
##TITLE=AC1231_PUEHDE124_6075312_jV922I8Z65
##JCAMPDX= 6.0         $$ Bruker NMR JCAMP-DX V2.0
##DATA TYPE= NMR SPECTRUM
##DATA CLASS= NTUPLES
##ORIGIN= BRUKER
##OWNER= Administrator
$$ 1.72 TOPSPIN		Version 2.1
$$ 2012-07-16 18:39:36.062 -0500  Administrator@TOPSPIN
$$ Compression mode = diff/dup
##.OBSERVE FREQUENCY= 400.13188235
##.OBSERVE NUCLEUS= ^1H
##.ACQUISITION MODE= SIMULTANEOUS (DQD)
##.ACQUISITION SCHEME= undefined
##.AVERAGES= 8
##.DIGITISER RES= 22
##SPECTROMETER/DATA SYSTEM= spect
##.PULSE SEQUENCE= zg30
##.SOLVENT NAME= COFFEE_meoh
##.SHIFT REFERENCE= INTERNAL, COFFEE_meoh, 1, 14.98061
##AUDIT TRAIL= $$ (NUMBER, WHEN, WHO, WHERE, PROCESS, VERSION, WHAT)
$$ ##TITLE= Audit trail, TOPSPIN		Version 2.1
$$ ##JCAMPDX= 5.01
$$ ##ORIGIN= Bruker BioSpin GmbH
$$ ##OWNER= Administrator
$$ $$ C:\Bruker\TOPSPIN/data/COFFEE/nmr/AC1231_PUEHDE124_6075312_jV922I8Z65/20/pdata/1/auditp.txt
$$ ##AUDIT TRAIL=  $$ (NUMBER, WHEN, WHO, WHERE, PROCESS, VERSION, WHAT)
(   1,<2012-05-08 23:04:03.625 -0500>,<Administrator>,<TOPSPIN>,<go>,<TOPSPIN 2.1>,
      <created by zg
	started at 2012-05-08 23:02:57.140 -0500,
	POWCHK enabled, PULCHK disabled,
       configuration hash MD5:
       AF F2 23 6B 01 CD 40 DD E5 A1 38 A0 06 EA F7 77
       data hash MD5: 64K
       6A 29 10 B4 87 6A 09 E7 3A 2E E7 16 00 7C 7E 08>)
(   2,<2012-05-08 23:04:11.281 -0500>,<Administrator>,<TOPSPIN>,<audit>,<TOPSPIN 2.1>,
      <user comment:
       ICON-NMR User ID: COFFEE
       data hash MD5: 64K
       6A 29 10 B4 87 6A 09 E7 3A 2E E7 16 00 7C 7E 08>)
(   3,<2012-07-16 18:39:31.500 -0500>,<Administrator>,<TOPSPIN>,<proc1d>,<TOPSPIN 2.1>,
      <Start of raw data processing
       efp LB = 0 FT_mod = 6 PKNL = 1 PHC0 = 0 PHC1 = 0 SI = 32K 
       data hash MD5: 32K
       2B 92 36 3A 18 DA A0 44 13 C3 CE 27 5D FE 95 E1>)
(   4,<2012-07-16 18:39:31.843 -0500>,<Administrator>,<TOPSPIN>,<proc1d>,<TOPSPIN 2.1>,
      <pk PHC0 = 210.2069 PHC1 = 0 
       data hash MD5: 32K
       B8 1F D0 A2 F7 60 2B EB 8B 08 55 55 91 D5 99 13>)
(   5,<2012-07-16 18:39:31.953 -0500>,<Administrator>,<TOPSPIN>,<proc1d>,<TOPSPIN 2.1>,
      <abs ABSG = 1 
       data hash MD5: 32K
       93 9F A0 55 82 95 51 2A E3 AB 09 FC 21 49 97 FC>)
(   6,<2012-07-16 18:39:32.250 -0500>,<Administrator>,<TOPSPIN>,<proc1d>,<TOPSPIN 2.1>,
      <abs ABSG = 2 
       data hash MD5: 32K
       62 BE 8B D9 7D AF B2 5B 03 66 16 E3 50 60 5C 90>)
(   7,<2012-07-16 18:39:32.328 -0500>,<Administrator>,<TOPSPIN>,<proc1d>,<TOPSPIN 2.1>,
      <abs ABSG = 3 
       data hash MD5: 32K
       2C C5 D8 5C 19 A5 9B A1 5E A9 25 6C B3 9F 72 D2>)
(   8,<2012-07-16 18:39:32.421 -0500>,<Administrator>,<TOPSPIN>,<proc1d>,<TOPSPIN 2.1>,
      <abs ABSG = 4 
       data hash MD5: 32K
       82 E0 E6 A0 D5 F3 7C A1 AF 4F 51 24 CD 21 8C 2A>)
(   9,<2012-07-16 18:39:32.500 -0500>,<Administrator>,<TOPSPIN>,<proc1d>,<TOPSPIN 2.1>,
      <abs ABSG = 5 
       data hash MD5: 32K
       CC E7 EC D1 73 D4 F2 3F E3 72 D2 34 94 C8 C6 1C>)
$$ ##END=
$$ [...]
150 150 150 150 150 150 150 150
##$TP07= 0
##$TPNAME0= <>
##$TPNAME1= <>
##$TPNAME2= <>
##$TPNAME3= <>
##$TPNAME4= <>
##$TPNAME5= <>
##$TPNAME6= <>
##$TPNAME7= <>
##$TPOAL= (0..7)
0.5 0.5 0.5 0.5 0.5 0.5 0.5 0.5
##$TPOFFS= (0..7)
0 0 0 0 0 0 0 0
##$TUNHIN= 0
##$TUNHOUT= 0
##$TUNXOUT= 0
##$USERA1= <user>
##$USERA2= <user>
##$USERA3= <user>
##$USERA4= <user>
##$USERA5= <user>
##$V9= 5
##$VALIST= <valist>
##$VCLIST= <CCCCCCCCCCCCCCC>
##$VD= 0
##$VDLIST= <DDDDDDDDDDDDDDD>
##$VPLIST= <PPPPPPPPPPPPPPP>
##$VTLIST= <TTTTTTTTTTTTTTT>
##$WBST= 1024
##$WBSW= 4
##$XGAIN= (0..3)
0 0 0 0
##$XL= 0
##$YL= 0
##$YMAX_a= 536777
##$YMIN_a= -656048
##$ZGOPTNS= <>
##$ZL1= 120
##$ZL2= 120
##$ZL3= 120
##$ZL4= 120
##$ABSF1= 14.98061
##$ABSF2= -5.57192
##$ABSG= 5
##$ABSL= 3
##$ALPHA= 0
##$AQORDER= 0
##$ASSFAC= 0
##$ASSFACI= 0
##$ASSFACX= 0
##$ASSWID= 0
##$AUNMP= <proc_prof1d_extract_pilot.lims>
##$AXLEFT= 0
##$AXNAME= <>
##$AXNUC= <1H>
##$AXRIGHT= 0
##$AXTYPE= 0
##$AXUNIT= <>
##$AZFE= 0.1
##$AZFW= 0.1
##$BCFW= 0
##$BC_mod= 0
##$BYTORDP= 0
##$COROFFS= 0
##$CY= 15
##$DATMOD= 1
##$DC= 0
##$DFILT= <>
##$DTYPP= 0
##$F1P= 0
##$F2P= 0
##$FCOR= 0.5
##$FTSIZE= 32768
##$FT_mod= 6
##$GAMMA= 0
##$GB= 0
##$INTBC= 1
##$INTSCL= 1
##$ISEN= 128
##$LB= 0
##$LEV0= 0
##$LPBIN= 0
##$MAXI= 10000
##$MC2= 0
##$MEAN= 0
##$ME_mod= 0
##$MI= 0
##$NCOEF= 0
##$NC_proc= -8
##$NLEV= 6
##$NOISF1= 0
##$NOISF2= 0
##$NSP= 0
##$NTH_PI= 0
##$NZP= 0
##$OFFSET= 14.98061
##$PC= 1
##$PHC0= 210.2069
##$PHC1= 0
##$PH_mod= 1
##$PKNL= yes
##$PPARMOD= 0
##$PPDIAG= 0
##$PPIPTYP= 0
##$PPMPNUM= 2147483647
##$PPRESOL= 1
##$PSCAL= 4
##$PSIGN= 0
##$PYNMP= <proc.py>
##$REVERSE= no
##$SF= 400.13
##$SI= 32768
##$SIGF1= 0
##$SIGF2= 0
##$SINO= 400
##$SIOLD= 32768
##$SPECTYP= <>
##$SREGLST= <1H.CDCl3>
##$SSB= 0
##$STSI= 32768
##$STSR= 0
##$SW_p= 8223.68421052632
##$SYMM= 0
##$S_DEV= 0
##$TDeff= 65536
##$TDoff= 0
##$TI= <>
##$TILT= no
##$TM1= 0
##$TM2= 0
##$TOPLEV= 0
##$USERP1= <user>
##$USERP2= <user>
##$USERP3= <user>
##$USERP4= <user>
##$USERP5= <user>
##$WDW= 1
##$XDIM= 32768
##$YMAX_p= 444778765
##$YMIN_p= -650390
##$CURPLOT= <Network HP LaserJet P1505>
##$CURPRIN= <$Network HP LaserJet P1505>
##$DFORMAT= <normdp>
##$LAYOUT= <+/1D_H.xwp>
##$LFORMAT= <normlp>
##$PFORMAT= <normpl>
##$SURQMSG= 1
$$ End of Bruker specific parameters
$$ ---------------------------------
##NTUPLES= NMR SPECTRUM
##VAR_NAME=  FREQUENCY,     SPECTRUM/REAL,   SPECTRUM/IMAG
##SYMBOL=    X,             R,               I
##VAR_TYPE=  INDEPENDENT,   DEPENDENT,       DEPENDENT
##VAR_FORM=  AFFN,          ASDF,            ASDF
##VAR_DIM=   32768,         32768,           32768
##UNITS=     HZ,            ARBITRARY UNITS, ARBITRARY UNITS
##FACTOR=    0.250966925370066, 1,           1
##FIRST=     8223.43324360095, 67363,        -253496
##LAST=      0,             143589,          -243465
##MIN=       0,             -650390,         0
##MAX=       8223.43324360095, 444778765,    0
$$ Real data points
##PAGE= N=1
##DATA TABLE= (X++(R..R)), XYDATA
$$ [...]
19514G1478b15925j5348J03607L4727I388b8737A26963i8991j72085F6274c70417
19502A04691c52924D7613J30395h5366l6910H5709e9927j62902r1574J42099d385
19490A02723i4200k9770N047A4207a71987J7695A24331e3455j99422A59217b65719
19478f5910p9690q8720C76943a36530B56472b24659g4374c5864k05381J18013
19468a23232B57655b52565D7524a98388L0717h3301c953l92202D2451L7638b50962
19456B1486a68121L352C2961K59679b19402B00309K88671a69901I6484J54236
19446B50720c0649j36246F3298b30256i5471H2111n094g38k74599B65361a7822
19434A51626i2390A67315C8620b96550G6241l6187K7875a87461I2100R6779M1166
$$ plain form
19514 71478 -215925 -231273 -127666 -92939 9388 -28737 126963 -98991 -271076 66274 -370417
19502 104691 -352924 47613 178008 -85366 -122276 85709 -59927 -222829 -314403 -172304 -4385
19490 102723 -94200 -123970 -118923 14207 -171987 -154292 124331 -53455 -252877 159217 -265719
19478 -65910 -145600 -234320 376943 -136530 256472 -224659 -74374 -35864 -241245 -123232
19468 -123232 257655 -252565 47524 -198388 -167671 -83301 -3953 -396155 42451 80089 -250962
19456 21486 -168121 -164769 32961 292640 -219402 200309 488980 -169901 96484 250720
19446 250720 -30649 -166895 63298 -230256 -95471 82111 77017 -738 -275337 265361 -17822
19434 151626 -92390 167315 38620 -296550 76241 40054 67929 -187461 92100 188879 230045
19423B30045e5382l4992J9513j10789j24076j2135B71010G8542J2391J123a42150
19411a21158e0230j99830E4421B4331a60881F7482h4247p3892L3456D6342b58990
19399H4789C3126M614i9127j70617A41478a15796a5084A91906F8359a67207D9707
19387a29990A98275a44443h696j9761j83089d3381D0489a63321J5884A72815a04995
19375c7704j93168D25136b06827C8088P4065J31367C480a43738B81826d33157
19364a61752I195b70946d332j29372A29369b29934a11858E9341d46914c9385L301
19353c6084k64043a05188A67834M5343a94120h5181j50032Q4179e8277j19434
19343a77711j76234D8639h6239k00806j48592C18229E7253b84444G6040l3084
$$ plain form
19423 230045 -55382 -90374 -70861 -181650 -305726 -317861 271010 78542 90933 92056 -142150
19411 -121158 -50230 -250060 54421 24331 -160881 67482 -84247 -158139 -124683 46342 -258990
19399 84789 33126 37740 -99127 -269744 141478 -115796 -15084 191906 68359 -167207 49707
19387 -129990 198275 -144443 -8696 -28457 -211546 -43381 40489 -163321 -147437 172815 -104995
19375 -37704 -230872 425136 -206827 38088 112153 243520 3480 -143738 281826 -433157
19364 -161752 9195 -270946 -4332 -133704 129369 -229934 -111858 59341 -446914 -39385 -36084
19353 -36084 -300127 -105188 167834 213177 -194120 -85181 -235213 -151034 -58277 -177711
19343 -177711 -353945 48639 -86239 -287045 -435637 318229 57253 -284444 76040 42956
19333D2956i2178k6129c0324A53716f8957m7077e0777j2708B29380a67581C6626
19321c1717o4970J845j8151A49427c97179A34280a68715C7210a89614p0402Q6592
19310a73424A69172a59864D1566a91735k16501a94805l8040Q2547p7077A20402
19299b23157n072M0749A2719g6838c964A43909c37878d2578D644a71863E2308
19287I7827J30380a75974p4242G6497Q5680J08718k148o5074b38462P9795j38654
19276b97321C2185Q9260a9730j19484k9193L0724j53798a1033r0875r2933L3719
19265a61122A82961f3950B22908q7139a8210k38626H4061A8516l789f3076G6177
19253a56869A25288g6151A08544d27337J34777C16220j39094b65680K2627B3228
$$ plain form
19333 42956 -92178 -118307 -30324 153716 -68957 -116034 -50777 -63485 229380 -167581 36626
19321 -31717 -96687 -94842 -112993 149427 -397179 134280 -168715 37210 -189614 -260016 -173424
19310 -173424 169172 -159864 41566 -191735 -408236 -194805 -232845 -150298 -227375 120402
19299 -223157 -228229 -187480 12719 -76838 -3964 143909 -337878 -42578 4644 -171863 52308
19287 97827 228207 -175974 -250216 76497 162177 270895 268747 203673 -238462 -158667 -297321
19276 -297321 32185 121445 -19730 -139214 -168407 -137683 -291481 -11033 -101908 -194841 -161122
19265 -161122 182961 -63950 222908 135769 -18210 -256836 84061 18516 14727 -63076 76177
19253 -156869 125288 -76151 108544 -427337 -292560 316220 177126 -265680 -243053 23228
19242b40670B77844b53044O9830A74308b19382K7400f0840C117c26895a41740
19231A8006a38878M2517j60205A33514P749R1840a47617A28651b22999R2427E093
19219D6432R2830c00886k515l0837a60734A38822b22265d1759M067J859A52724
19207a05371C02321d2789H0126j8316r880b72533e9423B26761b17880A44425R6744
19196B41169d9592O030l92603J39473h2025a5033o2671c8802G1658a97031j47254
19185c44285b5837m1289A11758f6027n3156j02988H5161c33147c3396A79584k1489
19174A58095a15155j58114R6650I9570J45887J7858a18458G3854a23009c8891
19163A73495c71610e3781A00367f7163j62746f5806A79893D8885a89058c4118
$$ plain form
19242 -240670 277844 -253044 -183214 174308 -219382 -191982 -60840 3117 -326895 -141740
19231 18006 -138878 -96361 -256566 133514 141263 233103 -147617 128651 -222999 -130572 5093
19219 46432 139262 -300886 -303401 -334238 -160734 138822 -222265 -41759 -37692 -35833 152724
19207 -105371 302321 -42789 80126 61810 51930 -272533 -59423 226761 -217880 144425 241169
19196 241169 -49592 -43562 -436165 -296692 -82025 -15033 -77704 -38802 71658 -197031 -344285
19185 -344285 -25837 -67126 111758 -66027 -119183 -222171 85161 -333147 -33396 179584 158095
19174 158095 -115155 -273269 -176619 99570 245457 263315 -118458 73854 -123009 -38891
19163 173495 -371610 -53781 100367 -67163 -229909 -65806 179893 48885 -189058 -34118
19152A44497E0843L4829b0746f154j66025j58316D6620J641J34300b88862m7377
19141c36239P0030j0250l66397J40108B11070E691K69485c21138a12985p9905
19131a92890k15978g6976k5185J9416q1857H7174R6202c52916E4010a80886j1818
19120a92704J1867A16382b06073q9334Q7579C51551A7047J00630c47579a05514
19109a38820M4963A26087P6006b26631C6270a49998e0150A11715O1909k6039m9904
19098I7681c74541d6046j36291r1694B23144c13575q6782J92632C490a06868j5548
19087a22416O982A16483E2828e2444k62201h6520k13798a35252Q351L4232k81690
19076c74359J52423D513L5049a80519Q322k5581A2203c0437j72804i3070F5360
$$ plain form
19152 144497 50843 85672 -20746 -6154 -172179 -330495 46620 48261 182561 -288862 -336239
19141 -336239 -266209 -276459 -642856 -502748 211070 5691 275176 -321138 -112985 -192890
19131 -192890 -408868 -76976 -102161 -82745 -164602 87174 183376 -352916 54010 -180886 -192704
19120 -192704 -180837 116382 -206073 -295407 -207828 351551 17047 117677 -347579 -105514
19109 -138820 -93857 126087 202093 -226631 36270 -149998 -50150 111715 173624 147585 97681
19098 97681 -374541 -46046 -182337 -274031 223144 -313575 -400357 -207725 3490 -106868 -122416
19087 -122416 -115434 116483 52828 -52444 -314645 -86520 -300318 -135252 -126901 -92669 -374359
19076 -374359 -221936 4513 39562 -180519 -172197 -197778 12203 -30437 -203241 -93070 65360
19064A75161O4441R8374a83457A858c6628l2616k99708A41019c9830j28311A16397
19052a57842A19973a74451B4334b0303k61740J8177b1662j36766A63380a54947
19041b75998R8007f7741P43B23227H4158j3951a27152j15806A83169a32700e3303
19029c38798A73684i6323k4295A0957i2563j38708d3595O016c884o9616B59717
19017B78290b22669O1353D61583G8608A2148L72386a42310A62783G8797c2858
19006F3506K39719h4633H9077f0709q7529f4432B955J28858h7267C11255C860
18994H8137c72997J13593L5732B06018k018D0935c5019j88835G249d0859k288
18983d3147n1851j32480B63300c5952C5294b71395A95160b11134e7375j00659
$$ plain form
19064 175161 239602 337976 -183457 1858 -36628 -69244 -368952 141019 -39830 -168141 116397
19052 -157842 119973 -174451 24334 -20303 -282043 -263866 -21662 -158428 163380 -154947
19041 -275998 -177991 -67741 -66998 223227 84158 70207 -127152 -242958 183169 -132700 -53303
19029 -338798 173684 -96323 -120618 10957 -92563 -231271 -43595 -37579 -3884 -73500 259717
19017 278290 -222669 -161316 461583 78608 12148 384534 -142310 162783 78797 -32858
19006 63506 303225 -84633 89077 -60709 -148238 -64432 2955 131813 -87267 311255 3860
18994 88137 -372997 -259404 -223672 206018 204000 40935 -35019 -223854 7249 -40859 -43147
18983 -43147 -94998 -227478 263300 -35952 35294 -271395 195160 -211134 -57375 -158034
18973a58034c3565o4315a0088C8118b5888o1195A73538j7887b28633h1255l7913
18962a19168B34537a23577b445B521J67988n8174f0855C16323A07776M4187c52736
18950a72067b3289A84809c01685A35391e845A626b8166k87889J23686a3312j97309
18939b10621Q5015k47216B2923J82571a9616p8377p3518a0191q0314B186d58557
18927A13083q695a8927m43996C083J25359C2265F358N2638g4214B26631p3320
18916A53311p2000c87603g2471A575c14920b6040F9206d520m02329f9080B20464
18904D06716b0932k35002d4717A7712N9117A8266a23271k9890C4253B898G70K1911
18892B2681B530R7930l5831K7190a40248B30210b91766J20480D0364a54775N12
$$ plain form
18973 -158034 -33565 -97880 -10088 38118 -25888 -87083 173538 155651 -228633 -81255 -119168
18962 -119168 234537 -123577 -2445 2521 170509 112335 -60855 316323 107776 151963 -352736
18950 -172067 -23289 184809 -301685 135391 -5845 1626 -28166 -316055 -192369 -13312 -210621
18939 -210621 -125606 -372822 22923 205494 -19616 -97993 -171511 -10191 -90505 2186 -458557
18927 113083 104388 -18927 -462923 3083 128442 32265 6358 58996 -74214 226631 153311
18916 153311 81311 -387603 -72471 1575 -314920 -26040 69206 -4520 -406849 -69080 220464
18904 406716 -20932 -255934 -44717 17712 76829 18266 -123271 -153161 34253 2898 770 22681
18892 22681 2530 100460 64629 91819 -140248 230210 -291766 -171286 40364 -154775 -154263
18881a54263C2900k675b56037d699j22374C4335b42547n1403A44502F577J19010
18870A25587a17193j18753A01942d17093A22634a13519j20959E0829d15940a46324
18859a39053r631b6477G4989M77409c92232J73467E8295g5806A66821L1285m6726
18848A51380n6923d7531j30704N5835F7885K09232a61487M7870A95365p0837J2724
18837A37252D164J81887E6370N3158a9536m64001J73239A52779J10482a39295
18826A01657D3571a86288j3870J2397e9900n9743k91150A70244G5420e1418J3358
18815c8060j18934p8598g3992A29735j9294d8691A52267G5179I218O1846j1936
18804E9128L07219i4275A72389b62018e1312H8545m592J45304Q6274A52150a15812
$$ plain form
18881 -154263 32900 30225 -256037 -4699 -127073 34335 -242547 -293950 144502 6577 125587
18870 125587 -117193 -235946 101942 -417093 122634 -113519 -234478 50829 -415940 -146324
18859 -139053 -148684 -26477 74989 552398 -392232 -218765 58295 -75806 166821 198106 151380
18848 151380 94457 -47531 -178235 -122400 67885 277117 -161487 -113617 195365 124528 137252
18837 137252 4164 186051 56370 109528 -19536 -483537 -310298 152779 263261 -139295
18826 101657 43571 -186288 -200158 -187761 -59900 -119643 -410793 170244 75420 -51418 -38060
18815 -38060 -156994 -235592 -73992 129735 110441 -48691 152267 75179 9218 71064 59128
18804 59128 366347 -94275 172389 -262018 -51312 88545 83953 229257 315531 152150 -115812
18792B53247j06669f150o5425j84701L5239A69154E0044c25450B84617j24337
18782A60280E5611O8019M9497H4491d24131a26054e478j52974H405b71807E7606
18770A17759D562b32249e3811K1341m15914K19942A60241a69881m1140H1928O6191
18759A48119h6837j80486J26305B74699g8983j28982B3651j0584a13998q3400
18749a97398A86783e3856k3435B9029a39793D1760g198n3388m60464F9971a93762
18737B51840h0662j0555B1853J90851a03804B68083a56037j24090A20184K145
18727A22329c25909H5584b71863j12233b173o6665j49466h3494j78298c9484j7011
18716e6495g635k66002A7722c7746o5877F0419a88799j89232i2934M0847j47353
$$ plain form
18792 253247 146578 -6150 -71575 -256276 -221037 169154 50044 -325450 284617 160280
18782 160280 55611 123630 173127 84491 -424131 -126054 -5478 -158452 8405 -271807 57606
18770 117759 4562 -232249 -53811 -32470 -448384 -228442 160241 -169881 -211021 81928 148119
18759 148119 -86837 -267323 -141018 274699 -78983 -207965 23651 13067 -113998 -197398
18749 -197398 186783 -53856 -77291 29029 -139793 41760 -7198 -60586 -521050 69971 -193762
18737 251840 -80662 -91217 21853 212704 -103804 268083 -156037 -280127 120184 122329
18727 122329 -325909 85584 -271863 -384096 -2173 -68838 -218304 -83494 -261792 -39484 -56495
18716 -56495 -7635 -273637 17722 -37746 -103623 60419 -188799 -378031 -92934 -52087 -199440
18705a99440o7688e5521k08789i1376b723B4867L5344a31484L5060b3588k15501
18694b39089L0414d4B68091a27717E2455b86696a39495J6239n7682h3499A28442
18682G6370K88496j53123b37143A7220Q9354a18156H1959a86723A6908a04762
18671f83j41311A07611a56210m0740A90256c3005B4793E16J08897b7878B51781
18659a6468k9779j51015D5577o105i1876p7370j24038C0682e4388F9202I108c56634
18646d6472D0945L145b20514i7827j87883I378d9625B87714g2442a0695j02417
18635a13112j47234i1121A21481a29044j43803O3856Q8086e8093k59888J16901
18625b01080d6993F7663c6121p9776k3554j74815A27973h0991j06871C288K47001
$$ plain form
18705 -199440 -267128 -55521 -264310 -91376 -2723 24867 60211 -131484 -96424 -23588 -239089
18694 -239089 -208675 -44 268091 -127717 52455 -286696 -139495 -123256 -180938 -83499 128442
18682 76370 364866 211743 -237143 17220 106574 -118156 81959 -186723 16908 -104762
18671 -683 -141994 107611 -156210 -196950 190256 -33005 24793 516 109413 -27878 251781
18659 -16468 -46247 -197262 45577 39472 -91876 -169246 -293284 30682 -54388 69202 9108 -356634
18646 -46472 40945 44090 -220514 -97827 -285710 9378 -49625 287714 -72442 -10695 -113112
18635 -113112 -260346 -91121 121481 -129044 -272847 -208991 -120905 -58093 -317981 -201080
18625 -201080 -46993 67663 -36121 -115897 -139451 -314266 127973 -80991 -187862 3288 250289
18614B50289h004B6846L7152b38208p4054J29064j26726G2451a42518E5097h0028
18602E8735i8460k0691C5744b31804A3741b353m1099k05097A3466L27428b95571
18590b15203A23694e3558j45503A38700b10822G8749a53667d9479O420o0112d4390
18578C07065c2245o8783A4956b22002N8446c0659k7478o3121O339E4290c8357
18566G0519L223c20879A13339n0096a77933A40631d4844k99229N1419i2593m5308
18555a37901j54786e1472A93244f9151J0445A03819J9222J20556d57306A28111
18544d62488a9230j15445D432b48449B37294a4638B21628E2516R4335a09442A34211
18532H5889g1484o9953e4972j35300k03171A80470a12462A45822a61146j1325
$$ plain form
18614 250289 -8004 26846 63998 -238208 -312262 -183198 -309924 72451 -142518 55097 -80028
18602 58735 -98460 -119151 35744 -231804 13741 -2353 -43452 -248549 13466 340894 -295571
18590 -215203 123694 -53558 -199061 138700 -210822 78749 -153667 -49479 -43059 -103171 -44390
18578 307065 -32245 -101028 14956 -222002 -163556 -30659 -58137 -121258 -114919 54290 -38357
18566 70519 73742 -320879 113339 63243 -177933 140631 -44844 -344073 -292654 -92593 -137901
18555 -137901 -292687 -51472 193244 -69151 -58706 103819 123041 243597 -457306 128111
18544 -462488 -19230 -134675 4432 -248449 237294 -14638 221628 52516 146851 -109442 134211
18532 85889 -71484 -141437 -54972 -190272 -393443 180470 -112462 145822 -161146 -172471
18522a72471e3048j69499Q3600I8582b19401I9994J31290E5121b30985I0103e4730
18510A41342M6332F410c6780l105r0566I0770i8324A1235K3347f3034i944o627
18498a6571A02769a42225j07341Q1370k40412a16937K4325b2478A0718o19R6962
18487A07061b5229A36996a0119B00062g2108M84F1114Q8229h7382A19881d60544
18475C4956n851b4545j3374j31844h3714j18677P2860k8897g2984k3851L905E7060
18462b38178D2293a17966J4070B937d5779j28009N6374I5249c7091r4316N6641
18451g4766B48036b60990m108A72545e9599C65285b5548k66723Q9125e4771k56275
18440c11046J05948c3227H6406L83870A32437l5341a88810A15627g8501Q705A67883
$$ plain form
18522 -172471 -53048 -222547 -138947 98582 -219401 99994 231284 55121 -230985 90103 -54730
18510 141342 187674 6410 -36780 -39885 -130451 90770 -98324 11235 34582 -63034 -9944 -16571
18498 -16571 102769 -142225 -249566 -168196 -408608 -116937 -92612 -22478 10718 10099 107061
18487 107061 -25229 136996 -10119 200062 -72108 -71624 61114 149343 -87382 119881 -460544
18475 34956 29105 -24545 -37919 -169763 -83714 -202391 -129531 -158428 -72984 -96835 -92930 57060
18462 -238178 42293 -117966 -103896 2937 -45779 -173788 -117414 95249 -37091 -131407 -74766
18451 -74766 248036 -260990 -265098 172545 -59599 365285 -25548 -292271 -203146 -54771 -311046
18440 -311046 -205098 -33227 86406 470276 132437 97096 -188810 115627 -78501 -69796 167883
18428e0228o5990K3615B23790a1180F2675B4732a9098B47572C6791l899e1211
18416a07213k1951A22924a03719E8376k3023J79190a69775c3677j18387k03507
18406c55571D6389b32525r5197k1046B33068A10697h1702k0704B2040c7479m18286
18395d55765B96291a26108k99379H3537a50622c1436r4952A15836K1165f5030
18384a95273f0810j5368k8056k8030A42436k9924a9179R84j85402A42381J02303
18373B44684E5134a32250A50938e1944a2542C63520A38955F8987M0507j8744J8497
18362A09247k9607g2806A53037i681k37987I952K06372a02334D9051i9378H7708
18350A77684G8484a0747A86732e300o7267k49L5626H1214b6462L801F710a3930
$$ plain form
18428 -50228 -116218 -92603 223790 -11180 62675 24732 -19098 247572 36791 32892 -51211
18416 -107213 -129164 122924 -103719 58376 35353 214543 -169775 -33677 -152064 -355571
18406 -355571 46389 -232525 -327722 -348768 233068 110697 -81702 -102406 22040 -37479 -455765
18395 -455765 296291 -126108 -425487 83537 -150622 -31436 -126388 115836 137001 -65030
18384 -195273 -60810 -76178 -104234 -132264 142436 112512 -19179 -18195 -203597 142381 244684
18373 244684 55134 -132250 150938 -51944 -12542 363520 138955 68987 109494 90750 109247
18362 109247 79640 -72806 153037 -9681 -247668 9952 216324 -102334 49051 -99378 87708
18350 177684 78484 -10747 186732 -5300 -72567 -72816 -37190 81214 -26462 -22661 6710 -13930
18337i947k6393B23408a51974M6882A54740J71143G163b55565a7715m6931A2805
18325c77229A89289C8321a13466d6819A17031c26970A45381h4088G732a23041
18314a18874c927F8028b63299E2131e2718m2710j14091C4112N6830a6487B3182
18302a80798f3690K4052C30552g7554F5393a55068i962j6489G6815Q4546b6746
18290a42974E025b28449B7705d489B35750a7644A04262h7214A73522h4503o0302
18279a44805A74613d4096C4286d43099g1700A41955O8465a02183h8p2736A9757
18267A1244a16209j2644c7576o5112M897C2789g9146G0658d5474A71030a3654
18255i5602r7167g9709G7686K74808a29519A60734M4104o5959h0081H1406c60614
$$ plain form
18337 -9947 -36340 223408 -151974 -105092 154740 325883 7163 -255565 -17715 -64646 12805
18325 -377229 189289 38321 -113466 -46819 117031 -326970 145381 -84088 7732 -123041
18314 -118874 -3927 68028 -263299 52131 -52718 -95428 -209519 34112 90942 -16487 23182
18302 -180798 -63690 -39638 330552 -77554 65393 -155068 -9962 -26451 76815 161361 -26746
18290 -142974 5025 -228449 27705 -4489 235750 -17644 104262 -87214 173522 -84503 -144805
18279 -144805 174613 -44096 34286 -443099 -71700 141955 210420 -102183 -88 -72824 19757
18267 11244 -116209 -128853 -37576 -102688 -97791 32789 -79146 70658 -45474 171030 -13654
18255 -95602 -192769 -79709 77686 352494 -129519 160734 204838 138879 -80081 81406 -360614
18243b56542H9888e90492A19238j5794d029D1705i6640K7268I2557d7971J9811
18232b8160c638j6152C6782J26312m4408n7654f00613G0786L5145a17997I5519
18220e7880j01711A12677A2950J4316a61195g1725A59323a49078P4343j86936
18210b61671Q9867g8254J2211j69394j9246M1845j19595i6790A15663K9695c10685
18198G583g9622D2952K5683b79489E0251h6765i859B0748J4589j7604J2315J15023
18186A45071e1523p3805D768g5742J6291B15972c71844A95429b1022j07251A62747
18174A80111B5624J20886a80083B35675f7012E6786R664M0063b02056a3091j33980
18163a47071A27469d5405C93390B2786J58491G4923g5953m3522B28081D6960f0373
$$ plain form
18243 -256542 89888 -590492 119238 103444 -4029 41705 -96640 -69372 92557 -47971 -28160
18232 -28160 -3638 -19790 36782 163094 118686 61032 -600613 70786 105931 -117997 95519
18220 -57880 -159591 112677 12950 27266 -161195 -71725 159323 -149078 -74735 -261671
18210 -261671 -171804 -78254 -66043 -235437 -254683 -212838 -332433 -96790 115663 145358 -310685
18198 7583 -79622 42952 68635 -279489 50251 -86765 -9859 20748 35337 17733 30048 145071
18186 145071 -51523 -125328 4768 -75742 -59451 215972 -371844 195429 -21022 -128273 162747
18174 180111 25624 146510 -180083 235675 -67012 56786 66450 106513 -202056 -13091 -147071
18163 -147071 127469 -45405 393390 22786 181277 74923 -75953 -119475 228081 46960 -60373
18151b0599F3327k0186K4561O4142c31679a6067l0361j3438k19108d1180l81479
18140d22659A5827J2092b30424q210Q9101J1213J7574B18032a12203B82230g0257
18128G5972c25073r423h8680i895H7017b7375D9883M2122a85338C1195a37577
18116I0793a07760K3460q8078A29627a49207K4708r3381D4962i1259A86199F1883
18104D7946h8543R447F8652I009a95693O8460F7475c19434j4307J47260d1361
18092a16237M6383P503H9886J10143F1015b01010O0585r473A4415J92886c46972
18080A0135K4564Q0497D7113c1293A64568c29571Q3999P2462l12344A6942e1702
18068c58808a01019K5633n1502f0821q331A55027a62677B40866c23877B2539c24159
$$ plain form
18151 -20599 63327 43141 67702 131844 -331679 -16067 -46428 -59866 -278974 -41180 -422659
18140 -422659 15827 27919 -230424 -238634 -149533 -138320 -120746 218032 -112203 282230 -70257
18128 75972 -325073 -334496 -88680 -9895 87017 -27375 49883 92005 -185338 31195 -137577
18116 90793 -107760 -84300 -172378 129627 -149207 -124499 -217880 44962 -91259 186199 61883
18104 47946 -88543 -79096 68652 9009 -195693 -127233 67475 -319434 -333741 -186481 -41361
18092 -116237 -69854 -62351 89886 200029 61015 -201010 -140425 -149898 14415 207301 -346972
18080 10135 34699 115196 47113 -31293 164568 -329571 -245572 -173110 -485454 16942 -51702
18068 -358808 -101019 -75386 -126888 -60821 -69152 155027 -162677 240866 -323877 22539 -324159
18056b62840B84887m014b9364A24469c22353J50965A23516a32511M1158M3400
18046d7953C3422N3883J57014a15777d8285B64644d2549I7109a94113j80786H5787
18034b85670A79061f8566A15871n6435M03383C6467g8542j34096I6616B6649e5195
18022c92282a64861l0942g9981B4955a73851m6712N6587B60281b62414R9719A79956
18010B08626C0397b03167g6905M285A97609Q3428b67667A27448A7751M529b55586
17998B60184E2289a06731P81D9439a83600I5332a13056A43822J21111f5864k63
17987f6127B3185K8240b38384A41359f2336A30362l8559l4996a24167l7083H8524
17975f3108C04580I2962a69959Q3881A9728j136a45481r6502g3143o8549c4093
$$ plain form
18056 -262840 284887 280873 -29364 124469 -322353 -171388 123516 -132511 -91353 -47953
18046 -47953 33422 87305 244319 -115777 -48285 264644 -42549 97109 -194113 -374899 85787
18034 -285670 179061 -68566 115871 59436 462819 36467 -78542 -212638 96616 26649 -55195
18022 -392282 -164861 -195803 -79981 24955 -173851 -220563 -163976 260281 -262414 -162695 179956
18010 208626 30397 -203167 -76905 -72620 197609 281037 -267667 127448 17751 22280 -255586
17998 260184 52289 -106731 -105950 49439 -183600 95332 -113056 143822 264933 -65864 -66127
17987 -66127 23185 51425 -238384 141359 -62336 130362 91803 56807 -124167 -161250 88524
17975 -63108 304580 92962 -169959 -86078 19728 18592 -145481 -241983 -73143 -141692 -34093
17963f5779J9382A40822n3782B9706K59405b7774G1299a13420C18072E2347Q257
17952F0604c28178C40562a96508B5550L08855A19133a56088A79607C3647a28532
17941B54020b18328J01941B090J26105D915J27821d03927d39D1628a40432A35814
17929b52753m3970f4889B22348g1286G3750Q2343a98490j1129J01076j2588f0261
17917d8446C2834a82187j74289a23239M9735L4280A7401g2835B00015H0635d5970
17905b48789N6758D26361n5002g2647a6699k35023B06320E6345a86573e8869A62721
17893h2890B17737f305I0442c6391C17752p6959E0891J87669a4658A46275b66890
17881E4657O7391K4941R4744a4674j15693B2592P4529J32050b45207G056a11152
$$ plain form
17963 -65779 -46397 140822 87040 29706 289111 -27774 71299 -113420 318072 52347 60604
17952 60604 -328178 340562 -196508 25550 334405 119133 -156088 179607 33647 -128532
17941 254020 -218328 -116387 2090 128195 4915 132736 -403927 -439 41628 -140432 135814
17929 -252753 -296723 -64889 222348 -71286 73750 156093 -198490 -209619 -108543 -121131 -60261
17917 -48446 32834 -182187 -356476 -123239 -73504 -39224 17401 -72835 200015 80635 -45970
17905 -248789 -192031 426361 371359 -72647 -16699 -251722 206320 56345 -186573 -58869 162721
17893 -82890 217737 -6305 90442 -36391 317752 240793 50891 238560 -14658 146275 -266890
17881 54657 122048 146989 241733 -14674 -130367 22592 97121 229171 -245207 7056 -111152
17869G4458b10093Q699A34344K94415a34529r0584h667A29731g5392b466l7716
17858d0182l89580J36803Q560k8783a48560J9697A92623M7921a75403E5096a08702
17846d5267B00096a15260E5216O0878n883k2452a68391g3842L0925o1920B4199
17834B45964d3646j54022N4778r4365A43454R0334n6300a04221A07245K6338b09020
17822A30681a44233f0746A33605n3176C3688J8969c96194a45520N1870c4494C87571
17810E10039a2734B1414J10708i5113M3659j91483B25429k3097e9467C8251J16660
17799A54911A4254c4722A00499m6730L5976K1935C2720J50352J9034J5171n8383
17788A58894i4467G9218C1922a80670m3135D4943h9842n361A25158L7338g4974
$$ plain form
17869 74458 -210093 -201394 134344 428759 -134529 -225113 -8667 129731 -75392 -2466 -40182
17858 -40182 -429762 -292959 -284399 -313182 -148560 -128863 192623 240544 -175403 55096 -108702
17846 -45267 200096 -115260 55216 116094 110211 87759 -168391 -73842 -42917 -104837 24199
17834 245964 -43646 -197668 -142890 -237255 143454 233788 177488 -104221 107245 133583 -209020
17822 130681 -144233 -60746 133605 80429 33688 52657 -396194 -145520 -93650 -34494 387571
17810 510039 -12734 21414 132122 -95113 -51454 -242937 225429 202332 -59467 38251 154911
17799 154911 14254 -34722 100499 53769 89745 111680 32720 183072 202106 217277 158894
17788 158894 -94467 79218 31922 -180670 -223805 44943 -89842 -95203 125158 162496 -74974
17776d1482I9617a53649G9630k8800J74912e3166r0719e7093B94127i0001L1744
17765e8257b6015j92661A8807a31288J5404B51272A3832a07359A18940g6585A47647
17753B96592A39648Q5567J15446a39116A49556l9471a28614J544K7937E7520h7654
17741G9505c8321j7027a6030C45400a78274j11444A25593e8261A18422a0279l079
17730a3358C30477G8260i0537k40511a13402C6494i573B23612K10719A68412B5007
17718c5541A19347a6968j60501C2535Q1673n2987a18241D4891a11458L2977A1610
17706A1830J77381B7630l495a7242k32767a8369A00870b38525A00295a6530E0870
17694h2714k14329b2245j49408H9544k8994J48709b1476p6299m998A83003J34970
$$ plain form
17776 -41482 99617 -153649 79630 50830 225742 -53166 -143885 -57093 294127 -90001 -58257
17765 -58257 -26015 -218676 18807 -131288 -115884 251272 13832 -107359 118940 -76585 147647
17753 296592 139648 225215 340661 -139116 149556 110085 -128614 -127070 -99133 57520 -87654
17741 79505 -38321 -55348 -16030 345400 -178274 -289718 125593 -58261 118422 -10279 -13358
17730 -13358 330477 78260 -90537 -331048 -113402 36494 -9573 223612 434331 168412 25007
17718 -35541 119347 -16968 -177469 32535 114208 61221 -118241 44891 -111458 -78481 11610
17706 11830 189211 27630 24135 -17242 -250009 -18369 100870 -238525 100295 -16530 50870
17694 -82714 -297043 -22245 -171653 89544 60550 209259 -21476 -97775 -102773 183003 317973
17683C17973a27609E9564d6867A67882a30476k0190P1167H9196d3238D637M6741
17672E1378a7864A21124a48237a1587A02053l6208h6495E256d925A7129J35090
17661A52219a47392B02973J1506b40804C23148b00974B2549L68203a50567B08842
17650A60082F6761J10226A6677a1375H998c2812k15091k3926B38136B7999J64177
17639A92176i0903A89790o0059b67507B64439i8860C9573b07178I6063J18159
17629B14222n6414D4822N6056b2j15879B56008o3200K54190c1852p7366A04200
17617a08330B53974G0284a8026B5169a69768c9368m1439B50886H395a30958B03634
17605A29078a52974N6336A91079D1023J58149e5800H1942c6071B20218a78846
$$ plain form
17683 317973 -127609 59564 -46867 167882 -130476 -150666 -79499 89196 -43238 4637 51378
17672 51378 -17864 121124 -148237 -11587 102053 65845 -86495 5256 -4925 17129 152219
17661 152219 -147392 202973 214479 -240804 323148 -200974 22549 390752 -150567 208842
17650 160082 66761 176987 16677 -11375 8998 -32812 -247903 -271829 238136 27999 192176
17639 192176 -90903 189790 129731 -267507 264439 -98860 39573 -207178 96063 214222
17629 214222 157808 44822 100878 -22 -115901 256008 192808 446998 -31852 -109218 104200
17617 -108330 253974 70284 -18026 25169 -169768 -39368 -80807 250886 8395 -130958 203634
17605 129078 -152974 -96638 191079 41023 199172 -55800 81942 -36071 220218 -178846
17594a72771p7072i6254k98226f2936B90070l0323H0871a4192p4715C19521A22928
17582A29229B5518a28135O803A04270O4187C4473L23852A5907E410J82468h7817
17570a14813B89276j30643f0564k8340C98444a31938B60650i8097r6590C46913
17559G1806A5893h0192b3973C80011E6053b2187A79483P391a1867A4525K81077
17548B95602M0156A00393a52502c6901C85959A4262F424R6819J63073o7383J32220
17537C31153G0956a7957p9078B08209q5355K10307j44753c47487A33726J90057
17527C23783a81801A0363M3274a17024E0904J20188J6880h6001F223a68939B24813
17515B592b41710g0349A00999f740A98063c099H7009j8634K49697I5177J63298
$$ plain form
17594 -172771 -249843 -96254 -394480 -62936 290070 259747 80871 -14192 -88907 319521 122928
17582 129229 25518 -128135 -121332 104270 168457 34473 358325 15907 5410 187878 -87817
17570 -114813 289276 158633 -60564 -88904 398444 -131938 260650 -98097 -194687 346913
17559 71806 15893 -80192 -23973 380011 56053 -22187 179483 186874 -11867 14525 295602
17548 295602 335758 100393 -152502 -36901 385959 14262 6424 103243 266316 198933 331153
17537 331153 70956 -17957 -97035 208209 122854 333161 188408 -347487 133726 323783
17527 323783 -181801 10363 53637 -117024 50904 171092 187972 -86001 6223 -168939 224813
17515 2592 -241710 -70349 100999 -6740 198063 -3099 87009 68375 318072 95177 258475
17504B58475J51329k00183k7186n1012J07573A07070J19048M8489A03316B6097
17493E1846c7359C11591j4961j05165J84917e8702b7651B44937G8908b28386D71682
17481a35513H6010N9235B964a77789b9612C08227C1059K37027j26038b2994A3249
17469B15177K08640j73172m4042a29994b6953C9825M0778O7351Q7964r4786J67180
17458C08312n9905a70830A00534a87616C18382F8213R4863J91066B2594a78976
17447i923o1902B97361J85908k14170j22626j9058m6437l0666A33L467J25352
17436A28952K34176j7918j62157n4549O7566o1J85216H0636r224K54458K5563
17425C51433G8156K94804A38672L5130L51617A93397h9604B54117J06086o1196
$$ plain form
17504 258475 409804 209621 182435 131423 238996 107070 226118 274607 103316 26097
17493 51846 -37359 311591 296630 191465 376382 -58702 -27651 244937 78908 -228386 471682
17481 -135513 86010 145245 2964 -177789 -29612 308227 31059 268086 142048 -22994 13249
17469 215177 423817 250645 206603 -129994 -26953 39825 80603 147954 235918 141132 308312
17458 308312 248407 -170830 100534 -187616 318382 68213 163076 354142 22594 -178976
17447 -9923 -71825 297361 483269 269099 146473 127415 80978 50312 133 3600 128952
17436 128952 363128 345210 183053 128504 196070 196009 381225 80636 71412 325870 351433
17425 351433 78156 372960 138672 173802 525419 193397 -89604 254117 360203 299007
17415B99007A24559A9020O24957B21479K42591F7013K09040J32561o6420G9972
17404H5536D1570J5508K57454o2989J49729R6220P0961k31866A25087a31806A68498
17392C49906A16858g2008l18569A93542O6733k2247r7514f0585H8265O5136J14298
17381B67699r2691K30543A89909I4498L21485A50222N9424L884L7490A21499E6958
17369A37638j9704O638J88370F3453R2279R5126k299b3918j63720C25072P411
17358C32483j20806F4247a00991B07860l3884H3618D0783a48726B91061P4940
17348C66001A67160p195a16863C87998b672A64769M9361E8013O5887A1829J14451
17337A26280d1346G5652Q7847F4755G686K83618j2060p9671q8607L40774A10618
$$ plain form
17415 299007 124559 19020 643977 221479 464070 67013 276053 408614 342194 79972
17404 85536 41570 57078 314532 251543 401272 497492 568453 336587 125087 -131806 168498
17392 349906 116858 -72008 -390577 193542 260275 238028 140514 -60585 88265 153401 267699
17381 267699 175008 405551 189909 94498 415983 150222 209646 213530 251020 121499 56958
17369 137638 117934 124572 312942 63453 155732 250858 248559 -23918 -187638 325072 332483
17358 332483 211677 64247 -100991 207860 173976 83618 40783 -148726 291061 366001
17348 366001 167160 159965 -116863 387998 -2672 164769 214130 58013 123900 11829 126280
17337 126280 -41346 75652 163499 64755 7686 291304 279244 199573 110966 451740 110618
17325C88066c02937A60038E4163K22470M1875F1548L50156k5864I4958L47624
17315D42582J887H5699b970o0478D57780I7037J36798J1428o697D9425a47283
17303F2792L96460A85249K67009A80390h2757A99365J54210q7820E9273c2388
17292h0992B37302L90932B80208a7028F0525h7371D3678c7537A02654P8467f5445
17280a33025F0475a45578B15475j06160k5620k8501K4014g5211B75630A01885
17269F4910R9428d9056B62109j21003J9001K01991A3880J24401l1466a77987C22112
17257b20237C32966q568g07A19141L29093A26026a92901a9156H6321a41330A62503
17245F6882M54399A10318l2439R8960G7431b3136B59856B2621L36085A78193K01409
$$ plain form
17325 388066 -302937 160038 54163 276633 318508 61548 411704 385840 94958 442582
17315 442582 444469 85699 -2970 -63448 457780 97037 233835 245263 238566 49425 -147283
17303 62792 459252 185249 452258 180390 -82757 199365 353575 265755 59273 -32388
17292 -80992 237302 628234 280208 -17028 60525 -87371 43678 -37537 102654 181121 -65445
17280 -133025 60475 -145578 215475 109315 83695 55194 79208 -75211 275630 101885
17269 64910 164338 -49056 262109 141106 160107 362098 13880 138281 106815 -177987 322112
17257 -220237 332966 324398 -707 119141 448234 126026 -192901 -19156 86321 -141330 162503
17245 66882 521281 110318 77879 176839 77431 -23136 259856 22621 358706 178193 379602
17234C79602k5783F6336J41119L5112P3305e1371B20879E8559R7783Q6550o2401
17223A80491c9362C16783p5427r4480o8037f7289b2860B36287n7370J33069A37742
17211d008H4794i777B1485J65527a02983A19846L56711n6890h5475B49445j12279
17200A37166C288J2735P9776K1866E5301J69738Q551j3621K75815P095B03319
17188C48446A63166o7035L23311j74719P5442A37929J50095J96765a022C86534
17177B38814K06052j76663K26543j89042A15243P5775M297K85946k33029K62056
17167E10288A23671j2226J83376k5870a68735B98846A21221K40694H5442M05475
17157D90917I2509J17573J14189J76286k6532j97834K37236A35869J54782J41304
$$ plain form
17234 379602 353819 66336 207455 242567 315872 -51371 220879 58559 156342 242892 180491
17223 180491 -39362 316783 241356 146876 78839 -67289 -22860 236287 178917 311986 137742
17211 -4008 84794 -9777 21485 187012 -102983 119846 476557 419667 -85475 249445 137166
17200 137166 3288 16023 95799 117665 55301 225039 233590 219969 495784 502879 203319
17188 348446 163166 96131 419442 244723 320165 137929 288024 484789 -1022 386534
17177 238814 444866 268203 494746 305704 115243 191018 195315 481261 248232 510288
17167 510288 123671 111445 294821 268951 -168735 298846 121221 361915 85442 490917
17157 490917 92509 210082 324271 500557 474025 276191 513427 135869 290651 431955
17147D31955A97045m9647N60137B31731M1008r837o7408R186B2504K52762P716
17136B82982A07011L91323j23013j68217p4804k0843J85410J76045k9551A68698
17125B99661J18832r1108O426j13184p7864R2379N8953K85921A69753K02793m2507
17114C30039k6080K2657j34307K2125O4913o0296A5820J63509J77421j54532M7870
17103B50088n093J01666l6761R703J3263m50M1673P0789J29834j65917j48756
17092B60039L43890k66405q9196J27298A31349L98577q5552B21928K78839j88994
17082C11773a56866D36921P0622l5722k1540j85969L9931J52234J5164D9770J92359
17071B42129N67373k83408j86015j16491A04616L39131n0198L28384C50332J22807
$$ plain form
17147 431955 197045 147398 707535 231731 272739 262902 195494 204680 22504 275266 282982
17136 282982 107011 498334 375321 207104 132300 111457 296867 472912 443361 168698
17125 299661 418493 327385 333811 220627 142763 235142 294095 580016 169753 372546 330039
17114 330039 303959 326616 192309 214434 279347 219051 15820 179329 356750 202218 250088
17103 250088 244995 346661 309900 319603 332866 332416 374089 444878 574712 408795 260039
17092 260039 603929 337524 248328 375626 131349 529926 444374 221928 500767 311773
17082 311773 -156866 436921 507543 471821 450281 264312 304243 456477 471641 49770 242129
17071 242129 809502 526094 340079 223588 104616 443747 393549 721933 350332 473139
17061D73139m2686J57742k05797A73408K80479m7190J96608k52766N0905r8615
17051C02829K33455K7325j04339o4746o0345K97774j57705L4103O1896A62554
17040D19907J86610j46370j83179L42179j42412Q3742n1215q2274M9098m727R5677
17029E67036k57413L02100B57187J34140J07698J33896B42297P07949L2039C76835
17018F36553k91912j6323K42581N200n8820L4733k6020j63268J30010O1738J27125
17007F81597Q6984P4740k38254L03426l66279J2050j17955L88122j58118k43869
16997D22444L50799k27201m769L5883K28759j86566J08346p3613K85651m39313
16987E00420K01302j13503N5765B34560L75681J41368j48701k43998L21882K55932
$$ plain form
17061 473139 430453 588195 382398 173408 453887 406697 603305 350539 401444 302829
17051 302829 536284 563609 459270 394524 334179 631953 474248 508351 570247 162554
17040 419907 606517 460147 276968 619147 476735 560477 509262 426988 476086 471359 567036
17029 567036 309623 611723 257187 391327 499025 632921 242297 950246 982285 376835
17018 636553 344641 328318 570899 576099 517279 552012 525992 362724 492734 554472 681597
17007 681597 768581 843321 605067 908493 542214 554264 436309 824431 666313 422444
16997 422444 773243 546042 541273 577156 805915 619349 727695 654082 939733 500420
16987 500420 701722 588219 643984 234560 610241 751609 602908 358910 680792 936724
16977I36724D43802L23244J08511j50873J6829j57102J53332j55317O2029R5310
16967G39765J30355k37373J86326Q6909j34786R4717k03556L79380m38562J75848
16957G79023M5122r1974J56390r6795O7595K12701k67804M4666l09421J38188
16947F77691L92213j28781R6856n4208j83009q4111L59912k45538k99813M9261
16937E80473M33750j44176J65707J7021L39388n97658L35968j34618l9789J38942
16927A095008m9692j81243K69040k69945K01760J66791P3743N1767l95889L73738
16917A335078m8648k4568k21186K37893K70976l00423j08458k3676R0047J79036
16907A386071k5266K54806j15985l70306M39233J25111p9590k95784L3137J94227
$$ plain form
16977 936724 443802 767046 875557 724684 741513 584411 737743 582426 644455 739765
16967 739765 870120 632747 819073 905982 771196 865913 662357 1041737 603175 779023
16957 779023 824145 732171 888561 791766 859361 1072062 804258 848924 539503 677691
16947 677691 1069904 941123 1037979 983771 800762 716651 1076563 831025 531212 580473
16937 580473 1014223 870047 1035754 1052775 1392163 794505 1130473 995855 956066 1095008
16927 1095008 1045316 864073 1133113 863168 1064928 1231719 1305462 1357229 961340 1335078
16917 1335078 1286430 1261862 1040676 1278569 1549545 1249122 1140664 1116988 1207035 1386071
16907 1386071 1360805 1615611 1499626 1129320 1568553 1693664 1614074 1318290 1351427 1545654
16897A545654K40529l51026J45687M4109k43922L90668j88380j0058o7566K8511
16887A534206J95414k82605M5104L30584j86240K42711J45555j31578j69565M40352
16877B163938m27644n5143j8821J33392J57407J5372L64139k40924j38123K58809
16867B212402Q3077j77651r6166P09133o51913K03915p1814p147L7040L22466
16857B563342k01937O9377r804R3634J96925o0328J8672J03351Q3755J68417l08729
16846B716675J52434l5399J52799n5845L15565M9077k81360P7284M38843j58914
16836C371159J91027r2810j45297K39368L9425L9785J57520J72839K2116J0290
16826D005422J81802P8248k08050j3786N08494K5384K82692n95241L63405J29667
$$ plain form
16897 1545654 1786183 1435157 1580844 1624953 1381031 1771699 1583319 1573261 1505695 1534206
16887 1534206 1729620 1447015 1492119 1822703 1636463 1879174 2024729 1893151 1723586 2163938
16877 2163938 1736294 1681151 1662330 1795722 1953129 1968501 2332640 2091716 1953593 2212402
16867 2212402 2295479 2117828 2021662 2730795 2078882 2282797 2210983 2203836 2240876 2563342
16857 2563342 2361405 2430782 2420978 2514612 2711537 2651209 2669881 2773232 2856987 3025404 2716675
16846 2716675 2869109 2833710 2986509 2930664 3246229 3295306 3013946 3091230 3530073 3371159
16836 3371159 3562186 3469376 3324079 3563447 3602872 3642657 3800177 3973016 3995132 4005422
16826 4005422 4187224 4265472 4057422 4043636 4552130 4577514 4860206 4264965 4628370 4758037
16816D758037P6641J82720n135J76730N64353m08301M43939P8212J76812j43766
16806E900242p107J7066K36804L62314K04717N2991K64623k16662O89402l30977
16796G173413N66017O6649L28475m67398J031894J46688j28499O2678M52687O34348
16786I866952l50956M49920K85751O8524M56369K73974L38454M31902K22216P43884
16776A2786990K49228P67612K70360J80440N61682M40169N96639J88736M75475
16767A6517331N27918P96469M73074M56852J056489O50606N48305Q91034R10122
16758B2828200R14064J078450J149767M73664J225653J423720J122272J001688
16750C1217478J625077J258791J699797J269169J422689J784236K059843J941954
$$ plain form
16816 4758037 4834678 5017398 5012263 5188993 5753346 5345045 5788984 5867196 6044008 5900242
16806 5900242 5893135 5910201 6147005 6509319 6714036 6767027 7031650 6814988 7504390 7173413
16796 7173413 7739430 7806079 8134554 7667156 8699050 8845738 8717239 8779917 9232604 9866952
16786 9866952 9515996 9965916 10251667 10320191 10776560 11050534 11388988 11820890 12043106 12786990
16776 12786990 13036218 13803830 14074190 14254630 14816312 15256481 15853120 16041856 16517331
16767 16517331 17045249 17841718 18314792 18771644 19828133 20478739 21027044 21918078 22828200
16758 22828200 23742264 24820714 25970481 26444145 27669798 29093518 30215790 31217478
16750 31217478 32842555 34101346 35801143 37070312 38493001 40277237 42337080 44279034
16742D4279034K082832K124560K391499K609610K460785K896037K793788L418396
16734F5056541L076686L533850L868212L833171M205524L914604N018100M313431
16726I6820119M876459N007710M995715N693154M552317N919974N491695N369204
16718A38726347M895506M992729M303683M337835L439598L183477K732524J710850
16710A68322549J403313J93384n81384j029273j865747k583393l063553l364366
16702A57431530m261454m420098m940679m889245n068266n268100n350034m756757
16694A18476897n694873m970223m679294m904078m255584m232808m464027l782578
16686H1493432l874836l765377l077935l639018l170446k920607k555499l063221
$$ plain form
16742 44279034 46361866 48486426 50877925 53487535 55948320 58844357 61638145 65056541
16734 65056541 68133227 71667077 75535289 79368460 83573984 87488588 92506688 96820119
16726 96820119 101696578 106704288 111700003 117393157 121945474 127865448 133357143 138726347
16718 138726347 143621853 148614582 152918265 157256100 160695698 163879175 166611699 168322549
16710 168322549 169725862 169919246 169337862 168308589 166442842 163859449 160795896 157431530
16702 157431530 153170076 148749978 143809299 138920054 133851788 128583688 123233654 118476897
16694 118476897 112782024 107811801 103132507 98228429 93972845 89740037 85276010 81493432
16686 81493432 77618596 73853219 70775284 67136266 63965820 61045213 58489714 55426493
16678E5426493j972806k932154j795369k173821k377690j675673j862266j524715
16670C9111999j485686j348623k247449r34759j159311r59654j238795j116813
16662B8620909q30012j350022r73896o23008j220136p45516n74878p58367q22623
16653B0722451m94836p69789q78850n51443m01653o97718n43470n59876l36706
16644A5488110j25307o72350n73927m64653l68715k16254m63935l42035j59655
16635A2101279l00775m33278j28943o73657j0388k41948k51293j35771m97569
16626I427657o38538J75079k17237Q2107o83946j38256J69124o44341J8481k7318
16616G522812m36670M9250J31045p01130o088k48609j12065n7611L973m80862
$$ plain form
16678 55426493 53453687 50521533 48726164 46552343 44174653 42498980 40636714 39111999
16670 39111999 37626313 36277690 34030241 33095482 31936171 30976517 29737722 28620909
16662 28620909 27790897 26440875 25466979 24843971 23623835 22878319 22303441 21545074 20722451
16653 20722451 20227615 19457826 18578976 18027533 17625880 16928162 16384692 15824816 15488110
16644 15488110 15362803 14690453 14116526 13651873 13283158 13066904 12602969 12260934 12101279
16635 12101279 11800504 11367226 11238283 10564626 10554238 10312290 10060997 9925226 9427657
16626 9427657 8789119 8964198 8746961 8829068 8145122 8006866 8175990 7531649 7550130 7522812
16616 7522812 7086142 7135392 7266437 6565307 6559219 6310610 6198545 6140934 6144907 5664045
16606E664045k41356M1652J41636l30250j10373j42335K28897m08757L2900J6843
16596D892902k58545j4917m34914k42891J98026L1635k50026K27197l39824Q4581
16586C893224Q047j20809m4672J26438l17257q301k0354j06960l77851J05176
16576C136681p5722K6546l66385K50068J62015O5689k11607k04976l540r334J16355
16565B885790m9475n53829L46615j60700j5143p083%K75113n08018L41598m18670
16554B136198k08527m7299J36754M7379k46888K5958J64916K57758k67367k24426
16544A774456p6016L31118n60902N57790l08548j97232K07490k1312m8733J28366
16534A786477J5949J58174n22599L16160l67012M43838l86659K82793j70165K76265
$$ plain form
16606 5664045 5422689 5464341 5605977 5275727 5165354 5023019 5251916 4843159 4876059 4892902
16596 4892902 4634357 4619440 4184526 3941635 4139661 4171296 3921270 4148467 3808643 3893224
16586 3893224 3901271 3780462 3735790 3862228 3544971 3536670 3516316 3409356 3031505 3136681
16576 3136681 3060959 3087505 2721120 2971188 3133203 3198892 2987285 2782309 2778769 2769435 2885790
16565 2885790 2836315 2282486 2629101 2468401 2453258 2446175 2446175 2721288 2213270 2554868 2136198
16554 2136198 1927671 1880372 2017126 2064505 1817617 1843575 2008491 2266249 1998882 1774456
16544 1774456 1698440 2029558 1468656 2026446 1717898 1520666 1728156 1706844 1658111 1786477
16534 1786477 1802426 1960600 1438001 1754161 1387149 1830987 1444328 1727121 1556956 1833221
16524A833221j60536j04952j14493M8337N140k54773K6667l5780o9031M82357
16514A656157k00550k32600J85591R3322k54339j16390j00443O7223J88887k03233
16504A083625l8717J44786k74390K40132k654k5078K45838M308k04208n4447k5487
16493A093708L2531k60149Q6742M3661j41783R5657m0257k57145M47043l0439
16483A069569L27975l53537j88584M1561J15142N373o1182J99514L2671q3020
16473A105482k19766l3918l43501K41299L68548o7741k14510p8018L3115K9673
16463H20663j43890M96025l97744r2025k14889M08955j42537q3767J90209Q1440
16453I22440J6512k15171K09978l82885J72293J42304m19639N50952K4110j91309
$$ plain form
16524 1833221 1672685 1567733 1453240 1501577 1506717 1251944 1278611 1242831 1173800 1656157
16514 1656157 1455607 1223007 1408598 1501920 1247581 1131191 1030748 1097971 1286858 1083625
16504 1083625 1044908 1189694 915304 1155436 1152782 1127704 1373542 1377850 1173642 1119195 1093708
16493 1093708 1126239 866090 952832 996493 854710 950367 910110 652965 1100008 1069569
16483 1069569 1397544 1044007 855423 896984 1012126 1017499 956317 1155831 1188502 1105482
16473 1105482 885716 851798 508297 749596 1118144 1050403 835893 757875 790990 820663
16463 820663 676773 1172798 775054 683029 468140 877095 734558 650791 841000 922440
16453 922440 938952 723781 933759 550874 723167 865471 445832 996784 1020894 829585
16443H29585l42308K30019Q7953Q3434j36905k13256Q5856K0381J13504K9118
16433G87381k73980J00706j7727K77551j4078j96621Q8956j07942r3061M64847
16423A016032j98268k08045J54742j34453J46257k68942O6144J49514B90567J0338
16413C00905L35033K11217k56010j70489J63837m2773K68047l39140l7837J58193
16403E90983j3777k04949L18751k39248q2922J17986J2233J42636j27554K9668
16393E43807j12935J74157K64381j73662k37579K56363J22932k08982L70405j91388
16383H07499C51034J19563R4930j52081p3361K90544L3480B91175a24553D18027
16372E69728J33704j50805j7009j32252J76083M04761l28166j22999n8413j56725
$$ plain form
16443 829585 487277 717296 805249 888683 751778 538522 624378 644759 758263 787381
16433 787381 513401 614107 596380 873931 859853 663232 752188 644246 551185 1016032
16423 1016032 817764 609719 764461 630008 776265 507323 573467 722981 290567 300905
16413 300905 635938 847155 591145 420656 584493 541720 809767 470627 432790 590983
16403 590983 577206 372257 691008 451760 368838 486824 499057 641693 514139 543807
16393 543807 430872 605029 869410 695748 458169 714532 837464 628482 998887 807499
16383 807499 351034 470597 565527 413446 340085 630629 664109 291175 -124553 418027
16372 569728 703432 552627 535618 403366 579449 984210 656044 533045 474632 317907
16362C17907J04839P2902m3368K07381B91014K46402A24763L28010k06848L18326
16352E64251B66226J61575J50407j45208J23191P8344E0500N97214k51805L10797
16342G06706l2749j31008I9109N62718B97028L48895k57924p7446M85517C26049
16331F14916B03770J50572K96132n7763j71923J33040j48219N871L7292j330J12098
16320E59540M0227k86107L02687J76161j39072R54j93382J55253k09899p4808
16310C31554J38302L27472j08391n4593O7646B84480K26603P4627j62103M4908
16300D68515K30520Q0771l06172p3192M51331C73558k9654J06736k01179l1543
16290B17918R4658K11053J94220A80681P45060j14704j66716B63924k1920L26143
$$ plain form
16362 317907 422746 495648 452280 659661 291014 537416 124763 452773 245925 564251
16352 564251 266226 427801 578208 433000 556191 634535 50500 647714 395909 706706
16342 706706 673957 542949 99109 661827 297028 645923 387999 310553 796070 326049
16331 614916 203770 354342 650474 592711 420788 553828 405609 411480 448772 447442 559540
16320 559540 599767 313660 616347 792508 653436 654390 461008 616261 406362 331554
16310 331554 469856 797328 688937 634344 701990 284480 511083 585710 423607 468515
16300 468515 699035 779806 473634 400442 851773 373558 343904 450640 249461 217918
16290 217918 312576 523629 717849 180681 925741 811037 644321 263924 242004 568147
16280E68147q7547K8672j2996K67675l24351l4492k6444M31623l68161A47567
16269F01079B86219m812K80473r6067j8470j4766j57456M19201j03761k1178p2657
16258D96726K16467k90225J39200q5307L25861C91236J87353j98726K75735k88742
16248C66856K30604j0455m9819j23498l1384L39466k72425P654O3668j96471J00392
16237D24588A87060M18481j57359j66073K92008j1376j19795j36497k0969K45724
16227E31204A94074J69361L37773C48583P6839O744r3184k990R0704j93473M0238
16216B73461M896n9052J30428A35424K41411O1444m3529Q7138B36946J89777O2538
16205D89261A43506K48979Q7109q3633j91849K46858A84430K87663k01147l1924
$$ plain form
16280 568147 480600 509272 496276 763951 439600 405108 378664 810287 442126 147567
16269 601079 286219 281407 561880 465813 447343 432577 275121 694322 590561 569383 496726
16258 496726 713193 422968 562168 476861 802722 391236 578589 379863 655598 366856
16248 366856 597460 587005 537186 413688 382304 721770 449345 456999 520667 324196 424588
16237 424588 187060 605541 448182 282109 574117 562741 442946 306449 285480 531204
16227 531204 194074 363435 701208 348583 425422 432166 338982 335992 426696 233223 273461
16216 273461 278357 219305 349733 135424 376835 438279 394750 481888 236946 426723 489261
16205 489261 143506 392485 479594 395961 204112 450970 184430 472093 270946 239022
16195B39022R7247R9685j33651K23984j86978j36385p3603L03556B11888p1181
16185A40707K15810q5615j16371J43440K18151J04847q1288B19344L14747A27108
16174i837C83742j78604O1283J45766q9078A51498K23317l8438K41864k49314
16164C28927E2945M06635j57081O0195J74568B08280J96347j64457J10693N0549
16154D01412D5953J93928A12325J93313I2533P1106J74636n5234A7616K18847
16144B36463I1748J24294c9766C76275E6566f5568B71848n8806a31454D19409
16133A15346r653J32793q7077K17956j40841f8550B52212l0897P9465j48933Q1870
16122B33717J16639A19991J53121l1245K80068B48634k0855c5159C36321K18888
$$ plain form
16195 239022 336269 435954 302303 526287 339309 202924 129321 432877 211888 140707
16185 140707 356517 270902 154531 297971 516122 620969 539681 219344 534091 127108
16174 -9837 383742 205138 266421 412187 323109 151498 374815 336377 578241 328927
16164 328927 52945 459580 302499 362694 537262 208280 404627 240170 350863 401412
16154 401412 45953 239881 112325 305638 92533 163639 338275 283041 17616 236463
16144 236463 91748 216042 -39766 376275 56566 -65568 271848 213042 -131454 419409
16133 115346 105693 238486 151409 369365 228524 -68550 252212 221315 300780 151847 233717
16122 233717 350356 119991 273112 241867 521935 248634 227779 -35159 336321 555209
16112E55209A89079G8661J01849H7797J18662j7056K2561J96306A81232q2410
16102I8822d2889p7188j25419A01016c6024D16170a05219A67810Q9016h0006E3550
16090C03953G4957L8696J38642b02803j01840A17085K13493F4950f1768B1804
16079i1295l6126E80i2137B42817G9826d78l8988C24202g9313J9612A75041G4885
16066B44504L2565m6402J05479b46733b0697B34624G9059J04574b48523b9046
16055F4432R2735K07794A01768K281j7914K45979b42874D2577b66982D9869a11597
16043G308g0316B95504a20411K6639J6882o667C24485d1046m25715D6648K48223
16032B94871b45055j95246C1993a97508A35706a06454D4643a89854E9014K90766
$$ plain form
16112 555209 189079 78661 180510 87797 206459 189403 211964 408270 181232 98822
16102 98822 -42889 -120077 -245496 101016 -36024 416170 -105219 167810 256826 -80006 53550
16090 303953 74957 113653 252295 -202803 -304643 117085 330578 64950 -61768 21804
16079 -91295 -127421 580 -92137 242817 79826 -478 -39466 324202 -79313 -59701 175041 74885
16066 244504 277069 230667 336146 -246733 -20697 234624 79059 183633 -248523 -29046
16055 64432 157167 364961 101768 104049 86135 332114 -242874 42577 -266982 49869 -111597
16043 7308 -70316 295504 -120411 -93772 -76890 -83557 324485 -41046 -466761 46648 294871
16032 294871 -245055 -440301 31993 -197508 135706 -106454 44643 -189854 59014 349780
16022C49780c2262O394j47366B7884J53777R8595i5101o9422A76823d4984l36607
16011c81591d7054j00450C440Q1354L937B6936b8237E7513J32583J40523A02945
15999I4282a65646D25867a86481B56003k0402H3641K27844a44162A23751a88244
15988B44480b70584a06493l9914j20535L0021j0745h7393A220b52235H4651a07441
15976G7633M0860J91504i5763b8042B40383J57937k1302j12979Q1214k4875m5143
15965B75235A7321K7988k319a5338k177B66476a38644e3362E5020j951N2106D5235
15952a87896B85838i716o4578A432R6342A9671K52435a15189e3316j58348j8062
15941b29726R9859o9793i5715j29784l29843A34756A3595K49367a75525h5536
$$ plain form
16022 349780 -32262 -25868 -173234 27884 181661 280256 -95101 -164523 176823 -44984 -381591
16011 -381591 -47054 -147504 3440 84794 88731 26936 -28237 57513 190096 330619 102945
15999 94282 -165646 425867 -186481 256003 235601 83641 311485 -144162 123751 -188244
15988 244480 -270584 -106493 -146407 -266942 -236921 -247666 -87393 1220 -252235 84651 -107441
15976 77633 118493 309997 -95763 -28042 240383 398320 377018 264039 345253 320378 275235
15965 275235 17321 45309 42990 -15338 -17515 266476 -138644 -53362 55020 53069 105175 45235
15952 -187896 285838 -9716 -74294 1432 97774 19671 272106 -115189 -53316 -211664 -229726
15941 -229726 -129867 -199660 -95715 -225499 -555342 134756 13595 262962 -175525 -85536
15930a74524j603A67099J90976A19619e8658a9365L028G6304c9947l27604G8789
15918a05967M0570p0519j21437J11531l3907l6071A44541a96807B44041P9436
15908C23477h7480k21161g8100a5777k19887A04579a10848B61506G3167J73043
15898B46210a08867A06330b21081c2808F4168M8307a36056j39863i5257k10436
15888c05693B34623e6500m2561k24324G8564a74363f9006n3793k50732A27066
15877a20922K1453D6911Q725K9000A020i1342A76239d0955D5945g0267k9523p183
15865a06973J6019H5690J57164d987l6873a5532n5706d062j77783h4073j03536
15854a87609A8554a76972f2802B3688M3601P6176a73451H854J74243f0810k16513
$$ plain form
15930 -174524 -176127 167099 358075 119619 -58658 -19365 -16337 76304 -39947 -367551 78789
15918 -105967 -65397 -135916 -257353 -145822 -179729 -215800 144541 -196807 244041 323477
15908 323477 -87480 -308641 -78100 -15777 -235664 104579 -110848 261506 73167 246210
15898 246210 -108867 106330 -221081 -32808 64168 112475 -136056 -275919 -95257 -305693
15888 -305693 234623 -56500 -99061 -323385 78564 -174363 -69006 -122799 -373531 127066
15877 -120922 -99469 46911 55636 84636 1020 -91342 176239 -40955 45945 -70267 -99790 -106973
15865 -106973 -90954 85690 242854 -4987 -41860 -15532 -71238 -4062 -181845 -84073 -187609
15854 -187609 18554 -176972 -62802 23688 67289 143465 -173451 8854 183097 -60810 -277323
15843b77323g1760G9802g2557r9090g77B07913c62110e6513l0213k52712a59121
15831A74372i2171k7162D47076a28932O3551A09466c8220C2672J73479g3144j20585
15820a93729B79587h2778A41621a80248B14771A7946b10241f2187D1532b64465
15809b15867k35772d2353E9320J24608r1405K12701c665H5886a15674J0220E3795
15797D8851a88101A35878a92156a2575A35982F1103b12355A05907a81704B81503
15786B7735g400n7669O584j60313j9572A40206J07355b64322R4474a3274n7143
15775g0417a9902k04425j06285B50676A06590j030P8734f3765j03887A08602d4810
15763B8649h2515r655B35897A3207J06005h9348k24506C14749B1779b64124a12272
$$ plain form
15843 -277323 -71760 79802 -72557 -171647 -777 207913 -362110 -56513 -86726 -339438 -159121
15831 174372 -92171 -119333 447076 -128932 -65381 109466 -38220 32672 206151 -73144 -193729
15820 -193729 279587 -82778 141621 -180248 214771 17946 -210241 -62187 41532 -264465
15809 -215867 -451639 -42353 59320 183928 92523 305224 -3665 85886 -115674 -105454 53795
15797 48851 -188101 135878 -192156 -12575 135982 61103 -212355 105907 -181704 281503
15786 27735 -7400 -65069 -58485 -218798 -238370 140206 247561 -264322 -169848 -13274 -70417
15775 -70417 -19902 -224327 -330612 250676 106590 105560 184294 -63765 -167652 108602 -44810
15763 28649 -82515 -92170 235897 13207 119212 -89348 -313854 314749 21779 -264124 -112272
15751D40812I4665l3565a25713L0348C40498a33115f6213h131j66959A0491c43427
15739G5373G092J32868A1541J53567a46791q8208O4786A25157g5749B10134a29131
15727b34548a01467K9490q273I9920C2053a98033b420A12879O8928H284b13811
15715a95113b7259j29574k27267a40501l7171A11362e5166n688j35329n1875G4682
15703A63543c9464B57436c73969J81219k32742m0649a99606h3421p1669C12384
15692B9365c62282c1594I5506a73774C5671o760d4609D72661A48169F5511a8125
15680A03444c15719I6205B0988d3833B23570a887F4720d26275J55989i5567l7153
15669a32720G150L7603h4009l03120f6489l88007J96319A39830O1998J1266a58080
$$ plain form
15751 440812 94665 61100 -125713 -95365 340498 -133115 -66213 -8131 -175090 10491 -343427
15739 75373 7092 139960 11541 165108 -146791 -234999 -170213 125157 -75749 210134 -129131
15727 -234548 -101467 -71977 -80250 99920 32053 -198033 -2420 112879 181807 8284 -213811
15715 -195113 -27259 -156833 -384100 -140501 -177672 111362 -55166 -60854 -196183 -248058 74682
15703 163543 -39464 257436 -373969 -192750 -425492 -466141 -199606 -83421 -155090 312384
15692 29365 -362282 -31594 95506 -173774 35671 28911 -44609 472661 148169 65511 -18125
15680 103444 -315719 96205 20988 -43833 223570 -1887 64720 -426275 -270286 -95567 -132720
15669 -132720 7150 44753 -84009 -387129 -66489 -454496 -258177 139830 201828 213094 -158080
15657a52907b6345k916o0792E0585b31468A72003a52536B03314m1767a10992B37311
15645A29150C5136b37105A85660b78146a3680j83121e1854q5052j15988p2264
15635c25158i5196A73586b83172G0528b17387g0489j08657c0637i517k2116G887
15623f8165m39260a59263k97402G570P3806O460F73f2176I2459b3126m7652k77129
15611c47907F529a08072B1012b66276E7082b51062B5156a0883j37781N5316k56244
15600c49592e0103j16608M8828j93476b3134j1311l1650B24900a17520j75437
15590b92957B39634c39295B66631g1220j20118B79482G6475d6983o1691A87215
15579A04261b02533A94099m2020a8463j8485a554G0765K8990a57268j59677A17875
$$ plain form
15657 -152907 -26345 -29261 -90053 50585 -231468 172003 -152536 203314 161547 -110992 237311
15645 129150 35136 -237105 185660 -278146 -13680 -196801 -51854 -136906 -252894 -325158
15635 -325158 -95196 173586 -283172 70528 -217387 -70489 -179146 -30637 -9517 -31633 7887
15623 -68165 -507425 -159263 -456665 7570 81376 87836 673 -62176 92459 -23126 -70778 -347907
15611 -347907 6529 -108072 21012 -266276 57082 -251062 25156 -10883 -148664 -93348 -349592
15600 -349592 -50103 -166711 -117883 -311359 -23134 -34445 -66095 224900 -117520 -292957
15590 -292957 239634 -339295 266631 -71220 -191338 279482 76475 -46983 -108674 187215
15579 104261 -202533 194099 152079 -18463 -36948 -1554 70765 99755 -157268 -316945 117875
15567i5553C12875e29706b27783b0674p9662j36445B10373a72058E9344b5855
15556b8580B84022L2221A32721b06637r0038B66305k0147h1445N4D3462f4110
15544A96722d74j43681M6433H1946b8189J107l4754A97483G1431J19407b22785
15532a27025C106a31793A77692b0253E7411k1399a20037D02125a00219A53288
15521B35551k7991b2590B49856i531A53942j5753b87124A63573C6799R2123a27139
15509H0222f7002j26354D6800e7936l92867E3695a415I2268a87554f490F6376
15497A33541K07105i2981B66345b2489A23337f4309b5010J0990A20130e4252A32832
15485E1997g3721D6534b81248K6627A58949k2495b61798A59886d7567j9889j91523
$$ plain form
15567 -95553 312875 -529706 -227783 -20674 -100336 -236781 210373 -172058 59344 -25855
15556 -28580 284022 316243 132721 -206637 -296675 266305 246158 -81445 -81391 43462 -64110
15544 196722 -474 -144155 -97722 81946 -28189 -27082 -61836 197483 71431 190838 -222785
15532 -127025 3106 -131793 177692 -20253 57411 36012 -120037 402125 -100219 153288
15521 235551 207560 -22590 249856 -9531 153942 138189 -287124 163573 36799 128922 -127139
15509 80222 -67002 -193356 46800 -57936 -450803 53695 -1415 92268 -187554 -6490 66376
15497 133541 340646 -92981 266345 -22489 123337 -64309 -25010 -14020 120130 -54252 132832
15485 51997 -73721 46534 -281248 -254621 158949 136454 -261798 159886 -47567 -67456 -258979
15474b58979A30415g4256N532K9255A22331a8122C27511b3164l17694P6522A35998
15462a16453A20446n6671a16259B38681n5291M4657b54849J4625A56607l9515
15452A17092C574N5361J63687i9147a7717E4155b9784A83657e27424a92614B5755
15440C85913A01083B3139J26618P3639b58391a08271C1384b6587g248j62057C00414
15428a40913A80428Q988a14435j62738C15587G5596l1339a09207D3604J1854a80408
15416g2660A20974i0066b9742B1909J00384J7308b2846o4678a8685j32425H9431
15404c21877D7206b10521R835b1390k7787l3461a9373q4875j75217A21553a1272
15392g8992k5067A60894N2727K17457f1525a1160A7189a3552A64890F3956k2624
$$ plain form
15474 -258979 130415 -74256 -68724 -39469 122331 -18122 327511 -23164 -340858 -264336 135998
15462 -116453 120446 63775 -116259 238681 183390 228047 -254849 -240224 156607 117092
15452 117092 3574 58935 222622 -99147 -17717 54155 -29784 183657 -527424 -192614 25755
15440 385913 101083 23139 149757 223396 -258391 -108271 31384 -26587 -7248 -169305 300414
15428 -140913 180428 189416 -114435 -277173 315587 75596 44257 -109207 43604 55458 -180408
15416 -72660 120974 -90066 -29742 21909 122293 139601 -22846 -87524 -18685 -151110 89431
15404 -321877 47206 -210521 -200686 -21390 -49177 -82638 -19373 -104248 -279465 121553 -11272
15392 -78992 -104059 160894 213621 431078 -61525 -11160 17189 -13552 164890 63956 41332
15381D1332J7842Q2116K17229A09743c25515J22994A98795M8420a41317O2869
15371g8448o4062B071K2419g8456b8139C33590F6943g8307G7089j8466N3114c12904
15358a72082j5627A61902A0312a7813C991b80403A32322c52119a07785j39447
15348b47232G1418a7902k17628Q8033K0977l47188B99448A37969h559o1321B78432
15336a09585J1971B04636Q2494j13426H971J28886F5346b93581G7704j3434e1354
15324H5121j758J205K68000q3057c65531L3956c0431p6829j9681C6558c49712
15312b19568B34169e9480D51481A9309a48371r7555D08634j59705a42180C24930
15301a20181b3090C3828J5730i1532a8029H0175a04239A97438o2285k1077m1268
$$ plain form
15381 41332 59174 141290 358519 109743 -325515 -202521 198795 247215 -141317 -78448
15371 -78448 -142510 2071 24490 -78456 -28139 333590 66943 -78307 77089 58623 111737 -312904
15358 -172082 -187709 161902 10312 -17813 3991 -280403 132322 -352119 -107785 -247232
15348 -247232 71418 -17902 -235530 -147497 -126520 -473708 299448 137969 -8559 -69880 278432
15336 -109585 -97614 204636 287130 173704 8971 137857 65346 -293581 77704 64270 -51354
15324 85121 83363 84568 352568 269511 -365531 -331575 -30431 -107260 -126941 36558 -349712
15312 -219568 234169 -59480 451481 19309 -148371 -245926 408634 248929 -142180 324930
15301 -120181 -23090 33828 49558 -91532 -18029 80175 -104239 197438 135153 114076 72808
15290G2808P135l73M0210A8196J10825J77593j13740a08174E9284h4319A05310
15278A766L2047A3279b2217A72432j2259N2449c3584D1659F856R645b38894A6250
15265B10527c30354A38679c2334A03183K52025B909K34530b7998C59968j24294
15255B35674H5780J48902a75166A38426j5995A1430J47439g8799l8112n6540g5485
15243A88509n7290a73063E4502d795C05694a44300B11424h7636d0185a302j05209
15232a06511B24848E6485d2311A09781C0909b51201B29223k7290c86679C67246
15221D2663J07010A8757K18447a42590J0090e2616A38243C561b6261E1355P9509
15210A30864a04115j20411G3194Q2006c9670k14790R3613b0795B0993j701K80515
$$ plain form
15290 72808 79943 79570 119780 18196 129021 306614 192874 -108174 59284 -84319 105310
15278 1766 33813 13279 -22217 172432 160173 212622 -33584 41659 6856 16501 -238894 16250
15265 210527 -330354 138679 -32334 103183 355208 2909 237439 -27998 359968 235674
15255 235674 85780 234682 -175166 138426 122431 11430 158869 -78799 -116911 -173451 -75485
15243 188509 131219 -173063 54502 -4795 305694 -144300 211424 -87636 -40185 -1302 -106511
15232 -106511 224848 56485 -42311 109781 30909 -251201 229223 201933 -386679 367246
15221 42663 149673 18757 237204 -142590 -132500 -52616 138243 3561 -26261 51355 130864
15210 130864 -104115 -224526 73194 155200 -39670 -254460 -160847 -20795 20993 19292 299807
15199B99807H8673J3677k1450K08949j40890a12650H6406l58D219J61308j1847
15188A53680P2670a1598k31145B2838a50453a2774E77923A41482O5937d771n7420
15177f2191F6331R8022J56381G3920c432o4341A02999K0547A3945P2191R1458
15166A77594H2708i2051p6707g0475M194A6435J54728j9500g3375A35762C5711
15154C6985g4904K1410B12639G7944b9992F7601A9217a37181A90311g9375B25499
15142F7105R6555i4919m2918A32382b54l51813F1101i7924D8660J34184G2050
15130b09937C14414n5421q2551b24865A01889O0733n8293j2335N8188j5027K15090
15119C50245n0078C0862J44141J44842k9182J68532k10114M2159j03252j074k3163
$$ plain form
15199 299807 88673 102350 80900 289849 148959 -112650 86406 86048 4219 165527 153680
15188 153680 226350 -11598 -242743 22838 -150453 -12774 577923 141482 207419 -4771 -62191
15177 -62191 66331 164353 320734 73920 -3432 -67773 102999 123546 13945 86136 177594
15166 177594 82708 -92051 -168758 -70475 -66281 16435 171163 151663 -73375 135762 35711
15154 36985 -74904 -53494 212639 77944 -29992 67601 19217 -137181 190311 -79375 225499
15142 67105 163660 -94919 -137837 132382 -254 -352067 61101 -97924 48660 182844 72050
15130 -209937 314414 258993 176442 -224865 101889 162622 104329 91994 150182 135155 350245
15119 350245 300167 30862 175003 319845 290663 459195 249081 291240 187988 186914 163751
15108A63751O8747J09677j54613O236F156O5411O5007f7145G8490Q3382K4106
15097A85978A0702L70032C728b7666K680B56327k3765A09051M66956A34468o1306
15086G3162K87261E3048J8873L74835d76268A40028a10019C9098c04678F2495
15075C48443j59831N4465q7213j6112l0165L2354m6977a3459r6837C4031K06228
15064B40259K3985P5925J35768C8320L1727a25231A56210L0482A5770O4183e318
15052B99906p2608M8770A009M26670f9173b2910j13040B38825C3469Q9924a12845
15040d35864B62984O2292N71E0513f079B97079A20773M35634B21174H1508M8939
15029A30447J07201k8654n5159J14601O4673b13684C45190P4189j51124j2410
$$ plain form
15108 163751 232498 342175 187562 193798 6156 71567 136574 -67145 78490 161872 185978
15097 185978 10702 380734 3728 -27666 -24986 256327 232562 109051 576007 134468 73162
15086 73162 360423 53048 71921 446756 -476268 140028 -110019 39098 -304678 62495
15075 348443 188612 243077 155864 139752 109587 141941 94964 -13459 -110296 34031 240259
15064 240259 264244 340169 475937 38320 70047 -125231 156210 186692 15770 79953 -5318
15052 299906 227298 276068 1009 427679 -69173 -22910 -135950 238825 33469 123393 -112845
15040 -435864 262984 325276 325847 50513 -6079 297079 120773 556407 221174 81508 130447
15029 130447 237648 208994 153835 268436 333109 -213684 345190 419379 268255 255845
15019B55845O3462k8182k1355A12445a20314C04949A2387R9606L1162L8985J540
15008A83680D7969K74577O6431j26477J51570B01150n773D6445a72089C06582
14997B34161B3515J94677K04609J46715B08546G8590J15259k5955K25577A94046
14986B99531J41932B00016K7783K22144I1516J33874M16738E691M46334G3629
14975A70483J98625n3275K2413G9609J98329J27821A35709J72774J28588j38472
14965B98599R5625N1865A51892J14448J98697A63760K88359k24705n936N1367
14955B72845k2043k5861L03173j40409j70466j9803n2235K1427R7475M376R0363
14944C58842j62213K00961k2416K8075J56080j38469A65990l3945J48593J672
$$ plain form
15019 255845 319307 291125 269770 112445 -120314 304949 12387 111993 143155 182140 183680
15008 183680 47969 322546 388977 262500 414070 201150 195377 46445 -172089 306582
14997 234161 23515 218192 422801 569516 208546 78590 193849 167894 393471 194046
14986 299531 441463 200016 227799 449943 91516 225390 642128 5691 452025 73629
14975 170483 369108 315833 338246 79609 277938 405759 135709 308483 437071 298599
14965 298599 394224 446089 151892 266340 465037 163760 452119 227414 221478 272845
14955 272845 250802 224941 528114 387705 217239 197436 145201 166628 264103 268479 358842
14944 358842 196629 397590 375174 403249 559329 420860 165990 132045 280638 282310
14934B82310J06553K7673r9718A57438K10738n3563O8321C623J46250a01421C17010
14922B60513l9203K8630n7399J3605O7081F71J88432r2012J60275g829E64598
14910D26922J89202B79911K65871K86735l41460K22540k79637J02860L8486K9486
14900F04792j47707L26753A70764K82034J84679K04999l09620j95282N1062L5526
14890D24162J49438L8794k18014j0056j12834J41199j57543K34165j33597J43423
14880D99137J0114j04795K49608k16425D8984K10314J03951A76627M55386J20463
14870G52476k03155q9682K03098B36698K7260J68221N5324j48821P5181J57729
14860E71592p3430j79207L78947C8733L07831r3733J37914K8947M6532j73020
$$ plain form
14934 282310 388863 416536 316818 157438 368176 314613 382934 3623 149873 -101421 317010
14922 260513 221310 249940 192541 206146 273227 671 189103 97091 257366 -7829 564598
14910 426922 616124 279911 545782 832517 491057 713597 433960 536820 575306 604792
14900 604792 457085 783838 170764 452798 637477 842476 532856 337574 388636 424162
14890 424162 573600 612394 394380 384324 271490 412689 255146 489311 355714 499137
14880 499137 509251 404456 654064 437639 48984 259298 363249 176627 632013 752476
14870 752476 549321 459639 662737 236698 263958 432179 487503 338682 413863 571592
14860 571592 498162 318955 697902 38733 346564 252831 390745 419692 466224 293204
14850B93204K59735J48763l05284J04339A4480M93029j76095j32479M12724k55230
14840C56429K06600q1069A71213K56391N19956l49259B75089J32205J12916A67819
14829C02288K09504A99392R8422R0753p8376K34702J26625m1674J04108k17661
14819E16291m2092L15604j98592R9128M5008I5605P82024B25107J03317J90764
14809E19188j10916M52517l74393A74210M98880l31913J47998j65067J44403P5821
14799E44332J14218j01656J18811q6382o2216n4496B06892J83098K52039j23132
14789E18897J71011K9311j54895K07860C44039p9428J51672J79721P2585j22174
14779E46415j40414K47799K9106n8674j20667L01178k55871j87479J94189j16195
$$ plain form
14850 293204 552939 701702 396418 500757 14480 507509 331414 198935 611659 356429
14840 356429 563029 481960 171213 427604 947560 598301 275089 407294 520210 167819
14829 302288 511792 199392 297814 388567 310191 544893 671518 629844 733952 516291
14819 516291 474199 789803 591211 690339 735347 95605 877629 225107 328424 519188
14809 519188 408272 860789 486396 174210 673090 341177 489175 324108 468511 544332
14799 544332 658550 556894 675705 589323 527107 472611 206892 389990 642029 518897
14789 518897 689908 719219 564324 772184 344039 264611 416283 596004 668589 546415
14779 546415 406001 653800 682906 624232 503565 804743 548872 361393 555582 439387
14769D39387J11992q1132J32726O2496q2349j87261N3888Q2816L6773Q5902C23911
14757H97559K3821L5806k27198j86217L71342j41391L180j49589J81392j20113
14747F88592j85238l3107m4979K32297r7204J17414K85356l8068m43643J82412
14737F63832K21893j3755j62494P2905j0372J90972D12726k4023N73688J10o6697
14726H95804j60311M5819n6372L3736K69072m0347l07845K77964l14324K27349
14716H70545k63157L56890k17956r3939k11255J65513J94050M99798j55100q4372
14706A061017l58070P1379R3226R4595J03598P1007o2073k99931J10258o8014
14696H16992J24820j15045K8798n3148R7745K23824j51063j52266J04671r522
$$ plain form
14769 439387 551379 470247 602973 665469 583120 395859 449747 532563 569336 655238 323911
14757 897559 921380 957186 729988 543771 915113 773722 776902 627313 808705 688592
14747 688592 503354 470247 425268 657565 560361 677775 963131 925063 481420 663832
14737 663832 885725 871970 709476 782381 772009 962981 412726 388703 962391 962501 895804
14726 895804 735493 781312 724940 758676 1027748 987401 679556 957520 643196 870545
14716 870545 607388 964278 746322 652383 441128 606641 800691 1300489 1145389 1061017
14706 1061017 702947 774326 867552 962147 1065745 1136752 1074679 774748 885006 816992
14696 816992 941812 826767 855565 802417 900162 1123986 972923 820657 925328 915806
14686I15806J96062r2609n7970J02572j54255j93708Q2283L71573m73595K34834
14676I30993q361J63938j6818k65889O1644J1277M3179J07664K85457k37647m0168
14665A035269k18009N12959m81746N10142m8123n70581L28448o6881j60215L96299
14655A237562j83803k03175J83758l15616M51828L4253L2020r5774l080M2080
14645A180053j02908l28171L97908N1692j52769L26761k21973q8176O2936L58120
14635A483473k16345n7823J06579l5211j61655j54765L89221J26794m09240p7277
14625I93751K16954k1005J39344j83969j65500K61042k3220K24175J04816l17256
14615A229132R9985l26376K55958K34635n9363k80563K03742j5091L03995n28369
$$ plain form
14686 915806 1111868 1019259 961289 1063861 909606 715898 798181 1169754 696159 930993
14676 930993 922632 1086570 1069752 803863 865507 876784 919963 1027627 1313084 1075437 1035269
14665 1035269 817260 1330219 848473 1358615 1310492 739911 1068359 1001478 841263 1237562
14655 1237562 1053759 850584 1034342 718726 1170554 1204807 1236827 1141053 1137973 1180053
14645 1180053 1077145 748974 1146882 1198574 1045805 1372566 1150593 1062417 1125353 1483473
14635 1483473 1267128 1209305 1315884 1280673 1119018 964253 1353474 1480268 1071028 993751
14625 993751 1210705 1189700 1329044 1145075 979575 1240617 1217397 1441572 1546388 1229132
14615 1229132 1329117 1002741 1258699 1493334 1433971 1153408 1357150 1342059 1646054 1117685
14605A117685L06704L57987m88026K59018k05695K16449k1200j32515K04417j74143
14595A440681n1837J10144N85996m99188K02283j84346J26436k8921P4361l3912
14585A741697m0414N3260K47957m60132J78634j2832Q1962k37681K06394j2535
14575A746310K25744k66795L76158j55220j41352K15218r9422J04984j82209M3622
14565A867038j4561l3889K81253J45727k89884L72392Q83r7559L6890o9447J01712
14554B300555O1114L06163L543o133k65733J69718J6365N99507j26107J35211
14544C194203K19159K04521L00860J83991L74464N80143O63606O44676R78338
14535G343961J711627K301657L606760M319430L794813r49611n642515n543709
$$ plain form
14605 1117685 1424389 1782376 1294350 1553368 1347673 1564122 1542922 1410407 1614824 1440681
14595 1440681 1388844 1498988 2084984 1585796 1788079 1603733 1730169 1701248 1775609 1741697
14585 1741697 1701283 1754543 2002500 1542368 1721002 1708170 1790132 1552451 1758845 1746310
14575 1746310 1972054 1705259 2081417 1926197 1784845 2000063 1900641 2005625 1823416 1867038
14565 1867038 1852477 1818588 2099841 2245568 1955684 2328076 2328959 2231400 2268290 2198843 2300555
14554 2300555 2361669 2667832 2671375 2665242 2399509 2569227 2585592 3185099 3058992 3194203
14544 3194203 3413362 3617883 3918743 4102734 4477198 5057341 5720947 6365623 7343961
14535 7343961 9055588 11357245 14964005 19283435 23078248 22128637 16486122 10942413
14527A0942413l675091j382063r09013q96609p26959p6141q1590m30603L6733
14518B801077l86768J04671J94118K8008j00840j84296K18743k64164Q2686J80609
14508B673844p6312K74351n17940O72268l21621q1674J77194o7453L87116l65728
14498B754045J05524k5671K42777l00373Q5169J9844K98515k93722J17035L07741
14488C310884l7080k69281M73676m9770K31763k44877j62097L08571J12194M0757
14478C714740j43039R780K34581l39386M65920m56941k9085M86279J75183o5757
14468D052275j49390J0085P7025L59112k59015J61334q0227J89550q6877L89028
14458D662900n4361p5407j3134O46852n06373j7505J95562Q3956k2653n40J62183
$$ plain form
14527 10942413 7267322 5885259 4976246 4079637 3352678 3276537 3194947 2764344 2801077
14518 2801077 2414309 2518980 2713098 2741106 2640266 2455970 2674713 2410549 2493235 2673844
14508 2673844 2597532 2871883 2353943 3026211 2704590 2622916 2800110 2732657 3119773 2754045
14498 2754045 2859569 2833898 3076675 2776302 2861471 2881315 3179830 2886108 3003143 3310884
14488 3310884 3273804 3004523 3478199 3428429 3660192 3415315 3253218 3561789 3673983 3714740
14478 3714740 3571701 3581481 3816062 3476676 3942596 3485655 3456570 3942849 4118032 4052275
14468 4052275 3902885 3912970 3989995 4349107 4090092 4251426 4171199 4360749 4273872 4662900
14458 4662900 4608539 4533132 4519998 5166850 4660477 4642972 4838534 4922490 4899837 4899297 5061480
14447E061480Q9811L3109k38586L30712j68318M28752l80652J73242J26452m8993
14437E407009K63004j24812K96624J87706l60319K40210l06887M28401k4787O42110
14427F648259k63874O3897K46869L22497n24109M12514m3221l31857K32668L55001
14417G118644J79134J02589Q4024K21569l19259O09257o98727N93351K89687J59792
14407H340061l3769J36850K47610j94944L26784j2085L51831n2633j37884Q28233
14397I800054m70270M03552K11937R2575J60027K02815O3160J819K32699K58476
14387A0956844J37214J97085K18782K09335M86355j16639J65676K92425J81840
14378A2728917L34386j81327O66242J9382J94428L69896J20569L87040L69869
$$ plain form
14447 5061480 5151291 5184400 4945814 5276526 5108208 5536960 5156308 5329550 5456002 5407009
14437 5407009 5670013 5545201 5841825 6029531 5669212 5909422 5602535 6030936 6006149 6648259
14427 6648259 6384385 6448282 6695151 7017648 6493539 6906053 6862832 6530975 6763643 7118644
14417 7118644 7297778 7400367 7484391 7705960 7386701 7995958 7297231 7890582 8180269 8340061
14407 8340061 8306292 8443142 8690752 8495808 8822592 8810507 9162338 9109705 8971821 9800054
14397 9800054 9329784 9733336 9945273 10037848 10197875 10400690 10463850 10465669 10698368 10956844
14387 10956844 11094058 11291143 11509925 11719260 12205615 12088976 12254652 12547077 12728917
14378 12728917 13063303 12881976 13548218 13567600 13762028 14131924 14252493 14639533 15009402
14369A5009402Q4137N26691O9247J85841M92945K10318M23867L42086N31944K54896
14359A8131374L79491J8954L94915O19142L97836L42808M58127Q99629L421P43339
14349B2389036N16166J9018O01171N34383O74213L72956Q01150K68250J106501
14340B7282844L62185N32688P75927P19950O55922R44077O84975Q28571O58296
14331C3445435N34211J695849N98213R01168R21754J416285Q65602J393437J100905
14322D2872859J014912J478009J139046J606877J351520J735609J561756J619993
14314E4380581J641784K013246J703257J989751K340554J662484K708620K192009
14306G0632286K797717K383940K584961L111185L059327L406664L337433L952330
$$ plain form
14369 15009402 15093539 15620230 15689477 15875318 16368263 16578581 17002448 17344534 17876478 18131374
14359 18131374 18510865 18529819 18924734 19543876 19941712 20284520 20742647 21642276 21645697 22389036
14349 22389036 22905202 22924220 23525391 24059774 24733987 25106943 25908093 26176343 27282844
14340 27282844 27645029 28177717 28953644 29673594 30329516 31273593 31958568 32787139 33445435
14331 33445435 33979646 35675495 36273708 37174876 38096630 39512915 40378517 41771954 42872859
14322 42872859 43887771 45365780 46504826 48111703 49463223 51198832 52760588 54380581
14314 54380581 56022365 58035611 59738868 61728619 64069173 65731657 68440277 70632286
14306 70632286 73430003 75813943 78398904 81510089 84569416 87976080 91313513 95265843
14298I5265843L481736L606956M611478M414675M403751N025644N108875N480899
14290A31399857N698986O179069O053714O996229P210337P371982Q204542Q223278
14282A87337994R091266R229429R376591J0042802J0738739J1309610J2105894
14275B59232325J2016014J2426146J2908533J3393135J3053482J3654817J3196072
14268C49880524J3015526J2449471J1214386J0282625Q894019P973186P369076
14261D21078813O984762O777030M795046L060955J474469O07690o72600l383179
14253D40722986n481759p323242q922961r986279j1358357j1423290j1923123
14246C74303975j1922605j1934842j2324539j2049530j2063447j2326423j2247121
$$ plain form
14298 95265843 98747579 102354535 106966013 111380688 115784439 120810083 125918958 131399857
14290 131399857 137098843 143277912 149331626 156327855 163538192 170910174 179114716 187337994
14282 187337994 196429260 205658689 215035280 225078082 235816821 247126431 259232325
14275 259232325 271248339 283674485 296583018 309976153 323029635 336684452 349880524
14268 349880524 362896050 375345521 386559907 396842532 405736551 413709737 421078813
14261 421078813 428063575 434840605 439635651 442696606 444171075 444778765 444106165 440722986
14253 440722986 435241227 427917985 418995024 409008745 397650388 386227098 374303975
14246 374303975 362381370 350446528 338121989 326072459 314009012 301682589 289435468
14239B89435468j2195741j1514574j1550338j0835497j0597196j0547707r919492
14232B12274923r639970r717444q796918q538574q260889p597215p192617o774546
14224A45756750o397322n957276n530360n594419n036862m929757m337434m258514
14216A03714806l974272l597736l798140l813249l216047k695626l430126k910561
14208G6279049k452724k454978k784251k138773k167931k131151k102878j752444
14200E8293919j736347k002417j606479j529496j497191j288495j710748o92362
14192D6230384j216187j557525j263399j135141j244651q85774j255941q17090
14184C6854676q77014j237089n29670j112476p18921n92819q42351q90540n81650
$$ plain form
14239 289435468 277239727 265725153 254174815 243339318 232742122 222194415 212274923
14232 212274923 202634953 192917509 184120591 175582017 167321128 159723913 152531296 145756750
14224 145756750 139359428 133402152 127871792 122277373 117240511 112310754 107973320 103714806
14216 103714806 99740534 96142798 92344658 88531409 85315362 82619736 79189610 76279049
14208 76279049 73826325 71371347 68587096 66448323 64280392 62149241 60046363 58293919
14200 58293919 56557572 54555155 52948676 51419180 49921989 48633494 46922746 46230384
14192 46230384 45014197 43456672 42193273 41058132 39813481 38927707 37671766 36854676
14184 36854676 35977662 34740573 34210903 33098427 32379506 31786687 30944336 30053796 29472146
14175B9472146r85813m03594o70275q98846p71436l31603m80059l77543n74868
14166B3978109o74074m22281m77003l35589q52445j51061o75150m06176j90462
14157A9793868l64943n67568m98373j69450l14584j25755n14055n73011k31142
14148A6434987k21274l79703j94020l00770l11201J41939m13225l06239l02257
14139A4148237l57537m59032K77784n03505k7991j50690l85075J83997o13950
14130A2112238l9221k81109l83234k59324J19661l42397J88448l93521k50376
14121A0471165J5806m0221n65531K04293l18757k57945r7691k3419k41543L54529
14111I500686o65872o1457r0525J06615m48605J78459j07882k10845j13284j84276
$$ plain form
14175 29472146 28486333 28082739 27412464 26513618 25742182 25410579 24930520 24552977 23978109
14166 23978109 23304035 22881754 22404751 22069162 21216717 21065656 20390506 19984330 19793868
14157 19793868 19428925 18861357 18362984 18193534 17878950 17753195 17239140 16666129 16434987
14148 16434987 16213713 15834010 15639990 15339220 15028019 15169958 14756733 14450494 14148237
14139 14148237 13790700 13331668 13609452 13105947 13077956 12927266 12542191 12726188 12112238
14130 12112238 12073017 11791908 11408674 11149350 11269011 10926614 11115062 10721541 10471165
14121 10471165 10486971 10446750 9881219 10085512 9766755 9508810 9411119 9387700 9146157 9500686
14111 9500686 8834814 8773357 8682832 8789447 8340842 8519301 8411419 8200574 8087290 7903014
14101G903014P6501k5793J5803l22618M9839l34947j18483j51113j6737O0063
14091G135529M1611j12774m24219j75249L67237J7187o03027J99613k01343K8808
14081F273373O1714l47449K7840J77355l13205K29780l06224K30068m21924J9091
14071E630419k92833J72988j74388K04107k77666J80096k02614k95335L50799
14062E295573k45257l5573q5158j43934k58648J82482J56857q6044n4048j05838
14052D620412l29843J58113p598L0854k22400J41318k42446R9005o8605J83718
14042D362528l22794j9369J15222k47146P2797l8913K2017k98629K54839k93745
14032C606807j07170o9320L80414J78294n35583K59740j10191k02418j18560J26068
$$ plain form
14101 7903014 7979515 7953722 7969525 7646907 7696746 7361799 7243316 7092203 7075466 7135529
14091 7135529 7177140 7064366 6640147 6464898 6832135 6849322 6246295 6445908 6244565 6273373
14081 6273373 6335087 5987638 6015478 6192833 5879628 6109408 5803184 6033252 5611328 5630419
14071 5630419 5337586 5510574 5336186 5540293 5262627 5442723 5240109 4944774 5295573
14062 5295573 5050316 5014743 4929585 4785651 4527003 4709485 4866342 4780298 4726250 4620412
14052 4620412 4290569 4448682 4441084 4471938 4249538 4390856 4148410 4247415 4178810 4362528
14042 4362528 4039734 4020365 4135587 3888441 3961238 3922325 3944342 3645713 3900552 3606807
14032 3606807 3499637 3430317 3810731 3989025 3453442 3713182 3602991 3400573 3282013 3408081
14022C408081j6539M8841J81220j3306k63594q6418P8581Q7034j86828l860K82213
14011C515425o12228L29175k2493j41281l8098k7797k26384K28795l88553K98762
14001B915323j98578j38630J13364N5662K85374l35770O2190O1066l18558Q5210
13991B586653m9505q329J82301J1408J07314o7081R0137l24462K53687P24594
13981C506717n00054J77911N11093L18377M52373O82999J246927K162739K954510
13972A1513592M895507N107544J229949m450641m595435l111600k688688r80124
13964F920104j064230p68764m72789l66142k15081j22300m95517k18315R369m8413
13954C157922o11530L11938K6481k28154L4435m0801J10214l57195j62975K9075
$$ plain form
14022 3408081 3391542 3440383 3621603 3608297 3344703 3258285 3336866 3423900 3237072 3233212 3515425
14011 3515425 2903197 3232372 3209879 3068598 3030500 3002703 2776319 3005114 2616561 2915323
14001 2915323 2716745 2578115 2691479 2747141 3032515 2696745 2758935 2820001 2501443 2586653
13991 2586653 2537148 2528819 2711120 2722528 2829842 2762761 2852898 2528436 2782123 3506717
13981 3506717 3006663 3184574 3695667 4014044 4466417 5149416 6396343 8559082 11513592
13972 11513592 16409099 21516643 22746592 18295951 13700516 10588916 7900228 6920104
13964 6920104 5855874 5087110 4614321 4248179 4033098 3910798 3415281 3196966 3206335 3157922
13954 3157922 2546392 2858330 2884811 2656657 2691092 2650291 2760505 2403310 2240335 2269410
13944B269410J15887j92745M14021l97540j32452K45143J45863k47918l1647K8662
13934B216684M4697l1070m59427K03550Q1535k40493K89233m05899J71081R4831
13924A964722J9627k73942K93384j11655n3157q3590k28476L01799o4177o4225
13914A700310K07124k10597P4836J9342J55833l22208K77951j36587k3651J23083
13904A865436j92318l8859j38630L73647k75005l547N0591l47536N41346j06796
13894A728329j33740J01914k54182r4794k8678K15270j55904J37809M787j34343
13884A386468j02674J84408m70989O53473l37587K58523j35834l36613K54321
13875A353496L49640p71176O56524j72433K92656m77396Q4406L4192n15065K67588
$$ plain form
13944 2269410 2385297 2192552 2606573 2209033 2076581 2321724 2467587 2219669 2188022 2216684
13934 2216684 2261381 2230311 1770884 1974434 2055969 1815476 2104709 1698810 1869891 1964722
13924 1964722 1984349 1710407 2003791 1892136 1838979 1755389 1526913 1828712 1764535 1700310
13914 1700310 1907434 1696837 1771673 1791015 1946848 1624640 1902591 1766004 1742353 1865436
13904 1865436 1673118 1634259 1495629 1869276 1594271 1590724 1641315 1293779 1835125 1728329
13894 1728329 1594589 1696503 1442321 1347527 1318849 1534119 1378215 1516024 1520811 1386468
13884 1386468 1283794 1468202 997213 1650686 1313099 1571622 1435788 1099175 1353496
13875 1353496 1703136 931960 1588484 1416051 1708707 1231311 1315717 1349909 834844 1102432
13865A102432R6161K63834j32587j38166J04144J55588l21768K16105j67595O8241
13855A246389m4109k2288Q9300j45150l15331K71666J38840J88689k16666n1841
13845A139499M55628l03722l51162K71482n2909l16180m418L80958k86202P767
13835I40741K50923K17114k57145j11139L21432l22323J3260N8368r738R3523
13825A195016J24009m32380L56616R8627m56091M02146m4675n51129K60146o1726
13815H90559K26888j10427K91929j27557m81107L46823j64103P6438R1133L7122
13805A077698l45906J98087P6084j62436J94994m10751N12428P2658l22174r7700
13795G92982k8690Q6500R2784l56076L49407j69024j35774l2732J39234J51061
$$ plain form
13865 1102432 1198593 1462427 1329840 1191674 1295818 1451406 1129638 1345743 1178148 1246389
13855 1246389 1202280 1179992 1269292 1124142 808811 1080477 1219317 1408006 1191340 1139499
13845 1139499 1595127 1291405 940243 1211725 1158816 842636 838218 1219176 932974 940741
13835 940741 1191664 1408778 1151633 1040494 1361926 1039603 1052863 1111231 1101493 1195016
13825 1195016 1319025 886645 1243261 1341888 885797 1287943 1243268 692139 952285 890559
13815 890559 1117447 1007020 1298949 1171392 690285 1037108 873005 949443 1040576 1077698
13805 1077698 731792 929879 1005963 843527 1038521 627770 1140198 1212856 890682 792982
13795 792982 764292 850792 943576 587500 936907 767883 632109 599377 738611 889672
13785H89672L8016J48905D20388M86806M4910l26055M0738J13737K9583M8318
13775H58425j36462Q7737p0681J19941K08805m5393q0748D63797M77870k22317
13765G19350L6535j0699M9767J69787j95833j1591k67356O71802j65877j71683
13755H24202J02623l64832K93719K6955J13305q16k44883P9520r1070k5103P004
13744G20624K82600l45949C01334P5870N84605L2796j76438j43661o7706o2618
13734E44182K18611M8296Q6811l15567j81028N9755N65318l24203j13910m0085
13724E48180L49159m35616K30288j00360M3338J01799j05644L51941k31408k62127
13714D89550J18567L7596r1807K85410l0947j51592m8457k89296J75961L06643
$$ plain form
13785 889672 927688 1076593 420388 907194 952104 626049 666787 780524 810107 858425
13775 858425 721963 809700 739019 858960 1067765 1022372 941624 463797 941667 719350
13765 719350 755885 745186 794953 964740 768907 757316 489960 1161762 995885 824202
13755 824202 926825 561993 855712 882667 995972 995156 750273 829793 738723 713620 720624
13744 720624 1003224 657275 301334 377204 961809 994605 818167 674506 606800 544182
13734 544182 762793 811089 897900 582333 401305 461060 1026378 702175 588265 548180
13724 548180 897339 461723 692011 591651 634989 736788 631144 983085 751677 489550
13714 489550 608117 645713 553906 839316 808369 656777 608320 319024 494985 801628
13704H01628k46116L1864J82154k9423k89969J7945M1496q3181K990M9059L25824
13693H04271k78090J7847J71730j03083k1140j09600k29518M05826Q0339j64613
13683E73969J3392J81469j20721j46094L18653l83136K69509k18937l2241J69270
13673F25133r8386j19281J67048k6603k58172r840K24045r0344j70926N17772
13663G60446C26272J18988K48685B90806J60200P2199j47928O2736p1008j37368
13653B29637M1114K47678j33049N1063q5252K77402J9334k47864K2044L74937
13643G97044B07847J33087P6981J79662j02302B10211L08674k30299J49530k9796
13633D08320J51614j16050N241J69313k71300j17425P6195j0694K66350m7194
$$ plain form
13704 801628 555512 587376 769530 740107 450138 468083 509579 426398 429388 478447 804271
13693 804271 526181 544028 715758 612675 591535 481935 252417 658243 738582 573969
13683 573969 587361 768830 648109 502015 820668 437532 707041 488104 455863 625133
13673 625133 526747 407466 574514 547911 289739 279899 503944 413600 242674 760446
13663 760446 326272 445260 693945 290806 451006 523205 375277 438013 367005 229637
13653 229637 270751 518429 385380 436443 351191 628593 647927 400063 422107 797044
13643 797044 207847 340934 417915 597577 495275 210211 518885 288586 438116 408320
13633 408320 559934 443884 449125 618438 347138 229713 305908 295214 561564 514370
13623E14370J4513A80124N90715B59276K04282P2595j68204p734A40768L25456
13613D66224k25506J67519o4290A66166O69517A46460N62629j97789K0862B26213
13602C49894n0796J73054j91400L21987j80401P4404Q3028K4721j9486j14494
13592D70511P17R948j89860j35204J52905J30558A30668F0048M90186j23681j56349
13581B70204L3510L20470G4856P73041B68362Q3862A34947a26235E74865j23099
13571D51766j43748K25059o0769j13897o7710J31748J01364B13106K27560j01068
13561C39598K26709B08479K06262K09305B96771j10635J04501K3159K83662B08708
13550D98892B07601J62904J5132R3152a19618D59655B24456M7747m3458L13895
$$ plain form
13623 514370 528883 180124 770839 259276 463558 536153 367949 360215 140768 466224
13613 466224 240718 408237 343947 166166 835683 146460 709089 511300 532162 226213
13602 349894 299098 472152 280752 602739 422338 496742 579770 604491 585005 470511
13592 470511 471228 481176 291316 156112 309017 439575 130668 60048 550234 426553 270204
13581 270204 303714 624184 74856 847897 268362 352224 134947 -126235 574865 451766
13571 451766 308018 533077 472308 358411 290701 422449 523813 213106 440666 339598
13561 339598 566307 208479 414741 624046 296771 186136 290637 313796 597458 208708
13550 498892 207601 370505 385637 478789 -119618 459655 224456 272203 228745 542640
13540E42640k11646Q7131o3937A45066L86591k62082k5146J81695j92532P0256
13530C03848j48321N07619l04570n7924D9886J96292R1066K52160A81210M00932
13520E82142j06827A98370K25777I3098R0488J1878J30003J63771A77241J71483
13510C48724J82973J77569B31956e6433I8265J28283A07733K57408I8063J05419
13500B03482K90099k07205k0098j10293D2142L48747N4857J87654C109L30554
13490C33663e1104C70114j29844H7596J83040A15303J58190g3798B37769J60285
13480C98054J5356j41821C1589j2270J12471C5168J23492L52691j55177J8636
13470C74810A40077M18898k44287J76386B38969N4056A37008J77557J42509H8052
$$ plain form
13540 542640 330994 418125 354188 145066 531657 269575 244429 426124 233592 303848
13530 303848 155527 663146 358576 300652 49886 246178 337244 589404 181210 582142
13520 582142 475315 198370 424147 93098 183586 195464 325467 489238 177241 348724
13510 348724 531697 709266 231956 -56433 98265 226548 107733 365141 98063 203482
13500 203482 493581 286376 266278 155985 42142 390889 445746 633400 3109 333663
13490 333663 -51104 370114 240270 87596 270636 115303 273493 -73798 237769 398054
13480 398054 413410 271589 31589 19319 131790 35168 158660 511351 356174 374810
13470 374810 140077 558975 314688 491074 238969 293025 137008 314565 457074 88052
13459F38705k41306G2763J58907r7290L07059A35916A4832L91990j11434K3461
13449C18849A03350Q663a0208E63860o3913B09232D6480L98061P0932j65231E9107
13437A53366M46379A07623J92192k1833o1327J20830H6108a39334B62419J09891
13427C72310n8260j49442a6878H1902K91743O565k369j27042a4408C34715A40399
13415B62994J60426A85923j9118n8364j3557K94148i901B30462R8019o2879f3734
13403C83545A1998M2838R2221J57042a70410A39606J47937n1554a10290B81144
13392A89074D1459n582O3337J7332K6393J24673A6209K56659q0987M10328A58517
13380B50044H6666J03410J73317j26352i63A41492J72619J80215m9049A91512
$$ plain form
13459 638705 397399 72763 231670 134380 441439 135916 14832 406822 295388 318849
13449 318849 103350 112013 -10208 563860 499947 209232 46480 444541 515473 350242 59107
13437 153366 599745 107623 299815 277982 216655 337485 86108 -139334 262419 372310
13427 372310 314050 164608 -16878 81902 373645 380210 377841 250799 -14408 334715 140399
13415 262994 423420 185923 166805 108441 94884 389032 -9901 230462 328481 265602 -63734
13403 383545 11998 54836 147057 304099 -170410 139606 287543 235989 -110290 281144
13392 189074 41459 35877 99214 116546 142939 267612 16209 272868 191881 602209 158517
13380 250044 86666 190076 363393 237041 -963 141492 314111 494326 445277 191512
13369D60545n4249j72171l3342J8206L31349A86909a47013B80833B5606O4020
13359H9626Q1943O1870L52168j66598A22465L76212H0023N6654J30736A09620
13348A52877K58013b11322A12916R3300r3228a05999C47763A59985o730p0761
13338H2494K20000r8313K7641p8417C3979L42454A66768B2688N91443j60203A74493
13326C15562J34154k0683P4172A44898K92157j37162Q636G5856J16372L01588
13316D93816I0830M38742A89495p8885Q2219q3197j8004J50557N20988a64362
13305D36910A19448L39766k25638K5777K02199j75422r2013J99572j11675k1052
13295B60962N1005J42431j79814j37096K70113j80148J94965D1860M3329J77305
$$ plain form
13369 460545 406296 234125 200783 218989 550338 186909 -147013 280833 25606 89626
13359 89626 171569 233439 585607 419009 122465 498677 80023 136677 267413 109620
13348 152877 410890 -211322 112916 206216 112988 -105999 347763 159985 153255 82494
13338 82494 302494 204181 231822 153405 33979 376433 166768 22688 614131 453928 174493
13326 315562 449716 429033 503205 144898 437055 299893 308529 75856 192228 493816
13316 493816 90830 529572 189495 110610 192829 109632 91628 242185 763173 -164362
13305 436910 119448 459214 233576 259353 461552 286130 194117 393689 282014 260962
13295 260962 311967 454398 274584 137488 407601 227453 422418 41860 85189 262494
13285B62494a04986H6465i7302A46401P1969N0562C118L52105o6458j43092f2319
13273C5350J25559m1392h5544C53419M131n7689n7614N502D6490M69219b46797
13261C06503f7630B62889H0685Q7534P4469M094b23546A42410L90E7168B3822
13249A36200a03836A18300J98698B5652h906G3146a14789I3729B6773a79650B35080
13237C91465G1361J51144m4689J47981b07943A12593J05765N947q5088K6575J89490
13226C55282F4492K2551J49893A8501J13216J26865e7182F9604e5525A32289j9994
13215A12295n2103e486C6867b69013C65509A54045a10672B4362K38254J04900
13205C67516a05964C0714J52547J32731A6361d9118I1102J19978m518J49497h2264
$$ plain form
13285 262494 -104986 86465 -97302 146401 218370 268932 3118 355223 288765 145673 -62319
13273 35350 160909 119517 -85544 353419 357550 299861 242247 247749 46490 515709 -246797
13261 306503 -67630 262889 80685 168219 242688 246782 -223546 142410 142800 57168 23822
13249 136200 -103836 118300 316998 25652 -8906 73146 -114789 93729 26773 -179650 235080
13237 391465 71361 222505 177816 325797 -207943 112593 218358 224305 139217 165792 355282
13226 355282 64492 87043 236936 18501 131717 258582 -57182 69604 -55525 132289 112295
13215 112295 60192 -5486 36867 -269013 365509 154045 -110672 24362 262616 367516
13205 367516 -105964 30714 183261 315992 16361 -49118 91102 211080 206562 356059 -82264
13193A88636J38244A49032C5117J90284o7610J55J26898B3643M2098G031d1458
13181A31541b79924J28565A60470J49922d234B61304a47359A15200J07693a337
13170A76702J93787j19793d6866A38178n4553J53028H5829A6577f4700B86005
13159A43162Q7252A12417a64549q240A26706d2645B24678q3569c22597d6254B77228
13147C80129A78952b74982I367M7754j7288a33418A22485L71927B25955k4023
13137B01932k6660a89115B13897b8004H6794J80334a10629B09342N3860F6112
13126d8694A24340d7301o1369L3993G5369g3943C29825M3239i116j00153A52632
13114A25296a37081A04167J5053a71820h0953b0883B1060L0622g6848A56285J2563
$$ plain form
13193 188636 326880 149032 35117 225401 157791 157946 284844 23643 65741 7031 -41458
13181 131541 -279924 -151359 160470 310392 -4234 261304 -147359 115200 222893 -1337
13170 176702 370489 250696 -46866 138178 83625 236653 85829 16577 -64700 286005
13159 143162 230414 112417 -164549 -172789 126706 -42645 224678 141109 -322597 -46254 277228
13147 380129 178952 -274982 9367 57121 39833 -133418 122485 494412 225955 201932
13137 201932 175272 -189115 213897 -28004 86794 267128 -110629 209342 263202 66112
13126 -48694 124340 -47301 -108670 -74677 75369 -73943 329825 373064 -9116 -109269 152632
13114 125296 -137081 104167 119220 -171820 -80953 -20883 21060 51682 -76848 156285 168848
13103A68848J09032r5456e9288k7117A26854b34064f8431k8978B74441q5884e5886
13091H3631c2028n8478B76596c1720B38777N9819Q73q8281G4266b20484C27666
13079b98484e896G8723O3297N9654J93625A18931c1909I27N62889i4474A20603
13067G7137J53614q1895a82041B94317J01599b5199I0862K12055l4877b42861
13056a0073B02275e3026C8515c27524A28080r442a58343B11605M7753P344K16363
13045D83065D5508J31820k7646J25769b11122B75842C1349P9688e773H919L64026
13034C72945g122A40425a25159B75963R791a9862A11431J33099j18221b0685B29807
13022B13394e581A27470J22475J01472F3631m279L49875a36906N8062j43148A01720
$$ plain form
13103 168848 277880 182424 -59288 -86405 126854 -234064 -68431 -97409 274441 188557 -55886
13091 83631 -32028 -90506 276596 -31720 238777 298596 299469 211188 74266 -220484 327666
13079 -298484 -5896 78723 142020 201674 395299 118931 -31909 927 563816 -94474 120603
13067 77137 230751 148856 -182041 294317 395916 -25199 90862 302917 268040 -242861
13056 -10073 202275 -53026 38515 -327524 128080 118638 -158343 211605 259358 266702 483065
13045 483065 45508 177328 149682 275451 -211122 275842 31349 111037 -5773 8919 372945
13034 372945 -7122 140425 -125159 275963 285754 -19862 111431 244530 126309 -20685 229807
13022 213394 -5581 127470 249945 351417 63631 59352 409227 -136906 -78844 -221992 101720
13010H931M96153G7062L03262J82040c2620G8572J62028K5718K5279J87061B1622
12998a32052A21446C8798K573L30728j78579c1930A12461O2284g0328C08563D6518
12986D38768B1814Q7923K17344j44164i7955e907k33192A96083b83716C87463
12975a71130P4141A8939M9401a43905A86801F2378L5174r258K53400c1306j58606
12964a89912A15827A6466K03005C7418b47624I6398i0333A61805a75235C47049
12953c66870f3705A4409R052O7357M5096l0013f2473A43089K2764K4286o0870
12942A29269a74040A98783i1649C38205A51603K10719D6784e1457p798A64885
12931f6597o7491q7610f1891H7808J00399B1618N6243a41880p0325B94351h8061
$$ plain form
13010 8931 505084 77062 380324 562364 -32620 78572 240600 266318 291597 478658 21622
12998 -132052 121446 38798 41371 372099 193520 -31930 112461 174745 -70328 308563 46518
12986 438768 21814 109737 327081 182917 -97955 -5907 -239099 196083 -283716 387463
12975 -171130 -96989 18939 68340 -143905 186801 62378 97552 88294 341694 -31306 -189912
12964 -189912 115827 16466 219471 37418 -247624 96398 -90333 161805 -175235 347049
12953 -366870 -63705 14409 23461 90818 135914 105901 -62473 143089 165853 190139 129269
12942 129269 -174040 198783 -91649 338205 151603 362322 46784 -51457 -59255 164885
12931 -66597 -134088 -221698 -61891 87808 188207 21618 77861 -141880 -212205 294351 -88061
12919I1504d2761F5188J15085R8211a4078k77202h652B54212K46577j59146g8986
12907B19206m8667e858l18795C318a8472D985a38365j9766A34914d6660A32597
12895C19230b88908J42338J6281j60034A33128L059d6761h029A10678b50401J23013
12884a27388l04864d1058J9143A12203m0315J62164c2252o3226o5883a6596j5728
12873c2324A9885a25083C4493M9475a59405A01925J67018J05316H8131J89123
12863B77254D2646K61858A8463F588P2805p21L58223d2761J1339F3223R6287a58167
12850b1278p3258C98936m7170A01296N5651a60028C5966J43414h3935B25330A5844
12838b01388A07870K3793k4025a05360L067C3332L01998J810A50155j3794j9517
$$ plain form
12919 91504 -42761 65188 180273 278484 -14078 -291280 -8652 254212 500789 341643 -78986
12907 219206 170539 -5858 -324653 3318 -18472 4985 -138365 -158131 134914 -46660 132597
12895 319230 -288908 -146570 -130289 -290323 133128 136187 -46761 -8029 110678 -250401 -127388
12884 -127388 -432252 -41058 -21915 112203 71888 234052 -32252 -95478 -161361 -16596 -32324
12873 -32324 19885 -125083 34493 83968 -159405 101925 268943 374259 88131 277254
12863 277254 42646 304504 18463 6588 79393 78672 436895 -42761 -31422 63223 159510 -158167
12850 -21278 -94536 398936 351766 101296 156947 -160028 35966 179380 -83935 225330 15844
12838 -201388 107870 131663 107638 -105360 -102293 33332 335330 337140 150155 136361 116844
12827A16844h0500b1542A572J54809b77091J19589f6895A84193a94401B38354
12816A70402h6646c1446A82131G3051j5394h6722E0654N42278A96574d57789A4688
12804B03931c2305B06077p9543a13670A44194O0517a61714A226Q8838J72113F2967
12792B98456e7032C0902Q2465J434e4981j96108a01032q7684R2162G6856c5243
12780C5438d754G379e5916A20951e3241k86267f0081A33933B0822a94779C17970
12768d1614m62q3081G7484a33248a9156j13297J8872A44379J81370b73567A06319
12756i9052j32384a9519A46209p430C929b10927b3110E8470A340i3044A33127
12744B70580G5376h9523k61841A40101Q4043r2976O0589a39655D326N9677d4048
$$ plain form
12827 116844 -80500 -21542 1572 156381 -277091 -157502 -66895 184193 -194401 238354
12816 170402 -86646 -31446 182131 73051 57657 -86722 50654 592932 196574 -457789 14688
12804 203931 -32305 206077 126534 -113670 144194 204711 -161714 1226 90064 262177 62967
12792 298456 -57032 30902 113367 114801 -54981 -251089 -101032 -188716 -96554 76856 -35243
12780 35438 -4754 7379 -55916 120951 -53241 -339508 -60081 133933 20822 -194779 317970
12768 -41614 -42076 -125157 77484 -133248 -19156 -132453 -113581 144379 325749 -273567 106319
12756 -99052 -231436 -19519 146209 138779 3929 -210927 -23110 58470 1340 -93044 133127
12744 270580 75376 -89523 -351364 140101 224144 131168 191757 -139655 4326 64003 -44048
12732I564L2783M2779c00421A78053a74553B5817e4260A35486f7263A31327b39878
12720b49659H8143i1447H9062J22990q9191a5794A69744p5N2971q8020Q421R8411
12708B41452F6719a23616O0700b7559r217j90764B51398c70580A07029K6048A0852
12696G0619b6175B36576K47094j66783j1264A26367m8847N5631J84214J12270
12686D29635i1160A24463R1025a02361A09799M9991m8726a4880B68221O9065I8149
12674F1960f4159h057A77045J41559a13191j43220H2098M6627b83333a467k38249
12663b39716A60504B0340L62085j8220A6676f5802F100K8380a09797B25036c2295
12651C6940c0535j73754B17740j6528a23726B7339R8216J4747A4487K87256O5050
$$ plain form
12732 9564 42347 85126 -300421 178053 -174553 25817 -54260 135486 -67263 131327 -239878
12720 -249659 88143 -91447 89062 212052 122861 -15794 169744 169669 222640 134620 143041 241452
12708 241452 66719 -123616 -62916 -27559 -36776 -227540 251398 -370580 107029 133077 10852
12696 70619 -26175 236576 483670 316887 305623 126367 77520 133151 317365 429635
12686 429635 -91160 124463 215488 -102361 109799 159790 111064 -14880 268221 337286 98149
12674 61960 -64159 -8057 177045 318604 -113191 -256411 82098 128725 -283333 -1467 -239716
12663 -239716 160504 20340 382425 364205 16676 -65802 6100 34480 -109797 225036 -32295
12651 36940 -30535 -204289 217740 201212 -123726 27339 125555 140302 14487 301743 366793
12640C66793C3193a03678G6767K31163M6300A60706h398c645j69781A22367J5226
12629A37593c94G2916b31414A89029K22863A24358E9175k1929Q9100C1187f2480
12617b81210A41050I994J05227J34664m3429r3599J1513a08173G5615L6722B3417
12605A41340h815r6183G8503P6768m4951R8034a71311B63618b37470g2872l9115
12594a11987A55047k2433A3111K52728Q7639b68842A69400b64720O7748M3171
12584a53801H5539J68269D3618M4728a36991A30971N9553c2990A12513b5190l05505
12573c30695A39569J34212g9839C06434c31474D83207a08029K5613I519K43906
12563B53425F8695c8693p1521A38916R8915g2780j24494A69779a7212B44098C3915
$$ plain form
12640 366793 33193 -103678 76767 307930 354230 160706 -8398 -3645 -173426 122367 137593
12629 137593 -394 72916 -231414 189029 411892 124358 59175 37246 126346 31187 -62480
12617 -281210 141050 9994 115221 249885 206456 112857 124370 -108173 75615 112337 23417
12605 141340 -8815 -104998 78503 155271 110320 208354 -171311 263618 -237470 -72872 -111987
12594 -111987 155047 132614 13111 265839 353478 -268842 169400 -264720 -196972 -153801
12584 -153801 85539 253808 43618 88346 -136991 130971 190524 -32990 112513 -25190 -330695
12573 -330695 139569 273781 -79839 306434 -331474 483207 -108029 -82416 9519 253425
12563 253425 68695 -38693 -110214 138916 237831 -72780 -197274 169779 -17212 244098 33915
12551H5292K5451l3778e1459m1049B7856J4494e4941h149A69912a23286K5757
12540i7529n9034I4467e0992l9556j09454E0580J83787q2401b9320k00388B26307
12528A85133A4361b7316j157q3967I654d18476D5559C443a81883j5145A28263
12516H8405J73713q6918b01335B35018G5659f9675B3927J27188e0088E6235b57222
12504C87276a04952L1142j94448A75093d3193B8655Q1623a7038C5107a45057A63700
12492B57396H7784K7668e8178a9094j22383B05096G1012A5809M5053a96847L0740
12481a66107A10g4473b0663m792j53653A3601b8790r6193E865a1284A16121b80088
12468a33193a9982j2161H0400K3611M7612L46161j92800a88117a8356B71744c89783
$$ plain form
12551 85292 110743 76965 -51459 -92508 27856 42350 -54941 -8149 169912 -123286 -97529
12540 -97529 -156563 94467 -50992 -90548 -200002 50580 234367 151966 -29320 -229708 226307
12528 185133 14361 -27316 -28473 -112440 9654 -418476 45559 3443 -181883 -197028 128263
12516 88405 262118 175200 -201335 235018 75659 -69675 23927 151115 -50088 56235 -257222
12504 387276 -104952 -73810 -268258 175093 -43193 28655 110278 -17038 35107 -145057 163700
12492 257396 87784 115452 -58178 -19094 -141477 205096 71012 15809 60862 -196847 -166107
12481 -166107 110 -74473 -20663 -25455 -179108 13601 -28790 -124983 5865 -11284 116121 -280088
12468 -133193 -19982 -32143 80400 104011 151623 497784 304984 -188117 -18356 271744 -389783
12456A26652f6659B32840h8155p7186B20641r5156B9747a65701f2764q8695A22306
12444A92336n6123l4365c4225l9354q2399J3215E4886b6078k01429A33490c01308
12432A37361a08004C862a65921A69625i7197e993A08308c705H041k246a75993
12420a16606e1724b4447o3147A78168i751j10741A777b4751j33346A97550B2989
12408F4427e2941a9205B96c4587F6107b45298f4333j23490A39794f8496H3299
12396E1814a09468G7310a8867B97719g2824j6695L1312j33382h3389D95429b51513
12384a92938a8525j28399C3223a91370A53326a93213B2415a74912A1018J13104
12374A24122B9734a09432r4743D5631R8997Q7394c2133j11581c8836k3177l5174
$$ plain form
12456 126652 -66659 232840 -88155 -165341 220641 125485 29747 -165701 -62764 -151459 122306
12444 192336 136213 101848 -34225 -73579 -155978 -142763 54886 -26078 -227507 133490 -301308
12432 137361 -108004 3862 -165921 169625 -97197 -5993 108308 -3705 8041 5795 -175993
12420 -116606 -51724 -24447 -87594 178168 -9751 -120492 1777 -24751 -158097 197550 22989
12408 64427 -52941 -19205 296 -34587 66107 -245298 -64333 -187823 139794 -68496 83299
12396 51814 -109468 77310 -18867 297719 -72824 -89519 -58207 -191589 -83389 495429 -251513
12384 -192938 -18525 -146924 33223 -191370 153326 -193213 22415 -174912 11018 124122
12374 124122 29734 -109432 -204175 45631 144628 232022 -32133 -143714 -38836 -62013 -97187
12363i7187n6626K3227E3209b09418b5557A07729C447b11988B80201a61753a2418
12351A27211c7834q3469A22524b3474A60346a77407n4292J04630A90242g8378
12340a30765l1624R683C7259J25184e8053a2549A13088h279r0268I6575A7741
12328b6507f882j40412d6342F5754f1836A9983a67425r7207C2518K6360A1711
12316D0238J4630i0701C954a36573H5105B514J58283c73999a39417F910Q6050
12305I2960J17412e5465j76491e543j67778a0675j3990A0718b16572f5838l5155
12294a00993M3713B64085c1396A52987D933R2624a1920o1349C67654C6500R6736
12283A33236c6261D6155a03147a8956B9066f4067A26843e6566B45114F3625J73978
$$ plain form
12363 -97187 -153813 -130586 53209 -209418 -25557 107729 3447 -211988 280201 -161753 -12418
12351 127211 -37834 -121303 122524 -23474 160346 -177407 -231699 -127069 190242 -78378
12340 -130765 -162389 -152706 37259 162443 -58053 -12549 113088 -8279 -98547 96575 17741
12328 -26507 -6882 -147294 -46342 65754 -61836 19983 -167425 -264632 32518 58878 11711
12316 40238 54868 -90701 3954 -136573 85105 2514 160797 -373999 -139417 6910 92960
12305 92960 210372 -55465 -231956 -5543 -173321 -10675 -24665 10718 -216572 -65838 -100993
12294 -100993 -57280 264085 -31396 152987 4933 97557 -11920 -73269 367654 36500 133236
12283 133236 -36261 46155 -103147 -18956 29066 -64067 126843 -56566 245114 63625 237603
12272B37603A7882J6462r339L4165R0582g44B63154E9307f9983C04467D4462K05464
12260B49926j0725E1684e9156D9912J23361F5152J33809a10902A4359L05806b08585
12248C8838K99896A35780a80643b8657j2637A2592O3835a74435B93206i6965D6834
12236i3960c766B1138e4158q5480E06570A3271J98377c5328B89627I5231J04643
12225A99874K11143f2799A76379q0958G383J71000b96808B9058P6009g0688D4968
12213a32586b9624A03348g3972B91147Q142J87659A79417J4866c26850B97469
12202A61068a65668A87288a75588G4049K94762A04425A8371J37281D1738J79478
12192B21216J14533m075L6376r7767K35026a96657H4638Q9115J23524N4516C6651
$$ plain form
12272 237603 17882 34344 25005 59170 149752 -744 263154 59307 -69983 304467 44462 249926
12260 249926 239201 51684 -59156 49912 173273 65152 198961 -110902 14359 320165 -208585
12248 38838 338734 135780 -180643 -28657 -41294 12592 76427 -174435 293206 -96965 46834
12236 -93960 -3766 21138 -54158 -139638 506570 13271 211648 -35328 289627 95231 199874
12225 199874 411017 -62799 176379 95421 7383 178383 -296808 29058 105067 -70688 44968
12213 -132586 -29624 103348 -73972 291147 299289 486948 179417 194283 -326850 297469
12202 161068 -165668 187288 -175588 74049 368811 104425 18371 155652 41738 221216
12192 221216 335749 331674 368050 270283 505309 -196657 84638 173753 297277 351793 36651
12180A22504L00700K9297a6319C75053F6807M23977j86139C5859K40778K55940
12170E32577B46136a41855C82168H1858O6957G765e3224B83013j08107H1427K93690
12159C75117j38616q5324J83830j10286Q7328A36874b31730B59712o7794m2202
12149A49716J38006J36586E1010L25186n3400A47314O434a55817c1815E9247A8109
12137A9051K39568a93548F7679K20773c1765B49331a25238M332q0679f8736B71857
12125g7791A34891D6787b3732A08509c71086I6515a24142j3888A34723o1330h6211
12113b53012g3001A7434a17875e3073b5240p5588k99260A24853K1803B6548L6065
12102F2613b26156J180C8677a146A82158A335J56495F0148e2393A51969h2713
$$ plain form
12180 122504 423204 452501 -16319 375053 66807 490784 304645 35859 276637 532577
12170 532577 246136 -141855 382168 81858 148815 7765 -53224 283013 174906 81427 375117
12159 375117 236501 151177 335007 224721 312049 136874 -231730 259712 191918 149716
12149 149716 287722 424308 51010 376196 322796 147314 153748 -155817 -31815 59247 18109
12137 19051 258619 -193548 67679 288452 -31765 249331 -125238 -120906 -201585 -68736 271857
12125 -77791 134891 46787 -23732 108509 -371086 96515 -124142 -138030 134723 73393 -86211
12113 -253012 -73001 17434 -117875 -53073 -25240 -100828 -400088 124853 146656 26548 62613
12102 62613 -226156 -224976 38677 -1146 182158 1335 157830 60148 -52393 151969 -82713
12090A04374b49982o6974J05110A209J05607M2660a14932r9681Q9407C39445I7649
12078a63568a2462C7304i6512B47708L2636c1757A47957J42371D7560Q8970I495
12066B25797C0998a00255j70285N8811B82813A4569a55174C5509a74653D38221
12055E6594k4827J30725O3013K5985F9859A5726a5269B0284J73756d1514a4726
12043a84721Q1474G4483a37516A01510J72721j17645h5550B69387c17770B69159
12032a05091E0603h7757n8489j77231E9119b92658J39606j66132f1406j10581
12022a71987k36595E31708A32280A1140J23581b22391H4658b9910A36841g5367
12011A48433R9323F7559a1956C45026q7201m7b30667G2158J49840o8964c5685
$$ plain form
12090 104374 -249982 -316956 -211846 1209 106816 149476 -114932 -214613 -125206 339445 97649
12078 -163568 -12462 37304 -96512 247708 280344 -31757 147957 290328 47560 136530 9495
12066 225797 30998 -100255 -270540 -211729 282813 14569 -155174 35509 -174653 438221
12055 56594 31767 162492 225505 251490 69859 15726 -15269 20284 194040 -41514 -14726
12043 -184721 -103247 74483 -137516 101510 274231 156586 -85550 269387 -317770 269159
12032 -105091 50603 -87757 -146246 -323477 59119 -292658 -153052 -319184 -61406 -171987
12022 -171987 -408582 531708 132280 11140 134721 -222391 84658 -29910 136841 -75367
12011 148433 247756 67559 -11956 345026 257825 257778 -230667 72158 221998 153034 -35685
11999b39612d9784I1998b05087B80698c25616j6180b9577J1120q7164D3482a32556
11987c1068E2566J3859L1656a36182E8739a14541a4230o1976l0415M16i899k00422
11975b10321b2059j49235e7608o6830b0286p7926A0000J28353a09640k7220k4281
11964a61141A19187d31024g6393l0292o2233r6015B39645c44420h6072A12663
11953E9372K25303g902B7555c6817j09649N5285L6648A03082C5223J46831o0432
11942A21622c26666A4403M7874i0304j03158Q5985E3454O4053H520b60854F8068
11930d3959j43851C66528f5883G8110b31039A05932g9986n0556A80357g5192E7985
11918b17691a01852c1026D6621i5407d6618K3015A80823k0337l4824d4292r9993
$$ plain form
11999 -239612 -49784 91998 -205087 280698 -325616 -341796 -29577 -18457 -105621 43482 -132556
11987 -31068 52566 66425 98081 -136182 58739 -114541 -14230 -76206 -106621 -106205 -9899 -210321
11975 -210321 -22059 -171294 -57608 -124438 -20286 -98212 10000 138353 -109640 -136860 -161141
11964 -161141 119187 -431024 -76393 -106685 -168918 -264933 239645 -344420 -86072 112663
11953 59372 284675 -7902 27555 -36817 -146466 -91181 -54533 103082 35223 182054 121622
11942 121622 -326666 14403 62277 -90304 -193462 -107477 53454 117507 8520 -260854 68068
11930 -43959 -187810 366528 -65883 78110 -231039 105932 -79986 -130542 180357 -75192 57985
11918 -217691 -101852 -31026 46621 -95407 -46618 -23603 180823 160486 125662 -44292 -144285
11907a44285C5391Q4524J65231c0690E1009a31027B65503a64723A18704a27651
11896a7765A38345f9523l4698r5328G7751R5523L5404a58269C30621c7509j38693
11885a76202j69777e4351d668k30993n3413e0632A82157k7730D3837K3381O6327
11874A33545J03101J12786j53424a31652E9888g1806G1346K8811c347G9322J47424
11863B26746C6391i4835B60670b96550F2456j589p286a19149M0753k52285E9800
11851c13418J21988N680A12806a91906D0241L37158A75132a61419A33227r580
11841A23647a35140p9718i7597M7640n5620d3657C1171K1879J3245i8653j11170
11830b09823O7627b9067A0382e4899B8849p450J32949A6630a00797l2068C5557
$$ plain form
11907 -144285 35391 119915 285146 -30690 51009 -131027 265503 -164723 118704 -127651
11896 -17765 138345 -69523 -104221 -199549 77751 173274 208678 -158269 330621 -37509 -176202
11885 -176202 -345979 -54351 -4668 -235661 -289074 -50632 182157 154427 43837 67218 133545
11874 133545 236646 349432 196008 -131652 59888 -71806 71346 100157 -3347 79322 226746
11863 226746 36391 -94835 260670 -296550 62456 60867 53581 -119149 -78396 -330681 59800
11851 -313418 -191430 -185750 112806 -191906 40241 377399 175132 -161419 133227 123647
11841 123647 -135140 -214858 -97597 -49957 -105577 -43657 31171 53050 66295 -98653 -209823
11830 -209823 -142196 -29067 10382 -54899 28849 21399 154348 16630 -100797 -132865 35557
11818b0175k46073Q1570c2206j5757B5050J1469a44952A95857q6976j6316R3596
11807A86161a04642D0908a55096L8065j02571C5032b34393A84920N287J76343
11797C66550f8028o2634C76048j70481g7456A7533d4407j74398O6156K3476C64885
11785E8454b79415B67931A8200K0693k900b2864A27194M0950b10902g1893N685
11774f6208G4647a42610J1154c5005I6388a03353B43330b27626B1842b48929R2129
11763a56800A38299c8366J3022H4788a51916n1210A7520a97619R1259q6455L2720
11752a60095r3532a21021A41152J1907J73743c81260B05993a14141A1817J01602
11742A13419a59093A5568J54499C6922h0306a6226G7841a9017l58806f3465n6254
$$ plain form
11818 -20175 -266248 -184678 -32206 -47963 25050 36519 -144952 195857 108881 92565 186161
11807 186161 -104642 40908 -155096 -117031 -219602 35032 -234393 184920 190207 366550
11797 366550 -68028 -130662 376048 205567 -77456 17533 -44407 -218805 -152649 -129173 364885
11785 58454 -279415 267931 18200 38893 35993 -22864 127194 168144 -210902 -71893 -66208
11774 -66208 74647 -142610 -131456 -35005 96388 -103353 243330 -227626 21842 -248929 -156800
11763 -156800 138299 -38366 -25344 84788 -151916 -203126 17520 -197619 -106360 -192815 -160095
11752 -160095 -253627 -121021 141152 153059 326802 -381260 205993 -114141 11817 113419
11742 113419 -159093 15568 170067 36922 -80306 -16226 77841 -19017 -377823 -63465 -119719
11731a19719n9065f6189j37018j71460B9048a22486E5034a69392C9099a97847
11720h1322c6512g595A6698l70F639P8201J10421c1051A13814a6281j10121D0682
11707a52407L8864B49738G8647J1512J401g269B94754b3948C39053A3914K15255
11696B29169a96252A65131a27875M434j15596D2744J3815J29429a81384l9527
11686b20911a00771c3329D8278b1459A22196O354J1899F2848a59671A28508i2713
11674i3269A52311b13468B34033p2058O1505d3534k15786A18935b4436I3878K56055
11663C49933d4892J7210A65005f1111B21522o2534l1348O4390F7403b5935A41358
11651A43647b39224B03663G7260a14808c4572B24052q0656i9766m4053b3929j67760
$$ plain form
11731 -119719 -178784 -66189 -203207 -374667 29048 -122486 55034 -169392 39099 -197847
11720 -81322 -36512 -7595 16698 16328 6639 84840 195261 -31051 113814 -16281 -126402 40682
11707 -152407 -113543 249738 78647 90159 91560 -7269 294754 -23948 339053 13914 229169
11696 229169 -196252 165131 -127875 -123441 -239037 42744 56559 185988 -181384 -220911
11686 -220911 -100771 -33329 48278 -21459 122196 128550 140449 62848 -159671 128508 -92713
11674 -93269 152311 -213468 234033 161975 223480 -43534 -259320 118935 -24436 93878 349933
11663 349933 -44892 -27682 165005 -61111 221522 158988 127640 192030 67403 -25935 141358
11651 143647 -239224 203663 77260 -114808 -34572 224052 143396 -99766 -143819 -23929 -191689
11640a91689R801A16264c2222C98580a35176e3603G7943M776j8994i4700j3770
11629a08470A96301k6616a24110A21983N1340h7368h353E6052a06116N2398E0331
11617C74749A13202a47757a48j32927C7352L3113K23538l8237K3664j26175i4095
11605F9298K8187N5120n1325e5499D556N3127J17872q4562b59219A43466A1396
11593D8531J07917a3153j61832F5935O3291O6317K7459F0716a43121B19054d2670
11581B27086M5013a8680A24169J82023j41198g6347B64369B6238L2912J12569
11571A71719a52698G2210j5903a22503B70722a32525M599B3545a47651B19737
11560C55974n5373a05546E1531d7877n6098B99041A0170J2553R0912N2233E1862
$$ plain form
11640 -191689 -181888 116264 -32222 398580 -135176 -53603 77943 82719 63725 -94700 -108470
11629 -108470 196301 169685 -124110 121983 173323 -87368 -8353 56052 -106116 -53718 50331
11617 374749 113202 -147757 -148 -133075 37352 70465 294003 255766 279430 153255 -94095
11605 69298 97485 152605 101280 -55499 4556 57683 175555 90993 -259219 143466 11396
11593 48531 156448 -13153 -174985 65935 129226 195543 223002 60716 -143121 219054 -42670
11581 227086 272099 -18680 124169 306192 164994 -76347 264369 26238 59150 171719
11571 171719 -152698 72210 56307 -122503 270722 -132525 -127926 23545 -147651 219737
11560 355974 300601 -105546 51531 -47877 -103975 299041 10170 22723 113635 165868 51862
11548A40141a43746F6692K34923a41926l5334E588b5779o3568A01427b6225A41701
11536B39485F3486b00238Q5285B53699r5246b7539B1057b28204C08287j2442F256
11524E0064o568A3584N04694a09811d6097C08435L429F4265J9163J11153A549
11512i8985A80625m136O7040B2314b61364h1761C82057o7464a34087j95676B27953
11500B56410I129K04697a2177j02109C40424l5519F4903c5482C98253j75887p9475
11489A42891o2056a28186B84353a4028p4999r555B80139b57639A25195M8840K91139
11478D65174A9195a16508F27854C5931M9217a00542A09467M8135p1047L4210i4447
11466A73036F4630i7645B02371Q3979k0554B093J19905a94585R6080D10702I7218
$$ plain form
11548 140141 -143746 66692 301615 -141926 -177260 5588 -25779 -89347 101427 -26225 141701
11536 239485 63486 -200238 -114953 253699 158453 -27539 21057 -228204 308287 295845 6256
11524 50064 43496 13584 518278 -109811 -46097 308435 311864 64265 83428 194581 1549
11512 -98985 180625 176489 243529 22314 -261364 -81761 382057 314593 -134087 -329763 227953
11500 256410 9129 213826 -12177 -114286 340424 304905 64903 -35482 398253 222366 142891
11489 142891 80835 -128186 284353 -14028 -89027 -98582 280139 -257639 125195 174035 465174
11478 465174 19195 -116508 627854 35931 85148 -100542 109467 157602 86555 120765 -94447
11466 173036 64630 -97645 202371 286350 265796 2093 121998 -194585 -98505 410702 97218
11454C51132G4694J52460j09975a56854C91865A88910m0622g0257I0474K06975
11444B97449F9689J35046J75525a41036K5232A43684b20058J06206D8139c1113
11433E0976R4449J50129h267A51505k7886b40733j82842a1612j5256H8923J33466
11422B22389b38225a08747B17486b505k1140k90372F636e5449k18473A11396D2766
11410H3336d0245J8995A70160F5413i0891D83098g3072P776C9603A9575c17088
11398c73914A32128E5107c8895A41845b53988H0203i2645A81958C0670J49199
11388A79869i7347B03872P0570m3204C7544a01227k65014a6554A83682C2009b71714
11376a90881e2535A62458M6484b09042D9864a35956d7497A82735o4208n4629A0764
$$ plain form
11454 351132 74694 227154 117179 -156854 391865 188910 148288 -70257 90474 297449
11444 297449 69689 204735 380260 -141036 -115804 143684 -220058 -113852 48139 -31113
11433 50976 145425 295554 -8267 151505 123619 -240733 -423575 -11612 -26868 88923 222389
11422 222389 -238225 -108747 217486 -2505 -23645 -314017 6636 -55449 -273922 111396 42766
11410 83336 -40245 -21250 170160 65413 -90891 483098 -73072 -65296 39603 19575 -317088
11398 -373914 132128 55107 -38895 141845 -253988 80203 -92645 181958 30670 179869
11388 179869 -97347 203872 274442 231238 37544 -101227 -366241 -16554 183682 32009 -271714
11376 -190881 -52535 162458 208942 -209042 49864 -135956 -47497 182735 118527 63898 10764
11364B27943A1553K2033J25464P2147c80981A29762n6602a74790P2209E6087P6566
11353A32653b53068g2996R189j60329j16013B76649a54678D57056c6435j2124
11343d8559j8869n2306A85392a43101c5754j2279n3555p6785h4219g899k40528
11332b48427j5352P5954d4402G8743a06727k3780I4674d32278B83163a61889b6595
11320B4779L37475A59345b39572B38512R2712E915a5527l08059E6907K07546F1335
11308A19064A0895a63445A4961J16687a78574k69561B30435a18166M3280B90551
11297D2969R0995C9598M6015a14211k29901E3014h781k975j57592q0356j20743
11286c70447d1815j18054R629A55090a39481C20639a65790d3271j11271j23265
$$ plain form
11364 227943 11553 33586 159050 231197 -380981 129762 73160 -174790 -102581 56087 132653
11353 132653 -253068 -72996 -63807 -224136 -340149 276649 -154678 457056 -36435 -48559
11343 -48559 -67428 -119734 185392 -143101 -35754 -48033 -101588 -178373 -84219 -7899 -248427
11332 -248427 -263779 -187825 -44402 78743 -106727 -130507 94674 -432278 283163 -161889 -26595
11320 24779 362254 159345 -239572 238512 331224 5915 -15527 -323586 56907 264453 61335
11308 119064 10895 -163445 14961 131648 -178574 -448135 230435 -118166 -74886 290551
11297 42969 133964 39598 85613 -114211 -344112 53014 -8781 -11756 -169348 -249704 -370447
11286 -370447 -41815 -159869 -150240 155090 -139481 320639 -165790 -43271 -154542 -277807
11276b77807D1182N0195A3123L1a10952l2820I1244a79006Q0054r8204i4293j78171
11264b72464B86073f1726q9866k54766H1364a94133A59623b47750i2398l880G6435
11252a90110g3231j9884D3808b63478i1278B21687n7969I077K18556C9364J05159
11241A44523L5222f1452k1287G8741b8321o8089B48127r3845f639o6657j35343
11230b08639A13530a00485M9862B6061h0986E2825f4158a4120j49326j708H3792
11218D8381R8340a4124C34683a74532F9277b66105a06194d8760I5699d55079a72802
11206c58998A50634a17836A59084e460A92657a84201E7192J48224o0619a68376
11195a73397O9503e783A90504B0752d1516n8644A97615D7173P3570b32549k4750
$$ plain form
11276 -277807 41182 91377 13123 13154 -110952 -143772 91244 -179006 -98952 -197156 -94293 -272464
11264 -272464 286073 -61726 -151592 -406358 81364 -194133 159623 -247750 -92398 -96278 76435
11252 -190110 -73231 -93115 43808 -263478 -91278 221687 163718 9077 227633 39364 144523
11241 144523 179745 -61452 -82739 78741 -28321 -96410 248127 154282 -6639 -73296 -208639
11230 -208639 113530 -100485 -50623 26061 -80986 52825 -64158 -14120 -163446 -165154 83792
11218 48381 146721 -14124 334683 -174532 69277 -266105 -106194 -48760 95699 -455079 -172802
11206 -358998 150634 -117836 159084 -5460 192657 -184201 57192 205416 144797 -168376
11195 -173397 -103894 -5783 190504 20752 -41516 -100160 197615 47173 120743 -232549 -257299
11184b57299J19319A41204k0559a71361a9671B10116h985l26299a01872E0896
11173h417p1774A87890I3374D4821I410R9544b55383O7430A30880a88732B22612
11161c05559g286j61076A21306A4410h767j49364j40029f1104F3590b59552B2583
11149A652a97289A54036k7607k5214b05890b3632A03828L27K33906c69952E0764
11137a99443c1952l44487A12988M299F670c23391l2748B56795h7752I0126h7586
11125a70950A22845o339a41357j15454A82041a70177A36775D4333O1908a583C2724
11113H5651O1353g6610E6233R3507M0846B0409J54524R7200e4685D212J21134
11102A25346L57771A04333A9931h901j05737C83694a34761d4404C4007J2834K51025
$$ plain form
11184 -257299 -137980 141204 120645 -171361 -19671 210116 -8985 -335284 -101872 50896
11173 -8417 -80191 187890 93374 44821 9410 108954 -255383 -187953 130880 -188732 222612
11161 -305559 -7286 -168362 121306 14410 -8767 -158131 -298160 -61104 63590 -259552 22583
11149 1652 -197289 154036 126429 101215 -205890 -23632 103828 104155 338061 -369952 50764
11137 -199443 -31952 -376439 112988 117287 6670 -323391 -356139 256795 -87752 90126 -87586
11125 -170950 122845 116506 -141357 -256811 182041 -170177 136775 44333 106241 -1583 32724
11113 85651 147004 -76610 56233 149740 190586 20409 174933 272133 -54685 4212 125346
11102 125346 483117 104333 19931 -8901 -114638 383694 -134761 -44404 34007 46841 297866
11091B97866D8318j4605K56854F187J66103n4396h7311C32695h8421C06090P2402
11080C78492j34413R865J4211J30128A62178l5715L29560k10273c1638A35297
11069A84129H7386J12749k6109m8274b13768A77509C0832K30528a07414B63469
11058A47075L20410f0861A62051K73331A92985j64K24541M865J76654B01692N31952
11047G33644B70623K15404l4583m954J10825j66289L08716l0662J29714j63127
11037F35667j20813K59774C41882O5195J98817M44422j29792m8290k05338n178
11027F61718n8838m1385J11045J07480q0079j64049J60892o2220P1370J74065
11017H79999l39153K15036L0355L48767l53301R7519k31010p2908N4588L01034
$$ plain form
11091 297866 48318 33713 290567 6187 172290 117894 -87311 332695 -88421 306090 378492
11080 378492 244079 253944 268155 398283 162178 126463 456023 245750 -31638 135297
11069 184129 87386 200135 174026 125752 -213768 177509 30832 261360 -107414 263469
11058 147075 467485 -60861 162051 435382 192985 192821 417362 422227 598881 201692 733644
11047 733644 270623 486027 451444 446490 557315 391026 699742 669080 798794 635667
11037 635667 514854 774628 341882 407077 605894 1050316 920524 872234 666896 661718
11027 661718 602880 561495 672540 780020 699941 535892 696784 634564 705934 879999
11017 879999 540846 755882 786237 1135004 781703 879222 648212 575304 629892 930926
11007I30926l83809K8111k4539J64872L9686J27631l04588O6112j93549Q3547
10997E34400L2832J2257K7367k88967L82432k04677P7562K76584j92007p6405
10987E81378K25861k87786K38292j46545o7756k6187j24412M65834j38675k08572
10977E11432K73695J53946l40726M07818J36148l35119L29058p17k03409J18617
10967A050743J73895l03368M04506M5252K73672J67775M13485k3759j37250M72541
10957B537492R5796k36653K54799j87576J32212j10794m58633j21747K19953l80500
10947A744349j63540L66745r3887k01726l06113L09052L115p9432k6661l52788
10937A199114P7748m45346j10975K8469C28484M5345N6673B06259J98096B02139
$$ plain form
11007 930926 547117 575228 550689 715561 755247 882878 578290 644402 450853 534400
10997 534400 567232 579489 606856 317889 700321 495644 573206 849790 657783 581378
10987 581378 807239 519453 757745 611200 543444 517257 392845 858679 720004 511432
10977 511432 785127 939073 598347 1006165 1142313 807194 1136252 1135535 932126 1050743
10967 1050743 1224638 921270 1325776 1371028 1644700 1812475 2225960 2202201 2064951 2537492
10957 2537492 2633288 2396635 2651434 2463858 2596070 2485276 2026643 1904896 2124849 1744349
10947 1744349 1580809 1947554 1853667 1651941 1345828 1654880 1657995 1578563 1551902 1199114
10937 1199114 1276862 831516 720541 749010 328484 373829 430502 206259 404355 202139
10926A8226K79728J5785J31563G8637J24055J14306A7596L69093j16314D3009
10915a1457C02462a66324a74j90741M7543O2132B90528A937a50384G8603a21724
10903c20840A50254f5086H1594a39356B49478m9727d4801n5525C34192A00026
10892H0569h2393A20620l8708J22496b21997B52088H2987a33041F6033a7080F2037
10880C7713M13233I8162b08108c47k17442P0538A96370o4676D2081b44016P4984
10869a69032A22861b37466j9852J19687J6499l4891f6671C92857c95807A59483
10858a56047D8839a64727o7616d2105A4868K75585c1548A97377a85346d8917D5600
10846b14722Q2206l58486A89608c32778F9770c2544j21717A30255e0777A5070
$$ plain form
10926 18226 297954 313739 445302 78637 202692 316998 17596 386689 270375 43009
10915 -11457 302462 -166324 -174 -190915 -143372 -81240 290528 1937 -150384 78603 -121724
10903 -320840 150254 -65086 81594 -139356 249478 199751 -44801 -100326 334192 100026
10892 80569 -82393 120620 81912 204408 -221997 252088 82987 -133041 66033 -17080 62037
10880 37713 450946 98162 -208108 -347 -217789 -147251 196370 131694 42081 -244016 -169032
10869 -169032 122861 -237466 -257318 -137631 -121132 -156023 -66671 392857 -395807 159483
10858 -156047 48839 -164727 -232343 -42105 14868 290453 -31548 197377 -185346 -48917 45600
10846 -214722 -132516 -491002 189608 -332778 69770 -32544 -154261 130255 -50777 15070
10835a39573E9567a7389G1694e28247A47300D0827h4943n8223r6964b3077A01876
10823A82661o7508K18815b01940b7321k6549p5428c4858E0792a90884H4936g2404
10811a94546C59670e9605k02002a23266a2895A85144h9850f110j3214A79772B9332
10799e9635l5466l45887J30401J42315L1176A69833H107h2551q0335K399G0660
10787b09516k19261d5234I1d7765n157B06377b89025N6892N7060K4334j69143
10776c19882L5140J41693c5965F2618b04784o0236B51631l7828l1998a26513a3354
10764c05896B2320b51642A7484J30339b25942B4036J26521i0906E4865a42477
10753B98794d62988A83408b54114j31013a8919B22614a98877J9655B8445Q6441
$$ plain form
10835 -139573 59567 -17389 71694 -528247 147300 40827 -84943 -143166 -240130 -23077 101876
10823 182661 115153 333968 -201940 -27321 -53870 -129298 -34858 50792 -190884 84936 -72404
10811 -194546 359670 -59605 -261607 -123266 -12895 185144 -89850 -6110 -19324 179772 29332
10799 -59635 -95101 -440988 -310587 -168272 -137096 169833 8107 -82551 -162886 -160487 70660
10787 -209516 -428777 -45234 91 -47765 -52922 206377 -289025 -232133 -175073 -150739 -319882
10776 -319882 -284742 -143049 -35965 62618 -204784 -265020 251631 213803 181805 -126513 -13354
10764 -305896 22320 -251642 17484 147823 -225942 24036 150557 -90906 54865 -142477
10753 298794 -462988 183408 -254114 -385127 -18919 222614 -198877 -179222 28445 114886
10743A14886c90785A26865e2334q8747n1022n5724I4004J54536k1262a04304j07331
10732b11635C5675L2097M27890j61736b24437d3171A04710c50339J42650f3610
10721G5675c47805J41058a7554C59937b92270B55032B8747L4643J6368p721i707
10709b97693I5456m0447b42720a414j8343n12009a66833A22909N5187p751g3130
10697a52927e883B18054b96866i0362D9937J74915a0969A88151b4921k74927J46628
10686a53220A50816b04171d7465k70386A27317a92000b8092k88320a8810q6848
10676a05658A05857c1092A39625a26989a4978j5736k12265A38317a40618E7991
10665A60121i1296g549j13297d2878k16939J22503C4384c8671j19206A67979J76958
$$ plain form
10743 114886 -390785 126865 -52334 -141081 -192103 -247827 94004 248540 227278 -104304 -211635
10732 -211635 35675 67772 495662 333926 -224437 -43171 104710 -350339 -207689 -63610
10721 75675 -347805 -206747 -17554 359937 -292270 255032 28747 63390 79758 72037 -9707
10709 -297693 95456 55009 -242720 -1414 -19757 -531766 -166833 122909 178096 170345 -73130
10697 -152927 -5883 218054 -296866 -90362 49937 224852 -10969 188151 -24921 -299848 -153220
10686 -153220 150816 -204171 -47465 -317851 127317 -192000 -28092 -316412 -18810 -105658
10676 -105658 105857 -31092 139625 -126989 -14978 -30714 -242979 138317 -140618 57991
10665 160121 -91296 -7549 -120846 -42878 -259817 -137314 34384 -38671 -157877 167979 344937
10654C44937a42372B58949b96081f6750B24664b03752k41169f4361M137j7368
10644g7592L1511A4201b95195G0003L7376f8726j95280J19578b6000A55321b26565
10632H8612i2650a2177p5632C48474b95474a6076m4702A95410b71137J32279j01162
10621b40020a06836B83623B6104e8802m295A5898e5284G1265J62628b01074B73500
10609F1827a94199P1579E2918d6146k8796j39827J2392B28634a26051l958F0346
10597a6454k30220F3012L0646e1934b2440j3123j81911e5667q129A60662B0958
10585d8740H7297a34773j78657A39568i1355A93464a89198F3169k5061d09456
10574a08755a6440j39725C6691b03807h5259E0615i6605J7785k06662P7585a02229
$$ plain form
10654 344937 -142372 258949 -296081 -66750 224664 -203752 -444921 -64361 -60224 -77592
10644 -77592 -46081 14201 -295195 70003 107379 -68726 -264006 -144428 -26000 155321 -226565
10632 88612 -92650 -12177 -87809 348474 -295474 -16076 -60778 195410 -271137 -138858 -240020
10621 -240020 -106836 283623 26104 -58802 -63097 15898 -55284 71265 233893 -201074 273500
10609 61827 -194199 -122620 52918 -46146 -74942 -214769 -202377 228634 -126051 -130009 60346
10597 -16454 -246674 63012 93658 -51934 -22440 -35563 -217474 -55667 -63796 160662 20958
10585 -48740 87297 -134773 -313430 139568 -91355 193464 -189198 63169 38108 -409456
10574 -108755 -16440 -156165 36691 -203807 -85259 50615 -96605 -78820 -285482 -207897 -102229
10562b24766l6478A46096a42872o5656h4963J6263o550j95620B51274H4321b78002
10550b59379a0969j10143A85378o0888k7051a24716l13623b4500J912m6102k1570
10539i0260A52558c34466G755K07162p1199a20681B54825c5055j50207B18726
10528F1130a25039j41136F3414c3727j68967e8537C3683i6043k2841G4824j1339
10517F3485a63178B97914a16385j09330B07g4749p2982n1773l46320J79390I2148
10505b45994e8208j60634J00519B1436h695l32820A27616a42851j81188C4399
10494b5936H1381b5651n14848K27379A77044N1987d4474p0297p3201b5605j74197
10483a99802E9507K9812C5685b12345R2483j01683B21850E6908J86489a72444
$$ plain form
10562 -224766 -261244 146096 -142872 -208528 -84963 -68700 -75250 -270870 251274 84321 -278002
10550 -259379 -10969 -121112 185378 124490 97439 -124716 -438339 -24500 -22588 -68690 -90260
10539 -90260 152558 -334466 7755 214917 143718 -120681 254825 -35055 -185262 218726
10528 61130 -125039 -266175 63414 -33727 -202694 -58537 33683 -96043 -118884 74824 63485
10517 63485 -163178 297914 -116385 -225715 207 -74749 -147731 -199504 -545824 -366434 92148
10505 -245994 -58208 -218842 -118323 21436 -8695 -341515 127616 -142851 -324039 34399
10494 -25936 81381 -25651 -540499 -313120 177044 229031 -44474 -114771 -187972 -25605 -199802
10483 -199802 59507 89319 35685 -212345 -119862 -221545 221850 56908 243397 -172444
10472A63644B8499K19564l4071K00150C5733K50894G9594J83856Q6181J61345
10462E10976q3988A72287f9273d636E5350k3665J78075E0527f4188k04846e569
10450b0097k5630G8976A7545K432J9916J32356b18929j50147A38321d8965a0918
10438b9270j75976G1396O0273a29746B8764n325f7160B43843a74642r6908E6557
10426a1524p9887B6844R465b35794N2025A19856a37399N0464c8097E4255k0987
10415C3268i848j35067A09686E0118f8361A76816a40225m8299E0413f1604H057
10403F570i3636m8543L1706j66829A09250a61072B11204c36568Q8179A49580J2711
10392A62291a83900k40745J12953D8525b40043e3906m7029d923H1852E989e5015
$$ plain form
10472 163644 28499 248063 213992 414142 35733 286627 79594 263450 349631 510976
10462 510976 426988 172287 -69273 -4636 55350 31685 209760 50527 -64188 -269034 -5569
10450 -20097 -45727 78976 17545 19977 39893 172249 -218929 -369076 138321 -48965 -10918
10438 -29270 -205246 71396 131669 -129746 28764 23439 -67160 243843 -174642 -271550 56557
10426 -11524 -91411 26844 36309 -235794 -183769 119856 -137399 -86935 -38097 54255 33268
10415 33268 -9848 -144915 109686 50118 -68361 176816 -140225 -188524 50413 -61604 8057
10403 6570 -93636 -142179 -110473 -277302 109250 -161072 211204 -336568 -248389 149580 162291
10392 162291 -183900 -424645 -311692 48525 -240043 -53906 -100935 -4923 81852 5989 -55015
10380a19133c268r5037C06675C4512a1122I3913R7874K5190L3726C038K0100M628
10368B7766M8483a000A17722n2491g9111B52871m9590m0617L09231B22038F3339
10356D01009j03496e4225E83300B25027j10395J45013q2712P8367K75255B6770
10345D70054n2856A62925N9962K4922J62798k8234j7184o8997A23989J56147L59850
10334F39986k06944l4291E7427P44385I071L10840J27661j47765k0701f868D64323
10322A12121N00895l4573a56895G6469K19876l4186A22644b20462A04041J3441
10312A17482a18637I6445Q5833c1110B40651n4851R532l5587b5311B29902I60
10300A44909n4601J16582m2378F1724J03815i269A96980G8793b20058h6446n8570
$$ plain form
10380 -119133 -3268 -98305 306675 34512 -11122 93913 191787 216977 250703 3038 23138 27766
10368 27766 76249 -1000 117722 65231 -79111 252871 203281 162664 471895 222038 63339
10356 401009 297513 -54225 583300 225027 114632 259645 176933 255300 530555 26770
10345 470054 417198 162925 222887 247809 410607 382373 365189 296192 123989 280136 639986
10334 639986 433042 398751 57427 801812 9071 319911 447572 299807 279106 -6868 464323
10322 112121 613016 578443 -156895 76469 296345 262159 122644 -220462 104041 117482
10312 117482 -118637 96445 182278 -31110 240651 185800 195332 159745 -25311 229902 960
10300 144909 90308 206890 164512 61724 165539 -9269 196980 78793 -220058 -86446 -145016
10289a45016j6423c2851m8844B06792d59517A00706J1464a01600H3525J66039
10279B49564B8535a18218B15177j04390M9774o2118J79077a03360A8346a14990
10268A45421k5985O7295a06561j44874l2960A20995J34784b24648R3500m16516
10258e47664G6170b03674A57401p8164Q344J01735a48359E5509O3692A3431J16245
10247A29676K72392j36186A06991L44089c501I3640J73135a16265k00864A96284
10236b2841k01664i8239l85127I3554J61650a42334A10129n0741a75429L5845
10226a39584L7432A81806d9007k55405d6211j66443l21595b35484a06730B19686
10215B45892d8269j74316O5378k3082M4099l4685o691A32227a05012P543C41710
$$ plain form
10289 -145016 -161439 -32851 -81695 206792 -459517 100706 112170 -101600 83525 249564
10279 249564 28535 -118218 215177 110787 160561 98443 277520 -103360 18346 -114990
10268 145421 119436 186731 -106561 -251435 -284395 120995 255779 -224648 -131148 -547664
10258 -547664 76170 -203674 157401 79237 87581 189316 -148359 55509 119201 13431 129676
10247 129676 402068 265882 106991 451080 -3501 93640 266775 -116265 -317129 196284
10236 -22841 -224505 -98239 -483366 93554 255204 -142334 110129 59388 -175429 -139584
10226 -139584 -102152 181806 -49007 -304412 -46211 -212654 -534249 -235484 -106730 219686
10215 245892 -48269 -222585 -157207 -180289 -136190 -170875 -177566 132227 -105012 -97469 341710
10203d3153j38835A42801f6274m970n275j85529f7003n9262M5854m0867N4372
10192f6906j46719M9181I7342D0994Q4067b02408B8557a51857C8795b86985a35245
10180h6506M3114j58697b0282k18488A06175f3703A23650j2439I010c17618A5110
10168A48190h0717A34554d64016O7172d0169A6521K4729e3576B43881n1528a34146
10156a7072j60167B7654a49745L7972p5243A91007C7439a38674D647a86540A14614
10144a93371E7200J12669b73365P0216A10150P9670a51550D40851F8881k7175
10134D1706a61481h24C3561a8898B2791b53741f5907J3204o254A2931J2333J94594
10122B19858p2373D6143a0993j31020I3113a44324j41059a29970K5940A13218
$$ plain form
10203 -43153 -181988 142801 -66274 -71244 -76519 -262048 -67003 -126265 -80411 -121278 -66906
10192 -66906 -213625 -164444 97342 40994 125061 -202408 28557 -151857 38795 -286985 -135245
10180 -86506 -43392 -202089 -20282 -238770 106175 -63703 123650 111211 9010 -317618 15110
10168 148190 -80717 134554 -464016 -396844 -40169 16521 41250 -53576 243881 192353 -134146
10156 -17072 -177239 27654 -149745 -111773 -187016 191007 37439 -138674 4647 -186540 114614
10144 -193371 57200 169869 -273365 -203149 110150 189820 -151550 440851 68881 41706
10134 41706 -161481 -824 33561 -18898 22791 -253741 -65907 -52703 -58957 12931 25264 219858
10122 219858 147485 46143 -10993 -142013 93113 -144324 -285383 -129970 -104030 113218
10111d817A3351a05065j1347j12029D7211H311N8680J36057f6087E9028a36157
10099A1948Q9367i5785B45587c48085i9126a0366r0779l72996h9704l08949d7708
10087F0165P3043E8605E328i3601p7270Q2706j7268d5214m07672a45758j0011
10076a55769F5700J05531a22771a4477p1225l7468A87970B3318i0377j26819B78694
10064A76415b67031k8760G9202a80861o4149B04181a31554c334k38722B26410
10053C30729b21865F4875b00354A10064f5219j62924n8487a08821e3459j41244
10043a94703e1800J1406k10594G0410a30000A21270K524b07062j57005A67526
10032D1371g0211C7415a96691A41075K54496a56862c7515j20610M7768l79436
$$ plain form
10111 -4817 13351 -105065 -116412 -228441 47211 8311 66991 203048 -66087 59028 -136157
10099 11948 101315 -95785 245587 -348085 -99126 -10366 -101145 -474141 -89704 -398653 -47708
10087 60165 133208 58605 5328 -93601 -170871 -88165 -105433 -45214 -452886 -145758 -155769
10076 -155769 65700 171231 -122771 -14477 -85702 -123170 187970 23318 -90377 -217196 278694
10064 176415 -267031 -295791 79202 -180861 -245010 204181 -131554 -3334 -242056 226410
10053 330729 -221865 64875 -200354 110064 -65219 -228143 -286630 -108821 -53459 -194703
10043 -194703 -51800 -40394 -250988 70410 -130000 121270 123794 -207062 -364067 167526
10032 41371 -70211 37415 -196691 141075 395571 -156862 -37515 -158125 -110357 -489793
10022d89793B80477b61486B51272i1323A6455c18970a5243l53247c6646q4539
10012a21185d7123j38851h6339A95255D8993J34953p6474i3705E6931a95707e7099
10000h6250j03809R4845A49464a3576k39077Q5775e8165B30815a32038M5077A07460
9988A0343a98822G391M7320K49796C9159L4751g6485A16289d2095A00908b66679
9976d1291J2479k25062e8307j87205B02475P5971a31990r0088F7979J90469a12916
9964a75940N5910M2892m039j31060L6090B5666p937a66162e679o6294m61G3061
9951i7740M980A6494A248a20030F2521a40524I3000C3818J1564J46135c04517
9939b30569j08464a32059F5106c64547B402e8867m6478A21963a92908F4859N8975
$$ plain form
10022 -489793 280477 -261486 251272 -91323 16455 -318970 -15243 -368490 -36646 -121185
10012 -121185 -47123 -185974 -86339 195255 48993 183946 107472 -93705 56931 -195707 -57099
10000 -86250 -190059 -95214 149464 -13576 -252653 -166878 -58165 230815 -132038 -86961 107460
9988 10343 -198822 7391 54711 304507 39159 73910 -76485 116289 -42095 100908 -266679
9976 -41291 -28812 -253874 -58307 -245512 202475 278446 -131990 -222078 67979 258448 -112916
9964 -175940 -120030 -77138 -81177 -212237 -176147 25666 17729 -166162 -5679 -71973 -72434 73061
9951 -97740 -92760 16494 1248 -120030 62521 -140524 93000 33818 45382 191517 -304517
9939 -230569 -339033 -132059 65106 -364547 2402 -58867 -105345 121963 -192908 64859 123834
9928A23834j4745m7873a84183m4390g7096R228j0115k59863b1639A39491j9445
9917A20046a6746k64200a20069B940c26004A81420d10164h2670p9793A67870n3184
9906A14686h3021A23289a17748q7592j02616l2541a1955A35935a44430j4683g7182
9894A88261g4906K1862o2253p2549N4205p4614L5643A50277c83237a8008O86k12107
9882b29429A42552e1454j25618H3748i526I1862b16530R330b0779F8531D931R530
9870A4461a14616Q558r4703G4093c16880A41688b06898B8942c28111d3595A60513
9858B1956r345d6606A24410j4611d13642A5845b09365A22525p411h034k04818
9847b12852f6946l3030b8787C2403N2153J49281c00674C9287b48355a1302m966
$$ plain form
9928 123834 109089 61216 -184183 -228573 -77096 -67868 -77983 -337846 -21639 139491 120046
9917 120046 -16746 -280946 -120069 2940 -326004 181420 -410164 -82670 -162463 167870 114686
9906 114686 -83021 123289 -117748 -205340 -307956 -340497 -11955 135935 -144430 -159113 -77182
9894 188261 -74906 -53044 -115297 -187846 -133641 -208255 -172612 150277 -383237 -18008 -17322 -229429
9882 -229429 142552 -51454 -177072 83748 -9526 91862 -216530 -207200 -20779 68531 4931 14461
9870 14461 -114616 -106058 -200761 74093 -316880 141688 -206898 28942 -328111 -43595 160513
9858 21956 12611 -46606 124410 109799 -413642 15845 -209365 122525 115114 -8034 -212852
9847 -212852 -66946 -99976 -28787 32403 84556 233837 -300674 39287 -248355 -11302 -16268
9836a6268l55837a55036F7476J05731a23724G8800C2761a45F1745a82940b9976
9824c6046k8386j20744k7629B9912b90805i3947j6706j0288M5332l13652a67835
9812A13961g0992A08188b6535n0574L2480j3598K6529l42788D9402a34261j03995
9801b38256A15713B4737J4589b07397P5714k5593c5673c090H9169D2705i5958
9789a98367A48945A0539h6394D07335a45504j63542M7892a0400k0691m8229m6952
9778a26272O2388q9584O4838B56806G3431a86045q7342A6661i1315o1060o9121
9767b21496Q0824l9280c9747j87515e6930j6590A32928l3534a02877k2712I5540
9755a22774J0286A2194P8055a43319C25612a5561a150j29599k3159K8931C0647
$$ plain form
9836 -16268 -372105 -155036 67476 173207 -123724 78800 32761 -145 61745 -182940 -29976
9824 -36046 -64432 -185176 -212805 29912 -290805 -93947 -110653 -120941 -75609 -389261 -167835
9812 113961 -70992 108188 -26535 -77109 -44629 -58227 -31698 -374486 49402 -134261 -238256
9801 -238256 115713 24737 39326 -207397 -131683 -157276 -35673 -3090 89169 42705 -95958
9789 -198367 148945 10539 -86394 407335 -145504 -309046 -261154 -10400 -31091 -79320 -126272
9778 -126272 -63884 -153468 -88630 256806 73431 -186045 -273387 16661 -91315 -152375 -221496
9767 -221496 -140672 -179952 -39747 -227262 -56930 -73520 132928 99394 -102877 -125589 95540
9755 -122774 -112488 12194 90249 -143319 325612 -15561 -1150 -130749 -153908 -124977 30647
9743a03762c86B23756q8553a5556A83852a77745B65219b7661p3837r8343e9719
9731e8987l84755C2518Q9581c711A43598a97675k2990N2013P7714p2373H3983
9719b95784A19621n6805c15769A91176h6670I2570a67803o0714E4777a10987n3331
9708a64318H8835J47077a13634A43306C5787r843M27529a1063k20482d1679R286
9697c2393j97319m979I3665c3752a725A51751a75013L4885m7731M7759C9159b08062
9684b74588a29560b8299m021B14147k0334b97975d0557H1953a51684O7851j89193
9673b73026i2766A3493a63466B20296H0494k7648N2143a65524M6323k84365C49717
9661G4299b6202p3679F7000i6854C16586a39138j96856M1087A56191b66285J8114
$$ plain form
9743 -103762 -386 223756 135203 -15556 183852 -177745 265219 -27661 -101498 -199841 -59719
9731 -58987 -443742 32518 122099 -3711 143598 -197675 -220665 -168652 -90938 -163311 83983
9719 -295784 119621 62816 -315769 191176 -86670 92570 -167803 -228517 54777 -110987 -164318
9708 -164318 88835 235912 -113634 143306 35787 25944 453473 -11063 -231545 -41679 -32393
9697 -32393 -229712 -234691 93665 -33752 -1725 151751 -175013 -140128 -187859 -140100 39159 -208062
9684 -274588 -129560 -28299 -32320 214147 193813 -297975 -40557 81953 -151684 -83833 -273026
9673 -273026 -92766 13493 -163466 220296 80494 52846 104989 -165524 -119201 -403566 349717
9661 74299 -26202 -99881 67000 -96854 316586 -139138 -335994 -294907 156191 -266285 -248171
9650b48171G7455b13877p965c0570l17776d5255l2890k310l37129A39696B0743
9638a71115B16690b99136p6115a72383b9299k36457A92110d09871a95960l4764
9628b30724N6776C2602a95242i1138n6214j66988A08450c74030I9924b07837l51945
9617e59782A46261d4232j5791B15581a05185H9150a53847B14508a7237l15033
9607c32270C01031b63375I5296b9323j45466P0263A18342h0299p0697D1013f6523
9595b26367f0317q8583j81143a56239B71610G1258i1264k09514d7434j70959m894
9584b23287d3180J9170B86215b14676j4995h3524c4966m6347C24164f367j28866
9573a35233l4587o5456J14910A44073b33111J04779d4199B2111f3024F5266j4544
$$ plain form
9650 -248171 77455 -213877 -221842 -30570 -348346 -45255 -78145 -80455 -417584 139696 20743
9638 -171115 216690 -299136 -375251 -172383 -29299 -265756 192110 -409871 -195960 -230724
9628 -230724 -173948 32602 -195242 -91138 -147352 -314340 108450 -374030 99924 -207837 -559782
9617 -559782 146261 -44232 -60023 215581 -105185 89150 -153847 214508 -17237 -332270
9607 -332270 301031 -263375 95296 -29323 -174789 -104526 118342 -80299 -150996 41013 -66523
9595 -226367 -60317 -148900 -330043 -156239 271610 71258 -91264 -300778 -47434 -218393 -223287
9584 -223287 -43180 -24010 286215 -214676 -229671 -83524 -34966 -81313 324164 -6367 -135233
9573 -135233 -169820 -235276 -120366 144073 -233111 -128332 -44199 22111 -63024 65266 50722
9562E0722j2171M0064k1508j0035b92259a18924l68595a87894F7764J00549g3762
9550b17247A5170e625r6423A59727b97798A09852b11512H1223K7525c74486P3764
9539c00722R4069C2853f9992j98591a05837n1721k77982h4040l1236o9100A88848
9527a33288A7613p943J91668I4736i4290r1217c9406k75392B30224b05077H1410
9515C1870j4940M354K1284J92962d39151B02556B294J37043b42503c1160j70019
9504b01179C5811a35270F4438b4381B3866a94858R0881j7419k2244O0872k46956
9493c29724C1976k325b26394C976J51962b19784O8632M6614j59936r1353e2585
9481A70446b06204B45980g775j41841A60062E0340c51500B9416Q6229c15799a01930
$$ plain form
9562 50722 38551 78615 57107 47072 -292259 -118924 -487519 -187894 67764 168313 -73762
9550 -217247 15170 -5625 -102048 159727 -297798 109852 -211512 81223 108748 -374486 -300722
9539 -300722 -206653 32853 -69992 -268583 -105837 -157558 -435540 -84040 -115276 -184376 188848
9527 -133288 17613 9670 201338 94736 -94290 -185507 -39406 -314798 230224 -205077 81410
9515 31870 16930 21284 42568 235530 -439151 202556 2294 139337 -242503 -31160 -201179
9504 -201179 35811 -135270 64438 -24381 23866 -194858 -103977 -121396 -143640 -82768 -329724
9493 -329724 31976 29651 -226394 3976 155938 -219784 -151152 -104538 -264474 -355827 -52585
9481 170446 -206204 245980 -7775 -149616 160062 50340 -351500 29416 115645 -315799 -101930
9469b2811B0388K751a45207j70344h1784c5523j06884F6876b61066P2567P5193
9458a13306K7614q609r6886G2968a29013j22268A81935A2639b45533R5897r3100
9447b42736A27567d4980j81895b9716A07642a75746c2836G0737B7482d7546k96033
9436c43579g1491A65238k6872a48965m911b0171A24632a99623c5400k1919j11257
9425a68576C6751Q8306b33817c066q3795A4306d02283a32382r7120A69742k564
9414A67178b87895h0597c0378j44984A04447n1604a36713k6605A9272a26112l8108
9403a64220K1983e0415B37428b90572R4752g3399f292b214A44903l4752a46695
9391B97894A17823a40396B36257a19072l6300A31215l3437a56803C60023b48274
$$ plain form
9469 -22811 20388 23139 -145207 -315551 -81784 -35523 -142407 66876 -261066 -188499 -113306
9458 -113306 -85692 -94301 -191187 72968 -129013 -251281 181935 12639 -245533 -149636 -242736
9447 -242736 127567 -44980 -226875 -29716 107642 -175746 -32836 70737 27482 -47546 -343579
9436 -343579 -71491 165238 138366 -148965 -153876 -20171 124632 -199623 -35400 -57319 -168576
9425 -168576 36751 125057 -233817 -3066 -86861 14306 -402283 -132382 -229502 169742 167178
9414 167178 -287895 -80597 -30378 -175362 104447 52843 -136713 -163318 19272 -126112 -164220
9403 -164220 -142237 -50415 237428 -290572 -195820 -73399 -6292 -2214 144903 110151 -146695
9391 297894 117823 -140396 236257 -119072 -155372 131215 97778 -156803 360023 -248274
9380f2506E8526f2480A33996J09810o6026F3591a90344B5736R2098a92342D2604
9368a48069B387K07121b88160O2486c5703n5910D502b16599f4062I1577J08262
9357A99839A9312a00996r3574F7101K24572I8871B6011b03565B16014c36354a66176
9345d24942b135j58498l8080c9285B78683j12044b51169A03093h8279L3762k03543
9334b58060a13848L3652K8473k81160F5749E044K36152a04464A82557D210a08174
9322B42502c3548B17214a18351B53239d84353C17667b69069P1529j8071j19245
9312c34856B60216c36424b9853p569j62698A09983J83167b68094B01346a49739
9301H3672a82567C950b33781K6738d7368l13395J33393h2020A3819f3732C38087
$$ plain form
9380 -62506 58526 -62480 133996 243806 177780 63591 -190344 25736 117834 -192342 42604
9368 -148069 2387 209508 -288160 -225674 -35703 -91613 4502 -216599 -64062 91577 199839
9357 199839 19312 -100996 -194570 67101 291673 98871 26011 -203565 216014 -336354 -166176
9345 -424942 -2135 -160633 -198713 -39285 278683 166639 -251169 103093 -88279 -54517 -258060
9334 -258060 -113848 -80196 -51723 -332883 65749 5044 241196 -104464 182557 4210 -108174
9322 242502 -33548 217214 -118351 253239 -484353 317667 -269069 -197540 -215611 -334856
9312 -334856 260216 -336424 -29853 -37422 -200120 109983 293150 -268094 201346 -149739
9301 83672 -182567 3950 -233781 -207043 -47368 -360763 -227370 -82020 13819 -63732 338087
9289c45229A96313k4860a8024C1679a74750K881C433K89058C3421c20388a09798
9277A14579b4689r9223n4869h3843g522j39663e0472j2751j01067A80318a69718
9265b48498A7803a17096N8406n18329f7050a2118j6930l25510A25626L276b79763
9253C10213A35502a35607d2691n2014G8348N1083o2625b32655C08013g2263k26005
9242b98268l0171d5218A3320g3144j49249A53679J33313f7816A74380o9144d03792
9230c05113f3192A29972a19130o5780g4436I8866e07166f716j07714q3955j70586
9219c68971A04789h6356l16790A90369m9513K2799f5384G7100a26737k22278A02444
9207c16805L3373F0186J23797a30602j10630Q7484A76057e1435B27045j6237m1672
$$ plain form
9289 -345229 196313 171453 -18024 31679 -174750 -171869 3433 292491 33421 -320388 -109798
9277 114579 -24689 -123912 -178781 -83843 -7522 -147185 -50472 -63223 -164290 180318 -169718
9265 -248498 17803 -117096 -58690 -577019 -67050 -12118 -29048 -354558 125626 128902 -279763
9253 310213 135502 -135607 -42691 -94705 78348 129431 66806 -232655 308013 -72263 -298268
9242 -298268 -328439 -45218 13320 -73144 -222393 153679 286992 -67816 174380 105236 -403792
9230 -305113 -63192 129972 -119130 -184910 -74436 98866 -507166 -6716 -114430 -198385 -368971
9219 -368971 104789 -86356 -403146 190369 140856 163655 -65384 77100 -126737 -349015 102444
9207 -316805 -283432 60186 183983 -130602 -241232 -153748 176057 -51435 227045 210808 169136
9196A69136b60457N1606B08357a66021D17481a1664m63849d8786D2104a70959
9185d5777A86264b46618B4939c05990f8672B8050b85689A00981c57547a53820
9174A39654J23331b62477L6261A26970a33958H5113a83800d5079B2683c3695E851
9162A45157p2059l5876b21381k37979h2797G9074j9679J84498d3728m5538l38902
9151d28168D4531a79574A51837f7731k1372j70653J04820O2834o0889B6406d2481
9139d1997l4141A05382b90355H2267a24508C37669j45730g252j30200D6024b72299
9127h0233E7446b6125k39949B1957J67882b36060M0784A19744a38937B6017g0360
9115a96199A0230M5498P6879h0779n3585B59695N0461G1798R6789A6605M6311
$$ plain form
9196 169136 -260457 -208851 208357 -166021 417481 -11664 -475513 -48786 42104 -170959
9185 -45777 186264 -246618 24939 -305990 -68672 28050 -285689 100981 -357547 -153820
9174 139654 262985 -262477 -226216 126970 -133958 85113 -183800 -45079 22683 -33695 5851
9162 145157 73098 37222 -221381 -459360 -82797 79074 59395 243893 -43728 -89266 -428168
9151 -428168 44531 -179574 151837 -67731 -89103 -259756 -154936 -92102 -152991 26406 -42481
9139 -41997 -76138 105382 -290355 82267 -124508 337669 191939 -7252 -137452 46024 -272299
9127 -80233 57446 -26125 -266074 21957 189839 -236060 -195276 119744 -138937 26017 -70360
9115 -196199 10230 55728 132607 -80779 -134364 259695 310156 71798 168587 16605 62916
9104F2916J53449B51M7829a11468m6304l1858j43512A65243c57367a23402a8509
9092d6721l18733A84827a47019b1799A75301a47995A4607f8944o5530D29710h7379
9080G9184J70556m5139m3241f8233o3672j61877e6138A16130a34283A55747b09788
9068b49016C09183h4507K8084b1060l0014E7557a89193M9872c1073A42542D7874
9056a49697A79785a21166b3078B12690c4561j49784k6305c8940A8308e8488b8179
9044b11518A69031b2412k0842j68484f7195A22155J63697b14217B16890b55145
9033h4160A17820e1502k11679A50844G0682f7756j25670q1895g5452k05225g803
9021h7770B84118b86469B08489a17423H3074f3822C5488a41314H8416f7749I1302
$$ plain form
9104 62916 216365 251 48080 -111468 -157772 -189630 -333142 165243 -357367 -123402 -18509
9092 -46721 -365454 184827 -147019 -21799 175301 -147995 14607 -68944 -134474 429710 -87379
9080 79184 249740 204601 161360 -68233 -131905 -293782 -56138 116130 -134283 155747 -209788
9068 -249016 309183 -84507 -56423 -21060 -51074 57557 -189193 -139321 -31073 142542 47874
9056 -149697 179785 -121166 -23078 212690 -34561 -184345 -210650 -38940 18308 -58488 -28179
9044 -211518 169031 -22412 -43254 -211738 -67195 122155 285852 -214217 216890 -255145
9033 -84160 117820 -51502 -263181 150844 70682 -67756 -193426 -275321 -75452 -280677 -7803
9021 -87770 284118 -286469 208489 -117423 83074 -63822 35488 -141314 88416 -67749 91302
9009A6501J38579a76023J0430b2580D5826j6843a55430A83276b0355A57018k1202
8998A35816i9581I8153a61846k9781k7616A77215l3597c20453f7987n1003j96937
8987c15927A38894k2767J88899a26990C1077d17359A31143j5833C2487g0688B0615
8975a01760B28681a37599j39161C0168a3170j85403L5108C6295P3736m4153J3906
8964G9784b9206B05297e4332k55985A13296c83926d6752B1607c31022l2842d4781
8952A17202f9964c3020r8371G9782k0190a79781Q9567D4728L9568K821C2058f169
8939a66027I2779a55461A29959E6244a74060A28985P969F5969i8167K5508B4768
8927b71808b8584m26354a72010d4557k02961O4771B7912J42596D0437L78918J8689
$$ plain form
9009 16501 155080 -176023 -165593 -22580 45826 28983 -155430 183276 -20355 157018 135816
8998 135816 -99581 98153 -161846 -191627 -219243 177215 143618 -320453 -67987 -118990 -315927
8987 -315927 138894 116127 305026 -126990 31077 -417359 131143 115310 32487 -70688 20615
8975 -101760 228681 -137599 -276760 30168 -13170 -198573 -163465 36295 110031 65878 79784
8964 79784 -29206 205297 -54332 -310317 113296 -383926 -46752 21607 -331022 -363864 -44781
8952 117202 -69964 -33020 -131391 79782 59592 -179781 -90214 44728 84296 87117 32058 -6169
8939 -166027 92779 -155461 129959 56244 -174060 128985 136954 65969 -98167 -72659 24768
8927 -271808 -28584 -454938 -172010 -44557 -247518 -182747 27912 170508 40437 419355 438044
8916D38044o2761l0696E1177K95266J25924l2010L03547L47630J201291J534676
8906C827501L927725K167217D255991j958194j044166n51397k01989K02280l35303
8897C67222A43475R8812c3589A25262J53203p3657K4218K4750c878E2749a5392
8885D9922O1798g3866K1025A63492f6793C46115D7125A5078e1475B55918A0879
8873b4843j1128l07924A13683f5459F8597i3441c3291A84030k4462A2174b27384
8861b7517D20262a27808k58842A52753Q1187b1032D762K3381b1974B82490a83564
$$ plain form
8916 438044 375283 344587 51177 346443 472367 440357 743904 1091534 2292825 3827501
8906 3827501 7755226 9922443 4255991 2297797 1253631 702234 500245 702525 367222
8897 367222 143475 242287 -33589 125262 278465 204808 229026 253776 -3878 52749 -15392
8885 49922 111720 -73866 -52841 163492 -66793 346115 47125 15078 -51475 255918 10879
8873 -24843 -35971 -343895 113683 -65459 68597 -93441 -33291 184030 159568 12174 -227384
8861 -27517 420262 -127808 -386650 152753 233940 -21032 4762 28143 -21974 282490 -183564
$$ [...]
##END NTUPLES=NMR SPECTRUM
##END=
