
##TITLE=AC1233_CMOAH12092_6610494_DhLeZNSFOO
##JCAMPDX= 6.0         $$ Bruker NMR JCAMP-DX V2.0
##DATA TYPE= NMR SPECTRUM
##DATA CLASS= NTUPLES
##ORIGIN= BRUKER
##OWNER= Administrator
$$ 1.72 TOPSPIN		Version 2.1
$$ 2012-08-02 03:15:25.609 -0500  Administrator@TOPSPIN
$$ Compression mode = diff/dup
##.OBSERVE FREQUENCY= 400.02188249412
##.OBSERVE NUCLEUS= ^1H
##.ACQUISITION MODE= SIMULTANEOUS (DQD)
##.ACQUISITION SCHEME= undefined
##.AVERAGES= 64
##.DIGITISER RES= 22
##SPECTROMETER/DATA SYSTEM= spect
##.PULSE SEQUENCE= noesygpps1d.comp
##.SOLVENT NAME= COFFEE_meoh
##.SHIFT REFERENCE= INTERNAL, COFFEE_meoh, 1, 14.96259
##AUDIT TRAIL= $$ (NUMBER, WHEN, WHO, WHERE, PROCESS, VERSION, WHAT)
$$ ##TITLE= Audit trail, TOPSPIN		Version 2.1
$$ ##JCAMPDX= 5.01
$$ ##ORIGIN= Bruker BioSpin GmbH
$$ ##OWNER= Administrator
$$ $$ C:\Bruker\TOPSPIN/data/COFFEE/nmr/AC1233_CMOAH12092_6610494_DhLeZNSFOO/12/pdata/1/auditp.txt
$$ ##AUDIT TRAIL=  $$ (NUMBER, WHEN, WHO, WHERE, PROCESS, VERSION, WHAT)
(   1,<2012-08-02 03:15:20.406 -0500>,<Administrator>,<TOPSPIN>,<go>,<TOPSPIN 2.1>,
      <created by zg
	started at 2012-08-02 03:03:49.968 -0500,
	POWCHK enabled, PULCHK disabled,
       configuration hash MD5:
       6B 1B 68 BB D9 2E 58 E2 7F 35 AD 54 07 DF 0E 41
       data hash MD5: 64K
       24 DB FF 15 7F 28 4E 5D AC D3 5B 31 77 88 1C 8B>)
(   2,<2012-08-02 03:15:23.296 -0500>,<Administrator>,<TOPSPIN>,<proc1d>,<TOPSPIN 2.1>,
      <Start of raw data processing
       efp LB = 0.3 FT_mod = 6 PKNL = 1 PHC0 = 0 PHC1 = 0 SI = 128K 
       data hash MD5: 128K
       4C 24 AD 5C 19 7B 0E 9D 88 74 21 AD 0C 0E FA 2F>)
(   3,<2012-08-02 03:15:24.453 -0500>,<Administrator>,<TOPSPIN>,<proc1d>,<TOPSPIN 2.1>,
      <pk PHC0 = 0.1593018 PHC1 = 0 
       data hash MD5: 128K
       68 4D 3C 65 59 F7 05 90 BE 8B F1 50 14 6E DC A4>)
(   4,<2012-08-02 03:15:25.234 -0500>,<Administrator>,<TOPSPIN>,<proc1d>,<TOPSPIN 2.1>,
      <abs ABSG = 1 
       data hash MD5: 128K
       B2 E3 BE 86 71 0D ED 5D 5B 8C B4 FA FD 75 59 1A>)
(   5,<2012-08-02 03:15:25.328 -0500>,<Administrator>,<TOPSPIN>,<proc1d>,<TOPSPIN 2.1>,
      <abs ABSG = 2 
       data hash MD5: 128K
       08 76 04 87 CA AC A0 E5 A5 C5 44 A8 3A ED 93 6F>)
(   6,<2012-08-02 03:15:25.390 -0500>,<Administrator>,<TOPSPIN>,<proc1d>,<TOPSPIN 2.1>,
      <abs ABSG = 3 
       data hash MD5: 128K
       A5 32 2C 67 FD 61 10 EA D8 37 DD 58 33 0E DE 5E>)
(   7,<2012-08-02 03:15:25.484 -0500>,<Administrator>,<TOPSPIN>,<proc1d>,<TOPSPIN 2.1>,
      <abs ABSG = 4 
       data hash MD5: 128K
       EA 35 12 F3 35 90 F1 F6 50 52 62 98 81 01 28 44>)
(   8,<2012-08-02 03:15:25.531 -0500>,<Administrator>,<TOPSPIN>,<proc1d>,<TOPSPIN 2.1>,
      <abs ABSG = 5 
       data hash MD5: 128K
       B4 8B F5 8A 75 80 11 31 88 2B 69 5A D7 E9 2E FA>)
$$ ##END=
$$ 
$$ $$ hash MD5
$$ $$ 76 E0 71 FF 70 23 FB 86 BC 45 16 1F 07 3C 4F AA
##$RELAX= 
##$RELAX= 
##$RELAX= 
##$RELAX= 
##$RELAX= 
##$RELAX= 
##$RELAX= 
##$RELAX= 
$$ Bruker specific parameters
$$ [...]
##$TP07= 0
##$TPNAME0= <>
##$TPNAME1= <>
##$TPNAME2= <>
##$TPNAME3= <>
##$TPNAME4= <>
##$TPNAME5= <>
##$TPNAME6= <>
##$TPNAME7= <>
##$TPOAL= (0..7)
0.5 0.5 0.5 0.5 0.5 0.5 0.5 0.5
##$TPOFFS= (0..7)
0 0 0 0 0 0 0 0
##$TUNHIN= 0
##$TUNHOUT= 0
##$TUNXOUT= 0
##$USERA1= <user>
##$USERA2= <user>
##$USERA3= <user>
##$USERA4= <user>
##$USERA5= <user>
##$V9= 5
##$VALIST= <valist>
##$VCLIST= <CCCCCCCCCCCCCCC>
##$VD= 0
##$VDLIST= <DDDDDDDDDDDDDDD>
##$VPLIST= <PPPPPPPPPPPPPPP>
##$VTLIST= <TTTTTTTTTTTTTTT>
##$WBST= 1024
##$WBSW= 4
##$XGAIN= (0..3)
0 0 0 0
##$XL= 0
##$YL= 0
##$YMAX_a= 16759151
##$YMIN_a= -9754903
##$ZGOPTNS= <>
##$ZL1= 120
##$ZL2= 120
##$ZL3= 120
##$ZL4= 120
##$ABSF1= 14.96259
##$ABSF2= -5.595592
##$ABSG= 5
##$ABSL= 3
##$ALPHA= 0
##$AQORDER= 0
##$ASSFAC= 0
##$ASSFACI= 0
##$ASSFACX= 0
##$ASSWID= 0
##$AUNMP= <proc_prof1d_extract.lims>
##$AXLEFT= 0
##$AXNAME= <>
##$AXNUC= <1H>
##$AXRIGHT= 0
##$AXTYPE= 0
##$AXUNIT= <>
##$AZFE= 0.1
##$AZFW= 0.1
##$BCFW= 0
##$BC_mod= 0
##$BYTORDP= 0
##$COROFFS= 0
##$CY= 15
##$DATMOD= 1
##$DC= 0
##$DFILT= <>
##$DTYPP= 0
##$F1P= 0
##$F2P= 0
##$FCOR= 0.5
##$FTSIZE= 131072
##$FT_mod= 6
##$GAMMA= 0
##$GB= 0
##$INTBC= 1
##$INTSCL= 1
##$ISEN= 128
##$LB= 0.3
##$LEV0= 0
##$LPBIN= 0
##$MAXI= 10000
##$MC2= 0
##$MEAN= 0
##$ME_mod= 0
##$MI= 0
##$NCOEF= 0
##$NC_proc= -2
##$NLEV= 6
##$NOISF1= 0
##$NOISF2= 0
##$NSP= 0
##$NTH_PI= 0
##$NZP= 0
##$OFFSET= 14.96259
##$PC= 1
##$PHC0= 0.1593018
##$PHC1= 0
##$PH_mod= 1
##$PKNL= yes
##$PPARMOD= 0
##$PPDIAG= 0
##$PPIPTYP= 0
##$PPMPNUM= 2147483647
##$PPRESOL= 1
##$PSCAL= 4
##$PSIGN= 0
##$PYNMP= <proc.py>
##$REVERSE= no
##$SF= 400.020008999513
##$SI= 131072
##$SIGF1= 0
##$SIGF2= 0
##$SINO= 400
##$SIOLD= 131072
##$SPECTYP= <>
##$SREGLST= <1H.CDCl3>
##$SSB= 0
##$STSI= 131072
##$STSR= 0
##$SW_p= 8223.68421052631
##$SYMM= 0
##$S_DEV= 0
##$TDeff= 65536
##$TDoff= 0
##$TI= <>
##$TILT= no
##$TM1= 0
##$TM2= 0
##$TOPLEV= 0
##$USERP1= <user>
##$USERP2= <user>
##$USERP3= <user>
##$USERP4= <user>
##$USERP5= <user>
##$WDW= 1
##$XDIM= 131072
##$YMAX_p= 432678494
##$YMIN_p= -10536
##$CURPLOT= <Network HP LaserJet P1505>
##$CURPRIN= <$Network HP LaserJet P1505>
##$DFORMAT= <normdp>
##$LAYOUT= <+/1D_H.xwp>
##$LFORMAT= <normlp>
##$PFORMAT= <normpl>
##$SURQMSG= 1
$$ End of Bruker specific parameters
$$ ---------------------------------
##NTUPLES= NMR SPECTRUM
##VAR_NAME=  FREQUENCY,     SPECTRUM/REAL,   SPECTRUM/IMAG
##SYMBOL=    X,             R,               I
##VAR_TYPE=  INDEPENDENT,   DEPENDENT,       DEPENDENT
##VAR_FORM=  AFFN,          ASDF,            ASDF
##VAR_DIM=   131072,        131072,          131072
##UNITS=     HZ,            ARBITRARY UNITS, ARBITRARY UNITS
##FACTOR=    0.0627417313425164, 1,          1
##FIRST=     8223.62146879497, 421,          -59704
##LAST=      0,             1566,            -59732
##MIN=       0,             -10536,          0
##MAX=       8223.62146879497, 432678494,    0
$$ Real data points
##PAGE= N=1
##DATA TABLE= (X++(R..R)), XYDATA
$$ [...]
63174G73105J9044J9860K0003K0058K0618K1317K1241K0189J8867J7766J6585
$$ 773105 792149 812009 832012 852070 872688 894005 915246 935435 954302 972068 988653
63163I88653J4962J3048J0952Q280M773Q62l035p243j2159j7270k1599k4892k7500
$$ 988653 1003615 1016663 1027615 1035895 1040668 1041530 1038495 1031252 1019093 1001823 980224 955332 927832
63150I27832k9310k9756k8947k7858k7105k6150k4182k1276j8321j6068j4498
$$ 927832 898522 868766 839819 811961 784856 758706 734524 713248 694927 678859 664361
63139F64361j2951j0832q363o575o112o206n497l787k242j663j401m72J002K078
$$ 664361 651410 640578 632215 625640 619528 613322 607825 604038 601796 600133 598732 598260 599262 601340
63125F01340K359K290K366K614K876L141L511M033M571M858M755M508M435M388
$$ 601340 603699 605989 608355 610969 613845 616986 620497 624530 629101 633959 638714 643222 647657 652045
63111F52045L969L358L343M223N188N304M656M007L690L452L152K863K453J687
$$ 652045 656014 659372 662715 666938 672126 677430 682086 686093 689783 693235 696387 699250 701703 703390
63097G03390P88K83K09N6l76o45m52k92q12j860k586k434j625o84J44Q77J492
$$ 703390 704178 704461 704670 704726 704350 703705 703253 702961 702149 700289 697703 695269 693644 692960 693104 693981 695473
63080F95473J931K324K932L828M806N669O455P264Q033Q726R517J0555J1635J2390
$$ 695473 697404 699728 702660 706488 711294 716963 723418 730682 738715 747441 756958 767513 779148 791538
63066G91538J2817J3250J3878J4628J5494J6667J8162J9656K0852K1785K2733
$$ 791538 804355 817605 831483 846111 861605 878272 896434 916090 936942 958727 981460
63055I81460K4049K6041K8634L1146L2898L4174L6012L8835M1713M3355M3531
$$ 981460 1005509 1031550 1060184 1091330 1124228 1158402 1194414 1233249 1274962 1318317 1361848
63044A361848M3126M3100M3695M4446M4643M3967M2844M1950M1374M0631L9625
$$ 1361848 1404974 1448074 1491769 1536215 1580858 1624825 1667669 1709619 1750993 1791624 1831249
63033A831249L9034L9417M0435M1296M1561M1070L9556L6780L2692K7015J9129
$$ 1831249 1870283 1909700 1950135 1991431 2032992 2074062 2113618 2150398 2183090 2210105 2229234
63022B229234Q939k529j4000k5072l5858m5800n3752n9146o2396o4063o4177o2521
$$ 2229234 2238173 2235644 2221644 2196572 2160714 2114914 2061162 2002016 1939620 1875557 1811380 1748859
63010A748859n9120n4376m8933m3351l7687l1600k5115j8887j3302p854j991L897
$$ 1748859 1689739 1635363 1586430 1543079 1505392 1473792 1448677 1429790 1416488 1408634 1406643 1410540
62998A410540R108J3763J8301K2227K4577K5578K6581K8153K9426K9699K9512
$$ 1410540 1419648 1433411 1451712 1473939 1498516 1524094 1550675 1578828 1608254 1637953 1667465
62987A667465K9474K9170K8074K6681K5683K4635K2464J8994J4896J0304M545
$$ 1667465 1696939 1726109 1754183 1780864 1806547 1831182 1853646 1872640 1887536 1897840 1902385
62976A902385k660j0636j8657k6730l5076m3318n0672n6640o1149o4136o5392
$$ 1902385 1899725 1889089 1870432 1843702 1808626 1765308 1714636 1657996 1596847 1532711 1467319
62965A467319o4845o2793n9841n6637n3548n0448m6839m2407l7465l2739k8710
$$ 1467319 1402474 1339681 1279840 1223203 1169655 1119207 1072368 1029961 992496 959757 931047
62954I31047k5401k2746k0779j9278j7587j5291j2850j1112j0268r777r303r079
$$ 931047 905646 882900 862121 842843 825256 809965 797115 786003 775735 765958 756655 747576
62942G47576r212r298r088q972r323r782r742r231q771q601q510q311p980p485
$$ 747576 738364 729066 719978 711006 701683 691901 682159 672928 664157 655556 647046 638735 630755 623270
62928F23270o873o391o122n707m822l762l127l095l374l663l758l470k906k578
$$ 623270 616397 610006 603884 598177 593355 589593 586466 583371 579997 576334 572576 569106 566200 563622
62914E63622k702k706k041j225j283k268l122l056k340j620j091o01r3L80P48
$$ 563622 560920 558214 556173 554948 553665 551397 548275 545219 542879 541259 540168 539567 539474 539854 540602
62899E40602R49J000R74P41Pj070j730j591j339j812k787l468l701l858l834l288
$$ 540602 541551 542551 543525 544266 544273 543203 541473 539882 538543 536731 533944 530476 526775 522917 519083 515795
62883E15795k655k717l184k962j995j483k019k666k474j754j301j203j147j058
$$ 515795 513140 510423 507239 504277 502282 500799 498780 496114 493640 491886 490585 489382 488235 487177
62869D87177q76m05J02k1p80j306j145r18j131j276q24k00qo5m7l19j196k047
$$ 487177 486301 485896 485998 485977 485197 483891 482746 481828 480697 479421 478597 478397 478389 478324 478277 477958 476762 474715
62851D74715k140j801j781j949j622q34k87k46l85n10o51n98j32M32N74L06rk33
$$ 474715 472575 470774 468993 467044 465422 464588 464301 464055 463670 463160 462509 461911 461779 462211 462785 463091 463082 462849
62833D62849l28n9N31P97L55j53MM77N30L79O94J134P08m86j255j166j101j595
$$ 462849 462521 462462 462993 463790 464145 463992 463996 464473 465003 465382 466076 467210 467918 467432 466177 465011 463910 462315
62815D62315j814q70P95K047K487K532K525K412K175K065K427L309M273M698M525
$$ 462315 460501 459631 460426 462473 464960 467492 470017 472429 474604 476669 479096 482405 486678 491376 495901
62800D95901M447N000N765O086O291P334R268J0985J1719J1965J2556J3567J4609
$$ 495901 500348 505348 511113 517199 523490 530824 540092 551077 562796 574761 587317 600884 615493
62787F15493J5629J6892J8515K0481K2839K5532K8259L0824L3405L6310L9673
$$ 615493 631122 648014 666529 687010 709849 735381 763640 794464 827869 864179 903852
62776I03852M3543M7881N2386N6615O0554O4697O9292P3800P7338P9361P9719
$$ 903852 947395 995276 1047662 1104277 1164831 1229528 1298820 1372620 1449958 1529319 1609038
62765A609038P8349P5238P0447O3779N4662M2774K8770J4013n02j4681k8693m2042
$$ 1609038 1687387 1762625 1833072 1896851 1951513 1994287 2023057 2037070 2036568 2021887 1993194 1951152
62753A951152n3650o2861p0008p5754q0065q2295q2253q0749p8698p6134p2458
$$ 1951152 1897502 1834641 1764633 1688879 1608814 1526519 1444266 1363517 1284819 1208685 1136227
62742A136227o7514o1974n6658n1828m7239m2716l8454l4808l1735k8693k5313
$$ 1136227 1068713 1006739 950081 898253 851014 808298 769844 735036 703301 674608 649295
62731F49295k1955j9236j7090j4987j3041j1974j1677j0858q814o671n896o205
$$ 649295 627340 608104 591014 576027 562986 551012 539335 528477 519663 512992 507096 500891
62719E00891o086m905l293j703J2J557K150J848J895L200N344P452R175J0416
$$ 500891 494805 489900 486607 484904 484916 486473 488623 490471 492366 495566 500910 508362 517537 527953
62705E27953J1044J1580J3266J6621K0482K3277K4962K6833K9694L3035L6012
$$ 527953 538997 550577 563843 580464 600946 624223 649185 676018 705712 738747 774759
62694G74759L8607M1472M5089M9262N3393N7007N9984O2331O3872O4306O3405
$$ 774759 813366 854838 899927 949189 1002582 1059589 1119573 1181904 1245776 1310082 1373487
62683A373487O0938N6597N0316M2525L3721K3857J2620K07j2623k5130l6664m6316
$$ 1373487 1434425 1491022 1541338 1583863 1617584 1641441 1654061 1654268 1641645 1616515 1579851 1533535
62671A533535n3362n8166o1878o4924o6536o6131o4384o2322n9945n6519n1971
$$ 1533535 1480173 1422007 1360129 1295205 1228669 1162538 1098154 1035832 975887 919368 867397
62660H67397m7250m3292m0113l7082l3769l0421k7603k5414k3287k0717j8002
$$ 867397 820147 776855 736742 699660 665891 635470 607867 582453 559166 538449 520447
62649E20447j5808j4331j3273j2544j2195j1789j0687r129q126p987p818o936
$$ 520447 504639 490308 477035 464491 452296 440507 429820 420691 412565 404578 396760 389824
62637C89824n942n707o067o244o055n810n491m874m215m022m183m034l285k354
$$ 389824 383882 378175 372108 365864 359809 353999 348508 343634 339419 335397 331214 327180 323895 321541
62623C21541j804j824k203k428j995j001j85o2j83J84J019J681J918K104K591
$$ 321541 319737 317913 315710 313282 311287 310286 310101 310039 309856 310040 311059 312740 314658 316762 319353
62608C19353L358M303N351O305O973P493Q098Q713R198R825J1026J2695J4263
$$ 319353 322711 327014 332365 338670 345643 353136 361234 369947 379145 388970 399996 412691 426954
62595D26954J5504J6775J8467K0642K3245K6139K8925L1212L3183L5420L8020
$$ 426954 442458 459233 477700 498342 521587 547726 576651 607863 641046 676466 714486
62584G14486M0327M1747M2316M2224M1182L8637L4403K8759K2002J4273N808k796
$$ 714486 754813 796560 838876 881100 922282 960919 995322 1024081 1046083 1060356 1066164 1063368
62572A063368j0762j7583k3269k8026l1730l3938l4604l4466l4402l4478l4036
$$ 1063368 1052606 1035023 1011754 983728 951998 918060 883456 848990 814588 780110 746074
62561G46074l2567l0250k7623k5150k3125k1578k0102j8136j5683j3578j2709
$$ 746074 713507 683257 655634 630484 607359 585781 565679 547543 531860 518282 505573
62550E05573j3064j3710j3788j3257j2626j2088j1335j0239r303r029r046q439
$$ 505573 492509 478799 465011 451754 439128 427040 415705 405466 396163 387134 378088 369649
62538C69649o994n474m521l856k959j950j256p70k6J015J916K428K736L126L801
$$ 369649 362655 357181 352660 348804 345845 343895 342639 341869 341843 342858 344774 347202 349938 353064 356865
62523C56865M899O262P326P720P824Q271R069R802J0514J1702J3471J5440J7483
$$ 356865 361764 368026 375352 383072 390896 399167 408236 418038 428552 440254 453725 469165 486648
62510D86648J9901K2699K5408K7848L0383L3135L5568L7141L7841L7802L6879
$$ 486648 506549 529248 554656 582504 612887 646022 681590 718731 756572 794374 831253
62499H31253L4924L1971K7849K2281J5617Q862K460m166j1324j8033k3140k6859
$$ 831253 866177 898148 925997 948278 963895 972757 975217 971051 959727 941694 918554 891695
62487H91695l0199l3220l4910l4825l3697l2290l0514k8066k5197k2429j9956
$$ 891695 861496 828276 793366 758541 724844 692554 662040 633974 608777 586348 566392
62476E66392j7722j5706j3809j1831r795p951o294m444k344n92K71N46R75J809
$$ 566392 548670 532964 519155 507324 497529 489578 483284 478840 476496 475904 476175 476721 477696 479505
62462D79505K691L358L997M838N733O308O416O312O377O681O934O981P172P853
$$ 479505 482196 485554 489551 494389 500122 506430 512846 519158 525535 532216 539150 546131 553303 561156
62448E61156Q657Q809Q296Q008Q419Q711P817N785L373O86k768o787j0280j2689
$$ 561156 569813 578622 586918 594926 603345 612056 619873 625658 629031 629717 626949 620162 609882 597193
62434E97193j4684j6942j8930j9519j8416j6405j4418j2870j1689j0511q962p146
$$ 597193 582509 565567 546637 527118 508702 492297 477879 465009 453320 442809 433847 426701
62422D26701n667m857m231l080j444j6P75J117J355J697K346L481M947O317P305
$$ 426701 421034 416177 411946 408866 407422 407406 408181 409298 410653 412350 414696 418177 423124 429441 436746
62407D36746P873Q001P722P396P453P798P850P275O299N237M152L123K357J858
$$ 436746 444619 452620 460342 467738 475191 482989 490839 498114 504413 509650 513802 516925 519282 521140
62393E21140J284L58q56k249l754n021n480n085m559m458m419l787k609j398j17
$$ 521140 522424 522782 521926 519677 515923 510902 505422 500337 495778 491320 486901 483114 480505 479107 478990
62378D78990J772M297O676Q313R545J1091J3176J5520J7954K0615K3587K6678
$$ 478990 480762 485059 491735 500048 509593 520684 533860 549380 567334 587949 611536 638214
62366F38214K9638L2430L5269L8377M1718M4972M7877N0614N3599N6724N8948
$$ 638214 667852 700282 735551 773928 815646 860618 908495 959109 1012708 1069432 1128380
62355A128380N9005N6494N2030M6220L8907K9712J9132Q601o29q348j5060k1139
$$ 1128380 1187385 1243879 1295909 1342129 1381036 1410748 1429880 1438481 1437852 1429504 1414444 1393305
62343A393305k6491l0909l4448l7478m0331m2884m4504m4667m3530m1633l9100
$$ 1393305 1366814 1335905 1301457 1263979 1223648 1180764 1136260 1091593 1048063 1006430 967330
62332I67330l5708l1818k8466k6139k4257k2404k1323k1623k2160k1031j8146
$$ 967330 931622 899804 871338 845199 820942 798538 777215 755592 733432 712401 694255
62321F94255j5383j4002j3187j1712r765q206o990n548m128l485l508l249k446
$$ 694255 678872 664870 651683 639971 630206 622000 615010 609462 605334 601849 598341 595092 592646
62308E92646j950k431l377l844l625l261l285l802m610n398n856n818n335m584
$$ 592646 590696 588265 584888 581044 577419 574158 570873 567071 562461 557063 551207 545389 540054 535470
62294E35470l750k933k097j131j7J092J976K530K806L046L636M805O289P536Q358
$$ 535470 531720 528787 526690 525559 525542 526634 528610 531140 533946 536992 540628 545433 551722 559258 567616
62279E67616R051R815J0364J0444J0356J0652J1492J2655J4004J5508J6993J8288
$$ 567616 576667 586482 596846 607290 617646 628298 639790 652445 666449 681957 698950 717238
62267G17238J9545K1068K2801K4405K5925K7955L0921L4449L7740M0482M3138
$$ 717238 736783 757851 780652 805057 830982 858937 889858 924307 962047 1002529 1045667
62256A045667M6246M9581N2208N3295N2609N0041M5112L7421K7502J6702O203
$$ 1045667 1091913 1141494 1193702 1246997 1299606 1349647 1394759 1432180 1459682 1476384 1482587
62245A482587l431j1838j8676k4109k8852l3401l7652m1364m4374m6193m6163
$$ 1482587 1479156 1467318 1448642 1424533 1395681 1362280 1324628 1283264 1238890 1192697 1146534
62234A146534m4502m2325m0098l6911l2051k6513k1850j8182j4655j1359r302
$$ 1146534 1102032 1059707 1019609 982698 950647 924134 902284 884102 869447 858088 848786
62223H48786q499p660o084m594m024l954l660l279l227l204k754k285k544l337
$$ 848786 840287 832627 826543 821949 817925 813971 810311 807032 803805 800601 797847 795562 793018 789681
62209G89681l685l168k356j807j320l89J041K603L958M971N598N915O288P228
$$ 789681 785996 782828 780472 778665 777345 776956 777997 780600 784558 789529 795127 801042 807330 814558
62195H14558Q891J0759J2111J2850J3671J5192J7225J9136K0662K1942K2906K3176
$$ 814558 823449 834208 846319 859169 872840 888032 905257 924393 945055 966997 989903 1013079
62183A013079K2605K1449J9942J8141J6262J4749J3796J3208J2901J3145J4058
$$ 1013079 1035684 1057133 1077075 1095216 1111478 1126227 1140023 1153231 1166132 1179277 1193335
62172A193335J5277J6533J8297K1376K5834L0616L4389L6702L8169L9448M0179
$$ 1193335 1208612 1225145 1243442 1264818 1290652 1321268 1355657 1392359 1430528 1469976 1510155
62161A510155L9186L5750L0349K3987J7356J1002N731J999q36l762o693q768j0056
$$ 1510155 1549341 1585091 1615440 1639427 1656783 1667785 1673516 1675515 1674679 1670917 1664224 1655456 1645400
62148A645400j1806j4527j6892j7394j6266j4850j3589j1703q724n305k416m68
$$ 1645400 1633594 1619067 1602175 1584781 1568515 1553665 1540076 1528373 1519649 1514344 1511928 1511460
62136A511460N69Q85R10J281K315L740N024N809O074O173O785Q406J0772J3081
$$ 1511460 1512029 1512914 1513824 1515105 1517420 1521160 1526184 1531993 1538067 1544240 1551025 1559431 1570203 1583284
62122A583284J4922J6595J8388J9916K0632K0670K0731K1221K1932K2626K3389
$$ 1583284 1598206 1614801 1633189 1653105 1673737 1694407 1715138 1736359 1758291 1780917 1804306
62111A804306K4252K4898K5102K5168K5547K6221K6914K7709K8846L0006L0461
$$ 1804306 1828558 1853456 1878558 1903726 1929273 1955494 1982408 2010117 2038963 2068969 2099430
62100B099430L0160L0010L0788L2254L3791L5298L6915L8377L9424M0618M2903
$$ 2099430 2129590 2159600 2190388 2222642 2256433 2291731 2328646 2367023 2406447 2447065 2489968
62089B489968M6331M9780N1949N2156N0343M7079M3703M1752M1933M3887M6913
$$ 2489968 2536299 2586079 2638028 2690184 2740527 2787606 2831309 2873061 2914994 2958881 3005794
62078C005794N0367N3278N4355N2786M8834M3586L8428L4719L3296L4040L6246
$$ 3005794 3056161 3109439 3163794 3216580 3265414 3309000 3347428 3382147 3415443 3449483 3485729
62067C485729L9438M3348M7203M9912N1131N1401N0874M8702M4169L7778L0692
$$ 3485729 3525167 3568515 3615718 3665630 3716761 3768162 3819036 3867738 3911907 3949685 3980377
62056C980377K3689J7154J1396O345J367l855q785j3020j7253k2316k7648l1708
$$ 3980377 4004066 4021220 4032616 4038961 4040328 4036473 4027688 4014668 3997415 3975099 3947451 3915743
62044C915743l3852l4826l5377l5316l4265l2519l0716k9073k7355k5318k2918
$$ 3915743 3881891 3847065 3811688 3776372 3742107 3709588 3678872 3649799 3622444 3597126 3574208
62033C574208k0354j8016j6196j4783j3473j2252j1289j0450r320p883o654n966
$$ 3574208 3553854 3535838 3519642 3504859 3491386 3479134 3467845 3457395 3448075 3440192 3433538 3427572
62021C427572n514m867m120l686l720l998m238m290m119l858l786m061m484m795
$$ 3427572 3422058 3417191 3413071 3409385 3405665 3401667 3397429 3393139 3389020 3385162 3381376 3377315 3372831 3368036
62007C368036n085n687o627p551q308r264j0744j2369j3459j3994j4718j6129
$$ 3368036 3362951 3357264 3350637 3343086 3334778 3325514 3314770 3302401 3288942 3274948 3260230 3244101
61995C244101j7967j9887k2152k5117k8479l1696l4760l7860m0489m1770m1741
$$ 3244101 3226134 3206247 3184095 3158978 3130499 3098803 3064043 3026183 2985694 2943924 2902183
61984B902183m1347m0991m0028l8090l6007l4679l3783l2381l0354k8372k6832
$$ 2902183 2860836 2819845 2779817 2741727 2705720 2671041 2637258 2604877 2574523 2546151 2519319
61973B519319k5614k4702k4188k3722k2641k0845j8986j7697j7078j6891j6822
$$ 2519319 2493705 2469003 2444815 2421093 2398452 2377607 2358621 2340924 2323846 2306955 2290133
61962B290133j6511j5797j4983j4472j4214j3849j3347j2998j2825j2500j1977
$$ 2290133 2273622 2257825 2242842 2228370 2214156 2200307 2186960 2173962 2161137 2148637 2136660
61951B136660j1660j1787j2008j1783j0932r717q528p579o668n335l454j500P8
$$ 2136660 2125000 2113213 2101205 2089422 2078490 2068773 2060245 2052666 2045998 2040663 2037209 2035709 2035787
61938B035787J576L607O121Q429J0274J2278J5154J8882K2909K6757L0283L3678
$$ 2035787 2037363 2040970 2047091 2055520 2065794 2078072 2093226 2112108 2135017 2161774 2192057 2225735
61926B225735L7389M1720M6506N1436N6755O3154P0948P9927R0091J01934J15713
$$ 2225735 2263124 2304844 2351350 2402786 2459541 2522695 2593643 2673570 2763661 2865595 2981308
61915B981308J31032J47611J66004J87143K11460K38863K69213L02459L38737
$$ 2981308 3112340 3259951 3425955 3613098 3824558 4063421 4332634 4635093 4973830
61906D973830L78748M23701M74266N29722N88454O48782P08436P63070Q05730
$$ 4973830 5352578 5776279 6250545 6780267 7368721 8017503 8725939 9489009 10294739
61897A0294739Q27562Q18637P68854O70359N21299L28504J07014j23073l40623
$$ 10294739 11122301 11940938 12709792 13380151 13901450 14229954 14336968 14213895 13873272
61888A3873272n27393o71286p67991q20207q35037q21024p86132p37089o79723
$$ 13873272 13345879 12674593 11906602 11086395 10251358 9430334 8644202 7907113 7227390
61879G227390o19231n59596n02846m49475l99916l55237l16173k82083k51584
$$ 7227390 6608159 6048563 5545717 5096242 4696326 4341089 4024916 3742833 3491249
61870C491249k24030j99678j78486j59567j42225j26807j13897j03010r2818q2670
$$ 3491249 3267219 3067541 2889055 2729488 2587263 2460456 2346559 2243549 2150731 2068061
61860B068061p3296o5692n9720n4175m8119m1766l6020l1403k7647k4233k0986
$$ 2068061 1994765 1929073 1869353 1815178 1767059 1725293 1689273 1657870 1630223 1605990 1585004
61849A585004j8028j5376j2863j0439q288o577n262m187l193k139j023j31K59
$$ 1585004 1566976 1551600 1538737 1528298 1520010 1513433 1508171 1503984 1500791 1498652 1497629 1497498 1497757
61836A497757L59P66J694K671L280L801M778O174P470Q327Q752Q758Q446Q369
$$ 1497757 1498116 1498882 1500576 1503247 1506527 1510328 1515106 1521280 1528750 1537077 1545829 1554587 1563033 1571402
61822A571402R158J0637J1836J2089J1768J1779J2641J4278J6322J8432K0521
$$ 1571402 1580560 1591197 1603033 1615122 1626890 1638669 1651310 1665588 1681910 1700342 1720863
61811A720863K2880K5843K9307L2792L6079L9456M3284M7613N2315N7291O2443
$$ 1720863 1743743 1769586 1798893 1831685 1867764 1907220 1950504 1998117 2050432 2107723 2170166
61800B170166O7719P3287P9472Q6466R4335J03094J12455J21728J30704J40477
$$ 2170166 2237885 2311172 2390644 2477110 2571445 2674539 2786994 2908722 3039426 3179903
61790C179903J52592J67324J83676K01202K20880K43767K69893K99132L32225
$$ 3179903 3332495 3499819 3683495 3884697 4105577 4349344 4619237 4918369 5250594
61781E250594L69982M12220M58522N09663N67209O31987P03864P82800Q69143
$$ 5250594 5620576 6032796 6491318 7000981 7568190 8200177 8904041 9686841 10555984
61772A0555984R62779J062517J165875J268198J361360J433410J469172J451008
$$ 10555984 11518763 12581280 13747155 15015353 16376713 17810123 19279295 20730303
61764B0730303J360865J185120R20909N79898J87414k21968o10838r46511j207488
$$ 20730303 22091168 23276288 24197197 24777095 24964509 24742541 24131703 23185192 21977704
61755B1977704j385706j484229j513309j487187j421324j329738j223576j111574
$$ 21977704 20591998 19107769 17594460 16107273 14685949 13356211 12132635 11021061
61747A1021061j000722q95844p99099p10749o30647n58907m95615m40350l92065
$$ 11021061 10020339 9124495 8325396 7614647 6984000 6425093 5929478 5489128 5097063
61738E097063l49429l11609k78618k50497k26157k03699j82186j62427j45663
$$ 5097063 4747634 4436025 4157407 3906910 3680753 3477054 3294868 3132441 2986778
61729B986778j31910j20077j09234r9211r0250q2602p6303p0976o5982o1055n6579
$$ 2986778 2854868 2734791 2625557 2526346 2436096 2353494 2277191 2206215 2140233 2079178 2022599
61718B022599n2939m9900m6996m4220m1793l9441l6547l3081k9857k7628k6263
$$ 2022599 1969660 1919760 1872764 1828544 1786751 1747310 1710763 1677682 1647825 1620197 1593934
61707A593934k5039k3506k1815k0297j9039j7986j7256j7031j7070j6680j5509
$$ 1593934 1568895 1545389 1523574 1503277 1484238 1466252 1448996 1431965 1414895 1398215 1382706
61696A382706j4191j3739j4305j4959j4776j3754j2544j1692j1357j1392j1410
$$ 1382706 1368515 1354776 1340471 1325512 1310736 1296982 1284438 1272746 1261389 1249997 1238587
61685A238587j1079j0578j0453j0812j1026j0538r637r013q882q930q965r053
$$ 1238587 1227508 1216930 1206477 1195665 1184639 1174101 1164464 1155451 1146569 1137639 1128674 1119621
61673A119621r128q947q472p931p493p188p126p408p806p853p404o842o616o805
$$ 1119621 1110493 1101546 1093074 1085143 1077650 1070462 1063336 1055928 1048122 1040269 1032865 1026023 1019407 1012602
61659A012602p135p225o746n652m326l225k362j369k22N00M13jR1P40J204J057
$$ 1012602 1005467 998242 991496 985844 981518 978293 975931 974562 974340 974840 975253 975252 975343 976083 977287 978344
61643I78344P94J085J792K230K127J925K102K650L235L556L460L004K572K544
$$ 978344 979138 980223 982015 984245 986372 988297 990399 993049 996284 999840 1003300 1006304 1008876 1011420
61629A011420K713K437J553P27M69K85o58k231l484l983m347n184o167o591o437
$$ 1011420 1014133 1016570 1018123 1018850 1019319 1019604 1018946 1016715 1013231 1009248 1004901 999717 993550 986959 980522
61614I80522o370o804p427p695p512p272p317p542p569p233o840o788p103p348
$$ 980522 974152 967348 959921 952226 944714 937442 930125 922583 915014 907781 900941 894153 887050 879702
61600H79702p031o016m677l615l059k564j498M2J224J575J698K513M100N761O987
$$ 879702 872671 866655 861978 858363 855304 852740 851242 851284 852508 854083 855781 858294 862394 868155 875142
61585H75142P765Q114P993P733Q013R155J0814J2415J3638J4444J5047J5852J7153
$$ 875142 882907 891021 899014 906747 914760 923915 934729 947144 960782 975226 990273 1006125 1023278
61572A023278J8863K0825K3152K5821K8091K9096K9049K9122L0039L1411L2583
$$ 1023278 1042141 1062966 1086118 1111939 1140030 1169126 1198175 1227297 1257336 1288747 1321330
61561A321330L3325L3411L2290K9793K6670K3913K1968K0874K0647K0927K0777
$$ 1321330 1354655 1388066 1420356 1450149 1476819 1500732 1522700 1543574 1564221 1585148 1605925
61550A605925J9463J7229J4798J2370R575O214K523j134m463p239r508j1560j3478
$$ 1605925 1625388 1642617 1657415 1669785 1679360 1685574 1688097 1686963 1682500 1675261 1665753 1654193 1640715
61537A640715j4935j5736j6225j6760j7088j6633j5216j3079j0440p510m624j929
$$ 1640715 1625780 1610044 1593819 1577059 1559971 1543338 1528122 1515043 1504603 1497093 1492469 1490540
61525A490540R05M175P617J0819J3922J7466K1754K6833L2797L9490M6320N2975
$$ 1490540 1491445 1495620 1503237 1514056 1527978 1545444 1567198 1594031 1626828 1666318 1712638 1765613
61513A765613O0169O8817P8779Q9152R9781J11407J24361J38121J52521J68380
$$ 1765613 1825782 1894599 1973378 2062530 2162311 2273718 2398079 2536200 2688721 2857101
61503B857101J86312K05702K25428K44881K63446K79483K90573K94510K89353
$$ 2857101 3043413 3249115 3474543 3719424 3982870 4262353 4552926 4847436 5136789
61494E136789K72956K43593K01419J48968R0102K8897l0713q5099j31440j68095
$$ 5136789 5409745 5653338 5854757 6003725 6093827 6122724 6092011 6006912 5875472 5707377
61484E707377j94569k11375k19865k21565k17432k08044j94590j79059j63047
$$ 5707377 5512808 5301433 5081568 4860003 4642571 4434527 4239937 4060878 3897831
61475C897831j46768j29724j12093r4844p8661o3347m8489l4156k0712q316L135
$$ 3897831 3751063 3621339 3509246 3414402 3335741 3272394 3223905 3189749 3169037 3160721 3163856
61464C163856J3699K3327L1969L9597M6255N2075N7014O0553O2023O1383N9309
$$ 3163856 3177555 3200882 3232851 3272448 3318703 3370778 3427792 3488345 3550368 3611751 3671060
61453C671060N6402N2878M9199M6317M4658M3474M1969M0706M0964M2984M5822
$$ 3671060 3727462 3780340 3829539 3875856 3920514 3963988 4005957 4046663 4087627 4130611 4176433
61442D176433M8812N2005N5057N6944N7226N6543N5201N2300M7076M0246L2914
$$ 4176433 4225245 4277250 4332307 4389251 4446477 4503020 4558221 4610521 4657597 4697843 4730757
61431D730757K4876J5264M461n927j5069k3606l2111l9993m6343n1001n4105n5346
$$ 4730757 4755633 4770897 4775358 4769431 4754362 4730756 4698645 4658652 4612309 4561308 4507203 4451857
61419D451857n4403n1721m8148m4027l9156l3532k7503k1301j4917q613l057J226
$$ 4451857 4397454 4345733 4297585 4253558 4214402 4180870 4153367 4132066 4117149 4108536 4105479 4106705
61407D106705M252O290P391P368O055L361o84n675j0693j4802j7621j9145j9043
$$ 4106705 4110957 4117247 4124638 4132006 4138061 4141422 4140738 4135063 4124370 4109568 4091947 4072802 4053759
61394D053759j6581j1414l984N177J6157K9272M4261O0546P8118R7438J18345
$$ 4053759 4037178 4025764 4021780 4026957 4043114 4072386 4116647 4177193 4255311 4352749 4471094
61383D471094J39822J61197J83014K06167K30446K54417K76506K95572L10382
$$ 4471094 4610916 4772113 4955127 5161294 5391740 5646157 5922663 6218235 6528617
61374F528617L18957L18773L07528K83752K47176J98937J41766P9762J7545m0981
$$ 6528617 6847574 7166347 7473875 7757627 8004803 8203740 8345506 8425268 8442813 8401832
61364H401832r3447j38973j77677k10238k37488k59785k76805k88255k94584k96599
$$ 8401832 8308385 8169412 7991735 7781497 7544009 7284224 7007419 6719164 6424580 6127981
61354F127981k94424k87622k76444k62397k47202k31645k15756j99594j83377
$$ 6127981 5833557 5545935 5269491 5007094 4759892 4528247 4312491 4112897 3929520
61345C929520j67106j50563j33671j16640r9911q4105o9681n6522m4072l2056
$$ 3929520 3762414 3611851 3478180 3361540 3261629 3177524 3107843 3051321 3007249 2975193
61335B975193k0677r961N12J0859K0382K8325L4854M0722M6177N0715N3825N5478
$$ 2975193 2954516 2944555 2945067 2955926 2976308 3004633 3039487 3080209 3126386 3177101 3230926 3286404
61323C286404N6009N5852N5312N4234N1972M8139M3311L8659L4899L1899K9231
$$ 3286404 3342413 3398265 3453577 3507811 3559783 3607922 3651233 3689892 3724791 3756690 3785921
61312C785921K6683K4263K2044K0112J8422J6590J3920R725L815l188j0118j6263
$$ 3785921 3812604 3836867 3858911 3879023 3897445 3914035 3927955 3937680 3941495 3938307 3928189 3911926
61300C911926k2149k8810l6246m3159m8495n2591n6343n9892o2771o4833o6208
$$ 3911926 3889777 3860967 3824721 3781562 3733067 3680476 3624133 3564241 3501470 3436637 3370429
61289C370429o6637o5605o3090n9542n5183m9935m3957l7715l1559k5640k0141
$$ 3370429 3303792 3238187 3175097 3115555 3060372 3010437 2966480 2928765 2897206 2871566 2851425
61278B851425j5169j0682o934m706m438n498o963q849j1603j4766j7126j8210
$$ 2851425 2836256 2825574 2818640 2813934 2809496 2803998 2797035 2788186 2776583 2761817 2744691 2726481
61266B726481j8487j8063j6332j3264r843o662l048J720P228J2757J8646K5893
$$ 2726481 2707994 2689931 2673599 2660335 2650492 2643830 2640782 2642502 2649730 2662487 2681133 2707026
61254B707026L4897M5361N7033O9645Q2452R4787J06912J19387J31502J41244
$$ 2707026 2741923 2787284 2844317 2913962 2996414 3091201 3198113 3317500 3449002 3590246
61244C590246J46986J48346J44942J35142J16801Q9072N3057J1140l3583p7391
$$ 3590246 3737232 3885578 4030520 4165662 4282463 4371535 4424592 4435732 4402149 4324758
61234D324758j16409j47761j70271j84088j89961j89077j83101j73748j62198
$$ 4324758 4208349 4060588 3890317 3706229 3516268 3327191 3144090 2970342 2808144
61225B808144j49186j35571j22365j10134r8713q7750p7317o7818n9512n2346
$$ 2808144 2658958 2523387 2401022 2290888 2192175 2104425 2027108 1959290 1899778 1847432
61215A847432m6064m0342l5023l0303k6455k3155j9444j4680r306m276N1M022
$$ 1847432 1801368 1761026 1726003 1695700 1669245 1646090 1626646 1611966 1602660 1598384 1598435 1602457
61203A602457P833J1151J3728J5972J8473K1091K2832K2720K0689J7467J3655
$$ 1602457 1610290 1621441 1635169 1651141 1669614 1690705 1713537 1736257 1756946 1774413 1788068
61192A788068R222M062j234n610q533j0358j1751j3177j4959j7238j9596k1228
$$ 1788068 1797290 1801352 1800118 1794508 1785975 1775617 1763866 1750689 1735730 1718492 1698896 1677668
61180A677668k1871k2206k3054k4467k5929k7061k7754k7927k7612k7048k6410
$$ 1677668 1655797 1633591 1610537 1586070 1560141 1533080 1505326 1477399 1449787 1422739 1396329
61169A396329k5730k5243k5416k6369k7622k8749k9694l0225k9692k8028k6275
$$ 1396329 1370599 1345356 1319940 1293571 1265949 1237200 1207506 1177281 1147589 1119561 1093286
61158A093286k5400k4978k3895k1917j9682j7508j5268j3368j2759j3720j5446
$$ 1093286 1067886 1042908 1019013 997096 977414 959906 944638 931270 918511 904791 889345
61147H89345j7060j8409j9637k0579k0895k0373j8924j6618j3829j1039q463o142
$$ 889345 872285 853876 834239 813660 792765 772392 753468 736850 723021 711982 703519 697377
61135F97377m261k946j925q45K21J110K197M052O463Q448R328R323R098R219R994
$$ 697377 693116 690170 688245 687400 687621 688731 690928 694980 701443 709891 719219 728542 737640 746859 756853
61120G56853J1307J2535J3081J3033J2916J2930J2921J2910J3089J3343J3369
$$ 756853 768160 780695 793776 806809 819725 832655 845576 858486 871575 884918 898287
61109H98287J3171J2963J2682J2077J1100R681P447M252P09k553n732r129j1933
$$ 898287 911458 924421 937103 949180 960280 969961 977408 981660 982369 979816 974084 964955 953022
61096I53022j2945j2360j1644j1598j1674j1386j1160j1347j1539j1406j1362
$$ 953022 940077 927717 916073 904475 892801 881415 870255 858908 847369 835963 824601
61085H24601j1756j2159j2001j1366j0649r963r291q740q318p816p168o443n448
$$ 824601 812845 800686 788685 777319 766670 756707 747416 738676 730358 722542 715374 708931 703483
61072G03483l941k267j159o91j99O53J462J928K258K479K219J525J112J338J656
$$ 703483 699542 697275 696116 695425 695226 695879 697341 699269 701527 704006 706225 707750 708862 710200 711856
61057G11856J522J198J194J483J702J658J254M73l32o19l35J27P22J803L226M254
$$ 711856 713378 714576 715770 717253 718955 720613 721867 722340 722008 721389 721054 721181 721903 723706 726932 731186
61041G31186M668N217O525Q218R506J0084J0111R933J0085J0993J2390J3562J4296
$$ 731186 735854 741071 747596 755814 765320 775404 785515 795448 805533 816526 828916 842478 856774
61028H56774J4939J5513J5635J5364J5187J4995J4074J2481J1374J1545J2511
$$ 856774 871713 887226 902861 918225 933412 948407 962481 974962 986336 997881 1010392
61017A010392J3455J4252J5066J5853J6620J7608J8841K0280K2329K5293K8380
$$ 1010392 1023847 1038099 1053165 1069018 1085638 1103246 1122087 1142367 1164696 1189989 1218369
61006A218369L0472L1959L4451L8509M3111M7717N3126N9589O5686P0011P2814
$$ 1218369 1248841 1280800 1315251 1353760 1396871 1444588 1497714 1557303 1622989 1693000 1765814
60995A765814P5278P8371Q3114R0660J01324J14619J30573J49570J70639J91762
$$ 1765814 1841092 1919463 2002577 2093237 2194561 2309180 2439753 2589323 2759962 2951724
60985B951724K12580K35011K60743K90241L24964L68167M22623M89895N72475
$$ 2951724 3164304 3399315 3660058 3950299 4275263 4643430 5066053 5555948 6128423
60976F128423O73637P94641R36445J106370J319786J594230J944511K373975K841391
$$ 6128423 6802060 7596701 8533146 9639516 10959302 12553532 14498043 16872018 19713409
60967A9713409L215340L284455K873304J996545R01889o3356o49474p93882n66650
$$ 19713409 22928749 26213204 29086508 31083053 31984942 31921586 31272112 30478230 29911580
60958B9911580r1575M56489Q29100P72904J87303p76393j794016k567150k968394
$$ 29911580 29820005 30276494 31105594 31878498 32065801 31289408 29495392 26928242 23959848
60949B3959848l036079k877057k589931k247647j903542j590111j318219j087130
$$ 23959848 20923769 18046712 15456781 13209134 11305592 9715481 8397262 7310132
60941G310132q94747p37840o09662n03629m17431l50632l00411k62267k32862
$$ 7310132 6415385 5677545 5067883 4564254 4146823 3796191 3495780 3233513 3000651
60932C000651k09791j90344j72750j57228j43939j31390j18301j05404r3720q2799
$$ 3000651 2790860 2600516 2427766 2270538 2126599 1995209 1876908 1771504 1677784 1594985
60922A594985p2440o4419o0341n9026n7943n6203n4318n2100m8825m4819m1038
$$ 1594985 1522545 1458126 1397785 1338759 1280816 1224613 1170295 1118195 1069370 1024551 983513
60911I83513l7438l3292k8762k4769k1689j9252j7304j5662j3835j1828j0452
$$ 983513 946075 912783 884021 859252 837563 818311 801007 785345 771510 759682 749230
60900G49230r952r248p550n730m785m027k246J84J971K992M062N220N882O339
$$ 749230 739278 730030 722480 716750 711965 707938 705692 705876 707847 710839 714901 720121 726003 732342
60886G32342P363Q530Q604P592O794O635N954L895J210r43k559m438o819r008
$$ 732342 739705 748235 756839 764431 771225 777860 783814 787709 788919 787976 785417 780979 774160 765152
60872G65152j0170j0249j0019j0190j0516j0212r217q340q009p710p011o221n438
$$ 765152 754982 744733 734714 724524 714008 703796 694579 686239 678230 670520 663509 657288 651850
60859F51850m057j909M6J119K017L537N158O060O702P938R364J0156J0881J2807
$$ 651850 647793 645884 645930 647049 649066 652603 657761 663821 670523 678461 687825 697981 708862 721669
60845G21669J5669J7856J8729J9245K0244K1568K2915K4152K4495K2897J9517
$$ 721669 737338 755194 773923 793168 813412 834980 857895 882047 906542 929439 948956
60834I48956J5694J2242Q982O084M423M112M046L526L133L261K966J209j508l703
$$ 948956 964650 976892 985874 991958 996381 1000493 1004539 1008065 1011198 1014459 1017425 1018634 1017126 1013423
60820A013423m634m728m778n298o390p730q896r937j1225j2621j3426j3419j3296
$$ 1013423 1008789 1004061 999283 993985 987595 979865 970969 961032 949807 937186 923760 910341 897045
60807H97045j3681j4252j4386j4116j3889j3731j3211j2010j0181q012n916m251
$$ 897045 883364 869112 854726 840610 826721 812990 799779 787769 777588 769576 763660 759409
60795G59409k982j750m43O50J440K455M256O658Q859J0259J0926J1423J2276J3572
$$ 759409 756427 754677 754234 754884 756324 758779 763035 769693 778552 788811 799737 811160 823436 837008
60781H37008J4924J5933J6647J7384J8209J8843J9079J8975J8574J7805J6737
$$ 837008 851932 867865 884512 901896 920105 938948 958027 977002 995576 1013381 1030118
60770A030118J5650J4685J3614J2089J0059P950O448N921N930N587M568L444K705
$$ 1030118 1045768 1060453 1074067 1086156 1096215 1104165 1110613 1116534 1122464 1128051 1132619 1136063 1138768
60757A138768J989P72o45j620k285l308m624n418n310m696l815k547j323j142
$$ 1138768 1140757 1141529 1140884 1139264 1136979 1133671 1129047 1123629 1118319 1113623 1109808 1107261 1105938 1104796
60743A104796k135l173l502l851n071o627p499p880q727r945j0401r721q854q556
$$ 1104796 1102661 1099488 1095986 1092135 1087064 1080437 1072938 1065058 1056331 1046386 1035985 1026264 1017410 1008854
60729A008854q423p837o957o146n066l196q27J169K418L294M080M541M427L958
$$ 1008854 1000431 992594 985637 979491 974425 971229 970402 971571 973989 977283 981363 985904 990331 994289
60715I94289L479K913J882L67j060j765j780j889k839m475n829o104n445m550
$$ 994289 997768 1000681 1002563 1002930 1001870 1000105 998325 996436 993597 989122 983293 977189 971744 967194
60701I67194l805l127k493k144k122k112k007k263l315m918o517q018r720j1626
$$ 967194 963389 960262 957769 955625 953503 951391 949384 947121 943806 938888 932371 924353 914633 903007
60687I03007j3383j4844j6115j6962j6815j5643j4303j3639j3581j3505j3087
$$ 903007 889624 874780 858665 841703 824888 809245 794942 781303 767722 754217 741130
60676G41130j2324j1055r023o443l992k113o75O03J697K439K919L447M139M778
$$ 741130 728806 717751 708728 702285 698293 696180 695505 696108 697805 700244 703163 706610 710749 715527
60662G15527N075N014M762M357L695K829K122J912K167K603K973L137L074L021
$$ 715527 720602 725616 730378 734735 738430 741259 743381 745293 747460 750063 753036 756173 759247 762268
60648G62268L374M175M951N356N688O293O809O672O116N977O490P062P306P523
$$ 762268 765642 769817 774768 780124 785812 792105 798914 805586 811702 817679 824169 831231 838537 846060
60634H46060P950Q370Q774R714J1513J3613J5206J6085J6530J6802J7055J7311
$$ 846060 854010 862380 871154 880868 892381 905994 921200 937285 953815 970617 987672 1004983
60622A004983J7292J6682J5705J4806J3664J1342P777M139J232j526m749p696
$$ 1004983 1022275 1038957 1054662 1069468 1083132 1094474 1102251 1106390 1107622 1106096 1101347 1093651
60610A093651r293r826j0381j1070j1008r835q081o102l822j589k67k59j251l001
$$ 1093651 1084358 1074532 1064151 1053081 1042073 1032238 1024157 1018055 1014233 1012644 1012377 1012118 1010867 1007866
60596A007866n583q628j1201j2727j3390j3397j2564j0842q732o784n146l763
$$ 1007866 1002283 993655 982454 969727 956337 942940 930376 919534 910802 904018 898872 895109
60584H95109k525j146M92J772J750M60q41j059m05K23M01L70M50Q04J470K219
$$ 895109 892584 891438 891930 893702 895452 895912 895071 894012 893607 893830 894231 894601 895051 895855 897325 899544
60568H99544K634K729L196M546O181O827N913M105K347Q51p00k369l858n103o348
$$ 899544 902178 904907 908103 912649 918830 925657 931570 935675 938022 938873 938173 935804 931946 926843 920495
60553I20495p439p641o640n333m862n036m567k857o58J274L133N168O859P924
$$ 920495 913056 905415 898775 893442 888580 883544 878977 876120 875462 876736 879869 885037 891896 899820
60539H99820R383J2452J6861K1373K5693L0638L6467M2213M6799M9716N0260M7188
$$ 899820 909203 921655 938516 959889 985582 1016220 1052687 1094900 1141699 1191415 1241675 1288863
60527A288863L9796K8742J5391R80j3140k5204l3719l8300l9425l7675l3609k7953
$$ 1288863 1328659 1357401 1372792 1373772 1360632 1335428 1301709 1263409 1223984 1186309 1152700 1124747
60515A124747k1414j4434p421j070L952P509R856J1122J1206J0243Q938Q196Q467
$$ 1124747 1103333 1088899 1081478 1080408 1084360 1091869 1101725 1112847 1124053 1134296 1143234 1151430 1159897
60502A159897R521J0999J3074J6307K0895K6429L2518L9249M6796N5131O4455
$$ 1159897 1169418 1180417 1193491 1209798 1230693 1257122 1289640 1328889 1375685 1430816 1495271
60491A495271P5397Q8013J01039J12917J23431J33645J44408J55904J68646J84151
$$ 1495271 1570668 1658681 1759720 1872637 1996068 2129713 2274121 2430025 2598671 2782822
60481B782822K04364K30926K64789L05306L48822L88370M14951M19276L93471
$$ 2782822 2987186 3218112 3482901 3788207 4137029 4525399 4940350 5359626 5753097
60472E753097L33500K41442J25247m056j34731k54696l52140m18517m51787m56376
$$ 5753097 6086597 6328039 6453286 6449230 6314499 6059803 5707663 5289146 4837359 4380983
60462D380983m39884m09687l71614l30070k88449k49259k14046j83308j56790
$$ 4380983 3941099 3531412 3159798 2829728 2541279 2292020 2077974 1894666 1737876
60453A737876j34101j15002r9127q5863p4682o5286n7248m9875m2774l6251l0891
$$ 1737876 1603775 1488773 1389646 1303783 1229101 1163815 1106567 1056692 1013918 977667 946776
60442I46776k6894k4124k2399k1444k0739j9798j8525j7131j5843j4830j4118
$$ 946776 919882 895758 873359 851915 831176 811378 792853 775722 759879 745049 730931
60431G30931j3420j2305j0814r498q594p576o024m503l891m059l999l347k932
$$ 730931 717511 705206 694392 684894 676300 668724 662700 658197 654306 650247 646248 642901 639969
60418F39969l425m069l476j451O68J574J369J167J742K949M176M818M479L304
$$ 639969 636544 632475 628999 627548 628216 629790 631159 632326 634068 637017 641193 646011 650490 653794
60404F53794K202K174L097L738L337K648K882M019M988N290N604O531P563P719
$$ 653794 655996 658170 661267 665005 668342 670990 673872 677891 682879 688169 693773 700304 707867 715586
60390G15586O815N610M816M344L589K314J049M33K71l66j897l492m052l594l142
$$ 715586 722401 728011 732827 737171 740760 743074 744123 744556 744827 744461 742564 739072 735020 731426 728284
60375G28284l403m098m529m221l071j411l4L83Pm26n58o10o44l48L07Q38J028
$$ 728284 724881 720783 716254 712033 708962 707551 707517 707900 707907 707481 706923 706313 705669 705321 705628 706466 707494
60358G07494J297J920K473K542K564L210M223M597L977L187L161L828M570N371
$$ 707494 708791 710711 713184 715726 718290 721500 725723 730320 734297 737484 740645 744473 749043 754414
60344G54414O736Q489R492R112Q309Q399R141R121P874O387N262L868J944O81
$$ 754414 761150 769639 779131 788243 796552 804951 814092 823213 831087 837474 842736 846604 848548 849229
60330H49229J005J936K053J766K531M375N926O639P184P566O764M640K508J041
$$ 849229 850234 852170 854223 855989 858520 862895 868821 875460 882644 890210 896974 901614 904122 905163
60316I05163q19l969p378r344r505q649p335n813m635m196l928k900j047Q28K110
$$ 905163 904344 900375 892997 883653 874148 865499 858164 852351 847716 843520 839592 836692 835645 836473 838583
60301H38583K756K893K606K150J918K271L401N125O720P482P543P642P978P965
$$ 838583 841339 844232 846838 848988 850906 853177 856578 861703 868423 875905 883448 891090 899068 907033
60287I07033P313O527N977N267M064K804J990J462R73Q74J497K437L071L391L644
$$ 907033 914346 920873 926850 932117 936181 938985 940975 942437 943410 944284 945781 948218 951289 954680 958324
60272I58324L723L569L735M747O256P543Q543R758J1429J3420J5623J7884J9855
$$ 958324 962047 965616 969351 974098 980354 987897 996440 1006198 1017627 1031047 1046670 1064554 1084409
60259A084409K1544K3636K6617K9941L2826L5523L8999M3553M8556N3481N8449
$$ 1084409 1105953 1129589 1156206 1186147 1218973 1254496 1293495 1337048 1385604 1439085 1497534
60248A497534O3838O9994P7236Q5509R4060J02077J09604J17286J25237J32760
$$ 1497534 1561372 1631366 1708602 1794111 1888171 1990248 2099852 2217138 2342375 2475135
60238B475135J39081J43700J45965J45012J40491J32931J23170J11651R8308Q2965
$$ 2475135 2614216 2757916 2903881 3048893 3189384 3322315 3445485 3557136 3655444 3738409
60228C738409O5777M7520K9303J1849m833k0836l5617m8133n7587o3747o6716
$$ 3738409 3804186 3851706 3881009 3892858 3888025 3867189 3831572 3783439 3725852 3662105 3595389
60217C595389o6682o3812n8192n0057m0022k8825j6631l133J1456K6168M0432
$$ 3595389 3528707 3464895 3406703 3356646 3316624 3287799 3271168 3268035 3279491 3305659 3346091
60206C346091N4853P0203Q6030J00998J14347J26224J36690J45017J50025J50719
$$ 3346091 3400944 3471147 3557177 3658175 3772522 3898746 4035436 4180453 4330478 4481197
60196D481197J46599J37838J25111J09033Q9894O8210M5173K2044p42k3415m5966
$$ 4481197 4627796 4765634 4890745 4999778 5089672 5157882 5203055 5225099 5224357 5200942 5154976
60185E154976o7694q7425j03785j15582j22395j24703j23113j17730j08626r6504
$$ 5154976 5087282 4999857 4896072 4780490 4658095 4533392 4410279 4292549 4183923 4087419
60175D087419q2358o6715m9734l1700j3003O183K5532M4117O0925P5721Q8746
$$ 4087419 4005061 3938346 3888612 3856912 3843909 3850092 3875624 3919741 3980666 4056387 4145133
60164D145133R9589J06913J09452J06968J00151Q9957P7104O1988M5005K6947
$$ 4145133 4244722 4351635 4461087 4568055 4668206 4758163 4835267 4897255 4942260 4969207
60154D969207Q857q387k4011l6879m5738n0174n0696m7651m0690k9727j5700K65
$$ 4969207 4978064 4969677 4945666 4908787 4863049 4812875 4762179 4714528 4673838 4644111 4628411 4628676
60142D628676J7850L7031N7146P7335R7527J18389J40468J64014J89210K15985
$$ 4628676 4646526 4683557 4740703 4818038 4915565 5033954 5174422 5338436 5527646 5743631
60132E743631K43811K72179L00857L29302L56416L81349M03771M22688M35879
$$ 5743631 5987442 6259621 6560478 6889780 7246196 7627545 8031316 8454004 8889883
60123H889883M41398M38907M28561M09519L80997L44127L01188K53280K00236
$$ 8889883 9331281 9770188 10198749 10608268 10989265 11333392 11634580 11887860 12088096
60114A2088096J42675Q2493K1261m0456j01916j61682k18549k71608l18957l57597
$$ 12088096 12230771 12313264 12334525 12294069 12192153 12030471 11811922 11540314 11221357 10863760
60104A0863760l85265m01532m06789m01294l85716l61591l30584k94057k53773
$$ 10863760 10478495 10076963 9670174 9268880 8883164 8521573 8190989 7896932 7643159
60095G643159k12017j70243j28316q5818m3563l202L4160O8204R8587J24467J44709
$$ 7643159 7431142 7260899 7132583 7046765 7003202 7000000 7034160 7102364 7200951 7325418 7470127
60084G470127J58171J63976J61802J51755J34055J09176P8371M3628P078k9196
$$ 7470127 7628298 7792274 7954076 8105831 8239886 8349062 8427433 8471061 8478139 8448943
60074H448943o3078r3030j19016j42119j62959j81091j95972k07657k16125k20791
$$ 8448943 8385865 8292835 8173819 8031700 7868741 7687650 7491678 7284021 7067896 6847105
60064F847105k21360k18583k13386k05645j94449j79498j61676j42292j22098
$$ 6847105 6625745 6407162 6193776 5988131 5793682 5614184 5452508 5310216 5188118
60055E188118j01131p9249n6645l3793j0981J1821L4586N6996P8772R9863J19844
$$ 5188118 5086987 5007738 4951093 4917300 4906319 4918140 4952726 5009722 5088494 5188357 5308201
60044E308201J37505J51439J60768J64815J62650J53718J38709J19008R5454O8393
$$ 5308201 5445706 5597145 5757913 5922728 6085378 6239096 6377805 6496813 6592267 6660660
60034F660660L8745Q036k2651n3023q2749j10953j36396j57573j72940j81930
$$ 6660660 6699405 6707441 6684790 6631767 6549018 6438065 6301669 6144096 5971156 5789226
60024E789226j85565j85155j80670j71424j58018j42227j25046j06305q6274o6002
$$ 5789226 5603661 5418506 5237836 5066412 4908394 4766167 4641121 4534816 4448542 4382540
60014D382540m5787k4936l563J7042L6681N7190P9902J03496J25851J46852J67765
$$ 4382540 4336753 4311817 4308254 4325296 4361977 4419167 4499069 4602565 4728416 4875268 5043033
60003E043033J88440K06838K20975K29902K32758K28263K15614J95217J68394
$$ 5043033 5231473 5438311 5659286 5889188 6121946 6350209 6565823 6761040 6929434
59994F929434J36914J02707O7299L1346m961m1127p6263j09386j39219j63946
$$ 6929434 7066348 7169055 7236354 7267700 7262739 7221612 7145349 7035963 6896744 6732798
59984F732798j81868j92390j96021j93592j85784j73238j56574j36412j13670
$$ 6732798 6550930 6358540 6162519 5968927 5783143 5609905 5453331 5316919 5203249
59975E203249q9676o5581m1691j7709O463L0256N2610P2476Q9427J03912J16595
$$ 5203249 5113573 5047992 5006301 4988592 4995055 5025311 5077921 5150397 5239824 5343736 5460331
59964E460331J27251J34751J38280J38059J34639J28014J17982J04911Q9657P3024
$$ 5460331 5587582 5722333 5860613 5998672 6133311 6261325 6379307 6484218 6573875 6646899
59954F646899N5795L8953K3361R369k829j2632j9062k1224j8500j0674J885J8477
$$ 6646899 6702694 6741647 6765008 6774377 6771548 6758916 6739854 6718630 6700130 6689456 6691341 6709818
59942F709818L8839O3341R2145J24585J59764J97427K37681K80181L23952L67741
$$ 6709818 6748657 6811998 6904143 7028728 7188492 7385919 7623600 7903781 8227733 8595474
59932H595474M10078M49123M82891N09371N26121N29882N17081M84740M31062
$$ 8595474 9005552 9454675 9937566 10446937 10973058 11502940 12020021 12504761 12935823
59923A2935823L55857K61266J52153L5246q2408j94404k95057l79438m44006m87423
$$ 12935823 13291680 13552946 13705099 13740345 13657937 13463533 13168476 12789038 12345032 11857609
59913A1857609n10793n16843n08521m88230m58226m21157l79636l35480k89879
$$ 11857609 11346816 10829973 10321452 9833222 9374996 8953839 8574203 8238723 7948844
59904G948844k44084j99211j55486j12550p0567l0225Q462M6279Q3411J18710
$$ 7948844 7704760 7505549 7350063 7237513 7166946 7136721 7145183 7191462 7274873 7393583
59894G393583J50845J79338K03935K23602K36728K41599K36142K18052J86161
$$ 7393583 7544428 7723766 7927701 8151303 8388031 8629630 8865772 9083824 9269985
59885I269985J41576Q6857K4584m2688j11550j77854k37802k88598l28363l56059
$$ 9269985 9411561 9498418 9523002 9480314 9368764 9190910 8953108 8664510 8336147 7980088
59875G980088l71642l75943l70476l57339l38849l16781k92122k65642k38372
$$ 7980088 7608446 7232503 6862027 6504688 6165839 5849058 5556936 5291294 5052922
59866E052922k11283j85012j60059j36886j15619r6298p9670o7068n9092n4919
$$ 5052922 4841639 4656627 4496568 4359682 4244063 4147765 4068095 4001027 3941935 3887016
59856C887016n3304n3610n5398n7686n9300n9510n7870n3976m7885m0272l1700
$$ 3887016 3833712 3780102 3724704 3667018 3607718 3548208 3490338 3436362 3388477 3348205 3316505
59845C316505k2311j2754m749P8J386m40n363j3316k3196l3218m2135m9480n4851
$$ 3316505 3294194 3281440 3276691 3276769 3278155 3277715 3272352 3259036 3235840 3202622 3160487 3111007 3056156
59832C056156n7764n8017n5700n0999m4461l7101k9663k2079j4111o021J920J0067
$$ 3056156 2998392 2940375 2884675 2833676 2789215 2752114 2722451 2700372 2686261 2680240 2682160 2692227
59820B692227J8837K7931L6752M5049N2434N7915O1084O3327O6674P1479P6306
$$ 2692227 2711064 2738995 2775747 2820796 2873230 2931145 2992229 3055556 3122230 3193709 3270015
59809C270015P9952Q2428Q3640Q2178P6084O4561M8781L1327J4978J526q494j5083
$$ 3270015 3349967 3432395 3516035 3598213 3674297 3738858 3787639 3818966 3833944 3835470 3826976 3811893
59797C811893j8141j7756j4541r137j614Q171K0015L3542M8596O4894Q1828R9334
$$ 3811893 3793752 3775996 3761455 3752318 3750704 3758875 3778890 3812432 3861028 3925922 4007750 4107084
59785D107084J18506J40663J66032J94162K25187K59799K98153L39660L83571
$$ 4107084 4225590 4366253 4532285 4726447 4951634 5211433 5509586 5849246 6232817
59776F232817M28492M70763N03457N16897N00217M44248L45977K12300N9476r2013
$$ 6232817 6661309 7132072 7635529 8152426 8652643 9096891 9442868 9655168 9714644 9622631
59766I622631k23858l24179l88767m19785m23035m05422l73821l34609k92833
$$ 9622631 9398773 9074594 8685827 8266042 7843007 7437585 7063764 6729155 6436322
59757F436322k51535k12182j75531j41821j10797q2364n6891l4292j3369P049
$$ 6436322 6184787 5972605 5797074 5655253 5544456 5462092 5405201 5370909 5357540 5364589
59747E364589K6829M5346O3096Q1335J00320J19218J37814J57092J77897K00080
$$ 5364589 5391418 5436764 5499860 5581195 5681515 5800733 5938547 6095639 6273536 6473616
59737F473616K23234K47472K73123L00422L29733L61541L96052M33244M73205
$$ 6473616 6696850 6944322 7217445 7517867 7847600 8209141 8605193 9038437 9511642
59728I511642N15759N59877O04215O48028O90543P29400P60611P80344P86001
$$ 9511642 10027401 10587278 11191493 11839521 12530064 13259464 14020075 14800419 15586420
59719A5586420P75909P49344P07617O54594N95868N37915M87606M51007M31676
$$ 15586420 16362329 17111673 17819290 18473884 19069752 19607667 20095273 20546280 20977956
59710B0977956M30362M46240M77578N21051N71515O23044O69625P04887P22424
$$ 20977956 21408318 21854558 22332136 22853187 23424702 24047746 24717371 25422258 26144682
59701B6144682P17271O86761O29914N47207M41636L19317J88145N6143o8757j78617
$$ 26144682 26861953 27548714 28178628 28725835 29167471 29486788 29674933 29731076 29662319 29483702
59691B9483702k66712l29095l64574l73522l57276l18372k60399j87075j01460
$$ 29483702 29216990 28887895 28523321 28149799 27792523 27474151 27213752 27026677 26925217
59682B6925217n964R7229K06050L18992M35541N55674O78532Q01594R21124J032743
$$ 26925217 26919253 27016482 27222532 27541524 27977065 28532739 29211271 30012865 30933989 31966732
59672C1966732J130800J207398J252681J256008J206718J095103R15191O68482
$$ 31966732 33097532 34304930 35557611 36813619 38020337 39115440 40030631 40699113
59664D0699113L65670K5361l28609o70237r75267j225146j408848j522344j567701
$$ 40699113 41064783 41090144 40761535 40091298 39116031 37890885 36482037 34959693 33391992
59655C3391992j552615j488865j389549j267411j135365j007516q98658q22615
$$ 33391992 31839377 30350512 28960963 27693552 26558187 25550671 24652013 23829398
59647B3829398p89679q02930q55049r29132j004396j063012j094001j093817j065261
$$ 23829398 23039719 22236789 21381740 20452608 19448212 18385200 17291199 16197382 15132121
59638A5132121j015092r50817q78507q02817p27714o56138n89463n28124m72644
$$ 15132121 14117029 13166212 12287705 11484888 10757174 10101036 9511573 8983449 8510805
59629H510805m23394l79778l40458l04488k71638k41789k14532j89503j66540
$$ 8510805 8087411 7707633 7367175 7062687 6791049 6549260 6334728 6145225 5978685
59620E978685j45439j25852j07680r1274p7095o5237n5464m7736m2576m0736m2437
$$ 5978685 5833246 5707394 5599714 5508440 5431345 5366108 5310644 5262908 5220332 5179596 5137159
59609E137159m7123n4017o2610p2303q2066r0892r8468j04823j09488j11539j10490
$$ 5137159 5090036 5036019 4973409 4901106 4819040 4728148 4629680 4524857 4415369 4303830 4193340
59598D193340j06717j01057r4389q7411q0178p1985o2350n2025m2355l3732k5466
$$ 4193340 4086623 3985566 3891177 3803766 3723588 3651603 3589253 3537228 3494873 3461141 3435675
59587C435675j7162r308k331M019J0032J5465K0017K3694K6437K7951K8339K8265
$$ 3435675 3418513 3409205 3406874 3410893 3420925 3436390 3456407 3480101 3506538 3534489 3562828 3591093
59575C591093K8207K8047K7736K7784K8792L0966L4393L9232M5362N2378O0215
$$ 3591093 3619300 3647347 3675083 3702867 3731659 3762625 3797018 3836250 3881612 3933990 3994205
59564C994205O9289P9723R1046J02884J15409J28781J42717J57053J72224J88791
$$ 3994205 4063494 4143217 4234263 4337147 4452556 4581337 4724054 4881107 5053331 5242122
59554E242122K06814K25950K45748K65592K84842L03229L20637L36260L48600
$$ 5242122 5448936 5674886 5920634 6186226 6471068 6774297 7094934 7431194 7779794
59545G779794L56535L59858L58482L51872L39790L23116L03397K81943K59688
$$ 7779794 8136329 8496187 8854669 9206541 9546331 9869447 10172844 10454787 10714475
59536A0714475K37512K16040J95081J73540J50035J24266R8473P7287O5006O2620
$$ 10714475 10951987 11168027 11363108 11536648 11686683 11810949 11909422 11986709 12051715 12114335
59526A2114335O8012P8907R4374J13170J32018J46526J53186J49566J33449J02977
$$ 12114335 12182347 12261254 12355628 12468798 12600816 12747342 12900528 13050094 13183543 13286520
59516A3286520N7814l58o8399j42401k18295k92368l61228m21406m69699n04334
$$ 13286520 13344334 13343976 13275577 13133176 12914881 12622513 12261285 11839879 11370180 10865846
59506A0865846n25403n33888n30838n17696m96638m69900m39066m05334l69994
$$ 10865846 10340443 9806555 9275717 8758021 8261383 7791483 7352417 6947083 6577089
59497F577089l34216k98803k64493k32064k01868j73802j47912j24414j02926
$$ 6577089 6242873 5944070 5679577 5447513 5245645 5071843 4923931 4799517 4696591
59488D696591q2449o2491m3466k5654q584Q205K4665M1017N7995P5720R3335J10484
$$ 4696591 4614142 4551651 4508185 4482531 4473947 4482152 4506817 4547834 4605829 4681549 4774884 4885368
59476D885368J28215J47432J67421J87026K06482K26782K47717K67709K85146
$$ 4885368 5013583 5161015 5328436 5515462 5721944 5948726 6196443 6464152 6749298
59467F749298K98748L06947L08172L01592K86564K61566K24991J77080J20143
$$ 6749298 7048046 7354993 7663165 7964757 8251321 8512887 8737878 8914958 9035101
59458I035101N6915j0239p8464j44035k03486k54573k95928l26557l46150l55475
$$ 9035101 9092016 9081777 9003313 8859278 8655792 8401219 8105291 7778734 7432584 7077109
59448G077109l56036l49540l37636l21769l03053k82490k61158k39969k19328
$$ 7077109 6721073 6371533 6033897 5712128 5409075 5126585 4865427 4625458 4406130
59439D406130j99426j80641j63303j47178j31708j16690j02349q8965p6801o6151
$$ 4406130 4206704 4026063 3862760 3715582 3583874 3467184 3364835 3275870 3199069 3132918
59429C132918n6953m8491m0048l1767k4358j7975j1937n615Q34O736J1590J5377
$$ 3132918 3075965 3027474 2987426 2955659 2931301 2913326 2901389 2895774 2896608 2903344 2914934 2930311
59417B930311J8442K1134K3538K5642K7854L1139L6339M3242N0153N4303N3266
$$ 2930311 2948753 2969887 2993425 3019067 3046921 3078060 3114399 3157641 3207794 3262097 3315363
59406C315363M7014L8881L3708L4414M0547N0132O2078P6509R3600J12772J32474
$$ 3315363 3362377 3401258 3434966 3469380 3509927 3560059 3622137 3698646 3792246 3905018 4037492
59395D037492J50158J63473J72541J80847J92933K11311K35919K65871L00584
$$ 4037492 4187650 4351123 4523664 4704511 4897444 5108755 5344674 5610545 5911129
59386E911129L39473L81714M26603M73608N21936N70332O17078O59581O94102
$$ 5911129 6250602 6632316 7058919 7532527 8054463 8624795 9241873 9901454 10595556
59377A0595556P16507P23484P13174O85384O42030N87084N25250M60448L95654
$$ 10595556 11312063 12035547 12748721 13434105 14076135 14663219 15188469 15648917 16044571
59368A6044571L33522K76275K24983J79431J38490J00164O1682K0320k5709p7274
$$ 16044571 16378093 16654368 16879351 17058782 17197272 17297436 17359118 17379438 17353729 17276455
59358A7276455j34548j96411k59841l20621l74591m18013m47578m61427m60472
$$ 17276455 17141907 16945496 16685655 16365034 15990443 15572430 15124852 14663425 14202953
59349A4202953m48169m29043m07703l88548l75006l68535l68788l74643l84631
$$ 14202953 13754784 13325741 12918038 12529490 12154484 11785949 11417161 11042518 10657887
59340A0657887l96556m07706m15739m18991m16219m06793l91354l71580l49071
$$ 10657887 10261331 9853625 9437886 9018895 8602676 8195883 7804529 7432949 7083878
59331G083878l24686k98879k72140k45036k18296j92862j69397j47708j27072
$$ 7083878 6759192 6460313 6188173 5943137 5724841 5531979 5362582 5214874 5087802
59322E087802j07199q8532p1615n6483m2672k9586j6906m867N972J5438K3907
$$ 5087802 4980603 4892071 4820456 4763973 4721301 4691715 4674809 4669942 4675914 4691352 4715259
59311D715259L1576L7984M2529M5094M5729M4194M0287L4318K6775J7911Q143
$$ 4715259 4746835 4784819 4827348 4872442 4918171 4962365 5002652 5036970 5063745 5081656 5089799
59300E089799j597j0533j8637k5962l1847l5493l6904l6419l3699k8076j9766
$$ 5089799 5088202 5077669 5059032 5033070 5001223 4965730 4928826 4892407 4858708 4830632 4810866
59289D810866r731J510J4130K8096M2889N8183P3935Q9791J05164J20101J35294
$$ 4810866 4801135 4802645 4816775 4844871 4887760 4945943 5019878 5109669 5214833 5334934 5470228
59278E470228J50879J65794J78548J88238J94584J97375J96125J90037J78263
$$ 5470228 5621107 5786901 5965449 6153687 6348271 6545646 6741771 6931808 7110071
59269G110071J60534J37682J11316Q2760N2205J8914j7396n4841q9077j15535
$$ 7110071 7270605 7408287 7519603 7602363 7654568 7673482 7656086 7601245 7512168 7396633
59259G396633j32398j41127j44160j43004j38704j32824j26797j20947j15108
$$ 7396633 7264235 7123108 6978948 6835944 6697240 6564416 6437619 6316672 6201564
59250F201564j09627j04945j00704r6242r1493q6475q0278p1732o0752m8070l3836
$$ 6201564 6091937 5986992 5886288 5790046 5698553 5612078 5531800 5460068 5399316 5351246 5317410
59239E317410j7452J433K2645M6147P2055J00142J30124J62276J97026K34094
$$ 5317410 5299958 5301391 5324036 5370183 5442238 5542380 5672504 5834780 6031806 6265900
59229F265900K72775L12679L53198L92595M28542M59208M82573M94810M90850
$$ 6265900 6538675 6851354 7204552 7597147 8025689 8484897 8967470 9462280 9953130
59220I953130M67096M22947L59768K79496J84560P8347l4754j49406k59529l59179
$$ 9953130 10420226 10843173 11202941 11482437 11666997 11745344 11710590 11561184 11301655 10942476
59210A0942476m43586n09340n54312n78264n83278n72681n49595n16983m78338
$$ 10942476 10498890 9989550 9435238 8856974 8273696 7701015 7151420 6634437 6156099
59201F156099m37135l95623l55027l16563k81250k49141k19807j93371j70098
$$ 6156099 5718964 5323341 4968314 4651751 4370501 4121360 3901553 3708182 3538084
59192C538084j49349j30353j13583r9988q8989p8848o9001o0430n3529m7263m0881
$$ 3538084 3388735 3258382 3144799 3044811 2955822 2876974 2807973 2747543 2694014 2646751 2605870
59181B605870l4984l0186k6004k1732j7385j3093q547l615J267N850J0442J5105
$$ 2605870 2570886 2540700 2514696 2492964 2475579 2462486 2453939 2450324 2451591 2457441 2467883 2482988
59169B482988J9291K2740K5969K9534L3495L7855M2719M7797N2542N6966O1503
$$ 2482988 2502279 2525019 2550988 2580522 2614017 2651872 2694591 2742388 2794930 2851896 2913399
59158B913399O5995O9759P2856P6065P9303Q1241Q0997P9194P6691P3214O7859
$$ 2913399 2979394 3049153 3122009 3198074 3277377 3358618 3439615 3518809 3595500 3668714 3736573
59147C736573O0243N0545L9142K6775J4490K923p973j8279k7725l5968m2560m6604
$$ 3736573 3796816 3847361 3886503 3913278 3927768 3930691 3922718 3904439 3876714 3840746 3798186 3751582
59135C751582m7384m5477m2325l8450l3098k5832j7393q548Q77J1306K2637L4737
$$ 3751582 3704198 3658721 3616396 3577946 3544848 3519016 3501623 3493075 3493952 3505258 3527895 3562632
59123C562632M7829O1924P6525R1307J06372J21537J36154J50057J63933J78442
$$ 3562632 3610461 3672385 3748910 3840217 3946589 4068126 4204280 4354337 4518270 4696712
59113D696712J93628K09428K25839K42312K57854K72022K84855K95414L01331
$$ 4696712 4890340 5099768 5325607 5567919 5825773 6097795 6382650 6678064 6979395
59104F979395L00142K90193K69973K37853J93300J37739P3843M833o5211j31528
$$ 6979395 7279537 7569730 7839703 8077556 8270856 8408595 8482438 8487271 8422060 8290532
59094H290532j90191k39195k77913l06294l24927l35065l38021l35023l27567
$$ 8290532 8100341 7861146 7583233 7276939 6952012 6616947 6278926 5943903 5616336
59085E616336l16984l03626k87454k69558k51832k35014k18339k01413j85108
$$ 5616336 5299352 4995726 4708272 4438714 4186882 3951868 3733529 3532116 3347008
59076C347008j70145j56197j42930j30652j19395j08629r8422q9537q1857p4226
$$ 3347008 3176863 3020666 2877736 2747084 2627689 2519060 2420638 2331101 2249244 2175018
59066B175018o6473n9946n5145n0582m5053l9486l5153l1545k7594k3688k0777
$$ 2175018 2108545 2048599 1993454 1942872 1897819 1858333 1823180 1791635 1764041 1740353 1719576
59055A719576j8523j6076j3853j2853j2885j3107j3885j6393k0625k5127k8664
$$ 1719576 1701053 1684977 1671124 1658271 1645386 1632279 1618394 1602001 1581376 1556249 1527585
59044A527585l0964l2041l1913l0929k9474k7492k4930k2196j9454j6152j2109
$$ 1527585 1496621 1464580 1432667 1401738 1372264 1344772 1319842 1297646 1278192 1262040 1249931
59033A249931q455o253m805k536P75L901O066P711R322J0621J1172J0999J0393
$$ 1249931 1241476 1235223 1230418 1227882 1228657 1232558 1238624 1246335 1255657 1266278 1277450 1288449 1298842
59020A298842R570Q561P158N164K982J560J306J560J572J533K127L533N430P470
$$ 1298842 1308412 1316973 1324131 1329295 1332277 1333837 1335143 1336703 1338275 1339808 1341935 1345468 1350898 1358368
59006A358368R324J0742J1968J3436J4760J4839J3485J1984J1344J0988R949Q449
$$ 1358368 1367692 1378434 1390402 1403838 1418598 1433437 1446922 1458906 1470250 1481238 1491187 1499636
58994A499636P324O700O291O344P194Q401R255R768J0358J1010J1520J2013J2593
$$ 1499636 1506960 1513660 1519951 1526295 1533489 1541890 1551145 1560913 1571271 1582281 1593801 1605814 1618407
58981A618407J3009J3290J3926J4883J5343J5087J5127J6133J7394J8350J9890
$$ 1618407 1631416 1644706 1658632 1673515 1688858 1703945 1719072 1735205 1752599 1770949 1790839
58970A790839K2841K6280K8886L1032L3895L7210L9687M1187M2686M4327M5246
$$ 1790839 1813680 1839960 1868846 1899878 1933773 1970983 2010670 2051857 2094543 2138870 2184116
58959B184116M5303M5420M5950M6056M4990M3120M1528M1345M3302M7115N1490
$$ 2184116 2229419 2274839 2320789 2366845 2411835 2454955 2496483 2537828 2581130 2628245 2679735
58948B679735N5452N9402O4149O9594P5308Q1777Q9736R8712J07563J16222J25628
$$ 2679735 2735187 2794589 2858738 2928332 3003640 3085417 3175153 3273865 3381428 3497650 3623278
58937C623278J36089J47024J58303J70624J84444J99582K16004K34139K54316
$$ 3623278 3759367 3906391 4064694 4235318 4419762 4619344 4835348 5069487 5323803
58928E323803K76607L01152L27996L56805L87402M20307M56060M94386N34784
$$ 5323803 5600410 5901562 6229558 6586363 6973765 7394072 7850132 8344518 8879302
58919H879302N77366O22318O68922P15963P62461Q07051Q47170Q79864R02570
$$ 8879302 9456668 10078986 10747908 11463871 12226332 13033383 13880553 14760417 15662987
58910A5662987R11920R02476Q68360Q06022P14535N94038M46056K75547R1135
$$ 15662987 16574907 17477383 18345743 19151765 19866300 20460338 20906394 21181941 21273076
58901B1273076r7176k79890m48323n95102p15301q06644q68778r03241r13815
$$ 21273076 21175900 20896010 20447687 19852585 19137284 18330640 17461862 16558621 15644806
58892A5644806r05417q82178q47021q02812p52694o99242o44252n89501n36933
$$ 15644806 14739389 13857211 13010190 12207378 11454684 10755442 10111190 9521689 8984756
58883H984756m87992m43309m03001l66798l34286l05612k81485k61903k45481
$$ 8984756 8496764 8053455 7650454 7283656 6949370 6643758 6362273 6100370 5854889
58874E854889k30758k17378k05144j92969j80029j67096j55294j44181j32520
$$ 5854889 5624131 5406753 5201609 5008640 4828611 4661515 4506221 4362040 4229520
58865D229520j20386j08963r8660q8974p9869p1771o4464n7426n0884m5122l9193
$$ 4229520 4109134 4000171 3901511 3812537 3732668 3660897 3596433 3539007 3488123 3443001 3403808
58854C403808l1996k4231j7549j1987o062P52P524J3911K0766K8375L5855M2672
$$ 3403808 3371812 3347581 3330032 3318045 3311983 3312735 3320259 3334170 3354936 3383311 3419166 3461838
58842C461838M9323N6145O2834O9466P6657Q4469R2481J01069J11187J22670J34220
$$ 3461838 3511161 3567306 3630140 3699606 3776263 3860732 3953213 4054282 4165469 4288139 4422359
58831D422359J45403J57277J70771J85783K02148K20154K39666K60105K81724
$$ 4422359 4567762 4725039 4895810 5081593 5283741 5503895 5743561 6003666 6285390
58822F285390L05829L33363L64240L98167M34967M74056N14881N57960O04154
$$ 6285390 6591219 6924582 7288822 7686989 8121956 8596012 9110893 9668853 10273007
58813A0273007O52769P01568P48641P92688Q31387Q60967Q77664Q78045Q57780
$$ 10273007 10925776 11627344 12375985 13168673 14000060 14861027 15738691 16616736 17474516
58804A7474516Q11849P36882O32406M99908L42556J66534j8906k03704l78802
$$ 17474516 18286365 19023247 19655653 20155561 20498117 20664651 20645745 20442041 20063239
58795B0063239n36184o69162p73769q49004q95595r15635r13434q94773q64348
$$ 20063239 19527055 18857893 18084124 17235120 16339525 15423890 14510456 13615683 12751335
58786A2751335q24927p79059p30031o80502o31588n83927n38453m95491m54489
$$ 12751335 11926408 11147349 10417318 9736816 9105228 8521301 7982848 7487357 7032868
58777G032868m15358l79071l46381l16958k90303k66537k45900k28404k14089
$$ 7032868 6617510 6238439 5892058 5575100 5284797 5018260 4772360 4543956 4329867
58768D329867k02511j91969j80609j68406j56678j45701j34533j23275j13473
$$ 4329867 4127356 3935387 3754778 3586372 3429694 3283993 3149460 3026185 2912712
58759B912712j05631r8317r0470q2836p6149o9609o2393n5251m9429m5006m1289
$$ 2912712 2807081 2708764 2618294 2535458 2459309 2389700 2327307 2272056 2222627 2177621 2136332
58748B136332l7891l4630l1354k8482k6714k5771k4527k2706k1144k0092j8834
$$ 2136332 2098441 2063811 2032457 2003975 1977261 1951490 1926963 1904257 1883113 1863021 1844187
58737A844187j7407j6891j7341j7258j5978j4876j5125j5999j6484j6975j8120
$$ 1844187 1826780 1809889 1792548 1775290 1759312 1744436 1729311 1713312 1696828 1679853 1661733
58726A661733j9531k0852k2754k5465k7757k8744k9422l0979l2751l3403l3009
$$ 1661733 1642202 1621350 1598596 1573131 1545374 1516630 1487208 1456229 1423478 1390075 1357066
58715A357066l2371l1305k9238k6824k5247k4346k2894k0457j7814j5793j4669
$$ 1357066 1324695 1293390 1264152 1237328 1212081 1187735 1164841 1144384 1126570 1110777 1096108
58704A096108j4361j4284j3392j1211q549o609n772n752o246o812o806o053n033
$$ 1096108 1081747 1067463 1054071 1042860 1034311 1027702 1021930 1016178 1009932 1003120 996314 990261 985228
58691I85228l982k549q59R5l09j548k986m783p122r407j0972j1780j1901j1099
$$ 985228 981246 978697 977838 977933 977624 976076 973090 968307 961185 951778 940806 929026 917125 906026
58677I06026r490p746o145m278k077j27J424K998M258L975J958j84r82n73M35
$$ 906026 896536 888790 882645 878367 876290 876163 877587 880585 884843 888818 890776 890592 889610 889037 889472
58662H89472K179M560O372O493N173L204Q60j609l360l775l099j692L84K646M318
$$ 889472 891651 896211 902583 909076 914249 917453 918313 916704 913344 909569 906470 904778 905162 907808 912126
58647I12126N701Q048J1451J4311J5714J6789J8754K1097K2821K4145K5781K7728
$$ 912126 917827 925875 937326 951637 967351 984140 1002894 1023991 1046812 1070957 1096738 1124466
58635A124466K9830L2489L5841L9361M3028M7635N3173N8482O3400O9584P8098
$$ 1124466 1154296 1186785 1222626 1261987 1305015 1352650 1405823 1464305 1527705 1597289 1675387
58624A675387Q7774R7291J07273J18853J31668J44894J59020J74984J92594K11110
$$ 1675387 1763161 1860452 1967725 2086578 2218246 2363140 2522160 2697144 2889738 3100848
58614C100848K30195K48960K65196K76941K83497K83573K73808K50872K14193
$$ 3100848 3331043 3580003 3845199 4122140 4405637 4689210 4963018 5213890 5428083
58605E428083J65430J06764M1350k5840q9572j46191j92970k27277k48223k58044
$$ 5428083 5593513 5700277 5741627 5715787 5626215 5480024 5287054 5059777 4811554 4553510
58595D553510k60027k55898k46552k33805k19504k03868j86686j69229j53208
$$ 4553510 4293483 4037585 3791033 3557228 3337724 3133856 2947170 2777941 2624733
58586B624733j38646j24534j10817r8072q6128p4719o4636n6427m8898m0762l3009
$$ 2624733 2486087 2361553 2250736 2152664 2066536 1991817 1927181 1870754 1821856 1781094 1748085
58575A748085k7716k5125k3857k3451k4744k7939l1990l5744l8400l9234l8122
$$ 1748085 1720369 1695244 1671387 1647936 1623192 1595253 1563263 1527519 1489119 1449885 1411763
58564A411763l6019l3830l1431k8713k6487k5249k4119k2346k0663j9726j8641
$$ 1411763 1375744 1341914 1310483 1281770 1255283 1230034 1205915 1183569 1162906 1143180 1124539
58553A124539j6590j4587j3666j2681j0048o552m207l217k293j227q11q49n19
$$ 1124539 1107949 1093362 1079696 1067015 1056967 1050415 1046208 1042991 1040698 1039471 1038660 1037811 1037292
58540A037292k73j263l126m419m950n817p397r082j0667j2270j3278j3112j2597
$$ 1037292 1037019 1035756 1032630 1028211 1023261 1017444 1010047 1000965 990298 978028 964750 951638 939041
58527I39041j2890j3579j3538j3099j3473j4574j5270j5378j5462j5146j3587
$$ 939041 926151 912572 899034 885935 872462 857888 842618 827240 811778 796632 783045
58516G83045j1349r914r510r122q357p550o439m493k371j358j498j749j674j536
$$ 783045 771696 761782 752272 743150 734793 727243 720804 716311 713940 712582 711084 709335 707661 706125
58502G06125j202m36K19K99N71J807L195L515L110L002K975K356J818K402L428
$$ 706125 704923 704487 704706 705005 705576 707383 710578 714093 717203 720205 723180 725536 727354 729756 733184
58487G33184L484K842K882L662M089M031M316M995N496O054P232Q518R102R329
$$ 733184 736668 739510 742392 746054 750143 754174 758490 763485 768981 775035 782267 790785 799887 809216
58473H09216R746R546P749N012K412n23m485q219j0002j0370j1016j1857j1591
$$ 809216 818962 828508 836257 841269 843681 843158 838673 830454 820452 810082 799066 787209 775618
58460G75618j0376r467q852p705o508o391o891o792o402o719p157o530n459n204
$$ 775618 765242 755775 746923 739218 732710 726319 719428 712636 706234 699515 692358 685828 680369 675165
58446F75165n013l394j149k54m85k7J219J874K037K927M153M304L828M286N240
$$ 675165 670152 666758 665609 665355 664870 664843 666062 667936 669973 672900 677053 681357 685185 689471 694711
58431F94711M970L831L754M724M979M379M421N195N545N927P789J0255J0879R637
$$ 694711 699681 703512 707266 711990 716969 721348 725769 730964 736509 742436 750225 760480 771359 780996
58417G80996Q811R048Q932Q349Q627R212P895M794K465J755R12o77j441r60q84
$$ 780996 789807 798855 807787 816136 824763 833975 841870 846664 849129 850884 851796 851119 849678 848718 847834
58402H47834j805k404k344k891m014m098l037k515k742k120n50K12K3P24K574
$$ 847834 846029 843625 841281 838390 834376 830278 827241 824726 821984 819864 819314 819526 819549 820273 822847
58387H22847L630L282L112L598L458K707K971M144M296L524M203O766Q830R355
$$ 822847 826477 829759 832871 836469 839927 842634 845605 849749 854045 857569 861772 868538 877368 886723
58373H86723R900J0948J0799R288Q807J0309J1715J1532J0763J0160Q949P256
$$ 886723 896623 907571 918370 927658 936465 946774 958489 970021 980784 990944 999893 1007149
58361A007149O451O284N011L024K622L637L294J250M99K180L772L750L807M897
$$ 1007149 1013600 1019884 1024895 1027919 1030541 1034178 1037472 1038722 1039221 1041401 1045173 1048923 1052730 1057627
58347A057627N265M129L394L978M213L448L474M908N958O213P581J0180J1455
$$ 1057627 1062892 1067021 1070415 1074393 1078606 1082054 1085528 1090436 1096394 1102607 1110188 1120368 1131823
58334A131823J0868J1069J2882J3625J2256J1511J2941J4339J4302J4700J6305
$$ 1131823 1142691 1153760 1166642 1180267 1192523 1204034 1216975 1231314 1245616 1260316 1276621
58323A276621J6581J4445J2793J3502J4250J3056J1793J2262J2856J2139J1807
$$ 1276621 1293202 1307647 1320440 1333942 1348192 1361248 1373041 1385303 1398159 1410298 1422105
58312A422105J3181J4447J4229J4244J5713J6710J5843J4940J5592J6505J6556
$$ 1422105 1435286 1449733 1463962 1478206 1493919 1510629 1526472 1541412 1557004 1573509 1590065
58301A590065J6832J7548J6908J5102J5194J7985K0285K0386K0714K2842K4674
$$ 1590065 1606897 1624445 1641353 1656455 1671649 1689634 1709919 1730305 1751019 1773861 1798535
58290A798535K4952K5644K7432K7850K6459K6563K9182L0620K8974K7541K8840
$$ 1798535 1823487 1849131 1876563 1904413 1930872 1957435 1986617 2017237 2046211 2073752 2102592
58279B102592L0729L1579L3528L7288L9553L9128L9779M3425M6454M6456M6453
$$ 2102592 2133321 2164900 2198428 2235716 2275269 2314397 2354176 2397601 2444055 2490511 2536964
58268B536964M8514M9656M8290M8264N1891N5406N6050N7139O1205O4795O5344
$$ 2536964 2585478 2635134 2683424 2731688 2783579 2838985 2895035 2952174 3013379 3078174 3143518
58257C143518O6510P1140P5538P6463P7300Q1463Q6160Q8628R1888R8284J04068
$$ 3143518 3210028 3281168 3356706 3433169 3510469 3591932 3678092 3766720 3858608 3956892 4060960
58246D060960J06492J09444J15828J21604J23800J26846J34204J41516J45276
$$ 4060960 4167452 4276896 4392724 4514328 4638128 4764974 4899178 5040694 5185970
58237E185970J50169J60175J70637J77327J84997J98327K12834K23936K36378
$$ 5185970 5336139 5496314 5666951 5844278 6029275 6227602 6440436 6664372 6900750
58228F900750K55088K75227K91423L08307L31515L56940L79729M04960M38158
$$ 6900750 7155838 7431065 7722488 8030795 8362310 8719250 9098979 9503939 9942097
58219I942097M74444N08795N47625N97831O54283P11107P75173Q54762R45680
$$ 9942097 10416541 10925336 11472961 12070792 12725075 13436182 14211355 15066117 16011797
58210A6011797J043285J157101J297989J462785J648797J871618K150543K488427
$$ 16011797 17055082 18212183 19510172 20972957 22621754 24493372 26643915 29132342
58202B9132342K884176L350198L895672M508129N178794N936381O833407P913776
$$ 29132342 32016518 35366716 39262388 43770517 48949311 54885692 61719099 69632875
58194F9632875R219079J0809769J2752124J5106797J7974110K1546517K6069351
$$ 69632875 78851954 89661723 102413847 117520644 135494754 157041271 183110622
58187A83110622L1665684L7993233M3759901M6479695M3162112L2076124J4431123
$$ 183110622 214776306 252769539 296529440 343009135 386171247 418247371 432678494
58180D32678494n682454k3389582l5508575m1485339m2541289m0340039l6292486
$$ 432678494 426996040 403606458 368097883 326612544 284071255 243731216 207438730
58173B07438730l1475682k6651067k2238538j8391019j5143621j2478660j0313035
$$ 207438730 175963048 149311981 127073443 108682424 93538803 81060143 70747108
58166G0747108q530261p049880n832488m830616l982554l250754k622984k073881
$$ 70747108 62216847 55166967 49334479 44503863 40521309 37270555 34647571 32573690
58158C2573690j562196j067838n94854j30398L67862R39334J612289K427106L385781
$$ 32573690 31011494 29943656 29348802 29218404 29586266 30525600 32137889 34564995 37950776
58149C7950776M297653M706999M109934K363776r7508k498070m209385n050545
$$ 37950776 42248429 46955428 51065362 53429138 53331630 50833560 46624175 41573630
58141D1573630n198650m917377m401215l784664l174235k631973k168440j777796
$$ 41573630 36374980 31457603 27056388 23271724 20097489 17465516 15297076 13519280
58133A3519280j462697j219229j025481q61769p26011o18643n29294m49955l86086
$$ 13519280 12056583 10837354 9811873 8950104 8224093 7605450 7076156 6626201 6240115
58124F240115l42467l10530k80841k56470k42858k34737k24015k11569k00932
$$ 6240115 5897648 5587118 5306277 5049807 4806949 4572212 4348197 4136628 3935696
58115C935696j88629j70782j51823j37196j23985j07580r1071p9825p2907o7829
$$ 3935696 3747067 3576285 3424462 3287266 3163281 3055701 2964630 2884805 2811898 2744069
58105B744069o7366p3563q0888q3252q2464q2464q1028p4895o7502o3585o0972
$$ 2744069 2676703 2603140 2522252 2439000 2356536 2274072 2193044 2118149 2050647 1987062 1926090
58094A926090n5500m9432m7183m6914m4080l9617l7257l6148l3215k9716k8671
$$ 1926090 1870590 1821158 1773975 1727061 1682981 1643364 1606107 1569959 1536744 1507028 1478357
58083A478357k8685k6814k4641k5213k6813k5863k3372k2528k2596k0930j8569
$$ 1478357 1449672 1422858 1398217 1373004 1346191 1320328 1296956 1274428 1251832 1230902 1212333
58072A212333j8105j8465j7147j5201j4759j4321j1672q789q520r166p739n880
$$ 1212333 1194228 1175763 1158616 1143415 1128656 1114335 1102663 1093874 1085354 1076188 1068449 1062569
58060A062569o886r298r242p145o523p821q755r151j0386j1517j0845r714j0228
$$ 1062569 1055683 1046385 1037143 1029998 1023475 1015654 1006899 997748 987362 975845 965000 955286 945058
58047I45058j0992r658p554p174p196n029k170j724k555j259J582K631J947K450
$$ 945058 934066 924408 916854 909680 902484 897455 895285 893561 891006 889747 891329 893960 895907 898357
58033H98357M189M567L591L737M944M639K557R92M33n79j662r59P77P33j360l057
$$ 898357 902546 907113 910704 914441 919385 924024 926581 927573 928006 927427 925765 924806 925583 926316 924956 921899
58017I21899l422l705m102l602k876l623n259n732n299n961p630q378q167q716
$$ 921899 918477 914772 910670 907068 904192 900569 895310 889578 884279 878318 870688 862310 854143 845427
58003H45427r975j0202r244q466p788o103m153l637l975l277j955j867k535j922
$$ 845427 835452 825250 816006 807540 799752 793649 789496 785859 781884 778607 776652 774785 772250 770328
57989G70328l98j18p93m9K154L384L128L435M876N566M779M061M170M170M079
$$ 770328 769930 769812 769019 768970 771124 774508 777636 781071 785947 791513 796292 800353 804523 808693 812772
57974H12772N154O949P198N292K994J237q53l275m522m366m468n532o395o550
$$ 812772 817926 824875 832073 837365 840359 841596 840743 837468 832946 828580 824112 818580 812185 805635
57960H05635o937p684p546o260n122m680m196l716m262n579o027n171m185l432
$$ 805635 798698 791014 783468 777208 772086 767406 763210 759494 755232 749653 743626 738455 734270 730838
57946G30838k020k0J283J732K486L546L570K539K129K822L070J953M29p05j917
$$ 730838 728818 728798 730081 731813 734299 737845 741415 743954 746083 748905 751975 753928 754357 753652 751735
57931G51735l370m324m786n770p354q402q621q964r509r010p153n260m185l211
$$ 751735 748365 744041 739255 733485 726131 717729 709108 700144 690635 681625 674472 669212 665027 661816
57917F61816j653J76K006L986N703O486O840P973R695J0640J0600J0756J1422
$$ 661816 660163 660339 662345 666331 672034 678520 685360 693333 703028 713668 724268 735024 746446
57904G46446J1565J0819J0017R359P973N801M073L418L102K506J803R32n45k409
$$ 746446 758011 768830 778847 788206 796179 801980 806053 809471 812573 815079 816882 817814 817269 814860
57890H14860l991n347o768p538o945o111o706q165q389p036n720n068m083k551
$$ 814860 810869 805522 798754 791216 784271 778160 771454 763289 754900 747864 742144 737076 732993 730442
57876G30442j614j524j199l25K99Q07K242M196N020M787N489P638R294R310Q983
$$ 730442 728828 727304 726105 725780 726079 726886 729128 733324 738344 743131 748620 756258 765552 774862 783845
57861G83845R392R569Q553P161O312N488M126K853K146J325o6j291j800k128k693
$$ 783845 793237 802806 811359 818520 824832 830320 834446 837299 839445 840770 840704 839413 837613 835485 832792
57846H32792l085l209l610m235m350m151m648n621n660m685m311n020n256m210
$$ 832792 829707 826498 822888 818653 814303 810152 805504 799883 794223 789538 785227 780207 774951 770741
57832G70741l279l562m079l826l624m479n703o215o263o541o868o985p302p811
$$ 770741 767462 763900 759821 755995 752371 747892 742189 735974 729711 723170 716302 709317 702015 694204
57818F94204p564o287n142m972n095m806m546m570m063k737j802k036k293j287
$$ 694204 686640 680353 675211 670239 665144 660338 655792 651222 647159 644422 642620 640584 638291 637004
57804F37004M25J553K022K456K776K688K690L378M453N459O711Q643J0978J3278
$$ 637004 637429 638982 641004 643460 646236 648924 651614 654992 659445 664904 671615 680258 691236 704514
57790G04514J5409J6773J6132J3131R115N725L489K286K082K510K692K212J373
$$ 704514 719923 736696 752828 765959 775074 780799 784288 786574 788656 791166 793858 796070 797443
57777G97443J97j707l897n172n330n439n855n617m403l326k912k076k16J439J819
$$ 797443 797640 795933 792036 786864 781534 776095 770240 764623 760220 756894 753982 751906 751690 753129 754948
57762G54948J831K724L987M401M087M063M642N540O782Q270R186Q853P656O423
$$ 754948 756779 759503 763490 767891 771978 776041 780683 786223 793005 801275 810461 819314 826970 833393
57748H33393N627N612O541P614P556O427N667N758N547M459L689M090M764M857
$$ 833393 839020 844632 851173 858787 866343 872770 878437 884195 889742 894201 897890 901980 906744 911601
57734I11601N055N955O670O540O634P958R587J0323J0791J2163J3941J4906J5158
$$ 911601 916656 922611 929281 935821 942455 950413 960000 970323 981114 993277 1007218 1022124 1037282
57721A037282J5573J6122J6468J7197J8765K0079J9966J9263J9719K1468K3337
$$ 1037282 1052855 1068977 1085445 1102642 1121407 1141486 1161452 1180715 1200434 1221902 1245239
57710A245239K4930K6753K8775L0496L2105L4153L6544L9105M2476M7142N2374
$$ 1245239 1270169 1296922 1325697 1356193 1388298 1422451 1458995 1498100 1540576 1587718 1640092
57699A640092N7476O3234P0667P9192Q7680R6514J06855J18597J30873J43972
$$ 1640092 1697568 1760802 1831469 1910661 1998341 2094855 2201710 2320307 2451180 2595152
57689B595152J58930J75679J93459K12446K33014K53566K71130K83901K91327
$$ 2595152 2754082 2929761 3123220 3335666 3568680 3822246 4093376 4377277 4668604
57680D668604K91653K81430K57900K20678J71276J12832N0526r358o1521j02122
$$ 4668604 4960257 5241687 5499587 5720265 5891541 6004373 6054899 6045541 5984020 5881898
57670E881898j27811j36218j28117j08443q5509o9966p2548r8843j44179j94942
$$ 5881898 5754087 5617869 5489752 5381309 5295800 5225834 5153286 5054443 4910264 4715322
57660D715322k36399k59935k64396k53398k32411k06623j79400j52382j26809
$$ 4715322 4478923 4218988 3954592 3701194 3468783 3262160 3082760 2930378 2803569
57651B803569j04031q4596o7945n3423m0910l0250k0901j2463m852K216R248J6383
$$ 2803569 2699538 2614942 2546997 2493574 2452664 2422414 2401513 2389050 2384198 2386414 2395662 2412045
57639B412045K3423L0604L8640M7868N7944O8414P9084Q9963J01385J13992J28034
$$ 2412045 2435468 2466072 2504712 2552580 2610524 2678938 2758022 2847985 2949370 3063362 3191396
57628C191396J42903J58026J73682J90134K06403K20860K32527K40543K42692
$$ 3191396 3334299 3492325 3666007 3856141 4062544 4283404 4515931 4756474 4999166
57619D999166K35854K18004J88668J47770R5782L5414k8086q9027j43037j87120
$$ 4999166 5235020 5453024 5641692 5789462 5885244 5920658 5892572 5803545 5660508 5473388
57609E473388k19486k40096k50435k52192k46696k35599k21059k04761j87500
$$ 5473388 5253902 5013806 4763371 4511179 4264483 4028884 3807825 3603064 3415564
57600C415564j70016j53343j38006j23708j10330r8443q8376p9445p0780o2472
$$ 3415564 3245548 3092205 2954199 2830491 2720161 2621718 2533342 2453897 2383117 2320645
57590B320645n5337m9799m5406m1326l7041l2636k8518k4917k1781j9152j7155
$$ 2320645 2265308 2215509 2170103 2128777 2091736 2059100 2030582 2005665 1983884 1964732 1947577
57579A947577j5414j3113j0142p599o428o051n197l612k055q85K31J399K370L313
$$ 1947577 1932163 1919050 1908908 1901309 1894881 1888830 1883633 1880021 1877966 1877081 1877312 1878711 1881081 1884394
57565A884394M754O634Q354R830J1552J3581J5334J6628J7963J9533K0810K1502
$$ 1884394 1889148 1895782 1904136 1913966 1925518 1939099 1954433 1971061 1989024 2008557 2029367 2050869
57553B050869K2152K3389K5147K7024K8913L1021L3555L6692M0529M4986M9976
$$ 2050869 2073021 2096410 2121557 2148581 2177494 2208515 2242070 2278762 2319291 2364277 2414253
57542B414253N5593O1838O8440P5277Q2715R1079J00108J09514J19704J31197
$$ 2414253 2469846 2531684 2600124 2675401 2758116 2849195 2949303 3058817 3178521 3309718
57532C309718J43648J56177J68426J80373J91303J99750K04286K03519J95508
$$ 3309718 3453366 3609543 3777969 3958342 4149645 4349395 4553681 4757200 4952708
57523D952708J78261J51070J14756P0855K1609k9258p6937j17316j48206j69156
$$ 4952708 5130969 5282039 5396795 5467650 5489259 5460001 5383064 5265748 5117542 4948386
57513D948386j80904j85030j83179j76401j65640j52602j39168j26042j12807
$$ 4948386 4767482 4582452 4399273 4222872 4057232 3904630 3765462 3639420 3526613
57504C526613r9328q6245p4119o3052n3255m5018l7952l1174k4433j8232j2713
$$ 3526613 3427285 3341040 3266921 3203869 3150614 3105596 3067644 3036470 3012037 2993805 2981092
57493B981092p285j649L694Q287J2333J6178J9863K3502K7487L2011L6870M1992
$$ 2981092 2973807 2972158 2975852 2984139 2996472 3012650 3032513 3056015 3083502 3115513 3152383 3194375
57481C194375M7683N4177O1332O8839P6421Q3996R2032J01493J12853J25417J38150
$$ 3194375 3242058 3296235 3357567 3426406 3502827 3586823 3678855 3780348 3893201 4018618 4156768
57470D156768J50827J63615J75950J86664J94778J99184J97869J88533J69817
$$ 4156768 4307595 4471210 4647160 4833824 5028602 5227786 5425655 5614188 5784005
57461E784005J41232J02568N5020K658m8792r4960j33743j63812j84041j94644
$$ 5784005 5925237 6027805 6082825 6085483 6036691 5941731 5807988 5644176 5460135 5265491
57451E265491j97220j93249j83729j70447j55980j41843j27948j14180j01197
$$ 5265491 5068271 4875022 4691293 4520846 4364866 4223023 4095075 3980895 3879698
57442C879698q9241p7724o6623n6954m9190m2545l6393l1055k6499k1804j6788
$$ 3879698 3790457 3712733 3646110 3589156 3539966 3497421 3461028 3429973 3403474 3381670 3364882
57431C364882j2784j0688r451p689n561l917k467k53K705N404P124P801P691P418
$$ 3364882 3352098 3341410 3331959 3324270 3318709 3314792 3312325 3312072 3314777 3320181 3327305 3335106 3342797 3350215
57417C350215P860R234J0771J1789J2434J2986J3325J3602J4420J5647J6179J5640
$$ 3350215 3358075 3367309 3378080 3389869 3402303 3415289 3428614 3442216 3456636 3472283 3488462 3504102
57405C504102J5191J5818J6945J7772J8658J9917K0482J9412J7801J7495J8571
$$ 3504102 3519293 3535111 3552056 3569828 3588486 3608403 3628885 3648297 3666098 3683593 3702164
57394C702164J9670K0233K0737K1233K1355K1578K2690K4070K4172K2869K1741
$$ 3702164 3721834 3742067 3762804 3784037 3805392 3826970 3849660 3873730 3897902 3920771 3942512
57383C942512K1757K2129K1876K1237K0894K0883K0947K1197K1829K2707K3584
$$ 3942512 3964269 3986398 4008274 4029511 4050405 4071288 4092235 4113432 4135261 4157968 4181552
57372D181552K4320K4697K4509K3925K3294K2716K2284K2519K3754K5286K6044
$$ 4181552 4205872 4230569 4255078 4279003 4302297 4325013 4347297 4369816 4393570 4418856 4444900
57361D444900K6083K6378K7150K7464K6803K5963K5874K6427K7036K7684K8569
$$ 4444900 4470983 4497361 4524511 4551975 4578778 4604741 4630615 4657042 4684078 4711762 4740331
57350D740331K9317K9305K8640K8093K8177K8701K9267K9720L0031L0091K9901
$$ 4740331 4769648 4798953 4827593 4855686 4883863 4912564 4941831 4971551 5001582 5031673 5061574
57339E061574K9843L0370L1381L2127L2075L1582L1356L1405L1166L0630L0599
$$ 5061574 5091417 5121787 5153168 5185295 5217370 5248952 5280308 5311713 5342879 5373509 5404108
57328E404108L1408L2262L2271L1649L1244L1383L1834L2473L3257L3870L4085
$$ 5404108 5435516 5467778 5500049 5531698 5562942 5594325 5626159 5658632 5691889 5725759 5759844
57317E759844L4229L4639L4940L4608L3997L3972L4674L5396L5700L5826L6023
$$ 5759844 5794073 5828712 5863652 5898260 5932257 5966229 6000903 6036299 6071999 6107825 6143848
57306F143848L6215L6485L7126L8073L8861L9335L9775M0243M0398M0202M0231
$$ 6143848 6180063 6216548 6253674 6291747 6330608 6369943 6409718 6449961 6490359 6530561 6570792
57295F570792M0952M2199M3616M5165M6882M8521M9772N0604N1218N1816N2618
$$ 6570792 6611744 6653943 6697559 6742724 6789606 6838127 6887899 6938503 6989721 7041537 7094155
57284G094155N3810N5258N6455N6931N6587N5504N3545N0393M5905M0325L4045
$$ 7094155 7147965 7203223 7259678 7316609 7373196 7428700 7482245 7532638 7578543 7618868 7652913
57273G652913K7297K0158J2960O374Q41l881q162j1564j3197j3000j2034j1120
$$ 7652913 7680210 7700368 7713328 7719702 7720543 7716662 7708500 7696936 7683739 7670739 7658705 7647585
57261G647585r930p873n243k817q05J128L095M978O882Q931J0788J2028J2808
$$ 7647585 7637655 7629782 7624539 7621722 7620917 7622045 7625140 7630118 7637000 7645931 7656719 7668747 7681555
57248G681555J3611J4549J5548J6909J8898K0916K1892K1541K0535J9465J8325
$$ 7681555 7695166 7709715 7725263 7742172 7761070 7781986 7803878 7825419 7845954 7865419 7883744
57237G883744J7048J5810J4649J3409J2249J1564J1281J0698R372P660O161N030
$$ 7883744 7900792 7916602 7931251 7944660 7956909 7968473 7979754 7990452 7999824 8007484 8013645 8018675
57225H018675M045L073K219J588J069L27q28k025k603k341j566l67J643M395O930
$$ 8018675 8022720 8025793 8028012 8029600 8030669 8030996 8030168 8028143 8025540 8023199 8021633 8021266 8022909 8027304 8034234
57210H034234Q520R647J0977J2093J2228J1703J1357J0933R429P088N418N031
$$ 8034234 8042754 8052401 8063378 8075471 8087699 8099402 8110759 8121692 8131121 8138209 8143627 8148658
57198H148658M760L474J547j00j344k549l686m565n343o146o710o913p209q131
$$ 8148658 8153418 8156892 8158439 8158339 8156995 8154446 8150760 8146195 8140852 8134706 8127996 8121083 8113874 8105743
57184H105743r794j2192j5388j9053k2401k4946k6871k8333k9087k9062k8683
$$ 8105743 8095949 8083757 8068369 8049316 8026915 8001969 7975098 7946765 7917678 7888616 7859933
57173G859933k8225k7452k6253k4973k3738k2199k0330j8744j7782j7061j6323
$$ 7859933 7831708 7804256 7778003 7753030 7729292 7707093 7686763 7668019 7650237 7633176 7616853
57162G616853j5859j5527j4411j2243j0310r912j0721j1613j2421j3726j5558
$$ 7616853 7600994 7585467 7571056 7558813 7548503 7538591 7527870 7516257 7503836 7490110 7474552
57151G474552j7622k0374k4502k9467l3879l7333m0743m4740m8860n2512n5736
$$ 7474552 7456930 7436556 7412054 7382587 7348708 7311375 7270632 7225892 7177032 7124520 7068784
57140G068784n8713o1340o3558o5338o6170o5332o2886n9687n6274n2467m8268
$$ 7068784 7010071 6948731 6885173 6819835 6753665 6688333 6625447 6565760 6509486 6457019 6408751
57129F408751m4320m1197l8961l7795l8354m1042m5454n0796n6343o1251o4658
$$ 6408751 6364431 6323234 6284273 6246478 6208124 6167082 6121628 6070832 6014489 5953238 5888580
57118E888580o6269o6307o4664o0802n4775m7572m0118l2656k5517j9443j4408
$$ 5888580 5822311 5756004 5691340 5630538 5575763 5528191 5488073 5455417 5429900 5410457 5396049
57107E396049q757l15J2273K9987N4385Q7035J28316J77659K34692K99417L71796
$$ 5396049 5387292 5386977 5399250 5429237 5483622 5570657 5698973 5876632 6111324 6410741 6782537
57096F782537M52224N42220O43964P59437Q90401J037819J199423J368110J534116
$$ 6782537 7234761 7776981 8420945 9180382 10070783 11108602 12308025 13676135 15210251
57087A5210251J688178J820678J918054J962552J936243J825166J623691J343261
$$ 15210251 16898429 18719107 20637161 22599713 24535956 26361122 27984813 29328074
57079B9328074J020229P07158M43919K31132L3075j91551m60431p62778j073244
$$ 29328074 30348303 31055461 31499380 31730512 31763587 31572036 31111605 30348827 29275583
57070B9275583j365545j617615j812774j941032j999651j992336j928356j821251
$$ 29275583 27910038 26292423 24479649 22538617 20538966 18546630 16618274 14797023
57062A4797023j685911j535302j379454j226179j081058r46773q23947p13118
$$ 14797023 13111112 11575810 10196356 8970177 7889119 6942346 6118399 5405281
57054E405281o15213n30275m56944l93649l39464k93532k54568k21453j93549
$$ 5405281 4790068 4259793 3802849 3409200 3069736 2776204 2521636 2300183 2106634
57045B106634j70073j49839j32172j17400j05804r6541q8214q0170p2666o6025
$$ 2106634 1936561 1786722 1654550 1537150 1431346 1334805 1246591 1166421 1093755 1027730
57035A027730o0240n5187n0646m6162m1342l6374l1884k8265k5376k2886k0628
$$ 1027730 967490 912303 861657 815495 774153 737779 705895 677630 652254 629368 608740
57024F08740j8603j6880j5503j4364j3204j1858j0413r009p666o436n544n017
$$ 608740 590137 573257 557754 543390 530186 518328 507915 498906 491240 484804 479260 474243
57012D74243m373l034r84J437M263P870J2180J6597K1062K6524L3738M2244N1502
$$ 474243 469870 466836 465852 467289 471552 479422 491602 508199 529261 555785 589523 631767 683269
56999F83269O2636P7990R9157J26675J60814J98903K29449K31905J88706J01282
$$ 683269 745905 823895 923052 1049727 1210541 1409444 1638893 1870798 2059504 2160786
56989B160786o649j03667j69350k00695k05193j91953j68559j41496j15864r4617
$$ 2160786 2154137 2050470 1881120 1680425 1475232 1283279 1114720 973224 857360 762743
56979G62743p8931o8920o3440o0093n6540n1830m6162l9801l2805k5521j8561
$$ 762743 683812 614892 551452 491359 434819 382989 336827 297026 264221 238700 220139
56968B20139j2285o798k367O60K544M328P001J0605J4339J7474K0064K2677K5595
$$ 220139 207854 201056 198689 199349 201893 206221 213222 223827 238166 255640 275704 298381 323976
56955C23976K8163K8883K6046J8771P911l984j4031k0654k3883k4307k2350j8721
$$ 323976 352139 381022 407068 425839 433750 429766 415735 395081 371198 346891 324541 305820
56943C05820j4733j1491r080o970m837k500M53M217Q284J2073J5873K0387K5592
$$ 305820 291087 279596 270516 263546 258709 256209 256662 260879 269163 281236 297109 317496 343088
56930C43088L0705L4789L6452L3327K3631Q717p080j9763k8128l2769l4139l2563
$$ 343088 373793 408582 445034 478361 501992 510709 503629 483866 455738 422969 388830 356267
56918C56267k9175k5451k1972j8501j5039j2061r853q234o914n701m469l310k546
$$ 356267 327092 301641 279669 261168 246129 234068 224215 215981 209067 203366 198897 195587 193041
56905A93041k259k034j455o08K02R53J773K629L399M084M703N320O342Q212J0575
$$ 193041 190782 188748 187293 186685 186887 187840 189613 192242 195641 199725 204428 209748 216090 224302 234877
56890B34877J2344J3119J3977J6281K0085K4251K7573K9041K7503K2146J3525
$$ 234877 247221 260340 274317 290598 310683 334934 362507 391548 419051 441197 454722
56879D54722L520n835j3165j7714j9236j8104j5188j1456p708m393j338K012N806
$$ 454722 458242 452407 439242 421528 402292 384188 369000 357544 349836 345443 344105 346117 351923
56866C51923R622J3269J7363K2606K9031L6523M5438N5761O5596P1189O8609N5585
$$ 351923 361545 374814 392177 414783 443814 480337 525775 581536 647132 718321 786930 842515
56854H42515L2840M694k2178m2067n2992n6239n3929m7839l9824l1603k3722j5651
$$ 842515 875355 880049 857871 815804 762812 706573 652644 604805 564981 533378 509656 494005
56842D94005p146J311R562J8146K7405L7095M7374N9262P3521Q9478J04820J15459
$$ 494005 486859 488170 497732 515878 543283 580378 627752 687014 760535 850013 954833 1070292
56830A070292J15391R8749O4189J7693k9826o8322r2727j03082j02350r4327q2436
$$ 1070292 1185683 1284432 1348621 1366314 1336488 1268166 1175439 1072357 970007 875680 793244
56819G93244o9259n6526m5074l4770k4887j4942n142M155J3125K2360L2380M3575
$$ 793244 723985 667459 622385 587615 562728 547786 542644 546799 559924 582284 614664 658239
56807F58239N6230O9632Q0689Q4011P4459N0700J6815j9515n0745p2258q2852
$$ 658239 714469 784101 864790 948801 1023260 1073960 1090775 1071260 1020515 948257 865405
56796H65405q3889p8318o9551o0036n0549m0929l1348k2572j5288r585m902j16
$$ 865405 781516 703198 633647 573611 523062 482133 450785 428213 412925 403340 398438 398322
56784C98322N888J3236K0943K8258L5421M2126M5674M2169L0080J1865q022k5827
$$ 398322 404210 417446 438389 466647 502068 544194 589868 632037 662117 673982 665960 640133
56772F40133l9226m7043m9430m7879m4159l9269l3684k8034k3051j9084j6058
$$ 640133 600907 553864 504434 456555 412396 373127 339443 311409 288358 269274 253216
56761B53216j3718j1701r715p834o336n165m063l180k903k998k690j842j256j456
$$ 253216 239498 227797 218082 210248 203912 198747 194684 191504 188601 185603 182913 181071 179815 178359
56747A78359j970k211k250k202j662n52K48q2j094j730j725j579j568j611j809
$$ 178359 176389 174178 171928 169726 168064 167512 167760 167678 166584 164854 163129 161550 159982 158371 156562
56732A56562k262k557k215j526j188j269j239r40q36j187j643j748j415q48l99
$$ 156562 154300 151743 149528 148002 146814 145545 144306 143366 142530 141343 139700 137952 136537 135689 135290
56717A35290l87p52r57n95J27Q38J584K461L049K778J710M19o82j324j175l05
$$ 135290 134903 134151 133194 132599 132726 133564 135148 137609 140658 143436 145146 145565 144883 143559 142384 142079
56701A42079L95J68n23p03m49p48j787k493k097j149n62m30l23j33n6j14j51j9
$$ 142079 142474 142642 142119 141416 140967 140219 138432 135939 133842 132693 132131 131701 131378 131245 131189 131075 130924 130905
56683A30905M31J223J940K022J541J224J424J655J449J175J386J839J716P50m29
$$ 130905 131336 132559 134499 136521 138062 139286 140710 142365 143814 144989 146375 148214 149930 150680 150251
56668A50251j042r64p07q14j284j563j238o80p00j492k269k235j510q02m54k16
$$ 150251 149209 148245 147538 146724 145440 143877 142639 141959 141259 139767 137498 135263 133753 132951 132497 132281
56652A32281J26L51R2o77j566k053j856j178n36l17m47n74n27m30m59n62n93n52
$$ 132281 132407 132758 132850 132173 130607 128554 126698 125520 124984 124667 124220 123646 123119 122689 122230 121668 121075 120523
56634A20523n52n34j87O32J505J792J412R75J025J426J712J798J981K342K604
$$ 120523 119971 119437 119250 119882 121387 123179 124591 125566 126591 128017 129729 131527 133508 135850 138454
56619A38454K561K357K160J830J174M02P3M49J039J033K31o68r00m97r3pKJ83
$$ 138454 141015 143372 145532 147362 148536 148938 149011 149460 150499 151532 151763 151095 150195 149698 149605 149598 149600 149783
56601A49783M24N48N12K82j46m62k90K02M30L24M48J028J434J077K34m92r46j161
$$ 149783 150207 150755 151267 151549 151403 150941 150651 150853 151283 151607 152055 153083 154517 155594 155828 155336 154390 153229
56583A53229q71N0J028J418J429J774K569L164K999K137J112N78Q98J750K417
$$ 153229 152358 152408 153436 154854 156283 158057 160626 163790 166789 168926 170038 170616 171514 173264 175681
56568A75681K707L132L838M172L856L780M736N983O247N597N144N203N041M419
$$ 175681 178388 181520 185358 189530 193386 197166 201902 207885 214132 219729 224873 230076 235117 239536
56554B39536M110M606N349N532M943L812K538J653J347J058J89q62j227j004j201
$$ 239536 243646 248252 253601 259133 264076 267888 270426 272079 273426 274484 274673 273811 272584 271580 270379
56539B70379k183l229l727l874l961l924l785l786l864l724l476l362l020j974
$$ 270379 268196 264967 261240 257366 253405 249481 245696 241910 238046 234322 230846 227484 224464 222490
56525B22490p72m01o14l02L76j39k259m219m430l502k897k854k752k541k490k345
$$ 222490 221718 221317 220703 220401 220777 220638 218379 214160 209730 206228 203331 200477 197725 195184 192694 190349
56509A90349j813j317j263j193o36j40l92r08p88k32j69o69r19o18k87k37j91
$$ 190349 188536 187219 185956 184763 184127 183987 183595 182687 181899 181667 181498 180829 179910 179292 179005 178768 178577
56492A78577m5p5k92k46K70Q80J131R98Q03Q87J345J878K061J954K092K644L038
$$ 178577 178532 178457 178165 177919 178189 179069 180200 181198 182001 182888 184233 186111 188172 190126 192218 194862 197900
56475A97900K784K287K343L053L745L783L189K606K787L839M908N067M529M376
$$ 197900 200684 202971 205314 208367 212112 215895 219084 221690 224477 228316 233224 238291 242820 247196
56461B47196M985N508N183M323L572L018K537K246K038J417L84l15l69n19j288
$$ 247196 252181 257689 262872 267195 270767 273785 276322 278568 280606 282023 282407 282092 281723 281204 279916
56446B79916k029j997j567j360j091l26L07o5j073j620j450j156r70p90r23j672
$$ 279916 277887 275890 274323 272963 271872 271546 271853 271788 270715 269095 267645 266489 265519 264729 263806 262134
56430B62134k409k280j658j696k576l379l588l601l678l481k888k276j827j372
$$ 262134 259725 257445 255787 254091 251515 248136 244548 240947 237269 233788 230900 228624 226797 225425
56416B25425r55q55r94j066j163j536j860j605r54n17k17M60J240J188K00o43
$$ 225425 224470 223615 222621 221555 220392 218856 216996 215391 214437 213920 213703 214163 215403 216591 216791 216148
56400B16148n04L44J249J899K100J684R67O21P88R73R11Q82R91R42P11O93R52
$$ 216148 215644 215988 217237 219136 221236 222920 223887 224508 225296 226269 227180 228062 229053 229995 230706 231399 232351
56383B32351J047Q49Q30J222J584J575J572K040K815L381L586L673L799L853L669
$$ 232351 233398 234247 235077 236299 237883 239458 241030 243070 245885 249266 252852 256525 260324 264177 267846
56368B67846L324L144L356L668L468K596J542P10j1o03n16M83J607J946J677J631
$$ 267846 271170 274314 277670 281338 284806 287402 288944 289654 289643 289040 288524 289007 290614 292560 294237 295868
56352B95868K009K364K447K307J810R41L44O38J413J749J549J529K055K926M051
$$ 295868 297877 300241 302688 304995 306805 307746 308090 308728 310141 311890 313439 314968 317023 319949 324000
56337C24000N425O541O835O651O853P566Q196Q533Q864R111Q940Q656Q932R616
$$ 324000 329425 335966 342801 349452 356305 363871 372067 380600 389464 398575 407515 416171 425103 434719
56323D34719R890R630R571R983J0279J0116R786R332Q282O629N091M028K936J462
$$ 434719 444609 454239 463810 473793 484072 494188 503974 513306 521588 528217 533308 537336 540272 541734
56309E41734R2n47m98k81l59r48j889k612k663k204j621r39j83J75l0P9J406L484
$$ 541734 541826 541279 540781 540500 540141 539193 537304 534692 532029 529825 528204 527265 527082 527257 527227 527306 528712 532196
56291E32196N133O184P378Q877J0093J0941J1901J2985J3841J4863J6825J9407
$$ 532196 537329 543513 550891 559768 569861 580802 592703 605688 619529 634392 651217 670624
56279F70624K1371K2398K3524K5588K8399L1515L4640L7296L9323M1786M6111
$$ 670624 691995 714393 737917 763505 791904 823419 858059 895355 934678 976464 1022575
56268A022575N2190N8663O4989P1894P9721Q7942R6579J06562J18199J30617J43012
$$ 1022575 1074765 1133428 1198417 1270311 1350032 1437974 1534553 1641115 1759314 1889931 2032943
56257B032943J55243J66995J77778J87884J97849K06696K12176K13017K09449
$$ 2032943 2188186 2355181 2532959 2720843 2918692 3125388 3337564 3550581 3760030
56248C760030K01360J87737J68296J44079J15960Q4334N0701J7707j2985m1207
$$ 3760030 3961390 4149127 4317423 4461502 4577462 4661796 4712497 4730204 4717219 4676012
56238D676012o6221q6211j00539j10622j17516j20642j20004j17738j16023j14943
$$ 4676012 4609791 4523580 4423041 4312419 4194903 4074261 3954257 3836519 3720496 3605553
56228C605553j13751j12771j12654j13129j13830j15319j17938j20760j22774
$$ 3605553 3491802 3379031 3266377 3153248 3039418 2924099 2806161 2685401 2562627
56219B562627j24010j24468j23217j19784j15318j11096j06810j01431r4857q7650
$$ 2562627 2438617 2314149 2190932 2071148 1955830 1844734 1737924 1636493 1541636 1453986
56209A453986q0122p2632o5881o0056n4568m9227m4562m0428l5848l0860k6940
$$ 1453986 1373864 1301232 1235351 1175295 1120727 1071500 1026938 986510 950662 919802 892862
56198H92862k4604k2401j9356j6643j5402j4573j2606r909p900o720n551m155
$$ 892862 868258 845857 826501 809858 794456 779883 767277 757368 749468 742748 737197 733042
56186G33042k677q57J247K695L126L724N424P382Q495R240J0530J1924J2561J2843
$$ 733042 730365 729508 730755 733450 736576 740300 745724 753106 761601 770841 781371 793295 805856 818699
56172H18699J3565J4258J3958J2817J1557J0042P744M893K025p86l227m398m244
$$ 818699 832264 846522 860480 873297 884854 894896 902640 907533 909558 908772 905545 901147 896903
56159H96903m167m915n140l471p76J174K242L486N145O744Q424J0748J3651J6818
$$ 896903 892736 887821 882681 879210 878434 879608 881850 885336 890481 897225 905649 916397 930048 946866
56145I46866K0414K4497K8509L2289L6630M2103M8495N6113O6183P9028R3229
$$ 946866 967280 991777 1020286 1052575 1089205 1131308 1179803 1235916 1302099 1381127 1474356
56134A474356J07466J21455J34203J43189J46397J43407J33830J17415R7080P9003
$$ 1474356 1581822 1703277 1837480 1980669 2127066 2270473 2404303 2521718 2618798 2697801
56124B697801O7413O1207N7225N4047N0318M2486K7935Q875r712k4618l4828l9833
$$ 2697801 2765214 2826421 2883646 2937693 2988011 3030497 3058432 3067307 3057595 3032977 2998149 2958316
56112B958316m0960m2849n0150o3293p9575r6769j12954j24691j28976j26314
$$ 2958316 2917356 2874507 2824357 2761064 2681489 2584720 2471766 2347075 2218099 2091785
56102B091785j19195j08599r4798q0146o7781n8217m9989m2754l7115l2454k7743
$$ 2091785 1972590 1863991 1769193 1689047 1621266 1563049 1513060 1470306 1433191 1400737 1372994
56091A372994k3690k1357j9727j7220j4440j2725j1246q500n389l782l213j990
$$ 1372994 1349304 1327947 1308220 1291000 1276560 1263835 1252589 1244089 1238700 1234918 1231705 1229715
56079A229715m04L18R59K992N467O434O411P267Q840R849J0863J2995J4915J4708
$$ 1229715 1229311 1229629 1230588 1233580 1239047 1245481 1251892 1259159 1267999 1277848 1288711 1301706 1316621 1331329
56065A331329J3501J3728J5075J5660J5847J7099J8476J8227J7561J8698K0597
$$ 1331329 1344830 1358558 1373633 1389293 1405140 1422239 1440715 1458942 1476503 1495201 1515798
56054A515798K0770K0044K1002K2949K3219K2367K3174K5286K5882K5073K5646
$$ 1515798 1536568 1556612 1577614 1600563 1623782 1646149 1669323 1694609 1720491 1745564 1771210
56043A771210K7825K9181K9458L0596L2335L2655L2374L4290L8022M0556M1633
$$ 1771210 1799035 1828216 1857674 1888270 1920605 1953260 1985634 2019924 2057946 2098502 2140135
56032B140135M3619M6420M7680M7771M9352N2132N3359N3270N4683N7420N8679
$$ 2140135 2183754 2230174 2277854 2325625 2374977 2427109 2480468 2533738 2588421 2645841 2704520
56021B704520N8653O0043O2314O2500O1533O3416O8017P1162P2111P4389P8712
$$ 2704520 2763173 2823216 2885530 2948030 3009563 3072979 3140996 3212158 3284269 3358658 3437370
56010C437370Q1925Q3615Q7171R3180R8377J02037J06934J13183J17714J20673
$$ 3437370 3519295 3602910 3690081 3783261 3881638 3983675 4090609 4203792 4321506 4442179
56000D442179J25603J32582J38148J42523J49711J59819J68819J76570J87238
$$ 4442179 4567782 4700364 4838512 4981035 5130746 5290565 5459384 5635954 5823192
55991E823192K01012K13659K25068K39679K57542K73789K88057L05307L26263
$$ 5823192 6024204 6237863 6462931 6702610 6960152 7233941 7521998 7827305 8153568
55982H153568L46657L67073L93329M25711M58501M91940N33535N85364O41639
$$ 8153568 8500225 8867298 9260627 9686338 10144839 10636779 11170314 11755678 12397317
55973A2397317P01183P70589Q52456R42966J043945J164757J309505J475953J670222
$$ 12397317 13098500 13869089 14721545 15664511 16708456 17873213 19182718 20658671 22328893
55964B2328893J908483K200881K548135K956035L435849L987083M599848N282610
$$ 22328893 24237376 26438257 28986392 31942427 35378276 39365359 43965207 49247817
55956D9247817O072749P016151Q154160R533371J1207996J3232165J5680579J8695087
$$ 49247817 55320566 62336717 70490877 80024248 91232244 104464409 120144988 138840075
55948A38840075K2494522K7285781L3014210L8916154M3101173M2781860L5593218
$$ 138840075 161334597 188620378 221634588 260550742 303651915 346433775 382026993
55941C82026993K1387756K975691j5124874k9059221l7233542m0170494l9339446
$$ 382026993 403414749 406390440 391265566 362206345 324972803 284802309 245462863
55934B45462863l6205453l1927625k7354393k3015044j9152214j5842153j3090462
$$ 245462863 209257410 177329785 149975392 126960348 107808134 91965981 78875519
55927G8875519j0846213r015881p515934o296496n311803m505013l834095l282619
$$ 78875519 68029306 59013425 51497491 45200995 39889192 35384179 31550084 28267465
55919B8267465k833514k457140k133524j861992j639286j448778j279099j133694
$$ 28267465 25433951 22976811 20843287 18981295 17342009 15893231 14614132 13480438
55911A3480438j013755r09056q12973p30341o63248o03665n46627m97027m57194
$$ 13480438 12466683 11557627 10744654 10014313 9351065 8747400 8200773 7703746 7246552
55902G246552m20509l83169l50262l24628l00926k75941k54131k37934k22639
$$ 7246552 6826043 6442874 6092612 5767984 5467058 5191117 4936986 4699052 4476413
55893D476413k05615j91101j81281j71660j59618j48921j41650j34013j24037
$$ 4476413 4270798 4079697 3898416 3726756 3567138 3418217 3276567 3142554 3018517
55884C018517j15402j09850j03613r5002q7966q4577q1223p5641p0702o7956o4424
$$ 3018517 2903115 2793265 2689652 2594650 2506684 2422107 2340884 2265243 2194541 2126585 2062161
55873B062161n8974n5082n4026n2083m7484m3596m2225m0373l6761l4915l6357
$$ 2062161 2003187 1948105 1894079 1841996 1794512 1750916 1708691 1668318 1631557 1596642 1560285
55862A560285l7177l4901l2633l2707l2163k8351k3493j9892j5711r231k518K482
$$ 1560285 1523108 1488207 1455574 1422867 1390704 1362353 1338860 1318968 1303257 1294026 1291508 1293990
55850A293990O700R631P237k152j4121k3616k9938l3757l3870l0374k6681k4955
$$ 1293990 1300690 1310321 1317558 1315406 1301285 1277669 1247731 1213974 1180104 1149730 1123049 1098094
55838A098094k3343k0576j9130k0741k2941k3324k3310k4450k4898k3013k0914
$$ 1098094 1074751 1054175 1035045 1014304 991363 968039 944729 920279 895381 872368 851454
55827H51454k0892k1477k0335j8159j6609j5305j3737j3322j4684j5626j4502
$$ 851454 830562 809085 788750 770591 753982 738677 724940 711618 696934 681308 666806
55816F66806j2913j2571j2304j0671q690p482o045l743k222k357k178k07J907
$$ 666806 653893 641322 629018 618347 609657 602175 596130 592387 590165 587808 585630 585423 587330
55803E87330K542K841L864L964J816p67j811k439m382o775q202r499j1735j3662
$$ 587330 589872 592713 596577 600541 602357 601590 599779 597340 592958 586183 577981 568482 556747 543085
55789E43085j3891j3441j3574j3328j1710j0145j0058j0184q942p308o602n516
$$ 543085 529194 515753 502179 488851 477141 466996 456938 446754 437812 430504 423902 418386
55777D18386k366J501L361K701N71k908p709j2007j3853j3649j2856j1559r376
$$ 418386 416020 417521 420882 423583 424154 421246 413537 401530 387677 374028 361172 349613 340237
55764C40237p248o000m609k137J3Lj620l179m541o361p932q126p395o797o075
$$ 340237 332989 326989 322380 320243 320256 320259 318639 315460 310919 304558 296626 288500 281105 274308 268233
55749B68233m657l434l558m427m723m436m269m127l753l754m437m827m214l361
$$ 268233 263576 260142 256584 252157 247434 242998 238729 234602 230849 227095 222658 217831 213617 210256
55735B10256k824j737K91J809J749J314J806K360J672L58n57j746m029o141o441
$$ 210256 207432 205695 205986 207795 209544 210858 212664 215024 216696 217054 216497 214751 210722 204581 198140
55720A98140n574n207n308m815l945l529l077j617K74J295J549J961K401K254
$$ 198140 192566 187359 182051 177236 173291 169762 166685 165068 165342 166637 168186 170147 172548 174802
55706A74802K130L121N030O827Q180R163R263Q165O618N222L446J135l98k22N65
$$ 174802 176932 180053 185083 191910 200090 209253 218516 226681 233299 238521 241967 243102 242704 242482 243047
55691B43047N98K45K25k56k022l935m415l840l459l117k037p64k28J72J459K990
$$ 243047 243645 243890 244115 243859 241837 237902 233487 229647 226188 223071 221034 220270 220042 220214 221673 224663
55675B24663L468L165L163L190K296Q95K13K45Q9l43n28o01p65l58Q92J697R70
$$ 224663 228131 231296 234459 237649 239945 240840 241053 241298 241387 241044 240516 239915 239150 238792 239684 241381 242351
55658B42351k88o09l45n01n07O19J974J966Q71k2r08k680m535m999m764n846q177
$$ 242351 242063 241454 241109 240608 240101 240720 242694 244660 245531 245509 244601 241921 237386 232387 227623 221777 213600
55641B13600r611r277q477q134p707o914o424o365n956n073m640n147n947o277
$$ 213600 203989 194712 186235 178101 170394 163480 157056 150691 144735 139662 135022 129875 123928 117651
55627A17651n851m667l220k574l018l328k462j226q54r37m51J30k57j040r16l33
$$ 117651 111800 107133 103913 101339 98321 94993 92531 91305 90451 89514 89063 89193 88936 87896 86980 86647
55611H6647q01k069k369j346n13p27j196j241j159j100q01n29q21j248r83l87
$$ 86647 85846 83777 81408 80062 79549 78822 77626 76385 75226 74126 73325 72796 71975 70727 69744 69357
55595F9357m57r50p98j25J4l21m9Q42J253J022J036J227N54q28j395o90k4k59
$$ 69357 68900 67950 67152 67027 67041 66720 66671 67513 68766 69788 70824 72051 72605 71777 70382 69692 69668 69409
55577F9409o62n57m06n47l80L99J023Q87M91O01J276K166L000L515L595L518L464
$$ 69409 68747 68190 67784 67237 66857 67256 68279 69166 69657 70258 71534 73700 76700 80215 83810 87328 90792
55560I0792K970J699K98m45q47j595k381k539k452k864l334k929j949j325q50
$$ 90792 93762 95461 95759 95314 94467 92872 90491 87952 85500 82636 79302 76373 74424 73099 72249
55545G2249J75J080O76l63j94J202J963J466J212K153L245L335K715K089J563
$$ 72249 72424 73504 74180 73817 73623 74825 76788 78254 79466 81619 84864 88199 90914 93003 94566
55530I4566J294J669K323K296J575J138J196R09Q3m19l50n82j451k155k270k464
$$ 94566 95860 97529 99852 102148 103723 104861 106057 106966 107049 106630 106280 105698 104247 102092 99822 97358
55514I7358l184l988m519m871m672l351j619j136k199l306l373k912k525j910
$$ 97358 94174 90186 85667 80796 76124 72773 71154 70018 67819 64513 61140 58228 55703 53793
55500E3793r97n51q69j252j410j998l136l747l205k308j898j716j411j327j511
$$ 53793 52796 52245 51376 50124 48714 46716 43580 39833 36628 34320 32422 30706 29295 27968 26457
55485B6457j150J09J310J523J136R68R65N71k80j208j871k007j567j056j094j501
$$ 26457 25307 25416 26726 28249 29385 30353 31318 31889 31609 30401 28530 26523 24956 23900 22806 21305
55469B1305j502q84j42L89O90N59N2Q9J309K591K277O76l13n4K26k11o44o47q67
$$ 21305 19803 18919 18777 19166 19856 20415 20467 20556 21865 24456 26733 27409 27096 27042 27268 27057 26413 25766 24899
55450B4899j439j439o01J18K74N91J219J168K32l19J87P46N86L96O24L77p45j437
$$ 24899 23460 22021 21420 21538 21812 22403 23622 24790 25022 24703 24890 25636 26222 26618 27242 27619 26874 25437
55432B5437p42K26J22m97m27J7j82p72p44j39J76K9o5N2J83M27Q26Q61J87o79
$$ 25437 24695 24921 25043 24546 24119 24136 23954 23182 22438 22299 22475 22504 22439 22491 22674 23101 23927 24788 24975 24296
55412B4296j068j023q37m30J55M72M72P24J282J316N36j00J40P05R51J177J596
$$ 24296 23228 22205 21368 20938 21093 21565 22037 22761 24043 25359 25895 25795 25935 26640 27591 28768 30364
55395C0364J466M33m36k20K40l17j460j758j028m61p42j279j300p82l05m47j234
$$ 30364 31830 32263 31827 31607 31847 31530 30070 28312 27284 26823 26081 24802 23502 22720 22415 21968 20734
55378B0734j877j536m93J56O5p6m0n12j573k148j755j405j863k256j577l03O04
$$ 20734 18857 17321 16828 16984 17049 16973 16933 16421 14848 12700 10945 9540 7677 5421 3844 3541 4145
55361D145J247K022K395J764P11R6k27o51o49K14J043Q26J52J97O79M47l90n99
$$ 4145 5392 7414 9809 11573 12284 12380 12153 11502 10853 11067 12110 12936 13088 13285 13964 14411 14021 13422
55343A3422J19P63P27M83M98N76M65K41Pj59q7J48O8m67q73p25m18k96N4Q41J271
$$ 13422 13541 14304 15031 15514 16012 16588 17053 17294 17301 17142 17055 17203 17271 16804 15931 15206 14788 14492 14546 15387 16658
55322A6658P33PJ15O63N21l47r49q33m01k6J49j11o89p97k0Q11P93L58M31Q46
$$ 16658 17391 17398 17513 18176 18697 18350 17401 16568 16167 16141 16290 16179 15490 14693 14673 15484 16277 16635 17066 17912
55302A7912Q61O92J070J694J527N44j95j29L24P02Q63N53k77q43l85N79R06N03
$$ 17912 18773 19465 20535 22229 23756 24300 24105 23976 24300 25002 25865 26418 26141 25298 24913 25492 26398 26901
55284B6901J61L4m20j052j032l30J08j21l90l53n22j158j581j176k67L84M50J01
$$ 26901 27062 27096 26676 25624 24592 24262 24370 24249 23859 23506 22984 21826 20245 19069 18802 19186 19636 19737
55266A9737k98l45N6N18P00Q55J314J771J766J546J593J568P63n09j053n11J18
$$ 19737 19439 19094 19150 19668 20368 21223 22537 24308 26074 27620 29213 30781 31544 31035 29982 29471 29589
55249B9589j25j006j660j590q58J56R06R89N14j08o47j047j130p94l82k97m15
$$ 29589 29464 28458 26798 25208 24350 24506 25412 26401 26915 26807 26160 25113 23983 23189 22807 22510 22095
55232B2095l00J52O91J128J351J230R10Q36J056R71K37n73p54m06lL91Q13R27
$$ 22095 21795 21947 22638 23766 25117 26347 27257 28093 29149 30120 30357 29784 29030 28624 28621 29012 29825 30752
55214C0752N90K95L52L13j0J65J272K218J775M85k27k46m86r28o24M09R92O31
$$ 30752 31342 31637 31989 32302 32292 32457 33729 35947 37722 38207 37980 37734 37248 36320 35696 36105 37097 37728
55196C7728J26R0J97K42O07J283J526R44j0r44j905k579k146n13J115J490O16
$$ 37728 37854 37944 38141 38383 38990 40273 41799 42743 42733 41789 39884 37305 35159 34646 35761 37251 37867
55179C7867n36j123r56m60l06o72r08l15Q28J569J478R29L65k3q3J03n6r95k128
$$ 37867 37331 36208 35252 34792 34486 33814 32906 32591 33419 34988 36466 37395 37760 37737 37654 37757 37701 36706 34578
55160C4578k370j446m4J096J575J124j62j495k116k085j765j002L47J552J726
$$ 34578 32208 30762 30718 31814 33389 34513 34351 32856 30740 28655 26890 25888 26235 27787 29513
55145B9513J128O25K81l95j163j292q42m63r0P58J675J733J094P57Q05M23l01
$$ 29513 30641 31266 31547 31152 29989 28697 27855 27392 27302 28060 29735 31468 32562 33319 34124 34547 34246
55128C4246l25M51R43Q73J237K248K566J396j09n15MM17L95J84q7j85L00J123
$$ 34246 33921 34372 35315 36188 37425 39673 42239 43635 43526 43011 43015 43432 43827 44011 43924 43739 44039 45162
55110D5162J300N17l06m20k21k21j00M13P45M94K92P04J106P36J42L73J230J470
$$ 45162 46462 46979 46673 46253 46032 45811 45711 46124 46869 47363 47655 48359 49465 50201 50343 50716 51946 53416
55092E3416O33m48q85o85k49L40J240K303K928K580J481N18J82Mn24q79k31J059
$$ 53416 54049 53601 52716 52031 51782 52122 53362 55665 58593 61173 62654 63172 63354 63358 62834 61955 61724 62783
55074F2783J701J278O41M04J74l41n93j44N24P28M63N4l47n39k28M03P38N87L78
$$ 62783 64484 65762 66403 66807 66981 66640 66047 65903 66427 67155 67618 67672 67325 66786 66558 66961 67699 68286 68664
55055F8664J89m62j564k274k049j332p09k51k3k86p14m37N84J195O95j23k46J45
$$ 68664 68853 68391 66827 64553 62504 61172 60463 60212 60189 59903 59189 58752 59336 60531 61226 61103 60857 61002
55037F1002L50L24L56K52k32p24o78j32N19R48P68k32j337j334k16N77J85n07
$$ 61002 61352 61676 62032 62284 62052 61328 60650 60518 61037 61985 62753 62521 61184 59850 59634 60211 60396 59889
55019E9889m75q1l6N0P68J462J154K50k4N79J292J663J757J400N01k94l01N5o8
$$ 59889 59414 59333 59297 59347 60115 61577 62731 62981 62957 63536 64828 66491 68248 69648 70149 69855 69554 69609 69541
55000F9541m90m39q1k26p50p15o1K13j93l31L25Q62K69j043j829j534o64M6K88
$$ 69541 69051 68612 68531 68305 67555 66840 66779 66992 66799 66468 66793 67655 67924 66881 65052 63518 62854 62900 63188
54981F3188K16J33J13p7n58r94j001o63l15K2N07R55J053J026J444K328L003L001
$$ 63188 63404 63537 63650 63573 63015 62021 61020 60357 60042 60064 60571 61526 62579 63605 65049 67377 70380 73381
54963G3381K616K386K424K546K743L231M096N123O040O893P964R249J0221J0523
$$ 73381 75997 78383 80807 83353 86096 89327 93423 98546 104586 111479 119443 128692 138913 149436
54949A49436J0695J1556J2878J3395J2352J0301P951N012Q84m067q688j2168j4342
$$ 149436 160131 171687 184565 197960 210312 220613 228564 233576 234460 230393 221705 209537 195195
54936A95195j5157j4619j3223j1739j0556r570q594p551o417n271m268l326k174
$$ 195195 180038 165419 152196 140457 129901 120331 111737 104186 97769 92498 88230 84904 82730
54923H2730r65l17m17n95k56L22P36J337K552L840M316M128M194M785N362N832
$$ 82730 81765 81448 81031 80436 80180 80502 81238 82575 85127 88967 93283 97411 101605 106390 111752 117584
54907A17584O917Q965J1256J2817J3302J2759J1137Q539N456K315r79m653q372
$$ 117584 124501 133466 144722 157539 170841 183600 194737 203276 208732 211047 210068 205415 197043
54894A97043j1253j2581j2475j1748j1080j0418r301p774o555o084n845n045l746
$$ 197043 185790 173209 160734 148986 137906 127488 118187 110413 103858 97774 91929 86884 83138
54881H3138k790k681l006k995k373j534j024r55r19n38K7L99P03J353K108J994
$$ 83138 80348 77667 74661 71666 69293 67759 66735 65780 64861 64323 64350 64749 65452 66805 68913 70907
54865G0907N66j367k675l093l022k664k077j626j621j701j243l27L14K87m5j51
$$ 70907 71473 70106 67431 64338 61316 58652 56575 54949 53328 51627 50384 50057 50371 50658 50613 50462
54849E0462R1M31N54L14q0k56j36n3k08l46k31m8m6j18j53l27p17r06n34J36O24
$$ 50462 50553 50984 51538 51852 51772 51516 51380 51327 51119 50773 50542 50494 50448 50330 50177 49850 49133 48227 47693 47829 48453
54828D8453Q25P86L33m39p91j26J145K147K610K764K534J815J216J500K284K328
$$ 48453 49278 50064 50397 49958 49167 49041 50186 52333 54943 57707 60241 62056 63272 64772 67056 69384
54812F9384J268J53QP01J592K484L387L941L835L490L765M904O263P109P448P885
$$ 69384 70652 70805 70813 71514 73106 75590 78977 82918 86753 90243 94008 98912 105175 112284 119732 127617
54796A27617Q834J0088J1234J2195J3098J3707J3409J1879R385O314K816q88m215
$$ 127617 136451 146539 157773 169968 183066 196773 210182 222061 231446 237760 240576 239688 235473
54783B35473o668q281r418j0286j0814j0799r970q375o722n909n925n757m652
$$ 235473 228805 220524 211106 200820 190006 179207 169237 160862 154140 148231 142306 136549 131897
54770A31897l008j613o59N6N06O22O98R86J314J590K284L825N865P709R142J0297
$$ 131897 128889 127276 126617 126673 127179 127801 128499 129485 130799 132389 134673 138498 144363 152072 161214 171511
54754A71511J1201J2019J3357J5575J8055J9836K0613K0541J9435J6898J2986
$$ 171511 182712 194731 208088 223663 241718 261554 282167 302708 322143 339041 352027
54743C52027Q069K331l945r844j4418j7587j9789k1033k0950j9644j7701j5597
$$ 352027 360096 362427 358482 348638 334220 316633 296844 275811 254861 235217 217516 201919
54731B01919j3637j2187j1225j0071q278o534n758n610m936l486k205j812k015
$$ 201919 188282 176095 164870 154799 146521 139987 134229 128619 123683 120197 117992 116180 114165
54718A14165k214k132j688r99n61p68j279j454j328j395j630j502q94j81M84J144
$$ 114165 111951 109819 108131 107132 106571 105803 104524 103070 101742 100347 98717 97215 96321 96140 96624 97768
54702I7768J408Q27j54n42j64K54L61N58R58J042N85O2k00m08o25m92L3M22L46
$$ 97768 99176 100003 99849 99307 99143 99397 99758 100316 101274 102316 102901 102963 102763 102355 101730 101238 101271 101693 102039
54683A02039R7j0j7O4L45O80Q08R75J623K472K744K370K118K339K586K700L173
$$ 102039 102136 102126 102109 102173 102518 103198 104006 104981 106604 109076 111820 114190 116308 118647 121233 123933 127106
54666A27106M098M735M645M389M507M636M272L720L580L795L815L400K831K533
$$ 127106 131204 135939 140584 144973 149480 154116 158388 162108 165688 169483 173298 176698 179529 182062
54652A82062K760L351L746L644L553M156N252O163P065Q849J1495J3736J4782
$$ 182062 184822 188173 191919 195563 199116 203272 208524 214687 221752 230601 242096 255832 270614
54639B70614J5297J6132J7067J7431J7043J5843J3309R081L609k373q525j4386
$$ 270614 285911 302043 319110 336541 353584 369427 382736 391817 395426 393053 384528 370142
54627C70142j8994k1623k2486k2174k0880j8752j6363j4207j2234j0401r094q358
$$ 370142 351148 329525 307039 284865 263985 245233 228870 214663 202429 192028 182934 174576
54615A74576p413n683l784k667k238j656o80J13L14J44%N4J69j16j241k877l930
$$ 174576 167163 161480 157696 155029 152791 151135 150455 150568 150882 151026 151026 151080 151249 151133 149892 147015 143085
54598A43085l734k873k329k267k256k230k520l159l811m203m156l412k031p42
$$ 143085 139351 136478 134149 131882 129626 127396 124876 121717 117906 113703 109547 106135 104104 103362
54584A03362l28q01j621k447l216l723l762l503l232k852k106j145l74J02M70
$$ 103362 103034 102233 100612 98165 94949 91226 87464 83961 80729 77877 75771 74626 74252 74354 74824
54569G4824Q05J069J246J168N02o13j353j134l74K19O99J444K042J668N11j52
$$ 74824 75629 76698 77944 79112 79614 79001 77648 76514 76140 76359 77058 78502 80544 82212 82723 82571
54553H2571L83J316J461P35J02L29J242K060K218J895J749K119K667K951L107
$$ 82571 82954 84270 85731 86466 86568 86897 88139 90199 92417 94312 96061 98180 100847 103798 106905
54538A06905L590M389M992N154N232N620O276P018P905R017R990J0133R071P128
$$ 106905 110495 114884 119876 125030 130262 135882 142158 149176 157081 166098 176088 186221 195292 202420
54524B02420M962K941Q96j537m426p345r538j0328r667q345p414p219p266p123
$$ 202420 207382 210323 211219 209682 205256 197911 188373 178045 168378 160033 152619 145400 138134 131011
54510A31011o931o789o192m826l480l222l860m143l462k425j609q13J17O72M70
$$ 131011 124080 117291 111099 106273 102793 99571 95711 91568 88106 85681 84072 83259 83376 84048 84518
54495H4518n2k81j64J47O85J276J422J102R68J205J000q4j026o36O61J472J456
$$ 84518 84466 84185 84021 84168 84853 86129 87551 88653 89621 90826 91826 91742 90716 90080 90741 92213 93669
54478I3669J480J932K174J825J523J878K492K521J757O94j39n33n29k81L6K83
$$ 93669 95149 97081 99255 101080 102603 104481 106973 109494 111251 111945 111806 111273 110744 110463 110499 110782
54462A10782L39J10l10n94m93j30J63J34l34j196k103k538k315j792j379j156
$$ 110782 111121 111231 110921 110327 109834 109704 109867 110001 109667 108471 106368 103830 101515 99723 98344 97188
54446I7188j043j030r35m64J86K53o15j643j782r63J2N03M67N8n16q49o38j17
$$ 97188 96145 95115 94180 93716 93902 94155 93540 91897 90115 89152 89164 89667 90134 90192 89676 88827 88189 88072
54428H8072J92P8l48r53j483j399m72O21Q84K13m52k81O48J639K050J683Q81L43
$$ 88072 88264 88342 87994 87041 85558 84159 83687 84308 85192 85405 84953 84672 85320 86959 89009 90692 91573 91916
54410I1916M96J001J216J006Q07R76J429J923K259K276K045K046K761M031N095
$$ 91916 92412 93413 94629 95635 96442 97418 98847 100770 103029 105305 107350 109396 112157 116188 121283
54395A21283N283M505L158J867J150J022R73O04P8l82j050k220l341l436k473
$$ 121283 126566 131071 134229 136096 137246 138268 139241 139845 139923 139541 138491 136271 132930 129494 127021
54380A27021j569j617k276k662k540k332k282k168j834j515j482j634j617j272
$$ 127021 125452 123835 121559 118897 116357 114025 111743 109575 107741 106226 104744 103110 101493 100221
54366A00221p66l16J7J86J4n89j381j943k062j807j348q40l92J29R82K003K523
$$ 100221 99455 99139 99156 99342 99356 98767 97386 95443 93381 91574 90226 89386 88994 89123 90105 92108 94631
54349I4631K279K063K672L501L252K028J480K436L613L456K327J774K285K902
$$ 94631 96910 98973 101645 105146 108398 110426 111906 114342 117955 121411 123738 125512 127797 130699
54335A30699K736J881Q53J5m25m78n50j058j889k588k924k948k687k354k512l461
$$ 130699 133435 135316 136169 136184 135759 135281 134731 133673 131784 129196 126272 123324 120637 118283 115771 112310
54319A12310m543m695l723k526k038k367k941l200l015k641k271j731q80k17m07
$$ 112310 107767 103072 99349 96823 94785 92418 89477 86277 83262 80621 78350 76619 75739 75522 75115
54304G5115j146j262l82L54j57j383j972j505o88j30P9k7k86l02l9j68r85j552
$$ 75115 73969 72707 72325 72679 72522 71139 69167 67662 66974 66844 66923 66896 66610 66308 66269 66101 65116 63564
54286F3564r48J13J46q65j475j013l27j92j88K64Q74J106R48N98Q0l72k89K75
$$ 63564 62616 62729 62875 62010 60535 59522 59195 59003 58815 59079 59953 61059 62007 62605 62685 62313 62024 62299
54268F2299O44N86P33J485K221K199J638J191Q88L26l90o49k24M15P15O11M07
$$ 62299 62943 63529 64262 65747 67968 70167 71805 72996 73884 74210 73820 73171 72947 73362 74077 74688 75095
54251G5095L20K52j2m54p21n70k12n2j83l63l64r9L90P74N73j46n65j81K69k41
$$ 75095 75415 75667 75655 75201 74480 73910 73698 73646 73463 73100 72736 72637 73027 73801 74374 74228 73663 73482 73751 73510
54231G3510j421j913j190j51K89K89L46L69M9m37p57r59j166j149o73k3L02K53
$$ 73510 72089 70176 68986 68835 69124 69413 69759 70128 70177 69740 68983 68024 66858 65709 65036 65013 65315 65568
54213F5568J61K27L83O00R20J226J189N78m01j085q70P7P90M98m74j143j074p61
$$ 65568 65729 65956 66339 66939 67859 69085 70274 70852 70451 69366 68496 68573 69363 69861 69387 68244 67170 66409
54195F6409p53r59r26m93L5K33Mk61j03L97O69N40N13R10J205Q15N3m10o33j045
$$ 66409 65656 64697 63771 63278 63313 63546 63550 63289 63186 63583 64252 64792 65305 66215 67420 68235 68288 67878 67245 66200
54175F6200j380r81p5L20j55p67q77o36l22J05M87L64k18n35k03K49K28j35l93
$$ 66200 64820 63839 63764 64084 63929 63162 62285 61649 61327 61432 61919 62283 62065 61530 61327 61576 61804 61669 61276
54156F1276m10k82j04o8k42j79N99J616J772Q73m3k29j38l77o61m77JL30N33P28
$$ 61276 60866 60584 60480 60412 60170 59991 60590 62206 63978 64851 64808 64579 64441 64064 63403 62926 62927 63257 63790 64518
54136F4518N79r1p25p88o82j114j867k000j106K75J328J622J149K95l73n97o40
$$ 64518 65097 65006 64281 63493 62811 61697 59830 57830 56724 56999 58327 59949 61098 61393 61020 60423 59783
54119E9783p93q66n08K52R59J091L46j001j961j635l46O46Q01R01J523J889J037
$$ 59783 58990 58124 57616 57868 58827 59918 60264 59263 57302 55667 55321 55967 56768 57669 59192 61081 62118
54102F2118m98j280r19l48l01m41k34K06M59M81M98N60N09K18k10n61o28l98n7
$$ 62118 61620 60340 59421 59073 58772 58331 58097 58303 58762 59243 59741 60301 60810 61028 60818 60257 59629 59231 59174
54083E9174J69K16K51N08R63J114L91r91j912j546l84M80Q21J198J707J753J208
$$ 59174 59343 59559 59810 60318 61281 62395 62786 61795 59883 58337 57953 58433 59254 60452 62159 63912 65120
54066F5120P20N29K9r40j354l34J461K550K299J143k56j328j525q03P1M26O29
$$ 65120 65840 66369 66398 65458 64104 63770 65231 67781 70080 71223 70967 69639 68114 67311 67382 67808 68437
54049F8437J443K697L355K878J810J019R00J333J954K384K518K663L131L822M322
$$ 68437 69880 72577 75932 78810 80620 81639 82539 83872 85826 88210 90728 93391 96522 100344 104666
54034A04666M270L504K213J170J323K773M504N511N811N905N787N158M269L808
$$ 104666 108936 112440 114653 115823 117146 119919 124423 129934 135745 141650 147437 152595 156864 160672
54020A60672M024M536M929N045M772M064L185K531K179J942J721J530J291R11
$$ 160672 164696 169232 174161 179206 183978 188042 191227 193758 195937 197879 199600 201130 202421 203332
54006B03332M53k3o62j648k929m274n342n670n020l962l548m030m426l772k422
$$ 203332 203785 203762 203100 201452 198523 194249 188907 183237 178217 174255 170707 166677 162251 158479 156057
53991A56057j514j583k223k868l220l111k572k047k036k423k508j757m88K59l61
$$ 156057 154543 152960 150737 147869 144649 141538 138966 136919 134883 132460 129952 128195 127707 127966 127605
53976A27605j950k923k198o25j6p78j496j129l10K1J71Q28J618J696J115O02L50
$$ 127605 125655 122732 120534 119909 119893 119115 117619 116490 116180 116201 116372 117200 118818 120514 121629 122231 122581
53959A22581J62K26P41J122P21J2n0M55O74N27P94J688K539K957L218L412L280
$$ 122581 122743 122969 123710 124832 125553 125565 125515 125970 126644 127171 127965 129653 132192 135149 138367 141779 145059
53942A45059L000L149L679L913L750L860M466M949M954M890M930M513L299J772
$$ 145059 148059 151208 154887 158800 162550 166410 170876 175825 180779 185669 190599 195112 198411 200183
53928B00183M32q44k129k959l020k611j970q31P22J835J972J862K487L643M391
$$ 200183 200615 199771 197642 194683 191663 189052 187082 186251 186973 188808 190780 192642 195129 198772 203163
53913B03163M479M473M649M717M597M679N097N438N456N553O217P247P847P360
$$ 203163 207642 212115 216764 221481 226078 230757 235854 241292 246748 252301 258518 265765 273612 280972
53899B80972N718L388J105m31r83j010j243j845k196j734q79o99j682l223m518
$$ 280972 286690 290078 291183 290752 289769 288759 287516 285671 283475 281741 280862 280163 278481 275258 270740
53884B70740n470o445p409p858p463o503n649n525o260p298p819p554p020o756
$$ 270740 265270 258825 251416 243558 236095 229592 223943 218418 212158 204860 197041 189487 182467 175711
53870A75711o620o152n296m349l495k804k469k554k710k567k295k307k562k558
$$ 175711 169091 162939 157643 153294 149799 146995 144526 141972 139262 136695 134400 132093 129531 126973
53856A26973k058j400j093j355j954k389k358k162k274k460j973r04m80j400k601
$$ 126973 124915 123515 122422 121067 119113 116724 114366 112204 109930 107470 105497 104593 104113 102713 100112
53841A00112k581j387k84J25K97N26M92J54l3M7Jk52k92p8j13n38p94m92L5L21
$$ 100112 97531 96144 95860 95985 96282 96808 97300 97454 97421 97468 97469 97217 96925 96847 96734 96196 95402 94910 94945 95266
53821I5266L15J20j89k69K58J133J589J402J163J303J494J355J019O93K87n3L13
$$ 95266 95581 95701 95512 95243 95501 96634 98223 99625 100788 102091 103585 104940 105959 106652 106939 106886 107199
53804A07199J705L468M598M767M326L613K755K041J971K824M260N467N790N373
$$ 107199 108904 112372 116970 121737 126063 129676 132431 134472 136443 139267 143527 148994 154784 160157
53790A60157M917M755M441L650K910K922L404L404K589J485N59j40n25m75l37
$$ 160157 165074 169829 174270 177920 180830 183752 187156 190560 193149 194634 195193 195053 194528 194053 193716
53775A93716n89j002r24m83n68j371k029k002j937k563l561m077l826l149k442
$$ 193716 193127 192125 191201 190718 190150 188779 186750 184748 182811 180248 176687 172610 168784 165635 163193
53760A63193k019k114k613l053l051k472j277J98J014M93o86j211j011j216k139
$$ 163193 161174 159060 156447 153394 150343 147871 146594 146792 147806 148299 147613 146402 145391 144175 142036
53745A42036k623j997j280j529k164k052j369j078j213r84k95Q6j80n52n12j06
$$ 142036 139413 137416 136136 134607 132443 130391 129022 127944 126731 125747 125452 125538 125358 124806 124294 124188
53729A24188M39R45J113P28J08j53J11N65R40J178J133N85l81j280j599j144k33
$$ 124188 124627 125572 126685 127413 127521 127368 127479 128044 128984 130162 131295 131880 131499 130219 128620 127476 127243
53712A27243M46M84L89R76K039K304J145l77q84m38j58m82q00n94m7N79J343K217
$$ 127243 127689 128173 128562 129538 131577 133881 135026 134649 133765 133327 133169 132687 131887 131293 131246 131825 133168 135385
53694A35385K832K924K685K534K723L178L545L436K842K220J988K075K185K226
$$ 135385 138217 141141 143826 146360 149083 152261 155806 159242 162084 164304 166292 168367 170552 172778
53680A72778K289K395K525K660K645K257J622J218J153R20J83o26r17p61o01m86
$$ 172778 175067 177462 179987 182647 185292 187549 189171 190389 191542 192462 192645 192019 191102 190341 189740 189254
53664A89254j59L11N24K78l45j219k092k470k108j438j085j062r01m54k6K05L97
$$ 189254 189095 189406 189930 190208 189863 188644 186552 184082 181974 180536 179451 178389 177488 177034 177008 177213 177610
53647A77610N83N53K51M4L05Q97J205O83n10j537j687j143p03o89o73k77K23M58
$$ 177610 178193 178746 178997 179041 179346 180243 181448 182131 181621 180084 178397 177254 176551 175862 175189 174912 175135 175593
53629A75593N76R07J356J618J674J716J751J687J599J601J644J686J796J893J683
$$ 175593 176169 177076 178432 180050 181724 183440 185191 186878 188477 190078 191722 193408 195204 197097 198780
53614A98780J182R11J277K086K899L530L867L688L020K359K192K584L438M607
$$ 198780 199962 200873 202150 204236 207135 210665 214532 218220 221240 223599 225791 228375 231813 236420
53600B36420N522N423M401L573L662M044L845L337L352L905M347M509M718M854
$$ 236420 241942 247365 251766 255339 259001 263045 266890 270227 273579 277484 281831 286340 291058 295912
53586B95912M413L465K720K586K813L039L030K514J437M25K10O63R82Q27N59M34
$$ 295912 300325 303790 306510 309096 311909 314948 317978 320492 321929 322354 322564 323227 324209 325036 325595 326029
53570C26029L34L39P35J234J069J44n41j81O85Q63L4r00r75k65L14P4p26j260
$$ 326029 326363 326702 327437 328671 329740 329884 329343 329162 329847 330710 330744 329844 328869 328604 328918 328992 328266 327006
53552C27006j026j82R01J922K537K486K051J903K183K219J537O60M05Q32J426
$$ 327006 325980 325798 326699 328621 331158 333644 335695 337598 339781 342000 343537 344197 344602 345434 346860
53537C46860J969K606L319L881M124L962L374K810L034M112N043N023M593M807
$$ 346860 348829 351435 354754 358635 362759 366721 370095 372905 375939 380051 385094 390117 394710 399517
53523C99517N756O689P210P497P590P407P295P776Q861J0200J1630J2949J3598
$$ 399517 405273 411962 419172 426669 434259 441666 448961 456737 465598 475798 487428 500377 513975
53510E13975J3447J3403J4265J5447J5908J5934J6609J7812J8310J7885J7822
$$ 513975 527422 540825 555090 570537 586445 602379 618988 636800 655110 672995 690817
53499F90817J8953K0626K2059K3383K4731K5525K5474K5233K5370K5469K5037
$$ 690817 709770 730396 752455 775838 800569 826094 851568 876801 902171 927640 952677
53488I52677K4486K4398K4551K4366K3869K3382K2860K2154K1536K1331K1294
$$ 952677 977163 1001561 1026112 1050478 1074347 1097729 1120589 1142743 1164279 1185610 1206904
53477A206904K1023K0573K0216J9857J9252J8613J8379J8528J8495J7820J6620
$$ 1206904 1227927 1248500 1268716 1288573 1307825 1326438 1344817 1363345 1381840 1399660 1416280
53466A416280J5454J4756J4341J3576J2201J0691R467Q051N743K879N09j142k932
$$ 1416280 1431734 1446490 1460831 1474407 1486608 1497299 1506766 1514817 1520560 1523439 1523948 1522806 1519874
53453A519874n306p607r185j0313j1494j2728j3979j5612j7683j9439k0220k0322
$$ 1519874 1514568 1506961 1497776 1487463 1475969 1463241 1449262 1433650 1415967 1396528 1376308 1355986
53441A355986k0411k0576k0624k0767k1289k1879k1992k1656k1398k1536k1959
$$ 1355986 1335575 1314999 1294375 1273608 1252319 1230440 1208448 1186792 1165394 1143858 1121899
53430A121899k2395k2447k1701k0154j8302j6494j4524j2191r829p860o284m963
$$ 1121899 1099504 1077057 1055356 1035202 1016900 1000406 985882 973691 963862 956002 949718 944755
53418I44755m053l673l450k919k029r20M79K187L861N165O202P234Q352R677J1502
$$ 944755 940702 937029 933579 930660 928631 927711 928190 930377 934238 939403 945605 952839 961191 970868 982370
53403I82370J3860J6284J8328J9925K1044K1596K1964K2949K4746K6603K7980
$$ 982370 996230 1012514 1030842 1050767 1071811 1093407 1115371 1138320 1163066 1189669 1217649
53392A217649K9278L0912L2499L3776L5427L8032M0817M2665M3776M5138M6735
$$ 1217649 1246927 1277839 1310338 1344114 1379541 1417573 1458390 1501055 1544831 1589969 1636704
53381A636704M7625M7670M7871M8830N0080N1046N1650N1755N1007M9625M8309
$$ 1636704 1684329 1731999 1779870 1828700 1878780 1929826 1981476 2033231 2084238 2133863 2182172
53370B182172M7176M5533M3103M0525L8285L6015L3218K9922K6184K1817J7109
$$ 2182172 2229348 2274881 2317984 2358509 2396794 2432809 2466027 2495949 2522133 2543950 2561059
53359B561059J2958R623O157J775k949p173j1388j6738k3063k8786l2782l5405
$$ 2561059 2574017 2583640 2589797 2591572 2588623 2581450 2570062 2553324 2530261 2501475 2468693 2433288
53347B433288l7492l9363m1095m2993m5182m7167m8315m8599m8504m8341m7977
$$ 2433288 2395796 2356433 2315338 2272345 2227163 2179996 2131681 2083082 2034578 1986237 1938260
53336A938260m7091m5497m3334m1070l9279l8271l8013l8315l8875l9104l8290
$$ 1938260 1891169 1845672 1802338 1761268 1721989 1683718 1645705 1607390 1568515 1529411 1491121
53325A491121l6171l3191l0086k7431k5648k4909k4734k4073k2310j9952j7797
$$ 1491121 1454950 1421759 1391673 1364242 1338594 1313685 1288951 1264878 1242568 1222616 1204819
53314A204819j5811j3499j1122r674r514r955j0470j1337j2614j3337j2514j0399
$$ 1204819 1189008 1175509 1164387 1154713 1145199 1135244 1124774 1113437 1100823 1087486 1074972 1064573
53302A064573p970n658l411j616q65q95o75L57J945L843O082Q235R374R240Q843
$$ 1064573 1056603 1050945 1047534 1045918 1045053 1044158 1043483 1043840 1045785 1049628 1055710 1063945 1073319 1082559 1091402
53287A091402R390J1070J3185J5059J6434J7427J8514K0235K2599K4934K6530
$$ 1091402 1100792 1111862 1125047 1140106 1156540 1173967 1192481 1212716 1235315 1260249 1286779
53276A286779K7160K6939K6146K5294K4779K4255K2900K0588J8277J6785J5794
$$ 1286779 1313939 1340878 1367024 1392318 1417097 1441352 1464252 1484840 1503117 1519902 1535696
53265A535696J4443J2427R969P187M148J282r83k782m545o223p397q108r036j0766
$$ 1535696 1550139 1562566 1572535 1579722 1583870 1585152 1584169 1581387 1576842 1570619 1563222 1555114 1546078 1535312
53251A535312j3188j5716j7855j9469k0693k1673k2423k2994k3630k4439k5056
$$ 1535312 1522124 1506408 1488553 1469084 1448391 1426718 1404295 1381301 1357671 1333232 1308176
53240A308176k5003k4460k4092k4015k3601k2535k1372k0593j9774j8358j6814
$$ 1308176 1283173 1258713 1234621 1210606 1187005 1164470 1143098 1122505 1102731 1084373 1067559
53229A067559j6224j6932j8227j9115j8980j7683j5735j4176j3694j3887j3821
$$ 1067559 1051335 1034403 1016176 997061 978081 960398 944663 930487 916793 902906 889085
53218H89085j3103j1985j0725r525q769q576q276p131n524m665n037n930o661
$$ 889085 875982 863997 853272 843747 834978 826402 818126 810995 805471 800806 795769 789839 783178
53205G83178p412q586j0050j1406j2468j3043j2819j1928j1190j1287j1893j2108
$$ 783178 775766 767180 757130 745724 733256 720213 707394 695466 684276 672989 661096 648988
53193F48988j1521j0514r731r525r852j0338j0611j0731j1141j1974j2685j2727
$$ 648988 637467 626953 617222 607697 597845 587507 576896 566165 555024 543050 530365 517638
53181E17638j2355j2317j2817j3258j3045j2240j1272j0455r993j0019j0276j0029
$$ 517638 505283 492966 480149 466891 453846 441606 430334 419879 409886 399867 389591 379562
53169C79562q863p445o934p525q119p738o695n953n771n573n016m446m252m324
$$ 379562 370699 363254 356320 348795 340676 332938 326243 320290 314519 308946 303930 299484 295232 290908
53155B90908m374m380m428m459m392m302m308m418m547m473l861k681j534j168
$$ 290908 286534 282154 277726 273267 268875 264573 260265 255847 251300 246827 242966 240285 238751 237583
53141B37583j550j942j920j781j848j929j792j557j330r21l28K3n8j10K73P49
$$ 237583 236033 234091 232171 230390 228542 226613 224821 223264 221934 221013 220685 220708 220650 220540 220813 221562
53125B21562Q06N87N95Q82J148J384J802K336K718K889K843K297J117j38p23o72
$$ 221562 222368 222955 223550 224432 225580 226964 228766 231102 233820 236709 239552 241849 242966 242828 242105 241433
53109B41433o66j053j602k146k877l849m763n325n510n404n104m783m544m258
$$ 241433 240767 239714 238112 235966 233089 229240 224477 219152 213642 208238 203134 198351 193807 189549
53095A89549l838l467l270k973k350j735j597j781j778j552j467j557j534j446
$$ 189549 185711 182244 178974 176001 173651 171916 170319 168538 166760 165208 163741 162184 160650 159204
53081A59204j597j828j660j206j172j726k116j780j092p51q63j085j130q50k01
$$ 159204 157607 155779 154119 152913 151741 150015 147899 146119 145027 144276 143413 142328 141198 140348 140147
53066A40147M63N11j82r95j343j350j375j347j056o99o45q48r93j030j137j224
$$ 140147 140610 141121 140939 139944 138601 137251 135876 134529 133473 132774 132129 131281 130288 129258 128121 126897
53050A26897j000n42l75p95j419j544q90J32P36M02o48j582j667r43j25J82L4
$$ 126897 125897 125355 124980 124185 122766 121222 120332 120464 121200 121602 120954 119372 117705 116762 116637 116819 116853
53033A16853r8oM6k85r93j720k003j517l67P13Q02j89j167r89J73J119J168P48
$$ 116853 116755 116749 116795 116510 115517 113797 111794 110277 109910 110623 111425 111236 110069 109080 109253 110372 111540 112288
53015A12288M07J7o40j205j167n85J55Q38J330J342Q77M56M32M61J82m3K17N10
$$ 112288 112695 112712 112072 110867 109700 109115 109270 110108 111438 112780 113657 114113 114545 115006 115188 115145 115362 115872
52997A15872O0r43j472j033j51M78O80N39J55j53j1N49J139J566J892K033J837
$$ 115872 115932 114989 113517 112484 112333 112811 113491 114030 114185 114032 114021 114570 115709 117275 119167 121200 123037
52980A23037J470J281J345J620K252L185L748L434K880L117L998M371L846L265
$$ 123037 124507 125788 127133 128753 131005 134190 137938 141372 144252 147369 151367 155738 159584 162849
52966A62849L250L329K968K454K165J762P45p17k105l118l509k926j557l70j28
$$ 162849 166099 169428 172396 174850 177015 178777 179522 178805 176700 173582 170073 167147 165590 165220 165092
52951A65092n08p44p82j150j937k576k611k180j680j280q67l69J8K8k46l56j35
$$ 165092 164584 163840 163058 161908 159971 157395 154784 152604 150924 149644 148777 148408 148426 148454 148208 147852 147717
52934A47717K2j20j27L16N13k88j368j175M32J806J784J038N53O7r35j753j296
$$ 147717 147739 147619 147492 147808 148321 148033 146665 145490 145922 147728 149512 150550 151103 151170 150235 148482 147186
52917A47186J45J197J273R54O70J42p04j154o32M27J074R61O28P12J141J295R63
$$ 147186 147331 148528 149801 150755 151425 151567 150863 149709 149077 149504 150578 151539 152167 152879 154020 155315 156278
52900A56278P73J341K180K125Q85m93r12m11K79P60J088J368J682K117K450K218
$$ 156278 157051 158392 160572 162697 163582 163089 162177 161766 162045 162805 163893 165261 166943 169060 171510 173728
52884A73728J344L33m01r04j100o11M40J164J090R21J366J896J574O36J52L94
$$ 173728 175072 175405 175004 174100 173000 172389 172829 173993 175083 176004 177370 179266 180840 181476 181628 182022
52868A82022O01L12k9J02O35J222J579J494J038P95J259K037K222J614R88J040
$$ 182022 182623 182935 182906 183008 183643 184865 186444 187938 188976 189771 191030 193067 195289 196903 197891 198931
52852A98931J634K241K672L098L656M213M403L996L293K958L225L544L311K561
$$ 198931 200565 202806 205478 208576 212232 216445 220848 224844 228137 231095 234320 237864 241175 243736
52838B43736J556K14j444k693k823k239k035k601l358l815l976l805l200k586
$$ 243736 245292 245506 244062 241369 238546 236307 234272 231671 228313 224498 220522 216717 213517 210931
52824B10931k621l106l082k332j860k388l234l331k739k308k315k248j787j247
$$ 210931 208310 205204 202122 199790 197930 195542 192308 188977 186238 183930 181615 179367 177580 176333
52810A76333j049j259j733k247k430j929q67O4K12m05j168j511j407j216j204
$$ 176333 175284 174025 172292 170045 167615 165686 164819 164883 165095 164690 163522 162011 160604 159388 158184
52795A58184j392j683j923j826j255o42o73j345j777j322m11J46K39K26P6m20
$$ 158184 156792 155109 153186 151360 150105 149463 148790 147445 145668 144346 143935 144081 144320 144546 144622 144202
52779A44202q00l52N59N66q62k516k875j916q66n89q24q84n51j89k34o95j169
$$ 144202 143402 143050 143609 144175 143313 140797 137922 136006 135140 134551 133727 132843 132292 132103 131869 131174 130005
52762A30005j356j448j755k131k194k048k192k642k734k102j314j138j576j998
$$ 130005 128649 127201 125446 123315 121121 119073 116881 114239 111505 109403 108089 106951 105375 103377
52748A03377k004j704j403j355j586j703j231l94j64j011k014j911p96O5k6m77
$$ 103377 101373 99669 98266 96911 95325 93622 92391 91997 91833 90822 88808 86897 86101 86166 86140 85663
52732H5663n70m29l44k9P24J255Q26l0QJ157K082J647L43o03q19p44n54n7M75
$$ 85663 85093 84664 84320 84291 85015 86270 87096 87066 87074 88231 90313 91960 92303 91700 90881 90137 89583 89526 90001
52713I0001L47m87j177j052l25M54J077J465J417J070J032J573K125K109J814
$$ 90001 90348 89861 88684 87632 87307 87761 88838 90303 91720 92790 93822 95395 97520 99629 101443
52698A01443J801J931J702J310J425J980K078J250L8q83j479j902j998j672j364
$$ 101443 103244 105175 106877 108187 109612 111592 113670 114920 114958 114075 112596 110694 108696 107024 105660
52683A05660j524j924j949j429p90m94o67j214j967k624k860k602k112j682j388
$$ 105660 104136 102212 100263 98834 98044 97550 96883 95669 93702 91078 88218 85616 83504 81822 80434
52668H0434j198j194j420j597j237l04N02M39l24q94p34j99J82L90O53R09R49
$$ 80434 79236 78042 76622 75025 73788 73484 73986 74425 74101 73207 72473 72274 72456 72846 73499 74408 75357
52651G5357Q38P85P71O82N64M65K34j70m09k59r2m15j077j448j247o56J89J276
$$ 75357 76195 76980 77751 78433 78997 79462 79696 79526 79117 78858 78766 78351 77274 75826 74579 73923 74112 75388
52633G5388K373L101L386L305K624J139n75j472j294q49q60j172j369j526j864
$$ 75388 77761 80862 84248 87553 90177 91316 90741 89269 87975 87126 86266 85094 83725 82199 80335
52618H0335k159k032j589j257j140q98k78N36J131J302J241J260J344J156O17
$$ 80335 78176 76144 74555 73298 72158 71260 70982 71518 72649 73951 75192 76452 77796 78952 79569
52603G9569K00L57Q50J114J083J135J341J321R43N64M87O37Q82J178J311J013
$$ 79569 79769 80126 80976 82090 83173 84308 85649 86970 87913 88477 88964 89601 90483 91661 92972 93985
52587I3985M72K20M05O84Q83J151J287P57l07q66k32R40J574J567J590J877J892
$$ 93985 94457 94677 95082 95766 96649 97800 99087 99844 99537 98671 98439 99379 100953 102520 104110 105987 107879
52570A07879J221K24l45r7O36J156J135R96J328J981K250J959J679J734J663J146
$$ 107879 109100 109324 108979 108882 109518 110674 111809 112805 114133 116114 118364 120323 122002 123736 125399 126545
52554A26545P16R55J492J571J211J025J147J111P46M48M77N76M57K29K01N17J078
$$ 126545 127261 128216 129708 131279 132490 133515 134662 135773 136519 136967 137444 138020 138477 138706 138907 139424 140502
52537A40502J565J546Q82k5n54m34J60Q24J070N48m80j129q09L5M97L54J30J69
$$ 140502 142067 143613 144495 144470 143916 143482 143642 144466 145536 146084 145604 144475 143666 143701 144198 144552 144682 144851
52519A44851K86L01L31M20L51P5j20q0j3j05k22k74n17j129j688j492m41P17J157
$$ 144851 145137 145438 145769 146189 146540 146615 146495 146415 146402 146297 146075 145801 145284 144155 142467 140975 140534 141251 142408
52500A42408Q12K77L9N4R3J57K85K41j61n31k23P16J435J292N53j28m27k35N52
$$ 142408 143220 143497 143536 143590 143683 143840 144125 144366 144205 143674 143451 144167 145602 146894 147447 147319 146892 146657 147209
52481A47209J667K249J811J005Q41J256J282N46k28l15J23N20O56N50J74k53j63
$$ 147209 148876 151125 152936 153941 154782 156038 157320 157866 157638 157323 157446 157966 158622 159172 159346 159093 158930
52464A58930P02J700J907J246N82O42J204J455R79J34m19l83K6M73P94R68J000
$$ 158930 159632 161332 163239 164485 165067 165709 166913 168368 169347 169481 169062 168679 168705 169178 169972 170940 171940
52447A71940R68J007J090R84N40k6l44k61J46P16J237J454J277Q81M51M3k07p4
$$ 171940 172908 173915 175005 175989 176529 176503 176159 175898 176044 176760 177997 179451 180728 181609 182060 182103 181896 181822
52429A81822K36P3p34j327r49k54n81j969k896k302r69l26o76j259j498j426j140
$$ 181822 182058 182131 181397 180070 179121 178867 178286 176317 173421 171119 170150 169824 169148 167889 166391 164965 163825
52412A63825o71k95l33n75m85m3J96m5l16j60J82J65k24m24kQ32J493J531R80
$$ 163825 163154 162859 162526 161951 161466 161423 161619 161574 161258 161098 161280 161445 161221 160797 160795 161627 163120 164651 165631
52393A65631L24J02M20Q26Q45N54L62L15mo91j074m64Q13J711J738J411J333J382
$$ 165631 165955 166057 166477 167303 168148 168702 169064 169379 169375 168684 167610 167146 167959 169670 171408 172819 174152 175534
52375A75534J141P39O38Q60R52P42O45J090J988K798K960K322J376R77J459K099
$$ 175534 176675 177414 178052 178912 179864 180606 181251 182341 184329 187127 190087 192409 193785 194762 196221 198320
52359A98320J913R82L67O37J190J329J347J900K812L260K959K426K107J932J850
$$ 198320 200233 201215 201582 202219 203409 204738 206085 207985 210797 214057 217016 219442 221549 223481 225331
52344B25331K172L073M121M637M295L275K017J048P36R83J376J631J740J585R23
$$ 225331 227503 230576 234697 239334 243629 246904 248921 249969 250705 251688 253064 254695 256435 258020 258943
52329B58943k6l63N73K305L607L744K952J925J221J130J554K017K114K072K408
$$ 258943 258917 258554 259127 261432 265039 268783 271735 273660 274881 276011 277565 279582 281696 283768 286176
52314B86176L043L255K756K239K486L345M083M450M892N749O783P569Q021Q391
$$ 286176 289219 292474 295230 297469 299955 303300 307383 311833 316725 322474 329257 336826 344847 353238
52300C53238Q898R494R862R682R053Q559Q838J0007J1639J3141J4128J4499J4425
$$ 353238 362136 371630 381492 391174 400227 408786 417624 427631 439270 452411 466539 481038 495463
52287D95463J4203J4032J4025J4378J5225J6190J6555J6161J5681J5611J5446
$$ 495463 509666 523698 537723 552101 567326 583516 600071 616232 631913 647524 662970
52276F62970J4570J3538J3482J4287J4466J3148J1212R863Q965P647N995N009
$$ 662970 677540 691078 704560 718847 733313 746461 757673 767536 776501 784148 790143 795152
52264G95152M962M846L724J953N80K9j87o13j259j792k022j983j785j588j620
$$ 795152 800114 804960 808684 810637 811217 811246 811059 810446 809187 807395 805373 803390 801605 800017 798397
52249G98397j981k406k488k216k105k463k780k156l71J806L454M349M909N573
$$ 798397 796416 794010 791522 789306 787201 784738 781958 779802 779431 781237 784691 789040 793949 799522
52235G99522O437P381Q300R147R856J0346J0670J1092J1750J2341J2352J1778
$$ 799522 805959 813340 821640 830787 840643 850989 861659 872751 884501 896842 909194 920972
52223I20972J1095J0482R534Q201P331P545Q010P321N388L421K064O66j273l147
$$ 920972 932067 942549 952083 960284 967615 975160 983170 990491 995879 999300 1001364 1002030 1000757 997610
52209I97610m272m915n638o385o980p774q911r682r542r234r802j0811j0863r761
$$ 997610 993338 988423 982785 976400 969420 961646 952735 943053 933511 924277 914475 903664 892801 883040
52195H83040q910r249r912r519q006o464n643n308m909m358l927l732l521l071
$$ 883040 874130 864881 854969 845450 837444 830980 825337 820029 815120 810762 806835 803103 799582 796511
52181G96511k589k462k558k256j390p27j030j956k556k554k464k492k166j303
$$ 796511 793922 791460 788902 786646 785256 784529 783499 781543 778987 776433 773969 771477 769311 768008
52167G68008n98p72j622k328k510k546k911l575m100m174l969l879l989l909l332
$$ 768008 767410 766638 765016 762688 760178 757632 754721 751146 747046 742872 738903 735024 731035 727126 723794
52152G23794k479j848j613j614j763k119k618l004l089k861k433k122k351l099
$$ 723794 721315 719467 717854 716240 714477 712358 709740 706736 703647 700786 698353 696231 693880 690781
52138F90781l628l253k366k126l046m384n092m942m438l982l577l145k744k485
$$ 690781 687153 683900 681534 679408 676362 671978 666886 661944 657506 653524 649947 646802 644058 641573
52124F41573k349k261k236k400k812l319l711l941l953l429k141o11K46L19N40
$$ 641573 639224 636963 634727 632327 629515 626196 622485 618544 614591 611162 609021 608410 608656 608975 609515
52109F09515J450K273K133J551J730K738L556L836M420N899P726R176J0228J1039
$$ 609515 610965 613238 615371 616922 618652 621390 624946 628782 633202 639101 646827 656003 666231 677270
52095F77270J1461J1625J2272J3811J5623J6912J7762J8693J9694K0437K1094
$$ 677270 688731 700356 712628 726439 742062 758974 776736 795429 815123 835560 856654
$$ [...]
##END NTUPLES=NMR SPECTRUM
##END=
