
##TITLE=AC1233_PERAH12114_6519287_kQ2xMY586G
##JCAMPDX= 6.0         $$ Bruker NMR JCAMP-DX V2.0
##DATA TYPE= NMR SPECTRUM
##DATA CLASS= NTUPLES
##ORIGIN= BRUKER
##OWNER= Administrator
$$ 1.72 TOPSPIN		Version 2.1
$$ 2012-07-13 16:51:23.421 -0500  Administrator@TOPSPIN
$$ Compression mode = diff/dup
##.OBSERVE FREQUENCY= 400.02188249412
##.OBSERVE NUCLEUS= ^1H
##.ACQUISITION MODE= SIMULTANEOUS (DQD)
##.ACQUISITION SCHEME= undefined
##.AVERAGES= 8
##.DIGITISER RES= 22
##SPECTROMETER/DATA SYSTEM= spect
##.PULSE SEQUENCE= zg30
##.SOLVENT NAME= COFFEE_meoh
##.SHIFT REFERENCE= INTERNAL, COFFEE_meoh, 1, 14.98509
##AUDIT TRAIL= $$ (NUMBER, WHEN, WHO, WHERE, PROCESS, VERSION, WHAT)
$$ ##TITLE= Audit trail, TOPSPIN		Version 2.1
$$ ##JCAMPDX= 5.01
$$ ##ORIGIN= Bruker BioSpin GmbH
$$ ##OWNER= Administrator
$$ $$ C:\Bruker\TOPSPIN/data/COFFEE/nmr/AC1233_PERAH12114_6519287_kQ2xMY586G/30/pdata/1/auditp.txt
$$ ##AUDIT TRAIL=  $$ (NUMBER, WHEN, WHO, WHERE, PROCESS, VERSION, WHAT)
(   1,<2012-07-13 16:51:15.953 -0500>,<Administrator>,<TOPSPIN>,<go>,<TOPSPIN 2.1>,
      <created by zg
	started at 2012-07-13 16:50:09.343 -0500,
	POWCHK enabled, PULCHK disabled,
       configuration hash MD5:
       6B 1B 68 BB D9 2E 58 E2 7F 35 AD 54 07 DF 0E 41
       data hash MD5: 64K
       C3 B3 8A DA F3 55 C4 F6 02 26 6E A3 D8 08 4B 9A>)
(   2,<2012-07-13 16:51:18.875 -0500>,<Administrator>,<TOPSPIN>,<proc1d>,<TOPSPIN 2.1>,
      <Start of raw data processing
       efp LB = 0 FT_mod = 6 PKNL = 1 PHC0 = 0 PHC1 = 0 SI = 32K 
       data hash MD5: 32K
       06 5B BF A0 35 46 ED 5A 54 57 96 90 6D 96 10 6A>)
(   3,<2012-07-13 16:51:19.328 -0500>,<Administrator>,<TOPSPIN>,<proc1d>,<TOPSPIN 2.1>,
      <pk PHC0 = 179.4122 PHC1 = 0 
       data hash MD5: 32K
       8B 7B CE 25 2A 0D A8 F8 A6 4B 99 A6 1A B8 C5 0B>)
(   4,<2012-07-13 16:51:19.421 -0500>,<Administrator>,<TOPSPIN>,<proc1d>,<TOPSPIN 2.1>,
      <abs ABSG = 1 
       data hash MD5: 32K
       E0 C0 76 C7 7A 80 AA D9 9C C9 5C E2 08 8E 34 EB>)
(   5,<2012-07-13 16:51:19.453 -0500>,<Administrator>,<TOPSPIN>,<proc1d>,<TOPSPIN 2.1>,
      <abs ABSG = 2 
       data hash MD5: 32K
       4E 41 FC E1 47 EA 87 11 35 56 73 7C 75 9F 03 18>)
(   6,<2012-07-13 16:51:19.484 -0500>,<Administrator>,<TOPSPIN>,<proc1d>,<TOPSPIN 2.1>,
      <abs ABSG = 3 
       data hash MD5: 32K
       9E 51 94 00 8D 88 55 3D 19 FC 52 3B 55 36 52 4D>)
(   7,<2012-07-13 16:51:19.515 -0500>,<Administrator>,<TOPSPIN>,<proc1d>,<TOPSPIN 2.1>,
      <abs ABSG = 4 
       data hash MD5: 32K
       14 E7 A4 BC 9B 44 2B 49 3D AE F0 36 8A CD 01 C4>)
(   8,<2012-07-13 16:51:19.546 -0500>,<Administrator>,<TOPSPIN>,<proc1d>,<TOPSPIN 2.1>,
      <abs ABSG = 5 
       data hash MD5: 32K
       8D DC 3E CA 71 4B A9 DF 66 F8 71 2D 7A 24 2F 54>)
$$ ##END=
$$ 
$$ $$ hash MD5
$$ $$ 7B 64 89 F5 8B 66 28 DF 61 A0 5D FB D0 52 89 E8
##$RELAX= 
##$RELAX= 
##$RELAX= 
##$RELAX= 
##$RELAX= 
##$RELAX= 
##$RELAX= 
##$RELAX= 
$$ Bruker specific parameters
$$ [...]
150 150 150 150 150 150 150 150
##$TP07= 0
##$TPNAME0= <>
##$TPNAME1= <>
##$TPNAME2= <>
##$TPNAME3= <>
##$TPNAME4= <>
##$TPNAME5= <>
##$TPNAME6= <>
##$TPNAME7= <>
##$TPOAL= (0..7)
0.5 0.5 0.5 0.5 0.5 0.5 0.5 0.5
##$TPOFFS= (0..7)
0 0 0 0 0 0 0 0
##$TUNHIN= 0
##$TUNHOUT= 0
##$TUNXOUT= 0
##$USERA1= <user>
##$USERA2= <user>
##$USERA3= <user>
##$USERA4= <user>
##$USERA5= <user>
##$V9= 5
##$VALIST= <valist>
##$VCLIST= <CCCCCCCCCCCCCCC>
##$VD= 0
##$VDLIST= <DDDDDDDDDDDDDDD>
##$VPLIST= <PPPPPPPPPPPPPPP>
##$VTLIST= <TTTTTTTTTTTTTTT>
##$WBST= 2048
##$WBSW= 25
##$XGAIN= (0..3)
0 0 0 0
##$XL= 0
##$YL= 0
##$YMAX_a= 511645
##$YMIN_a= -656894
##$ZGOPTNS= <>
##$ZL1= 120
##$ZL2= 120
##$ZL3= 120
##$ZL4= 120
##$ABSF1= 14.98509
##$ABSF2= -5.573092
##$ABSG= 5
##$ABSL= 3
##$ALPHA= 0
##$AQORDER= 0
##$ASSFAC= 0
##$ASSFACI= 0
##$ASSFACX= 0
##$ASSWID= 0
##$AUNMP= <proc_prof1d_extract_pilot.lims>
##$AXLEFT= 0
##$AXNAME= <>
##$AXNUC= <1H>
##$AXRIGHT= 0
##$AXTYPE= 0
##$AXUNIT= <>
##$AZFE= 0.1
##$AZFW= 0.1
##$BCFW= 0
##$BC_mod= 0
##$BYTORDP= 0
##$COROFFS= 0
##$CY= 15
##$DATMOD= 1
##$DC= 0
##$DFILT= <>
##$DTYPP= 0
##$F1P= 0
##$F2P= 0
##$FCOR= 0.5
##$FTSIZE= 32768
##$FT_mod= 6
##$GAMMA= 0
##$GB= 0
##$INTBC= 1
##$INTSCL= 1
##$ISEN= 128
##$LB= 0
##$LEV0= 0
##$LPBIN= 0
##$MAXI= 10000
##$MC2= 0
##$MEAN= 0
##$ME_mod= 0
##$MI= 0
##$NCOEF= 0
##$NC_proc= -8
##$NLEV= 6
##$NOISF1= 0
##$NOISF2= 0
##$NSP= 0
##$NTH_PI= 0
##$NZP= 0
##$OFFSET= 14.98509
##$PC= 1
##$PHC0= 179.4122
##$PHC1= 0
##$PH_mod= 1
##$PKNL= yes
##$PPARMOD= 0
##$PPDIAG= 0
##$PPIPTYP= 0
##$PPMPNUM= 2147483647
##$PPRESOL= 1
##$PSCAL= 4
##$PSIGN= 0
##$PYNMP= <proc.py>
##$REVERSE= no
##$SF= 400.02
##$SI= 32768
##$SIGF1= 0
##$SIGF2= 0
##$SINO= 400
##$SIOLD= 32768
##$SPECTYP= <>
##$SREGLST= <1H.CDCl3>
##$SSB= 0
##$STSI= 32768
##$STSR= 0
##$SW_p= 8223.68421052631
##$SYMM= 0
##$S_DEV= 0
##$TDeff= 65536
##$TDoff= 0
##$TI= <>
##$TILT= no
##$TM1= 0
##$TM2= 0
##$TOPLEV= 0
##$USERP1= <user>
##$USERP2= <user>
##$USERP3= <user>
##$USERP4= <user>
##$USERP5= <user>
##$WDW= 1
##$XDIM= 32768
##$YMAX_p= 483534270
##$YMIN_p= -828488
##$CURPLOT= <Network HP LaserJet P1505>
##$CURPRIN= <$Network HP LaserJet P1505>
##$DFORMAT= <normdp>
##$LAYOUT= <+/1D_H.xwp>
##$LFORMAT= <normlp>
##$PFORMAT= <normpl>
##$SURQMSG= 1
$$ End of Bruker specific parameters
$$ ---------------------------------
##NTUPLES= NMR SPECTRUM
##VAR_NAME=  FREQUENCY,     SPECTRUM/REAL,   SPECTRUM/IMAG
##SYMBOL=    X,             R,               I
##VAR_TYPE=  INDEPENDENT,   DEPENDENT,       DEPENDENT
##VAR_FORM=  AFFN,          ASDF,            ASDF
##VAR_DIM=   32768,         32768,           32768
##UNITS=     HZ,            ARBITRARY UNITS, ARBITRARY UNITS
##FACTOR=    0.250966925370066, 1,           1
##FIRST=     8223.43324360094, -142990,      49181
##LAST=      0,             -111501,         -242500
##MIN=       0,             -828488,         0
##MAX=       8223.43324360094, 483534270,    0
$$ Real data points
##PAGE= N=1
##DATA TABLE= (X++(R..R)), XYDATA
$$ [...]
19522d23795f7694F9691c61661I9504e5092m8412j09064k2515A19851h4057A5570
$$ -423795 -67694 69691 -361661 99504 -55092 -103504 -212568 -235083 119851 -84057 15570
19510a26313M617A7194b18093K3111F7792b2178C38462c4380j97713k54311k2005
$$ -126313 -121696 17194 -218093 -194982 67792 -22178 338462 -34380 -232093 -486404 -508409
19499e08409b30600C5257c01355A26396a46384G8342h55A84982c86502B66646
$$ -508409 -230600 35257 -301355 126396 -146384 78342 -855 184982 -386502 266646
19488a47001r663g4802k41644J49188j59622A03880l6720K73795c10044a12084
$$ -147001 -156664 -74802 -316446 -167258 -326880 103880 67160 340955 -310044 -112084
19477c19197A19806A6141c26380i9604J7576G6961c5138B18615a74166A24106
$$ -319197 119806 16141 -326380 -99604 -82028 76961 -35138 218615 -174166 124106
19466A37105L66A9688b17562O2337A35215e40677B26609c3791B6846b24212G8859
$$ 137105 137471 19688 -217562 -155225 135215 -540677 226609 -33791 26846 -224212 78859
19454c06630r6662E5142A9141a54484j08790N4623j57094b6569k07171D3908d89414
$$ -306630 -403292 55142 19141 -154484 -263274 -208651 -365745 -26569 -233740 43908 -489414
19442d47516J36448j1539B34091J5085d230D538d29610a03431q8759P3424D4063
$$ -447516 -311068 -322607 234091 249176 -4230 4538 -429610 -103431 -192190 -118766 44063
19430B1281c22088A09974e4171D9323L65163A12025c39168B69074c8746E2004
$$ 21281 -322088 109974 -54171 49323 414486 112025 -339168 269074 -38746 52004
19419A98406h3500j09402g2713B09869J66322g1725I486g3591J9966A57643j3575
$$ 198406 -83500 -192902 -72713 209869 376191 -71725 9486 -73591 -53625 157643 144068
19408A44068b53608B32713b5377A00890a24121n4267L0085m6816P7311L1469C0901
$$ 144068 -253608 232713 -25377 100890 -124121 -178388 -148303 -195119 -117808 -86339 30901
19396B84493a67077k02595a16674a6422c119j82242k09486B45733b6362q1478
$$ 284493 -167077 -369672 -116674 -16422 -3119 -185361 -394847 245733 -26362 -107840
19386a07840j65831j92731g1750E4788j0512c00151N8243c3055A75633a87637
$$ -107840 -273671 -466402 -71750 54788 44276 -300151 -241908 -33055 175633 -187637
19375b01775C28062G2008a69939m0857j14885a09389I2199B2134a81846N5408
$$ -201775 328062 72008 -169939 -210796 -325681 -109389 92199 22134 -181846 -126438
19365a26438A71642a66916m3008d7499k32531A7193g0849A0679L31612A4618a2427
$$ -126438 171642 -166916 -209924 -47499 -280030 17193 -70849 10679 342291 14618 -12427
19353b33500f2397D7933J3786b81780C30993g5218E7214J12577e5446A44968I194
$$ -233500 -62397 47933 61719 -281780 330993 -75218 57214 169791 -55446 144968 9194
19341A20847b64518h4013a5907B24086q7486k8608b82923d0344B7648g9140B48472
$$ 120847 -264518 -84013 -15907 224086 136600 107992 -282923 -40344 27648 -79140 248472
19329e07635b2046C6026e71492h8476j6002D5382c62112a80210b0311H6565P1804
$$ -507635 -22046 36026 -571492 -88476 -104478 45382 -362112 -180210 -20311 86565 158369
19318A58369b36575B18694a67876l5313K2478m3086A05676a60891r2481F6851
$$ 158369 -236575 218694 -167876 -203189 -180711 -223797 105676 -160891 -253372 66851
19307a16525M844l15515a69615F7461b23789J8145G535O8307a72107j09412J30820
$$ -116525 -111681 -427196 -169615 67461 -223789 -205644 7535 75842 -172107 -281519 -150699
19296a50699A20754b27751A88951a17513A96021a97263g3259b1219F2080B9121
$$ -150699 120754 -227751 188951 -117513 196021 -197263 -73259 -21219 62080 29121
19285d19843a64424k2908G4946R085a36209k834M9441j90962A92288a30285k1424
$$ -419843 -164424 -187332 74946 84031 -136209 -139043 -89602 -280564 192288 -130285 -151709
19274a51709P3596l63644a35905K7709H1099b42250b2157k71915R7378D3760c5252
$$ -151709 -78113 -441757 -135905 -108196 81099 -242250 -22157 -294072 -196694 43760 -35252
19262d53703d1854j23458P4797I8224J17802h523o5583l39880A50665J8820C2631
$$ -453703 -41854 -165312 -90515 98224 216026 -8523 -74106 -413986 150665 169485 32631
19250a29761e8584K0477B06604H9517d17833J03540A7807b56151C3077A6243b75816
$$ -129761 -58584 -38107 206604 89517 -417833 -314293 17807 -256151 33077 16243 -275816
19238a14794j07703e3060C1544C01J00005b40765D7672J75229b20299B01962f7228
$$ -114794 -222497 -53060 31544 301 100306 -240765 47672 222901 -220299 201962 -67228
19226b81473A1422c6118j32249M4685a5607A42933h8702C1991a70308B91684h933
$$ -281473 11422 -36118 -168367 -123682 -15607 142933 -88702 31991 -170308 291684 -8933
19214b45352B8947b98580c3215B65588G9749J30510d87448F9346d6045n2243A44264
$$ -245352 28947 -298580 -33215 265588 79749 210259 -487448 69346 -46045 -98288 144264
19202e06546h1528j32451e8009J0883j69049G3286a97403C4211K1635h8319l8037
$$ -506546 -81528 -213979 -58009 -47126 -216175 73286 -197403 34211 55846 -88319 -126356
19191a26356l61901a77364g2059K8431n5793j77359L9774F6612d73806a95272
$$ -126356 -488257 -177364 -72059 -43628 -99421 -276780 -237006 66612 -473806 -195272
19180B14253a36215M3787l7395B12364J55447j08515G28K5753a80258J8958a9240
$$ 214253 -136215 -92428 -129823 212364 367811 259296 728 26481 -180258 -161300 -19240
19168a63924M9492B39535F2170G985f2259B02404e0000l42853a84800j2266B10314
$$ -163924 -114432 239535 62170 7985 -62259 202404 -50000 -392853 -184800 -197066 210314
19156C09165b2848k26317B01069b9108J1620j61532e4455a6224l8436Q177k32282
$$ 309165 -22848 -249165 201069 -29108 -17488 -179020 -54455 -16224 -54660 -46483 -278765
19145b78765h2122A5443b20520f5238k70010h9621m9292N8617H8156c4066k32635
$$ -278765 -82122 15443 -220520 -65238 -335248 -89621 -138913 -80296 88156 -34066 -266701
19134b66701A9897a64466N5973D2584N49a68571O5313I5123e9057n6660j46117
$$ -266701 19897 -164466 -108493 42584 43133 -168571 -103258 95123 -59057 -115717 -261834
19123b61834d41j68827A12310b08052I6116b05990E4803f4802o673l97079a45760
$$ -261834 -441 -169268 112310 -208052 96116 -205990 54803 -64802 -71475 -468554 -145760
19111A24633d46013B64277C1101a472A79333b24207d6055o4773L7752j37899D5483
$$ 124633 -446013 264277 31101 -1472 179333 -224207 -46055 -110828 -73076 -210975 45483
19099f9967A08906b9646C48126h9188q473C4576K24455a66297B47219D0032P6829
$$ -69967 108906 -29646 348126 -89188 -97661 34576 259031 -166297 247219 40032 116861
19088A16861D8822K48623f8283j68102P5795A56445b13795d8470e629j19467j12490
$$ 116861 48822 297445 -68283 -236385 -160590 156445 -213795 -48470 -5629 -125096 -237586
19077b37586A39746N9746a24843N8625A66712i2153L1516j89902P7919A29368
$$ -237586 139746 199492 -124843 -66218 166712 -92153 -60637 -250539 -172620 129368
19066a95045B96117i7684A8429a16099B07587h6716i506o3895l4136A05928c02094
$$ -195045 296117 -97684 18429 -116099 207587 -86716 -9506 -73401 -107537 105928 -302094
19054a49581B26485C3517b43525J03797M3120k68650A17390d5567k45254A39372
$$ -149581 226485 33517 -243525 -139728 -96608 -365258 117390 -45567 -290821 139372
19043B5455c98208a71998A25405c3102j35850E9657N1548B4985K7818a44432G0065
$$ 25455 -398208 -171998 125405 -33102 -168952 59657 111205 24985 52803 -144432 70065
19031A25172b98292Q757F7239P8455J10760A0576K99256M0871j19743l7014I0212
$$ 125172 -298292 -289535 67239 145694 256454 10576 309832 350703 230960 193946 90212
19019a74768I232P7915h2852B71044n368a07916j03559C2502Q9923h8713A3521
$$ -174768 9232 87147 -82852 271044 265676 -107916 -211475 32502 122425 -88713 13521
19007b09167R6633B07965b26935C3124J04571a27018N9245r4543j6848A58014
$$ -209167 -112534 207965 -226935 33124 137695 -127018 -67773 -162316 -179164 158014
18996a68543d9644k05562B86028J1818A0175d12712I3039M832a48003p5658E0460
$$ -168543 -49644 -255206 286028 297846 10175 -412712 93039 97871 -148003 -223661 50460
18984d3843E2357d2782q7443A65761b01745e3309N597r097l03410M1574D4582
$$ -43843 52357 -42782 -130225 165761 -201745 -53309 -47712 -56809 -360219 -318645 44582
18972b1805B26765b39736m5058B20244a9156j52142m7619c8125G1287M7669b63939
$$ -21805 226765 -239736 -284794 220244 -19156 -171298 -218917 -38125 71287 118956 -263939
18960e1794r1012F7126i7896b4588B27106b24116B66519j24377a4242k42234j49946
$$ -51794 -142806 67126 -97896 -24588 227106 -224116 266519 142142 -14242 -256476 -406422
18949d06422o0288e6081A19464c9368j42598A05999j6837J17462J08079B8714
$$ -406422 -466710 -56081 119464 -39368 -181966 105999 89162 206624 314703 28714
18938a50762k4205m48k0690j17451J46966A8801J09294A4162d69j34264J2322
$$ -150762 -174967 -175415 -196105 -313556 -166590 18801 128095 14162 -469 -134733 -122411
18927a22411A02660C9624a36885b2980l19035b9001j92904a7434Ia38591B51006
$$ -122411 102660 39624 -136885 -22980 -342015 -29001 -221905 -17434 9 -138591 251006
18915a24514A56228a57329B87756A6004a54272O873A0473i7326o527j30433A09267
$$ -124514 156228 -157329 287756 16004 -154272 -147399 10473 -97326 -103853 -234286 109267
18903b18434m8547a745m3190A24079F1572b68194A08941B0010J16379a64878E0024
$$ -218434 -266981 -1745 -44935 124079 61572 -268194 108941 20010 136389 -164878 50024
18891e592j84834A06371O4804a41892k4222o354A41168f890r4339A41034H045
$$ -5592 -190426 106371 171175 -141892 -166114 -172468 141168 -6890 -101229 141034 8045
18879b8306j0819A77460a91043F3529c14760F5310a68565K3352d7363C8630a48905
$$ -28306 -39125 177460 -191043 63529 -314760 65310 -168565 -145213 -47363 38630 -148905
18867g0842k38886N4330P7333l1773A89135b20151A8451H04a17317A9087a78355
$$ -70842 -309728 -255398 -178065 -209838 189135 -220151 18451 804 -117317 19087 -178355
18855B21690q048e3514b3944j91750K0902B31751b29194A85554G1617h5944i855
$$ 221690 213642 -53514 -23944 -215694 -194792 231751 -229194 185554 71617 -85944 -9855
18843B00576q8516a15024m5368k4442A14828O9504Q0366b6739A20419b23564h7650
$$ 200576 112060 -115024 -160392 -184834 114828 184332 264698 -26739 120419 -223564 -87650
18831a78908o8364j23095B55074a17744l42543c7891j60390i8224a5121j071G0957
$$ -178908 -247272 -370367 255074 -117744 -460287 -37891 -198281 -98224 -15121 -16192 70957
18819B3981G510b28271R6336A17682l5484O65491D6521J58034a34600f1096j82268
$$ 23981 7510 -228271 -131935 117682 82198 747689 46521 204555 -134600 -61096 -243364
18808b43364A23563l9954L24573A92418r0932j2043b19736p684e6458j44254N7609
$$ -243364 123563 83609 408182 192418 101486 89443 -219736 -227420 -56458 -200712 -143103
18797a43103m1382O6314A8504c07425a32914j30786i690B74668c32277f0223k7409
$$ -143103 -184485 -118171 18504 -307425 -132914 -263700 -9690 274668 -332277 -60223 -87632
18786h7632B9577J72599i661k5114k84760A15519Q9009G316M3064c4639j072m5428
$$ -87632 29577 202176 -9661 -34775 -319535 115519 204528 7316 50380 -34639 -35711 -81139
18774h1139R724B11598g09054D6551b36289c8658J3103l1293I367e3378l15620
$$ -81139 -71415 211598 -709054 46551 -236289 -38658 -25555 -56848 9367 -53378 -368998
18763c68998H9779l9787J59715b23224A4274J1011b13143m1852k2180h3911j0709
$$ -368998 89779 49992 209707 -223224 14274 25285 -213143 -254995 -277175 -83911 -94620
18752i4620m4295A36943I555R3182h6513r7020f1118o9647G9195b4796A24826
$$ -94620 -138915 136943 9555 102737 -86513 -183533 -61118 -130765 79195 -24796 124826
18740a19260A18564l6770d8924A40549D8908b9496E8708d1815k93306i0185j33355
$$ -119260 118564 81794 -48924 140549 48908 -29496 58708 -41815 -335121 -90185 -223540
18729b23540B7658B209J33446b33383a0876o1035j91695A08534g1882j11137g0623
$$ -223540 27658 2209 135655 -233383 -10876 -71911 -263606 108534 -71882 -183019 -70623
18717G7964b70358m2521A93218b45662A66369D1615i4148p2095D6206a62825J5036
$$ 77964 -270358 -312879 193218 -245662 166369 41615 -94148 -166243 46206 -162825 -147789
18706a47789r1785e0756C02350a91360h3236I0996a0543j71144m3156f2199j48971
$$ -147789 -239574 -50756 302350 -191360 -83236 90996 -10543 -181687 -224843 -62199 -211170
18695b11170D3087b46088B369a83598k39254A29912a34348j27152j86760c7323
$$ -211170 43087 -246088 2369 -183598 -422852 129912 -134348 -261500 -448260 -37323
18684a24377F9381J71693c14619i3560Q103A47409h912k54232j11425A09375D4625
$$ -124377 69381 241074 -314619 -93560 -85457 147409 -8912 -263144 -374569 109375 44625
18672F2873b33409B49952b8266p0393n1431k7216f6663m57975d3316B44589b01936
$$ 62873 -233409 249952 -28266 -98659 -150090 -177306 -66663 -524638 -43316 244589 -201936
18660g1374o8816A20431b12538f901l293o2579j71817L1125N8620O8958F3171
$$ -71374 -140190 120431 -212538 -6901 -10194 -72773 -244590 -213465 -154845 -85887 63171
18648c08902B3988n401b27529I3884j9176j2937b0047j11336C8354P9662g9101
$$ -308902 23988 18587 -227529 93884 74708 61771 -20047 -131383 38354 118016 -79101
18636A71483B3824a17503B7089a37088l0888h1014q0329L5635j79351B9980J85717
$$ 171483 23824 -117503 27089 -137088 -167976 -81014 -161343 -125708 -305059 29980 215697
18625B15697a58961C43324A25257b55780i96k07465E250b61187A74360a42283
$$ 215697 -158961 343324 125257 -255780 -996 -208461 5250 -261187 174360 -142283
18614a71307L3208f0087A68506c48497a52393j40358h7303j53088g7653j57808
$$ -171307 -138099 -60087 168506 -348497 -152393 -292751 -87303 -240391 -77653 -235461
18604b35461e249J555k14966j1659c5347m61593O9647B21a26874E0707r011a20985
$$ -235461 -5249 -3694 -218660 -230319 -35347 -496940 -427293 221 -126874 50707 41696 -120985
18591B1071c40475J25070b4455j59704j4051B70060e3406k94413a1400G3713J56200
$$ 21071 -340475 -215405 -24455 -184159 -198210 270060 -53406 -347819 -11400 73713 229913
18580B29913g7538n1340q2286D4648J11064c2495G9350J10409B8931b35210L1506
$$ 229913 -77538 -128878 -211164 44648 155712 -32495 79350 189759 28931 -235210 -203704
18569b03704G1303C822a60366A01763b05427B00165b876A36721b80726l8882J54245
$$ -203704 71303 3822 -160366 101763 -205427 200165 -2876 136721 -280726 -319608 -165363
18558a65363m6280i0943g084q8730l03135G847d45682e7243A46484a58350N166
$$ -165363 -211643 -90943 -7084 -95814 -398949 7847 -445682 -57243 146484 -158350 -153184
18547a53184M3202J1880A8094h6641j49328F8833B8844a38737A20833K168c03285
$$ -153184 -109982 -98102 18094 -86641 -235969 68833 28844 -138737 120833 123001 -303285
18535C1893Q5285O6496Q6895R3215a6449B09619o9864A4369b18797D8893J09648
$$ 31893 117178 183674 270569 363784 -16449 209619 139755 14369 -218797 48893 158541
18524A58541M1368e4887B6579f4936H9821a07559p4781Q0755p4265F4704a45974
$$ 158541 199909 -54887 26579 -64936 89821 -107559 -182340 -101585 -175850 64704 -145974
18512D1660N0333b47913p440E0397c77927Q9647A66704a85667j02563J43463B06756
$$ 41660 91993 -247913 -255353 50397 -377927 -288280 166704 -185667 -288230 -144767 206756
18500b93249a6752j35524A59201b49161i6336m3483O7864j96196f4145j17871
$$ -293249 -16752 -152276 159201 -249161 -96336 -139819 -71955 -268151 -64145 -182016
18490a82016B83984b21785d9861A63711D6530a49798d5765k1019A96207b12536
$$ -182016 283984 -221785 -49861 163711 46530 -149798 -45765 -66784 196207 -212536
18479I902a59949a1287r2761j53912A17955E7546a9178k63691I329a8534m08043
$$ 9902 -159949 -11287 -104048 -257960 117955 57546 -19178 -282869 9329 -18534 -426577
18468d26577J61653G5360d62346K28453I410i0334o9995C24399E6225Q7581C704
$$ -426577 -264924 75360 -462346 -233893 9410 -90334 -160329 324399 56225 143806 3704
18456c2678G9438l5006A3008a35323A30655o2750a19749j26642a13891B8600d46732
$$ -32678 79438 44432 13008 -135323 130655 67905 -119749 -246391 -113891 28600 -446732
18444C81722d6493A46433a44515b4959k31356H7487b72553A99609G3414a55173
$$ 381722 -46493 146433 -144515 -24959 -256315 87487 -272553 199609 73414 -155173
18433H3646l1031L44789e52860J37684I2245c6880A68322l3018d4567n5346C94147
$$ 83646 52615 397404 -552860 -415176 92245 -36880 168322 135304 -44567 -99913 394147
18421a00646q069C7338b70182c8026f725k30923h5213L4974A48428N9229I3815
$$ -100646 -108715 37338 -270182 -38026 -6725 -237648 -85213 -50239 148428 207657 93815
18409e6825p5195j647B4467L5271L1538J41570c85146G0332J9402b02032A0692
$$ -56825 -132020 -133667 24467 59738 91276 232846 -385146 70332 89734 -202032 10692
18397C26695b52716A63324i1823a6453A5860a07359B28193a18402L3305l22138
$$ 326695 -252716 163324 -91823 -16453 15860 -107359 228193 -118402 -85097 -407235
18387d07235b01212A21698b29506c0069k48594E3782j5680b57578l0062e1525
$$ -407235 -201212 121698 -229506 -30069 -278663 53782 38102 -257578 -287640 -51525
18376a39053A79848a85082A26228E1453J20211J2272i9085B45471h28488a73791
$$ -139053 179848 -185082 126228 51453 171664 183936 -99085 245471 -828488 -173791
18365a03395n0876b4152m82382G2325B0532J27583L3355F3862K23698g4820j60522
$$ -103395 -154271 -24152 -506534 72325 20532 148115 181470 63862 287560 -74820 -235342
18354b35342b0867A62403a08213n2877H5007K42648A08389j4723A9967a92549
$$ -235342 -20867 162403 -108213 -161090 85007 327655 108389 93666 19967 -192549
18343f394k51961A3428o88c27265f2930F987c80967b3002C6226d33552a9256j39197
$$ -6394 -258355 13428 12740 -327265 -62930 6987 -380967 -23002 36226 -433552 -19256 -158453
18331a58453F1842c99380J41434d5716O857F3114K1709c41775a10368d0086B88740
$$ -158453 61842 -399380 -257946 -45716 -38859 63114 84823 -341775 -110368 -40086 288740
18319C91689b02697K9183A4693h5132j82399G1267a62483L1642B44356h200m20505
$$ 391689 -202697 -173514 14693 -85132 -267531 71267 -162483 -130841 244356 -8200 -428705
18308d28705E3587a16125a3219j78538j43062b9194j89862h6952j5881c5899A73942
$$ -428705 53587 -116125 -13219 -191757 -334819 -29194 -219056 -86952 -102833 -35899 173942
18296C10312i4142d6094l07241I0220m1454L5404J64373A06826f1084k2483b5101
$$ 310312 -94142 -46094 -353335 90220 48766 84170 248543 106826 -61084 -83567 -25101
18284g9631F3545L5560m4749b26287h5554a8628F6280K4915K7397a3782r4670
$$ -79631 63545 99105 54356 -226287 -85554 -18628 66280 91195 118592 -13782 -108452
18273a08452I927a06441o1654J6396A936J47953k4588b41818J1032O7058k40755
$$ -108452 9927 -106441 -168095 -151699 1936 149889 125301 -241818 -230786 -163728 -404483
18262d04483A12943a60182K0488B72036a37885A67264d05969a41311E0095J09849
$$ -404483 112943 -160182 -139694 272036 -137885 167264 -405969 -141311 50095 159944
18252A59944L4430G1327L890h7806G6300j3530a99512A02821J33272d10316a16825
$$ 159944 194374 71327 75217 -87806 76300 62770 -199512 102821 236093 -410316 -116825
18240e3142K3985H1641A2188K43818r2527a64444B51011n0783b85136d3257p7786
$$ -53142 -29157 81641 12188 256006 163479 -164444 251011 200228 -285136 -43257 -121043
18229a21043e9401n6968K8559l47885C08167a80488d8540p2063l05627F5653B861
$$ -121043 -59401 -116369 -87810 -435695 308167 -180488 -48540 -120603 -426230 65653 2861
18217a77302M0346A34696a017l05291a32833j26329j3176R5346E4755B4625a85863
$$ -177302 -136956 134696 -1017 -306308 -132833 -259162 -272338 -176992 54755 24625 -185863
18205a9730j40158K2347B43571G6162h0102j53852D1681h1423l884F8575b42870
$$ -19730 -159888 -137541 243571 76162 -80102 -233954 41681 -81423 -85307 68575 -242870
18193a2893I6588K2895i1483n072A63767a87574A57969Q393J73549f1595B6790
$$ -12893 96588 119483 -91483 -96555 163767 -187574 157969 166362 339911 -61595 26790
18181A56672c9125B8672a24421k18686R0832e5510k56591C784J21138g4407k42469
$$ 156672 -39125 28672 -124421 -343107 -252275 -55510 -312101 3784 124922 -74407 -316876
18170c16876D03873j58232f6448j44403D7723c0193j38955D6928b3794G447J69657
$$ -316876 403873 245641 -66448 -210851 47723 -30193 -169148 46928 -23794 7447 177104
18159A77104a53879c7740B22055A05769b06143G0080A7236e4598j95123h613j73063
$$ 177104 -153879 -37740 222055 105769 -206143 70080 17236 -54598 -249721 -8613 -181676
18148a81676a7090A87254p910K9049c1231B41689e4743A03547J17816O7742A01168
$$ -181676 -17090 187254 179344 208393 -31231 241689 -54743 103547 221363 289105 101168
18136B04942c27728P6835F0757a23589F180L6283R130c56814i0888k67283J54470
$$ 204942 -327728 -250893 60757 -123589 6180 42463 51593 -356814 -90888 -358171 -203701
18125b03701b7905k154H7605a55798H3608a63179k01248p4875a26066A22786b25145
$$ -203701 -27905 -30059 87605 -155798 83608 -163179 -364427 -439302 -126066 122786 -225145
18113d2293k37687d7824j09212j36146J03768o4682M2548P0412j1390a0048q0939
$$ -42293 -279980 -47824 -157036 -293182 -189414 -254096 -211548 -141136 -152526 -10048 -90987
18102i0987L2076a3725k36094M6873A50492c76276a72510C636b5237N085p6343
$$ -90987 -58911 -13725 -249819 -202946 150492 -376276 -172510 3636 -25237 -20152 -96495
18091i6495A04806A6687L46315c1215j54683n1163A74535a66363j2015P7643G5117
$$ -96495 104806 16687 363002 -31215 -185898 -237061 174535 -166363 -178378 -100735 75117
18079C34597b38866B34291M2317e16156B23821H2846a52952C93f3310b0579D2345
$$ 334597 -238866 234291 276608 -516156 223821 82846 -152952 393 -63310 -20579 42345
18067b01084m8771d569j85552g3885o6239A16565c07225A23277Q2015c30854B49116
$$ -201084 -249855 -4569 -190121 -73885 -140124 116565 -307225 123277 205292 -330854 249116
18055C8890O1057B9440a00377j10401F5061J96416a30409D1155O4796c4682l8760
$$ 38890 99947 29440 -100377 -210778 65061 261477 -130409 41155 105951 -34682 -73442
18044g3442k1113o8784f2107A1050J13928b42450D9766J1076a01322d2553j17461
$$ -73442 -94555 -163339 -62107 11050 124978 -242450 49766 60842 -101322 -42553 -160014
18033a60014B93381D6732a31069l65239A03881a82008B72860C5491a32567A79710
$$ -160014 293381 46732 -131069 -496308 103881 -182008 272860 35491 -132567 179710
18022a74109d1524k60114A10846a87642C28532b67291c408j13819A68765a6721
$$ -174109 -41524 -301638 110846 -187642 328532 -267291 -3408 -117227 168765 -16721
18011c24949B8413J8198b42550J06834q1004B36251b0975j11728C95831A20276
$$ -324949 28413 46611 -242550 -135716 -216720 236251 -20975 -132703 395831 120276
18000c9931A34550N5944c84954E4679K86671j35470b77727e8405A46968J67911
$$ -39931 134550 190494 -384954 54679 341350 205880 -277727 -58405 146968 314879
17990C14879d3556A74031f5613j46341l4912J07549n0062r7548A40874l7624b95225
$$ 314879 -43556 174031 -65613 -211954 -246866 -139317 -189379 -286927 140874 103250 -295225
17978a37930O3663F3002f1398C0966b63216A2440c70956Q6590h5673K7232k867
$$ -137930 -74267 63002 -61398 30966 -263216 12440 -370956 -284366 -85673 -58441 -61308
17967f1308k27279d8605j18818a0309l00459R9522A21479b76329a03900A71024
$$ -61308 -288587 -48605 -167423 -10309 -310768 -211246 121479 -276329 -103900 171024
17956c62357g0183B30267C3864Q6255A4286L59322i4324b9115l01686D06925A41586
$$ -362357 -70183 230267 33864 120119 14286 373608 -94324 -29115 -330801 406925 141586
17944A4932K3506a31602J5633P42g724l8943j23107A26125L0042c96364f482F1111
$$ 14932 38438 -131602 -115969 -115227 -7724 -46667 -169774 126125 156167 -396364 -6482 61111
17931B9812Q7847a40337R680M8261p211C549J01568b5107l07161a30595j84530
$$ 29812 117659 -140337 -130657 -82396 -89607 3549 105117 -25107 -332268 -130595 -315125
17920c15125e1316J8131D7378Q5002J3619e3497j48183Q3398A83702C3753b6162
$$ -315125 -51316 -33185 47378 132380 145999 -53497 -201680 -118282 183702 33753 -26162
17908C66488a38938J6975K1798j10149h9677j87828L6549O2040Q3314k73200A20319
$$ 366488 -138938 -121963 -100165 -210314 -89677 -277505 -240956 -178916 -95602 -368802 120319
17896B96825a02157C92243K6804c20303J34187C6057b34978J12066G8810K5002
$$ 296825 -102157 392243 419047 -320303 -186116 36057 -234978 -122912 78810 103812
17886A03812a82889L1192A87084H7718b71986a19496F7111O7185Q1276C6595J699
$$ 103812 -182889 -151697 187084 87718 -271986 -119496 67111 134296 215572 36595 38294
17875C8294J6189B2554K63709J60176A035R4878b00625J5397j89980f6512f106
$$ 38294 54483 22554 286263 446439 1035 95913 -200625 -185228 -375208 -66512 -6106
17863b15525C9750A735L0992J38388L88141A22893h9178D68933H0800g1007k88846
$$ -215525 39750 1735 32727 171115 559256 122893 -89178 468933 80800 -71007 -359853
17852c59853A3007J3646A2439c91885A65652e7308A28818a9262A88571n5558g9539
$$ -359853 13007 26653 12439 -391885 165652 -57308 128818 -19262 188571 133013 -79539
17840d5112B44848a07782p6564q7200A37606b4893A67509a00395L0061A18219
$$ -45112 244848 -107782 -184346 -271546 137606 -24893 167509 -100395 -70334 118219
17829A53577a28203A14385a6508j68590K6237C60854c27089A58132a81977B6246
$$ 153577 -128203 114385 -16508 -185098 -158861 360854 -327089 158132 -181977 26246
17818H162J19586J12370m1134d05476A74223A7696K77534a15002F7624b54923
$$ 8162 127748 240118 198984 -405476 174223 17696 295230 -115002 67624 -254923
17807a48557e4492j99036D03577a90235q4901A15839a77284K5337F6963b89415
$$ -148557 -54492 -253528 403577 -190235 -275136 115839 -177284 -151947 66963 -289415
17796B69452F2899N62p218N7331J83679a26403H8106a6645j73222H9502j4917
$$ 269452 62899 63461 56243 113574 297253 -126403 88106 -16645 -189867 89502 74585
17785G4585d9601H8480J60966I2953c466j94643a8975C8539f14383B31284p9030
$$ 74585 -49601 88480 249446 92953 -3466 -198109 -18975 38539 -614383 231284 152254
17774A52254a80848l3251B3158P2756d09014D1750J19197J84561A45106K5671
$$ 152254 -180848 -214099 23158 95914 -409014 41750 160947 345508 145106 170777
17764A70777d8043a3026m7486D0223a72427K5350k15877I0193f7029j51546E936
$$ 170777 -48043 -13026 -60512 40223 -172427 -147077 -362954 90193 -67029 -218575 5936
17752A9727a65410c7318G5930J46089B1270N4432d4372B48054H0986J65372n5708
$$ 19727 -165410 -37318 75930 222019 21270 75702 -44372 248054 80986 246358 190650
17741A90650B6167J73265a55880q8665i0478B2866c10599A50940C3604P4078j724
$$ 190650 26167 199432 -155880 -244545 -90478 22866 -310599 150940 33604 107682 105958
17730A05958J29489A15740F386e4268B37299a15544A88122k0541a46686L5039
$$ 105958 235447 115740 6386 -54268 237299 -115544 188122 167581 -146686 -111647
17720a11647B71101f1310a1184j55923P3214A38500b03711d9239C70737C1823
$$ -111647 271101 -61310 -11184 -167107 -93893 138500 -203711 -49239 370737 31823
17709D04884f6389m1175c9484q6077A22895J92084a7411j98120a02732J013l3835
$$ 404884 -66389 -107564 -39484 -125561 122895 314979 -17411 -215531 -102732 -101719 -135554
17698a35554B03085g9483J1377F6262j8010d193E6470K68039j31379b75804B36695
$$ -135554 203085 -79483 -68106 66262 48252 -4193 56470 324509 193130 -275804 236695
17686c64371e3731j61698B48615p5863e4140j81819A06911J41960A02793b00944
$$ -364371 -53731 -215429 248615 172752 -54140 -235959 106911 248871 102793 -200944
17675a18874d0588A72334b3443m1803j48060D4124J2681J60244a2470j23438J9402
$$ -118874 -40588 172334 -23443 -65246 -213306 44124 56805 217049 -12470 -135908 -116506
17664a16506B39948b5917R022B02234c60315e0455B11606D9198M3680b00976E4307
$$ -116506 239948 -25917 -16895 202234 -360315 -50455 211606 49198 92878 -200976 54307
17652A14279H683a93469Q9608I1969f5933a8803j5025F199a18623J9825E5728
$$ 114279 8683 -193469 -103861 91969 -65933 -18803 -33828 6199 -118623 -98798 55728
17640C5598b51416A56878a02218I5048i5600D2978c14104I9007c83486A98419
$$ 35598 -251416 156878 -102218 95048 -95600 42978 -314104 99007 -383486 198419
17629b34883D5765R9601B6572b44699H0363J48021A06500J9741C5767a74103P3219
$$ -234883 45765 145366 26572 -244699 80363 228384 106500 126241 35767 -174103 -100884
17618a00884A03973a56462d7355J8291B8227L22533g4991p4270a0370j90159K0286
$$ -100884 103973 -156462 -47355 -29064 28227 350760 -74991 -149261 -10370 -200529 -180243
17607a80243D6849d63771C15099c15272a8867A08586h2240n1735A23450E2684
$$ -180243 46849 -463771 315099 -315272 -18867 108586 -82240 -133975 123450 52684
17596b3610A08491m2932b57438A69562L5078C4295a70504H9011J36857i8298E9452
$$ -23610 108491 65559 -257438 169562 204640 34295 -170504 89011 225868 -98298 59452
17584C0906d437o5492a3612k02317f4326k77311D7069J34093g3792G4292c03960
$$ 30906 -4437 -69929 -13612 -215929 -64326 -341637 47069 181162 -73792 74292 -303960
17572b1508o5262F8962c75409a10322B28665J87342b1882r6327b6796e096o3321
$$ -21508 -86770 68962 -375409 -110322 228665 416007 -21882 -118209 -26796 -5096 -68417
17561f8417q1721M060m1601I7434o117i1466D15442n3564A41844J53435p7058
$$ -68417 -150138 -146078 -187679 97434 91317 -91466 415442 361878 141844 295279 218221
17550B18221D6234A2829J6475J87184a67244H7386L52420j92571a6782A04947
$$ 218221 46234 12829 29304 216488 -167244 87386 439806 247235 -16782 104947
17539A33256f5621C7712b10031A38145a18641p0217N2672A60753Q4699a22676
$$ 133256 -65621 37712 -210031 138145 -118641 -188858 -136186 160753 245452 -122676
17528A288a45787H5619p305J08353E2219M6671a07887A21277L4161P574m6766
$$ 1288 -145787 85619 78314 186667 52219 98890 -107887 121277 155438 163012 116246
17517A16246K54873b3029B57445L7535j46123a1620C60384A41109d7500A04949
$$ 116246 371119 -23029 257445 294980 148857 -11620 360384 141109 -47500 104949
17506B51833j20555b05214E9271J32130R2805k4424f0570A04018D2948J48970
$$ 251833 131278 -205214 59271 191401 284206 259782 -60570 104018 42948 191918
17496A91918M2017l2055G5558k1045a40666A70981f9413D90619A7086K52203q5451
$$ 191918 233935 201880 75558 54513 -140666 170981 -69413 490619 17086 269289 183838
17485A83838R800m0243I512K20599E8802K02978q0053k3004B7199K00318p2105
$$ 183838 193638 153395 9512 230111 58802 261780 181727 158723 27199 227517 155412
17474A55412g7784C46573j32156K53102A59711M39705a16049D12336A82640A1235
$$ 155412 -77784 346573 214417 467519 159711 599416 -116049 412336 182640 11235
17463H3982a18245L3950B47566n6712m3345K14271a09215A36456K96102a46954
$$ 83982 -118245 -84295 247566 190854 147509 361780 -109215 136456 432558 -146954
17452d3370B73582J94198Q8002A98412l7119g1836E64639k35136J26404J50678
$$ -43370 273582 467780 555782 198412 161293 -71836 564639 329503 455907 606585
17442F06585j17215H0121M72146A44749J56144J01083N8166A26712L50464k5315
$$ 606585 489370 80121 552267 144749 300893 401976 460142 126712 477176 451861
17432D51861R1647j18844K2896j61369Q2773r4760K39325A7428K59989K53914
$$ 451861 543508 424664 447560 286191 368964 274204 513529 17428 277417 531331
17422E31331k46442J11997o5775A17506R9699o3037J85666J76779L4393j05134
$$ 531331 284889 396886 331111 117506 217205 154168 339834 516613 551006 445872
17412D45872j10775n7566o4436q8611J68100L15142B14132A04046l0134N9241
$$ 445872 335097 277531 213095 124484 292584 607726 214132 104046 73912 133153
17402A33153O9927C8266L02033n9833a64535B3221K60410d07943D36264j22628
$$ 133153 203080 38266 340299 280466 -164535 23221 283631 -407943 436264 313636
17392C13636J6430m9825I3828J72048F0388L63958j18711A9908Q7805g1802A29476
$$ 313636 330066 280241 93828 265876 60388 424346 305635 19908 107713 -71802 129476
17380B86060j9225J3740a86616O2368A46991Q3269D6261J6198k722K78847g7207
$$ 286060 266835 280575 -186616 -124248 146991 230260 46261 62459 59737 338584 -77207
17368G3558J59280e5653G4272N18999A03268Q1749a41473A92569k9924a29648
$$ 73558 232838 -55653 74272 593271 103268 185017 -141473 192569 162645 -129648
17357B60166J4216j13399K66753A93128F9982j17i0513B08636a2137j81010B2459
$$ 260166 274382 160983 427736 193128 69982 69865 -90513 208636 -12137 -193147 22459
17345a10909D4398a32649E5824Q7417L829J15274A4201R6834L73930I7076J12016
$$ -110909 44398 -132649 55824 143241 147070 262344 14201 111035 484965 97076 209092
17334B09092a68579H3440K91013A54254k8703e6552B4522J20025F9702K8447A1200
$$ 209092 -168579 83440 374453 154254 125551 -56552 24522 144547 69702 98149 11200
17322C17818e6740B45386I1069M4776J47961F9426J56098m2385k9567K62543a04063
$$ 317818 -56740 245386 91069 135845 283806 69426 225524 183139 153572 416115 -104063
17310E3908J15647K93109j61778q1450P5619R6317a39812J4152G3857Q6501P9690
$$ 53908 169555 462664 300886 219436 295055 391372 -139812 -125660 73857 160358 240048
17299B40048m3765o7895a31586A0695N3210b3745A77026e9415B80530p8448J58261
$$ 240048 196283 128388 -131586 10695 63905 -23745 177026 -59415 280530 202082 360343
17288C60343b33903A48659L7023A1459a27214B27295F6494A6691R8947K43619
$$ 360343 -233903 148659 185682 11459 -127214 227295 66494 16691 115638 359257
17278C59257a02392A01441J74921J55063j50133L07676j72794c3517C36899j13098
$$ 359257 -102392 101441 276362 431425 281292 588968 416174 -33517 336899 223801
17268B23801A11598m0134N3131H262R8878j8241h470D65674k09997J78254b128
$$ 223801 111598 71464 124595 8262 107140 88899 -8470 465674 255677 433931 -2128
17256C1345K4317K68001j04441j06606K59360q9209E0715J49830K11032A64121
$$ 31345 55662 323663 219222 112616 371976 282767 50715 200545 411577 164121
17245G8608J85862L3546j16466n7434L09223B06479p5542L94540n7249j38959
$$ 78608 264470 298016 181550 124116 433339 206479 130937 525477 468228 329269
17235C29269j47036K50901B9454M00622I3609I608J78791q3281J48621A01606
$$ 329269 182233 433134 29454 430076 93609 9608 188399 105118 253739 101606
17224A6689K52024C8210J52954l5406J21813H462L48703J65625j9927A78154m8194
$$ 16689 268713 38210 191164 155758 277571 8462 357165 522790 502863 178154 129960
17213A29960J9288M61767A93361J4643J49347j03061M7671A01102L35906A59680
$$ 129960 149248 611015 193361 208004 357351 254290 301961 101102 437008 159680
17202C08468K5982l8848J42840j44185r5112R0923K16959A49981K46376c4713
$$ 308468 334450 295602 438442 294257 199145 290068 507027 149981 396357 -34713
17191B15525L5112R8635c5535C27549K26462A44489g182D71205A54203k0K7943
$$ 215525 250637 349272 -35535 327549 554011 144489 -7182 471205 154203 154183 182126
17180A82126J80533j49514J53813J32734k15796n7965d5647C08909M43598A14969
$$ 182126 362659 213145 366958 499692 283896 225931 -45647 308909 752507 114969
17169A72461J57823n6417j2353A08005J24976J27535J31036k4744B03701J82727
$$ 172461 330284 273867 261514 108005 232981 360516 491552 466808 203701 386428
17159C86428e6859E04879A55089C0557K96125q9796L17116k40622L24643j52161
$$ 386428 -56859 504879 155089 30557 326682 236886 554002 313380 638023 485862
17149D85862q6568J8239o4004N6409J98977o5455A79268M29371j32269j99960
$$ 485862 399294 417533 353529 409938 608915 543460 179268 608639 476370 276410
17139B76410o0100L76619B57745M2147o3084K62868A17336K37162j48065K42810
$$ 276410 216310 592929 257745 299892 236808 499676 117336 354498 206433 449243
17129D49243o8495Q3104J1732P599J71652B53495l7569L84885m4115L6698k08801
$$ 449243 380748 463852 475584 483183 654835 253495 215926 600811 556696 593394 384593
17118C84593R3150M7226M9246k03816K85881o420k54694K92087l13458M11143
$$ 384593 477743 524969 574215 370399 656280 649860 395166 687253 373795 784938
17108G84938C08955J81474J41118k95047q7963K19831O8242B38922K92304M176
$$ 784938 308955 490429 631547 336500 248537 468368 536610 238922 531226 535402
17098E35402B27050M84887B78110K32645P6029k05381L70039l29477K5956K9096
$$ 535402 227050 711937 278110 510755 586784 381403 751442 421965 447921 477017
17088D77017J95585k70341N3558q3863J51585k43092j6898J54479O8329J67239
$$ 477017 672602 402261 455819 371956 523541 280449 263551 418030 486359 653598
17078F53598k82906o9729L48356j57044r3138R3784j53321J52651J03603A92059
$$ 653598 370692 300963 649319 492275 399137 492921 339600 492251 595854 192059
17067D45547k1204Q0356J1686k12574J67292P5989P8513J51291J02377l18203
$$ 445547 424343 504699 516385 303811 471103 547092 625605 776896 879273 561070
17057E61070j5736K8670P5433k3820j29096J22013j8850j3612o0628j21465K29651
$$ 561070 545334 574004 649437 625617 496521 618534 599684 586072 525444 403979 633630
17046F33630L6488B80721N11656K74850m95243L16839k68485J95793k47231n1114
$$ 633630 670118 280721 792377 1067227 571984 888823 620338 816131 568900 517786
17036E17786R196M01677P5160l28121o6016L15730l26337K65013k83122J04626
$$ 517786 526982 928659 1003819 675698 609682 925412 599075 864088 580966 685592
17026F85592K04271k26410J61525k13627m8524Q6117J63349k55695L14127l9505
$$ 685592 889863 663453 824978 611351 562827 648944 812293 556598 870725 831220
17016H31220l26336K20749K80341j562k79505l1178J79566N8285m43721L09757
$$ 831220 504884 725633 1005974 1004412 724907 693729 873295 931580 487859 797616
17006G97616O9648j20491Q9792k42998L58162k16598J99523K74573m53166J22011
$$ 797616 867264 746773 836565 593567 951729 735131 934654 1209227 756061 878072
16996H78072r0376J12340J66152l38462K2511J31659K6823l93681M14254k75307
$$ 878072 787696 900036 1066188 727726 750237 881896 908719 515038 929292 653985
16986F53985J49061k17759K07635m7346J22669K66040n9895m00669L13716j76665
$$ 653985 803046 585287 792922 745576 868245 1134285 1074390 673721 987437 810772
16976H10772L8257J14430r0296K78464k95058K54615r1592J62895j50652j93926
$$ 810772 849029 963459 873163 1151627 856569 1111184 1019592 1182487 1031835 837909
16966H37909j62225M55536J48608k99223K42579q440Q1871j18367N354J38711
$$ 837909 675684 1131220 1279828 980605 1223184 1214744 1296615 1178248 1183602 1322313
16956A322313k27561j60914M47819K04949m45040K07558l30606K79766l862K67689
$$ 1322313 1094752 933838 1381657 1586606 1141566 1349124 1018518 1298284 1294422 1562111
16946A562111l21755L1434L56908j63861j26676L193q7829M66745l49629K904
$$ 1562111 1240356 1271790 1628698 1464837 1338161 1341354 1253525 1720270 1370641 1373545
16936A373545k4309k15611N1481L51189l31746Q0390M63950L291N6407k38969
$$ 1373545 1349236 1133625 1185106 1536295 1204549 1284939 1748889 1752180 1808587 1569618
16926A569618L9965k67085J57494p0110J22617Q5960K26845m98313K05134j3371
$$ 1569618 1609583 1342498 1499992 1429882 1552499 1638459 1865304 1366991 1572125 1558754
16916A558754j14652M15437Q8795l02743M0266N4605J34547j64825J62124k00929
$$ 1558754 1444102 1859539 1948334 1645591 1685857 1740462 1875009 1710184 1872308 1671379
16906A671379O3744L07192k7502j46804K11551n7410j43117J2106L89219k98091
$$ 1671379 1735123 2042315 2014813 1868009 2079560 2022150 1879033 1891139 2280358 1982267
16896A982267q3388L87662l18703L27803l25376J60408K8525K43117j65785K7754
$$ 1982267 1898879 2286541 1967838 2295641 1970265 2130673 2159198 2402315 2236530 2264284
16886B264284O6660n7697L7133J88343J4035j11640J75199J22957J24361n76934
$$ 2264284 2330944 2273247 2310380 2498723 2512758 2401118 2576317 2699274 2823635 2246701
16876B246701M40491M7446j65874K9935J72343J53568J86403m65222K79400j3998
$$ 2246701 2687192 2734638 2568764 2598699 2771042 2924610 3111013 2645791 2925191 2911193
16866B911193K68998o5984j45014L14241j08983k8627J1289R7289q8519L11065
$$ 2911193 3180191 3114207 2969193 3283434 3174451 3145824 3157113 3254402 3165883 3476948
16856C476948k50973K87712N2018R8339k70968L3527K09545J74560o0857J25213
$$ 3476948 3225975 3513687 3565705 3664044 3393076 3426603 3636148 3810708 3749851 3875064
16846C875064j82877K3939L57682j26425J68760k57049K25277L80196L4831J00569
$$ 3875064 3692187 3716126 4073808 3947383 4116143 3859094 4084371 4464567 4499398 4599967
16836D599967m6218K23443j98481k80474Q51402j35302O2262R8241N13240m42085
$$ 4599967 4553749 4777192 4578711 4298237 5149639 5014337 5076599 5174840 5688080 5245995
16826E245995M19621j70474K572N77655l69844L19626K27502J41457k72509k13505
$$ 5245995 5665616 5495142 5497714 6075369 5705525 6025151 6252653 6394110 6121601 5908096
16816E908096N86771L88183k02415J63670J07850R3050L46746K06524J15083J53601
$$ 5908096 6494867 6883050 6680635 6844305 6952155 7045205 7391951 7598475 7713558 7867159
16806G867159K27530K20054j66592P978L44956K27047L19594M353K10400M25464
$$ 7867159 8094689 8314743 8148151 8156129 8501085 8728132 9047726 9052079 9262479 9687943
16796I687943K06846J91258N31590k73084L49115N01212J5558N19240J08232P3577
$$ 9687943 9894789 10086047 10617637 10344553 10693668 11194880 11210438 11729678 11837910 11911487
16786A1911487O57878M68472J61918O51758J45247P18734K09145M86116J81595
$$ 11911487 12569365 13037837 13199755 13851513 13996760 14715494 14924639 15410755 15592350
16777A5592350Q60237K30692K78893R91729J37998O41979O93482Q10246K90317
$$ 15592350 16452587 16683279 16962172 17953901 18091899 18733878 19427360 20237606 20527923
16768B0527923J047465L64831J069716O60080R18871Q58389J164932P69322J313413
$$ 20527923 21575388 21940219 23009935 23670015 24588886 25447275 26612207 27381529 28694942
16759B8694942R49479J307365J189727J409850R82239J802253J098495K168920
$$ 28694942 29644421 30951786 32141513 33551363 34533602 36335855 37434350 39603270
16751C9603270J666621J861988K165136J997701J958975K778224K620402K696799
$$ 39603270 41269891 43131879 45297015 47294716 49253691 52031915 54652317 57349116
16743E7349116K721147L226509L409675L249613L908851M332183M388224M483673
$$ 57349116 60070263 63296772 66706447 69956060 73864911 78197094 82585318 87068991
16735H7068991M695263N299695N590644N881970N998204O394081O353715P046443
$$ 87068991 91764254 97063949 102654593 108536563 114534767 120928848 127282563 134329006
16727A34329006O954206O999279P144726O693572O310710O839983N130156N096306
$$ 134329006 141283212 148282491 155427217 162120789 168431499 175271482 180401638 185497944
16719A85497944L814002K785907J785200N49461n84267j682752l573387l636620
$$ 185497944 189311946 192097853 193883053 194432514 193848247 192165495 188592108 184955488
16711A84955488n138326n449180o630216o850103o942483p108054p522693p419367
$$ 184955488 179817162 174367982 167737766 160887663 153945180 146837126 139314433 131895066
16703A31895066p076396o998466o490385o326622n945550n893715n328998m991268
$$ 131895066 124818670 117820204 111329819 105003197 99057647 93163932 87834934 82843666
16695H2843666m657357m625887l675341m011237l260870l654419l281305k806298
$$ 82843666 78186309 73560422 69885081 65873844 62612974 58958555 55677250 52870952
16687E2870952k714431k406388k822048j871417k201327j580790j816795k131424
$$ 52870952 50156521 47750133 44928085 43056668 40855341 39274551 37457756 35326332
16679C5326332j768617j286195j326597j599079j037866j021996j235229j136426
$$ 35326332 33557715 32271520 30944923 29345844 28307978 27285982 26050753 24914327
16671B4914327j267518o58337q73180r70079j073057m79641p66391n65623q46373
$$ 24914327 23646809 22988472 22115292 21145213 20072156 19592515 18826124 18260501 17414128
16662A7414128k81891p46610n30999l08557j000411l5696o65105m89240n03281
$$ 17414128 17132237 16385627 15854628 15546071 14545660 14509964 13844859 13355619 12852338
16653A2852338l18974l11066n60232k8090q2220n87904j93703o06122k49855J29684
$$ 12852338 12533364 12222298 11662066 11633976 11551756 10963852 10770149 10164027 9914172 10043856
16643A0043856n11059k95205m30351O5243n21222k81808J05875k25748m49878
$$ 10043856 9532797 9237592 8807241 8872484 8351262 8069454 8175329 7949581 7499703
16634G499703j90484j39890M4995o11762K92727j77307j17463j19285n64717J19571
$$ 7499703 7309219 7169329 7214324 6602562 6895289 6717982 6600519 6481234 5916517 6036088
16624F036088k39069J48240m11022m9530j67476J63430n05765k28169K45528m0234
$$ 6036088 5797019 5945259 5534237 5484707 5317231 5480661 4974896 4746727 4992255 4952021
16614D952021k1752n0207n29695j6474L76795n22965r7448N5691Q9369j39719
$$ 4952021 4930269 4880062 4350367 4333893 4710688 4187723 4090275 4145966 4235335 4095616
16604D095616j5369k99160K1305l02737K31056k61603P1425K38127n33543j9973
$$ 4095616 4080247 3781087 3802392 3499655 3730711 3469108 3540533 3778660 3245117 3225144
16594C225144K19028m98295J55582O0455k27965J44861j95101j94993r4034M68272
$$ 3225144 3444172 2945877 3101459 3161914 2933949 3078810 2883709 2688716 2594682 3062954
16584C062954m47242K4288J77481j14405j60154K4104k22054O0370K59981n59038
$$ 3062954 2615712 2640000 2817481 2703076 2542922 2567026 2344972 2405342 2665323 2106285
16574B106285J86054K965J37692l5090l74577K75300p1401m53330M88907m89219
$$ 2106285 2292339 2295304 2432996 2397906 2023329 2298629 2227228 1773898 2262805 1773586
16564A773586K77780n7943l1506R2697k61496O1364R6010K3984j918o0138k46212
$$ 1773586 2051366 1993423 1961917 2054614 1793118 1854482 1950492 1974476 1972558 1912420 1666208
16553A666208j85620L38761K527j79828J69415n89646K04718M0330j16744M08432
$$ 1666208 1480588 1819349 1821876 1642048 1811463 1221817 1426535 1466865 1350121 1758553
16543A758553J65758m10619L53859l49279k02077j50810J44751K83205J5020k42116
$$ 1758553 1924311 1513692 1867551 1518272 1316195 1165385 1310136 1593341 1608361 1366245
16533A366245k46356K32361j00817k88176M42971L5352o42957L28777k29537K33487
$$ 1366245 1119889 1352250 1251433 963257 1406228 1441580 798623 1127400 897863 1131350
16523A131350l95250K65236P3045l3949j35869P3909Q0539k09597K1346l9788
$$ 1131350 736100 1001336 1074381 1040432 904563 978472 1059011 849414 870760 830972
16513H30972j40958M56712j30947O429j79782J8310J21170J30962j09726k82483
$$ 830972 690014 1146726 1015779 1022208 842426 860736 981906 1112868 1003142 720659
16503G20659L74963j43486j92208J81981l56936J46079L27271m04880M05661k99493
$$ 720659 1095622 952136 759928 941909 584973 731052 1058323 653443 1059104 759611
16493G59611J10719l7260j45002j62523M78313D22932L38009K33738k72741o9298
$$ 759611 870330 833070 688068 525545 1003858 422932 760941 994679 721938 652640
16483F52640L01829m70521L12232j44753L30682l11096J3524l128J0019m4637
$$ 652640 954469 483948 796180 651427 982109 671013 684537 681409 691428 646791
16473F46791L3958k02681J56007j54607P6389o2010M3975j0505J44128j41677
$$ 646791 680749 478068 634075 479468 555857 493847 537822 527317 671445 529768
16463E29768j92587J98601j48384K62459L38102C30162J0244J00121p1474K52760
$$ 529768 337181 535782 387398 649857 987959 330162 340406 440527 369053 621813
16453F21813j13551k26318J54382K16907P2222l37580K38805B94931K59176o7244
$$ 621813 508262 281944 436326 653233 725455 387875 626680 294931 554107 486863
16443D86863J88347l13528J55729K40550l36799J86987J7050j43357n7729j09676
$$ 486863 675210 361682 517411 757961 421162 608149 625199 481842 424113 314437
16433C14437K96248j27307A44014e5752E48373K14868l33084M4750r9717Q7587
$$ 314437 610685 483378 144014 -55752 548373 763241 430157 474907 375190 462777
16423D62777A82963J26372J45332J7888A05430L20913K9658j35208K59018k45711
$$ 462777 182963 309335 454667 472555 105430 426343 456001 320793 579811 334100
16413C34100J05722B02856J33827A58434M27102C6936J70321K89404j71008M1446
$$ 334100 439822 202856 336683 158434 585536 36936 207257 496661 325653 367099
16403C67099K2019J24083A02942L19481n8718A64694g8857F63227C13305K48147
$$ 367099 389118 513201 102942 422423 363705 164694 -78857 663227 313305 561452
16393E61452B16290I9642K48961j50203F4687J93150K26459F0914J40377m4143
$$ 561452 216290 99642 348603 198400 64687 257837 484296 60914 201291 157148
16383A57148J29819J40832A47468J44528L30655B43081L70277b7737E5793N66170
$$ 157148 286967 427799 147468 291996 622651 243081 613358 -27737 55793 621963
16373F21963A8009a88131c0178E56116k41012A56200M6639r3660J73746A29275
$$ 621963 18009 -188131 -30178 556116 315104 156200 202839 109179 282925 129275
16362B04328R1747J6651F8786q762K39545A19133L40698C4910L21966A20346M9865
$$ 204328 296075 312726 68786 60024 299569 119133 459831 34910 356876 120346 170211
16351A70211m8989K12963p449h2015F8884J66582J19356Q4750j50646p5660m8892
$$ 170211 121222 334185 326736 -82015 68884 235466 354822 439572 288926 213266 164374
16340A64374N24870d4245B32324J6049c0435i896j02638b2879B59071a41601H8061
$$ 164374 689244 -44245 232324 248373 -30435 -9896 -112534 -22879 259071 -141601 88061
16328a19401C01683q5400p5679L60968j17825j90536I3919M0209a46729F2719
$$ -119401 301683 216283 140604 501572 383747 193211 93919 134128 -146729 62719
16317B35541J44057K40622k64943a55906B66195C433a6921B14798N0388G2896
$$ 235541 379598 620220 355277 -155906 266195 3433 -16921 214798 265186 72896
16306B85916A23739L13037C36a14989A97440a38967A17183N2923C8834J02365
$$ 285916 123739 436776 336 -114989 197440 -138967 117183 170106 38834 141199
16296A41199K76506A52999J83080A59510c41045a01589A23291J0978h849A62683
$$ 141199 417705 152999 336079 159510 -341045 -101589 123291 134269 -8849 162683
16285E5774j4034K11475b9844i149j19595A72007L4014H073b006B55096f5236
$$ 55774 41740 253215 -29844 -9149 -128744 172007 206021 8073 -2006 255096 -65236
16273A74038e01626A37322f2749B05424g3459a9980A54302a6175n4274E3668b1555
$$ 174038 -501626 137322 -62749 205424 -73459 -19980 154302 -16175 -70449 53668 -21555
16261b40329a01427B89379B8366K14237a45081C2289a32274j8721E109P2905J00082
$$ -240329 -101427 289379 28366 242603 -145081 32289 -132274 -150995 5109 78014 178096
16250A78096O4663A8024J00313a79731C1721i7221A97051N1690N7828p9860b72437
$$ 178096 242759 18024 118337 -179731 31721 -97221 197051 248741 306569 226709 -272437
16238B5414J81399G1883j2670d1611D9685K33035q2445a80141A12922i6478nA5561
$$ 25414 206813 71883 59213 -41611 49685 282720 200275 -180141 112922 -96478 -96483 15561
16225A46699J94180A59615f8271j75819B09752e0566j82264A28220J5364a44833
$$ 146699 340879 159615 -68271 -244090 209752 -50566 -232830 128220 143584 -144833
16214A56260o4248o870a1970B03380a86609F5442e1177A51002a97628m7958E6091
$$ 156260 92012 85142 -11970 203380 -186609 65442 -51177 151002 -197628 -245586 56091
16202b16390d1038A64352K08599d0273o6312E7810J44230A9284e6157j49260j39843
$$ -216390 -41038 164352 372951 -40273 -106585 57810 202040 19284 -56157 -205417 -345260
16191c45260a40842B66480G2485b02760A09889K8939c37857a10913C8535f5475
$$ -345260 -140842 266480 72485 -202760 109889 138828 -337857 -110913 38535 -65475
16180a32317B00967a25020B30145C5629d9816A33312a59967L7204C2128J10122
$$ -132317 200967 -125020 230145 35629 -49816 133312 -159967 -122763 32128 142250
16170A42250c19751J41669j4693B2094c8598k35180A83801J43392D5938b31316
$$ 142250 -319751 -178082 -192775 22094 -38598 -273778 183801 327193 45938 -231316
16159B28445H5643b705D6551f4097j6645A47195n5807b31175J2620I4868f8891
$$ 228445 85643 -2705 46551 -64097 -80742 147195 91388 -231175 -218555 94868 -68891
16147B7116a51687F9696a51436k6008F9152a17194c027C6100P8070h7937F4628
$$ 27116 -151687 69696 -151436 -177444 69152 -117194 -3027 36100 114170 -87937 64628
16135D2059a66869B22505D6388a14013m9161A40399M1099a98190C87944a16632
$$ 42059 -166869 222505 46388 -114013 -163174 140399 181498 -198190 387944 -116632
16124A17500g2369j2757r3000N6046H8149J19758j5305C2564b30766A6871h5530
$$ 117500 -72369 -85126 -178126 -122080 88149 207907 192602 32564 -230766 16871 -85530
16112B29288B4171d5985k15269e0449k02582D9195b57529A53830J6184g0580A26191
$$ 229288 24171 -45985 -261254 -50449 -253031 49195 -257529 153830 170014 -70580 126191
16100D79824j65324n0438o2915M1658e8384A08931O3389B124b7321A18790l4557
$$ 479824 314500 264062 201147 242805 -58384 108931 172320 2124 -27321 118790 84233
16089H4233J23158I5078a62605N6294B23371J2850o9331b34184p9576R4864j976
$$ 84233 207391 95078 -162605 -106311 223371 236221 166890 -234184 -313760 -218896 -220872
16078b20872e0133j50517k7028A54489a2206j71980I3094a22827B10572b01663
$$ -220872 -50133 -200650 -227678 154489 -12206 -184186 93094 -122827 210572 -201663
16067b896k25740E16657C7912M0787a17295B38947b25721m5196a9175j34913G4092
$$ -2896 -228636 516657 37912 78699 -117295 238947 -225721 -270917 -19175 -154088 74092
16055h1350a0072o5717E5447b21363N1976j48556F854O3063f2690j15113C5614
$$ -81350 -10072 -75789 55447 -221363 -169387 -317943 6854 69917 -62690 -177803 35614
16043B7052a33558A44444N0935j4937d33971K06124A37661a01116k5158B6907
$$ 27052 -133558 144444 195379 180442 -433971 -227847 137661 -101116 -126274 26907
16032G9838O0210h2569B32612I7174b22359N8650J338c3608q4150C57771h2091
$$ 79838 140048 -82569 232612 97174 -222359 -163709 -162371 -33608 -117758 357771 -82091
16020C0391g0819j41202D3242d0858k91446a9675D08066d5923B03006b54039B71687
$$ 30391 -70819 -212021 43242 -40858 -332304 -19675 408066 -45923 203006 -254039 271687
16008H3249b9208k1442j10652H5218d44415F0277N5478g2365q7780A43185b49381
$$ 83249 -29208 -50650 -161302 85218 -444415 60277 115755 -72365 -160145 143185 -249381
15996b02488j7713j02284J5454C21882a52537e0926B85771b47568b8315A99519
$$ -202488 -220201 -322485 -307031 321882 -152537 -50926 285771 -247568 -28315 199519
15985E4776i1250L2753B37321J06250r8451K75684q2459K7760o1352C0826l895
$$ 54776 -91250 -58497 237321 343571 245120 520804 438345 466105 404753 30826 26931
15974B6931a91713j4304A76343c4144A09419c31391h203A9041J18485g2103C21347
$$ 26931 -191713 -206017 176343 -34144 109419 -331391 -8203 19041 137526 -72103 321347
15962c01528J21118j56848a0766j42216b3436B7679a38380f851k01601Q9198j30177
$$ -301528 -180410 -337258 -10766 -152982 -23436 27679 -138380 -6851 -208452 -119254 -249431
15951b49431A47298b89163E2542b5030A20301f9037j60521O4855A37825b86923
$$ -249431 147298 -289163 52542 -25030 120301 -69037 -229558 -164703 137825 -286923
15940b02399b1620F6585d1662l4006l24109a86564E7670J22812K2614E4764b7496
$$ -202399 -21620 66585 -41662 -75668 -399777 -186564 57670 180482 203096 54764 -27496
15928g11A30603a13768k38408i858n5715A13838g4336o050j22911C001a03061
$$ -711 130603 -113768 -352176 -9858 -65573 113838 -74336 -80386 -203297 3001 -103061
15916c79302D5606b02471A2243b68850k7276I4619C5216c00008H5731a54317A81138
$$ -379302 45606 -202471 12243 -268850 -296126 94619 35216 -300008 85731 -154317 181138
15904G0881j3809R1868b38815j37251d3719H1395l2366a29353a6323C1613e0171
$$ 70881 57072 148940 -238815 -376066 -43719 81395 49029 -129353 -16323 31613 -50171
15892f4595l65698I6712b8670D8941O130d3676J2249l94075b392H6671j7162b36526
$$ -64595 -430293 96712 -28670 48941 55071 -43676 -31427 -425502 -2392 86671 69509 -236526
15879c7926j39088e265n00011a12086l59879I6594a69396D2139J26709b0647I9357
$$ -37926 -177014 -5265 -505276 -112086 -471965 96594 -169396 42139 168848 -20647 99357
15867i852j52529I1083D399c51265A33530J23415m8075a79671C59188A6737R6336
$$ -9852 -162381 91083 4399 -351265 133530 256945 208870 -179671 359188 16737 113073
15856A13073i9433a3102r771k49100o6911j45407a93153E2413a2049A37464d52759
$$ 113073 -99433 -13102 -22873 -271973 -338884 -484291 -193153 52413 -12049 137464 -452759
15844a31852j7819A99038g9570A96538M6554b4009G8671R5368r165b75152I6080
$$ -131852 -149671 199038 -79570 196538 243092 -24009 78671 174039 164874 -275152 96080
15832b49472a15698D142e855B30965N1183b24039F387a10874l288q9071Q2813
$$ -249472 -115698 4142 -5855 230965 282148 -224039 6387 -110874 -114162 -203233 -120420
15821a20420M1723A97647I0599a38806j85950b6188A52323b05467h5706L6656
$$ -120420 -78697 197647 90599 -138806 -324756 -26188 152323 -205467 -85706 -49050
15811d9050B27068d13600G3811B3302P7472a47608B12830a17491H1260J0948a18377
$$ -49050 227068 -413600 73811 23302 100774 -147608 212830 -117491 81260 92208 -118377
15799B51663A14328P0244b6587j34786C04253i9814J1271l2140A40846h0028A44300
$$ 251663 114328 184572 -26587 -161373 304253 -99814 -88543 -120683 140846 -80028 144300
15787a5008j10243A26828E3792A4125h4329c3410p2901A8782b30483N1879E5457
$$ -15008 -125251 126828 53792 14125 -84329 -33410 -106311 18782 -230483 -178604 55457
15775A29226L21551D3427M5614g5311d313j45519B20078b97541e5086A36379J3008
$$ 129226 450777 43427 89041 -75311 -4313 -149832 220078 -297541 -55086 136379 149387
15764A49387c1216l6976m5804p1427F1989j6024a13766A02123M5224h3813H576
$$ 149387 -31216 -68192 -113996 -185423 61989 45965 -113766 102123 147347 -83813 8576
15752b6593A26401b7170r6620o1210A98106F201e348B2727K9186a7946C5396E077
$$ -26593 126401 -27170 -123790 -185000 198106 6201 -5348 22727 51913 -17946 35396 5077
15739B38897h2178B3037a67956Q3920A42592d2522A07029n2676L00310E3615J9323
$$ 238897 -82178 23037 -167956 -84036 142592 -42522 107029 54353 354663 53615 72938
15728G2938K48584a50615o9075i2067L8945I2615K66167a19320C3243j5330b37398
$$ 72938 321522 -150615 -219690 -92067 -53122 92615 358782 -119320 33243 17913 -237398
15716D0197J46045a55924B89842m2283E241c08880J50887B21034a77078j78048
$$ 40197 186242 -155924 289842 247559 5241 -308880 -157993 221034 -177078 -355126
15706c55126A36255b69121k112F3714b82009N6245b6635F2512c23529J36422B5261
$$ -355126 136255 -269121 -271233 63714 -282009 -225764 -26635 62512 -323529 -187107 25261
15694a11077F2030m441Q434R2950K20932I6921O7373j8643O6549G3800c12891
$$ -111077 62030 57589 66023 158973 379905 96921 164294 145651 212200 73800 -312891
15682a33041B48725C5512Q0934K07600g2152F1482B6638h40B32287i4623l7500
$$ -133041 248725 35512 116446 324046 -72152 61482 26638 -840 232287 -94623 -132123
15671a32123j37197C34815d6779A979h4933a821k06477B48337f4444j09086A89532
$$ -132123 -269320 334815 -46779 1979 -84933 -1821 -208298 248337 -64444 -173530 189532
15659b64916d5413J5302H7340a74644e4342r5870d7432G7184M2798a05107j19489
$$ -264916 -45413 -30111 87340 -174644 -54342 -150212 -47432 77184 119982 -105107 -224596
15648b24596A05112b93661f1722m4579K9198B59503a38321n450j84926J15256
$$ -224596 105112 -293661 -61722 -106301 -77103 259503 -138321 -143771 -328697 -213441
15638b13441A53631b35656F6941a08495J4529a7272A00554d4997H2480e626j49604
$$ -213441 153631 -235656 66941 -108495 -93966 -17272 100554 -44997 82480 -5626 -155230
15627a55230j35675C15423H9023b66275A70101F650J73548k4076a38226j30266
$$ -155230 -290905 315423 89023 -266275 170101 6650 180198 156122 -138226 -268492
15617b68492A18529E0164f4366A63103a42688A36076h0872j48801B02291a28372
$$ -268492 118529 50164 -64366 163103 -142688 136076 -80872 -229673 202291 -128372
15606a31857e4775q3112m7643k58240a95780B44967a48921G3625a82953a9008
$$ -131857 -54775 -137887 -185530 -443770 -195780 244967 -148921 73625 -182953 -19008
15595c9772B51787q2685h4418d2035q1789j56846g9346A08538L1796F5319h8246
$$ -39772 251787 169102 -84418 -42035 -123824 -280670 -79346 108538 140334 65319 -88246
15583B0340a45304H5868A1490a07776j86828A77038c9452A30435b68947A16935
$$ 20340 -145304 85868 11490 -107776 -294604 177038 -39452 130435 -268947 116935
15572D838b9891B65300M811F374J00827c6931A08788a11954A11155h0048C5591
$$ 4838 -29891 265300 270111 6374 107201 -36931 108788 -111954 111155 -80048 35591
15560A3045M6937b34506k06595A07950f7202B7509K38218B4746L22520a96440
$$ 13045 59982 -234506 -441101 107950 -67202 27509 265727 24746 347266 -196440
15549c2050l32561C184N9440G072a44500H2581C0855L54318g4359B3796h8915
$$ -32050 -364611 3184 62624 7072 -144500 82581 30855 385173 -74359 23796 -88915
15537C62242A67552b13258k03807D239b77629I9153B1455a30692c78E2937b7006
$$ 362242 167552 -213258 -417065 4239 -277629 99153 21455 -130692 -378 52937 -27006
15525f5094F924a54387b345G3479c8998k47786B54212j1215J31240b40913B11688
$$ -65094 6924 -154387 -2345 73479 -38998 -286784 254212 242997 374237 -240913 211688
15513B01552e5533A33297J32371b11801m4483A3493M14115A23721d5376A39297
$$ 201552 -55533 133297 265668 -211801 -256284 13493 427608 123721 -45376 139297
15502b83972a18794j55451A40288a32420D02264b9887C12160a01230H305a7000
$$ -283972 -118794 -274245 140288 -132420 402264 -29887 312160 -101230 8305 -17000
15491a28266B8815J98822a53587H7195J5207L01624e6455a5136k79393h1324J8369
$$ -128266 28815 227637 -153587 87195 102402 404026 -56455 -15136 -294529 -81324 -62955
15480f2955A32891o6157l2434J78856b0778n07080A64558a1988A92766e5977A36657
$$ -62955 132891 66734 34300 213156 -20778 -527858 164558 -11988 192766 -55977 136657
15468F7360b18607A18680b89589G343h6179B19509m2766A7641b4722J1036A32173
$$ 67360 -218607 118680 -289589 7343 -86179 219509 176743 17641 -24722 -13686 132173
15456e2372F8065h4333m7327A28435F3330a07110b6835A40347J12539b42690k49083
$$ -52372 68065 -84333 -131660 128435 63330 -107110 -26835 140347 252886 -242690 -491773
15445d91773C39168A67152K47451i0930m188A55140b76752G3602i6106p2589A50603
$$ -491773 339168 167152 414603 -90930 -95118 155140 -276752 73602 -96106 -168695 150603
15433d46690J52037M8547Q3764f2655A23132d36m621j14648B68216k5187D6460
$$ -446690 -294653 -246106 -162342 -62655 123132 -436 -5057 -119705 268216 243029 46460
15421A3999b43017E9491g3325D5574a82794J0532B07534o2878k71k9356D3907
$$ 13999 -243017 59491 -73325 45574 -182794 -172262 207534 144656 144385 115029 43907
15409a08730A60160d94661J19678J34583E7225K95268C4027K41542b40017Q1684
$$ -108730 160160 -494661 -374983 -240400 57225 352493 34027 275569 -240017 -158333
15399a58333F7247O9604j0523a00256A5198a02376J4046A48031P3906f9795G7364
$$ -158333 67247 136851 126328 -100256 15198 -102376 -88330 148031 221937 -69795 77364
15387b50170p822A02397N3042i8308E4368c7150j84627k3710B440M6608J81629
$$ -250170 -257992 102397 155439 -98308 54368 -37150 -221777 -245487 2440 49048 230677
15376B30677b4138I4530g9131j06942C5243a86237M7557I3330a36644F8560B5001
$$ 230677 -24138 94530 -79131 -186073 35243 -186237 -138680 93330 -136644 68560 25001
15364C18501b44152B12297g4631B45704a79828A18560e4482B1765b19823E171
$$ 318501 -244152 212297 -74631 245704 -179828 118560 -54482 21765 -219823 5171
15353a03216o1684M3769m9527C3070K22241a30333A86883b997k6643n2354a446
$$ -103216 -164900 -121131 -170658 33070 255311 -130333 186883 -2997 -29640 -81994 -1446
15341a84012e7621A24368J2069F7702a42444H7027L536K44319A24904J32731G2455
$$ -184012 -57621 124368 136437 67702 -142444 87027 90563 334882 124904 257635 72455
15329A65349i9358m8516G4479f7309A49576L2531l5967k5560R6145b6113n9572
$$ 165349 -99358 -147874 74479 -67309 149576 182107 146140 120580 216725 -26113 -85685
15318h5685l8171C16388a82610A15594m7536h5145A57567e2145C1296b7498A63940
$$ -85685 -123856 316388 -182610 115594 68058 -85145 157567 -52145 31296 -27498 163940
15306C21129C0096N7172N0467e1213r8388B41982f1435F6872b12155D76009j47014
$$ 321129 30096 87268 137735 -51213 -149601 241982 -61435 66872 -212155 476009 328995
15295C28995F9810l0116J03566Q8647a62021k0828B56254j03427P7995G8233J75587
$$ 328995 69810 39694 143260 231907 -162021 -182849 256254 152827 230822 78233 253820
15284B53820p5872c2924A9611J64397b84908O7567C9679J64442a87075b2993A00359
$$ 253820 177948 -32924 19611 184008 -284908 -217341 39679 204121 -187075 -22993 100359
15272D3006L87642G225J77228M28719b12526A51258a9807E3555J11353J07008
$$ 43006 430648 7225 184453 613172 -212526 151258 -19807 53555 164908 271916
15262B71916I6657R8991J91002F7306M1882J4169m8669K91170r0320g9910j01201
$$ 271916 96657 195648 386650 67306 109188 123357 74688 365858 275538 -79910 -181111
15251a81111B12554B8494i9498C0401b6608B59365J16627J40331L85195J721840
$$ -181111 212554 28494 -99498 30401 -26608 259365 375992 516323 901518 2623358
15241B623358l44974J01079L69171A290801E42648A19244E4952a7101C39028m3302
$$ 2623358 2278384 2379463 2748634 1290801 542648 119244 54952 -17101 339028 295726
15231B95726m5313F0177A9575f4040H1485b37838A58836a40684j79014F39101
$$ 295726 250413 60177 19575 -64040 81485 -237838 158836 -140684 -319698 639101
15220A76383a31898E7885c0319A43070C0986K40260I5730K8871f1808m2559A14472
$$ 176383 -131898 57885 -30319 143070 30986 271246 95730 124601 -61808 -104367 114472
15208A72432G9484K06617A3662M76372B00670f1135A80502B6462g0366c3333j47413
$$ 172432 79484 286101 13662 490034 200670 -61135 180502 26462 -70366 -33333 -180746
15197a80746r01B25201D6124J87293C0669a55984e8736B68925a58586A31174F1269
$$ -180746 -181647 225201 46124 233417 30669 -155984 -58736 268925 -158586 131174 61269
15185B4317J2143b783k45756B49791h4105j15184k51376G8898b52997A38518f5514
$$ 24317 36460 -2783 -248539 249791 -84105 -199289 -450665 78898 -252997 138518 -65514
15173f8036o0055K2992c884C1685g5409A63536A2130a46353M3637J881C38789
$$ -68036 -128091 -105099 -3884 31685 -75409 163536 12130 -146353 -102716 -100835 338789
15161H4095a96615A30450b3585I1430J09292a0193C05646a95006a9519A2958L7887
$$ 84095 -196615 130450 -23585 91430 200722 -10193 305646 -195006 -19519 12958 50845
15150E0845J79322A7498a47349C80330E4241b14357B01436a96286A57206k3963
$$ 50845 230167 17498 -147349 380330 54241 -214357 201436 -196286 157206 133243
15140A33243j5413b0487m1496k8455A49938L72586k18217C9275K15180I2181i7921
$$ 133243 117830 -20487 -61983 -90438 149938 522524 304307 39275 254455 92181 -97921
15128A55586r895p0734n705f1766C33109A16960K98458j64713q8660E9875J24857
$$ 155586 145691 74957 69252 -61766 333109 116960 415418 250705 162045 59875 184732
15117A84732K6223p8939e3276D42210C2935J49533q4211k5791Q8910J24733k5074
$$ 184732 210955 132016 -53276 442210 32935 182468 98257 72466 161376 286109 261035
15106B61035r823A00540J50809l1411j04163L665e9816B12848J0309K90225j16402
$$ 261035 251212 100540 251349 219938 115775 119440 -59816 212848 223157 513382 396980
15095C96980A81333a76958i101B02968A00510K7621K31527n2767j48477J6606
$$ 396980 181333 -176958 -9101 202968 100510 128131 359658 306891 158414 175020
15085A75020M771q8187J5144I041a3820j70542M9363b4846k5075B96386r6515
$$ 175020 179791 91604 106748 9041 -13820 -184362 -134999 -24846 -49921 296386 199871
15074A99871M5144M5619E8735N8861K48608j79468A2847J53215K13773A88680
$$ 199871 245015 290634 58735 117596 366204 186736 12847 166062 379835 188680
15063a42487B63264h1070B30052f6213B34098j4567l5320K2056A01603L64291
$$ -142487 263264 -81070 230052 -66213 234098 219531 184211 206267 101603 465894
15053D65894A99292j7951c44696A76309G9486e7306k09837J6334I2666f1353B55825
$$ 465894 199292 181341 -344696 176309 79486 -57306 -267143 -250809 92666 -61353 255825
15041B42197a52064A33842J03549N8021G2795b2267A8343J75811k4197J12027
$$ 242197 -152064 133842 237391 295412 72795 -22267 18343 194154 169957 281984
15031B81984J52105K657I1972L61702A38162K38233j82348e1825a379C00459F7517
$$ 281984 434089 436746 91972 453674 138162 376395 194047 -51825 -1379 300459 67517
15019A8761P9508P588L13106a63597C49790A64390L65487a3076A16459K26646
$$ 18761 98269 105857 418963 -163597 349790 164390 529877 -13076 116459 343105
15009C43105j34488c4999A66917N1910J16178J13250k19338E1111K86180j00321
$$ 343105 208617 -34999 166917 218827 335005 448255 228917 51111 337291 236970
14999B36970H3307K86521j51770l0885H1845K52435j55008J13074l3402C4638
$$ 236970 83307 369828 218058 187173 81845 334280 179272 292346 258944 34638
14988A67050J36204e8219b1143C39123A28188J58031r2540J53772b244C94973
$$ 167050 303254 -58219 -21143 339123 128188 286219 193679 347451 -2244 394973
14977A06868D8461J32549K27511o7915J68653B27102a52097A65790L09960M235
$$ 106868 48461 181010 408521 340606 509259 227102 -152097 165790 475750 479985
14967D79985m6896B03099J23242N3642Q4604A18496k1099N5834M8000q1281a6462
$$ 479985 433089 203099 326341 379983 464587 118496 97397 153231 201231 119950 -16462
14955B11983E5201N6012J84165j01361o382L27700k38076J7986q7747p6230M90545
$$ 211983 55201 111213 295378 194017 187635 515335 277259 295245 207498 131268 621813
14944F21813C04777K12708k16643r5454J78642A01884K14679o2730K05030j59663
$$ 621813 304777 517485 300842 205388 384030 101884 316563 253833 458863 299200
14934B99200j06561J61300n9272E5045J20893q3597K00853H6807Q4427L5406o5157
$$ 299200 192639 353939 294667 55045 175938 92341 293194 86807 171234 206640 141483
14923A41483J95432M7305m2055J59972A79831J21072L58301J07579f3686D78782
$$ 141483 336915 384220 342165 502137 179831 300903 659204 766783 -63686 478782
14912E45708k06778M4726A52415c67442B83212M1629J41149j8322A63185J27093
$$ 545708 338930 383656 152415 -367442 283212 324841 465990 447668 163185 290278
14902B90278L45025j91102l4056A46366J08525B7350c370E98234m2975A20641
$$ 290278 635303 444201 410145 146366 254891 27350 -3370 598234 555259 120641
14891B99644j1548P5596j06807L38184A97500K21111j21575J30537o6044J77323
$$ 299644 288096 363692 256885 595069 197500 418611 297036 427573 361529 538852
14881E38852A71472J33960j2786m411N8804n9138J72102c587C56567j11393Q1740
$$ 538852 171472 305432 292646 288235 347039 287901 460003 -3587 356567 245174 326914
14870C26914J27965M5943J3296M088j87341K80171B80839J10783P4747n4244M8633
$$ 326914 454879 500822 514118 518206 330865 611036 280839 391622 466369 412125 460758
14859D60758P9971j41875L5860q9237J05828o3988J66868A43576J06443K60421
$$ 460758 540729 398854 434714 345477 451305 387317 554185 143576 250019 510440
14849E10440K9158j9299k44894q2520M40211B33572P0207J12905K35050k14937
$$ 510440 539598 520299 275405 192885 633096 233572 303779 416684 651734 436797
14839D36797l2665l1265L67151r9648n9829Q3547k55119r8928L85714C00995N09756
$$ 436797 404132 372867 740018 640370 580541 664088 408969 310041 695755 300995 810751
14828H10751j73159j05751J27626l4226o5819k34671K31643j46425j23950J04493
$$ 810751 637592 531841 659467 625241 559422 324751 556394 409969 286019 390512
14818C90512R7639J83801k57243j10009J81663A84564O65449k08212J8138l09876
$$ 390512 488151 671952 414709 304700 486363 184564 850013 641801 659939 350063
14808C50063L79493q7652j31019j7090j1976o8228j36582M55024j24892J5870
$$ 350063 729556 641904 510885 493795 481819 413591 277009 732033 607141 623011
14798F23011j59485j46719o8213L12978K71116k3856M7143j57649K06500j37313
$$ 623011 463526 316807 248594 561572 832688 808832 855975 698326 904826 767513
14788G67513M9669k82432K61461C79805m1891J91411J44145B32348L04518K74489
$$ 767513 817182 534750 796211 379805 337914 529325 673470 232348 536866 811355
14778H11355j26827Q3711j38499N0939j63043m0683L45393k63785j08022L52876
$$ 811355 684528 768239 629740 680679 517636 476953 822346 558561 450539 803415
14768H03415l39116M7118L6001J84881k29657K02161P7870Q9139k09783j4905
$$ 803415 464299 511417 547418 732299 502642 704803 782673 871812 662029 647124
14758F47124B69881N62508k19272k42110L71016o1171l2522j9188r7429R5674
$$ 647124 269881 832389 613117 371007 742023 680852 648330 629142 531713 627387
14748F27387J87740O4897k80010L10885m5646k69181p5243N3391J30632J35319
$$ 627387 815127 880024 600014 910899 865253 596072 520829 574220 704852 840171
14738H40171o3702k52032L01490j11110J63123J9737m6561J28141D29197J64252
$$ 840171 776469 524437 825927 714817 877940 897677 851116 979257 429197 593449
14728E93449j75652L66794R2177l18034M65571m61514M3791q4540M50230j92151
$$ 593449 417797 784591 876768 558734 1024305 562791 606582 522042 972272 780121
14718G80121k12798M52306k6579n3899o8313K88328n31898J12549J77276k08550
$$ 780121 567323 1019629 993050 939151 870838 1159166 627268 739817 917093 708543
14708G08543J64994k52422K33174r3164r0896J71603k42262K05308M5702j60900
$$ 708543 873537 621115 854289 761125 670229 841832 599570 804878 850580 689680
14698F89680J57450R823R5215n5931j37201K36057j55575Q2587K16601r5729k70659
$$ 689680 847130 856953 952168 896237 759036 995093 839518 922105 1138706 1042977 772318
14687G72318L08991j62007J5060j2155J6663l66102L83937L07105l80801J60055
$$ 772318 1081309 919302 934362 922207 938870 572768 956705 1263810 883009 1043064
14677A043064N399l30841M14543n26059Q56709m33409p5551K82098m06468K13698
$$ 1043064 1048463 717622 1132165 606106 1462815 1029406 953855 1235953 829485 1043183
14667A043183Q6637j81316O5744O7264K04037k59019k5585J87081k18172K32067
$$ 1043183 1129820 948504 1014248 1081512 1285549 1026530 1000945 1188026 969854 1201921
14657A201921J37876m33237o0255L64202r70m91107M60706K66572k34746K30801
$$ 1201921 1339797 906560 846305 1210507 1209537 718430 1179136 1445708 1210962 1441763
14647A441763k45187m5091L0181n5386N91248m44867R8118K0084k61093K35430
$$ 1441763 1196576 1151485 1181666 1126280 1717528 1272661 1370779 1390863 1129770 1365200
14637A365200p56j15792R0405j64594r4933M22436j56727R5162N3764J2631n45546
$$ 1365200 1364444 1248652 1339057 1174463 1079530 1501966 1345239 1440401 1494165 1506796 961250
14626I61250K74141j35719J66735N08978k31260j38412L53384n21344K97165M5684
$$ 961250 1235391 1099672 1266407 1775385 1544125 1405713 1759097 1237753 1534918 1580602
14616A580602J46224Q0967m65930L28327j05729k17095Q9225K79679k40382J78876
$$ 1580602 1726826 1807793 1341863 1670190 1564461 1347366 1436591 1716270 1475888 1654764
14606A654764l9616M1311K45513l9291l35592K59711m19056L28495n00039O94674
$$ 1654764 1615148 1656459 1901972 1862681 1527089 1786800 1367744 1696239 1196200 1890874
14596A890874l08346M31277q365l35367L47509l84366J02678J18180j21710O3282
$$ 1890874 1582528 2013805 2005440 1670073 2017582 1633216 1735894 1854074 1732364 1795646
14586A795646L89611n2632J45953l55973M5749r9752L0522K28365L61888m13507
$$ 1795646 2185257 2132625 2278578 1922605 1968354 1868602 1899124 2127489 2489377 2075870
14576B075870L14763k94156L29888k49965K04701j06588m7234K78795j216k97320
$$ 2075870 2390633 2096477 2426365 2176400 2381101 2274513 2227279 2506074 2504858 2207538
14566B207538M81941k36623L36322J27374m51769J64794L8224K07326n3237L09656
$$ 2207538 2689479 2452856 2789178 2916552 2464783 2629577 2667801 2875127 2821890 3131546
14556C131546Q4452k26262L54863M31606N23693L14163N59727J688637L638648
$$ 3131546 3215998 2989736 3344599 3776205 4299898 4614061 5173788 6862425 10501073
14547A0501073Q525369K1236236J1288710B4155032H802415D054682j086813j16503
$$ 10501073 19026442 40262678 51551388 24155032 8802415 4054682 2967869 2851366
14539B851366M08718J265421K861925k832190j856338o44091N4538K1945k80886
$$ 2851366 3260084 4525505 7387430 4555240 2698902 2054811 2109349 2131294 1850408
14530A850408L45430K35938j072k15604J21759n325k09058M89895J3429l4936
$$ 1850408 2195838 2431776 2430704 2215100 2336859 2331534 2122476 2612371 2625800 2590864
14520B590864j13145K344K29352k359l40690M12578K80307j84410j51671J10635
$$ 2590864 2477719 2480063 2709415 2707056 2366366 2778944 3059251 2874841 2723170 2833805
14510B833805M8756k9337k8336K45875j57987K46659j80250L21401r7661m903
$$ 2833805 2882561 2853224 2824888 3070763 2912776 3159435 2979185 3300586 3202925 3198022
14500C198022K40721m44224M06167k53410J1322K05178K5420k13290K62962j76748
$$ 3198022 3438743 2994519 3400686 3147276 3158598 3363776 3389196 3175906 3438868 3262120
14490C262120K74802J61322j11013J74081j25747K24270J92741k29554l9028K9541
$$ 3262120 3536922 3698244 3587231 3761312 3635565 3859835 4052576 3823022 3783994 3813535
14480C813535L78158o3844J7295n2073r6298J78646L35779l05150J07755K37983
$$ 3813535 4191693 4127849 4145144 4093071 3996773 4175419 4511198 4206048 4313803 4551786
14470D551786j17786J14511j21941L14994k72938L08847L83013j51875J42232
$$ 4551786 4434000 4548511 4426570 4741564 4468626 4777473 5160486 5008611 5150843
14461E150843m91240M62218j40784j8046M58051k45557N6836J56895J85362j63691
$$ 5150843 4659603 5121821 4981037 4962991 5421042 5175485 5232321 5389216 5574578 5410887
14451E410887M13731m50187K31454K62878P9292r2529L04729o6224K20183j76001
$$ 5410887 5824618 5374431 5605885 5868763 5948055 5855526 6160255 6094031 6314214 6138213
14441F138213L08129l79667J43769N57315j17716J67751o8546k38030K92193L09462
$$ 6138213 6446342 6066675 6210444 6767759 6650043 6817794 6749248 6511218 6803411 7112873
14431G112873j58071L88511l33670M00203K10751r1831J21490R2229O0798M30684
$$ 7112873 6954802 7343313 7009643 7409846 7620597 7528766 7650256 7742485 7803283 8233967
14421H233967j99027L30778J29998k10914j81568L26246M96173J29624m9612J00393
$$ 8233967 8034940 8365718 8495716 8284802 8103234 8429480 8925653 9055277 9005665 9106058
14411I106058K94140j71482M07247K92197j30800J54149P0180M99974q2516J29904
$$ 9106058 9400198 9228716 9635963 9928160 9797360 9951509 10021689 10521663 10439147 10569051
14401A0569051K80148J59916J02930L94330L19910K10430j90223K29006M18432
$$ 10569051 10849199 11009115 11112045 11506375 11826285 12036715 11846492 12075498 12493930
14392A2493930k1143K27112K63898K59532M87861j08130M05245l6228L54771L83064
$$ 12493930 12472787 12699899 12963797 13223329 13711190 13603060 14008305 13972077 14326848 14709912
14382A4709912L31133L14239K92208l8827N76198L28445M25396N1042N62587L20284
$$ 14709912 15041045 15355284 15647492 15608665 16184863 16513308 16938704 16989746 17552333 17872617
14372A7872617L66390O8352O10286K74649J17163O08896N65076K85833N30937
$$ 17872617 18239007 18307359 18917645 19192294 19309457 19918353 20483429 20769262 21300199
14363B1300199O41467M5730Q48072J31067R61931J28537Q84775Q15914M7448Q34389
$$ 21300199 21941666 21987396 22835468 22966535 23928466 24057003 24941778 25757692 25805140 26639529
14353B6639529N50527N71339R39091N13115J121171N05284N26963O95400P89947
$$ 26639529 27190056 27761395 28700486 29213601 30334772 30840056 31367019 32062419 32852366
14344C2852366P61040J191646R64834J048733N32504J165943J110731J343414
$$ 32852366 33613406 34805052 35769886 36818619 37351123 38517066 39627797 40971211
14336D0971211J087659J071125J154177J359189J430304J478718J303397J631651
$$ 40971211 42058870 43129995 44284172 45643361 47073665 48552383 49855780 51487431
14328E1487431J698179J432928J822999J943387K044375K047727K062105K453416
$$ 51487431 53185610 54618538 56441537 58384924 60429299 62477026 64539131 66992547
14320F6992547K165586K338171K494333K901307K957423K791083L582078K965452
$$ 66992547 69158133 71496304 73990637 76891944 79849367 82640450 86222528 89187980
14312H9187980L664095L834768L549869L873257M744725M982562M726970N108850
$$ 89187980 92852075 96686843 100236712 104109969 108854694 113837256 118564226 123673076
14304A23673076N541813N722894O227411O281858P129158P322677Q027196P899786
$$ 123673076 129214889 134937783 141165194 147447052 154576210 161898887 169926083 177825869
14296A77825869Q696916R166432R924755R926190J0714618J1895666J1678767
$$ 177825869 186522785 195689217 205613972 215540162 226254780 238150446 249829213
14289B49829213J2326014J3752535J3464884J4340051J4680915J5632744J5145774
$$ 249829213 262155227 275907762 289372646 303712697 318393612 334026356 349172130
14282C49172130J6058638J5800509J5805655J5821219J4929016J4508281J2840568
$$ 349172130 365230768 381031277 396836932 412658151 427587167 442095448 454936016
14275D54936016J1471014R808716O138726J179798j76363k943846j078801j178710
$$ 454936016 466407030 476215746 482354472 483534270 483357907 480414061 479335260 478156550
14267D78156550n701932n340006r532127j1904054j3413692j4776899j5979636
$$ 478156550 472454618 467114612 457582485 445678431 432264739 417487840 401508204
14260D01508204j6903741j6531387j6978629j6635969j6125137j5611207j5414755
$$ 401508204 384604463 368073076 351094447 334458478 318333341 302722134 287307379
14253B87307379j4563443j3892431j3177989j2875918j1996137r441675r277368
$$ 287307379 272743936 258851505 245673516 232797598 220801461 211359786 202082418
14246B02082418j0797336r591487q349982q605117p986952p462058p036678o515865
$$ 202082418 191285082 181693595 173343613 164738496 156751544 149289486 142252808 135736943
14238A35736943n569411n525557n724920n408916m733843m416430m466439l508709
$$ 135736943 130167532 124641975 118917055 113508139 108774296 104357866 99891427 96382718
14230I6382718l469769l935758l603647l591395l056802k426023l515283k327290
$$ 96382718 92912949 88977191 85373544 81782149 78725347 76299324 72784041 70456751
14222G0456751k568397k330676j964530j806923k302818k330637j508147j910002
$$ 70456751 67888354 65557678 63593148 61786225 59483407 57152770 55644623 53734621
14214E3734621j899856r81858j786621j509905j427189j472538j217311o44972
$$ 53734621 51834765 50852907 49066286 47556381 46129192 44656654 43439343 42794371
14206D2794371r63753j884242j218462p75551j339494o04175p21928r45187j509065
$$ 42794371 41830618 39946376 38727914 37952363 36612869 36008694 35286766 34341579 32832514
14197C2832514n70983q87995n87317p30075o76266p37462r62281l27416j234905
$$ 32832514 32261531 31373536 30786219 30056144 29379878 28642416 27680135 27352719 26117814
14188B6117814j95392n23975m61055q48517l00530p89872n21671l39615l50212
$$ 26117814 25922422 25398447 24937392 24088875 23788345 22998473 22476802 22137187 21786975
14179B1786975o95184n84220l91450q28q18866k97842l10911n24538k93226k44124
$$ 21786975 21091791 20507571 20116121 20115293 19296427 18998585 18687674 18163136 17869910 17625786
14169A7625786j18006n19672O974n18337j53336p57755l62162J78229l39611k45150
$$ 17625786 17507780 16988108 16995082 16476745 16323409 15565654 15203492 15381721 15042110 14796960
14159A4796960l76534L9738n68890k20183L126n69153K4508l42541N27078q63945
$$ 14796960 14420426 14460164 13891274 13671091 13674217 13105064 13129572 12787031 13314109 12450164
14149A2450164k11181j19403P58o59940J6894m4933j61451l12552k28270K08694
$$ 12450164 12238983 12119580 12120338 11460398 11477292 11432359 11270908 10958356 10730086 10938780
14139A0938780p7744n59552k00362K31669n17517M4627m3686k03071k05384j92193
$$ 10938780 10861036 10301484 10101122 10332791 9815274 9859901 9816215 9613144 9407760 9215567
14129I215567j1129j45771l32694j69670K22791k55476J53587k38789l77465j07755
$$ 9215567 9204438 9058667 8725973 8556303 8779094 8523618 8677205 8438416 8060951 7953196
14119G953196J15189j69931k51737j7353p3874r8611q3253J59989k35673k53569
$$ 7953196 8068385 7898454 7646717 7629364 7555490 7456879 7373626 7533615 7297942 7044373
14109G044373j57179J49611k21029j46324j47687R2747m55018K41080J77144o70122
$$ 7044373 6887194 7036805 6815776 6669452 6521765 6614512 6159494 6400574 6577718 5907596
14099E907596M39678m82228K79195m47762m0369K91204l66372J71857m7266k13497
$$ 5907596 6347274 5865046 6144241 5696479 5656110 5947314 5580942 5752799 5705533 5492036
14089E492036r7001k3907J43495l00308L81584k01706k39629J1200l68245N1387
$$ 5492036 5395035 5371128 5514623 5214315 5595899 5394193 5154564 5165764 4797519 4848906
14079D848906O2219r3408K68193J3547k19087j72889L65599n03413J18083k5038
$$ 4848906 4911125 4817717 5085910 5099457 4880370 4707481 5073080 4569667 4687750 4662712
14069D662712j44914p4898J40748m09332l4413K62483q3247j59432J54705n8967
$$ 4662712 4517798 4442900 4583648 4174316 4139903 4402386 4319139 4159707 4314412 4255445
14059D255445K07489j07294k65435K87557k35680n5725J7101m81261J39417Q6023
$$ 4255445 4462934 4355640 4090205 4377762 4142082 4086357 4103458 3622197 3761614 3847637
14049C847637j30183J38862k63748P0757l67887J78072J09659j10453K6504k81313
$$ 3847637 3717454 3856316 3592568 3663325 3295438 3473510 3583169 3472716 3499220 3217907
14039C217907J78849k5397m78160J71812K48827j28049m4154J75067k31326J36152
$$ 3217907 3396756 3371359 2893199 3065011 3313838 3185789 3141635 3316702 3085376 3221528
14029C221528k16343L11940k83415m5052R4222j06327k67475K36358r0036J7663
$$ 3221528 3005185 3317125 3033710 2988658 3082880 2976553 2709078 2945436 2855400 2873063
14019B873063J20799J2012m57853k65918J07491L44098k58366N4685j28614m0290
$$ 2873063 2993862 3005874 2548021 2282103 2389594 2733692 2475326 2530011 2401397 2361107
14009B361107j03241M83057k49396j15160J27940j66559J90289k79781O2593R6415
$$ 2361107 2257866 2740923 2491527 2376367 2504307 2337748 2528037 2248256 2310849 2407264
13999B407264n2201P9015J990l35214J58493m7585m60980K87305L92232J7608
$$ 2407264 2355063 2434078 2436068 2100854 2259347 2211762 1750782 2038087 2430319 2447927
13989B447927O98420K250640O045067J9811571K1327611k0525386A5215842o827899
$$ 2447927 3146347 5396987 11442054 31253625 52581236 32055850 15215842 8387943
13981H387943k695312q67574p69923n32263l33078j51303K3246l14719r1208j09538
$$ 8387943 5692631 4825057 4055134 3522871 3189793 3038490 3061736 2747017 2655809 2546271
13971B546271J61088j23646K10325p39589M29549J22948m21413K32622j21400
$$ 2546271 2707359 2583713 2794038 2054449 2483998 2606946 2185533 2418155 2296755
13962B296755L5692q4063j41847L20814l04623l79493L13678n5573O2363J53867
$$ 2296755 2332447 2248384 2106537 2427351 2122728 1743235 2056913 2001340 2063703 2217570
13952B217570m12303P0243J72833j49684L6150l20917K76799J42838k18224j99344
$$ 2217570 1805267 1875510 2048343 1898659 1934809 1613892 1890691 2033529 1815305 1615961
13942A615961J78913L32407m05478n6246O0334J36542n5076K57160n41877K4827
$$ 1615961 1794874 2127281 1721803 1665557 1725891 1862433 1807357 2064517 1522640 1547467
13932A547467k51431N31206j9477l2858M0261m82978N80711l27876J62686n29076
$$ 1547467 1296036 1827242 1807765 1774907 1815168 1332190 1912901 1585025 1747711 1218635
13922A218635J48482K09648p341J09800j13020k25394J36243k9936J99696j18509
$$ 1218635 1367117 1576765 1569424 1679224 1566204 1340810 1477053 1447117 1646813 1528304
13912A528304M5669L2710j85065l8730K05841m8387j48815k02391K78162o2586
$$ 1528304 1573973 1606683 1421618 1382888 1588729 1540342 1391527 1189136 1467298 1404712
13902A404712j72652J36944R1551j46003j85632K86016j7605M1679O4478j46098
$$ 1404712 1232060 1369004 1460555 1314552 1128920 1414936 1397331 1439010 1503488 1357390
13892A357390O6855k55560R1304K03026l32051m3994L3726K42594k34703j43047
$$ 1357390 1424245 1168685 1259989 1463015 1130964 1086970 1120696 1363290 1128587 985540
13882I85540L04503m02425L06951J76788J20846l78837k5584J77543m8853r1577
$$ 985540 1290043 887618 1194569 1371357 1492203 1113366 1087782 1265325 1216472 1124895
13872A124895p7013j46581K89846q7741R235o4640J87395L55736n15882j99203
$$ 1124895 1047882 901301 1191147 1103406 1112641 1048001 1235396 1591132 1075250 876047
13862H76047J44882J84887J70897m18123j22839K31274k8039n0874K7421j1194
$$ 876047 1020929 1205816 1376713 958590 835751 1067025 1038986 988112 1015533 1004339
13852A004339M7392r4477k1446p2526J49985q6498K4655k8451j63125N33117l24570
$$ 1004339 1051731 957254 935808 863282 1013267 926769 951424 922973 759848 1292965 968395
13841I68395R317Q872J92476n54098K87999k51465J45194j30991M19718k21593
$$ 968395 977712 986584 1179060 624962 912961 661496 806690 675699 1095417 873824
13831H73824K91020j29672O1162j85070j06073R2834q666j02641K02158L6511
$$ 873824 1164844 1035172 1096334 911264 805191 898025 889359 786718 988876 1025387
13821A025387m14611O7043J73664j23401J83966J84210j74608M6892j1070n3200
$$ 1025387 610776 677819 851483 728082 912048 1096258 921650 968542 957472 904272
13811I04272j27813J74122m43406L31791k01941K99586l03080J13071K72616j75071
$$ 904272 776459 950581 507175 838966 637025 936611 633531 746602 1019218 844147
13801H44147O0763j74580K72897k79333k47332M40983k41487K34337j41656j24339
$$ 844147 904910 730330 1003227 723894 476562 917545 676058 910395 768739 644400
13791F44400j46485J54211K63786l68322J87915J75450j48506J69775j77149J06229
$$ 644400 497915 652126 915912 547590 735505 910955 762449 932224 755075 861304
13781H61304j35886o9954L95579l25529j81436M12548D55513L71577J27374m14019
$$ 861304 725418 655464 1051043 725514 544078 956626 455513 827090 954464 540445
13771E40445Q4247M2604J45053k43183Q1598J13858K13884j49225j97210K32794
$$ 540445 624692 667296 812349 569166 650764 764622 978506 829281 632071 864865
13761H64865p3719k30892J91002j5968q0220J15785k55010K32428N1830k77945
$$ 864865 791146 560254 751256 735288 655068 770853 515843 748271 800101 522156
13751E22156J16661P7632R0406l66628N27406l76882R0458o8498j47962K08146
$$ 522156 638817 716449 806855 440227 967633 590751 681209 612711 464749 672895
13741F72895L90767l32777m1350o9130q0202j02935K61021J76692J4045l32906
$$ 672895 1063662 730885 689535 620405 540203 437268 698289 874981 889026 556120
13731E56120K67595k82596j32409m5628L50594J6421J24267k18837l09645L03495
$$ 556120 823715 541119 408710 363082 713676 730097 854364 635527 325882 629377
13721F29377Q8039o3639k15562N06465l68756k84451N38973k57396J23101k95953
$$ 629377 717416 653777 438215 944680 575924 291473 830446 573050 696151 400198
13711D00198N5287J10019R7862j96109o1355K253q1074J45983J7381Q1485J0448
$$ 400198 455485 565504 663366 467257 405902 408155 327081 473064 490445 571930 582378
13700E82378j49731J04290l5081L00978k99324K6299j23668m2234K23280k6044
$$ 582378 432647 536937 501856 802834 503510 529809 406141 363907 587187 561143
13690E61143j79821J14415M7591m5836M5729n4121M7215J59536j01675j82236
$$ 561143 381322 495737 543328 497492 543221 489100 536315 695851 594176 411940
13680D11940K64540j07802k30349K11009J15343j93841M3712l5348K30335C18795
$$ 411940 676480 568678 338329 549338 664681 470840 514552 479204 709539 318795
13669E41556j14006L61520l01255l1644K75684A88426L12456m5630l7913K54162
$$ 541556 427550 789070 487815 456171 731855 188426 500882 455252 417339 671501
13659F71501A77807L44147Q0776k01477j9311J26511j02811M41371C22442R7436
$$ 671501 177807 521954 602730 401253 381942 508453 405642 847013 322442 419878
13649D19878m2386M17249l96543J98940k39914K41416k41965K7142A34200K91727
$$ 419878 377492 794741 398198 597138 357224 598640 356675 383817 134200 425927
13639D25927r3944n1172q4774L07136A74170K50866A6809N48011P6411k46675
$$ 425927 331983 280811 196037 503173 174170 425036 16809 564820 641231 394556
13629C94556m5660n6585j8730L60634j19793q0390m9178K51371k19828j742k4045
$$ 394556 348896 292311 273581 634215 514422 434032 384854 636225 416397 414655 390610
13618C90610j07123Q4169L4713J63103k56728A22239K8145J22371j1193J58821
$$ 390610 283487 367656 402369 565472 308744 122239 150384 272755 261562 420383
13608D20383B00321J09929J34669r1866A75631J57500A03484L02789A11107K51741
$$ 420383 200321 310250 444919 353053 175631 333131 103484 406273 111107 362848
13598C62848H9767a31230G47697A40033J24M68346k95306K99007j88036j25585
$$ 362848 89767 -131230 747697 140033 140157 608503 313197 612204 424168 298583
13588B98583l6596J33087l5478o0183l8980A26970K85902M3428j20874M3471j19971
$$ 298583 261987 395074 359596 299413 260433 126970 412872 456300 335426 378897 258926
13577B58926j22940J69301K91860B68651o1994L35492b38145C59246m5018A03996
$$ 258926 135986 305287 597147 268651 206657 542149 -238145 359246 314228 103996
13566D99456k09805Q5930J30736B01658J6212r4709N86568a58113D29432l6051
$$ 499456 289651 375581 506317 201658 217870 123161 709729 -158113 429432 393381
13556C93381m7408j1481G4371K59137J5037J95705k47170j19388k2419J66483
$$ 393381 345973 334492 74371 333508 348545 544250 297080 177692 155273 321756
13546C21756J23622j68869q8629J84801e8908A38284J15864J09438Q9451A0330
$$ 321756 445378 276509 187880 372681 -58908 138284 254148 363586 453037 10330
13535B98259K49836A61821P1994K83745j21877A44421f4166F01023A46149k7277
$$ 298259 548095 161821 233815 517560 395683 144421 -64166 601023 146149 118872
13525A18872k2128J96110a71061A27058J58205J12135e6398D62853B20812M6964
$$ 118872 96744 292854 -171061 127058 285263 397398 -56398 462853 220812 267776
13515B67776h9504D47374c8595D52468a7158C95878j09533K19075j66088p6649
$$ 267776 -89504 447374 -38595 452468 -17158 395878 286345 505420 339332 262683
13505B62683Q1356O7200L2856j99329L3688K07242A61220k3356K50212j8623A72621
$$ 262683 344039 411239 444095 244766 278454 485696 161220 137864 388076 369453 172621
13493C63676J17871B38955I9742a50196C20433J0168L817L9608K3296p4801D2462
$$ 363676 481547 238955 99742 -150196 320433 330601 334418 374026 397322 322521 42462
13481B61820L09026B06980N95399C14701A24073J09699M6334m0732K2231G3194
$$ 261820 570846 206980 802379 314701 124073 233772 280106 239374 261605 73194
13470D69782j99121k1837H097b3122C64175A66724n6543J48391L15853G3034J87643
$$ 469782 270661 248824 8097 -23122 364175 166724 110181 258572 574425 73034 260677
13459B60677R4831j03513j4621L27457B09416K63408d6203B40757F6544L03567
$$ 260677 355508 251995 237374 564831 209416 472824 -46203 240757 66544 370111
13449C70111l4473p0775R665Q0931m9134b95050E42244R086k35679A33134L05016
$$ 370111 335638 264863 274528 355459 306325 -295050 542244 551330 315651 133134 438150
13438D38150A23397C7218I586R9871K35598f1103A1199f8915C86455A07787K68552
$$ 438150 123397 37218 9586 109457 345055 -61103 11199 -68915 386455 107787 376339
13427C76339P314j2148R3715L2503e0683D55060B14966o2775L3217F5849L5463
$$ 376339 383653 371505 465220 497723 -50683 455060 214966 152191 185408 65849 101312
13416A01312K03528J15669B04288b0760d136B92317a13137E1171K17810O5400
$$ 101312 304840 420509 204288 -20760 -4136 292317 -113137 51171 268981 334381
13406C34381L51013A87183L3645p3073L87712c6085A51231n8880l1922L97309
$$ 334381 685394 187183 220828 147755 535467 -36085 151231 92351 60429 457738
13396D57738A37467R7864o0995J04872I1765l8906J59986k7131C6700K17086k1446
$$ 457738 137467 235331 174336 279208 91765 52859 212845 185714 36700 253786 232340
13385B32340b85B14251P9413p5474n1203K15743J35723k49402O2503A15055h9284
$$ 232340 -285 214251 293664 218190 166987 382730 518453 269051 331554 115055 -89284
13373A24244k1142L63843B24660E0808M04642A77670K05140d1726C49999E5882
$$ 124244 103102 466945 224660 50808 455450 177670 382810 -41726 349999 55882
13362D56449B25399e8304G4171Q4775C908P127K47126q1194J52735H6739L00091
$$ 456449 225399 -58304 74171 158946 3908 11035 258161 176967 329702 86739 386830
13351C86830b4720C74620B2812R6024J15868K16835L1575A45165K11620L0732
$$ 386830 -24720 374620 22812 118836 234704 451539 483114 145165 356785 387517
13341C87517q5397J41817J15568j17150n1974j16623p3756J19833r4146o5288
$$ 387517 302120 443937 559505 442355 390381 273758 200002 319835 225689 160401
13331A60401n0117M20773j75364M755J69538D8554J3445O2635k855J65816l8114
$$ 160401 110284 531057 355693 360448 529986 48554 61999 124634 121779 287595 249481
13320B49481q4659i5165B13466K64574j75784j0712l1119j06606I591Q4861m7012
$$ 249481 164822 -95165 213466 478040 302256 291544 260425 153819 9591 94452 47440
13309D7440J80510b55282F6925d171k2605E22015j44663K5260J6218j73673L2534
$$ 47440 227950 -255282 66925 -4171 -26776 522015 377352 402612 418830 245157 277691
13298B77691Q7725h882D0334L11596l5957a31069B30322l5963L2915J02383A08984
$$ 277691 365416 -8882 40334 351930 315973 -131069 230322 194359 227274 329657 108984
13286B31740J562h2699p2079B79799N8457h6481o3144B11212J47662b54750a6294
$$ 231740 233302 -82699 -154778 279799 338256 -86481 -149625 211212 358874 -254750 -16294
13274G5991K80630d195D6459i6711B15504j7720l578J01864j25378K18343a54117
$$ 75991 356621 -4195 46459 -96711 215504 197784 194206 296070 170692 389035 -154117
13262d7529A08749D2117K95211E353J74421R6888B4558J578a84656H8614J36895
$$ -47529 108749 42117 337328 5353 179774 276662 24558 26136 -184656 88614 225509
13251B25509e4609D83190d3883F4911K3785J59866a0125A48170h8390j93966F1563
$$ 225509 -54609 483190 -43883 64911 88696 248562 -10125 148170 -88390 -282356 61563
13239b554A569K22709J63602A33932K76258b395B6050K18992a48060B82867H1354
$$ -2554 1569 224278 387880 133932 410190 -2395 26050 245042 -148060 282867 81354
13227A70798B4688Q3532A6321K50238A09386R4074J57784b4808D6776O5816a8832
$$ 170798 24688 108220 16321 266559 109386 203460 361244 -24808 46776 112592 -18832
13215G7097K00373C7568J07227k1108D1214a91835D42797B1266O4452O8799m5498
$$ 77097 277470 37568 144795 123687 41214 -191835 442797 21266 85718 154517 109019
13204A09019K05580m9246N00N6446d0219j25522H0801b44208A63361c6255F3374
$$ 109019 314599 265353 265853 322299 -40219 -165741 80801 -244208 163361 -36255 63374
13192A2986P7052N7829a18230C11098A02620K19858A25274k86e5637B23179R4530
$$ 12986 90038 147867 -118230 311098 102620 322478 125274 124988 -55637 223179 317709
13181C17709A03033K9964d4464B41683L5464b1683m6782B78476F9591B337Q2358
$$ 317709 103033 132997 -44464 241683 277147 -21683 -68465 278476 69591 2337 84695
13170H4695K31998p6361A5873K35063o0432q0520J25234J4465d31A89315c7898
$$ 84695 316693 240332 15873 250936 190504 109984 235218 249683 -431 189315 -37898
13158a00648G2239M04913B53J03432b26982A97N60532B56709q9986o0812a21070
$$ -100648 72239 477152 253 103685 -226982 197 560729 256709 166723 105911 -121070
13146h50E3156g0662o4059B41199m3032c1209a3538A15847a15996m2538G9729
$$ -850 53156 -70662 -134721 241199 198167 -31209 -13538 115847 -115996 -158534 79729
13134c6762p0732A64161P6207h4945c0974p742r0946b1474l29198I5232J29749
$$ -36762 -107494 164161 240368 -84945 -30974 -38716 -129662 -21474 -350672 95232 224981
13123B24981a92557l880B52653n5308j9675q1106f2910A2370Q5606q979J6380
$$ 224981 -192557 -196437 252653 197345 177670 96564 -62910 12370 97976 88997 105377
13112A05377K152K0028a91867B71215h6027F9260L33379a06248B63875f5197D7515
$$ 105377 107529 127557 -191867 271215 -86027 69260 402639 -106248 263875 -65197 47515
13100a44179A04752a91688f0124A20823D6390K75434F7704g5366A6217J04130
$$ -144179 104752 -191688 -60124 120823 46390 321824 67704 -75366 16217 120347
13090A20347a22988B21687K26575D4657l988c30481A07891a03622B03127o0660
$$ 120347 -122988 221687 448262 44657 40669 -330481 107891 -103622 203127 142467
13080A42467j8420L6377P0113b18057e5358G5799c9792l0422A8018Q8671j2954
$$ 142467 124047 160424 230537 -218057 -55358 75799 -39792 -70214 18018 106689 93735
13069I3735J54536h9369A96043G2604L6504d9649G4804l3558J74035p6512a49635
$$ 93735 248271 -89369 196043 72604 109108 -49649 74804 41246 215281 138769 -149635
13057E1030A5273K77373b3592r6454C8728J0081J10857f8096f631E12389i9327
$$ 51030 15273 292646 -23592 -120046 38728 48809 159666 -68096 -6631 512389 -99327
13045B06864l8473b15788E5499K60308H634L85985D4447J84177a0297j88060A92852
$$ 206864 168391 -215788 55499 315807 8634 394619 44447 228624 -10297 -198357 192852
13033A11180K07815A8634K67198D0026N20137j95454A67625m1045k3286b89663
$$ 111180 318995 18634 285832 40026 560163 364709 167625 126580 103294 -289663
13022c36061C6068K45717D5992O6772l324J50028j745p4130C7278g9781C07673
$$ -336061 36068 281785 45992 112764 109440 259468 257723 183593 37278 -79781 307673
13010A49835G0634J18763K32189B08764L8574A11254l5267J15507l6840R4170
$$ 149835 70634 189397 421586 208764 247338 111254 75987 191494 154654 248824
13000B48824j04145G1104M716a20982A99914a85458F4139J15731i7424C91031
$$ 248824 144679 71104 75820 -120982 199914 -185458 64139 179870 -97424 391031
12989C79112c0886F043J33023D2329j7735M35359a18877A71701C6782J66205a02079
$$ 379112 -30886 6043 139066 42329 24594 459953 -118877 171701 36782 202987 -102079
12977B05792c27288D98877F5288P7879g2257C30091a27110B18041I9140L90454
$$ 205792 -327288 498877 65288 143167 -72257 330091 -127110 218041 99140 489594
12967D89594b38677D4872n946a59396A55433N8795g0378r6507B00927b42720C22396
$$ 489594 -238677 44872 38926 -159396 155433 214228 -70378 -166885 200927 -242720 322396
12955b25709A21156E0493L09740j10960H142J98395b24102D9893j6449L3739N9116
$$ -225709 121156 50493 360233 249273 8142 206537 -224102 49893 33444 67183 126299
12944A26299d72951b21883B40833A9990K92065D4576O5501n3911d639l50690D64470
$$ 126299 -472951 -221883 240833 19990 312055 44576 110077 56166 -4639 -355329 464470
12932f7380C43887j09552j00431b97681A5415e878j31766F4639P1707A2681P6750
$$ -67380 343887 234335 133904 -297681 15415 -5878 -137644 64639 136346 12681 89431
12921H9431Q0679k8490b43150D4091J44412J46659B9035L10330E5190J64973b979
$$ 89431 170110 141620 -243150 44091 188503 335162 29035 339365 55190 220163 -2979
12909b74758B99981a78454o1290D9418M62620G188L05146A9759b1353p4061A38054
$$ -274758 299981 -178454 -239744 49418 512038 7188 312334 19759 -21353 -95414 138054
12897A31995c7066k02326Q3383C01757C2912K5035N4120K700J7715l4020c1944
$$ 131995 -37066 -239392 -156009 301757 32912 57947 112067 114767 132482 98462 -31944
12885a83843K9536A60037E9395a18017G6930i128F6874f3852b9467B64859a35179
$$ -183843 -154307 160037 59395 -118017 76930 -9128 66874 -63852 -29467 264859 -135179
12873B01856m8533c668B2108M61097e18651I2601a2599F0263J54182a0260A7451
$$ 201856 153323 -3668 22108 483205 -518651 92601 -12599 60263 214445 -10260 17451
12861g2064F9219f1550I8531e1599B54701G8920a06348A17810j0634N4166D8978
$$ -72064 69219 -61550 98531 -51599 254701 78920 -106348 117810 107176 161342 48978
12849c2105E9202K345J01496b70817a0915m0433b697A98428J89144J11557E8432
$$ -32105 59202 61547 163043 -270817 -10915 -51348 -2697 198428 387572 499129 58432
12837c74140C01855p3724h0080b3608m88193d2964k83237f200C76809f8356J2378
$$ -374140 301855 228131 -80080 -23608 -511801 -42964 -326201 -6200 376809 -68356 -55978
12826e5978l3335B59074C7725L56752o4879F3929J79327r3631O6597b83440I792
$$ -55978 -89313 259074 37725 394477 329598 63929 243256 149625 216222 -283440 9792
12814b17300a03198l6268H9873f5935A65805a44610j5927B1050J13846R0622j03368
$$ -217300 -103198 -139466 89873 -65935 165805 -144610 -160537 21050 134896 225518 122150
12803A22150i2534A83430b84271a9125e604k04490A15578J98472a17369j91741
$$ 122150 -92534 183430 -284271 -19125 -5604 -210094 115578 314050 -117369 -309110
12793c09110b7474A80423a04940A580b84909b2423A25969a40657o5792g8801B99510
$$ -309110 -27474 180423 -104940 1580 -284909 -22423 125969 -140657 -206449 -78801 299510
12781B15275D0664b07856O0919j7361e020F5857e05214A14165b56168a00794I7061
$$ 215275 40664 -207856 -146937 -164298 -5020 65857 -505214 114165 -256168 -100794 97061
12769E24097a32787A10008C0717R3054J08724p0821a4454j20570C19127K9593
$$ 524097 -132787 110008 30717 123771 232495 161674 -14454 -135024 319127 348720
12759C48720n8920a12653e467B07017c3892A89836n96a82731D3040a2878A59488
$$ 348720 289800 -112653 -5467 207017 -33892 189836 189240 -182731 43040 -12878 159488
12747B73283a88474A32578K4901O9049C4829b29685d8418k13440B77765A02629
$$ 273283 -188474 132578 157479 226528 34829 -229685 -48418 -261858 277765 102629
12736b0148A54781g1060H1946g3895A19878B0233L01351a84500G7453j9881N2773
$$ -20148 154781 -71060 81946 -73895 119878 20233 321584 -184500 77453 57572 110345
12725A10345N0524b10200j5159e1532A42152b07580j17099a49443B55896a23574
$$ 110345 160869 -210200 -225359 -51532 142152 -207580 -324679 -149443 255896 -123574
12714b81l8977r7707j30025G8346P0037i8078D96869A30866J34033G3726J56932
$$ -281 -39258 -136965 -266990 78346 148383 -98078 496869 130866 264899 73726 230658
12703B30658b25344B06894J94870A76904E2868Q2785a57253G8701j152a50313
$$ 230658 -225344 206894 401764 176904 52868 135653 -157253 78701 77549 -150313
12692B95156F8618L11564b29756A06886N1383a24709A74981Q4651K14192j44728
$$ 295156 68618 380182 -229756 106886 158269 -124709 174981 259632 473824 329096
12682C29096i773B34913J58143O2263B8169K8049I12b99I3898a2063B93246H9435
$$ 329096 -9773 234913 393056 455319 28169 56218 912 -299 93898 -12063 293246 89435
12669e2060C09124g6371A60918b46738A74663K8090c38062i39A41017k999L65633
$$ -52060 309124 -76371 160918 -246738 174663 202753 -338062 -939 141017 138018 503651
12658E03651k38064A16656J05798a2829D27855j82496j6214J29138F1730l0431
$$ 503651 265587 116656 222454 -12829 427855 245359 229145 358283 61730 31299
12648C1299g485E8665J52580N9729n4579c371k21255A72617D4440a05807B13709
$$ 31299 -7485 58665 211245 270974 216395 -3371 -224626 172617 44440 -105807 213709
12636D5591f6243A74866k0809J01339E7678K56684G2200N2144L27735B21091L33971
$$ 45591 -66243 174866 154057 255396 57678 314362 72200 124344 452079 221091 555062
12625E55062B14728J80658k6980M9438j49543r1719J80477H9057M13995a44647
$$ 555062 214728 395386 368406 417844 268301 176582 357059 89057 503052 -144647
12614B92892b63384g4840A33751q886a73664G6761L63404A69202j3338M2806c3687
$$ 292892 -263384 -74840 133751 124865 -173664 76761 440165 169202 155864 198670 -33687
12602i0462A83167n7808h1407j14733H6034l2928K43115A11406K933a53844q159
$$ -90462 183167 125359 -81407 -196140 86034 53106 296221 111406 114339 -153844 -162003
12591a62003A59411R236a35543b4461k9764C33761n9813G0098M11282H7558N7148
$$ -162003 159411 168647 -135543 -24461 -54225 333761 273948 70098 481380 87558 144706
12580A44706a58261E7399N6648a45879A44375m4884a26844B8108J88034a81965
$$ 144706 -158261 57399 114047 -145879 144375 99491 -126844 28108 216142 -181965
12569I3893R7233g3861F0511J08250D8560J8885J9143P9369c8766F6187N8428
$$ 93893 191126 -73861 60511 168761 48560 67445 86588 165957 -38766 66187 124615
12558A24615E789g58A62636b6504r5991C82846f0592G3989g4165r0247A40638
$$ 124615 5789 -758 162636 -26504 -122495 382846 -60592 73989 -74165 -164412 140638
12546h1081k59144A51031K93695A3894a27996j661D52139a20152B73955b73930
$$ -81081 -340225 151031 444726 13894 -127996 -129657 452139 -120152 273955 -273930
12535B33303J35821C8423K23676a37660B23071H0402J10923B917K89046k8797
$$ 233303 369124 38423 262099 -137660 223071 80402 191325 2917 291963 263166
12525B63166A09838m7805j2390L2526a79114C15595A6433J54463c3878A36234
$$ 263166 109838 62033 49643 82169 -179114 315595 16433 170896 -33878 136234
12514A48664a55432B38142a68507A11418J21584q8271m0051B0609K66711a98520
$$ 148664 -155432 238142 -168507 111418 233002 144731 104680 20609 287320 -198520
12503B61582d1736F7543R4158p002a61137F1533R2670i5223L0453H3896a26568
$$ 261582 -41736 67543 161701 154699 -161137 61533 154203 -95223 -64770 83896 -126568
12491d3145G8682A6156b42349J5935L99B0711K77211b19909f4649A62787b55683
$$ -43145 78682 16156 -242349 -226414 -226015 20711 297922 -219909 -64649 162787 -255683
12479A07241I483d67545A49921b84916b0498j19380C2121L5083a7774I8418a5497
$$ 107241 9483 -467545 149921 -284916 -20498 -139878 32121 67204 -17774 98418 -15497
12467h4914A72317h0768k63857c1427j10236D49195A92724J54499b4842A54561
$$ -84914 172317 -80768 -344625 -31427 -141663 449195 192724 347223 -24842 154561
12456d0414j42325Q8131A63505b93632B98591D2096R2P4120b06519g4015l0142
$$ -40414 -182739 -94608 163505 -293632 298591 42096 42188 116308 -206519 -74015 -104157
12445a04157k12261A19669c19699a28508M7002j16548C21239A20411f4461B72429
$$ -104157 -316418 119669 -319699 -128508 -81506 -198054 321239 120411 -64461 272429
12434H6818c56743J07475B09836a05038C44556j11775E0125h7464H5667b34263
$$ 86818 -356743 -249268 209836 -105038 344556 232781 50125 -87464 85667 -234263
12423H3012C8179J01735A446b28382C25354c290j99950j15327A51368N7341D0181
$$ 83012 38179 139914 1446 -228382 325354 -3290 -203240 -318567 151368 208709 40181
12411B834a22757D05676C4203e2189b0839j26784l5573b3917j63521B2356c0333
$$ 2834 -122757 405676 34203 -52189 -20839 -147623 -183196 -23917 -187438 22356 -30333
12399C19353j17550b45022F8806K05995A04520j3884N4421b28697D5271L60276
$$ 319353 201803 -245022 68806 274801 104520 90636 145057 -228697 45271 405547
12389D05547i1132C2079L9091a60921O5024b2987E9855K4538i7430j17000A23026
$$ 405547 -91132 32079 71170 -160921 -95897 -22987 59855 84393 -97430 -214430 123026
12377h3275C4466b34538B07250a1986I238c59742a63076M8893M1246j38249B26402
$$ -83275 34466 -234538 207250 -11986 9238 -359742 -163076 -114183 -72937 -211186 226402
12365b98476a5090j3573G3879L07335f9128I8395d23907A41239a28421b5548n7073
$$ -298476 -15090 -28663 73879 381214 -69128 98395 -423907 141239 -128421 -25548 -82621
12354h2621c6384E17091B41620k2971E505a9545C73520g8020I0925m5156i9863
$$ -82621 -36384 517091 241620 218649 5505 -19545 373520 -78020 90925 45769 -99863
12342B52945E3255L2400e4847a9363j91748O307L0973B28785d6732A31713J20381
$$ 252945 53255 85655 -54847 -19363 -211111 -204804 -173831 228785 -46732 131713 252094
12331B52094A7736K2M58220D9374h6334A1081J64410J04818M0902F9804a69382
$$ 252094 17736 17758 475978 49374 -86334 11081 175491 280309 321211 69804 -169382
12319b82519A23231J27289a0784A16548L07186B01238H0138K14153N1571A29665
$$ -282519 123231 250520 -10784 116548 423734 201238 80138 294291 345862 129665
12308g830A15763i9043A37327a09041q1793A2648f6332B30343d4871m6737A71594
$$ -7830 115763 -99043 137327 -109041 -190834 12648 -66332 230343 -44871 -91608 171594
12296a6784A43316J82583d6568j7030B97146b44036C37286A52552K07369k7572
$$ -16784 143316 325899 -46568 -63598 297146 -244036 337286 152552 359921 332349
12286C32349D5886b8550E3086J53741a11494B09510J48952A29330c8471D20168
$$ 332349 45886 -28550 53086 206827 -111494 209510 358462 129330 -38471 420168
12275B87380L18537k86922q9440J16404A63203a46387C3831J0600b0650b564C28750
$$ 287380 605917 318995 229555 345959 163203 -146387 33831 44431 -20650 -2564 328750
12263g4731J793B94972b07286A03186C4274J66800a1558B01433P7092I0313Q6283
$$ -74731 -72938 294972 -207286 103186 34274 201074 -11558 201433 278525 90313 176596
12252A76596h594l958B42168f8585B30218M0500c58773A77953a26567C08096A3016
$$ 176596 -8594 -12552 242168 -68585 230218 270718 -358773 177953 -126567 308096 13016
12240e2801j32152A69008N9420p0779l8332e2038D86466B33084I0182R4137m6921
$$ -52801 -184953 169008 228428 157649 119317 -52038 486466 233084 90182 184319 137398
12229A37398K3031p6075O8327R1417k1926J1299N2002R5547Q713h8466D03263
$$ 137398 160429 84354 152681 244098 222172 233471 285473 381020 389733 -88466 403263
12217D02471q3517A12119K75523L89755l87379j38422L3105J13846A06791R0707
$$ 402471 318954 112119 387642 777397 390018 251596 284701 398547 106791 197498
12207A97498o6304L21200j39557J17173O713O2275b9816C84233j60160p5111Q4997
$$ 197498 131194 452394 312837 430010 436723 498998 -29816 384233 224073 148962 233959
12196B33959q6758E0354J24314k6673J34960I2972L33444e6357B64381H0631C468
$$ 233959 147201 50354 174668 147995 282955 92972 426416 -56357 264381 80631 3468
12184B03247H8939K88029j77347J61145p8624K2196G7624J96224k9595J21702
$$ 203247 88939 376968 199621 360766 282142 304338 77624 273848 244253 365955
12174C65955A13645N7948L01836k10150J74407o0715c15233R7994E5580M0274
$$ 365955 113645 171593 473429 263279 437686 376971 -315233 -217239 55580 95854
12164I5854L05198j90669a64543D25823C5512K16498j4453i504B0886J94601i8312
$$ 95854 401052 210383 -164543 425823 35512 252010 237557 -9504 20886 215487 -98312
12152A03337K32423G92b26597C60454j00355J37414d641A32703J54616I034a02744
$$ 103337 335760 792 -226597 360454 260099 397513 -4641 132703 287319 9034 -102744
12140d8817d06E0913f2228C49148c1849I0492J2703a22539j62114B5229J00867
$$ -48817 -406 50913 -62228 349148 -31849 90492 103195 -122539 -284653 25229 126096
12129A26096g540B13924d4528A98818E3118K70623A2774M07615p6882F0734L1138
$$ 126096 -7540 213924 -44528 198818 53118 323741 12774 420389 343507 60734 91872
12118I1872d2521m9327o8163a7932l30932J41871B1833J79814j00485J45820b20587
$$ 91872 -42521 -91848 -160011 -17932 -348864 -206993 21833 201647 101162 246982 -220587
12106B38614k1151C5757L93597h9132A04169a46061A41520d164j43255B88454
$$ 238614 217463 35757 429354 -89132 104169 -146061 141520 -4164 -147419 288454
12095H4811J40903o9021B604M4249a16767A71041d5924A1985e02960c1137B23574
$$ 84811 225714 156693 2604 46853 -116767 171041 -45924 11985 -502960 -31137 223574
12083A62447n6011f5204c0267p2919N0473B25573g6673G4514Q3588J97678J234133
$$ 162447 106436 -65204 -30267 -103186 -52713 225573 -76673 74514 158102 355780 1589913
12072A589913J421652j9893H44456D07048A32122k4120J17893a5607D8378a53632
$$ 1589913 3011565 2991672 844456 407048 132122 108002 225895 -15607 48378 -153632
12061F3743a27926A76819g8848B95256I67K6448L72797C5600P7063I78a14310
$$ 63743 -127926 176819 -78848 295256 967 27415 400212 35600 112663 978 -114310
12049A84307B7012R9603b53154k4290J08997m10630G2180f3221B75647A6362d20724
$$ 184307 27012 126615 -253154 -277444 -168447 -579077 72180 -63221 275647 16362 -420724
12037d6175B35278o5081k2072a43155A44495d92836b1667A23206k5163j4418J01814
$$ -46175 235278 170197 148125 -143155 144495 -492836 -21667 123206 98043 83625 185439
12026A85439B1830a5573n8202B05608a13099E37045b19535n5492A17723b2672
$$ 185439 21830 -15573 -73775 205608 -113099 537045 -219535 -275027 117723 -22672
12015A15790a49295C4777P0980E502O8947P7364d516p5266k4908E6236K92385
$$ 115790 -149295 34777 105757 5502 74449 151813 -4516 -79782 -104690 56236 348621
12004C48621G8653a32555B0906i6667p0725d200j38549d1857j9252A90295a49282
$$ 348621 78653 -132555 20906 -96667 -167392 -4200 -142749 -41857 -61109 190295 -149282
11992B5099a8836C7998K6056c16212p8479C35145j03423i0091r330B34382F2209
$$ 25099 -18836 37998 64054 -316212 -394691 335145 231722 -90091 -99421 234382 62209
11980B8862J59280Q6299A06717C3976b25829B14474i9829j28709A53754g6567
$$ 28862 188142 274441 106717 33976 -225829 214474 -99829 -228538 153754 -76567
11969b05303A6168c43006A82148R725p6005a44692O0398D9814b17739D1428i5825
$$ -205303 16168 -343006 182148 191873 115868 -144692 -84294 49814 -217739 41428 -95825
11957g9434j77034J24071A14599Q5773K29264b52629B95141c6031j51371d9430
$$ -79434 -256468 -132397 114599 200372 429636 -252629 295141 -36031 -187402 -49430
11946D21076j74390a00j51716B07386I7456A6916K56044M0922b56187C933M6911
$$ 421076 246686 -100 -151816 207386 97456 16916 272960 313882 -256187 3933 50844
11935E0844b87511a17322o6323b1477m1016A5744a09762A27365L0514n5038C9379
$$ 50844 -287511 -117322 -183645 -21477 -62493 15744 -109762 127365 157879 102841 39379
11923A5687b03483A48358l2094a77556B88328H5310a87490O1645B4504J82705
$$ 15687 -203483 148358 116264 -177556 288328 85310 -187490 -125845 24504 207209
11913B07209l2976a89674A58180p1401c51201C1911K4620j0371g7662F0752J83484
$$ 207209 174233 -189674 158180 86779 -351201 31911 56531 46160 -77662 60752 244236
11902B44236F8937K50988A9760J11177b37934A25202d41217a28029C1920N344
$$ 244236 68937 319925 19760 130937 -237934 125202 -441217 -128029 31920 37264
11892C7264J2625a66964k46456J24505B44089i4731A02103i9084j52403A09899
$$ 37264 49889 -166964 -413420 -288915 244089 -94731 102103 -99084 -251487 109899
11881e8212C0992H618b27650k21069F7576c8069o507j51413N2994B24126b74542
$$ -58212 30992 8618 -227650 -448719 67576 -38069 -44576 -195989 -142995 224126 -274542
11869C39332a83791A35242c25226A06010k8215a6716j71731i2644a7257A3512
$$ 339332 -183791 135242 -325226 106010 77795 -16716 -188447 -92644 -17257 13512
11858h8735R070a1947A5278a38439e5205A45219B5582N05J16567a57548O6807
$$ -88735 -79665 -11947 15278 -138439 -55205 145219 25582 26087 142654 -157548 -90741
11847i0741A83022F0217N3843A8449R7253e6306m45655A97816b23661G3149l1355
$$ -90741 183022 60217 114060 18449 115702 -56306 -501961 197816 -223661 73149 41794
11836D1794b27228H1599n331J1595A5650e1603j25539K6457A08904a58391F1382
$$ 41794 -227228 81599 76268 87863 15650 -51603 -177142 -150685 108904 -158391 61382
11824b81121I6302g8274A73667c0231l1498a0425k2315i102A85073c3379i484
$$ -281121 96302 -78274 173667 -30231 -61729 -10425 -32740 -9102 185073 -33379 -9484
11812b1486N994A9082i4973C3922a65392M2212p7593a1735A37936N9013D1600
$$ -21486 -15492 19082 -94973 33922 -165392 -123180 -200773 -11735 137936 196949 41600
11800b85940P1111M7490e645o5105m73267g0225p6884K4106H5623a88987G8756
$$ -285940 -214829 -167339 -5645 -70750 -544017 -70225 -147109 -123003 85623 -188987 78756
11788B70439G3958J41273l896M4001a03708F3462e702C31310j60740i1282A36140
$$ 270439 73958 215231 211335 255336 -103708 63462 -5702 331310 170570 -91282 136140
11776a89929A7560b14330B87195J17071a62518B05308r497D5861c24857g2584
$$ -189929 17560 -214330 287195 404266 -162518 205308 195811 45861 -324857 -72584
11765C6771j0850d694j03879p476d8995m12565F3979Q0754E4880d1605E0247Q619
$$ 36771 25921 -4694 -108573 -116049 -48995 -461560 63979 144733 54880 -41605 50247 58866
11753E8866i0731l2792e5963F2389J68168A10638a55292B42323b62384A7205c42332
$$ 58866 -90731 -123523 -55963 62389 230557 110638 -155292 242323 -262384 17205 -342332
11741b26964B6318a90203C38309F5634B1219P2908J43226b72802A32962R406E1717
$$ -226964 26318 -190203 338309 65634 21219 94127 237353 -272802 132962 142368 51717
11729b5119a515A86183L51646a7598j62024B07722E876a94085o3491a2747B25028
$$ -25119 -1515 186183 537829 -17598 -179622 207722 5876 -194085 -257576 -12747 225028
11717f3681B98011a21776A2223J81291r2146P655j9434J96708a78629I2852h5250
$$ -63681 298011 -121776 12223 193514 101368 109023 89589 286297 -178629 92852 -85250
11705A80497J32255J0940E5108J84351M9497C0K26149g5085B4161J91667h8166
$$ 180497 312752 323692 55108 239459 288956 30 226179 -75085 24161 215828 -88166
11693C75778j71744d2409A61155a73470A77565J7768H1955m0925P0278a17708
$$ 375778 204034 -42409 161155 -173470 177565 195333 81955 41030 111308 -117708
11682A76316K62807q4673a6907r3890G662L47974J1172a68460A40958h0072j79203
$$ 176316 439123 354450 -16907 -110797 7662 355636 366808 -168460 140958 -80072 -259275
11671b59275B95477e7707l3888A64900E3901N8658b39447B57071p8580b99159
$$ -259275 295477 -57707 -91595 164900 53901 112559 -239447 257071 178491 -299159
11660b23621B09546N2198a75841A47725k6390E6594b9463C52482q7528e7957j15812
$$ -223621 209546 261744 -175841 147725 121335 56594 -29463 352482 264954 -57957 -173769
11649a73769g43A10320L4637L5101h2551c7156B02076j00267J43701d98903E3351
$$ -173769 -743 110320 144957 180058 -82551 -37156 202076 101809 245510 -498903 53351
11637B2402p453h6179D2191a01031D6411D802b17975A0256A91K9367b2265C30564
$$ 22402 14949 -86179 42191 -101031 46411 4802 -217975 10256 191 29558 -22265 330564
11624B96410a03572A80556b35169B51763a04249B39664C3805N0102J72882a66018
$$ 296410 -103572 180556 -235169 251763 -104249 239664 33805 83907 256789 -166018
11613b42002E00797G9520b26361a10864D717M5306P9136k2934l067m0097h5813
$$ -242002 500797 79520 -226361 -110864 4717 50023 129159 106225 103158 63061 -85813
11601a03145B02255n3777G3279c5782j4769b3922B68838j06617a12420G5594L66840
$$ -103145 202255 148478 73279 -35782 -50551 -23922 268838 162221 -112420 75594 442434
11590D42434c9497A14520K4583J86955B4074O1432L8758J24181J70810j80904
$$ 442434 -39497 114520 139103 326058 24074 85506 124264 248445 419255 238351
11580B38351O1102K43600f3299A10060c1839A30422r96O0323O7675e290A01656
$$ 238351 299453 543053 -63299 110060 -31839 130422 129426 189749 257424 -5290 101656
11568A69497D6899K3312K51723h5733B21854I0331B6875K56290e2646J7819A06892
$$ 169497 46899 70211 321934 -85733 221854 90331 26875 283165 -52646 -34827 106892
11556b6990C67589g3181C83684n1413A25812c20266D9526j7278R5610C080J64063
$$ -26990 367589 -73181 383684 332271 125812 -320266 49526 32248 127858 3080 167143
11545A67143a05788B99526r7004P3754a16439B93575r4589q7959P1061L55445
$$ 167143 -105788 299526 202522 276276 -116439 293575 198986 111027 182088 537533
11535E37533B46763q1910a7896D66008B06676B5610J11007J20717J68414j11717
$$ 537533 246763 164853 -17896 466008 206676 25610 136617 257334 425748 314031
11525C14031I076K25389r3804K15022Q6446j66154r7903f7286G1416C0801L4401
$$ 314031 9076 234465 140661 355683 442129 275975 178072 -67286 71416 30801 65202
11514F5202K14760A31429J69846B0697K57967A21545b7414j11413C15367m6340
$$ 65202 279962 131429 301275 20697 278664 121545 -27414 -138827 315367 269027
11504B69027G647K13148J49288E5612K9269e3823D57360k11140d0887C5906i1111
$$ 269027 7647 220795 370083 55612 84881 -53823 457360 246220 -40887 35906 -91111
11492a6833o1149B21964r953Q7237q1381l3716n4761j4771R2462J93443J00932
$$ -16833 -77982 221964 212011 299248 217867 184151 129390 114619 207081 400524 501456
11481E01456q7461J88520B33471o186p8606K43975A32654K65763A40828J33959
$$ 501456 413995 602515 233471 227285 148679 392654 132654 398417 140828 274787
11471B74787F1388K20603a25870A10314L33333j26282B5575L36329O0744J56428
$$ 274787 61388 281991 -125870 110314 443647 317365 25575 361904 422648 579076
11461E79076k70115Q231r2159B1335L74394J80451k79453G1896J7050J90635a07490
$$ 579076 308961 317192 225033 21335 395729 576180 296727 71896 88946 279581 -107490
11449e231k05884N0977A36972c18350B60654a13064B21550e4079A98253N0324
$$ -5231 -211115 -160138 136972 -318350 260654 -113064 221550 -54079 198253 248577
11439B48577C3289a37660E9144L29752j54699f7991A20888J19407E0235K89503
$$ 248577 33289 -137660 59144 388896 234197 -67991 120888 240295 50235 339738
11429C39738j07398B2586f7873C2486J24615F1945Q9225c4761H664a26089B28921
$$ 339738 232340 22586 -67873 32486 157101 61945 151170 -34761 8664 -126089 228921
11417A51167M121b02781j71934G1249E323M0157K4957d1993j7309A51297g9544
$$ 151167 155288 -202781 -374715 71249 5323 45480 70437 -41993 -59302 151297 -79544
11405a3955A97562a529C60904r2768C5042L05950e4667D81477d9293B771K3164
$$ -13955 197562 -1529 360904 268136 35042 340992 -54667 481477 -49293 2771 25935
11394B5935O0257P8015Q2048K3497b028r3258k02636M3206B09745f6965D8362
$$ 25935 86192 164207 246255 269752 -2028 -95286 -297922 -254716 209745 -66965 48362
11382a46301B9920P4349a01148j12785C65661a20513A92780K15060A59603a78547
$$ -146301 29920 104269 -101148 -213933 365661 -120513 192780 407840 159603 -178547
11371A95301a1665E8546M9356C2997l360K81453L7791j18708a75367B42821j08668
$$ 195301 -11665 58546 107902 32997 29637 311090 348881 230173 -175367 242821 134153
11360A34153b12793d7501l1503A02987b2283M741C3974f4795A8094a27436B16603
$$ 134153 -212793 -47501 -79004 102987 -22283 -17542 33974 -64795 18094 -127436 216603
11348h2149r5749j21179a1986l3577J597B39099m3135h660A67144R194K4607o2089
$$ -82149 -177898 -299077 -11986 -45563 -43966 239099 195964 -8660 167144 176338 200945 138856
11336A38856K2692d256G3049b0058m53744a16829A88811H7410a4374A31460a27268
$$ 138856 161548 -4256 73049 -20058 -473802 -116829 188811 87410 -14374 131460 -127268
11324H9824a70393A7461a9455k47437J10655D13126b37232m1062f8438R738C4135
$$ 89824 -170393 17461 -19455 -266892 -156237 413126 -237232 -278294 -68438 -58700 34135
11312I9792h4424B14795l6526F4100J02176e2691B55594a65350j3988Q4215p2519
$$ 99792 -84424 214795 178269 64100 166276 -52691 255594 -165350 -179338 -95123 -167642
11301a67642G657a71554E9662a87688g3460A27132a31430f2835l53720A39435
$$ -167642 7657 -171554 59662 -187688 -73460 127132 -131430 -62835 -416555 139435
11290b68539A84798e5802j61238r5916A77302c40269C50285a63748k211N0661
$$ -268539 184798 -55802 -217040 -312956 177302 -340269 350285 -163748 -165959 -115298
11280a15298D361c0622o4286d2878I2105N7764b86200B4588J63065b68628E5426
$$ -115298 4361 -30622 -94908 -42878 92105 149869 -286200 24588 187653 -268628 55426
11268A50249n1415B9884b217B5c30510B58414k5360b49781A14351g8444r7068
$$ 150249 98834 29884 -2217 25 -330510 258414 233054 -249781 114351 -78444 -175512
11257a75512l0821A37144b47900l1666b8516A62898b4495g806l32702f9621A76276
$$ -175512 -206333 137144 -247900 -279566 -28516 162898 -24495 -7806 -340508 -69621 176276
11245b83093a35432J3445c9523A9169L2759a21582N8339b144B7150K07669n2951
$$ -283093 -135432 -121987 -39523 19169 51928 -121582 -63243 -2144 27150 234819 181868
11234A81868g7295d122A39141E5113a44659B03021c53752b0655I2264L0012J44592
$$ 181868 -77295 -4122 139141 55113 -144659 203021 -353752 -20655 92264 122276 266868
11223B66868c9878j21687K0688f505j37813F9288a89841l3341a1839C9199a47073
$$ 266868 -39878 -161565 -140877 -6505 -144318 69288 -189841 -223182 -11839 39199 -147073
11211a06254R52m5738o5751C6872h564j44944B0231J06573A0054O8691h595o2378
$$ -106254 -105302 -151040 -216791 36872 -8564 -153508 20231 126804 10054 78745 -8595 -70973
11199g0973I5795b31094B12511c46369D09141d4083D30012C3762J35195A0367
$$ -70973 95795 -231094 212511 -346369 409141 -44083 430012 33762 168957 10367
11188C41578E1175R6975N5225p3832g8725A86012f2929J8977F7150B1192a42319
$$ 341578 51175 148150 203375 129543 -78725 186012 -62929 -43952 67150 21192 -142319
11176d0957j86076K5354j03867Q4515O2419C00864j41444f8735B8893a85182B22899
$$ -40957 -227033 -201679 -305546 -221031 -158612 300864 159420 -68735 28893 -185182 222899
11164B36477a32652k15359A71171b57257A50556k0421c4650k80285f9035A46183
$$ 236477 -132652 -348011 171171 -257257 150556 130135 -34650 -314935 -69035 146183
11153g6082m6870A10779P7101H5900O5046D6437J56742a18802N5046D3891i4946
$$ -76082 -122952 110779 187880 85900 150946 46437 203179 -118802 -63756 43891 -94946
11141C2142f300C67064a46854L4014G4749a25056E06601k2742B00273a08693D46708
$$ 32142 -6300 367064 -146854 -112840 74749 -125056 506601 483859 200273 -108693 446708
11129E4895N2732a83871a5850A4775K71817j28694d2388j06462d8785B34990J1708
$$ 54895 107627 -183871 -15850 14775 286592 157898 -42388 -148850 -48785 234990 246698
11118B46698b31293H1270a78675H8038c42569B41293D5227p665K13414o1380C3023
$$ 246698 -231293 81270 -178675 88038 -342569 241293 45227 37562 250976 189596 33023
11106B83415f1812C04013G7204J20893j6396j0926c3870A48659R1244K14391k16697
$$ 283415 -61812 304013 77204 198097 181701 170775 -33870 148659 239903 454294 237597
11095B37597J82551j84420J68443A36882K04391O1751c9188C22689N2565A06590
$$ 237597 420148 235728 404171 136882 341273 403024 -39188 322689 375254 106590
11084A89069N8933K22598j06181p5213j33503J87861g127C69376C9032N18162
$$ 189069 248002 470600 364419 289206 155703 343564 -7127 369376 39032 557194
11074E57194J56809B34881J97257o440j31606K81908Q3921k21200j4774L54262
$$ 557194 714003 234881 432138 425698 294092 576000 659921 438721 423947 778209
11064G78209k8226j49584B94128L0503J88547j00843K60925q3572Q9893J30539
$$ 778209 749983 600399 294128 324631 513178 412335 673260 589688 679581 810120
11054H10120j49906p0714K38060K69957m04817L01828J61637j23925Q3946o6087
$$ 810120 660214 589500 827560 1097517 692700 994528 1156165 1032240 1116186 1050099
11044A050099j71926K01587J15011n19547J35991J87481J45667k04119J23470
$$ 1050099 878173 1079760 1194771 675224 811215 998696 1144363 940244 1063714
11035A063714k6042K11021k41578k98734K60562L24261n71129K40788k57377M05291
$$ 1063714 1037672 1248693 1007115 708381 968943 1293204 722075 962863 705486 1110777
11025A110777l09525J53108k85326L94567j02150K3338J76098n61116K31365J87931
$$ 1110777 801252 954360 669034 1063601 961451 984789 1160887 599771 831136 1019067
11015A019067Q650k82649N04246j59027n05201L01384j15845J80712k02630J46357
$$ 1019067 1027717 745068 1249314 1090287 585086 886470 770625 951337 748707 895064
11005H95064k49673M01768k87744J65106j58647L3047K23646P8458j73869k84947
$$ 895064 645391 1047159 759415 924521 765874 798921 1022567 1101025 927156 642209
10995F42209L90687L58080l90939M584K4988k3070K26232m11525L93568J67252
$$ 642209 1032896 1390976 1000037 1004621 1029609 1006539 1232771 821246 1214814 1382066
10985A382066q8713J38l5619K19599j79952M3612M45840j4677M4029N3866O51514
$$ 1382066 1293353 1293491 1257872 1477471 1297519 1341131 1786971 1772294 1816323 1870189 2521703
10974B521703l8307L49993L27755L08809K48176J70013K50395K16132k15398o89391
$$ 2521703 2483396 2833389 3161144 3469953 3718129 3888142 4138537 4354669 4139271 3449880
10964C449880k90746n0393k29499k08402p2851j39002L52025J85330m32521K74206
$$ 3449880 3159134 3108741 2879242 2670840 2597989 2458987 2811012 2996342 2563821 2838027
10954B838027j46925J79371l32715j54808m62043j77186o7788n82354m1857K05277
$$ 2838027 2691102 2870473 2537758 2382950 1920907 1743721 1675933 1093579 1051722 1256999
10944A256999o22448k54617J16400N3938k65218K36268k14986J29382A20221O01371
$$ 1256999 634551 379934 496334 550272 285054 521322 306336 435718 120221 721592
10934G21592C50674f4545A85364L0451E6058J87092c904A304L45358B5800b1442
$$ 721592 350674 -64545 185364 215815 56058 243150 -3904 1304 346662 25800 -21442
10922C12853G9931a33782I8292k2114J48499q3839D0161a05776B49788K36208
$$ 312853 79931 -133782 98292 76178 224677 140838 40161 -105776 249788 485996
10912D85996k08200A04141Q7221H3091a04798B99048f2109A22368O2568m1261
$$ 485996 277796 104141 191362 83091 -104798 299048 -62109 122368 184936 143675
10902A43675a61829B0527a03803A31870E8617c5529B05138b42147B83931A2160
$$ 143675 -161829 20527 -103803 131870 58617 -35529 205138 -242147 283931 12160
10891D7669d4553j68768H0939J20534E67a59361B61220L7353G2368a2780C71613
$$ 47669 -44553 -213321 80939 201473 567 -159361 261220 298573 72368 -12780 371613
10879a67947L865c0424P731l1957m9055H901L61141A07916N8115h1742A30125
$$ -167947 -164082 -30424 -22693 -54650 -103705 8901 370042 107916 166031 -81742 130125
10867B89527D1916a492A033J3372c5507G4543J56603o8181a70539D2080a4699
$$ 289527 41916 -1492 1033 14405 -35507 74543 231146 162965 -170539 42080 -14699
10855b39071f4211A38244g1774H1006J05566c28439A1828K42999r5846a33485
$$ -239071 -64211 138244 -71774 81006 186572 -328439 11828 254827 158981 -133485
10844g071F2020K32678d54942C7931N9866a24446K3896g169j3832B11597p8669
$$ -7071 62020 294698 -454942 37931 97797 -124446 -100550 -7169 -21001 211597 132928
10833A32928a53853o3146R2074b5797O431j85613C3713J34871J04012c03311a8428
$$ 132928 -153853 -216999 -124925 -25797 -19366 -204979 33713 168584 272596 -303311 -18428
10821D9660b05514h5732p5012C1695a07198k13476C93d32768A3121b9999k26390
$$ 49660 -205514 -85732 -160744 31695 -107198 -320674 393 -432768 13121 -29999 -256389
10810b56389h4893j40196E3686h3952A12667b27703J07299B05329k8152E1892
$$ -256389 -84893 -225089 53686 -83952 112667 -227703 -120404 205329 177177 51892
10799d9653J4568i407j59319D0763O5658a89472G6819a01170A43382b74104I6150
$$ -49653 -35085 -9407 -168726 40763 106421 -189472 76819 -101170 143382 -274104 96150
10787h037D9880c2787j1784j36344A51889a75008B99874j15219a25035k4522A63886
$$ -8037 49880 -32787 -44571 -180915 151889 -175008 299874 184655 -125035 -149557 163886
10775b80191A31609a6646j34117E6642P0041E8422K8540Q871c83376A41153b5463
$$ -280191 131609 -16646 -150763 56642 126683 58422 86962 95833 -383376 141153 -25463
10763a28127L1015P224j06266D4764b83400J38141C8280e5455K4678B12920e7140
$$ -128127 -97112 -89888 -196154 44764 -283400 -145259 38280 -55455 -30777 212920 -57140
10751a3008A27597K4425c50579G5888K32639b41300H5878B1245d4723B18210b40422
$$ -13008 127597 152022 -350579 75888 308527 -241300 85878 21245 -44723 218210 -240422
10739d1993C2826L47515G2816P5201j2354e9194j20680o7262j58207a8565m01156
$$ -41993 32826 380341 72816 148017 135663 -59194 -179874 -247136 -405343 -18565 -419721
10728d19721O0336a05605a3371A05259l0814a73973k88717g0234n9592k6385N3356
$$ -419721 -359385 -105605 -13371 105259 74445 -173973 -462690 -70234 -129826 -156211 -102855
10717a02855A37675J9064b45227j5662r6221A39730o3387b01131j8646I1629J22495
$$ -102855 137675 156739 -245227 -260889 -357110 139730 76343 -201131 -219777 91629 214124
10706B14124a20940H9647b77915E0218d8527E3748M6241k8320a7762j25664c1422
$$ 214124 -120940 89647 -277915 50218 -48527 53748 99989 71669 -17762 -143426 -31422
10694c68760C071b9404G9181B1794L6844d1997b326A12386J17000I4284B73h0663
$$ -368760 3071 -29404 79181 21794 58638 -41997 -2326 112386 229386 94284 273 -80663
10681i4293E4453a39621L7477C63849A76389F5411J03042b23713B9628K79032
$$ -94293 54453 -139621 -102144 363849 176389 65411 168453 -223713 29628 308660
10671C08660b9117B02667b50821d258k00701F3359L8032c01728d0326D4729i98
$$ 308660 -29117 202667 -250821 -4258 -204959 63359 101391 -301728 -40326 44729 -998
10659b89777j1370N8128j7975B0548b2060l65468Q7080C12013a57377f1443j99726
$$ -289777 -301147 -243019 -260994 20548 -22060 -387528 -300448 312013 -157377 -61443 -261169
10648b61169J03596C2456h1641H5959P3600h5412A03468P9746a67670e9549j89563
$$ -261169 -157573 32456 -81641 85959 159559 -85412 103468 183214 -167670 -59549 -249112
10637b49112H3266D0330M6475e4219B33966b46011a17462a9140k22364a1680j05681
$$ -249112 83266 40330 86805 -54219 233966 -246011 -117462 -19140 -241504 -11680 -117361
10626a17361j82132a08657m10012A35863B7782a80862d0865n2014B98612a29122
$$ -117361 -299493 -108657 -518669 135863 27782 -180862 -40865 -92879 298612 -129122
10615i0010k3934D7443f8839A14529A5438b10045B1895c09621A20498D9592p643
$$ -90010 -113944 47443 -68839 114529 15438 -210045 21895 -309621 120498 49592 41949
10604D1949c38861M8813a23410o706I2432a81580o6530e3061l15925A93299b59064
$$ 41949 -338861 -290048 -123410 -130116 92432 -181580 -248110 -53061 -368986 193299 -259064
10592B6323a30773A76544a71771B4684a3238G0128i2288A57788b18746J8112L0613
$$ 26323 -130773 176544 -171771 24684 -13238 70128 -92288 157788 -218746 -200634 -170021
10581a70021K8619D453L31943d9685A95231b98558j33807C7862J00341A3704b21604
$$ -170021 -141402 4453 336396 -49685 195231 -298558 -432365 37862 138203 13704 -221604
10569b02062n4490I8034c8253o8692j64538A54003a64500f8583A31732b30130
$$ -202062 -256552 98034 -38253 -106945 -271483 154003 -164500 -68583 131732 -230130
10558a05371H1323K08804a07437k10335D8463b88145A94350b20037B32956d2235
$$ -105371 81323 290127 -107437 -317772 48463 -288145 194350 -220037 232956 -42235
10547h5604K3452I8124G259J33940K74839a93731A3291Q6585a28568p1195C2729
$$ -85604 -62152 98124 7259 141199 416038 -193731 13291 99876 -128568 -199763 32729
10535A4801c00704J16763A22785d7374E6922M4381m5993b56841B1592K69481j08565
$$ 14801 -300704 -183941 122785 -47374 56922 101303 55310 -256841 21592 291073 182508
10524A82508C0740K04957D2558c10706A75709l6757f1854j45274h2476n0853a3363
$$ 182508 30740 235697 42558 -310706 175709 138952 -61854 -207128 -82476 -133329 -13363
10512a78240j82646J40812e9305J3849A90922P1131J22699a60096J9760r0079
$$ -178240 -360886 -220074 -59305 -45456 190922 262053 384752 -160096 -140336 -230415
10502b30415B14757o1904E1140L02524f1807D81315A69671F7434a99507a685k9785
$$ -230415 214757 152853 51140 353664 -61807 481315 169671 67434 -199507 -1685 -31470
10491c1470I7552D3715Q8989f091j09371d7292J6132E95662A87098P1089A02406
$$ -31470 97552 43715 132704 -6091 -115462 -47292 -31160 595662 187098 258187 102406
10479h4993B93844j2861M5003L57608K58855J34008C20682j44600K56900F5119
$$ -84993 293844 280983 325986 683594 942449 1076457 320682 176082 432982 65119
10468a7907E9652J58054M6916m7175E8321g28A47547a25013C1926Q3645a34282
$$ -17907 59652 217706 264622 217447 58321 -728 147547 -125013 31926 115571 -134282
10456a84279j9703G6432K22317a15391A27500B9686a37902c6212E3259g9095j05559
$$ -184279 -203982 76432 298749 -115391 127500 29686 -137902 -36212 53259 -79095 -184654
10445a84654A3167d2055G9622i0150J6806b523l2523j45860A88177a22428f0682
$$ -184654 13167 -42055 79622 -90150 -73344 -2523 -35046 -180906 188177 -122428 -60682
10433b23327O9830B76744h2414d249q2648j51863j70482j25896B81779c9747j30772
$$ -223327 -153497 276744 -82414 -4249 -86897 -238760 -409242 -535138 281779 -39747 -170519
10422a70519O3662L5370K8961A72685a26953B06512m4386h4556l9944C51707c60134
$$ -170519 -106857 -71487 -42526 172685 -126953 206512 162126 -84556 -124500 351707 -360134
10410A33784D7538J51511f3923H0978Q0051f2175A22098k27Q5736c9182j18296
$$ 133784 47538 199049 -63923 80978 161029 -62175 122098 121871 207607 -39182 -157478
10399a57478A21177m6777a08783k774A31312A2121J04272M99094A32889N6409
$$ -157478 121177 74400 -108783 -111557 131312 12121 116393 615487 132889 189298
10389A89298J35674A26442K9141j811j9128C8970M8962i6469L4193A18394L8633
$$ 189298 324972 126442 155583 153772 134644 38970 87932 -96469 -62276 118394 157027
10378A57027A095L63790L9606J6772I4897K79615J09073k7924j28915j13471J55456
$$ 157027 1095 364885 404491 421263 94897 374512 483585 455661 326746 213275 368731
10367C68731R0117M3765J17578J36735j14935k01784J2568B01234J09928F5084
$$ 368731 458848 502613 620191 756926 641991 440207 452775 201234 311162 65084
10356E14202k23650B1860M22578J953K96725B17876L09370L99100k10611j10676
$$ 514202 290552 21860 444438 446391 743116 217876 527246 926346 715735 605059
10346F05059B73530K96645j54031K06133j28757M2212j02634J29165k66646C3143
$$ 605059 273530 570175 416144 622277 493520 535732 433098 562263 295617 33143
10335G8046J31312J10990A55670J84296r747A38161J843a30837C5297N4890L2801
$$ 78046 209358 320348 155670 339966 330219 138161 140004 -130837 35297 90187 122988
10324A22988K55346L7061P5181B23004q5211P326D7700D61L22679H8604J16122
$$ 122988 378334 415395 490576 223004 137793 145119 47700 461 323140 88604 204726
10313B04726J11824J77755I0113P7525D4956R4999c51859A24344h058j77499p7580
$$ 204726 316550 494305 90113 167638 44956 139955 -351859 124344 -8058 -185557 -263137
10302b63137A14166m6099J37192C7315L31785J18186A27988D3973d9324A50269
$$ -263137 114166 68067 205259 37315 369100 487286 127988 43973 -49324 150269
10291B91290N9159b47743A03600a51582F2418L6130i8553j52725e3416j64264
$$ 291290 350449 -247743 103600 -151582 62418 98548 -98553 -251278 -53416 -217680
10281b17680D6620L9021P4481a36432A26331C9086i2918j74386O9197P7161G263
$$ -217680 46620 85641 160122 -136432 126331 39086 -92918 -267304 -198107 -120946 7263
10269g5912B18803K454a08758C6377l410O4502a88335Q8001B49235a68464P8771
$$ -75912 218803 221257 -108758 36377 32967 97469 -188335 -100334 249235 -168464 -89693
10258h9693C31427A39573K25628P4042J0361L40517k6743l64042A63069J80539
$$ -89693 331427 139573 365201 439243 449604 790121 763378 399336 163069 343608
10248C43608a09416k09057F2009P5417l0830K3532Q900b32221j54437h1351b2799
$$ 343608 -109416 -318473 62009 137426 106596 130128 139028 -232221 -386658 -81351 -22799
10236C83181k6997c36406J1284R4688A9192a39300F6215a04215j53688k19634
$$ 383181 356184 -336406 -325122 -230434 19192 -139300 66215 -104215 -257903 -477537
10226d77537A86349c70057J80411n9855E4410f4055D6283i7873k17584i3662j1758
$$ -477537 186349 -370057 -189646 -249501 54410 -64055 46283 -97873 -315457 -93662 -105420
10215a05420L8792k6056J184k57165a59803M3391B38513A18009k5847A0362J66861
$$ -105420 -66628 -92684 -91500 -348665 -159803 -116412 238513 118009 92162 10362 177223
10204A77223D026c51715a74418D07399b33520j15059J14387B05384c22000D4618
$$ 177223 4026 -351715 -174418 407399 -233520 -348579 -234192 205384 -322000 44618
10193A29720Q6674c0982A77082G2732i6735o7390A06003f9560B19761J2155a85035
$$ 129720 216394 -30982 177082 72732 -96735 -164125 106003 -69560 219761 231916 -185035
10181e16948A6462a19763A94558b02568c1191j94733k01309C1843c33479a66340
$$ -516948 16462 -119763 194558 -202568 -31191 -225924 -427233 31843 -333479 -166340
10170h2170l72616a21889N1861D2523b31680h4606D4358O7787b1162E2887M267
$$ -82170 -454786 -121889 -70028 42523 -231680 -84606 44358 112145 -21162 52887 57154
10159E7154c92597a47976J6295m800h584k24467i6833N098C6624K252a10290B54005
$$ 57154 -392597 -147976 -131681 -136481 -8584 -233051 -96833 -91735 36624 38876 -110290 254005
10146c88973a94260B01635a17227r9527R1078L3804D9562b20732e800F8737e1728
$$ -388973 -194260 201635 -117227 -216754 -125676 -91872 49562 -220732 -5800 68737 -51728
10134c04523O7317n6654i1328o6466M1966K9738j41446A08891a6452m8085a7312
$$ -304523 -237206 -293860 -91328 -157794 -115828 -86090 -227536 108891 -16452 -64537 -17312
10122F6678a33971j83758K7524A15209O0062K586b58446N9305C26549b47008E9879
$$ 66678 -133971 -317729 -290205 115209 175271 177857 -258446 -199141 326549 -247008 59879
10110B62058A5990e4799c87n7902A76138c87383A0885d11888J74115C043J18936
$$ 262058 15990 -54799 -387 -58289 176138 -387383 10885 -411888 -237773 3043 121979
10099A21979b63297i2940A06590a81249A23600a32898A73786b72011J23371C8747
$$ 121979 -263297 -92940 106590 -181249 123600 -132898 173786 -272011 -148640 38747
10088d01662L770J34716B06497b14733H5437a46477B30863a60572M3912K1089
$$ -401662 -397892 -263176 206497 -214733 85437 -146477 230863 -160572 -116660 -95571
10078i5571k01638a22947l8989g2189A03360d4916l2406C32030B8049b01770c5352
$$ -95571 -297209 -122947 -161936 -72189 103360 -44916 -77322 332030 28049 -201770 -35352
10066F5443J3524b02522A68280G0906d0488F1146f1434J2802j35575D1636L2738
$$ 65443 78967 -202522 168280 70906 -40488 61146 -61434 -48632 -184207 41636 74374
10055G4374d12153f0863o5522j3167f455D63130k29639d32529a30387q0254b9495
$$ 74374 -412153 -60863 -126385 -139552 -6455 463130 233491 -432529 -130387 -210641 -29495
10043c82193N4900a49683A56002l7842a74380f8428j31993A7559R7267B2283J44062
$$ -382193 -327293 -149683 156002 118160 -174380 -68428 -200421 17559 114826 22283 166345
10032A66345a95894l294B36947b8348B19636a98782C40914f4454k1400J0528A23249
$$ 166345 -195894 -199188 236947 -28348 219636 -198782 340914 -64454 -85854 -75326 123249
10020H8792c49259h7313G5502b90532J19014l601C90705A53709b02134n4760h3158
$$ 88792 -349259 -87313 75502 -290532 -171518 -175119 390705 153709 -202134 -256894 -83158
10008a22403I9067c09447J09469K0220D18769A67832c34679f8868c0265l78611
$$ -122403 99067 -309447 -199978 -179758 418769 167832 -334679 -68868 -30265 -408876
9998d08876a03650j17529b7614A03942a54323j80877h5935k6160A7888e17350
$$ -408876 -103650 -221179 -27614 103942 -154323 -335200 -85935 -112095 17888 -517350
9987a91549G9086c0935q1285m4269D6062a81947A73093a9464F7173H54J73765
$$ -191549 79086 -30935 -112220 -156489 46062 -181947 173093 -19464 67173 854 174619
9976A74619G8405a7124r2606k743M7130F5577A6772a02770A57520a08123F08226
$$ 174619 78405 -17124 -109730 -112473 -65343 65577 16772 -102770 157520 -108123 608226
9964b4191l7833q2408q0899J5501O9406j29523j07475a21805p4999h4743G8148
$$ -24191 -62024 -144432 -225331 -209830 -140424 -269947 -377422 -121805 -196804 -84743 78148
9952a77376j63556J22228A9135J65278a3860m3934j55909K1271N1061a6553k44270
$$ -177376 -340932 -218704 19135 184413 -13860 -57794 -213703 -192432 -141371 -16553 -260823
9941b60823A01196b56447P718C05709a13152j95383A21778i1314a9776j29362
$$ -260823 101196 -256447 -248729 305709 -113152 -308535 121778 -91314 -19776 -149138
9931a49138k9772C5148A0433L62553a86081I7181c58703b1023k74870e6683j04139
$$ -149138 -178910 35148 10433 372986 -186081 97181 -358703 -21023 -295893 -56683 -160822
9920a60822d0319n0364R352B96598f5367j53035r9714J10810Q9006r9389L4174
$$ -160822 -40319 -90683 -81331 296598 -65367 -218402 -318116 -207306 -118300 -217689 -183515
9909a83515b3137m1738j81932O7570q5252J7457c3182j19987I0402c56816A4466
$$ -183515 -23137 -64875 -246807 -179237 -264489 -247032 -33182 -153169 90402 -356816 14466
9897I4832d05354a4142A44521d2650j19122l9681m2823R9212K6082B53629R2141
$$ 94832 -405354 -14142 144521 -42650 -161772 -201453 -244276 -145064 -118982 253629 345770
9886C45770b08590O5795K151k1471F2714b01996A44282r335e36092J27030M4235
$$ 345770 -208590 -142795 -140644 -162115 62714 -201996 144282 134947 -536092 -409062 -364827
9875c64827A08849b59811A87366H8693b71707d165A39033a07025b4343j26753
$$ -364827 108849 -259811 187366 88693 -271707 -4165 139033 -107025 -24343 -151096
9865a51096A0569J68507b32418C64444j10613a63041c7972j23527A5409d13607
$$ -151096 10569 179076 -232418 364444 253831 -163041 -37972 -161499 15409 -413607
9854b49769K160c0165j18430C6543N5002d8310k84308a34628O5321j57403H2717
$$ -249769 -247609 -30165 -148595 36543 91545 -48310 -332618 -134628 -69307 -226710 82717
9842b03539l3588A10445A3269a90192k7595B4629L6136d4256H9047J36566a50648
$$ -203539 -237127 110445 13269 -190192 -217787 24629 60765 -44256 89047 225613 -150648
9830a47645p4415f6161q8428B17968B288g8175n383j27769o5807P6727E5376J45989
$$ -147645 -222060 -66161 -154589 217968 2288 -78175 -83558 -211327 -277134 -200407 55376 201365
9818B01365g3691k22370J12773O1067a4080C9769J64752D2188q019L9067c22875
$$ 201365 -73691 -296061 -183288 -122221 -14080 39769 204521 42188 34169 73236 -322875
9806h7329c9069j47740k27756a17991A40712d36180G012J31982L4106b66465I1427
$$ -87329 -39069 -186809 -414565 -117991 140712 -436180 7012 138994 173100 -266465 91427
9794A69451p2214b21117J1445P5645A43772c41699B7214b59549i9835q3443A94366
$$ 169451 97237 -221117 -209672 -134027 143772 -341699 27214 -259549 -99835 -183278 194366
9782c8332j43521A25153b48293c8686r2684J572j78575A79603a79820l30091H7571
$$ -38332 -181853 125153 -248293 -38686 -131370 -129798 -308373 179603 -179820 -509911 87571
9770e8913k77198g244k18507h0967n2141L6663l75448a59185k839j91592a52172
$$ -58913 -336111 -7244 -225751 -80967 -133108 -96445 -471893 -159185 -162024 -353616 -152172
9758a53351G171O3144c42348J31597H3070a72265j8150D4273J16419A6748h0036
$$ -153351 7171 70315 -342348 -210751 83070 -172265 -190415 44273 160692 16748 -80036
9746a7226j08317p0124I9798a37503e9893B69606c33827C83327q9633c03936a32544
$$ -17226 -125543 -195667 99798 -137503 -59893 269606 -333827 383327 293694 -303936 -132544
9734b21578q0935B6698b6019A6432i6322j89556B74446F9020L5820c18676J04694
$$ -221578 -302513 26698 -26019 16432 -96322 -285878 274446 69020 104840 -318676 -213982
9723b13982b9867l01880J13987A89502J3793H0378A9285L16b21684J08432k04717
$$ -213982 -29867 -331747 -217760 189502 203295 80378 19285 19601 -221684 -113252 -317969
9712c17969B63503I635b55225F8884a37427j58415J3225M2128e6778j25975k9181
$$ -317969 263503 9635 -255225 68884 -137427 -295842 -282617 -240489 -56778 -182753 -211934
9701b11934b7593j34884B49987D973b4536A54275i9594j18357N1074I12a20603
$$ -211934 -27593 -162477 249987 4973 -24536 154275 -99594 -217951 -166877 912 -120603
9689b10887A4638M20851B1331J37293b03447j1205i8453A17228J37206A07126
$$ -210887 14638 435489 21331 158624 -203447 -214652 -98453 117228 254434 107126
9678A60645F6267d5399A19171A2762d53968Q0630A16364h7435D7979K10422D2045
$$ 160645 66267 -45399 119171 12762 -453968 -373338 116364 -87435 47979 258401 42045
9666B7161h72k55664J18052k28272D4101K32025A01979A9022N0383f7179j75168
$$ 27161 -872 -256536 -138484 -366756 44101 276126 101979 19022 69405 -67179 -242347
9655b42347D836c01373H0909j6690a58822J2089A056d01031B0141a6874j88664
$$ -242347 4836 -301373 80909 64219 -158822 -146733 1056 -401031 20141 -16874 -205538
9644b05538K0700D201a42663G330i1578C2901j5930J2750L56613A77433c94751
$$ -205538 -184838 4201 -142663 7330 -91578 32901 16971 29721 386334 177433 -394751
9632D65522H6958J47580a41787m6330e8269K7218A04926b48646P6893j85005K6532
$$ 465522 86958 234538 -141787 -188117 -58269 -31051 104926 -248646 -171753 -356758 -330226
9621c30226b3172B204J71775b5673B34707h6819k08657J37767m9585C9501a58549
$$ -330226 -23172 2204 173979 -25673 234707 -86819 -295476 -157709 -207294 39501 -158549
9609C1923d0874l54894a87201J846H2342d55519a5192H2087k7941a65141n956
$$ 31923 -40874 -395768 -187201 -185355 82342 -455519 -15192 82087 54146 -165141 -171097
9598a71097E0363h3186p5452k153f5673D1701J3394N219a74056L4424A23487g371
$$ -171097 50363 -83186 -158638 -160791 -65673 41701 55095 60314 -174056 -139632 123487 -7371
9585b52334i5304F2491a27226H4921a349j07750k49808J62189r1829a5999k1755
$$ -252334 -95304 62491 -127226 84921 -1349 -109099 -358907 -196718 -288547 -15999 -37754
9574c7754j8705K1974k45447N0556M3848f4970I377c30161P4337J24775j35162
$$ -37754 -56459 -34485 -279932 -229376 -185528 -64970 9377 -330161 -255824 -131049 -266211
9563b66211h9149H4934b18739D9605j5850b55874c2908j12406B7250G749c22743
$$ -266211 -89149 84934 -218739 49605 33755 -255874 -32908 -145314 27250 7749 -322743
9551e26786A32930c18826J58089j89933d8345B03177a18467p4941C2595c35215
$$ -526786 132930 -318826 -160737 -350670 -48345 203177 -118467 -193408 32595 -335215
9540A5661c84784E0377a4555E0076P0383b09720d8104a9975k73809Q5793f8878
$$ 15661 -384784 50377 -14555 50076 120459 -209720 -48104 -19975 -293784 -207991 -68878
9528F6308c30116a17018D6090b0197k9411b844j98280f9963m90768K29258J58759
$$ 66308 -330116 -117018 46090 -20197 -49608 -2844 -201124 -69963 -560731 -331473 -172714
9517a72714b2112m84793a06839I6825i0488C7529b49162h7479G9327P4603b085
$$ -172714 -22112 -506905 -106839 96825 -90488 37529 -249162 -87479 79327 153930 -2085
9505D5643f7523B77237G6749d74962A96113a45668j59648a22502c3011B91093
$$ 45643 -67523 277237 76749 -474962 196113 -145668 -305316 -122502 -33011 291093
9494B6818a03777A09205B0751L8112a3969j59314g4367l21117h0570j3559C61849
$$ 26818 -103777 109205 20751 58863 -13969 -173283 -74367 -395484 -80570 -94129 361849
9482G637a85643a6762j21014A22670f4176A1630J16435a98512c9786E3466b31774
$$ 7637 -185643 -16762 -137776 122670 -64176 11630 128065 -198512 -39786 53466 -231774
9470A23360a6848C6794j1519g9731j15701g3599j2468j27815B28667c20852A0046
$$ 123360 -16848 36794 25275 -79731 -195432 -73599 -86067 -213882 228667 -320852 10046
9458c12958J16171a571j08201c904B07937a92442f349E0905L0990c51316a38685
$$ -312958 -196787 -1571 -109772 -3904 207937 -192442 -6349 50905 81895 -351316 -138685
9446a33687A79543a30932K7983A58792b77094q9094a53584C39305a16580B27769
$$ -133687 179543 -130932 -102949 158792 -277094 -366188 -153584 339305 -116580 227769
9435H9078B0807O1674C2252b48727a09858F7948i1444G3222b78746D86272D3296
$$ 89078 20807 82481 32252 -248727 -109858 67948 -91444 73222 -278746 486272 43296
9423C9576h7190R873A32993F6462a1753j59943M3076k79275M4771C4372J50938
$$ 39576 -87190 -77317 132993 66462 -11753 -171696 -128620 -407895 -363124 34372 185310
9412A85310L22623d6404j7318r154A94659d50113P887K1997a82492O3168j73363
$$ 185310 507933 -46404 -63722 -72876 194659 -450113 -442226 -420229 -182492 -119324 -292687
9401b92687H2319a59831l04086K8109b5593A60637a07688E8653a09283G1086a45223
$$ -292687 82319 -159831 -463917 -435808 -25593 160637 -107688 58653 -109283 71086 -145223
9389h1971D8564J85941h0528E876d667E0441J31460a02672k08468J49228A6368
$$ -81971 48564 234505 -80528 5876 -4667 50441 181901 -102672 -311140 -161912 16368
9377h6013j91480g650A65719a79935l40152a964k87397g3624B16311N5906D7170
$$ -86013 -277493 -7650 165719 -179935 -520087 -1964 -289361 -73624 216311 272217 47170
9365a36723c2276A98247b4683A29472d2272j13118j1002A51909b6508j05936e2553
$$ -136723 -32276 198247 -24683 129472 -42272 -155390 -166392 151909 -26508 -132444 -52553
9353g3990A62063d1325J4690l22j34529C1402d03821K9166J21626P2428A88004
$$ -73990 162063 -41325 -26635 -26957 -161486 31402 -403821 -374655 -253029 -180601 188004
9341A35981a43764a7986j59671P8742j820H2544Q2567a89905A00338b40258e152
$$ 135981 -143764 -17986 -177657 -98915 -100735 82544 165111 -189905 100338 -240258 -5152
9329G8134a79575B35713a04665n5019A46245n8615c9129k20381J5012A00595a65888
$$ 78134 -179575 235713 -104665 -159684 146245 87630 -39129 -259510 -244498 100595 -165888
9317i5141A82746p4331l8471B5434J20798a92854I0256b00275A31994a40564A18889
$$ -95141 182746 108415 69944 25434 146232 -192854 90256 -200275 131994 -140564 118889
9305e6641B87301c62004a09347c8384k88628H3316C719J88861j4186a10429k5044
$$ -56641 287301 -362004 -109347 -38384 -327012 83316 3719 192580 178394 -110429 -135473
9294a35473A97788a5685l0795j24022H1298J0459a29952A37211a93767A72110
$$ -135473 197788 -15685 -46480 -170502 81298 91757 -129952 137211 -193767 172110
9283c21333j388a57789N0042L4849j23269k50958i4240b5030r1491B9534a23992
$$ -321333 -322721 -157789 -107747 -72898 -196167 -447125 -94240 -25030 -116521 29534 -123992
9271F5002b08205Q6181c3858k47137b3472l9456A5131c68932J51379m2039I5694
$$ 65002 -208205 -122024 -33858 -280995 -23472 -62928 15131 -368932 -217553 -259592 95694
9259b2713B70759a02691l30052J17953a09309k67693B7337a23285E1a28186q0189
$$ -22713 270759 -102691 -432743 -314790 -109309 -377002 27337 -123285 51 -128186 -208375
9248b08375O518C02818b41674Q9561n1178k32545f6275G9835a72471M0996G1519
$$ -208375 -201857 302818 -241674 -152113 -203291 -435836 -66275 79835 -172471 -131475 71519
9236a02907d7037p950n6134a8627A9958J15090J49337c42823N9791b816k83986
$$ -102907 -47037 -54987 -111121 -18627 19958 135048 284385 -342823 -283032 -2816 -286802
9225b86802j6525C1251j4571g5560p5038g1282p829F7917c51781f9165C70186
$$ -286802 -303327 31251 16680 -75560 -150598 -71282 -79111 67917 -351781 -69165 370186
9213A71821b8726r1324m0425a639I0414a77126f9459a7427m54493D1697M3400
$$ 171821 -28726 -120050 -160475 -1639 90414 -177126 -69459 -17427 -471920 41697 85097
9202H5097a51620A56652c10075b640F9883i5734A8928a50929A28831c2424R253
$$ 85097 -151620 156652 -310075 -2640 69883 -95734 18928 -150929 128831 -32424 -23171
9191b3171p3869a5026C8885f2923A12882g6975k13649L1509G7785M6389C3434
$$ -23171 -97040 -15026 38885 -62923 112882 -76975 -290624 -259115 77785 124174 33434
9179b49939A67924d8796A7031a99978j150b1181A29688a63416j344e1679h931
$$ -249939 167924 -48796 17031 -199978 -201128 -21181 129688 -163416 -164760 -51679 -8931
9167a94373j03351J40567k9612J4875B83079a84855h8955A28235K45102I6649
$$ -194373 -297724 -157157 -186769 -171894 283079 -184855 -88955 128235 373337 96649
9156a3525j1209j96189R9736p9681A38749d1203d34n5557m6302H5528h3342j47220
$$ -13525 -24734 -220923 -121187 -200868 138749 -41203 -434 -55991 -102293 85528 -83342 -230562
9144b30562Q235H0664a86250c7163j332m6431m1757A04558l427a11172B95758
$$ -230562 -222327 80664 -186250 -37163 -38495 -84926 -126683 104558 101131 -111172 295758
9132F6263J51686c93504i9501k86818B9157J0017i1662E796h0779E2700b15891
$$ 66263 217949 -393504 -99501 -386319 29157 39174 -91662 5796 -80779 52700 -215891
9120A30482O6892b15338A05802j3284k5666a61220j08750M4895j97777g0028k4532
$$ 130482 197374 -215338 105802 92518 66852 -161220 -269970 -225075 -422852 -70028 -94560
9109i4560p5051A96278d83856a90275p6473O1809g4790l3920j03347h2469B0378
$$ -94560 -169611 196278 -483856 -190275 -266748 -204939 -74790 -108710 -212057 -82469 20378
9097c89168J12814B47593D8945J6086J12441a86972l002N5807K3946b1134B5934
$$ -389168 -276354 247593 48945 65031 177472 -186972 -189974 -134167 -110221 -21134 25934
9085b45724G9393a6013o5351K3360G6119a97968J5536A35190e17321A95734a75636
$$ -245724 79393 -16013 -81364 -58004 76119 -197968 -182432 135190 -517321 195734 -175636
9073i6140p2400P4542j2821D10710e9116j89567A0924K88853b88306d0152n3296
$$ -96140 -168540 -93998 -106819 410710 -59116 -248683 10924 299777 -288306 -40152 -93448
9062i3448R467o2795j04410n2633c855j00398A07054c29714c8659D8947c5395
$$ -93448 -83981 -146776 -251186 -303819 -3855 -104253 107054 -329714 -38659 48947 -35395
9050i6239j8667c1388B64432A00524c05942e3051C09636h0k80809J8706i3705
$$ -96239 -114906 -31388 264432 100524 -305942 -53051 309636 -80 -280889 -262183 -93705
9038c7554j08549e1011H8474b7635B7650E846L4338a9384l3612j9466e215l05558
$$ -37554 -146103 -51011 88474 -27635 27650 5846 40184 -19384 -52996 -72462 -5215 -310773
9026c10773j03018J40694k5759O1678l849N0317l9301r8143A45431a77170L4464
$$ -310773 -413791 -273097 -298856 -237178 -241027 -190710 -230011 -328154 145431 -177170 -142706
9015a42706B56671P7014b36256C28203a87045j17110A84859J0367c4534r5649
$$ -142706 256671 333685 -236256 328203 -187045 -304155 184859 195226 -34534 -130183
9005a30183e6985C3754c32635a02571L3600E9257a63976A75900a87744C25114
$$ -130183 -56985 33754 -332635 -102571 -68971 59257 -163976 175900 -187744 325114
8994b0134q9136k3126k5511B01830E0212a32709c5355j26610l05742b2977m808
$$ -20134 -109270 -132396 -157907 201830 50212 -132709 -35355 -161965 -467707 -22977 -27785
8983b7785p0337j50469J04550m7261B26134Q3459b50232r2396A19569a65718A17975
$$ -27785 -98122 -248591 -144041 -191302 226134 309593 -250232 -342628 119569 -165718 117975
8971c87436l5199J66958E5740i3103M4286A91896c7433C44017A04041a26287p9830
$$ -387436 -422635 -255677 55740 -93103 -48817 191896 -37433 344017 104041 -126287 -206117
8960b06117p0665n4605E826d3611A34207a0828D0133K533c2068q0148A72247a37857
$$ -206117 -276782 -331387 5826 -43611 134207 -10828 40133 42666 -32068 -112216 172247 -137857
8947A41729a7485j93040K6585g6934p1786B6143a81576g253B89998I5539A8456
$$ 141729 -17485 -210525 -183940 -76934 -148720 26143 -181576 -7253 289998 95539 18456
8935B16768b34977f2113I5694k0132d6027A68359b75241B91340J66647f0930B85893
$$ 216768 -234977 -62113 95694 75562 -46027 168359 -275241 291340 457987 -60930 285893
8923E19236Q21815J990455P884283k739896B423015E26837A33606J75723e890
$$ 519236 1341051 3331506 11215789 8475893 2423015 526837 133606 309329 -5890
8913c5530A41545o6735j4126j5482e8848H0017J57828a78532k0494R5775E4039
$$ -35530 141545 74810 60684 45202 -58848 80017 237845 -178532 -199026 -103251 54039
8901A970J83608J32150d00146a21376j38241j95235I8149N5774a6501F0780J6030
$$ 1970 185578 317728 -400146 -121376 -259617 -454852 98149 153923 -16501 60780 76810
8890G6810d86410E9740J11521a08431B6978a42122J7794C78833A31327P2304C4845
$$ 76810 -486410 59740 171261 -108431 26978 -142122 -124328 378833 131327 203631 34845
8878C30334d4731J4296r8033B03471b61300M0544a06349q2582O3455j10834a7544
$$ 330334 -44731 -30435 -128468 203471 -261300 -220756 -106349 -188931 -125476 -236310 -17544
$$ [...]
##END NTUPLES=NMR SPECTRUM
##END=
