
##TITLE=AC1233_PERAH12114_6519287_kQ2xMY586G
##JCAMPDX= 6.0         $$ Bruker NMR JCAMP-DX V2.0
##DATA TYPE= NMR SPECTRUM
##DATA CLASS= NTUPLES
##ORIGIN= BRUKER
##OWNER= Administrator
$$ 1.72 TOPSPIN		Version 2.1
$$ 2012-07-13 17:04:29.906 -0500  Administrator@TOPSPIN
$$ Compression mode = diff/dup
##.OBSERVE FREQUENCY= 400.02188249412
##.OBSERVE NUCLEUS= ^1H
##.ACQUISITION MODE= SIMULTANEOUS (DQD)
##.ACQUISITION SCHEME= undefined
##.AVERAGES= 64
##.DIGITISER RES= 22
##SPECTROMETER/DATA SYSTEM= spect
##.PULSE SEQUENCE= noesygpps1d.comp
##.SOLVENT NAME= COFFEE_meoh
##.SHIFT REFERENCE= INTERNAL, COFFEE_meoh, 1, 14.96143
##AUDIT TRAIL= $$ (NUMBER, WHEN, WHO, WHERE, PROCESS, VERSION, WHAT)
$$ ##TITLE= Audit trail, TOPSPIN		Version 2.1
$$ ##JCAMPDX= 5.01
$$ ##ORIGIN= Bruker BioSpin GmbH
$$ ##OWNER= Administrator
$$ $$ C:\Bruker\TOPSPIN/data/COFFEE/nmr/AC1233_PERAH12114_6519287_kQ2xMY586G/32/pdata/1/auditp.txt
$$ ##AUDIT TRAIL=  $$ (NUMBER, WHEN, WHO, WHERE, PROCESS, VERSION, WHAT)
(   1,<2012-07-13 17:04:24.984 -0500>,<Administrator>,<TOPSPIN>,<go>,<TOPSPIN 2.1>,
      <created by zg
	started at 2012-07-13 16:52:54.515 -0500,
	POWCHK enabled, PULCHK disabled,
       configuration hash MD5:
       6B 1B 68 BB D9 2E 58 E2 7F 35 AD 54 07 DF 0E 41
       data hash MD5: 64K
       FA 7C 3B C7 20 C7 16 28 6B 04 71 48 62 41 A8 08>)
(   2,<2012-07-13 17:04:27.984 -0500>,<Administrator>,<TOPSPIN>,<proc1d>,<TOPSPIN 2.1>,
      <Start of raw data processing
       efp LB = 0.3 FT_mod = 6 PKNL = 1 PHC0 = 0 PHC1 = 0 SI = 128K 
       data hash MD5: 128K
       E7 E6 B4 B5 CA 32 17 49 2F 72 9B 52 82 F3 A7 82>)
(   3,<2012-07-13 17:04:29.078 -0500>,<Administrator>,<TOPSPIN>,<proc1d>,<TOPSPIN 2.1>,
      <pk PHC0 = 1.521606 PHC1 = 0 
       data hash MD5: 128K
       71 3B DC 9C 8E C7 51 20 52 7E 7D 4F E3 2D 67 B8>)
(   4,<2012-07-13 17:04:29.578 -0500>,<Administrator>,<TOPSPIN>,<proc1d>,<TOPSPIN 2.1>,
      <abs ABSG = 1 
       data hash MD5: 128K
       F1 B3 56 59 F4 B9 BB CF 2A D7 E1 9C 7B 25 F9 B2>)
(   5,<2012-07-13 17:04:29.656 -0500>,<Administrator>,<TOPSPIN>,<proc1d>,<TOPSPIN 2.1>,
      <abs ABSG = 2 
       data hash MD5: 128K
       35 EA 91 87 68 FE 6D F8 1C 30 AB 1C 30 59 03 1F>)
(   6,<2012-07-13 17:04:29.718 -0500>,<Administrator>,<TOPSPIN>,<proc1d>,<TOPSPIN 2.1>,
      <abs ABSG = 3 
       data hash MD5: 128K
       F2 41 7E F1 0A D4 38 A0 E9 E3 A2 F6 DD 5A C6 09>)
(   7,<2012-07-13 17:04:29.765 -0500>,<Administrator>,<TOPSPIN>,<proc1d>,<TOPSPIN 2.1>,
      <abs ABSG = 4 
       data hash MD5: 128K
       09 99 42 FA 08 86 2A 02 FC 64 31 19 8E F0 9F 43>)
(   8,<2012-07-13 17:04:29.828 -0500>,<Administrator>,<TOPSPIN>,<proc1d>,<TOPSPIN 2.1>,
      <abs ABSG = 5 
       data hash MD5: 128K
       29 BD 79 A3 72 B6 CB 08 A4 3A 20 E4 84 E7 EE 60>)
$$ ##END=
$$ 
$$ $$ hash MD5
$$ $$ 1C D8 58 4B 8A 13 C8 66 5D 7A 22 65 8E C0 5D EA
##$RELAX= 
##$RELAX= 
##$RELAX= 
##$RELAX= 
##$RELAX= 
##$RELAX= 
##$RELAX= 
##$RELAX= 
##$RELAX= 
$$ [...]
##$TP07= 0
##$TPNAME0= <>
##$TPNAME1= <>
##$TPNAME2= <>
##$TPNAME3= <>
##$TPNAME4= <>
##$TPNAME5= <>
##$TPNAME6= <>
##$TPNAME7= <>
##$TPOAL= (0..7)
0.5 0.5 0.5 0.5 0.5 0.5 0.5 0.5
##$TPOFFS= (0..7)
0 0 0 0 0 0 0 0
##$TUNHIN= 0
##$TUNHOUT= 0
##$TUNXOUT= 0
##$USERA1= <user>
##$USERA2= <user>
##$USERA3= <user>
##$USERA4= <user>
##$USERA5= <user>
##$V9= 5
##$VALIST= <valist>
##$VCLIST= <CCCCCCCCCCCCCCC>
##$VD= 0
##$VDLIST= <DDDDDDDDDDDDDDD>
##$VPLIST= <PPPPPPPPPPPPPPP>
##$VTLIST= <TTTTTTTTTTTTTTT>
##$WBST= 2048
##$WBSW= 25
##$XGAIN= (0..3)
0 0 0 0
##$XL= 0
##$YL= 0
##$YMAX_a= 17020450
##$YMIN_a= -12866032
##$ZGOPTNS= <>
##$ZL1= 120
##$ZL2= 120
##$ZL3= 120
##$ZL4= 120
##$ABSF1= 14.96143
##$ABSF2= -5.596752
##$ABSG= 5
##$ABSL= 3
##$ALPHA= 0
##$AQORDER= 0
##$ASSFAC= 0
##$ASSFACI= 0
##$ASSFACX= 0
##$ASSWID= 0
##$AUNMP= <proc_prof1d_extract.lims>
##$AXLEFT= 0
##$AXNAME= <>
##$AXNUC= <1H>
##$AXRIGHT= 0
##$AXTYPE= 0
##$AXUNIT= <>
##$AZFE= 0.1
##$AZFW= 0.1
##$BCFW= 0
##$BC_mod= 0
##$BYTORDP= 0
##$COROFFS= 0
##$CY= 15
##$DATMOD= 1
##$DC= 0
##$DFILT= <>
##$DTYPP= 0
##$F1P= 0
##$F2P= 0
##$FCOR= 0.5
##$FTSIZE= 131072
##$FT_mod= 6
##$GAMMA= 0
##$GB= 0
##$INTBC= 1
##$INTSCL= 1
##$ISEN= 128
##$LB= 0.3
##$LEV0= 0
##$LPBIN= 0
##$MAXI= 10000
##$MC2= 0
##$MEAN= 0
##$ME_mod= 0
##$MI= 0
##$NCOEF= 0
##$NC_proc= -2
##$NLEV= 6
##$NOISF1= 0
##$NOISF2= 0
##$NSP= 0
##$NTH_PI= 0
##$NZP= 0
##$OFFSET= 14.96143
##$PC= 1
##$PHC0= 1.521606
##$PHC1= 0
##$PH_mod= 1
##$PKNL= yes
##$PPARMOD= 0
##$PPDIAG= 0
##$PPIPTYP= 0
##$PPMPNUM= 2147483647
##$PPRESOL= 1
##$PSCAL= 4
##$PSIGN= 0
##$PYNMP= <proc.py>
##$REVERSE= no
##$SF= 400.020009463214
##$SI= 131072
##$SIGF1= 0
##$SIGF2= 0
##$SINO= 400
##$SIOLD= 131072
##$SPECTYP= <>
##$SREGLST= <1H.CDCl3>
##$SSB= 0
##$STSI= 131072
##$STSR= 0
##$SW_p= 8223.68421052631
##$SYMM= 0
##$S_DEV= 0
##$TDeff= 65536
##$TDoff= 0
##$TI= <>
##$TILT= no
##$TM1= 0
##$TM2= 0
##$TOPLEV= 0
##$USERP1= <user>
##$USERP2= <user>
##$USERP3= <user>
##$USERP4= <user>
##$USERP5= <user>
##$WDW= 1
##$XDIM= 131072
##$YMAX_p= 430829065
##$YMIN_p= -10974
##$CURPLOT= <Network HP LaserJet P1505>
##$CURPRIN= <$Network HP LaserJet P1505>
##$DFORMAT= <normdp>
##$LAYOUT= <+/1D_H.xwp>
##$LFORMAT= <normlp>
##$PFORMAT= <normpl>
##$SURQMSG= 1
$$ End of Bruker specific parameters
$$ ---------------------------------
##NTUPLES= NMR SPECTRUM
##VAR_NAME=  FREQUENCY,     SPECTRUM/REAL,   SPECTRUM/IMAG
##SYMBOL=    X,             R,               I
##VAR_TYPE=  INDEPENDENT,   DEPENDENT,       DEPENDENT
##VAR_FORM=  AFFN,          ASDF,            ASDF
##VAR_DIM=   131072,        131072,          131072
##UNITS=     HZ,            ARBITRARY UNITS, ARBITRARY UNITS
##FACTOR=    0.0627417313425164, 1,          1
##FIRST=     8223.62146879497, 3411,         -87526
##LAST=      0,             5486,            -87837
##MIN=       0,             -10974,          0
##MAX=       8223.62146879497, 430829065,    0
$$ Real data points
##PAGE= N=1
##DATA TABLE= (X++(R..R)), XYDATA
$$ [...]
64742 521995 503351 485778 470284 457907 448615 441615 436458 433057 430797 428637 426224 424135 422782
64729 422782 421745 420524 419342 418837 419400 421234 424776 430642 439199 450320 463291 476837 489476 500168
64715 500168 508604 514785 518440 518967 515866 509165 499461 487605 474349 460291 446031 432151 419002
64702 419002 406740 395586 385705 376824 368495 360983 355311 351946 349934 348009 346169 345409 346095 347530
64688 347530 349098 351046 353938 358139 364151 372729 384166 397925 413406 430672 449997 470997 492665
64675 492665 514009 534189 552136 566457 575794 579184 576296 567700 554869 539573 523087 506052
64663 506052 489044 473036 459122 447880 439138 432386 427292 423777 421740 420989 421458 423246 426317 430442
64649 430442 435593 442160 450500 460464 471747 484605 499870 518217 539667 563763 589887 617208
64637 617208 644519 670335 693206 712024 726029 734532 736688 731897 720600 704454 685389 664494
64625 664494 641902 617623 592264 567060 543355 521944 502757 485273 469285 455010 442485
64614 442485 431368 421546 413377 406936 401565 396662 392432 389187 386383 383218 379968 377817 377463 378701
64600 378701 381315 385433 390890 397062 403631 410795 418569 426691 435526 446182 459224 473902 489182
64587 489182 504894 521297 538079 554504 570172 584946 598358 609676 618434 624342 626851 625392
64575 625392 620095 611852 601652 590153 577815 564946 551554 537494 522993 508792 495556 483172
64563 483172 470831 457956 445054 433424 423860 415859 408378 401165 394847 389810 385671 381985 378829
64550 378829 376370 374460 373094 372756 373771 375717 378062 381006 385004 389692 394037 397491 400280 402468
64536 402468 403475 402823 400819 398140 395133 391908 388728 385842 383113 380250 377441 375380 374583 374875 375686
64521 375686 376653 377854 379609 382178 385608 389668 393959 398245 402734 407924 414159 421492 430054 440341
64507 440341 452920 467921 484940 503295 522167 540585 557562 572234 583731 591092 593678 591662
64495 591662 585815 576823 565183 551784 538016 525040 513285 502967 494720 489215 486337 485179 484878
64482 484878 485102 485727 486386 486502 485569 483261 479439 474180 467722 460323 452336 444571 438423 435207 435122 437011
64466 437011 439412 441846 444881 449007 453851 458603 462830 466516 469552 471591 472348 471707 469656 466427 462691
64451 462691 459205 456272 453860 452185 451711 452515 454096 456030 458466 461808 466318 472269 480057 489757 500855
64436 500855 512860 526033 541045 558042 576559 596497 618733 644496 674437 708650 747582
64425 747582 792532 845303 907708 981746 1070025 1175795 1302686 1454527 1634611 1843676
64415 1843676 2077956 2329840 2591090 2855209 3116710 3369613 3608293 3829335 4030577
64406 4030577 4207578 4352293 4456409 4515634 4530266 4502538 4434638 4329028 4189136 4018739
64396 4018739 3820857 3597854 3352990 3092158 2824153 2558998 2305481 2069699 1855146
64387 1855146 1663355 1494252 1346555 1218562 1108692 1015311 936456 870141 814856 769496
64377 769496 732952 703979 681261 663292 648265 634389 620448 606078 591565 577321 563321
64366 563321 549001 533942 518690 504466 491940 480713 470239 460819 453295 448167 445457 445123 447037
64353 447037 450687 455464 461258 468270 476243 484271 491532 497785 502951 506437 507147 504198 497676 488751
64339 488751 479036 469661 460895 452602 444865 438067 432607 428731 426486 425582 425448 425736 426788 429414 434126
64324 434126 440668 448238 455948 463127 469393 474626 478901 482446 485456 487718 488478 486978 483237 478033
64310 478033 472046 465287 457494 448698 439155 429055 418677 408599 399387 391159 383720 376992 371079
64297 371079 366085 362121 359318 357583 356573 356194 356819 358611 360951 363157 365632 369597 375598 382880 390506
64282 390506 398568 407912 419032 431632 445146 459273 474024 489454 505326 520872 534877 546211
64270 546211 554393 559669 562592 563619 563139 561755 560308 559471 559323 559463 559518 559404 558969 557581 554324 548672
64254 548672 540810 531146 519607 505704 489533 472542 456830 443482 431915 421097 411040 402583
64242 402583 396044 390832 386479 383330 381874 381953 382985 384610 386712 389091 391478 393716 395651 397107 398225
64227 398225 399495 401115 402637 403651 404526 405920 407710 408980 409069 408168 406812 405254 403542 401814 400171
64212 400171 398377 395953 392614 388595 384559 381259 379214 378608 379290 380841 382834 385261 388611 393233 398776
64197 398776 404620 410837 418243 427497 438694 452054 468374 488248 511158 535864 561455 587453
64185 587453 612869 635647 653322 664193 667907 665074 656491 642829 625047 604698 583376 561955
64173 561955 540809 520604 502140 485397 469563 454372 440696 429320 419751 410850 402184 394208
64161 394208 387558 382784 380384 380374 381960 384184 386784 390067 394250 399380 405576 412780 420464 428027 435148
64146 435148 441381 445946 448591 450205 451768 452974 452678 450485 447120 443413 439823 436821 434736 433161
64132 433161 431342 429377 428310 428852 430639 432939 435510 438657 442960 448999 456780 465459 474212 483401
64118 483401 494195 507041 521208 535878 550802 565715 579951 593044 605030 615759 624515 630763
64106 630763 634834 637614 640015 642987 647433 653656 661200 669482 678198 686922 694803 700936 704686 705576
64092 705576 703459 699052 693731 688455 683335 678431 674302 671351 669167 667004 664562 661900 658962 655625
64078 655625 651895 647681 642612 636399 629199 621455 613679 606462 600221 594677 589055 583046 577142 571798
64064 571798 566773 561669 556640 552237 548939 547151 547131 548536 550557 552988 556682 562441 569887 578066 586842
64049 586842 596927 608709 621682 635111 648746 662733 677043 691169 704289 715840 725868
64038 725868 734666 742230 748563 754400 760825 767909 774530 780002 785138 791012 797357 803055 807829 812428
64024 812428 817229 821452 823753 822971 818306 809543 797292 782544 765904 747638 728435 709500 691725
64011 691725 675176 659582 644986 631756 620201 610323 601807 594183 587175 580891 575542 571104 567389
63998 567389 564382 562297 561427 562057 564333 567993 572457 577436 583221 590054 597461 604574 610942 616667 621957
63983 621957 626999 632132 637663 643524 649465 655573 662277 669940 678755 688863 700158 712109 724232
63970 724232 736746 750401 765705 782661 801058 820547 840608 861056 882566 906101 931820
63959 931820 959229 988473 1020690 1056747 1096348 1138976 1185223 1236593 1294325 1359114 1431937
63948 1431937 1514645 1609727 1719930 1848116 1996987 2168700 2364915 2587259 2837367 3116116
63938 3116116 3422887 3755748 4112315 4490258 4886829 5297912 5717406 6137359 6548716
63929 6548716 6942192 7308897 7640569 7929642 8169413 8354370 8480372 8544569 8545337 8482454
63919 8482454 8357329 8172992 7933915 7645931 7316157 6952706 6564370 6160401 5750114
63910 5750114 5342000 4942965 4558451 4193152 3851211 3535647 3247937 2988258 2755879
63901 2755879 2549326 2366633 2205813 2065006 1942152 1834970 1741467 1660207 1589856 1528749
63891 1528749 1475084 1427267 1383829 1343452 1305472 1270068 1237421 1206882 1177428 1148847 1121856
63880 1121856 1096986 1073899 1052080 1031872 1014408 1000628 990645 984108 980959 981616 986468 995482 1008462
63867 1008462 1025493 1046833 1072419 1101906 1135282 1173104 1215900 1263583 1315629 1371488 1430513
63856 1430513 1491687 1553853 1616261 1678651 1740796 1802076 1861438 1917623 1969425 2015885 2056218
63845 2056218 2089576 2114979 2131564 2138866 2136819 2125585 2105315 2075994 2037544 1990369 1935743 1875435
63833 1875435 1810828 1742545 1670914 1596598 1520888 1445620 1372705 1303299 1237420 1174670 1115219
63822 1115219 1059761 1008715 962027 919595 881108 845527 811643 779425 750029 724215 701584
63811 701584 681626 664481 650031 637188 624966 613587 603636 594705 585802 576630 567470 558150 548229
63798 548229 538086 528788 520787 513514 506290 498883 491194 483189 475338 468449 462850 458176 453994 450171
63784 450171 446686 443611 441214 439531 437927 435770 433436 431858 431080 430106 428318 426185 424274 422381 420139
63769 420139 417789 415806 414228 412906 412032 411884 412257 412598 412584 412232 411575 410580 409376 408279 407506 406906 406043
63752 406043 404679 403206 402381 402465 402912 403226 403808 405431 408077 410916 413417 415809 418370 420944 423410 426104
63736 426104 429425 433425 438023 443195 448646 453702 457941 461692 465581 469749 473816 477524 481136 485233
63722 485233 490226 496104 502658 509935 518248 527561 537110 545973 553848 560873 566926 571685 575252 578034
63708 578034 579923 580363 579433 578153 577317 576634 575539 574328 573793 574017 574264 574053 573747 573852 574140 573762 572103
63691 572103 569309 565974 562476 558772 554773 550628 546539 542583 538972 536240 534771 534214 533807 533279 533099
63676 533099 533885 535876 538920 542529 545997 548990 552085 556268 561737 567705 573485 579176 584977 590336
63662 590336 594294 596372 596683 595391 592544 588413 583575 578489 573108 566972 559686 551308 542338 533344
63648 533344 524698 516675 509597 503710 499096 495883 494298 494168 494649 494920 495056 495764 497361 499508 501858
63633 501858 504400 507153 510127 513696 518355 523908 529437 534355 539013 544006 549393 554965 560832 567318
63619 567318 574551 582534 591429 601469 612772 625532 640196 657193 676529 697773 720391 744104
63607 744104 769126 796005 824999 855623 887081 918938 950827 981557 1009144 1031934 1049260
63596 1049260 1060985 1067136 1068304 1065818 1061104 1055187 1048971 1043368 1038672 1034185 1028879 1022097 1013337 1001946
63582 1001946 987673 971203 953601 935359 916498 897497 879622 864232 851949 842391 834524 827388
63570 827388 820672 814553 809019 803675 798316 793275 788889 784947 780958 776765 772634 768980 766277 765070
63556 765070 765776 768490 773099 779521 787872 798647 812656 830505 852183 877522 906951 941310 981095
63543 981095 1026534 1078208 1136383 1199147 1261941 1319443 1367513 1403321 1424954 1432107 1426706 1411981
63531 1411981 1391083 1367008 1343012 1321818 1304239 1289158 1274752 1259294 1241275 1219717 1194494
63520 1194494 1165864 1133862 1098688 1061452 1023766 986625 950309 915224 882136 851511 823341
63509 823341 797705 774877 754713 736541 719909 704929 691584 679143 666713 654187 642427
63498 642427 632505 624749 618381 612126 605379 598749 593221 588944 585184 581436 578111 576034 575546 576279 577621
63483 577621 579277 581490 584729 589113 594250 599776 605898 613138 621576 630538 639025 646307 652184 656887
63469 656887 660680 663443 664704 664147 661896 658225 653295 647464 641565 636428 632153 628185 624179 620531
63455 620531 618033 617172 617797 619351 621342 623600 626107 628790 631608 634722 638250 641988 645741 649877 654997
63440 654997 661040 667272 673442 680494 689893 702715 719716 741914 770696 807529 853466 908353
63428 908353 970082 1034938 1098812 1157734 1207507 1244114 1265429 1272280 1267607 1255101 1238760 1222568
63416 1222568 1209531 1201266 1198851 1203236 1214204 1229786 1247701 1266760 1286008 1303330 1316252 1323741
63404 1323741 1326097 1323484 1316016 1305170 1293588 1283046 1273455 1263985 1254087 1243187 1230330 1214622
63392 1214622 1195484 1172327 1144730 1113197 1079187 1044223 1009415 975651 943476 912744 883148
63381 883148 855216 830060 808148 789084 772581 758813 747730 738956 732517 728807 727680 728433 730831
63368 730831 735157 741093 747643 754615 763122 774089 787212 802013 818937 838612 860790 884981
63356 884981 911528 941188 974072 1009753 1047950 1088243 1129329 1169342 1206788 1240560 1269288
63345 1269288 1291449 1306320 1314422 1317069 1315737 1311722 1305928 1298887 1291110 1283228 1275517 1267415 1257630
63332 1257630 1244668 1227368 1205494 1180072 1152804 1124853 1096440 1067675 1039269 1012143 986779
63321 986779 963409 942601 925457 913516 908491 911367 921201 935065 949351 960760 966075 962194
63309 962194 947553 923346 892772 859221 825408 793408 764399 738416 715058 694429 676890
63298 676890 662139 649290 637819 627834 619415 612294 606210 600961 596016 590672 584896 579529 575392
63285 575392 572388 569694 566639 563275 560291 558403 557688 557446 556858 555713 554390 553280 552491 551989 551699 551502
63269 551502 551453 551926 553222 555089 556944 558579 560293 562305 564452 566528 568550 570568 572603 574952 578193
63254 578193 582578 587629 592642 597390 602076 606804 611512 616385 621879 628236 635250 642593 650110 657667
63240 657667 665096 672562 680734 690258 701259 713745 728245 745448 765153 786273 808171 831502
63228 831502 857347 885901 916492 948597 982301 1017824 1055023 1093381 1132216 1170919 1209212
63217 1209212 1247061 1284193 1320033 1354487 1388530 1423571 1460334 1498644 1537967 1577604 1616435
63206 1616435 1653081 1686272 1714688 1736617 1750408 1755312 1751464 1739147 1718584 1690292 1655035 1613575
63194 1613575 1567133 1517994 1468750 1420847 1374533 1330301 1289466 1253156 1221630 1195027 1174024
63183 1174024 1159250 1150657 1147879 1150661 1158543 1170712 1186585 1206004 1228594 1253610 1280752 1310368
63171 1310368 1342289 1375220 1407898 1440207 1472457 1504237 1534808 1564082 1592355 1619434 1644857
63160 1644857 1668542 1690235 1708484 1721039 1726378 1724239 1714870 1698408 1674896 1644290 1606652 1562951
63148 1562951 1515425 1466334 1416458 1365601 1314458 1264964 1218677 1175780 1136022 1099811 1067801
63137 1067801 1039954 1015626 994358 976162 961143 949198 939988 933081 928163 925206 924332 925491 928346
63124 928346 932481 937639 943811 951154 959607 968486 976756 983879 990048 995380 999407 1001884 1003579 1005436
63110 1005436 1007151 1007457 1005845 1003192 1000489 997670 994090 989528 984236 978368 971863 964810 957623 950895
63096 950895 945141 940527 936816 933765 931584 930763 931442 933236 935710 938697 942166 946157 950894 956532 962608
63081 962608 968134 972446 975678 978248 980340 982191 984454 987735 991892 996286 1000726 1005770 1012089 1019950
63067 1019950 1029495 1041119 1055166 1071334 1088790 1106979 1126081 1146639 1169075 1193860 1221760
63056 1221760 1253356 1288310 1325698 1365207 1407535 1453384 1502637 1554958 1610781 1671051 1736126
63045 1736126 1805537 1878730 1955478 2035462 2117919 2201880 2286387 2370442 2453184 2534356 2614243
63034 2614243 2692867 2769527 2843470 2914835 2984558 3053384 3121230 3187539 3251907 3314098 3373470
63023 3373470 3428511 3476999 3516497 3544755 3559882 3560461 3545613 3514848 3467972 3405372 3328459 3239630
63011 3239630 3141663 3037255 2929077 2819962 2712822 2610482 2515500 2429813 2354401 2289568
63001 2289568 2235721 2193579 2163470 2144872 2136995 2139481 2152110 2174054 2203926 2240523 2283106 2331005
62989 2331005 2383296 2438962 2497111 2557028 2618218 2680375 2743108 2805741 2867559 2928090 2986812
62978 2986812 3042602 3093708 3138243 3174516 3200960 3216094 3218626 3207462 3181716 3140946 3085493
62967 3085493 3016486 2935616 2845046 2747280 2644725 2539279 2432452 2325794 2220929 2119217
62957 2119217 2021604 1928807 1841413 1759679 1683410 1612171 1545664 1483907 1427046 1374978 1327237
62946 1327237 1283397 1243444 1207441 1174955 1145230 1118034 1093768 1072509 1053347 1035138 1017659
62935 1017659 1001694 988136 977246 968535 961056 954000 947229 941035 935283 929270 922685 916162 910399
62922 910399 905204 899998 894867 890310 886114 881270 875119 868004 860657 853480 846573 840038 834015 828654
62908 828654 824184 820834 818569 817042 815776 814440 813094 812223 812166 812323 811346 808439 804126 799391 794569
62893 794569 789660 785207 782017 780093 778656 777278 776337 776256 776903 777894 778999 780039 780751 780984 780767 780189
62877 780189 779395 778649 778068 777330 775937 773705 770829 767637 764641 762539 761691 761667 761669 761281 760469 759175 757422
62860 757422 755671 754470 753802 753191 752401 751622 751115 751021 751306 751539 751019 749569 747874 746598 745642 744820 744568
62843 744568 745055 745180 743625 740658 737736 735461 733180 730532 728085 726238 724754 723748 723932 725359 726989
62828 726989 728078 729138 730953 733504 736454 739846 743691 747544 751142 754887 759180 763876 768795 774095
62814 774095 779629 784712 789115 793563 798552 803369 807091 809953 812864 816060 819203 822531 826954 833020
62800 833020 840529 849136 858671 868832 879184 889584 900269 911463 923212 935664 949249 964509
62788 964509 981816 1001253 1022789 1046764 1074065 1105472 1140916 1179889 1222560 1269857 1322389
62777 1322389 1380049 1442884 1511582 1586715 1668291 1756595 1852734 1957685 2071282 2192625 2320829
62766 2320829 2454557 2591325 2728036 2861912 2990226 3109482 3215669 3305156 3374795 3421658
62756 3421658 3443714 3440878 3414670 3366748 3298290 3210818 3107041 2990655 2865498 2734842 2601186
62745 2601186 2466740 2334111 2206104 2084523 1969596 1861014 1759180 1664975 1578794 1500489
62735 1500489 1429945 1366949 1310547 1259307 1212298 1169422 1130820 1096440 1066118 1039570 1016273
62724 1016273 995739 977873 962703 949897 938969 929890 923066 918693 916482 915954 916743 918789 922532
62711 922532 928675 937430 948293 960976 976131 994556 1015981 1039438 1064728 1092715 1124159 1158971
62699 1158971 1196857 1237986 1282780 1331582 1385006 1444266 1510720 1585106 1667367 1757133 1854155
62688 1854155 1958254 2068805 2184306 2302564 2421265 2538088 2650256 2754377 2847034 2925247
62678 2925247 2986247 3027397 3046886 3044295 3020102 2975049 2910478 2828972 2733943 2628583 2515577
62667 2515577 2397542 2277151 2156926 2039336 1926784 1820818 1721501 1628205 1540969 1460568
62657 1460568 1387441 1321337 1261949 1209115 1162220 1120149 1082058 1047675 1016660 988263 961908
62646 961908 937638 915674 895941 878226 862432 848379 835669 824054 813783 805409 799295 795285
62634 795285 792641 790358 787807 784977 781877 777990 772823 766853 761196 756237 751177 745212 738634 732508
62620 732508 727703 724552 723056 722922 723534 724215 724569 724525 724234 724050 724446 725708 727694 729940 732089 734289
62604 734289 737253 741764 748019 755596 764166 774009 785667 799430 815399 833739 854491 877491 902964
62591 902964 931931 965441 1003617 1046023 1092774 1144541 1201482 1262838 1327607 1394935 1463671
62580 1463671 1532193 1598896 1662321 1720532 1770987 1811431 1840643 1858136 1863584 1856859 1838291 1808640
62568 1808640 1769060 1721231 1667153 1608560 1546773 1483218 1419689 1357819 1298610 1242680 1190672
62557 1190672 1143147 1100217 1061499 1026352 994179 964799 938574 915892 896419 879159 863287
62546 863287 848624 835265 823185 812407 803151 795569 789577 785101 782176 780633 780015 779957 780396 781235
62532 781235 782134 782807 783245 783404 783007 782014 781137 781586 784286 789375 796360 804652 814123 825256 838735 854928
62516 854928 873871 895564 920002 947117 977167 1011186 1050607 1096279 1148141 1205868 1269418
62505 1269418 1338852 1414022 1494481 1579237 1666454 1753898 1840023 1924297 2006304 2084948 2158940
62494 2158940 2227766 2291825 2351758 2407885 2460185 2508710 2554209 2598482 2643832 2691837 2742487
62483 2742487 2794229 2844471 2890145 2928371 2956903 2973837 2977094 2964802 2936269 2891956 2832256
62472 2832256 2756884 2665852 2560570 2443677 2318273 2187756 2055816 1925771 1799888 1679713
62462 1679713 1566824 1462749 1368290 1283471 1208181 1142528 1086505 1039623 1000974 969526 944295
62451 944295 924319 908518 895771 885461 877864 873538 872137 872285 872895 874216 877231 882400 889413 897763
62437 897763 906983 916475 925665 934220 941635 946773 948420 946348 941297 933857 923933 911529 897444 882646
62423 882646 867286 850868 833396 815877 799522 784803 771534 759643 749416 740968 733806 727158
62411 727158 720509 713691 706726 699942 694043 689617 686475 683812 681059 678350 676141 674702 674051 674091 674684
62396 674684 675815 677707 680564 684215 688344 693046 698685 705150 711712 717768 723286 728366 732873 736855
62382 736855 740860 745418 750485 755706 760920 766135 771313 776497 781788 786877 791025 794017 796798 800694
62368 800694 806304 813665 823071 834880 848769 864110 881256 901615 926133 954380 985555 1019829
62356 1019829 1058176 1101279 1149232 1201999 1259405 1320493 1383395 1446139 1507355 1566010 1620707
62345 1620707 1669637 1711322 1745168 1771247 1789700 1800571 1804082 1800694 1790755 1774290 1751335 1722386
62333 1722386 1688318 1649974 1608105 1563748 1518384 1473454 1429817 1387824 1347845 1310409 1275735
62322 1275735 1243323 1212269 1181861 1151767 1121882 1092458 1064250 1037969 1013345 989289 965334
62311 965334 942510 922301 905100 890309 877645 867503 859924 854008 848702 843689 839154 835158 831588
62298 831588 828426 825661 823138 820814 818978 817962 817774 818218 819174 820490 821761 822505 822497 821758 820373 818519
62282 818519 816520 814655 812972 811509 810559 810447 811095 812090 813248 814902 817508 821171 825754 831467 839040
62267 839040 849088 861308 874643 888396 903075 920060 940725 966105 997016 1033891 1076524
62256 1076524 1124461 1177772 1237070 1302682 1374191 1450857 1531969 1616353 1701757 1785090 1863331
62245 1863331 1934129 1995709 2046529 2085262 2111133 2124129 2124619 2112756 2088574 2052783 2007055 1953211
62233 1953211 1892495 1826040 1755578 1683047 1609785 1536848 1465971 1399336 1338282 1282867 1232684
62222 1232684 1187339 1146186 1108531 1074453 1044618 1018982 996475 976290 958624 943619 930447
62211 930447 918199 907061 897810 890585 884878 880377 877066 874762 873251 872744 873586 875605 878216 881027
62197 881027 884012 887306 891244 896271 902394 909062 916065 924199 934393 946472 959426 972700 986543
62184 986543 1001154 1016220 1031288 1045979 1059645 1071263 1079860 1084911 1086484 1085395 1083126 1081128 1080115
62171 1080115 1080227 1081704 1085129 1091258 1100931 1114897 1133284 1155542 1181471 1211987 1248129 1289373
62159 1289373 1333652 1379013 1424470 1469043 1510814 1547522 1577793 1601413 1618660 1629712 1634588
62148 1634588 1633357 1626300 1613878 1596511 1574487 1548188 1518311 1485788 1451641 1417105 1383672 1352678
62136 1352678 1324919 1300784 1280448 1263531 1248822 1234940 1221374 1208598 1197202 1187253 1178458 1170612
62124 1170612 1163850 1158701 1155854 1155656 1157967 1162721 1170294 1180805 1193244 1205961 1218091 1229967 1241930
62111 1241930 1253218 1262359 1268358 1271193 1271340 1269141 1264693 1258226 1250445 1242314 1234527 1227407 1221548 1218341
62097 1218341 1219554 1226415 1239290 1258038 1282296 1311308 1343680 1377450 1410496 1441180 1468795 1493428
62085 1493428 1515434 1535291 1553852 1572091 1590231 1607473 1622857 1635929 1646318 1653356 1656958 1658578
62073 1658578 1660489 1664076 1669332 1675804 1683265 1691418 1699701 1707741 1715583 1723251 1730432 1736853 1742814 1749189
62059 1749189 1756944 1766537 1777500 1788590 1798482 1806298 1811540 1813963 1813775 1811576 1807623 1801454 1792622 1781390
62045 1781390 1768036 1751746 1731009 1705158 1674845 1640959 1603741 1563195 1519784 1474354 1427652
62034 1427652 1380153 1332203 1284217 1236921 1191374 1148543 1108922 1072676 1039936 1010622 984220
62023 984220 960201 938529 919350 902339 886857 872589 859525 847379 835688 824519 814488
62012 814488 806014 799000 793347 789193 786532 785099 784934 786686 791121 798450 808220 819623 831858 844395
61998 844395 856881 868761 879239 887919 895233 901761 907240 910597 910844 907636 901200 892162 881206
61985 881206 868474 853560 836586 818955 802378 787331 773110 759194 745874 733692 723005
61974 723005 714059 706839 700922 696045 692546 690510 688832 686138 682551 679506 677783 676726 675517 674148
61960 674148 672936 672067 671931 672952 674768 676486 678141 680974 685892 692530 700253 709089 719105 729830
61946 729830 741083 753621 768227 784673 802178 820362 839219 858833 879704 902672 927736
61935 927736 953404 977947 1000946 1023110 1045053 1066843 1088208 1108464 1126611 1142094 1155138
61924 1155138 1165847 1173444 1177083 1176989 1174135 1169159 1162181 1153363 1143101 1132062 1121651 1113930 1110301
61911 1110301 1110507 1113621 1119599 1129146 1142463 1159016 1178298 1199805 1222258 1243741 1262749 1278452
61899 1278452 1290001 1296427 1297480 1293906 1286602 1275929 1262109 1245860 1228343 1210629 1193304 1176371
61887 1176371 1159509 1142582 1125827 1109428 1093122 1076511 1059509 1042223 1024622 1006752 989010
61876 989010 971748 954897 938453 923159 910090 899649 891489 885305 881143 879032 878904 880921 885293
61863 885293 891735 899613 908730 919469 932129 946679 963276 982398 1004258 1028643 1055630 1085894
61851 1085894 1119824 1156727 1195473 1235690 1277796 1321826 1366672 1410522 1451764 1489340 1522506
61840 1522506 1550587 1572969 1589157 1598792 1601692 1598033 1588468 1574019 1555965 1535971 1516240 1499120
61828 1499120 1486303 1478451 1475653 1477986 1485387 1497084 1511448 1526426 1540050 1550578 1556466 1556480 1549987
61815 1549987 1537090 1518360 1494336 1465337 1431794 1394584 1354864 1313764 1272487 1232436 1194777
61804 1194777 1159843 1127324 1097077 1069346 1044157 1021036 999495 979432 960913 944006 929035
61793 929035 916504 906404 897946 890380 883765 878479 874244 870150 865613 860830 856165 851478 846312 840647
61779 840647 835198 830805 827586 824910 822257 819757 817683 815827 813941 812535 812496 813870 815666 817002 817894
61764 817894 818806 820099 822229 825878 831363 838221 845584 852617 858506 862613 864957 866082 866187 864868 861855
61749 861855 857409 851738 844805 837116 829877 823740 817992 811663 804880 798482 792854 787933 783884 780940
61735 780940 778869 777348 776537 776614 777203 778054 779860 783325 787770 791802 795272 799312 804359 809394 813596
61720 813596 817557 822169 827218 831966 836486 841377 846365 850178 851943 851975 850854 848325 843721 837242 830110
61705 830110 823252 816369 808784 800811 793570 787587 782323 777233 772480 768254 764104 759542 754750 749998
61691 749998 744817 738636 731984 726201 721863 718207 714204 709559 704438 698845 692734 686471 680707 675751
61677 675751 671334 667094 663149 659971 657582 655245 652366 649530 647971 647943 648293 647946 647174 646868 647114 647178
61661 647178 646635 645854 645473 645849 646994 648686 650697 653090 656109 659624 663053 666043 668829 671700 674632
61646 674632 677803 681806 686770 691775 695843 699068 702104 704880 706644 707125 706861 706425 705970 705556 705355 705377
61630 705377 705302 704627 702873 699913 696273 692728 689429 685948 682414 679806 678621 678010 676955 675559 674349
61615 674349 672978 670669 667384 663488 658670 652332 644754 636762 628554 620016 611877 605191 599708 594100
61601 594100 587928 582160 577539 573702 570183 567077 564248 560969 556947 552822 549189 545892 542700 539831
61587 539831 537302 534546 531254 528028 525658 524217 523177 521941 520031 517352 514547 512543 511568 511172 511284
61572 511284 512363 514262 515850 516272 515893 515538 515477 515579 515808 515981 515667 514905 514601 515700 518289 521795 525560
61555 525560 528911 531277 532750 534091 535832 537787 539722 541846 544160 545917 546432 546106 546101 547215 549469
61540 549469 552540 556140 560096 564362 568798 572924 576196 578627 580702 582511 583448 582925 580980 578069 574779
61525 574779 571838 569722 568027 565916 563455 561777 561549 562048 562211 561858 561233 560052 557867 555019 552419
61510 552419 550537 549155 547896 546488 544732 542725 540980 539943 539519 539352 539302 539420 539768 540594 542257 544584
61494 544584 546719 548027 548835 549842 551142 552287 552935 552972 552330 551291 550703 551241 552559 553685 554222 554655
61478 554655 555560 557071 559201 562129 565843 569734 572914 575015 576529 578178 579939 580969 580670 579578 578783
61463 578783 578693 578840 578795 578678 578738 579003 579484 580183 580775 580798 580371 580236 580960 582543 584816 587644 590635 593340
61445 593340 595856 598585 601314 603414 605136 607707 611700 616272 620609 625123 630421 635902 640395 643623
61431 643623 646125 648205 649861 651372 653033 654597 655856 657523 660564 664804 669096 672891 676717 680978
61417 680978 685086 688146 689922 690773 691005 690570 689193 686617 682803 678057 672940 668078 663949 660599 657542
61402 657542 654288 651042 648493 646769 645153 643090 640958 639446 638633 638085 637482 636705 635726 634853 634693 635370
61386 635370 636197 636623 637070 638249 640066 641917 643733 645947 648625 651463 654564 658422 662964 667235 670291
61371 670291 672042 673133 674362 676313 679137 682461 685610 688045 689643 690751 692074 694257 697404 701141
61357 701141 705227 709783 714920 720643 727298 735575 745757 757565 771045 786892 805237 824695 843489
61344 843489 861139 878249 894850 909844 922071 931213 937560 941554 943718 944505 943997 941976 938392
61331 938392 933568 928040 922382 917048 912143 907536 903389 900302 898642 898025 897808 897797 898191 899206 901158
61316 901158 904550 909589 915928 923299 932010 942330 953861 966196 979841 995735 1014043 1034121
61304 1034121 1055449 1077788 1100440 1122102 1141598 1158164 1170902 1178543 1180053 1175313 1165156 1150960
61292 1150960 1133967 1114691 1093119 1069770 1046235 1024233 1004387 986431 970287 956321 944658
61281 944658 934915 926586 919234 912420 906097 901007 898090 897457 898482 900884 905085 911418 919589 929157
61267 929157 940012 952011 964496 976636 988274 1000281 1013968 1030132 1048629 1068907 1090775
61256 1090775 1114311 1138955 1163144 1185011 1203091 1216214 1223347 1224097 1219148 1209821 1197380 1182925
61244 1182925 1167475 1151701 1135895 1120509 1106356 1093959 1083175 1073959 1067004 1063035 1061752 1062089
61232 1062089 1063297 1065383 1068773 1074010 1081469 1090898 1101536 1113075 1126059 1140843 1156591 1171951
61220 1171951 1186366 1200123 1213375 1225759 1236764 1246041 1253593 1260009 1266123 1272080 1277259 1281535 1285869
61207 1285869 1291027 1296417 1301036 1305015 1309377 1314866 1321914 1331291 1343764 1359335 1377624 1398614 1422258
61194 1422258 1447895 1475039 1504153 1535533 1567836 1598848 1627355 1653079 1675098 1691788 1702332
61183 1702332 1707124 1706723 1701570 1692659 1681303 1667995 1652477 1634829 1615451 1594049 1569878 1543127
61171 1543127 1514950 1486005 1456035 1424949 1393165 1360728 1327323 1293472 1260575 1229434 1199699
61160 1199699 1171094 1144140 1119397 1097051 1077598 1061832 1049672 1039947 1031864 1025898 1022886 1023134
61148 1023134 1026745 1033850 1043905 1055438 1066993 1077673 1086547 1092410 1094631 1093597 1090000 1084416 1077936
61135 1077936 1072392 1069416 1069694 1073336 1080247 1090009 1102268 1117649 1137532 1162526 1191796 1224201 1259420
61122 1259420 1297668 1339016 1383359 1430391 1479233 1528631 1577791 1626561 1674690 1721457 1766022
61111 1766022 1807465 1844585 1876554 1903803 1927353 1947217 1962404 1972493 1978052 1979349 1975837 1967186
61099 1967186 1953612 1934699 1909090 1875911 1835663 1789318 1737597 1681699 1623714 1565603 1508438
61088 1508438 1453013 1400332 1350971 1304748 1261462 1221341 1184611 1151476 1122511 1098021 1076879
61077 1076879 1057310 1039002 1023081 1009845 998180 987693 979548 974304 970634 967358 965168 965036 966285
61064 966285 967802 970021 974098 979892 986264 992757 999751 1007657 1017238 1030039 1046983 1066930 1087967
61051 1087967 1109868 1134107 1161685 1192085 1224263 1257601 1291867 1327004 1363009 1399582 1436146
61040 1436146 1472532 1509088 1545648 1581083 1614489 1646061 1676045 1703554 1727369 1747347 1764211
61029 1764211 1778397 1789867 1798572 1804453 1807491 1808387 1808479 1808397 1807517 1805416 1803042 1801654 1801543 1802747 1806233
61014 1806233 1813263 1824180 1838769 1857324 1880560 1909089 1943659 1985260 2034310 2090490 2153821
61003 2153821 2224774 2302628 2385070 2470426 2559145 2652282 2750224 2854252 2967800 3094439 3235706
60992 3235706 3392317 3566042 3758759 3971335 4205756 4467495 4764532 5106329 5506277
60983 5506277 5983189 6557512 7248281 8077709 9077651 10289909 11767064 13582096 15829175
60974 15829175 18586085 21846505 25477362 29242309 32866372 36086615 38678827 40499397
60966 40499397 41553514 42029836 42235607 42453434 42820662 43305617 43757942 43963905 43684405
60957 43684405 42707620 40926636 38393198 35297637 31891084 28411822 25050888 21942946
60949 21942946 19162156 16726810 14619859 12812833 11276471 9980010 8891463 7981025
60941 7981025 7221429 6585644 6047809 5586957 5187737 4837819 4526880 4247940 3997141
60932 3997141 3771428 3567592 3383375 3217569 3068540 2933750 2810909 2698433 2594582
60923 2594582 2497231 2404760 2316424 2231762 2150476 2072996 2000423 1933669 1872933 1817872 1767783
60912 1767783 1721859 1679816 1642012 1608423 1577818 1548533 1519765 1491561 1463963 1436929 1410803
60901 1410803 1385996 1362235 1338779 1315347 1292262 1269843 1248225 1227719 1208720 1191206 1174719
60890 1174719 1158810 1143228 1127877 1113000 1099241 1087091 1076328 1066262 1056382 1046540 1036868 1027820
60878 1027820 1019940 1013158 1006566 999280 991214 982716 973850 964520 954864 944971 934460 923024 911221
60865 911221 900221 890772 882797 875815 869357 863187 857517 852890 849441 846512 843374 840118 837342 835166
60851 835166 833079 830698 828182 825934 824268 823370 823261 823805 824999 827127 830368 834353 838390 841975 844831
60836 844831 846618 846948 845652 842923 839407 836289 834812 835191 836180 836124 834361 831360 827797 823957 819819
60821 819819 815199 809866 804003 798498 794306 791470 789139 786538 783524 780152 776198 771394 765852 759997
60807 759997 754176 748476 742846 737277 731895 726909 722443 718364 714343 710080 705488 700635 695574 690278
60793 690278 684863 679791 675617 672375 669426 666177 662778 659785 657274 654723 651780 648710 645968 643648
60779 643648 641500 639229 636661 633887 631308 629284 627708 626204 624793 624021 624384 625928 628447 631660 635108
60764 635108 638352 641412 644698 648387 652334 656658 661840 667921 674030 679138 682954 685898 688545 691306
60750 691306 694237 696809 698288 698630 698632 698863 698862 697853 695775 693068 689752 685350 679585 672632 664735 656089
60734 656089 647114 638431 630543 623724 618082 613391 609053 604701 600689 597565 595160 592761 590181 588001
60720 588001 586545 585213 583259 580844 578840 577824 577673 577994 578425 578586 578300 578010 578484 579793 581066 581641
60704 581641 582110 583635 586448 589659 592476 594933 597338 599733 602174 604882 607757 610255 612224 614387
60690 614387 617573 621846 626809 632236 637895 643183 647610 651383 655020 658692 662401 666271 670043 672823
60676 672823 674138 674784 675849 677383 678927 680694 682968 684866 685268 684859 685608 688018 690469 691611 691816
60661 691816 691632 690350 687150 682486 677260 671568 665339 659443 654993 652017 649804 648072 646897 645930 644730
60646 644730 643629 643370 643963 644612 644626 643801 642086 639580 636753 634102 631650 629172 626698 624353 622002 619637
60630 619637 617867 617416 618276 619854 621746 623847 625871 627452 628687 630012 631517 632840 633764 634429 634890
60615 634890 634862 634051 632539 630781 629351 628567 628189 627530 626080 623958 621682 619648 617947 616486 615130 613871
60599 613871 612945 612610 612821 613366 614291 615819 617812 619858 621925 624390 627314 630329 633466 637378 642353
60584 642353 647813 653289 659275 666421 674329 681777 687851 692373 695545 697779 699521 700753 700928 699937 698765
60569 698765 698579 699430 700512 701474 702886 705503 709649 715226 721873 729170 737137 746447 757814 771407
60555 771407 787236 805698 827042 850438 874236 897140 918561 937776 953369 963767 968122 966603
60543 966603 960162 950079 937586 923797 909945 897356 886935 878865 873014 869376 867911 868322 870495
60530 870495 874952 882495 893491 907794 925174 945424 968170 992864 1018904 1045519 1071719 1096547
60518 1096547 1119128 1138278 1152417 1160331 1161935 1158153 1150364 1140132 1128874 1117177 1104692 1091216
60506 1091216 1077671 1065543 1055655 1048033 1042758 1040121 1039868 1040915 1042154 1043210 1044285 1045689 1047990 1052413
60492 1052413 1060573 1073479 1091009 1112805 1139659 1173524 1215873 1266524 1324408 1388829 1459099
60481 1459099 1533294 1608428 1681824 1751384 1814614 1868670 1911771 1943639 1964162 1972674 1969013 1954241
60469 1954241 1929520 1895055 1850744 1797113 1735085 1665802 1591510 1515714 1441453 1369977 1301875
60458 1301875 1238551 1181391 1130177 1083617 1041125 1002974 969096 938967 912536 890101 871224
60447 871224 854756 839945 826720 814956 804356 795040 787403 781303 776017 770997 766098 761192 756233
60434 756233 751575 747605 744267 741488 739709 739158 738986 738069 736558 735645 735923 736877 737968 739143 740197 740580
60418 740580 740182 739579 739292 739371 739825 740791 742156 743536 744749 745765 746279 745977 745227 744883 745351 746467 748210
60401 748210 750880 754511 758763 763420 768412 773346 777682 781427 785123 789125 793402 797893 802415 806324
60387 806324 809028 810876 812842 815336 817977 820502 823169 826159 829319 832633 836309 840233 843913 847127
60373 847127 850154 853301 856627 860092 863506 866380 868328 869613 870877 872499 874583 877209 880134 882720
60359 882720 884910 887793 892273 897595 902247 905996 909777 913744 916909 918897 920709 923302 926566 930261
60345 930261 934972 941470 949813 959586 970478 982316 995109 1009228 1024820 1040781 1055102 1066501
60333 1066501 1074947 1080337 1081605 1077746 1069055 1056815 1042277 1026437 1010303 994810 980613 968156
60321 968156 957629 948794 941217 934754 929405 924836 920665 917171 914940 913730 912434 910326 907745 905418
60307 905418 903884 903697 905452 909330 915166 923061 933309 945786 960284 977606 999533 1027450 1061595
60294 1061595 1101522 1146299 1194029 1242064 1287821 1328647 1361012 1381309 1387935 1381621 1363501 1334224
60282 1334224 1295510 1251071 1204850 1159118 1115064 1074147 1037650 1005558 977075 952027 930839
60271 930839 913398 898760 885912 874300 863830 854808 847617 842000 836959 831792 826870 822980 820243
60258 820243 818159 816365 814862 813621 812410 811000 809375 807778 806480 805268 803471 800933 798682 797924
60244 797924 798501 799200 799440 799649 799972 799836 799129 798712 799268 800584 802395 804955 808276 811841 815662 820617
60228 820617 827067 834106 840983 848300 856944 866714 876960 887817 899795 912831 926775 942196 959537
60215 959537 977871 995563 1011885 1027075 1041112 1053516 1064256 1073944 1083074 1091812 1100467 1109443
60203 1109443 1118621 1127309 1134796 1140599 1144317 1145789 1145336 1143504 1140589 1136545 1131076 1123650 1113951 1102631
60189 1102631 1091111 1080238 1069597 1058601 1047668 1037793 1029482 1022671 1017217 1012791 1008687 1004419 1000163
60176 1000163 996111 991887 987279 983068 980239 978638 977284 975825 974848 974777 975275 975876 976562 977478 978467 979130
60160 979130 979134 978400 977237 976309 976294 977493 979691 982265 984519 986213 987798 989887 992575 995628 999091 1003175
60144 1003175 1007729 1012561 1018151 1025120 1033018 1040668 1047892 1055759 1064842 1074418 1083878 1093707 1104329 1115134
60130 1115134 1125541 1136034 1147138 1158272 1168625 1178395 1188027 1196925 1204088 1209525 1213922 1217279 1218971
60117 1218971 1218861 1217361 1214692 1210948 1206540 1201571 1195132 1186256 1175378 1163865 1152348 1140503 1128324
60104 1128324 1116555 1105840 1096388 1088504 1082622 1078654 1076019 1074435 1074150 1075369 1077907 1081337 1085028 1088249
60090 1088249 1090744 1092942 1095117 1096749 1097343 1097504 1098399 1100371 1102808 1105140 1107189 1108661 1109062 1108085 1105536
60075 1105536 1101035 1094389 1086020 1076403 1065350 1052511 1038352 1023940 1009899 996318 983451 971746
60063 971746 961194 951335 941931 933191 925475 919242 915032 912911 912120 911787 911836 912791 915085 918997 924816
60048 924816 932470 941400 951316 962512 974843 987071 998061 1007976 1017304 1025279 1030411 1032152 1030871
60035 1030871 1026519 1018679 1007921 995930 984144 973042 962629 952637 942309 931043 919323 908227
60023 908227 898033 888164 878314 868677 859182 849558 840155 831693 824154 816849 809547 802558 795782 788869
60009 788869 782368 777504 774510 772265 769910 767800 766554 766225 766819 768626 771495 774685 778054 782621 789326
59994 789326 797844 807206 816973 827253 838003 848873 859389 868920 876781 882776 887277 890494 891956
59981 891956 890974 887244 880794 871819 860955 849443 838538 828769 819913 811585 803762 796793 791007 786370
59967 786370 782676 780051 778890 779166 780270 781827 784261 788055 792825 797653 802101 806389 810884 815920
59953 815920 821808 828434 835054 841052 846634 852286 857860 862679 866193 867997 867676 865363 862109 858958
59939 858958 855955 852705 849449 846765 844663 842883 841767 841902 843163 845039 847649 851443 856080 860554
59925 860554 864385 867866 871366 875247 880178 886544 893698 900735 907791 915602 924092 932439 940280 947648
59911 947648 953878 957874 959459 959343 957851 954905 951211 948080 945824 943555 940809 938227 936423 935375
59897 935375 935228 936605 939711 944108 949626 956500 964346 972042 979047 985958 993488 1001670 1010219 1018713
59883 1018713 1026366 1032678 1038584 1045932 1055531 1066567 1078002 1089452 1100511 1110381 1118508 1124557 1127599
59870 1127599 1126458 1121191 1113127 1103177 1091302 1077855 1064020 1050336 1036052 1020628 1004831 989697
59858 989697 975415 961853 949250 937813 927495 918668 912073 907662 904490 902241 901819 903857 907674
59845 907674 912292 917491 923204 928902 934227 939361 944144 947857 950427 952867 955877 959149 962814 968401
59831 968401 977298 989192 1003011 1018519 1035918 1054679 1073956 1093613 1113693 1133200 1150426 1164282
59819 1164282 1174491 1180703 1182344 1179459 1173232 1165595 1158396 1152600 1147924 1143271 1137447 1129311 1117754
59806 1117754 1102461 1084589 1065912 1047452 1029802 1014246 1001986 992228 982737 972599 962851 953994
59794 953994 944816 934573 924627 916617 910268 904263 898167 892262 886487 880832 875993 872501 869857 867442
59780 867442 865467 864141 862902 861490 860775 861317 862088 861893 861160 860927 860828 859735 857916 857012 858052 860781
59764 860781 864765 869859 875631 881457 887337 893818 901199 909431 918518 928283 938063 947401 956701 966460
59750 966460 976252 985272 993452 1001138 1007984 1013134 1016279 1017822 1018192 1017710 1016870 1016093 1015367 1014642 1014157 1013943
59734 1013943 1013586 1013064 1013170 1014364 1015892 1016806 1017211 1017606 1017730 1017151 1016492 1016917 1018692 1021198 1023981 1026800
59718 1026800 1029075 1030445 1031714 1034164 1037945 1042025 1045618 1048872 1052210 1055767 1059467 1063071 1066291 1069397
59704 1069397 1073384 1078918 1085442 1091874 1097754 1103095 1107699 1111543 1115383 1120022 1125263 1130436 1135673 1141657
59690 1141657 1148248 1154314 1158923 1161980 1163659 1163904 1162582 1159716 1155620 1151038 1146852 1143247 1139471 1134760
59676 1134760 1129051 1122530 1115139 1106963 1098429 1089617 1080171 1070448 1061866 1055278 1049829 1044372 1039296 1035864
59662 1035864 1034347 1033889 1033842 1034251 1035345 1037416 1040805 1045241 1049647 1053309 1056641 1060075 1062995 1064736 1065739
59647 1065739 1066458 1065808 1062173 1055575 1047515 1038941 1029669 1019614 1009260 998934 988708 979105 970877
59634 970877 964069 958104 952728 948081 944034 940201 936405 932414 927593 921573 914852 907930 900338 891522
59620 891522 882203 873854 867156 861973 858417 856819 856925 858093 860046 862551 864812 866248 867452 869374
59606 869374 871966 874699 877919 882434 888054 893692 898596 902395 904359 903916 901612 898415 894410 889385
59592 889385 884145 879829 876245 872387 868388 865455 863971 863084 862145 861136 859749 857511 854915 853049 851967
59577 851967 850674 848715 846530 844230 841370 838046 834910 832042 829034 826203 824371 823364 822095 820280
59563 820280 818666 817435 815825 813646 811793 810845 810353 809899 809701 809799 809763 809508 809464 809691 809874 810283 811654 814066
59545 814066 817091 821014 826590 833540 840806 848468 857815 869135 881163 893491 908075 927318 951595
59532 951595 979326 1008409 1036741 1062318 1083830 1100982 1113948 1123118 1129511 1134441 1138324 1140417
59520 1140417 1139948 1136776 1130870 1122096 1110733 1097354 1082032 1064558 1045445 1025781 1006023 986062
59508 986062 966526 948772 933356 919653 907212 896360 887236 879447 873059 868707 866344 864964 863957
59495 863957 863675 864340 865463 866694 868122 869426 869905 869757 870215 871955 874391 876842 879250 881417 882789
59480 882789 883465 884359 885933 887914 890496 894489 899824 905334 910632 916843 924757 933520 941975 950083 958114
59465 958114 965542 971750 977040 982107 987275 993017 1000425 1010349 1022558 1036258 1050837 1065800 1080814
59452 1080814 1096146 1112110 1127673 1140602 1149518 1154915 1157747 1158076 1155623 1150567 1143113 1133080 1120462
59439 1120462 1105674 1088917 1070291 1050910 1032888 1017749 1005717 996740 990967 987870 986352 986346 989127
59426 989127 995423 1004498 1015681 1029402 1045945 1064490 1084306 1105613 1128283 1150898 1172133 1191978
59414 1191978 1210593 1227199 1241370 1254436 1268084 1282092 1294557 1303856 1309250 1310042 1305291 1294478
59402 1294478 1278112 1258050 1237540 1220204 1208363 1202585 1202720 1208204 1217056 1225852 1231508 1232471 1228023
59389 1228023 1217801 1202660 1184763 1165984 1147187 1129515 1114953 1104591 1097397 1091737 1087213 1084197
59377 1084197 1082643 1082309 1083241 1085146 1087094 1088583 1090019 1091570 1092653 1093203 1094162 1095953 1097890 1099946 1103608
59362 1103608 1109815 1117529 1125640 1134925 1146681 1160757 1176573 1194875 1216632 1241200 1267468 1296005
59350 1296005 1328001 1362593 1397242 1430673 1463611 1496599 1528657 1558247 1584150 1605132 1620000
59339 1620000 1628450 1631051 1628195 1619681 1605306 1585288 1560181 1530981 1499169 1466119 1432571 1399003
59327 1399003 1366082 1334341 1303954 1275296 1249152 1225784 1204421 1184233 1165263 1147934 1132296
59316 1132296 1118299 1106041 1095162 1084744 1074430 1064850 1056330 1048030 1039015 1029410 1019858 1010715 1002364
59303 1002364 995406 989766 984493 979075 973993 969511 965113 960832 957762 956347 955465 954243 953453 954048 955609
59288 955609 957550 960658 966039 973567 982643 993428 1006115 1020134 1035487 1053668 1075821 1101142
59276 1101142 1128722 1159773 1196268 1238332 1284772 1335073 1388677 1442849 1493272 1536446 1569893
59265 1569893 1590788 1596777 1588227 1567943 1538597 1501850 1459753 1415317 1371412 1330098 1292789 1259976
59253 1259976 1231131 1206030 1185666 1170801 1160332 1152475 1146885 1144152 1143981 1145589 1149384 1156429 1166582
59240 1166582 1178772 1192694 1208487 1225116 1240916 1255542 1269563 1282259 1291666 1296908 1298793 1297953
59228 1297953 1294013 1286765 1276594 1263508 1247250 1228730 1210014 1192538 1176335 1161089 1146809 1133403
59216 1133403 1120704 1109015 1098557 1088515 1077726 1066273 1055347 1045673 1037238 1030262 1025131 1021356
59204 1021356 1017867 1014389 1011547 1009730 1008937 1009519 1011894 1015575 1019457 1022964 1026123 1029037 1032245 1036909
59190 1036909 1043347 1050029 1055394 1060045 1065631 1072235 1078651 1084747 1091467 1098622 1104739 1109387 1113932 1119614
59176 1119614 1126318 1133545 1141276 1149612 1158715 1169237 1181734 1195671 1209985 1224324 1238608 1251922
59164 1251922 1263273 1272907 1281204 1286654 1286844 1281300 1271564 1258510 1241589 1220853 1197733 1173359 1147868
59151 1147868 1121889 1097089 1074507 1053657 1033850 1015307 998516 983511 970159 958320 947601
59140 947601 937776 929353 922835 917697 913123 909285 906729 904994 903312 902166 902536 904011 905348 906610
59126 906610 908971 912696 917218 923091 931803 943511 956784 970761 985849 1002204 1019281 1037069
59114 1037069 1056023 1075675 1094967 1113919 1133153 1151836 1168205 1182285 1196015 1210316 1224096
59103 1224096 1236440 1247728 1258072 1266641 1273131 1278006 1280774 1279998 1275740 1270236 1265504 1261917 1259547
59090 1259547 1258938 1259794 1260732 1261057 1261124 1260320 1256550 1248499 1236799 1222322 1205171 1186034 1166699 1148182
59076 1148182 1129921 1111573 1094066 1078188 1063769 1050974 1040646 1032569 1025070 1017220 1009822 1003446
59064 1003446 997251 990684 984670 980037 976264 972698 969520 966567 962690 957321 951352 945719 940470 935864
59050 935864 932688 930718 928554 925864 924119 924150 924737 924661 924441 924858 925426 925627 926139 927512 929022 930225 932333
59033 932333 936735 943236 950988 960117 971268 984478 999479 1016217 1034316 1053038 1072325 1092566
59021 1092566 1112764 1130526 1144672 1156309 1166444 1174190 1178431 1179623 1178712 1175723 1170762 1165116 1160114
59008 1160114 1156018 1153061 1152315 1154513 1159288 1166586 1177412 1191970 1208403 1224619 1240248 1255766 1270953
58995 1270953 1285292 1298630 1310384 1319290 1324942 1328273 1329601 1327729 1322043 1313920 1304861 1294795 1283585
58982 1283585 1272726 1263955 1257451 1252787 1250442 1250914 1253560 1257779 1264268 1273788 1285752 1299366 1315032
58969 1315032 1333363 1353910 1376076 1400069 1425599 1450923 1474582 1496882 1518174 1536845 1550532
58958 1550532 1558320 1560266 1555839 1544554 1527359 1505848 1480610 1451601 1419576 1386029 1352333 1319792
58946 1319792 1289720 1262652 1238299 1216897 1199483 1186215 1175887 1167858 1162837 1160849 1160170 1159464 1159232
58933 1159232 1159876 1160137 1158990 1157325 1155976 1153618 1148566 1141351 1133738 1126419 1119432 1113603 1109635 1106780
58919 1106780 1104120 1102146 1101455 1101005 1099452 1097288 1096011 1096113 1097381 1100087 1104319 1109231 1114574 1121870 1132472
58904 1132472 1145629 1160049 1176018 1194294 1214319 1235641 1259880 1289061 1322874 1359512 1398234
58893 1398234 1439002 1480643 1521696 1562540 1604597 1647912 1691255 1733839 1774895 1812196 1843132
58882 1843132 1866936 1884201 1894770 1897930 1894074 1884318 1868858 1847441 1820989 1791095 1758338 1722753
58870 1722753 1685548 1648832 1614017 1581735 1552571 1526396 1501679 1477080 1453122 1430935 1410214
58859 1410214 1389956 1370321 1352101 1335144 1318973 1304156 1291344 1279612 1267379 1254249 1240448
58848 1240448 1225391 1208588 1191137 1174505 1158452 1141843 1124812 1108506 1093350 1079103 1065921
58837 1065921 1053914 1042518 1031722 1022878 1016785 1012114 1007349 1003171 1001219 1001714 1004024 1008318 1014763
58824 1014763 1022329 1030206 1039127 1049477 1059644 1068311 1076602 1085637 1093622 1098226 1100335 1102463 1104651
58811 1104651 1105087 1103800 1102432 1100942 1097744 1092872 1087990 1083400 1077816 1071014 1064074 1057136 1049418 1041320
58797 1041320 1034040 1027284 1019731 1011525 1003968 997118 990172 983872 980002 978749 979040 981145 986296 993965
58783 993965 1002072 1009815 1017780 1025483 1031413 1035473 1038840 1041487 1042292 1041455 1040230 1038337 1034199 1027704 1020189
58768 1020189 1011747 1001144 988543 975823 964127 953468 944628 938895 935870 933973 933078 934107 936208
58755 936208 937111 936429 935951 936480 937075 937605 939454 943317 948765 956186 966634 979505 992776 1005666 1018637
58740 1018637 1030877 1040649 1048433 1056852 1067055 1077733 1088062 1098856 1110299 1121214 1131340 1141953
58728 1141953 1153610 1165462 1177264 1189798 1202962 1215563 1227308 1238849 1249810 1259004 1266485 1272963
58716 1272963 1277400 1277930 1275041 1270986 1266067 1258503 1247997 1236140 1222973 1206551 1186640 1165701 1145303
58703 1145303 1124433 1102214 1079429 1056473 1032527 1007695 983448 960302 937640 916392 899004
58692 899004 885979 875142 865026 856239 848880 841598 834061 827474 821712 814811 806251 797998 791318
58679 791318 785325 779560 775153 772407 770079 768202 768814 772757 778460 785047 793955 806266 821065 837665
58665 837665 856845 878575 900887 922049 941456 957460 967011 968674 963772 953731 938838 920371
58653 920371 901121 882662 864556 847027 831758 819263 808242 798446 791334 787136 784252 782435
58641 782435 783447 787555 792483 796934 802043 808211 813718 817688 821288 824767 826514 826276 825988 826096 824533
58626 824533 820804 817615 816770 816933 817195 819307 824328 830539 836962 845754 858750 874561 891262 908998
58612 908998 927651 944811 958389 968682 975909 978625 976764 973403 971187 969541 967352 965596 965185
58599 965185 965006 964330 964469 965938 966700 965405 963719 963472 964296 966079 970699 979047 989219 999910 1012693
58584 1012693 1028717 1046184 1063448 1081441 1100482 1117845 1131392 1142776 1154227 1165023 1174111
58573 1174111 1183516 1196027 1211842 1230362 1252981 1281238 1314343 1351098 1392012 1437065 1483761
58562 1483761 1529776 1575080 1619024 1657998 1688548 1710273 1723319 1726107 1718463 1704189 1687457 1669108
58550 1669108 1649207 1630400 1615472 1604019 1594452 1586789 1580450 1571885 1557662 1537802 1513400 1483585
58538 1483585 1447885 1408984 1369854 1330428 1290112 1251106 1216106 1185072 1157350 1134590 1118358
58527 1118358 1107149 1098782 1093414 1091336 1090524 1089530 1090171 1094072 1099052 1102205 1103899 1105391 1105211 1101519 1095599
58512 1095599 1089468 1082455 1073588 1064830 1058273 1052515 1045426 1038096 1032489 1027680 1022048 1016720 1013101 1009495
58498 1009495 1003982 998234 994698 992496 989978 988719 990899 995177 999355 1004836 1014205 1026666 1040116
58485 1040116 1055585 1075411 1099105 1125159 1154746 1189328 1226549 1262575 1296427 1327957 1353953
58474 1353953 1370705 1378413 1378862 1370968 1353096 1327717 1299377 1270006 1240356 1213554 1192542 1176153
58462 1176153 1162284 1152752 1150461 1154238 1161424 1173236 1192329 1217019 1243036 1269089 1295486 1319191
58450 1319191 1335689 1344399 1347244 1343555 1331484 1312929 1291881 1269358 1244884 1221218 1202290 1187786
58438 1187786 1174889 1163970 1157574 1155282 1154721 1156252 1161687 1169930 1178951 1190410 1207148 1227669 1248154
58425 1248154 1268133 1288894 1308131 1321793 1329634 1333573 1332371 1323601 1309208 1293358 1276378 1256437
58413 1256437 1235352 1216681 1199667 1181166 1162111 1146050 1132815 1119690 1107258 1097949 1090460 1082014
58401 1082014 1074580 1072280 1074108 1075742 1077048 1080993 1086566 1089838 1090850 1092504 1093809 1091391 1086643 1084068
58387 1084068 1083415 1080724 1076330 1074336 1074786 1073857 1071489 1071363 1073511 1074292 1073620 1075100 1079200 1083327 1088310
58372 1088310 1097603 1110368 1122629 1134892 1151316 1171892 1192970 1215033 1242011 1273132 1303260
58361 1303260 1331191 1359728 1387689 1409954 1425546 1437733 1446147 1446964 1441014 1433570 1425934 1415301
58349 1415301 1402847 1393450 1387258 1380233 1373276 1372077 1377483 1384791 1393044 1406091 1423882 1441813 1459499
58336 1459499 1481203 1506704 1530695 1551932 1573816 1595293 1610716 1619732 1627768 1635695 1638544 1635595
58324 1635595 1631943 1628880 1622617 1613812 1608354 1607140 1605032 1601368 1601358 1605658 1609013 1610874 1616876 1628019
58310 1628019 1638977 1648827 1662554 1680060 1694913 1706160 1720165 1738423 1754852 1767571 1781838
58299 1781838 1798819 1813170 1824514 1839458 1859239 1877152 1891211 1907411 1927458 1945550 1960595
58288 1960595 1979239 2003327 2026763 2048108 2073671 2104636 2134066 2160205 2189645 2223806 2255819
58277 2255819 2284526 2317622 2357005 2395284 2430958 2472367 2522124 2572579 2621587 2677496 2743247
58266 2743247 2810725 2876217 2945982 3021020 3092144 3155868 3219194 3283077 3337896 3381386 3424076
58255 3424076 3470692 3513611 3551188 3594384 3648080 3704006 3759335 3823407 3898654 3974323 4047065
58244 4047065 4127931 4220994 4315691 4408728 4512116 4630406 4752037 4872700 5004612 5152708
58234 5152708 5305280 5458671 5626789 5815020 6009965 6206659 6419790 6655709 6900781
58225 6900781 7150567 7422174 7723898 8042119 8372659 8734049 9134557 9558797 10003276
58216 10003276 10490823 11032721 11613095 12229385 12909954 13672297 14505171 15413417 16436783
58207 16436783 17602172 18904913 20362000 22033639 23967627 26179967 28720516 31700240
58199 31700240 35230939 39414628 44426407 50525718 57954081 66930332 77807531 91154781
58191 91154781 107708513 128466808 154833653 188124083 228266031 272848755 317691905
58184 317691905 358381196 391145103 412698565 420331007 412974322 392147015 361463576
58177 361463576 325111580 286717289 249093978 214246883 183250455 156315867 133206375
58170 133206375 113610158 97195163 83562324 72315847 63132855 55717436 49766290
58163 49766290 45031823 41359233 38630206 36731531 35604544 35271733 35805879 37324554
58155 37324554 39977688 43800553 48515344 53539679 58214831 61965896 64274143 64691966
58147 64691966 63042688 59574431 54834861 49406401 43772341 38320607 33327182 28912466
58139 28912466 25074787 21778772 18987763 16642502 14670274 13019680 11655050 10526429
58131 10526429 9578361 8779628 8114552 7554403 7064959 6631961 6252346 5910024 5585166
58122 5585166 5277189 4994497 4731114 4476027 4235218 4021588 3832242 3657006 3499768
58113 3499768 3369896 3261074 3159180 3063110 2978387 2898376 2811387 2719381 2631466 2545849 2455655
58102 2455655 2365529 2285109 2212315 2139307 2068556 2007277 1952326 1896033 1840981 1794287 1753419
58091 1753419 1711837 1672298 1640543 1612283 1580447 1548923 1525180 1505587 1481892 1456050 1434657
58080 1434657 1414576 1388182 1357622 1330180 1304540 1275015 1244595 1220351 1200210 1177188 1152674
58069 1152674 1132987 1116754 1098085 1078510 1063687 1051901 1037577 1022641 1012844 1006298 996980 986140
58057 986140 978984 973463 963581 950714 940691 932733 922078 910516 903445 899221 892055 882865 876888
58044 876888 873238 867190 860265 857600 857559 854160 847707 843013 839259 831742 821843 815164 811238 804748 795560
58029 795560 788061 781880 772656 760968 751394 743721 733878 722574 714331 708968 702503 695433 691708 690584
58015 690584 687852 684143 683687 685806 685895 684082 684780 688393 691412 693950 699196 706084 710427 712788 717424
58000 717424 724013 728193 729908 733405 739146 743287 745027 747070 748823 746495 740113 733519 727370 718952
57986 718952 708835 700834 695276 688950 681680 676381 672712 667321 660415 655563 652910 649020 643481 639369
57972 639369 637124 634194 630747 629507 629866 628309 624757 622494 621899 620293 617836 617403 618643 618302 616492
57957 616492 616576 618738 619701 618866 618753 619317 617913 614990 613863 614676 614517 613514 614733 618010 620157 621478
57941 621478 625747 633323 640681 647332 656834 670076 683844 697148 712894 731940 751216 769017
57929 769017 786621 803484 816384 824666 831141 836598 838506 836181 832104 827116 819433 809331 799685
57916 799685 790956 780800 769490 760450 754437 748414 741170 734811 729744 723629 716511 711584 709442 706731
57902 706731 701908 697113 692951 686674 677395 668152 660993 654570 648155 643402 640609 637821 635072 634994 637943
57887 637943 641196 644152 649397 657200 664054 668380 672781 678725 683803 686207 687355 688115 686964 683845
57873 683845 681416 680589 679121 676330 674671 674912 674570 673212 674489 680440 688244 695088 701838 709278 715123
57858 715123 717788 719408 722306 725863 729295 733985 740575 747111 752360 757703 763643 767934 769300 769563
57844 769563 769965 768874 765286 761051 757379 752574 745492 737890 731174 724182 716402 709933 705936 702415
57830 702415 697865 693892 691965 690768 689077 688139 688858 689635 689247 688932 689621 690095 689801 690280 691814 692048 689966
57813 689966 687767 686638 684279 679090 673217 668679 663976 657503 651132 647245 645072 642974 641631 641972
57799 641972 642561 642138 642486 645854 651598 657989 665246 674202 684020 693634 703437 713367 721515 726827 730930
57784 730930 735252 738727 740511 742355 745950 750323 754221 758549 764007 768772 771149 772322 774005 775484
57770 775484 775404 774272 772803 769935 764885 759081 753732 747592 739346 730065 721081 711812 701945 693448 687900
57755 687900 684067 680513 678290 678543 679864 680734 682397 686606 692508 698325 704120 710307 715561 718868 721754
57740 721754 725807 729931 732525 734354 736625 738325 738195 737408 737440 737241 735332 732846 731618 731035 729654 728224
57724 728224 728146 728569 727965 727090 727516 728660 729121 729488 730914 732292 731715 729567 727400 725051 721619 718015
57708 718015 715680 713889 711071 707761 705540 704102 702022 699489 697749 696699 695449 694213 693404 692039
57694 692039 689411 687052 686574 686820 685769 684001 683598 684655 685584 686023 686885 688351 690213 693358 698646 705188
57678 705188 711871 719544 729702 742332 757275 776243 801094 831547 867212 910605 965558 1033731
57666 1033731 1114651 1207042 1306745 1404601 1489603 1553729 1591956 1600181 1577294 1528538 1463263
57655 1463263 1389462 1312621 1238071 1170410 1110966 1058963 1014846 979616 951800 928412 908527
57644 908527 892915 880800 870208 861048 854554 850008 845321 840605 837858 837150 836353 834784 833930 834345
57630 834345 834886 835368 837052 840083 843215 846417 850998 856717 861495 864501 866973 869448 870729 870271 869287
57615 869287 868860 868997 869960 872413 875780 878458 880066 881706 883853 885919 887921 890595 893715 896288 898405
57600 898405 900951 903624 905401 906807 909397 912985 915717 917029 918208 919824 920914 921000 920762 920424 919516
57585 919516 918419 918030 917793 916270 913793 912322 912432 912740 912576 912863 913924 914751 915025 915729 917076 917819 917289
57568 917289 916324 915710 915429 915868 917951 921552 925407 928910 932403 935649 937849 939335 941425 944432 947560
57553 947560 950722 954476 958198 960504 961654 963398 966285 969337 972597 977572 984618 992120 998957 1005685
57539 1005685 1012721 1019368 1025329 1031231 1037074 1041991 1046133 1050862 1056537 1061962 1066577 1071313 1076720 1082176
57525 1082176 1087568 1093806 1101015 1108077 1114697 1122054 1130697 1139528 1147667 1155501 1163100 1169325 1173565 1176919
57511 1176919 1180712 1184988 1189150 1192966 1196439 1199801 1203947 1209767 1216907 1224396 1232359 1241652 1252014 1262276
57497 1262276 1272287 1282815 1293680 1303902 1313648 1323874 1334013 1342227 1348167 1353238 1357893 1361029
57485 1361029 1362496 1363889 1366258 1369186 1372652 1377529 1383656 1389637 1395264 1401920 1409900 1417622 1424251 1430748
57471 1430748 1437419 1442768 1445999 1448563 1452034 1456344 1461097 1466711 1473186 1479661 1486184 1494119 1503831 1513858
57457 1513858 1523187 1532412 1541778 1550341 1558162 1567114 1578148 1589755 1600478 1611068 1622753 1635201
57445 1635201 1647597 1660093 1672869 1685350 1697555 1710635 1724941 1739199 1752637 1766208 1780691
57434 1780691 1795388 1809681 1823949 1837913 1850259 1861152 1872884 1886549 1900259 1912241 1923553
57423 1923553 1935938 1949093 1962105 1975648 1990576 2005922 2020416 2034551 2049212 2063751 2077526
57412 2077526 2091928 2108711 2127359 2146117 2164509 2182926 2200843 2217518 2233585 2250071 2266621
57401 2266621 2282376 2297721 2313475 2329308 2344612 2359980 2376161 2392600 2408724 2425651 2444741
57390 2444741 2465304 2485611 2505364 2525351 2545468 2565066 2584714 2605805 2628773 2653191 2679019
57379 2679019 2706139 2733235 2758736 2782498 2805252 2827099 2847978 2868842 2890669 2912826 2933934
57368 2933934 2953895 2973554 2992985 3011694 3030158 3049601 3070442 3092207 3114638 3137726 3161103
57357 3161103 3184538 3208546 3233399 3258150 3281782 3304700 3327956 3351761 3375916 3400951 3427439
57346 3427439 3454802 3482041 3509047 3536128 3562991 3589338 3615611 3641964 3667529 3692022 3717026
57335 3717026 3744171 3772911 3801633 3829975 3858452 3886792 3914550 3942641 3972351 4003348 4034367
57324 4034367 4065262 4096654 4128211 4159192 4190236 4222643 4256188 4289447 4322051 4354802 4387830
57313 4387830 4420504 4453186 4487293 4523422 4560788 4598567 4636518 4674427 4712197 4750312 4789023
57302 4789023 4827423 4864618 4901318 4938845 4976987 5014393 5050704 5086727 5122775 5158453 5193843
57291 5193843 5229344 5264519 5298671 5332342 5366728 5401835 5436761 5471535 5507026 5543228 5579282
57280 5579282 5615045 5651006 5686903 5722222 5757986 5796110 5836789 5878255 5919303 5960475 6002471
57269 6002471 6045084 6088007 6131319 6174891 6218593 6263110 6309165 6355933 6401671 6445873 6489315
57258 6489315 6532195 6574030 6615312 6657222 6699445 6740253 6779105 6817250 6855347 6892547 6928593
57247 6928593 6964811 7002039 7039354 7075886 7112383 7149902 7188381 7227533 7267846 7309578 7351993
57236 7351993 7394617 7438180 7483281 7529149 7574675 7619634 7663936 7706678 7747125 7785789 7823440
57225 7823440 7859635 7893247 7923956 7952321 7978794 8003419 8026116 8046705 8065102 8081870 8098075
57214 8098075 8114234 8130059 8145536 8161385 8178051 8195129 8212397 8230570 8250491 8272405 8296552
57203 8296552 8323501 8353200 8384660 8417427 8452547 8491138 8532740 8575894 8619535 8662898 8704941
57192 8704941 8745181 8784541 8824089 8863178 8899994 8933684 8964761 8993457 9018871 9040010 9056797
57181 9056797 9069817 9079789 9087453 9093290 9097052 9098017 9095808 9090478 9081764 9068869 9051237 9029060 9002758
57168 9002758 8972276 8937129 8896957 8851969 8803014 8751298 8697878 8643435 8588537 8533878 8480072
57157 8480072 8427626 8377570 8331778 8292044 8258904 8231877 8210684 8195544 8186376 8182489 8183194 8187977
57145 8187977 8195785 8204773 8213030 8219106 8221695 8219518 8211668 8197330 8174960 8142730 8100266 8049137 7991185
57132 7991185 7927415 7859127 7788987 7719923 7653873 7592514 7538081 7492103 7454259 7423791 7401000
57121 7401000 7385727 7375290 7365895 7355436 7343291 7328515 7310678 7291878 7275625 7264495 7261279 7271256
57109 7271256 7299981 7349428 7419552 7512862 7633683 7784184 7966559 8189589 8468600 8819587
57099 8819587 9259395 9811703 10506010 11370476 12434076 13736895 15328374 17252170 19541809
57090 19541809 22231058 25349677 28896147 32822905 37049781 41464478 45889398 50077584
57082 50077584 53792739 56904052 59378910 61192832 62303659 62743586 62690514 62381338 61935795
57073 61935795 61279699 60233762 58654210 56498227 53804500 50650849 47128565 43335264
57065 43335264 39378089 35375894 31448998 27701189 24210978 21034464 18205546 15730508
57057 15730508 13590548 11755213 10192024 8865839 7739284 6779753 5962806 5267253
57049 5267253 4672022 4159955 3719683 3341152 3013314 2727864 2480520 2266258 2077298
57040 2077298 1907712 1755851 1620227 1497046 1383793 1281166 1189200 1105135 1027167 956512
57030 956512 893673 836306 782909 735058 693761 657023 623142 593008 567069 543490 521496
57019 521496 503158 489511 478170 467159 457885 451937 448156 445452 445573 450532 460143 474632 496788
57006 496788 528894 570395 621623 687698 776428 894579 1047720 1239427 1466063 1713374
56996 1713374 1960377 2184583 2362449 2470618 2494108 2434480 2307825 2135666 1939027 1737182
56986 1737182 1545824 1374597 1227672 1105963 1007303 926454 857949 798674 746458 698043
56976 698043 650709 604409 560057 517117 475043 435462 400386 369475 341391 316541 296075
56965 296075 279381 265155 254037 247874 247197 251616 261817 278873 302067 329160 357994 386093
56953 386093 409643 424825 429714 423774 406940 380854 349666 317626 286729 257961 233210 214056
56941 214056 200058 190174 184676 184031 187414 194290 206113 224642 250027 282240 322324 369665 419402
56928 419402 464889 501492 526117 535162 526342 501765 466631 425479 381607 338550 299171 263884
56916 263884 232082 204513 182137 163794 147508 133216 121868 112810 104527 97076 91332 86736
56904 86736 82182 78268 76185 75337 74573 74785 77630 82531 87725 93524 101714 112421 124454 138216
56890 138216 155429 176342 200122 227619 260678 298531 337424 373735 404997 428200 440181
56879 440181 440293 430502 412821 388853 361661 335329 312171 292430 276685 266298 261420 260990 265094
56866 265094 275320 292733 317624 351464 396976 455790 527279 609196 697311 784507 862208
56855 862208 923001 961091 971997 954895 915030 861248 801009 739324 681093 630969 590911
56844 590911 560696 540879 532704 535508 547404 568884 603036 652240 717720 802171 908722 1035543
56832 1035543 1173786 1311588 1437402 1538911 1602880 1619750 1588269 1515253 1412376 1293232
56822 1293232 1170291 1052041 943053 846551 765236 699652 648241 609975 585361 574605 576930
56811 576930 592550 623627 672474 739873 824709 922796 1025493 1121364 1199877 1252580 1272118
56800 1272118 1254070 1201028 1122533 1029800 931783 835707 747683 670945 605487 550720 506935
56789 506935 473720 449364 433016 425555 427506 438101 457288 486460 525761 572162 620977 667547
56777 667547 706691 732630 741072 730547 701559 656290 599643 538362 477855 420885 369334 324934
56765 324934 287642 255514 227201 202935 182624 165201 150532 139695 132433 126509 120548 115387
56753 115387 111629 108126 104076 100479 98142 96104 93335 90261 87480 84669 81871 80077 79483 78906 77825
56738 77825 77135 77071 76451 75000 74267 75037 75952 75934 75884 76601 77139 76672 76023 75870 75373 74166 73775 75461 78419
56719 78419 81589 85350 89758 93151 94423 95041 96808 99107 100313 100605 101390 102951 104435 105336 105507 104594
56703 104594 102696 100720 99082 97169 94845 93015 91767 89660 86012 82224 79597 77527 75142 72984
56689 72984 71670 70630 69716 70362 73448 77553 80956 83963 87736 92390 97908 105370 115428 126777
56675 126777 137813 148597 159698 170404 179703 187765 194977 200759 204775 207954 210813 212124 210749
56662 210749 207449 203493 198935 193762 189155 185945 183203 179955 176888 174919 173685 173034 174306 178273
56648 178273 183310 187457 190819 194152 196727 197669 197934 198808 199653 199141 197535 195839 193913 191339 188869
56633 188869 187085 184925 181500 178102 176400 175882 175055 173912 173165 172370 170926 169742 169708 169708 168334 166388
56617 166388 165425 164923 163249 160474 157936 155878 153787 152225 152060 152551 152358 151760 151882 152437 152266 151399 150656
56600 150656 149963 148911 148133 148331 148865 149091 149891 151971 153981 154502 154712 156667 160000 162777 164684 166909
56584 166909 169635 172114 174584 177792 181186 183652 185407 187242 188828 189863 191739 195729 200531 204074
56570 204074 206808 210736 216106 221695 227569 234918 243807 253692 265586 281169 300273 321601 345177
56557 345177 371543 399223 425564 449433 470605 487492 498439 504683 509133 512661 514362 514801 515792
56544 515792 517179 516920 514304 510370 505291 498233 489713 481234 472593 462310 450666 439480 428769
56531 428769 416544 402248 387761 374628 362650 351424 340906 330403 319310 308885 301051 295577
56519 295577 290779 286527 283956 282485 280072 276381 272907 270006 266566 262643 259554 257253 254351 250759
56505 250759 247553 244277 239419 233646 229445 227162 224446 220088 215470 211717 208296 205031 202701 201008
56491 201008 198626 195837 194548 195229 196384 197369 199047 201386 203262 204954 207833 211206 212609 211802 211328
56476 211328 212330 213005 212122 210978 210708 210538 209971 210004 210986 211709 211708 212087 213165 213811 213881 214760 216645 217851
56458 217851 217613 216946 216031 213595 209820 207088 206719 207507 208381 209844 211895 213352 214226 216014 218712 220400
56442 220400 220755 221935 224780 227231 227882 228087 228924 229036 227324 225174 224117 223651 223046 223019 223941 224602 224325
56425 224325 224315 225545 227297 228901 230687 232216 231995 230102 228600 228214 227144 224376 221482 219725 218073
56410 218073 215647 213612 213018 213031 212778 212784 213351 213852 214681 217431 221972 225978 228400 230673 233488 235490 236485
56393 236485 238649 242858 246901 249068 250502 252269 253231 252851 253069 255164 257537 258747 260054 262897 266538
56378 266538 270232 274977 281081 286798 291455 297052 304601 311797 316615 320197 323747 325677 324727 323166
56364 323166 323851 326463 329365 332693 336712 339533 339562 338239 337603 337083 335279 332831 330878 328714 325637
56349 325637 323151 322745 323413 323781 324634 326901 329310 330600 331932 334576 337395 339179 341243 345031 349335
56334 349335 352676 356270 361803 368326 374164 379895 386572 392960 397448 400855 404636 408195 410664 413259
56320 413259 417051 420347 421198 420649 420690 420885 419879 418380 417814 417707 417131 416942 418118 419794 421362 424311
56304 424311 429454 434795 438889 443698 451117 459329 465991 472505 481392 491664 500610 508328 516747 525773
56290 525773 533993 541780 550384 559284 567494 575978 585961 596551 606742 617701 630283 642654 653368
56277 653368 664305 677333 690793 702815 715418 731482 750216 769603 790772 815714 843109
56266 843109 870876 900648 935151 973323 1012762 1055144 1104375 1160964 1222966 1291012 1367727
56255 1367727 1453509 1547611 1652239 1771031 1904592 2051812 2214216 2394419 2591569 2802888
56245 2802888 3028474 3269711 3523857 3784778 4048040 4310678 4566877 4808578 5029705
56236 5029705 5225584 5389345 5513648 5595323 5634250 5629067 5578800 5487551 5362562 5208293
56226 5208293 5027018 4824144 4607749 4383281 4153395 3922329 3695539 3475428 3262004
56217 3262004 3057216 2864205 2683062 2511939 2351494 2203739 2067664 1940817 1824024
56208 1824024 1719438 1625094 1536847 1454658 1381408 1316408 1255921 1199430 1149413 1105252 1063387
56197 1063387 1023423 988171 957549 928299 900030 875744 855956 837856 820741 806752 795779
56186 795779 785089 774520 766685 761510 755853 749014 743398 739372 734686 729282 725439 722909 719224 714958
56172 714958 713245 713969 713973 713099 714321 717792 720676 723095 728186 735954 743132 749512 758221 769251 779094
56157 779094 787457 797961 811412 824808 837902 854196 874324 894919 915297 938781 966156 994382
56145 994382 1023345 1057479 1098973 1145520 1196387 1254604 1321693 1396448 1480482 1578829 1693506
56134 1693506 1822370 1965233 2124170 2296082 2471387 2641782 2803353 2951489 3080487
56125 3080487 3190315 3286968 3373961 3449653 3513859 3569368 3614838 3643796 3653479 3648103 3631437
56114 3631437 3603147 3564276 3518470 3464829 3396456 3308751 3202624 3078021 2932421 2768665
56104 2768665 2596837 2425487 2257764 2097958 1953441 1827019 1715028 1615871 1532818 1465836
56094 1465836 1409052 1359490 1320134 1291236 1267089 1244881 1228241 1218335 1210049 1200885 1195022 1194378
56082 1194378 1194185 1191831 1191546 1195834 1200722 1204152 1210622 1222675 1235971 1247498 1260388 1276028 1289957
56069 1289957 1300341 1311820 1326129 1337735 1343758 1349319 1357888 1365386 1369159 1373661 1381692 1389145 1394028
56056 1394028 1401428 1413856 1426078 1435319 1446954 1464069 1481220 1494809 1509766 1529472 1549096 1565575
56044 1565575 1584087 1607726 1630966 1650393 1671588 1698228 1724924 1748246 1774144 1806846 1841197
56033 1841197 1873636 1909545 1951868 1994010 2032328 2073924 2123504 2174529 2222235 2272919 2330898
56022 2330898 2388894 2441337 2494584 2553726 2612174 2664901 2718950 2779845 2840933 2897504 2957854
56011 2957854 3028550 3102537 3173912 3250117 3336806 3425366 3508754 3594922 3690934 3789252 3884086
56000 3884086 3985460 4101870 4225036 4347465 4478489 4626511 4782422 4937940 5103041
55991 5103041 5287282 5481762 5678248 5887591 6119588 6363860 6611340 6874859 7166928
55982 7166928 7477912 7798999 8145010 8530342 8944978 9379800 9851956 10378187 10948281
55973 10948281 11553888 12217390 12961814 13780580 14670171 15662914 16792493 18060002 19473060
55964 19473060 21084226 22950373 25094106 27552715 30426208 33833479 37876831 42709062
55956 42709062 48578782 55748451 64445945 74988972 87902053 103877389 123809415
55949 123809415 148993113 180904922 220087457 264902668 311536947 355354300 392145258
55942 392145258 418315407 430829065 427990696 410533680 381601316 345434443 306010111
55935 306010111 266517557 229318858 195841341 166548732 141282449 119716077 101518982
55928 101518982 86299331 73624907 63119889 54461051 47313904 41361311 36376863
55921 36376863 32203792 28684636 25670549 23073008 20843640 18917063 17221150 15722811
55913 15722811 14413310 13262253 12228405 11299960 10482104 9757606 9097370 8496660 7964356
55904 7964356 7488107 7044313 6631502 6261284 5926497 5609216 5310591 5042901 4800645
55895 4800645 4567689 4345079 4144907 3964188 3790328 3625177 3478941 3347048 3216691
55886 3216691 3089779 2976679 2873686 2769014 2665085 2573078 2490886 2407644 2325007 2253263
55876 2253263 2190877 2127817 2065136 2011986 1966967 1920850 1874327 1835252 1801651 1764718 1725425
55865 1725425 1691603 1661881 1628841 1594765 1568107 1547496 1525100 1502898 1489787 1485096 1480315 1474789
55853 1474789 1474418 1476606 1471274 1455548 1433787 1405087 1364658 1316002 1268165 1222202 1173160 1123464
55841 1123464 1081040 1045728 1010736 976271 948758 927603 905706 882466 863834 849903 834674
55830 834674 817944 805595 798091 790060 781184 776384 775232 772087 766679 763954 763553 760083 753890 751223
55816 751223 753527 756523 759765 767034 777317 785415 791610 800902 812564 820283 822826 824803 826556 823191
55802 823191 814220 804606 795383 782529 765967 750522 737004 721277 703046 686740 672736 656478
55790 656478 637502 620759 607876 595455 583204 575364 572712 571235 570081 572947 580249 587730 594132
55777 594132 602495 612500 619191 620766 620290 618450 612163 601825 592514 586273 580232 573701 569959 569487
55763 569487 568466 565651 563856 563153 559473 551675 543337 535983 527040 515915 505410 495590 482864 466774
55749 466774 451196 437385 422422 406080 392460 382922 373921 363749 355085 349006 342848 336004 331624
55736 331624 330547 329701 328416 330097 335554 340793 343585 346234 349709 351171 349600 347869 346845 343384
55722 343384 336730 331067 328913 327521 324498 321612 320316 318793 316275 315277 316801 318131 317891 318557 321590
55707 321590 325004 328040 333174 340966 347897 351989 355733 360764 364379 364190 361727 358738 354349 348543
55693 348543 344107 342431 341421 339875 339723 341727 343501 344199 346603 352007 357470 360801 363927 368660 373480
55678 373480 377245 381763 387789 392629 394635 396081 398701 400383 399272 397338 396844 396844 396075 395801 396956 397850
55662 397850 397441 397535 399254 400714 400553 400153 399898 397049 390139 381873 374880 368035 359706 351168 343852 336509
55646 336509 327981 319767 313193 307103 300829 296180 293958 291806 288114 284850 283908 283928 283280 282823 283015 281667
55630 281667 277487 272703 269331 265941 260823 255177 250373 245212 238867 233430 230583 228621 225609 222544
55616 222544 220650 218669 215749 213849 214237 214676 213225 211797 212600 214055 213714 212489 212459 212956 212431 211884
55600 211884 212987 214812 215655 216108 217264 217897 216532 214346 213115 212245 210629 209306 209456 209834 209074 208410
55584 208410 209332 210696 210998 211263 212769 214127 213647 212490 212442 212679 211845 211228 212679 215238 216945 218169
55568 218169 220113 221949 222660 223906 227742 233015 237164 240158 243648 247663 251110 254231 257691 260561
55554 260561 261802 262408 263589 264467 264043 263603 264528 265686 265771 266218 268694 271535 271923 270023 267825 265414
55538 265414 261548 256475 251010 244193 234913 224587 215269 206560 197405 189329 184525 182012 179076 175516
55524 175516 173132 172052 170872 169601 169269 169316 168409 167230 167483 168767 169238 168746 168662 169338 170289 172023 174990
55507 174990 177552 177745 176300 175376 175191 174493 173389 172902 172524 170942 168529 166703 165613 164781 164830 165984
55491 165984 166135 163260 158698 155256 153199 150979 148662 147375 146379 144137 141621 141261 143128 145321 147606
55476 147606 151412 156561 161221 164889 168416 171314 172170 171703 172279 174223 175439 174927 174020 173833 173977 174054
55460 174054 174260 174343 173925 173745 174672 175912 176107 175643 175741 176072 175544 174694 174775 175242 174756 173986 174657 176337 176984
55441 176984 176305 175787 175766 175224 174239 173935 174185 174001 173837 174846 176203 175929 174180 172922 172583 171821 170501
55424 170501 169959 170295 170219 169733 170273 171955 173270 173726 174283 175103 175297 175045 175520 176632 177177 177206 177840 178890
55406 178890 179192 179146 180289 182369 183546 183523 183801 184687 184773 183608 182325 181341 179903 178058 176641 175233 172654
55389 172654 169513 167737 167531 167393 167064 167711 169174 169942 169977 170630 171571 170897 168657 167184 167365 167591 167079
55372 167079 167202 168593 169828 170073 170459 171748 173006 173542 173957 174504 174575 174347 174666 174958 173745 171568 170677
55355 170677 171340 171400 170148 169630 171147 173335 174858 176119 177173 176752 174809 173433 173800 174584 174664 174826 175410
55338 175410 174917 172651 170454 169994 170420 170418 170548 171659 172740 172251 170288 167965 165848 164228 163619 163833 163827
55321 163827 163285 163103 163741 164652 165808 167873 170350 171610 171483 171666 172815 173547 173189 173072 173910 174319 173372
55304 173372 172353 172396 172504 171609 170687 171072 172343 173517 174776 176431 177671 177855 177720 177982 178086 177559 177105
55287 177105 177223 177221 176783 176822 177619 177805 176588 175391 175747 177020 177667 177477 177191 177131 177417 178396 179751 180370 180009
55268 180009 179753 180085 180086 179367 178985 179426 179538 178624 177780 177908 178235 178118 178458 179804 180825 180290 179023 178386
55250 178386 178358 178585 179671 181778 183520 183922 184081 185244 186696 187226 187282 187885 188638 188597 188017 187602 187087 186097
55232 186097 185286 185068 184359 182156 179332 177351 176286 175595 175688 177040 178726 179495 179529 179696 179925 179701 179325
55215 179325 179343 179541 179663 180163 181110 181428 180440 179073 178365 177968 177341 177096 177768 178492 178338 177795 177581 177269 176494
55196 176494 176160 176944 177913 178157 178466 179686 180803 180516 179487 179106 179141 178585 177802 177760 177967 177247 175921 175246
55178 175246 175240 174879 174011 173342 172966 172540 172431 173166 174230 174863 175557 177264 179706 181845 183445 184780 185502
55161 185502 185261 184836 185202 186064 186612 187010 187756 188377 188273 188052 188526 189171 189188 189291 190713 193055 194830 195579
55143 195579 195831 195575 194500 193273 192855 192894 192416 191670 191686 192310 192291 191184 189745 188637 187973 187816 187967 187672
55125 187672 186662 185939 186412 187455 188051 188461 189364 190212 190114 189599 189819 190590 190929 190973 191646 192836 193629 193997
55107 193997 194639 195475 195870 196032 196647 197498 197935 198368 199680 201538 202814 203376 203939 204490 204444 204050 204078 204372
55089 204372 204181 203666 203607 203907 203920 203972 204997 206899 208653 209799 210496 210555 209935 209737 211050 213080 214024 213522
55071 213522 212722 212319 212205 212769 214663 217277 219096 219637 219610 219252 218014 215887 213618 211634 209897 208625
55055 208625 207928 207107 205612 204233 203949 204184 203742 202836 202447 202329 201594 200771 201151 202383 202881 202512 202664 203588
55037 203588 203852 202738 201120 199632 197937 196258 195691 196390 197148 197374 197885 199173 200429 200904 200854 200644 200184
55020 200184 199718 199882 200523 200710 200260 200063 200605 201374 201978 202622 203209 203205 202691 202469 202860 203395 203769 204128 204480
55001 204480 204834 205660 207058 207943 207441 206624 207242 209128 210688 211597 212985 215048 216691 217731 219296 221653
54985 221653 223642 224755 225824 227097 227573 226893 226083 225745 225243 224363 223974 224284 224150 223075 222211 222392 222717
54968 222717 222127 221010 220204 219712 219420 219911 221431 222999 223596 223493 223673 224610 226199 228170 230069 231568
54952 231568 233049 235054 237086 238009 237686 236972 236062 234348 232122 230833 231148 232265 233575 235451 237822
54937 237822 239648 240660 242137 245063 248824 252580 256660 261700 267586 274154 281881 290961 300566 309710
54923 309710 317904 324518 328610 330035 329509 327038 321583 313047 303317 294389 286523 279055 271918 265437
54909 265437 259548 254154 249510 245567 241714 237706 234035 231000 228461 226897 227393 229977 233149 235778
54895 235778 238285 241302 244408 246988 249218 251354 253239 255337 259103 265313 272996 280874 288927 297635
54881 297635 306592 314810 321586 326361 328549 328259 326296 322838 317074 308885 299778 291320 283569 275869
54867 275869 268259 261202 254804 249114 244438 240640 236924 233012 229677 227525 226180 225193 224710 224567 223911
54852 223911 222579 221757 222317 223445 223802 223218 222374 221671 221222 221156 221136 220357 218648 216776 215134 213188 210751
54835 210751 208616 207239 206079 205041 205164 206827 208541 208739 207742 206806 206289 205976 206203 207269 208473 208971
54819 208971 208992 209173 209395 209330 209407 210136 211147 211885 212620 213846 215336 216628 217738 218564 218473 217395 216511 216903
54801 216903 218377 220399 223131 226499 229331 230669 231099 231631 232165 232279 232565 233695 234912 234995 234217 234023
54785 234023 235137 237254 240125 243727 247583 251076 254221 257396 260781 264795 270404 278013 286712 295483
54771 295483 304389 313581 322042 328574 333311 336932 338998 338408 335041 329732 323057 315368 307579 300660
54757 300660 294658 289205 284555 281021 277969 274585 271249 268928 267545 266114 264216 262226 260366 258551
54743 258551 256946 255752 254709 253630 252966 253033 253267 253242 253814 256157 260224 265188 270871 277582 285069 292816
54727 292816 300919 309479 317480 323459 326935 328159 326978 323148 317376 310842 303935 296495 288881 281679
54713 281679 274768 267854 261580 256949 253920 251645 249735 248263 246885 245105 243136 241501 240097 238527
54699 238527 236913 235549 234391 233778 234732 237386 239930 240476 239220 237489 235612 233390 231724 231754 232857
54684 232857 233416 233216 233225 233424 232867 231744 231270 231497 231264 230543 230786 232464 234055 234112 232828 231037 229148 227615
54666 227615 227065 227312 227395 226991 226709 226728 226447 225779 225442 225532 225087 223674 222271 221979 222810 224146 225496 226451
54648 226451 226814 227111 228097 229576 230660 231244 232088 233330 234166 234236 234106 234066 233716 233123 233136 234018 234924 235257 235447
54629 235447 235809 235744 234711 233047 231212 229183 227235 226366 227043 228231 228479 227546 226386 225927 226423 227538
54613 227538 228569 228796 227999 226589 225277 224828 225797 227911 229942 230883 231108 231626 232552 233286 233970 235427 237561
54596 237561 239073 239186 238626 238397 238464 238168 237312 236350 235927 236396 237384 237875 237216 235909 234850 234137 233405 232949
54578 232949 233362 234284 234730 234607 234710 235180 235248 234668 234158 234133 234170 234066 234244 234715 234767 234182 233854 234658 236456 238527
54558 238527 240195 240843 240223 239050 238468 238739 239197 239478 239770 239878 239301 238433 238459 239693 241187 242318 243552
54541 243552 245258 247011 248589 250486 252875 255173 257165 259428 262054 264135 265243 266315 268202 270348
54527 270348 271777 272554 273276 273843 273691 272795 271614 270289 268507 265975 262769 259510 257209 256319 255956 254827
54511 254827 252956 251540 251073 250834 250498 250860 252302 253805 254298 254006 253597 252931 251590 249951 248839 248559
54495 248559 248908 249601 250142 249919 249029 248425 248702 249321 249542 249510 249829 250661 251762 252872 253633 253708 253426 253686 254881
54476 254881 256490 258077 259867 261902 263455 263890 263542 263288 263795 265390 267957 270642 272480 273617 275042
54461 275042 276855 277875 277418 276388 275909 275919 275824 275615 275524 275311 274726 274041 273582 273335 273416 274000 274371 273198 270453
54442 270453 267911 266911 266731 266160 265469 265492 265692 264762 262732 261019 260541 260936 261555 262164 262595 262611 262201 261516
54424 261516 260577 259525 258991 259657 261547 264054 266484 268356 269596 270649 271997 273378 274109 274267 274698 275595
54408 275595 276028 275429 274550 274291 274497 274728 275361 276979 279212 281097 282159 282509 282399 282345 283152 285097 287555
54391 287555 289872 292019 293928 295062 295346 295635 296519 297440 297798 298076 298921 299939 300423 300580 300895 300848 299497
54374 299497 296997 294486 292725 291684 291107 290621 289674 288236 287194 287335 288388 289853 292071 295450 299179
54359 299179 301980 303905 306306 310153 315254 320983 326858 332498 337736 342668 347033 349954 350935 350625 349784
54344 349784 348028 344553 339635 334386 329302 324117 318814 313747 308895 304046 299644 296545 294883 293982
54330 293982 293301 292741 292179 291560 291349 292090 293493 294674 295147 294975 294190 292873 291622 291019 290692 289731 288050
54313 288050 286550 285878 285711 285410 284768 284004 283480 283455 283753 283686 282674 280822 278636 276491 274706 273710 273595
54296 273595 273832 273896 273818 273764 273556 273159 273108 273858 275140 276506 277965 279457 280328 280118 279392 279026 279127 279379 279914
54277 279914 280952 282008 282334 281755 280495 278730 277077 276784 278356 280535 281675 281640 281377 281247 281007 280911 281433
54260 281433 282185 282401 282303 282816 284098 285602 287383 290000 293107 295469 296536 296932 297274 297596 297986 298665 299278
54243 299278 299079 298023 296768 295592 294264 292955 292165 291661 290597 288928 287660 287375 287485 287275 286852 286724
54227 286724 287162 288258 289974 291884 293429 294514 295344 295822 295755 295450 295277 294879 293743 292391 291911 292334 292643
54210 292643 292437 292439 293054 293603 293438 292878 292526 292386 292071 291317 290012 288296 286755 285920 285572 285233 285264 286548
54192 286548 288989 291309 292566 293055 293506 294244 295375 296964 298652 299823 300390 300714 300623 299321 296570 293193
54176 293193 290130 287707 285998 285094 284682 284127 283348 282950 283203 283540 283342 282593 281539 280433 279804 280176 281176
54159 281176 281652 281059 280074 279483 279204 278892 278804 279370 280290 280723 280245 279202 278176 277416 276793 276242 276138 277001
54141 277001 278734 280558 281983 283420 285380 287595 289524 291268 293220 295262 297153 299316 302226 305307
54127 305307 307502 308774 309991 311459 312654 313344 313804 313908 313226 312148 311738 312184 312511 312109 311494 311232 311227
54110 311227 311538 312800 315207 317869 319807 320956 321825 322838 324362 326627 329093 330531 330228 328783 327439
54095 327439 327005 327517 328474 329340 330189 331737 334267 336934 338905 340828 344149 349307 355789 363709 373762
54080 373762 385461 396884 406627 414738 421248 425039 424955 421193 414959 407366 399069 390319 381142 371989
54066 371989 364105 358414 354254 350363 346831 344675 343565 341803 338860 336183 334818 333933 332557 331223
54052 331223 330792 330970 331142 331673 333243 335688 338368 340937 343087 344450 345458 347381 350798 354976 359348
54037 359348 364410 370477 376853 383281 390936 400803 412049 423253 434393 446389 459443 473037 486857
54024 486857 500545 513125 523788 532739 540272 545663 548086 548140 547351 546596 545964 545669 546023 546776 547363 547521
54008 547521 547018 545342 542391 538904 535385 531217 525659 519015 511937 504326 495984 487671 480307 473628
53994 473628 466792 459863 453544 447822 442053 436151 430593 425472 420554 416085 412529 409698 407107 404990
53980 404990 403959 403766 403383 402271 400725 399005 396950 394496 391879 389285 386766 384441 382402 380673 379519
53965 379519 379295 379578 379120 377307 374962 373060 371464 369810 368763 369169 370589 371948 373231 375239 377959
53950 377959 380515 382622 384922 387887 391469 395805 401146 407048 412711 418253 424710 432581 441241 449987
53936 449987 458867 468157 477630 486631 494585 501440 507866 514803 522474 530241 537877 546590 558275 574266
53922 574266 595203 621157 650718 680492 706689 727085 740776 746857 744825 736039 723376 709341
53910 709341 695426 682960 673177 666335 661985 660239 661673 665932 671712 678333 686157 695091 703911 711578
53896 711578 718204 724065 728572 730932 731179 729865 727189 723095 717915 712310 706632 700703 694187 687001
53882 687001 679295 671057 661846 651182 639265 626948 614825 602828 590941 579614 569012 558556
53870 558556 547938 537999 529769 523043 516778 510467 504245 498019 491487 484809 478365 471999 465343 458619
53856 458619 452271 446075 439553 432984 427050 421782 416904 412879 410350 408657 406251 402647 398790 395400
53842 395400 392163 388781 385608 382879 380340 378054 376630 376218 376052 375344 374081 372730 371810 371745 372445 373061
53826 373061 372975 372883 373904 375804 377237 377726 378102 378829 379302 379170 379059 379460 380072 380783 382034 383581 384168 383304
53808 383304 382339 382764 384306 385678 386458 387220 388416 390196 392966 397086 402179 407502 412907 418839 425568
53793 425568 433032 441329 450760 461370 472846 484862 497184 509459 521097 531395 539744 545894
53781 545894 550066 552669 553929 553986 553179 551869 550059 547603 544693 541700 538616 535108 530982 526172 520456
53766 520456 513798 506752 499864 492862 485186 477096 469374 462130 454972 448274 442983 438908 434444 428588
53752 428588 422252 416978 413157 410100 407158 404103 400967 398078 395825 394024 391968 389393 386877 385023
53738 385023 383775 382782 381865 380919 379946 379332 379362 379363 378202 375884 373766 372864 372900 373343 374286 375657 376620 376665 376501
53719 376501 376989 377791 377974 377468 377067 377349 378321 379851 381762 383699 385365 386752 387873 388768 389991 392416
53703 392416 396058 399693 402245 404018 406055 408911 412664 417506 423417 429640 435264 440087 444372 448138
53689 448138 451337 454365 457602 460682 462859 463969 464420 464471 464097 463501 463151 463327 463966 464875 465751 466192 466017
53672 466017 465473 464904 464456 464292 464691 465598 466424 466596 465991 464708 463003 461703 461895 463591 465296 465615 464798
53655 464798 464051 463826 463672 463388 463325 463538 463497 462809 461628 460199 458513 456583 454719 453378 452868 453183 453945
53638 453945 454637 455065 455478 456125 456918 457692 458499 459432 460481 461715 463293 465093 466740 468279 470322 473194
53622 473194 476362 479126 481460 483783 486273 488908 491831 495204 498894 502725 506817 511294 515913 520272
53608 520272 524180 527563 530404 533060 536242 540289 544864 549677 555053 561360 568286 575127 581410 586843
53594 586843 591188 594719 598350 602757 607768 613107 619121 626073 633241 639633 645262 650772 655962 659680
53580 659680 661158 660689 658852 655887 651995 647541 642578 636718 629836 622631 616206 611239 607603 604584
53566 604584 601387 597687 593851 590556 588119 586233 584334 582169 580053 578598 578130 578440 579193 580322 581719
53551 581719 582847 583247 583350 584018 585275 586273 586732 587553 589537 592207 594439 595713 596318 596850 597964 600021
53535 600021 602503 604368 605482 607057 610128 614276 618592 623138 628567 634911 641765 649311 658078 667798
53521 667798 677443 686502 695551 705563 717123 730262 744552 759484 775104 791978 810233 829260
53509 829260 848904 870227 894221 920332 947279 974889 1003938 1034390 1065064 1095135 1124895
53498 1124895 1154856 1185072 1215558 1246512 1277792 1308834 1339360 1369545 1399401 1428675 1457562
53487 1457562 1486768 1516570 1546335 1575275 1603212 1630412 1657158 1683697 1710165 1736305 1761600
53476 1761600 1785865 1809473 1833004 1856926 1881528 1906687 1931758 1956100 1979712 2002879 2025216
53465 2025216 2045632 2063260 2077962 2089823 2098628 2103991 2105680 2103712 2098429 2090494 2080527 2068821 2055597
53452 2055597 2041308 2026298 2010395 1993328 1975325 1956881 1938018 1918216 1896858 1873417 1847634
53441 1847634 1820136 1792413 1765450 1738649 1710948 1682677 1655312 1629604 1605121 1581740 1560422
53430 1560422 1542081 1526692 1513977 1504139 1497248 1492502 1488751 1485516 1483113 1482116 1482936 1485569 1489534 1494327
53416 1494327 1500140 1507839 1518166 1531256 1546840 1564377 1583026 1602153 1622046 1643560 1666943 1691601
53404 1691601 1717154 1744071 1772982 1803998 1837008 1872056 1909082 1947830 1988435 2031657 2078104
53393 2078104 2127674 2180110 2235666 2294706 2356959 2421700 2488457 2557158 2627691 2699726 2772918
53382 2772918 2847066 2922030 2997536 3072909 3147091 3219253 3289452 3358344 3426126 3492150 3555683
53371 3555683 3616584 3674892 3730095 3781272 3827902 3870232 3908792 3943593 3973656 3997306 4013039
53360 4013039 4020234 4018952 4009194 3990596 3962853 3926211 3881587 3830451 3774493 3715019 3652573 3587346
53348 3587346 3519889 3451206 3382293 3314006 3247281 3182936 3121048 3060850 3001398 2942111 2882722
53337 2882722 2823105 2763418 2704153 2645876 2588894 2533190 2478628 2425406 2374424 2326904 2283399
53326 2283399 2243408 2206195 2171605 2139717 2110267 2083042 2058368 2036277 2015380 1993557 1969886
53315 1969886 1945163 1920483 1896155 1872125 1848536 1825434 1802651 1780420 1759571 1740756 1723954
53304 1723954 1709083 1696587 1686957 1680014 1675040 1671375 1668663 1666851 1666265 1667475 1670850 1676401 1684114 1694192
53290 1694192 1706941 1722665 1741639 1763796 1788458 1814801 1842591 1872122 1903494 1936443 1970726
53279 1970726 2006015 2041345 2075337 2107190 2137002 2165079 2191532 2216601 2240646 2263486 2284250
53268 2284250 2302071 2316409 2326663 2332238 2333328 2331075 2326490 2319553 2309511 2295609 2277409 2254989
53256 2254989 2229059 2200487 2169561 2136190 2100754 2064048 2026332 1987290 1947173 1907144 1868150
53245 1868150 1830222 1793263 1757670 1723646 1690629 1657951 1625509 1593301 1560993 1528395 1495664
53234 1495664 1462617 1428614 1393784 1359509 1326913 1295586 1264651 1234386 1205779 1179022 1153648
53223 1153648 1129863 1108629 1090395 1074604 1060427 1047283 1034618 1021891 1008740 994668 978841
53212 978841 960977 942224 924199 907080 889422 869955 848813 826915 805071 784103 765015
53201 765015 748327 733520 719667 706418 694021 682551 671574 660628 649804 639642 630437 621699
53189 621699 612479 602311 591726 581668 572551 564098 556008 548413 541561 535302 529140 522832 516760
53176 516760 511533 507306 503679 500309 497257 494531 491716 488479 485141 482137 479171 475705 472206 469903
53162 469903 469101 468661 467561 466091 464858 463453 461038 457735 454462 451626 448875 445991 443193 440507 437629
53147 437629 434664 432387 431492 431893 432938 433968 434520 434364 433599 432623 431825 431287 430799 430113 429242 428544 428429
53130 428429 428952 429838 430901 432209 433807 435499 436980 437980 438341 438284 438548 439769 441674 443445 444945 446897
53114 446897 449607 452332 454444 456540 459574 463346 466589 468377 468770 468242 467127 465562 463474 460623 457084
53099 457084 453538 450613 448089 445241 441938 438852 436586 435026 433659 432156 430553 429030 427627 426107
53085 426107 424257 422360 421042 420488 420179 419619 418923 418371 417876 417390 417415 418497 420407 422382 423907 424759 424617
53068 424617 423361 421641 420492 420307 420707 421344 422255 423440 424592 425276 425016 423390 420565 417629 415734 414913
53052 414913 414267 413314 412504 412371 412838 413606 414629 415940 417409 418933 420540 422121 423376 424186 424734 425193
53036 425193 425588 426032 426672 427311 427514 427295 427269 427863 428707 429108 428945 428766 429136 430125 431391 432552 433437 434119
53018 434119 434750 435414 436068 436564 436694 436381 435879 435593 435640 435811 436089 436863 438375 440256 441988 443598 445420
53001 445420 447332 448748 449415 449775 450401 451409 452504 453373 453900 454196 454566 455338 456678 458571 460866 463301
52985 463301 465641 467936 470478 473365 476325 479102 481693 484003 485561 485978 485449 484476 483322 482099 481148
52970 481148 480833 481063 481454 481897 482631 483844 485575 487878 490715 493707 496332 498364 499966 501475 503196
52955 503196 505088 506449 506405 505062 503649 503021 502570 501336 499614 498454 497924 497000 495132 492813 490468 487878
52939 487878 485018 482476 480537 478676 476511 474535 473324 472650 472032 471623 471838 472378 472323 471096 468868 466216
52923 466216 463826 462380 462122 462493 462516 461655 460135 458571 457505 457173 457423 457818 458007 457938 457639 457008 456082 455386
52905 455386 455675 457229 459567 461863 463579 464696 465488 466162 466702 467046 467264 467423 467339 466712 465663 464862 464870 465411
52887 465411 465599 464960 463976 463397 463183 462528 460973 459127 457966 457720 457859 458024 458431 459339 460696 462514 465097
52870 465097 468563 472448 476114 479302 482070 484507 486764 488970 490805 491580 491160 490414 490220 490355 489927 488607
52854 488607 486839 485041 483281 481636 480146 478429 475943 472729 469321 465935 462332 458583 455319 452940
52840 452940 451070 449004 446355 443113 439474 435857 432710 430132 427877 425816 424102 422756 421470 419962
52826 419962 418297 416795 415881 415981 417245 419307 421649 424156 426883 429313 430471 429980 428558 427235 426482
52811 426482 426313 426790 428066 430192 433125 436659 440073 442206 442341 440938 439211 437999 437183 436111 434295
52796 434295 431716 428674 425533 422601 420146 418300 416850 415241 413016 410280 407594 405476 404100 403347
52782 403347 402979 402842 403057 403963 405652 407651 409215 409944 410073 410299 411347 413410 415866 417817 419097 420407
52766 420407 422277 424324 425877 426918 427881 428846 429569 430084 430689 431429 432074 432546 432911 433074 432917 432666 432693 433030
52748 433030 433443 433750 433737 433093 431900 430879 430573 430656 430631 430837 431935 433729 435327 436251 436539 436036 434722 433616
52730 433616 434099 436143 438322 439830 441409 443917 447110 450422 453956 457903 461679 464452 466138 467249
52716 467249 468101 468608 468468 467260 464734 461373 458249 456004 454397 453013 451854 450976 450160 449284 448490 447667
52700 447667 446351 444527 442925 442141 442049 442424 443437 444996 446309 446791 446929 447597 448942 450583 452493 454901
52684 454901 457504 459533 460632 461242 462147 463891 466388 468754 469827 469201 467585 465886 464283 462568 460947
52669 460947 459895 459383 458813 457700 456093 454407 453111 452463 452287 452066 451435 450478 449513 448823 448681 449260 450362
52652 450362 451502 452387 453105 453954 455503 458635 463787 470031 475669 479935 483389 486442 488485 488905 488092
52637 488092 486736 484922 482681 480749 479855 479762 479848 480281 481734 484295 487517 491259 495566 499813 502898 504338
52621 504338 504469 503524 501241 497576 493120 488499 483769 478727 473565 468953 465538 463418 462109 461055 460131
52606 460131 459484 458975 458218 457244 456673 456966 457976 459387 461110 462939 464373 465264 466153 467477 468832 469486
52590 469486 469315 468784 468335 468250 468729 469637 470513 471211 472178 473675 475237 476339 477083 477742 478270 478872 480345 482930
52572 482930 485377 486190 485474 484577 484195 483927 483523 483351 483470 483329 482711 482182 482189 482405 482286 481733 480895 479796 478462
52553 478462 477111 475999 475259 474879 474541 473649 471929 469916 468428 467676 467351 467365 467814 468349 468370 467905 467637 467865
52535 467865 468093 467849 467294 466783 466343 465921 465739 466034 466720 467526 468315 469172 470347 472113 474393 476673 478612
52518 478612 480721 483972 488742 494561 500892 507649 514842 522242 529585 536727 543329 548704 552217 553675
52504 553675 553233 551164 547831 543608 538679 533010 526657 519998 513649 508181 503863 500572 497948 495656
52490 495656 493420 490941 488174 485663 484078 483249 482238 480631 479143 478532 478601 478893 479746 481748 484557 487193
52474 487193 489267 491032 492449 493299 494249 496699 501263 507214 513674 520508 527670 534454 539996 544042 546716
52459 546716 547859 547024 543982 539033 532980 526874 521369 516227 510778 504975 499547 495052 491288 487849
52445 487849 484778 482296 480243 478185 475966 473854 472212 471140 470364 469463 468275 467033 465920 464663 462859
52430 462859 460630 458579 457113 456131 455382 454818 454535 454624 455142 456022 457055 458125 459284 460395 460955 460631 459790
52413 459790 459134 459027 459589 461135 463848 467098 469750 471318 472373 473786 475996 479101 483215 488600 495623
52398 495623 504606 515525 528081 542328 558912 578211 599409 620809 640678 657326 668886 674009
52386 674009 672803 666442 656002 642441 627498 613446 601616 591818 583434 576504 571558 569053 569130
52373 569130 571370 574658 577837 580650 583498 586256 588005 588031 586397 583419 579288 574484 569886 566032 562678
52358 562678 559301 555718 552215 549505 548423 549057 550276 550830 550857 551498 553188 555353 557787 560995 564871
52343 564871 568317 570793 573131 576084 579050 581217 583072 585736 589371 593244 597007 600971 605449 610695
52329 610695 617275 625589 635081 644708 654191 664098 674594 684718 693147 699258 703317 705979 707853 709415
52315 709415 711113 713435 716760 721187 726629 733079 740618 749318 759370 771196 785045 800630 817625
52302 817625 836390 857565 880921 905253 929501 953290 976244 997573 1016767 1034080 1049972
52291 1049972 1064633 1078481 1092567 1107942 1124893 1143086 1162088 1181537 1201305 1221766 1243408
52280 1243408 1265943 1288371 1310191 1331951 1354217 1376690 1398798 1420550 1442238 1463826 1485188
52269 1485188 1506451 1527527 1547742 1566551 1584213 1601222 1617397 1632145 1645278 1656954 1667126
52258 1667126 1675618 1682643 1688739 1694298 1699431 1704019 1707552 1709294 1708894 1706544 1702292 1695813 1687277 1677892
52244 1677892 1669039 1661340 1655089 1651006 1649764 1651169 1654527 1659635 1666834 1676389 1688380 1702802 1719155
52231 1719155 1736324 1753646 1771743 1791591 1813030 1835017 1857039 1879305 1901633 1923193 1943522
52220 1943522 1962947 1981756 1999687 2016449 2032085 2046475 2059011 2069114 2076711 2081926 2084695 2085003
52208 2085003 2083220 2079908 2075384 2069659 2062796 2055208 2047576 2040375 2033435 2026176 2018419 2010785 2004088 1998531
52194 1998531 1993723 1989271 1985038 1980964 1976884 1972477 1967269 1960859 1953356 1945325 1937137 1928698 1919986 1911489
52180 1911489 1903702 1896515 1889538 1882843 1876976 1872356 1868987 1866622 1864924 1863589 1862485 1861581 1860724 1859854 1859494
52165 1859494 1860395 1862396 1864241 1864972 1864905 1864670 1863940 1861896 1858474 1854204 1849004 1842112 1833269 1823252 1813165
52150 1813165 1803846 1795980 1790111 1786288 1784163 1783623 1784923 1788056 1792395 1797137 1801860 1806531 1811189 1815691
52136 1815691 1819655 1822749 1825200 1827934 1831936 1837563 1844648 1853120 1863208 1875117 1888712 1903469 1918562
52123 1918562 1933110 1946531 1958630 1969350 1978612 1986329 1992216 1995639 1996163 1994217 1990604 1985258 1977287
52110 1977287 1966504 1954118 1941493 1929075 1917215 1907237 1900809 1898719 1900956 1907421 1917691 1930541
52098 1930541 1944635 1959445 1974793 1989972 2004250 2017978 2032300 2047979 2065266 2084613 2106516
52087 2106516 2130830 2157091 2185414 2216197 2249087 2283161 2317973 2353447 2388734 2422227 2452918
52076 2452918 2480964 2506856 2530819 2553014 2573373 2591110 2605245 2615838 2623858 2629705 2632761 2632674
52064 2632674 2630221 2626585 2622520 2618576 2615321 2612771 2610141 2606619 2602005 2596358 2589539 2581427 2572125 2561634
52050 2561634 2549741 2536421 2521988 2506704 2490790 2474963 2460441 2448136 2438251 2430770 2425800 2423202
52038 2423202 2422439 2423134 2425394 2429331 2434630 2440844 2447803 2455578 2464257 2473805 2483867 2493792 2503184 2512263
52024 2512263 2521242 2529589 2536671 2542998 2549980 2558384 2567846 2578063 2589490 2602398 2615989 2628995 2640709
52011 2640709 2651029 2660006 2667738 2674229 2678927 2680770 2678993 2673521 2664342 2650986 2633045 2610842 2585153
51998 2585153 2556552 2525388 2492173 2457585 2422065 2385449 2346941 2305589 2261134 2214304 2165924
51987 2165924 2115974 2064094 2010886 1957948 1906508 1856708 1808338 1761514 1716293 1672261 1628927
51976 1628927 1586164 1544163 1503516 1465586 1432115 1404048 1381111 1362673 1348410 1337864 1330060
51965 1330060 1324053 1319376 1315540 1311550 1306283 1298947 1288823 1275096 1257517 1236970 1215046 1193272
51953 1193272 1172921 1155045 1140207 1128423 1119696 1114461 1113342 1116746 1124744 1136974 1152541 1170481
51941 1170481 1190427 1212257 1234913 1256293 1274724 1290004 1302542 1311987 1317234 1317465 1312670 1303381
51929 1303381 1290326 1274215 1255647 1235343 1214510 1194538 1176141 1159158 1143297 1128724 1115824
51918 1115824 1104879 1096142 1089706 1085195 1082226 1081482 1084740 1093438 1107530 1125829 1146733 1168299 1188277
51905 1188277 1204654 1215889 1220572 1217641 1207316 1191089 1170353 1145588 1117237 1086476 1054471 1021674
51893 1021674 988609 956707 927433 901040 876984 855209 836194 820123 806917 796956 790897 788829
51881 788829 790281 795070 803542 815944 831966 850854 871573 892925 913826 933302 950008 962261
51869 962261 969087 971014 969398 965296 959494 953166 947661 943631 940897 939041 937648 936123 933929 931063
51855 931063 927860 924366 920265 915376 909865 904053 898266 892677 886955 880251 871880 861816 850321 837522
51841 837522 823780 810068 797394 786058 775989 767565 761506 758109 757094 758056 760589 764154 768332
51828 768332 773003 777765 781442 782854 782066 780283 778542 777063 775825 775136 775444 776958 779662 783384 787784
51813 787784 792401 796662 799713 800528 798585 794337 788715 782356 775616 769037 763290 758752 755553 753890
51799 753890 753847 754985 756553 758136 759837 761853 764187 766715 769333 772084 775279 779204 783622 787906 791808
51784 791808 795600 799116 801331 801448 799927 797818 795521 792959 790672 789884 791529 795890 803049 812998 825186
51769 825186 838490 851672 863610 873263 879977 883714 884565 882268 876702 868592 859126 849056 838681
51756 838681 828476 819089 810895 804138 799152 795753 792728 788918 784675 781353 779404 777963 776389 775147
51742 775147 774858 775397 776429 778116 780723 784030 787596 791297 795219 799204 802749 805244 806420 806886 808019
51727 808019 810821 814935 819240 823263 827325 831512 835462 839417 844656 852403 862725 874668 886939
51714 886939 898159 906995 912468 914075 911856 906817 901031 896410 893217 890461 887757 885906 885527 886227
51700 886227 887553 889777 893035 896498 899123 900592 900758 898886 894464 888465 882890 879047 876897 875884
51686 875884 875563 875315 874086 870811 864987 856825 847004 836260 825013 813395 801525 789474 777027
51673 777027 763997 750963 739215 729633 722115 716348 712613 711388 712691 716511 723420 734103 748521
51660 748521 766238 787279 811897 839557 868818 898062 925520 948705 964935 972985 973617 968204
51648 968204 957546 942516 925074 907672 891733 877310 864104 852269 842294 834731 830203 829138
51636 829138 831150 834819 838250 839765 838220 833159 824985 814737 803412 791553 779575 768199 758289
51623 758289 750354 744420 740293 737745 736543 736544 737697 739762 742152 744234 745680 746256 745463 742831 738548
51608 738548 733416 728084 722648 717001 711301 706020 701750 698889 697191 695745 693860 691970 691251 692378
51594 692378 695151 699236 704532 710721 717367 724890 734769 748235 765216 784796 805977 827449 847316
51581 847316 863839 876213 884295 888226 889068 889165 890975 895836 904567 918618 939492 967203 1000444
51568 1000444 1038367 1081347 1129952 1183986 1242679 1304939 1369290 1434281 1499244 1564083 1628249
51557 1628249 1690670 1750854 1809229 1865795 1918800 1964941 2000524 2022365 2028309 2017373 1989267
51546 1989267 1943852 1881681 1805300 1719427 1629338 1539103 1451282 1367652 1289722 1218752 1155575
51535 1155575 1100401 1052772 1011913 977092 947558 922383 900850 882822 868235 856385 846340
51524 846340 837997 832012 828549 826750 825651 824979 824808 824989 825356 826094 827510 829528 831500 832419 831372 828170
51508 828170 823440 817796 811118 803115 794287 785536 777078 768722 761231 756198 754140 753713 753487 753625 755023
51493 755023 757400 759245 759497 758465 757076 755704 753901 751008 746913 742190 737387 732350 726612 720335
51479 720335 714283 708836 703640 698436 693555 689320 685538 681964 678667 675487 671766 667286 663040 660305
51465 660305 659073 658070 656373 654533 653951 655402 658320 661412 663867 665886 668078 670652 673458 676460
51451 676460 679609 682441 684475 686065 688217 691518 695889 701480 708998 718959 731350 746299 764168
51438 764168 784445 805229 824439 841065 854782 865043 871346 874081 874457 873838 873508 874486 876705 878512
51424 878512 877672 872960 864694 854131 842842 832253 823125 815524 809623 806168 805612 807021 808535 808950
51410 808950 808464 807836 807237 805960 803084 798425 792956 788136 784705 782335 780496 779257 779088 780294 782972
51395 782972 787175 792819 799712 807950 818008 830269 844888 862307 883451 909113 939644 975570
51383 975570 1017999 1068005 1126073 1192528 1267941 1352514 1445363 1544704 1648260 1753127 1855926
51372 1855926 1953742 2044350 2124936 2191251 2238961 2265418 2269265 2248948 2203137 2132948 2042836
51361 2042836 1938962 1827126 1712166 1598297 1489171 1387567 1295118 1212264 1138703 1074206
51351 1074206 1018921 972675 934353 902341 875348 852380 832331 814251 797916 783477 770601
51340 770601 758525 746869 735883 725839 716635 707991 699692 691687 684279 678038 673132 668895 664466
51327 664466 659704 655111 651121 647953 645872 644952 644752 644831 645456 647224 650081 653337 656588 659940 663348
51312 663348 666442 669240 672511 677088 683133 690199 697806 705849 714540 723809 732633 739227 742244 741585
51298 741585 737889 731696 723481 713895 703310 691624 679249 667812 658846 652059 645936 639940 634971
51285 634971 631661 629466 627890 627471 628852 631630 634947 638814 644141 651573 660731 670529 680001 688947
51271 688947 697837 706930 715446 721943 725540 726532 725895 724708 724095 725083 728049 732434 737087 740816 742777
51256 742777 742824 741591 739872 737924 735662 733322 731386 729834 728132 726017 723694 721088 717587 712896 707614
51241 707614 702565 697914 693354 688836 684677 681053 677761 674519 671352 668659 666845 665890 665389 665126 665359
51226 665359 666237 667265 667782 667779 667680 667490 666818 665831 665507 666762 669702 673791 678223 682125 685037 687471 690444
51209 690444 694296 698452 702527 707002 712459 718650 724758 730171 734645 738080 740609 742650 744456 745755
51195 745755 746166 745828 745359 745298 745803 746746 747897 749060 750131 751048 751691 751980 751944 751506 750339 748183 745217
51178 745217 741772 737891 733615 729542 726405 724068 721556 718254 714523 711016 708022 705711 704378 704024
51164 704024 704203 704617 705439 706766 708295 709939 712158 715145 718224 720744 723154 726379 730277 733524 735159
51149 735159 735636 736176 737570 739828 742520 745031 746684 747046 746251 744891 743516 742198 740559 738155 734893
51134 734893 731177 727741 725227 723717 722604 721063 718812 716339 714384 713459 713880 715869 719290 723570 728264
51119 728264 733509 739535 745922 751837 756903 761379 765509 769216 772459 775491 778615 782005 785711 789504
51105 789504 792800 795212 797144 799417 802279 805213 807671 809455 810411 810394 809790 809490 810055 811201 812204 812443
51089 812443 811476 809165 805991 802816 800072 797489 794741 791931 789360 787276 786024 785896 786581 787308 787848
51074 787848 788903 791122 794174 797239 800017 802791 805758 808865 812239 816294 821293 826994 832868 838722
51060 838722 845104 852963 862801 874425 887884 904333 925331 951308 981290 1014103 1048979 1084768
51048 1084768 1119381 1150748 1178150 1202271 1224321 1245385 1266261 1287391 1308752 1329683 1348571
51037 1348571 1362943 1370609 1370959 1364857 1353423 1337646 1319209 1300613 1283827 1269320 1256728 1245764
51025 1245764 1235901 1225787 1213766 1198848 1180923 1160645 1139656 1120399 1104870 1093574 1086042 1081989
51013 1081989 1081451 1084084 1088995 1095266 1102405 1110505 1120221 1132253 1146511 1162145 1178714 1196814 1217001
51000 1217001 1238488 1259536 1278855 1296031 1310830 1322739 1331235 1336111 1337645 1336713 1334417 1331134 1326232
50987 1326232 1319183 1310634 1301878 1293585 1285796 1278981 1274331 1272857 1274713 1279456 1286571 1295775 1307263 1321756
50973 1321756 1340069 1362804 1390750 1425247 1467482 1517540 1574688 1638469 1708847 1785207 1865905
50962 1865905 1949083 2033500 2118483 2203684 2289354 2376524 2466359 2559134 2653794 2748403 2840997
50951 2840997 2930191 3015051 3094436 3166699 3230250 3284343 3329106 3364896 3392005 3411019 3423290
50940 3423290 3430950 3436591 3442775 3451468 3463645 3479188 3496928 3514609 3529104 3537171 3536421 3525834 3505647
50927 3505647 3476844 3440492 3397203 3347114 3290287 3226985 3157528 3082147 3001116 2914957 2824448
50916 2824448 2730641 2634924 2538851 2443845 2351124 2261776 2176534 2095596 2019103 1947799 1882631
50905 1882631 1823667 1770035 1721134 1677206 1638414 1604086 1573368 1546116 1522543 1502407 1485099
50894 1485099 1470205 1457424 1446290 1436507 1428286 1421868 1416983 1413244 1410702 1409443 1409021 1408997 1409804 1412292
50880 1412292 1416530 1421833 1427964 1435583 1445309 1456912 1469713 1483323 1497736 1513024 1529206 1546393
50868 1546393 1564899 1585205 1607639 1632077 1658105 1685541 1714508 1744939 1776592 1809901 1846415
50857 1846415 1887833 1934888 1987613 2046381 2112191 2186145 2269263 2362650 2467270 2583579 2711803
50846 2711803 2852542 3006696 3174859 3357058 3552816 3760990 3979640 4206533 4439705
50837 4439705 4677084 4915553 5150582 5376631 5587776 5778496 5944577 6083348 6192947
50828 6192947 6271941 6320266 6340175 6335565 6310509 6268964 6215564 6155821 6095371 6039327 5991875
50817 5991875 5955482 5930263 5914523 5905769 5900699 5894561 5881673 5856980 5816775 5758125 5678570 5576737
50805 5576737 5452676 5307348 5142299 4960008 4763993 4558177 4346424 4132741 3921385
50796 3921385 3716360 3520922 3337632 3168519 3015029 2877940 2757433 2653114 2564158 2489682
50786 2489682 2428908 2380738 2343502 2315514 2295688 2283169 2276629 2274439 2275330 2278249 2281742 2284159 2284516
50773 2284516 2282607 2278301 2271342 2261857 2250448 2237579 2223180 2206765 2187568 2164769 2138229 2108966
50761 2108966 2078420 2047363 2016064 1985133 1955282 1926363 1897705 1869636 1843797 1821563 1802876
50750 1802876 1786971 1773623 1763272 1756509 1753868 1755718 1761978 1772184 1786105 1804105 1826858 1855082
50738 1855082 1889458 1930359 1977621 2031105 2091492 2159921 2236832 2321825 2414703 2515860 2625304
50727 2625304 2741953 2864273 2990988 3120802 3251966 3382606 3511236 3636672 3757734
50718 3757734 3873106 3980937 4078312 4161596 4227694 4274784 4301815 4308027 4293485 4259857 4210380
50707 4210380 4149230 4081038 4010573 3942365 3880345 3827391 3784811 3752418 3729617 3716263 3711851
50696 3711851 3713911 3717985 3719352 3714302 3699818 3673101 3631920 3575098 3502435 3414755 3314207 3204009
50684 3204009 3087593 2968267 2849550 2734942 2627047 2527370 2436997 2356817 2287002 2227184
50674 2227184 2177477 2138661 2111067 2094023 2086728 2089002 2100778 2121561 2150710 2187577 2230891 2278604
50662 2278604 2328623 2379149 2428151 2473475 2513953 2549697 2580859 2606996 2628131 2645422 2659983
50651 2659983 2671755 2680358 2686308 2690550 2693358 2694602 2694608 2693947 2692819 2691503 2691103 2693097 2698445 2707772 2721981
50636 2721981 2741860 2767442 2798431 2834906 2876796 2923067 2972242 3023478 3076456 3130692 3185894
50625 3185894 3242655 3301824 3363616 3428529 3498850 3577447 3664270 3754758 3841945 3919138 3980242
50614 3980242 4019153 4031034 4014954 3974996 3918588 3853809 3787625 3725271 3669903 3622297 3581369
50603 3581369 3545642 3514372 3487057 3462124 3436792 3408352 3375018 3335362 3287736 3230929 3165095
50592 3165095 3091572 3011981 2927783 2840344 2750996 2661223 2572923 2488051 2407673 2331839 2260658
50581 2260658 2194820 2134616 2079067 2026842 1977647 1932057 1890379 1852381 1817917 1787107 1760087
50570 1760087 1737170 1718984 1705873 1697421 1693148 1693343 1698500 1708182 1721245 1737000 1755442 1776570
50558 1776570 1800337 1827168 1857683 1891822 1928919 1968563 2010636 2054565 2099483 2145374 2193243
50547 2193243 2243687 2295810 2347800 2398189 2446352 2492274 2536125 2577860 2617122 2653786 2688475
50536 2688475 2722190 2755631 2789497 2825275 2864811 2908746 2955956 3004906 3055170 3107439 3162656
50525 3162656 3221723 3285808 3356340 3434498 3520707 3614638 3715566 3822667 3934897 4050727
50515 4050727 4168346 4286144 4402550 4515109 4620305 4714876 4797017 4865826 4919891 4957130
50505 4957130 4975862 4975432 4955930 4918067 4863434 4794304 4713105 4622571 4526365 4428863 4333979 4244549
50493 4244549 4162902 4091599 4033392 3990638 3964670 3955378 3961366 3980669 4011046 4049139 4089729 4126564
50481 4126564 4153929 4167009 4161297 4132956 4080227 4003897 3906185 3789817 3658257 3515893 3367271
50470 3367271 3216384 3066882 2922324 2785601 2658357 2541285 2434814 2339279 2254782 2181248
50460 2181248 2118464 2065830 2022233 1986376 1957175 1933794 1915422 1901051 1889335 1878809 1868619
50449 1868619 1859028 1850979 1845233 1842233 1842582 1846989 1855563 1867620 1882385 1899658 1919736 1943045 1969886
50436 1969886 2000178 2033256 2068079 2103573 2138603 2171786 2201835 2228046 2250138 2267800 2280949
50425 2280949 2290290 2296984 2301772 2305015 2307508 2310392 2313997 2317508 2320197 2322479 2325418 2329726 2335724 2343905
50411 2343905 2355070 2370087 2389820 2415072 2446216 2482975 2524698 2570770 2620775 2674462 2731556
50400 2731556 2791311 2852247 2912631 2971191 3027060 3079210 3126511 3168280 3204061 3232743 3252512
50389 3252512 3261891 3260236 3246985 3221161 3182138 3130502 3067766 2995750 2916697 2833642 2749971 2668651
50377 2668651 2592041 2522203 2460963 2409699 2369248 2339850 2321119 2312351 2312967 2322308 2338704 2358925
50365 2358925 2378746 2394010 2401433 2399125 2386753 2364859 2333736 2293245 2243902 2187691 2127452 2065764
50353 2065764 2004671 1945984 1891192 1840987 1795204 1753216 1714343 1678165 1644763 1614682 1588498
50342 1588498 1566534 1548975 1536086 1528258 1526041 1530044 1540297 1555458 1572856 1589535 1603184 1612228
50330 1612228 1615563 1612533 1603109 1588111 1569487 1550070 1532368 1517338 1504679 1494257 1486653 1482313
50318 1482313 1480976 1482355 1486734 1494440 1505149 1518173 1533061 1549507 1566974 1584759 1602180 1618567
50306 1618567 1633508 1647448 1661614 1677059 1694162 1713352 1735739 1762670 1795232 1834694 1882747
50295 1882747 1940222 2005336 2073415 2138090 2192511 2230237 2246415 2239062 2209563 2162197 2103062
50284 2103062 2038467 1973245 1910139 1850636 1795867 1746450 1702206 1662874 1628865 1600704 1578041
50273 1578041 1559958 1546086 1536622 1531266 1528999 1529142 1531902 1537490 1545225 1554002 1563388 1573805 1585714
50260 1585714 1598923 1612760 1626785 1641267 1657043 1675011 1695777 1719615 1746483 1776084 1808150
50249 1808150 1842665 1879528 1918098 1957605 1998187 2041021 2087104 2136231 2187355 2239408 2291367
50238 2291367 2342061 2390601 2436853 2481073 2523306 2563617 2602523 2640479 2676964 2710487 2739274
50227 2739274 2761363 2774272 2775475 2763528 2738469 2701285 2653602 2597991 2537925 2477088 2418851
50216 2418851 2366159 2321067 2283936 2253335 2226957 2202496 2177808 2150999 2120923 2087560 2051741
50205 2051741 2014653 1977591 1941728 1907825 1876184 1846877 1819754 1794263 1769666 1745655 1722468
50194 1722468 1700291 1678825 1657629 1636521 1615369 1593837 1571773 1549667 1528244 1507623 1487315
50183 1487315 1467174 1447955 1430643 1415415 1401608 1388624 1376546 1365786 1356456 1348367 1341475 1336015
50171 1336015 1332245 1330318 1330340 1332218 1335364 1338987 1342903 1347768 1354166 1361669 1369140 1375880 1382173 1388743
50157 1388743 1395993 1403809 1411740 1419232 1425938 1432130 1438749 1446884 1457088 1469189 1482673 1497088 1512021
50144 1512021 1526919 1541196 1554580 1567068 1578451 1588169 1595964 1602567 1609410 1617731 1628297 1641949
50132 1641949 1659983 1683916 1715278 1755735 1806945 1869818 1943977 2028016 2120040 2217819 2318851
50121 2318851 2420799 2522004 2621538 2719000 2814523 2908834 3002856 3096888 3189823 3278877 3359922
50110 3359922 3428329 3479843 3511075 3519723 3504783 3466597 3406572 3326981 3231251 3123948 3009669
50099 3009669 2891786 2772624 2654639 2540602 2432485 2331008 2236579 2149900 2071200 1999677
50089 1999677 1934412 1875267 1822166 1774007 1729226 1687283 1648845 1614542 1584217 1557299 1533202
50078 1533202 1511271 1490977 1472406 1456131 1442321 1430204 1418564 1406626 1394484 1382814 1372232
50067 1372232 1362801 1354255 1346694 1340765 1336941 1334921 1334063 1334158 1335450 1338165 1342441 1348548 1356729 1366904
50053 1366904 1378948 1393083 1409539 1427864 1447030 1466302 1485663 1505353 1525353 1545407 1565276
50042 1565276 1584849 1604103 1622953 1641059 1657952 1673485 1688031 1702033 1715526 1728345 1740492
50031 1740492 1751938 1762252 1770859 1777739 1783631 1789528 1796167 1803832 1812387 1821458 1830803 1840655 1851824
50018 1851824 1865567 1883080 1904589 1928926 1954516 1980937 2009050 2039616 2072621 2108319 2148115
50007 2148115 2193797 2246440 2306523 2374328 2449269 2529260 2611470 2693359 2772465 2846043 2912261
49996 2912261 2971507 3025466 3074918 3119199 3157274 3187887 3208505 3215283 3204488 3173396 3120186
49985 3120186 3044520 2948781 2837789 2716698 2589797 2461318 2335929 2217395 2107440 2006714
49975 2006714 1916241 1837077 1769022 1710673 1660723 1618627 1584034 1556171 1533901 1516107 1501956
49964 1501956 1491022 1483223 1478660 1477551 1480144 1486441 1496078 1508847 1525180 1545501 1568963 1593335
49952 1593335 1616332 1636686 1653881 1667455 1676943 1682145 1683116 1680124 1673737 1664555 1652598 1637239 1617981
49939 1617981 1595128 1569684 1542949 1516302 1490937 1467539 1446372 1427544 1410699 1394530 1377267
49928 1377267 1357975 1336939 1314793 1291996 1269429 1248640 1230779 1215680 1202573 1191381 1182684
49917 1182684 1176660 1172770 1170651 1170896 1174722 1182906 1195144 1210447 1228137 1248235 1270757 1295051 1320302
49904 1320302 1346362 1373323 1400296 1425511 1447899 1467816 1485789 1501257 1513145 1521113 1525534 1526512
49892 1526512 1523494 1515718 1502606 1483976 1460280 1432628 1402292 1370309 1337646 1305353 1274346 1245395
49880 1245395 1219581 1198190 1181632 1168819 1158191 1149101 1141728 1135978 1131263 1127278 1124258 1122315 1121086
49867 1121086 1120385 1120836 1123495 1128951 1137063 1147596 1160862 1177523 1197743 1220684 1244935 1269265 1292804
49854 1292804 1314720 1334117 1350253 1362627 1371027 1375881 1378340 1379405 1378882 1375684 1369090 1359159 1346026
49841 1346026 1329767 1311270 1292306 1274134 1256673 1239641 1223873 1210745 1200667 1192916 1186746 1182005
49829 1182005 1178774 1177047 1176761 1177776 1179965 1183702 1189997 1199662 1212413 1227298 1243803 1261976 1281459
49816 1281459 1300958 1318905 1334340 1347104 1357433 1365483 1371077 1373838 1373554 1370308 1364282 1355710 1345098
49803 1345098 1333156 1320366 1307038 1293944 1282433 1273479 1266929 1261925 1257574 1252834 1246416 1237674 1227368
49790 1227368 1216918 1206998 1197435 1188243 1179988 1173165 1167956 1164760 1164345 1167208 1173155 1181676 1192461 1205408
49776 1205408 1220434 1237349 1255699 1274726 1293765 1312621 1331264 1349195 1365470 1379398 1390949
49765 1390949 1400460 1408182 1414014 1417388 1417376 1413297 1405259 1393975 1380075 1363799 1345264 1324727 1302664
49752 1302664 1279838 1257217 1235504 1214835 1195215 1177101 1161131 1147354 1135200 1124318 1115053
49741 1115053 1107938 1103037 1099957 1098337 1098121 1099387 1101955 1105193 1108383 1111368 1114784 1119606 1126728 1137005
49727 1137005 1151169 1169212 1190013 1211974 1233977 1255514 1276163 1295386 1312778 1328242 1342038
49716 1342038 1354918 1367883 1381345 1394602 1406492 1416265 1423352 1426604 1424549 1416517 1403027 1385114
49704 1385114 1363927 1341068 1318713 1298879 1282697 1270347 1261437 1255381 1251666 1249817 1249062 1248436 1247615
49691 1247615 1247298 1248206 1249969 1251704 1253468 1256226 1260468 1265863 1272465 1281155 1292422 1305669 1320454 1337723
49677 1337723 1358978 1384756 1414686 1448536 1486076 1525944 1565532 1602190 1633881 1658540 1673677
49666 1673677 1677450 1670097 1653996 1632350 1608013 1583430 1561206 1544053 1533789 1530285 1531503 1534578
49654 1534578 1536739 1535374 1527934 1512573 1489188 1459699 1427119 1394222 1362801 1333751 1307505 1284313
49642 1284313 1264319 1247617 1234332 1224495 1217738 1213273 1210395 1208914 1208821 1209608 1210279 1210118 1209100 1207228
49628 1207228 1203797 1197751 1188887 1178337 1167650 1157483 1147412 1136999 1126780 1118051 1111727 1107603
49616 1107603 1104717 1102247 1099981 1098150 1097039 1096729 1097036 1097614 1098207 1098858 1099854 1101441 1103549 1105720 1107359
49601 1107359 1108126 1108094 1107457 1106245 1104505 1102667 1101367 1100813 1100605 1100241 1099586 1098832 1098308 1098420 1099407 1100994 1102626
49584 1102626 1104143 1105824 1107659 1109212 1110503 1112381 1115425 1119020 1122303 1125720 1130779 1138300 1147641 1157764
49570 1157764 1168446 1180284 1194030 1210041 1227979 1246887 1265889 1284807 1303710 1321964 1338254
49559 1338254 1351506 1361208 1366847 1367837 1364383 1357827 1349706 1340834 1331611 1322736 1315065 1309012 1304530 1301468
49545 1301468 1299568 1298287 1297227 1296702 1297390 1299227 1301005 1301414 1300321 1298755 1297699 1297259 1297140 1297515 1299028
49530 1299028 1302169 1307195 1314600 1325059 1338754 1355394 1375225 1399400 1428882 1463515 1502711 1546284
49518 1546284 1593583 1642170 1688513 1730092 1766098 1796308 1820645 1840180 1857415 1874735 1892953
49507 1892953 1911555 1929316 1943921 1951799 1949635 1936157 1912047 1878507 1836765 1788920 1738275 1688224
49495 1688224 1640956 1597433 1558281 1524227 1495515 1471277 1450073 1431295 1415645 1403818 1395077
49484 1395077 1387846 1381591 1377253 1375634 1376108 1377400 1378915 1380744 1382902 1385374 1388639 1393413 1399795 1407163
49470 1407163 1414934 1423061 1431782 1441260 1451502 1462346 1473461 1484499 1495283 1505733 1515771 1525343
49458 1525343 1534285 1541950 1547268 1549481 1548621 1544975 1538405 1528657 1516168 1501971 1486849 1471094 1455176
49445 1455176 1440063 1426597 1414904 1404716 1396071 1389421 1385237 1383791 1385217 1389560 1396681 1406254 1417903
49432 1417903 1431474 1447247 1465786 1487249 1510785 1534915 1558693 1582292 1606404 1631732 1659685
49421 1659685 1692974 1734066 1782350 1833494 1882064 1924168 1957131 1978020 1984625 1978222 1963925 1947507
49409 1947507 1932519 1920694 1913683 1913023 1918826 1929593 1943307 1958187 1972920 1987104 2001369 2016280
49397 2016280 2031249 2045154 2057730 2069528 2080663 2090588 2099010 2105935 2110643 2111661 2108129 2100377 2088845
49384 2088845 2073305 2053704 2030986 2006418 1980622 1953880 1926974 1901150 1877492 1856761 1839577
49373 1839577 1826332 1817118 1811966 1810929 1813761 1819841 1828576 1839414 1851285 1862589 1872140 1879764 1885652
49360 1885652 1889556 1890920 1889363 1884692 1876890 1866477 1854476 1841635 1827984 1813505 1798848 1785054
49348 1785054 1772951 1763119 1755958 1751390 1748797 1747524 1746962 1745949 1742845 1736814 1728546 1719220 1709277 1698756
49334 1698756 1688085 1677628 1666972 1655677 1644524 1635089 1628100 1622999 1619039 1616025 1614015 1613109 1613726
49321 1613726 1616508 1621663 1628759 1637162 1646317 1655800 1665621 1676381 1688642 1702250 1716837 1732914 1751834
49308 1751834 1774765 1802256 1834606 1871728 1912387 1954257 1994979 2032658 2065334 2090851 2107781
49297 2107781 2116012 2116114 2108616 2094331 2074815 2051812 2026350 1998794 1969734 1940439 1912413 1886747
49285 1886747 1863960 1844282 1828016 1815585 1807166 1802375 1800479 1800961 1803744 1808799 1815668 1823377 1830690
49272 1830690 1836452 1839889 1840776 1839428 1836496 1832685 1828478 1824044 1819469 1815056 1811255 1808337 1806405 1805846
49258 1805846 1807678 1813496 1825163 1844337 1871812 1907295 1950021 1999153 2052806 2106861 2155932 2195888
49246 2195888 2224612 2240211 2240113 2223171 2191742 2150319 2102569 2050812 1997708 1946701 1900563 1860635
49234 1860635 1827574 1801684 1782238 1767571 1756351 1748139 1742654 1739444 1738548 1740568 1745639 1753137 1762668
49221 1762668 1774481 1788379 1803120 1817454 1831009 1843476 1853734 1860864 1865762 1870775 1877691 1886607
49209 1886607 1896715 1907605 1919696 1933750 1950163 1968639 1988566 2009714 2032402 2056902 2082928
49198 2082928 2109758 2136547 2162396 2186474 2208325 2227880 2245053 2259591 2271398 2280627 2287283 2291103
49186 2291103 2292125 2291191 2289731 2289230 2290901 2295494 2303287 2314590 2330347 2351831 2379668 2413766 2454574
49173 2454574 2503996 2564701 2638753 2726878 2828150 2939395 3054880 3167119 3268197 3350646
49163 3350646 3408111 3436637 3436137 3410667 3367039 3312637 3253630 3194312 3137522 3085381 3039518 3000924
49151 3000924 2970178 2947916 2934710 2930349 2933673 2943344 2958445 2978175 3001563 3027895 3057107 3089214
49139 3089214 3123474 3158473 3193014 3226746 3259986 3293099 3325990 3358178 3389468 3420376 3451533
49128 3451533 3482730 3513007 3541688 3568847 3594772 3619629 3643818 3667987 3692439 3717209 3743023
49117 3743023 3771429 3803550 3839464 3879418 3924913 3978015 4040532 4115177 4207276 4324085 4471769
49106 4471769 4652517 4863291 5096515 5343298 5598106 5860362 6129930 6400651 6659487
49097 6659487 6891885 7086156 7232353 7320013 7340772 7294078 7188963 7039297 6857180 6650041
49087 6650041 6422233 6178287 5925088 5671964 5429064 5205149 5006015 4834000 4688341
49078 4688341 4566167 4463892 4378403 4307338 4248649 4200347 4160802 4128960 4103873 4084138 4068152
49067 4068152 4055001 4044740 4037555 4032860 4029425 4026173 4022449 4017660 4011226 4003047 3993617 3983356 3972115
49054 3972115 3959484 3945396 3930190 3914376 3898521 3883094 3868187 3853677 3839976 3828308 3819820
49043 3819820 3814669 3812374 3812636 3815096 3818370 3820195 3818814 3813775 3805238 3793182 3777787 3760157 3742075
49030 3742075 3724992 3709490 3695587 3683254 3672640 3663965 3657214 3651929 3647523 3643918 3641712 3641517 3643293
49017 3643293 3646613 3651463 3658494 3668503 3681837 3698293 3717241 3737698 3758595 3779285 3799816 3820447
49005 3820447 3840889 3860258 3877918 3894195 3909990 3925708 3940824 3954565 3966807 3978115 3989081
48994 3989081 3999922 4010735 4021828 4033501 4045549 4057144 4067318 4075490 4081513 4085367 4086916 4085942
48982 4085942 4082234 4075612 4065950 4053202 4037311 4018105 3995406 3969259 3939921 3907591 3872426 3834849
48970 3834849 3795565 3755164 3714075 3673160 3633917 3597653 3564663 3534678 3507897 3485078 3466723
48959 3466723 3452707 3442624 3435987 3432248 3431328 3434149 3441883 3454453 3470418 3488536 3508688 3530940
48947 3530940 3554504 3578240 3601626 3624673 3647375 3669889 3692821 3716688 3741477 3767302 3795086
48936 3795086 3825813 3859482 3895652 3934749 3977805 4024843 4074516 4125507 4177446 4230107 4282612
48925 4282612 4334076 4384510 4434512 4484492 4534834 4586525 4640858 4698314 4758135 4819130 4880703
48914 4880703 4943045 5006596 5071560 5137917 5205785 5275675 5348350 5424368 5503593 5585111 5667812
48903 5667812 5751344 5836462 5924117 6014191 6105519 6197271 6289803 6383767 6478655 6572731 6664172
48892 6664172 6751815 6834875 6912562 6984194 7049500 7108651 7162063 7210122 7252974 7290626 7323275
48881 7323275 7351258 7374522 7392486 7404676 7411089 7411530 7404969 7390165 7366702 7334877 7294859 7246730
48869 7246730 7191302 7130128 7064530 6995223 6922933 6848723 6773462 6697647 6622072 6548097 6476822
48858 6476822 6408349 6342185 6278049 6215993 6156109 6098437 6042875 5988862 5935420 5881841 5828225
48847 5828225 5775221 5723540 5673876 5626898 5582995 5542214 5504602 5470359 5439380 5410965 5384281
48836 5384281 5358933 5334912 5312264 5291060 5271448 5253517 5237341 5223403 5212607 5205469 5201545 5200075
48824 5200075 5201045 5205208 5213188 5224970 5240245 5258768 5280242 5304185 5330166 5358123 5388367 5421245
48812 5421245 5456888 5495321 5536770 5581684 5630167 5681464 5734357 5788141 5842855 5898455 5954063
48801 5954063 6008313 6060231 6109588 6156663 6201909 6245624 6287677 6327788 6366278 6404177 6442060
48790 6442060 6478906 6512602 6541582 6565592 6584881 6599211 6607946 6610833 6608316 6601240 6590541 6577184
48778 6577184 6562088 6545904 6528924 6511363 6493625 6476125 6458812 6441102 6422355 6402276 6380687
48767 6380687 6357180 6331250 6302580 6270907 6235876 6197545 6156910 6115262 6072828 6028546 5981381
48756 5981381 5931346 5878943 5824128 5766330 5705188 5640776 5573312 5503229 5431557 5359900 5289899
48745 5289899 5222741 5158931 5098195 5039629 4982226 4925369 4868883 4812866 4757686 4703978 4652413
48734 4652413 4603590 4558222 4517174 4481055 4449901 4423512 4401896 4385144 4372986 4364769 4359849 4357842
48722 4357842 4358612 4362214 4368799 4378395 4390771 4405487 4421926 4439370 4457315 4475763 4494855 4514186
48710 4514186 4532928 4550687 4567782 4584527 4600895 4617130 4633986 4651829 4670093 4688267 4706847
48699 4706847 4726565 4747104 4767308 4786284 4803418 4817734 4828377 4835721 4841013 4844842 4846977 4847889
48687 4847889 4849316 4852751 4858146 4864623 4871778 4879652 4887983 4896145 4903565 4909751 4914278 4917252 4919521 4922008
48673 4922008 4925092 4929037 4934649 4942898 4953998 4967327 4982237 4998512 5016039 5034416 5052953 5070750
48661 5070750 5086723 5099773 5109024 5113683 5112560 5103873 5085668 5056638 5016679 4966741 4908129 4842057
48649 4842057 4769988 4694143 4617164 4541012 4466434 4393687 4323573 4257592 4197139 4142656 4093442
48638 4093442 4048228 4006100 3966858 3930384 3895823 3861779 3827355 3792471 3757147 3721062 3684301
48627 3684301 3647999 3613564 3581461 3551324 3523215 3498051 3476609 3458609 3443162 3429864 3419067
48616 3419067 3411176 3405918 3402200 3398392 3392751 3384078 3372362 3358667 3344021 3328430 3311428 3293652
48604 3293652 3277222 3263999 3253742 3244463 3234385 3222925 3209963 3195056 3177800 3158418 3137603
48593 3137603 3116145 3094952 3075006 3056801 3040018 3024097 3008971 2994975 2982296 2970806 2960209
48582 2960209 2950049 2939765 2929129 2918566 2908781 2900241 2893265 2888366 2886035 2886240 2888606 2893142 2900422
48569 2900422 2910890 2924218 2939372 2955007 2969661 2981856 2990417 2994818 2995193 2992008 2985773 2976974 2966066
48556 2966066 2953330 2938711 2921943 2902908 2881707 2858305 2832333 2803481 2771960 2738475 2703979
48545 2703979 2669695 2636965 2606458 2577694 2550043 2524161 2501645 2483072 2467188 2452431 2438627
48534 2438627 2426572 2416501 2407702 2399412 2391511 2384385 2378645 2374963 2373895 2375799 2380979 2389694 2402079
48521 2402079 2418620 2440892 2471017 2509525 2553944 2599982 2643699 2682046 2711982 2730523 2736181
48510 2736181 2729866 2714172 2692132 2666508 2639431 2612253 2585873 2561308 2539741 2522131 2509262
48499 2509262 2502182 2502131 2509920 2525595 2548506 2577040 2608120 2637494 2660878 2674678 2675908 2662330
48487 2662330 2633381 2590814 2538075 2479125 2417854 2358026 2302899 2254449 2212986 2177726 2147823
48476 2147823 2122938 2102894 2087044 2074291 2063831 2055660 2050289 2048203 2049646 2054531 2062294 2072129 2083620
48463 2083620 2096891 2111782 2127160 2141379 2153234 2162162 2167910 2170498 2170313 2167807 2163291 2157422 2151475
48450 2151475 2146405 2141767 2136132 2128540 2118988 2107612 2094132 2078216 2059898 2039518 2017733 1995675
48438 1995675 1974624 1955329 1937900 1922343 1908876 1897693 1888693 1881414 1875095 1869085 1863575 1859637
48426 1859637 1858056 1858331 1859187 1859775 1859866 1859262 1857726 1855238 1851663 1846318 1838567 1828648 1817257 1804595 1790557
48411 1790557 1775570 1760321 1744803 1728591 1711972 1695902 1680899 1666856 1653849 1642108 1631284
48400 1631284 1620865 1611406 1604164 1599342 1595728 1592297 1589099 1586309 1583519 1580364 1576866 1572811 1567802 1562266
48386 1562266 1557410 1553704 1550398 1547007 1544258 1542999 1543061 1543747 1544647 1545423 1545630 1545276 1544884 1544576 1543800 1542266
48370 1542266 1540294 1537914 1534558 1530131 1525588 1521972 1519534 1518024 1517069 1516158 1515216 1515343 1517927 1522836 1528605
48355 1528605 1534487 1541102 1548930 1557662 1567253 1578182 1590404 1603516 1618163 1635614 1655851 1678092
48343 1678092 1703412 1734314 1770848 1809481 1846809 1882061 1914715 1942377 1963026 1977517 1988025
48332 1988025 1995841 2002489 2011236 2025310 2045639 2071749 2103412 2140111 2180553 2224282 2272307 2325064
48320 2325064 2381555 2441579 2506639 2577696 2654654 2739231 2835276 2944911 3067774 3205795 3364991
48309 3364991 3550780 3765863 4015136 4308370 4656042 5068433 5562169 6161828 6892040
48300 6892040 7776063 8847731 10158857 11774998 13780991 16295032 19438537 23235538
48292 23235538 27517992 31939196 36081110 39542108 41957850 43030934 42624594 40844811
48284 40844811 38007382 34510372 30723326 26946232 23398818 20207179 17408897 14990551
48276 14990551 12925491 11183284 9725645 8511842 7507160 6680650 6000011 5435605
48268 5435605 4966413 4577089 4252341 3978540 3747511 3554029 3391354 3252448 3133252
48259 3133252 3031592 2944637 2869870 2806450 2753249 2707465 2667021 2632085 2602502 2576227 2552121
48248 2552121 2531643 2515693 2502417 2490445 2481731 2478567 2480055 2484253 2491968 2505554 2525283 2549227
48236 2549227 2575424 2601865 2625628 2644323 2657530 2665107 2665466 2657549 2643212 2625453 2605254 2582213
48224 2582213 2557251 2532397 2508435 2484750 2461127 2437980 2415204 2392324 2369451 2346712 2323246
48213 2323246 2298040 2271257 2243558 2214680 2183901 2151317 2117485 2082449 2046306 2010057 1974619
48202 1974619 1939534 1903791 1867450 1831399 1796113 1761639 1728192 1695708 1663457 1631158 1599882
48191 1599882 1570825 1543756 1517635 1492106 1467439 1443719 1421076 1400020 1380562 1361755 1343141
48180 1343141 1325857 1311239 1299044 1288087 1277775 1267896 1257868 1247573 1238164 1230638 1224223 1217506
48168 1217506 1210474 1204019 1198132 1192251 1186916 1183353 1181519 1180093 1178316 1176510 1174855 1173073 1171390 1170521
48154 1170521 1170517 1170615 1170307 1169664 1168690 1167324 1165993 1165279 1165137 1165308 1166225 1168464 1171499 1174042 1175609 1176806 1178252
48137 1178252 1180211 1183090 1187124 1191496 1194799 1196554 1197493 1198391 1199509 1201141 1203732 1207214 1210953 1214421
48123 1214421 1217397 1219626 1221024 1222113 1223547 1225289 1226900 1228394 1230052 1231653 1232749 1233526 1234445 1235221 1235103
48108 1235103 1234195 1233506 1233651 1234330 1235260 1236859 1239722 1243956 1249104 1254378 1259105 1263316 1267625 1272102 1275854
48093 1275854 1278409 1280967 1285283 1291718 1299331 1307567 1316766 1327270 1339124 1352587 1367890 1384582 1402085
48080 1402085 1420808 1441676 1464680 1488876 1513740 1539397 1565640 1592007 1618978 1647863 1679154
48069 1679154 1712013 1745670 1780241 1815802 1851673 1887107 1921847 1955554 1987359 2016473 2042652
48058 2042652 2065872 2086114 2103654 2118878 2131605 2141204 2147522 2151119 2152569 2152280 2151029 2149751 2148613
48045 2148613 2147036 2144733 2141952 2138646 2134347 2129029 2123103 2116368 2108039 2098226 2088308 2079243 2070350 2060384
48031 2060384 2049065 2036883 2024097 2010636 1996546 1981905 1966580 1950506 1933816 1916358 1897528
48020 1897528 1876940 1854874 1831745 1807576 1782358 1756487 1730472 1704471 1678401 1652242 1626072
48009 1626072 1600095 1574691 1550078 1525923 1501731 1477625 1454169 1431463 1409081 1386976 1365713
47998 1365713 1345616 1326446 1308155 1291210 1275810 1261484 1247851 1235142 1223531 1212569 1201794
47987 1201794 1191423 1181979 1173645 1166400 1160356 1155551 1151732 1148700 1146562 1145323 1144523 1143585 1142296 1140796
47973 1140796 1139398 1138509 1138322 1138503 1138572 1138639 1139235 1140317 1141112 1141192 1141068 1141390 1142098 1142718 1142978 1142728 1141645 1139485
47955 1139485 1136433 1132939 1129369 1125938 1122655 1119256 1115557 1111910 1108924 1106688 1104710 1102631 1100515 1098438
47941 1098438 1096394 1094656 1093636 1093310 1093399 1094212 1096541 1100566 1105548 1110820 1116387 1122321 1128306 1134174 1140239
47926 1140239 1146766 1153680 1161117 1169596 1179351 1190038 1201368 1213393 1226022 1238998 1252622 1267528
47914 1267528 1283329 1298371 1311507 1323401 1335414 1347901 1360259 1371956 1382576 1391336 1397501 1401170
47902 1401170 1402969 1403107 1401322 1397632 1392591 1386739 1380135 1372440 1363322 1352846 1341500 1329721 1317535
47889 1317535 1305006 1292750 1281323 1270282 1258725 1246832 1235930 1226794 1218832 1211303 1204365 1198392
47877 1198392 1193230 1188817 1185779 1184664 1185198 1186948 1190096 1194846 1200608 1206482 1212140 1217795 1223860 1231140
47863 1231140 1240593 1252243 1264921 1277741 1291129 1305630 1320491 1334440 1347327 1359884 1372126
47852 1372126 1383033 1391763 1398313 1403023 1406154 1407986 1408705 1408068 1405531 1400704 1393605 1384777 1375307 1366178
47838 1366178 1357257 1347471 1336324 1324592 1313149 1301972 1290898 1280563 1271677 1263986 1256838 1250331
47826 1250331 1245132 1241633 1240090 1241111 1245190 1252194 1262043 1275337 1292531 1313160 1336853 1364441 1396949
47813 1396949 1434031 1474621 1518561 1566194 1616600 1667613 1717488 1765319 1809957 1849942 1884503
47802 1884503 1913239 1934732 1946976 1949533 1943915 1931379 1911635 1884355 1850741 1812776 1771856 1729041
47790 1729041 1685921 1644219 1604864 1568082 1534115 1503327 1475895 1451926 1431663 1415218 1402262
47779 1402262 1392233 1384662 1379076 1374784 1370956 1366862 1362115 1356948 1352189 1348665 1346667 1346242 1347693 1351235
47765 1351235 1356340 1362085 1368183 1375032 1382720 1390555 1397777 1404206 1410070 1415616 1420917 1425559 1428453 1428476
47751 1428476 1425440 1420105 1413268 1405273 1396284 1386422 1375585 1363703 1351214 1338783 1326585 1314392
47739 1314392 1302300 1290725 1279834 1269761 1261311 1255432 1251785 1248837 1245782 1243510 1243196 1244758 1247397
47726 1247397 1250955 1255933 1262528 1270484 1279725 1290532 1303111 1317418 1333368 1350884 1369796 1389999
47714 1389999 1411628 1434831 1459407 1484882 1510842 1537059 1563359 1589564 1615550 1641206 1666186
47703 1666186 1689672 1710526 1727952 1742079 1753580 1762545 1768081 1769290 1766325 1760073 1751142 1739711
47691 1739711 1726086 1710657 1693341 1673682 1651757 1628548 1605360 1583152 1562356 1542901 1524385
47680 1524385 1506656 1490188 1475605 1463074 1452655 1444971 1440685 1439262 1439132 1439427 1441022 1445495 1453476
47667 1453476 1464289 1476813 1490357 1504926 1520976 1538931 1558834 1580403 1603195 1626666 1650428
47656 1650428 1674671 1699840 1725478 1749945 1771915 1791665 1810078 1826872 1840871 1851787 1860460
47645 1860460 1867244 1871374 1872320 1870749 1867727 1863751 1859116 1854479 1850506 1847530 1846029 1847045 1851805 1861322
47631 1861322 1876502 1898038 1925855 1959144 1997167 2039591 2085944 2135361 2186935 2239514 2290892
47620 2290892 2338086 2378853 2412291 2437604 2453150 2457303 2449622 2430578 2400741 2360936 2312604 2257304
47608 2257304 2196122 2130126 2061006 1990654 1920465 1851563 1785316 1722926 1664686 1610206 1559255
47597 1559255 1511974 1468537 1429134 1394161 1363914 1338126 1316091 1297100 1280479 1265444 1251341
47586 1251341 1238028 1225756 1214779 1205186 1196812 1189060 1181056 1172249 1162802 1153302 1144360 1136504 1129964
47573 1129964 1124260 1118377 1111671 1104368 1097072 1090207 1084177 1079497 1076264 1073795 1071196 1068129 1064704 1060947
47559 1060947 1056800 1052414 1047989 1043366 1038083 1031894 1025081 1018260 1011859 1005664 998952 991332 983341 975871
47545 975871 969090 962412 955493 948611 942022 935543 929018 922705 917017 912298 908879 906780 905312 903664
47531 903664 902005 901262 901610 902100 902104 902265 903441 905489 907753 910050 912505 914956 917216 919448 921697 923528
47515 923528 924727 925865 927523 929383 930688 931159 930880 929796 928063 926443 925550 924980 923867 922066 920154
47500 920154 918543 917273 916478 916389 917026 918296 920175 922328 924007 924813 925150 925387 925158 924191 923245 923326 924436
47483 924436 926051 928322 931596 934974 936755 936491 935498 935022 934967 934800 934709 935142 935900 936447 936860 937866 939980
47466 939980 942954 946130 949168 952379 956316 961152 966749 973254 981044 989842 998556 1006551 1014590 1023867
47452 1023867 1034517 1045860 1057720 1070594 1084713 1099930 1116539 1135360 1156890 1181083 1207995
47441 1207995 1237788 1269926 1303093 1336151 1368530 1399455 1427538 1451467 1470626 1484805 1493875
47430 1493875 1497958 1497398 1492297 1482528 1468357 1450438 1429044 1404047 1376120 1347270 1319552 1293651
47418 1293651 1269332 1246843 1227143 1210885 1197906 1187913 1181164 1178106 1178536 1181411 1185606 1190766 1197353
47405 1197353 1205819 1215859 1226497 1236770 1246184 1254715 1262613 1270104 1276971 1282418 1285544 1285956 1283835
47392 1283835 1279633 1273942 1267434 1260524 1253086 1244751 1235454 1225388 1214617 1203065 1190881 1178557 1166737
47379 1166737 1156092 1147107 1139644 1132937 1126497 1120830 1116820 1114595 1113587 1113596 1115054 1118173 1122583 1128045
47365 1128045 1134969 1143841 1154568 1166718 1180023 1194292 1209043 1223601 1237501 1250636 1263135 1275200
47353 1275200 1286876 1297848 1307568 1315609 1321793 1325937 1327681 1326699 1322918 1316532 1307830 1297039 1284228
47340 1284228 1269438 1252927 1235147 1216372 1196588 1175959 1155163 1135014 1115858 1097574 1080022
47329 1080022 1063265 1047586 1033486 1021321 1010651 1000316 989629 979169 969916 961952 954663 947905
47317 947905 942129 937437 933371 929808 927324 926329 926444 927001 927751 928855 930622 933483 937852 943651 950236
47302 950236 956952 963586 970136 976398 981937 986331 989468 991768 994037 996719 999316 1000878 1000987 999965
47288 999965 998197 995784 992970 990399 988630 987563 986538 984986 982993 981330 980824 981605 983238 985701 989760
47273 989760 996046 1004188 1013416 1023621 1035173 1048038 1061860 1076784 1093403 1111881 1131914 1153623
47261 1153623 1177819 1205289 1236323 1270726 1307411 1343893 1377035 1404553 1425326 1438491 1443434
47250 1443434 1440940 1433342 1422975 1411157 1398875 1387359 1377235 1367910 1358642 1349703 1341819 1334925 1328230
47237 1328230 1321149 1313543 1305353 1296666 1287864 1279068 1269626 1258807 1247007 1235713 1226183 1218536 1212103
47224 1212103 1206266 1200865 1196074 1192099 1189001 1186785 1185511 1185094 1185131 1185287 1185888 1187736 1191216 1195945 1201428
47209 1201428 1207671 1215052 1223920 1234396 1246124 1258173 1269719 1281012 1293083 1306353 1320110 1333599
47197 1333599 1346803 1359666 1371291 1380713 1388041 1394024 1398778 1401663 1402298 1400982 1398055 1393414 1386838
47184 1386838 1378437 1368680 1358204 1347600 1337175 1326937 1316940 1307510 1299033 1291747 1285953 1282032 1279957
47171 1279957 1278982 1278330 1278121 1279353 1283000 1289393 1298288 1309168 1321475 1334933 1349812 1366760 1386279
47158 1386279 1408347 1432473 1458067 1484855 1512888 1541995 1571366 1599977 1627466 1654128 1679927
47147 1679927 1703957 1725236 1743614 1759468 1772700 1782507 1788134 1789530 1787270 1782045 1774306 1764254
47135 1764254 1752083 1738214 1723213 1707524 1691475 1675543 1660364 1646331 1633292 1620779 1608484
47124 1608484 1596585 1585721 1576636 1569621 1564286 1559978 1556281 1553053 1550308 1548513 1548728 1551884 1557837 1565530
47110 1565530 1574050 1583146 1592834 1603043 1613710 1624761 1635885 1646607 1656518 1665098 1671576 1675487 1677174
47097 1677174 1677099 1674904 1669877 1662175 1652633 1641428 1627959 1612227 1595284 1578018 1560418 1542299 1523793
47084 1523793 1504746 1484653 1463733 1443118 1423376 1403754 1383567 1363494 1344757 1327804 1312559
47073 1312559 1299205 1287776 1277538 1267768 1258742 1251209 1245337 1240931 1238212 1237547 1238743 1241337 1245269
47060 1245269 1250608 1257032 1264211 1272300 1281340 1290621 1299350 1307494 1315242 1322167 1327746 1332220 1335998 1338680
47046 1338680 1339697 1339600 1339691 1340536 1341705 1342686 1343157 1342644 1341000 1339084 1338052 1338139 1339014 1340995 1344731 1349912 1355608
47029 1355608 1361868 1369700 1379351 1389903 1400853 1412757 1425812 1438978 1451263 1462944 1474805 1486952
47017 1486952 1499136 1511616 1524854 1538691 1552494 1565962 1579385 1593251 1607833 1622930 1637870
47006 1637870 1652037 1665507 1678782 1691938 1704500 1716158 1726925 1736440 1743786 1748324 1750218 1749913
46994 1749913 1747693 1743982 1739438 1734275 1727975 1720086 1710888 1700939 1690399 1679336 1668290 1657962 1648544
46981 1648544 1639780 1631591 1624229 1617838 1612202 1607004 1602227 1598293 1595793 1595003 1595646 1597321 1600071 1604311
46967 1604311 1610253 1617708 1626493 1636656 1648214 1660934 1674613 1689366 1705535 1723229 1741941 1760639
46955 1760639 1778537 1795942 1813988 1833280 1853164 1872697 1891850 1911120 1930349 1948743 1965859
46944 1965859 1981750 1996196 2008652 2019054 2027880 2035236 2040642 2043934 2045688 2046518 2046564 2045866 2044601 2042707
46930 2042707 2039951 2036740 2034253 2033416 2034238 2036364 2039670 2043978 2048911 2054554 2061723 2071000 2081926 2093547
46916 2093547 2105351 2117198 2128853 2140229 2151842 2164444 2178331 2193357 2209378 2226241 2243544
46905 2243544 2260894 2278297 2295914 2313472 2330211 2345401 2358672 2369920 2378996 2385422 2388425 2387559
46893 2387559 2383368 2377048 2369274 2359671 2347660 2333402 2317615 2300919 2283850 2267320 2252481 2240049
46881 2240049 2230073 2222506 2217842 2217014 2220589 2228107 2238460 2251094 2266559 2285622 2308088 2332974 2359554
46868 2359554 2387549 2416346 2444839 2472296 2498757 2524290 2548419 2570587 2590668 2608599 2623957
46857 2623957 2636307 2645742 2652845 2658471 2663720 2669646 2676606 2684211 2692131 2700589 2709866 2719821 2730254
46844 2730254 2741377 2753653 2767508 2783425 2801826 2822510 2844568 2867212 2890300 2913839 2937353
46833 2937353 2960031 2981114 2999871 3015744 3028783 3039488 3047906 3053458 3055948 3056058 3054378 3050683 3044818
46820 3044818 3037699 3030646 3024121 3017937 3012373 3008268 3006098 3005635 3006548 3008928 3013385 3020888 3032234 3047265
46806 3047265 3064963 3084687 3106868 3132063 3159967 3189974 3221978 3255730 3289980 3323316 3355487
46795 3355487 3386798 3416525 3443125 3465914 3485256 3501008 3512053 3517797 3518971 3516434 3510112 3499824
46783 3499824 3486390 3471149 3454833 3437534 3419458 3401126 3382974 3365142 3347533 3329905 3312068
46772 3312068 3294097 3276071 3257639 3238320 3218355 3198790 3180482 3163418 3147185 3131588 3116558
46761 3116558 3101855 3087172 3072243 3056730 3040467 3023991 3008327 2994015 2980861 2968860 2958666
46750 2958666 2950721 2944593 2939848 2937092 2937383 2940949 2947258 2956179 2968243 2983706 3002012 3022316 3044040
$$ [...]
##END NTUPLES=NMR SPECTRUM
##END=
