
##TITLE=AC1234_TANRS11078_6524953_RxOd57RpQz
##JCAMPDX= 6.0         $$ Bruker NMR JCAMP-DX V2.0
##DATA TYPE= NMR SPECTRUM
##DATA CLASS= NTUPLES
##ORIGIN= BRUKER
##OWNER= Administrator
$$ 1.72 TOPSPIN		Version 2.1
$$ 2012-07-15 01:30:00.125 -0500  Administrator@TOPSPIN
$$ Compression mode = diff/dup
##.OBSERVE FREQUENCY= 400.02188249412
##.OBSERVE NUCLEUS= ^1H
##.ACQUISITION MODE= SIMULTANEOUS (DQD)
##.ACQUISITION SCHEME= undefined
##.AVERAGES= 64
##.DIGITISER RES= 22
##SPECTROMETER/DATA SYSTEM= spect
##.PULSE SEQUENCE= noesygpps1d.comp
##.SOLVENT NAME= COFFEE_meoh
##.SHIFT REFERENCE= INTERNAL, COFFEE_meoh, 1, 14.96105
##AUDIT TRAIL= $$ (NUMBER, WHEN, WHO, WHERE, PROCESS, VERSION, WHAT)
$$ ##TITLE= Audit trail, TOPSPIN		Version 2.1
$$ ##JCAMPDX= 5.01
$$ ##ORIGIN= Bruker BioSpin GmbH
$$ ##OWNER= Administrator
$$ $$ C:\Bruker\TOPSPIN/data/COFFEE/nmr/AC1234_TANRS11078_6524953_RxOd57RpQz/12/pdata/1/auditp.txt
$$ ##AUDIT TRAIL=  $$ (NUMBER, WHEN, WHO, WHERE, PROCESS, VERSION, WHAT)
(   1,<2012-07-15 01:29:55.484 -0500>,<Administrator>,<TOPSPIN>,<go>,<TOPSPIN 2.1>,
      <created by zg
	started at 2012-07-15 01:18:25.203 -0500,
	POWCHK enabled, PULCHK disabled,
       configuration hash MD5:
       6B 1B 68 BB D9 2E 58 E2 7F 35 AD 54 07 DF 0E 41
       data hash MD5: 64K
       BB 26 BC 07 BF E4 1B 20 E4 43 89 36 2F CD CB 9A>)
(   2,<2012-07-15 01:29:58.265 -0500>,<Administrator>,<TOPSPIN>,<proc1d>,<TOPSPIN 2.1>,
      <Start of raw data processing
       efp LB = 0.3 FT_mod = 6 PKNL = 1 PHC0 = 0 PHC1 = 0 SI = 128K 
       data hash MD5: 128K
       5D F7 A4 86 BA B9 59 4F 98 79 A7 6D B4 CB C0 14>)
(   3,<2012-07-15 01:29:59.390 -0500>,<Administrator>,<TOPSPIN>,<proc1d>,<TOPSPIN 2.1>,
      <pk PHC0 = -3.147583 PHC1 = 0 
       data hash MD5: 128K
       85 EF E7 9D 5B C1 AA 72 75 37 10 E1 97 DE 87 CA>)
(   4,<2012-07-15 01:29:59.625 -0500>,<Administrator>,<TOPSPIN>,<proc1d>,<TOPSPIN 2.1>,
      <abs ABSG = 1 
       data hash MD5: 128K
       E9 E2 E3 E1 CB D8 03 AF 92 1F 12 FE DE 26 F7 26>)
(   5,<2012-07-15 01:29:59.703 -0500>,<Administrator>,<TOPSPIN>,<proc1d>,<TOPSPIN 2.1>,
      <abs ABSG = 2 
       data hash MD5: 128K
       C1 94 C2 A7 60 B9 9B 23 A3 D8 DD 6D 5D F6 BB 8D>)
(   6,<2012-07-15 01:29:59.765 -0500>,<Administrator>,<TOPSPIN>,<proc1d>,<TOPSPIN 2.1>,
      <abs ABSG = 3 
       data hash MD5: 128K
       0F 5F A5 73 21 F5 E6 20 35 57 4C 9E E9 26 6A 96>)
(   7,<2012-07-15 01:29:59.984 -0500>,<Administrator>,<TOPSPIN>,<proc1d>,<TOPSPIN 2.1>,
      <abs ABSG = 4 
       data hash MD5: 128K
       20 46 75 A5 B7 AE 24 5F 31 70 61 E9 7C BF B2 FA>)
(   8,<2012-07-15 01:30:00.046 -0500>,<Administrator>,<TOPSPIN>,<proc1d>,<TOPSPIN 2.1>,
      <abs ABSG = 5 
       data hash MD5: 128K
       AA 3B 0B F0 E7 5A C3 74 DC 8B BC F5 A6 DD EE AA>)
$$ ##END=
$$ 
$$ $$ hash MD5
$$ $$ CC E8 31 9F 07 C6 6D 2E B9 08 51 D5 03 38 7C 78
##$RELAX= 
##$RELAX= 
##$RELAX= 
##$RELAX= 
##$RELAX= 
##$RELAX= 
##$RELAX= 
##$RELAX= 
$$ Bruker specific parameters
$$ [...]
##$TP07= 0
##$TPNAME0= <>
##$TPNAME1= <>
##$TPNAME2= <>
##$TPNAME3= <>
##$TPNAME4= <>
##$TPNAME5= <>
##$TPNAME6= <>
##$TPNAME7= <>
##$TPOAL= (0..7)
0.5 0.5 0.5 0.5 0.5 0.5 0.5 0.5
##$TPOFFS= (0..7)
0 0 0 0 0 0 0 0
##$TUNHIN= 0
##$TUNHOUT= 0
##$TUNXOUT= 0
##$USERA1= <user>
##$USERA2= <user>
##$USERA3= <user>
##$USERA4= <user>
##$USERA5= <user>
##$V9= 5
##$VALIST= <valist>
##$VCLIST= <CCCCCCCCCCCCCCC>
##$VD= 0
##$VDLIST= <DDDDDDDDDDDDDDD>
##$VPLIST= <PPPPPPPPPPPPPPP>
##$VTLIST= <TTTTTTTTTTTTTTT>
##$WBST= 2048
##$WBSW= 25
##$XGAIN= (0..3)
0 0 0 0
##$XL= 0
##$YL= 0
##$YMAX_a= 10901330
##$YMIN_a= -8258938
##$ZGOPTNS= <>
##$ZL1= 120
##$ZL2= 120
##$ZL3= 120
##$ZL4= 120
##$ABSF1= 14.96105
##$ABSF2= -5.597132
##$ABSG= 5
##$ABSL= 3
##$ALPHA= 0
##$AQORDER= 0
##$ASSFAC= 0
##$ASSFACI= 0
##$ASSFACX= 0
##$ASSWID= 0
##$AUNMP= <proc_prof1d_extract.lims>
##$AXLEFT= 0
##$AXNAME= <>
##$AXNUC= <1H>
##$AXRIGHT= 0
##$AXTYPE= 0
##$AXUNIT= <>
##$AZFE= 0.1
##$AZFW= 0.1
##$BCFW= 0
##$BC_mod= 0
##$BYTORDP= 0
##$COROFFS= 0
##$CY= 15
##$DATMOD= 1
##$DC= 0
##$DFILT= <>
##$DTYPP= 0
##$F1P= 0
##$F2P= 0
##$FCOR= 0.5
##$FTSIZE= 131072
##$FT_mod= 6
##$GAMMA= 0
##$GB= 0
##$INTBC= 1
##$INTSCL= 1
##$ISEN= 128
##$LB= 0.3
##$LEV0= 0
##$LPBIN= 0
##$MAXI= 10000
##$MC2= 0
##$MEAN= 0
##$ME_mod= 0
##$MI= 0
##$NCOEF= 0
##$NC_proc= -2
##$NLEV= 6
##$NOISF1= 0
##$NOISF2= 0
##$NSP= 0
##$NTH_PI= 0
##$NZP= 0
##$OFFSET= 14.96105
##$PC= 1
##$PHC0= -3.147583
##$PHC1= 0
##$PH_mod= 1
##$PKNL= yes
##$PPARMOD= 0
##$PPDIAG= 0
##$PPIPTYP= 0
##$PPMPNUM= 2147483647
##$PPRESOL= 1
##$PSCAL= 4
##$PSIGN= 0
##$PYNMP= <proc.py>
##$REVERSE= no
##$SF= 400.020009617127
##$SI= 131072
##$SIGF1= 0
##$SIGF2= 0
##$SINO= 400
##$SIOLD= 131072
##$SPECTYP= <>
##$SREGLST= <1H.CDCl3>
##$SSB= 0
##$STSI= 131072
##$STSR= 0
##$SW_p= 8223.68421052631
##$SYMM= 0
##$S_DEV= 0
##$TDeff= 65536
##$TDoff= 0
##$TI= <>
##$TILT= no
##$TM1= 0
##$TM2= 0
##$TOPLEV= 0
##$USERP1= <user>
##$USERP2= <user>
##$USERP3= <user>
##$USERP4= <user>
##$USERP5= <user>
##$WDW= 1
##$XDIM= 131072
##$YMAX_p= 435268584
##$YMIN_p= -12434
##$CURPLOT= <Network HP LaserJet P1505>
##$CURPRIN= <$Network HP LaserJet P1505>
##$DFORMAT= <normdp>
##$LAYOUT= <+/1D_H.xwp>
##$LFORMAT= <normlp>
##$PFORMAT= <normpl>
##$SURQMSG= 1
$$ End of Bruker specific parameters
$$ ---------------------------------
##NTUPLES= NMR SPECTRUM
##VAR_NAME=  FREQUENCY,     SPECTRUM/REAL,   SPECTRUM/IMAG
##SYMBOL=    X,             R,               I
##VAR_TYPE=  INDEPENDENT,   DEPENDENT,       DEPENDENT
##VAR_FORM=  AFFN,          ASDF,            ASDF
##VAR_DIM=   131072,        131072,          131072
##UNITS=     HZ,            ARBITRARY UNITS, ARBITRARY UNITS
##FACTOR=    0.0627417313425164, 1,          1
##FIRST=     8223.62146879497, -802,         -48478
##LAST=      0,             62,              -48922
##MIN=       0,             -12434,          0
##MAX=       8223.62146879497, 435268584,    0
$$ Real data points
##PAGE= N=1
##DATA TABLE= (X++(R..R)), XYDATA
$$ [...]
$$ plain form
63819 874173 837122 800375 764736 730011 696016 663232 632426 603993 577830 553687 531521
63808 531521 511543 493839 477918 462906 448317 434314 420977 407749 394118 380608 368427
63797 368427 358097 348966 340183 331681 323944 317194 311117 305218 299187 293022 286962 281335 276374 272138
63783 272138 268472 264999 261354 257665 254617 252720 251579 250274 248414 246460 244928 243714 242373 240751
63769 240751 239054 237506 236203 235173 234404 233817 233294 232645 231583 229955 228101 226793 226577 227265 228197 228898
63753 228898 229317 229519 229363 228624 227334 225871 224671 223955 223852 224647 226620 229527 232559 235051 237098 239225
63737 239225 241593 243828 245567 246874 248106 249610 251643 254392 257978 262350 267097 271438 274763 277317
63723 277317 280050 283574 287677 292133 297407 303886 310842 316975 321897 326244 330368 333762 335955 337105
$$ packed form
63819H74173l7051l6747l5639l4725l3995l2784l0806k8433k6163k4143k2166
63808E31521j9978j7704j5921j5012j4589j4003j3337j3228j3631j3510j2181
63797C68427j0330r131q783q502p737o750o077n899o031o165o060n627m961m236
63783B72138l666l473l645l689l048j897j141j305j860j954j532j214j341j622
63769B40751j697j548j303j030p69n87n23o49j062j628j854j308k16O88R32P01
63753B28898M19K02j56p39j290j463j200p16j03P95J973K907L032K492K047K127
63737B39225K368K235J739J307J232J504K033K749L586M372M747M341L325K554
63723B77317K733L524M103M456N274O479O956O133M922M347M124L394K193J150
$$ plain form
63709 337105 337363 336353 333793 330159 326333 322996 320514 318798 316912 313515 308313 302731 298623 296628
63695 296628 296167 296532 297367 298424 299597 301092 303054 305101 306673 307749 308794 310072 311317 311964 311441
63680 311441 309584 307117 305424 305359 306542 308224 310453 313741 317901 322056 325746 329342 333356 337957 343129
63665 343129 348638 353813 358089 361859 366094 370908 375170 377758 378535 377812 375593 371880 367106 361678 355482
63650 355482 348427 341158 334619 329124 324391 320336 317183 314791 312495 309934 307686 306802 307815 310331
63636 310331 313492 316722 320070 323952 328595 333766 339002 344074 349182 354718 360821 367153 373227 379024
63622 379024 385108 391941 399304 406785 414749 424272 435930 449131 463001 477659 494222 513715 536255
63609 536255 561236 588054 616691 647752 681826 718718 757521 797509 838452 879613 918692
$$ packed form
63709C37105K58j010k560l634l826l337k482j716j886l397n202n582m108j995
63695B96628m61L65Q35J057J173J495J962K047J572J076J045J278J245O47n23
63680C11441j857k467j693o5J183J682K229L288M160M155L690L596M014M601N172
63665C43129N509N175M276L770M235M814M262K588P77p23k219l713m774n428o196
63650C55482p055p269o539n495m733m055l153k392k296k561k248q84J013K516
63636C10331L161L230L348L882M643N171N236N072N108N536O103O332O074N797
63622C79024O084O833P363P481P964R523J1658J3201J3870J4658J6563J9493K2540
63609E36255K4981K6818K8637L1061L4074L6892L8803L9988M0943M1161L9079
$$ plain form
63598 918692 952453 978390 995473 1003538 1002941 995132 982748 968318 952932 936588 919483 902330
63586 902330 885468 868369 850231 830615 809288 786011 760977 735238 710196 686721 665096
63575 665096 645694 629181 615921 605586 597588 591685 587952 586370 586718 588680 591850 595706 599852
63562 599852 604291 609270 614867 620867 626966 632984 638920 644999 651672 659415 668505 679129 691636 706553
63548 706553 724380 745614 771001 801465 837609 879379 926366 978316 1034855 1094225 1152096
63537 1152096 1201910 1237167 1254227 1253609 1239076 1215666 1188165 1160345 1134591 1111838 1092044 1074784
63525 1074784 1059284 1044029 1026836 1005735 979931 949933 916939 882133 846503 811026 776743
63514 776743 744482 714532 686814 661390 638635 618875 602071 587949 576156 566131 557139 548768
$$ packed form
63598I18692L3761K5937J7083Q065n97p809j2384j4430j5386j6344j7105j7153
63586I02330j6862j7099j8138j9616k1327k3277k5034k5739k5042k3475k1625
63575F65096j9402j6513j3260j0335p998n903l733j582L48J962L170L856M146
63562E99852M439M979N597O000O099O018N936O079O673P743R090J0624J2507J4917
63548G06553J7827K1234K5387L0464L6144M1770M6987N1950N6539N9370N7871
63537A152096M9814L5257J7060o18j4533k3410k7501k7820k5754k2753j9794j7260
63525A074784j5500j5255j7193k1101k5804k9998l2994l4806l5630l5477l4283
63514G76743l2261k9950k7718k5424k2755j9760j6804j4122j1793j0025q992q371
$$ plain form
63502 548768 541158 534447 528265 522160 516214 510705 505357 499641 493763 488572 484336 480320 475892 471334
63488 471334 467102 462929 458338 453585 449376 445950 443218 441612 441853 443702 445779 447125 448380 450965
63474 450965 455491 461444 468111 475065 481730 487162 490600 491960 491568 489697 486609 482744 478449 473612
63460 473612 468028 462130 456928 452998 449854 446636 443231 440453 439102 439054 439212 438341 436106 433480 432008
63445 432008 432516 434640 437628 441258 445754 451236 457708 465365 474399 484650 496012 509148 525289
63432 525289 545364 569886 599693 635932 678682 725790 773243 816493 851609 876151 889929
63421 889929 895038 894924 893274 893411 897773 907413 922353 942909 970320 1005519 1047487 1093265 1139372
63408 1139372 1182719 1220404 1249583 1268096 1275203 1271743 1259831 1242285 1221769 1200015 1177704 1154943
$$ packed form
63502E48768p610o711o182o105n946n509n348n716n878n191m236m016m428m558
63488D71334m232m173m591m753m209l426k732j606K41J849K077J346J255K585
63474D50965M526N953O667O954O665N432L438J360l92j871l088l865m295m837
63460D73612n584n898n202l930l144l218l405k778j351m8J58q71k235k626j472
63445D32008N08K124K988L630M496N482O472P657R034J0251J1362J3136J6141
63432E25289K0075K4522K9807L6239M2750M7108M7453M3250L5116K4542J3778
63421H89929N109j14j650J37M362R640J4940K0556K7411L5199M1968M5778M6107
63408A139372M3347L7685K9179J8513P107l460j1912j7546k0516k1754k2311k2761
$$ plain form
63396 1154943 1131648 1107556 1082193 1054993 1025486 993504 959419 924144 888775 854283 821542
63385 821542 791359 764146 739741 717795 698227 681069 666104 653056 642085 633702 628122 624998
63373 624998 623812 624335 626664 631037 637601 646144 656079 666858 678349 690735 704171 718764 734717
63360 734717 752278 771720 793569 818576 847073 878632 912798 949938 990745 1035000 1081339
63349 1081339 1128121 1173705 1215788 1251300 1277566 1293367 1298816 1294818 1283066 1266018 1246174 1225240
63337 1225240 1204014 1182701 1161078 1138588 1114664 1088930 1061027 1030551 997334 961644 924094
63326 924094 885771 848517 814426 784579 758537 735450 715371 699156 687528 680795 679238 682992
63314 682992 691289 701918 711318 715152 709647 693559 669198 641103 613372 588160 566101 547136
$$ packed form
63396A154943k3295k4092k5363k7200k9507l1982l4085l5275l5369l4492l2741
63385H21542l0183k7213k4405k1946j9568j7158j4965j3048j0971q383n580l124
63373F24998j186N23K329M373O564Q543R935J0779J1491J2386J3436J4593J5953
63360G34717J7561J9442K1849K5007K8497L1559L4166L7140M0807M4255M6339
63349A081339M6782M5584M2083L5512K6266J5801N449l998j1752j7048j9844k0934
63337A225240k1226k1313k1623k2490k3924k5734k7903l0476l3217l5690l7550
63326I24094l8323l7254l4091k9847k6042k3087k0079j6215j1628o733j557L754
63314F82992Q297J0629R400L834n505j6088k4361k8095k7731k5212k2059j8965
$$ plain form
63302 547136 530727 516063 502713 490863 480611 471301 461963 452251 442647 433804 425964 418917 412250
63289 412250 405582 398772 392045 385854 380523 375937 371575 366924 361997 357452 354083 352128 351094 350197
63275 350197 348886 347066 345052 343356 342215 341209 339581 337095 334406 332375 331197 330446 329782 329171 328381
63260 328381 326862 324493 322108 320724 320289 319716 318316 316709 315981 316297 316898 317281 317697 318379 318884 318681 318015
63243 318015 317663 317899 318162 317809 316903 316130 316121 316948 318133 319032 319271 318923 318320 317807 317642 317968 318688 319467 320008
63224 320008 320278 320366 320284 320062 319879 319800 319537 318840 318140 318345 319869 322177 324488 326577 328653 330825 333091
63207 333091 335682 338917 342718 346647 350542 354747 359544 364580 369153 372998 376505 380109 383644 386509
63193 386509 388454 390065 392308 395601 399526 403580 408011 413650 420940 429445 438494 448002 458424 470031
$$ packed form
63302E47136j6409j4664j3350j1850j0252r310r338r712r604q843p840p047o667
63289D12250o668o810o727o191n331m586m362m651m927m545l369j955j034q97
63275C50197j311j820k014j696j141j006j628k486k689k031j178p51o64o11p90
63260C28381j519k369k385j384m35n73j400j607p28L16O01L83M16O82N05k03o66
63243C18015l52K36K63l53r06p73rQ27J185Q99K39l48o03n13j65L26P20P79N41
63224C20008K70Q8q2k22j83p9k63o97p00K05J524K308K311K089K076K172K266
63207C33091K591L235L801L929L895M205M797N036M573L845L507L604L535K865
63193C86509J945J611K243L293L925M054M431N639P290Q505R049R508J0422J1607
$$ plain form
63179 470031 482585 495646 508853 521847 534292 546170 557801 569340 580472 590764 600071 608326
63167 608326 615235 620604 624800 628381 631332 633147 633603 632837 630567 625998 618868 609966 600002 588466
63153 588466 574347 557781 540240 523111 506770 491101 476202 462269 449312 437394 426896
63142 426896 418226 411413 406178 402141 398814 395700 392717 390340 389019 388579 388463 388497 389120 390865 393773
63127 393773 397405 401265 405211 409487 414375 419795 425355 430827 436447 442658 449645 457151 464620 471459
63113 471459 477323 482321 486869 491352 495999 501034 506628 512552 518128 522834 526836 530740 534860 538882
63099 538882 542191 544470 546128 548222 551687 556494 561747 566776 571901 577945 585294 593766 603038 612597
63085 612597 621449 628512 633471 636795 638778 639036 637134 633315 628277 622513 616120 609048 601202 592473
$$ packed form
63179D70031J2554J3061J3207J2994J2445J1878J1631J1539J1132J0292R307Q255
63167F08326O909N369M196L581K951J815M56p66k270m569p130q902r964j1536
63153E88466j4119j6566j7541j7129j6341j5669j4899j3933j2957j1918j0498
63142D26896q670o813n235m037l327l114k983k377j321m40j16L4O23J745K908
63127C93773L632L860L946M276M888N420N560N472N620O211O987P506P469O839
63113D71459N864M998M548M483M647N035N594N924N576M706M002L904M120M022
63099E38882L309K279J658K094L465M807N253N029N125O044P349Q472R272R559
63085F12597Q852P063M959L324J983K58j902l819n038n764o393p072p846q729
$$ plain form
63071 592473 582959 573104 563375 553868 544410 535030 526161 518339 511848 506618 502327 498596 495191 492120
63057 492120 489607 487995 487623 488625 490773 493588 496659 499816 503113 506809 511322 516903 523265 529836
63043 529836 536487 543705 551759 560027 567563 574239 580851 588045 595567 602721 609169 614898 619722 623324
63029 623324 625910 628357 631354 634519 636674 637054 636028 634606 633437 632364 630704 627700 622933 616679
63015 616679 609882 603499 597868 592963 589124 586987 586605 587225 588402 590850 595640 602799 611416 621088 632518
63000 632518 646413 662363 679297 696689 714766 733621 752624 770802 787529 802693 816506
62989 816506 829362 841787 854283 867154 880495 894200 907858 920673 931811 940927 948208 953746
62977 953746 956988 957027 953338 945967 935077 920687 902991 882614 860287 836482 811617 786398 761624
$$ packed form
63071E92473r514r855r729r507r458r380q869p822o491n230m291l731l405l071
63057D92120k513j612l72J002K148K815L071L157L297L696M513N581O362O571
63043E29836O651P218Q054Q268P536O676O612P194P522P154O448N729M824L602
63029F23324K586K447K997L165K155L80j026j422j169j073j660l004m767o254
63015F16679o797o383n631m905l839k137l82O20J177K448M790P159Q617R672J1430
63000F32518J3895J5950J6934J7392J8077J8855J9003J8178J6727J5164J3813
62989H16506J2856J2425J2496J2871J3341J3705J3658J2815J1138R116P281N538
62977I53746L242L9l689p371j0890j4390j7696k0377k2327k3805k4865k5219k4774
$$ plain form
62964 761624 737670 714529 692346 671622 652810 635940 620717 606760 593704 581312 569661
62953 569661 559027 549407 540259 530829 520676 509820 498534 487126 475848 464834 454143 443866
62941 443866 434126 424964 416370 408462 401459 395376 389855 384421 378877 373424 368521 364611 361775 359563
62927 359563 357362 355068 353116 351681 350154 347740 344415 340970 338279 336883 337056 338590 340406 341037 339957
62912 339957 338146 337030 337120 337975 339145 340613 342448 344577 346990 349718 352449 354520 355565 355948 356338
62897 356338 357087 358286 360208 363320 367834 373568 380257 387681 395355 402422 408226 413000 417693 423018
62883 423018 428784 434174 438524 441685 443717 444544 444057 442460 440301 438069 435819 433242 430021 426050 421350
62868 421350 415915 409730 402970 396108 389669 383723 377691 370940 363668 356945 351664 347642 344082 340723
$$ packed form
62964G61624k3954k3141k2183k0724j8812j6870j5223j3957j3056j2392j1651
62953E69661j0634r620r148r430j0153j0856j1286j1408j1278j1014j0691j0277
62941D43866r740r162q594p908p003o083n521n434n544n453m903l910k836k212
62927C59563k201k294j952j435j527k414l325l445k691j396J73J534J816O31j080
62912C39957j811j116R0Q55J170J468J835K129K413K728K731K071J045L83L90
62897C56338P49J199J922L112M514N734O689P424P674P067N804M774M693N325
62883D23018N766N390M350L161K032Q27m87j597k159k232k250k577l221l971m700
62868D21350n435o185o760o862o439n946o032o751p272o723n281m022l560l359
$$ plain form
62854 340723 338074 336505 335654 334957 334271 333602 332642 331082 329213 327649 326527 325502 324566 324292 325035 326378
62838 326378 327657 328679 329543 330075 329937 329196 328334 327663 327130 326731 326768 327513 328851 330435 332055 333699 335398
62821 335398 337186 339150 341364 343737 345985 347728 348610 348460 347473 346124 344706 342992 340587 337630 334894
62806 334894 333011 331833 330832 329992 329871 330688 331743 332064 331494 330841 331005 332189 333956 335796 337545 339332
62790 339332 341175 342619 342930 341876 340203 339069 339014 339758 340945 342605 344771 347137 349466 352066 355443
62775 355443 359684 364540 369929 375904 382152 387994 392920 396773 399335 400248 399588 398206 397104 396550 396035
62760 396035 394988 393357 391579 390126 389049 387855 385954 383263 380226 377138 373740 369700 365252 361057
62746 361057 357511 354477 351539 348220 344121 339370 334917 331823 330041 328379 325922 323086 320893 319674
$$ packed form
62854C40723k649j569q51o97o86o69r60j560j869j564j122j025r36k74P43J343
62838C26378J279J022Q64N32j38p41q62o71n33l99L7P45J338J584J620J644J699
62821C35398J788J964K214K373K248J743Q82j50r87j349j418j714k405k957k736
62806C34894j883j178j001q40j21Q17J055L21n70o53J64J184J767J840J749J787
62790C39332J843J444L11j054j673j134n5P44J187J660K166K366K329K600L377
62775C55443M241M856N389N975O248N842M926L853K562R13o60j382j102n54n15
62760C96035j047j631j778j453j077j194j901k691l037l088l398m040m448m195
62746C61057l546l034k938l319m099m751m453l094j782j662k457k836k193j219
$$ plain form
62732 319674 319012 318687 318951 319877 321003 321776 321957 321517 320605 319801 319895 321112 322879 324677 326759 329650 333242
62715 333242 336864 340165 343507 347420 351987 356798 361428 366014 371494 379024 388931 400452 412823 426255
62701 426255 441337 457780 474582 491493 509487 529439 550998 573282 596189 620380 646228
62690 646228 673485 701944 731786 763015 794911 826328 856332 884302 909478 930732 946943
62679 946943 957521 962327 961075 953106 938055 916659 890608 861614 830787 798750 765943 732707
62667 732707 699495 667155 636671 608411 581911 556637 532732 510915 491810 475503 461469
62656 461469 448788 436768 425469 415344 406389 398170 390771 384942 380849 377409 373513 369381 365895
62643 365895 363007 359762 355749 351629 348177 345574 343738 342646 342122 341905 342093 342967 344294 345360 345829
$$ packed form
62732C19674o62l25K64R26J126P73J81m40r12q04R4J217J767J798K082K891L592
62715C33242L622L301L342L913M567M811M630M586N480P530R907J1521J2371J3432
62701D26255J5082J6443J6802J6911J7994J9952K1559K2284K2907K4191K5848
62690F46228K7257K8459K9842L1229L1896L1417L0004K7970K5176K1254J6211
62679I46943J0578M806j252p969j5051k1396k6051k8994l0827l2037l2807l3236
62667G32707l3212l2340l0484k8260k6500k5274k3905k1817j9105j6307j4034
62656D61469j2681j2020j1299j0125q955q219p399n829m093l440l896m132l486
62643C65895k888l245m013m120l452k603j836j092n24k17J88Q74J327J066M69
$$ plain form
62628 345829 345974 345928 345318 343901 341961 339829 337572 335369 333572 332111 330465 328582 327117 326269 325142
62613 325142 322948 320298 318436 317599 316998 316168 315447 315112 314919 314679 314592 314706 314556 313716 312393 311216 310568
62596 310568 310284 309928 309362 309081 309827 311648 313614 314800 315354 316102 317221 317983 317981 317994 319176 321715 324689
62579 324689 327088 328581 329332 329444 328827 327534 325967 324615 323572 322473 320923 318907 316699 314571 312699
62564 312699 311178 309923 308672 307343 306270 305839 305931 306020 305792 305479 305526 306156 307180 308096 308457 308360 308484 309376
62546 309376 310742 311698 311671 310836 309799 309186 309511 310977 313247 315679 317934 320192 322782 325793 328981 331731
62530 331731 333192 332930 331647 330850 331604 333838 336954 340664 344987 349848 355130 360966 367587 374951 382774
62515 382774 390885 399372 408553 419005 431481 446413 463487 481884 500989 520709 541178 562361
$$ packed form
62628C45829J45m6o10j417j940k132k257k203j797j461j646j883j465q48j127
62613C25142k194k650j862q37o01q30p21l35j93k40q7J14j50q40j323j177o48
62596C10568k84l56n66k81P46J821J966J186N54P48J119P62kJ3J182K539K974
62579C24689K399J493P51J12o17j293j567j352j043j099j550k016k208k128j872
62564C12699j521j255j251j329j073m31R2Q9k28l13M7O30J024R16L61r7J24Q92
62546C09376J366R56k7q35j037o13L25J466K270K432K255K258K590L011L188K750
62530C31731J461k62j283p97P54K234L116L710M323M861N282N836O621P364P823
62515C82774Q111Q487R181J0452J2476J4932J7074J8397J9105J9720K0469K1183
$$ plain form
62503 562361 583983 605638 626852 647076 665677 682068 695887 707014 715288 720296 721762 720228
62491 720228 717081 713681 710672 708298 707090 707856 711078 716719 724674 735157 748483 764681 783471
62478 783471 804546 827718 852701 878620 903693 925522 942025 952329 956876 956685 952423 943883
62466 943883 930134 910164 883624 851226 814580 775646 736090 696867 658299 620650 584635
62455 584635 551200 520867 493581 469291 448367 431158 417376 406201 396970 389491 383754 379540
62443 379540 376263 373076 369299 365030 361140 358268 355954 353237 350086 347588 346496 346210 345697 344949 344815
62428 344815 345519 346153 345852 344909 344297 344441 344903 345090 344778 343974 342784 341623 341162 341704 342792 343715 344335 345071
62410 345071 346130 347158 347810 348295 349038 349988 350649 350798 350848 351336 352241 353057 353449 353637 354099 355088 356571 358564
$$ packed form
62503E62361K1622K1655K1214K0224J8601J6391J3819J1127Q274N008J466j534
62491G20228l147l400l009k374j208P66L222N641P955J0483J3326J6198J8790
62478G83471K1075K3172K4983K5919K5073K1829J6503J0304M547j91m262q540
62466I43883j3749j9970k6540l2398l6646l8934l9556l9223l8568l7649l6015
62455E84635l3435l0333k7286k4290k0924j7209j3782j1175r231p479n737m214
62443C79540l277l187l777m269l890k872k314k717l151k498j092k86n13p48j34
62428C44815P04O34l01r43o12J44M62J87l12q04j190j161m61N42J088R23O20P36
62410C45071J059J028O52M85P43R50O61J49N0M88R05Q16L92J88M62R89J483J993
$$ plain form
62392 358564 361284 364926 369391 374371 379597 384944 390361 395838 401411 407091 412847 418839 425562 433497
62378 433497 442592 452334 462364 472740 483558 494685 506149 518370 531605 545330 558769 572023
62366 572023 586173 602189 620146 639775 661315 685478 712827 743683 778502 817912 862335
62355 862335 911939 967083 1028371 1095927 1168620 1244143 1319716 1392563 1459939 1519176 1567980
62344 1567980 1604729 1628557 1639374 1637934 1625703 1604390 1575445 1539955 1498867 1453147 1403740
62333 1403740 1351533 1297531 1243070 1189728 1138932 1091533 1047730 1007347 970158 935970 904455
62322 904455 875056 847089 819987 793532 767933 743609 720702 698805 677310 656049 635435
62311 635435 616025 598197 582284 568556 556797 546189 536085 526683 518586 511842 505979 500922
$$ packed form
62392C58564K720L642M465M980N226N347N417N477N573N680N756N992O723P935
62378D33497R095R742J0030J0376J0818J1127J1464J2221J3235J3725J3439J3254
62366E72023J4150J6016J7957J9629K1540K4163K7349L0856L4819L9410M4423
62355H62335M9604N5144O1288O7556P2693P5523P5573P2847O7376N9237M8804
62344A567980L6749K3828J0817j440j2231k1313k8945l5490m1088m5720m9407
62333A403740n2207n4002n4461n3342n0796m7399m3803m0383l7189l4188l1515
62322I04455k9399k7967k7102k6455k5599k4324k2907k1897k1495k1261k0614
62311F35435j9410j7828j5913j3728j1759j0608j0104r402q097o744n863n057
$$ plain form
62299 500922 497213 495135 494118 493327 492458 491683 491261 491528 492924 495547 498894 502455 506285 510581 514962
62284 514962 518800 522154 525678 529574 533275 536369 539220 542339 545679 548961 552253 555711 559049 561932
62270 561932 564760 568508 573760 580414 588348 597825 609108 622312 638019 657550 682005 711308 744754
62257 744754 782391 825234 874080 928780 988899 1054474 1125525 1201066 1278945 1356370 1429991
62246 1429991 1495739 1549518 1588743 1613135 1623954 1622633 1610152 1587263 1554835 1513913 1465605
62235 1465605 1410968 1351121 1287566 1222242 1156951 1092731 1030182 970392 915042 865343 821300
62224 821300 782317 748012 718014 691471 667542 646263 628186 613097 599789 587273 575640
62213 575640 565461 556867 549496 542868 536383 529438 522168 515804 511573 509221 507168 504269 500919 498249
$$ packed form
62299E00922l709k078j017p91q69p75m22K67J396K623L347L561L830M296M381
62284E14962L838L354L524L896L701L094K851L119L340L282L292L458L338K883
62270E61932K828L748N252O654P934R477J1283J3204J5707J9531K4455K9303L3446
62257G44754L7637M2843M8846N4700O0119O5575P1051P5541P7879P7425P3621
62246A429991O5748N3779L9225K4392J0819j321j2481k2889l2428m0922m8308
62235A465605n4637n9847o3555o5324o5291o4220o2549n9790n5350m9699m4043
62224H21300l8983l4305k9998k6543k3929k1279j8077j5089j3308j2516j1633
62213E75640j0179q594p371o628o485o945p270o364m231k352k053k899l350k670
$$ plain form
62199 498249 496750 496111 496133 497229 499991 504541 510435 516985 523656 530389 537625 545886 555268 565485 576361
62184 576361 587993 600297 612725 624743 636361 647847 659096 669715 679642 689177 698294 706423
62172 706423 713153 718884 724656 731740 741610 755823 775419 800559 831047 866979 908599 955798
62160 955798 1008068 1064540 1123416 1181546 1235200 1281424 1318414 1344983 1360481 1365316 1360817 1348252
62148 1348252 1328379 1301958 1269964 1232966 1190959 1144373 1094811 1044292 994145 945155 898419
62137 898419 855283 816429 781639 750578 723388 700378 681410 665749 652359 640406 629725
62126 629725 620786 613949 608808 604501 600666 597733 596256 596362 597966 601107 605725 611476 618220 626592
62112 626592 637582 651433 667351 684454 702721 722753 744895 769009 794900 822348 850478
$$ packed form
62199D98249j499o39K2J096K762M550N894O550O671O733P236Q261R382J0217J0876
62184E76361J1632J2304J2428J2018J1618J1486J1249J0619R927R535R117Q129
62172G06423O730N731N772P084R870J4213J9596K5140L0488L5932M1620M7199
62160I55798N2270N6472N8876N8130N3654M6224L6990K6569J5498M835m499j2565
62148A348252j9873k6421l1994l6998m2007m6586m9562n0519n0147m8990m6736
62137H98419m3136l8854l4790l1061k7190k3010j8968j5661j3390j1953j0681
62126F29725q939o837n141m307l835k933j477J06J604L141M618N751O744Q372
62112F26592J0990J3851J5918J7103J8267K0032K2142K4114K5891K7448K8130
$$ plain form
62101 850478 877466 901122 919625 931718 936898 936000 931356 925750 921084 918160 917168 917483 917034 912883
62087 912883 903197 888549 871309 854227 839708 829565 824684 824962 829851 838825 851236 866318 883780
62074 883780 904027 927339 953177 980762 1009904 1040626 1072300 1103937 1135285 1166969 1199594
62063 1199594 1233438 1269050 1307260 1348183 1390667 1433069 1474123 1512706 1547097 1574994 1594331
62052 1594331 1604104 1604620 1597024 1582455 1561607 1535218 1504578 1470934 1434403 1394167 1349973 1302905
62040 1302905 1254490 1205712 1157285 1110286 1065771 1024024 984767 947969 913962 882872 854459
62029 854459 828448 804683 783058 763777 747603 735323 726780 720742 715758 710886 705576 699355 691888
62016 691888 683148 673347 662876 652406 642760 634346 626841 619688 612938 607343 603525 601192 599433 597832
$$ packed form
62101H50478K6988K3656J8503J2093N180q98m644n606m666k924r92L15m49m151
62087I12883r686j4648j7240j7082j4519j0143m881K78M889Q974J2411J5082J7462
62074H83780K0247K3312K5838K7585K9142L0722L1674L1637L1348L1684L2625
62063A199594L3844L5612L8210M0923M2484M2402M1054L8583L4391K7897J9337
62052A594331R773N16p596j4569k0848k6389l0640l3644l6531m0236m4194m7068
62040A302905m8415m8778m8427m6999m4515m1747l9257l6798l4007l1090k8413
62029H54459k6011k3765k1625j9281j6174j2280q543o038m984m872n310o221p467
62016F91888q740r801j0471j0470r646q414p505p153o750n595l818k333j759j601
$$ plain form
62002 597832 597092 598316 601783 606710 612247 618281 625041 632231 639056 645035 650302 655001 658685 660554
61988 660554 660123 657455 652894 646790 639492 631365 622625 613142 602598 591003 579093 568030 558589
61975 558589 550727 543908 537695 531894 526425 521338 516803 512813 508990 504963 500865 497120 493790 490596
61961 490596 487611 485415 484292 483693 482942 482207 482340 483834 486404 489540 492974 496511 499895 503244 507295
61946 507295 512767 519572 527094 535244 544844 556795 571271 588005 607017 628552 652410 677916
61934 677916 704625 732609 761756 791225 819982 847608 874173 899481 922946 944171 963136
61923 963136 979683 993237 1003190 1009168 1010700 1007068 998037 984693 969138 953309 938292 924716
61911 924716 913373 905141 900500 899495 902295 909520 921730 938540 958457 979715 1001103 1021853
$$ packed form
62002E97832p40J224L467M927N537O034O760P190O825N979N267M699L684J869
61988F60554m31k668m561o104p298q127q740r483j0544j1595j1910j1063r441
61975E58589p862o819o213n801n469n087m535l990l823m027m098l745l330l194
61961D90596k985k196j123n99p51p35J33J494K570L136L434L537L384L349M051
61946E07295N472O805P522Q150R600J1951J4476J6734J9012K1535K3858K5506
61934F77916K6709K7984K9147K9469K8757K7626K6565K5308K3465K1225J8965
61923I63136J6547J3554R953N978J532l632r031j3344j5555j5829j5017j3576
61911I24716j1343q232m641j005K800P225J2210J6810J9917K1258K1388K0750
$$ plain form
61899 1021853 1040960 1056968 1068411 1074184 1073543 1066301 1053263 1036072 1016159 993934 969309 942850
61887 942850 915966 889948 865116 841056 817537 795113 774870 757477 742331 727754 712228
61876 712228 695422 677903 660225 642748 626153 611341 598543 587082 576440 567178 560388 556515
61864 556515 555167 555835 558245 562048 566752 572221 578941 587649 598881 612942 630033 650255 673663
61851 673663 700412 730724 764672 802178 843198 887603 934778 983607 1033039 1082354 1130646
61840 1130646 1176329 1217549 1252996 1281973 1303758 1317342 1322043 1318201 1307164 1290730 1270710 1248875
61828 1248875 1227072 1207275 1191470 1181411 1178271 1182348 1193048 1209236 1229628 1252712 1276241 1297183
61816 1297183 1312727 1321433 1323006 1316884 1301645 1276280 1241728 1200604 1155564 1108302 1059910 1011442
$$ packed form
61899A021853J9107J6008J1443N773o41p242j3038j7191j9913k2225k4625k6459
61887I42850k6884k6018k4832k4060k3519k2424k0243j7393j5146j4577j5526
61876G12228j6806j7519j7678j7477j6595j4812j2798j1461j0642r262o790l873
61864E56515j348O68K410L803M704N469O720Q708J1232J4061J7091K0222K3408
61851F73663K6749L0312L3948L7506M1020M4405M7175M8829M9432M9315M8292
61840A130646M5683M1220L5447K8977K1785J3584M701l842j1037j6434k0020k1835
61828A248875k1803j9797j5805j0059l140M077J0700J6188K0392K3084K3529K0942
61816A297183J5544Q706J573o122j5239k5365l4552m1124m5040m7262m8392m8468
$$ plain form
61804 1011442 963948 918448 876082 837810 803681 772787 744214 717816 693938 672833 654720
61793 654720 639923 628356 619010 610559 602481 595245 589390 584850 581200 578146 575557 573334 571410 569666
61779 569666 567744 565182 561926 558503 555527 553141 551039 548880 546515 543934 541211 538450 535682 532878
61765 532878 530163 527944 526660 526380 526757 527380 528138 529201 530697 532419 533926 535006 536020 537667 540341
61750 540341 543778 547311 550315 552410 553509 553919 554284 555128 556363 557366 557558 556843 555571 554313 553698 554198
61734 554198 555876 558423 561520 565030 568755 572228 575060 577451 580019 583108 586536 590023 593516 596877
61720 596877 599643 601483 602756 604230 606303 608782 611383 613986 616355 618005 618590 618158 616884 614837 612236
61705 612236 609610 607416 605643 604127 603022 602673 603066 603771 604428 605030 605756 606759 608157 610002 612204 614574
$$ packed form
61804A011442m7494m5500m2366l8272l4129l0894k8573k6398k3878k1105j8113
61793F54720j4797j1567r346q451q078p236n855m540l650l054k589k223j924j744
61779E69666j922k562l256l423k976k386k102k159k365k581k723k761k768k804
61765E32878k715k219j284k80L77O23P58J063J496J722J507J080J014J647K674
61750E40341L437L533L004K095J099M10L65Q44J235J003J92p15j272j258o15N00
61734E54198J678K547L097L510L725L473K832K391K568L089L428L487L493L361
61720E96877K766J840J273J474K073K479K601K603K369J650N85m32j274k047k601
61705F12236k626k194j773j516j105l49L93P05O57O02P26J003J398J845K202K370
$$ plain form
61689 614574 616942 619184 621222 623082 624781 626086 626652 626634 626803 627607 628402 628160 626764 624990 623266 621227
61673 621227 618599 615761 613067 610262 607084 603947 601422 599395 597293 594933 592618 590533 588594 586764
61659 586764 585045 583183 580873 578327 576225 575040 574740 575141 576164 577702 579661 582298 586146 591379 597441
61644 597441 603525 609247 614791 620528 626634 632890 638751 643729 647786 651198 653986 655674 655705 653988 651029
61629 651029 647626 644416 641435 638114 633921 629101 624479 620478 616688 612582 608349 604614 601563 598776
61615 598776 595942 593311 591264 589654 587789 585017 581167 576386 570718 564055 556548 548851 541736 535443
61601 535443 529588 523681 517581 511439 505518 500183 495812 492487 489854 487500 485370 483690 482569 481876
61587 481876 481471 481356 481533 481800 481771 481089 479721 478079 476749 475969 475452 474812 474039 473412 472940 472122 470347 467491
$$ packed form
61689F14574K368K242K038J860J699J305N66j8J69Q04P95k42j396j774j724k039
61673F21227k628k838k694k805l178l137k525k027k102k360k315k085j939j830
61659E86764j719j862k310k546k102j185l00M01J023J538J959K637L848N233O062
61644E97441O084N722N544N737O106O256N861M978M057L412K788J688L1j717k959
61629F51029l403l210k981l321m193m820m622m001l790m106m233l735l051k787
61615E98776k834k631k047j610j865k772l850m781n668o663p507p697p115o293
61601E35443n855n907o100o142n921n335m371l325k633k354k130j680j121o93
61587D81876m05j15J77K67k9o82j368j642j330p80n17o40p73o27m72q18j775k856
$$ plain form
61569 467491 464094 460967 458553 456596 454445 451710 448565 445440 442499 439560 436410 433071 429794 426879
61555 426879 424438 422312 420294 418447 416988 415780 414269 412191 410067 408598 407750 406952 406107 405735 406004
61540 406004 406214 405706 404806 404378 404724 405441 406185 407000 407898 408698 409423 410387 411655 412757 413225 413088 412560 411565
61522 411565 409978 408139 406636 405591 404582 403353 402175 401365 400798 400226 399724 399379 398695 396845 393696 390216
61506 390216 387625 386334 385899 385762 385628 385225 384252 382821 381654 381414 381866 382015 381136 379471 377816 376688
61490 376688 376091 375914 376185 376878 377732 378425 378848 379111 379431 380115 381499 383589 385769 387124 387293 386917 387020
61473 387020 387935 389007 389443 389251 389120 389445 389790 389482 388491 387475 387000 386982 386926 386518 385884 385397 385332 385636 385969
61454 385969 386002 385773 385631 385786 385976 385708 384858 383926 383632 384211 385119 385523 385167 384672 384919 386185 388060 390050
$$ packed form
61569D67491l397l127k414j957k151k735l145l125k941k939l150l339l277k915
61555D26879k441k126k018j847j459j208j511k078k124j469q48p98q45l72K69
61540D06004K10n08r00m28L46P17P44Q15Q98Q00P25R64J268J102M68j37n28r95
61522D11565j587j839j503j045j009j229j178q10n67n72n02l45o84j850l149l480
61506C90216k591j291m35j37j34m03r73j431j167k40M52J49q79j665j655j128
61490C76688n97j77K71O93Q54O93M23K63L20O84J384K090K180J355J69l76J03
61473C87020R15J072M36j92j31L25L45l08r91j016m75j8n6m08o34m87o5L04L33
61454C85969L3k29j42J55J90k68q50r32k94N79R08M04l56m95K47J266J875J990
$$ plain form
61436 390050 392002 393969 396095 398756 402434 407119 412028 416232 419417 421821 423656 425025 426303 428084
61422 428084 430577 433347 435842 438022 440346 443251 446728 450375 453818 457110 460586 464221 467334 469174
61408 469174 469646 469206 468141 466321 463584 459922 455309 449838 444097 438895 434453 430369 426602 423872 422622
61393 422622 422120 421226 419715 418177 416808 415183 413228 411604 410784 410419 410043 409898 410484 411641 412728 413579
61377 413579 414687 416351 418219 419849 421278 422737 424234 425836 428043 431250 434846 437486 438452 438377 438375 438884
61361 438884 439645 440457 441460 442837 444683 447076 449859 452475 454491 456304 458772 462116 465727 469282 473529
61346 473529 479629 488042 498391 510085 522727 536144 550414 565751 582114 598990 615627 631131
61334 631131 644243 653602 658746 660509 659918 657004 651305 643274 634407 625946 618127 610747 603805 597311
$$ packed form
61436C90050J952J967K126K661L678M685M909M204L185K404J835J369J278J781
61422D28084K493K770K495K180K324K905L477L647L443L292L476L635L113J840
61408D69174M72m40j065j820k737l662m613n471n741n202m442m084l767k730j250
61393D22622n02q94j511j538j369j625j955j624q20l65l76j45N86J157J087Q51
61377D13579J108J664J868J630J429J459J497J602K207L207L596K640R66p5kN09
61361D38884P61Q12J003J377J846K393K783K616K016J813K468L344L611L555M247
61346D73529O100Q413J0349J1694J2642J3417J4270J5337J6363J6876J6637J5504
61334F31131J3112R359N144J763n91k914n699q031q867q461p819p380o942o494
$$ plain form
61320 597311 591062 585019 579545 574936 571026 567556 564630 562492 561054 559892 558520 556516 553685 550404
61306 550404 547592 545971 545476 545660 546477 548259 551072 554610 558811 564120 570891 578855 587456 596477 605900
61291 605900 615150 622912 627878 629500 627920 623523 616938 609245 601583 594395 587421 580589 574480 569694
61277 569694 566252 564035 563405 564721 567475 570649 573917 577852 582856 588556 594539 601026 608436 616721
61263 616721 625646 635283 645729 656606 667412 678210 689403 700957 712470 724157 737152 752450
61251 752450 769883 788496 807751 827855 848642 868404 884240 893780 896524 893494 885852 874288
61239 874288 859565 842975 825776 808491 791203 774404 759075 745897 734765 725225 717142 710824
61227 710824 706670 704818 704939 706243 707766 708820 709245 709353 709748 711120 713915 718005 722727 727290 731105
$$ packed form
61320E97311o249o043n474m609l910l470k926k138j438j162j372k004k831l281
61306E50404k812j621m95J84Q17J782K813L538M201N309O771P964Q601R021R423
61291F05900R250P762M966J622j580m397o585p693p662p188o974o832o109m786
61277E69694l442k217o30J316K754L174L268L935N004N700N983O487P410Q285
61263F16721Q925R637J0446J0877J0806J0798J1193J1554J1513J1687J2995J5298
61251G52450J7433J8613J9255K0104K0787J9762J5836R540K744l030p642j1564
61239H74288j4723j6590j7199j7285j7288j6799j5329j3178j1132r540q083o318
61227G10824m154j852J21J304J523J054M25J08L95J372K795M090M722M563L815
$$ plain form
61212 731105 733755 734880 734265 732045 728717 724931 721265 718132 715796 714393 713888 714004 714219 713947 712821
61197 712821 710940 708939 707785 708361 711160 716391 724290 735146 748956 765314 783832 804614 828120
61184 828120 854546 883432 913766 944326 973884 1001275 1025396 1045299 1060558 1071789 1080614 1088718
61172 1088718 1096698 1103950 1109672 1113725 1116370 1117416 1116002 1111257 1102983 1091624 1077744 1061708 1043756
61159 1043756 1024162 1003249 981348 958868 936304 914082 892476 871854 852947 836568 822892
61148 822892 811197 800541 790679 782217 776003 772539 771825 773427 776611 780703 785492 791163 797646 804108
61134 804108 809143 811422 810191 805470 798054 789267 780403 772334 765643 760971 758930 759728 763231 769486
61120 769486 778854 791462 806783 824056 842889 863275 885285 909098 935125 963523 993546 1023851
$$ packed form
61212G31105K650J125o15k220l328l786l666l133k336j403n05J16K15k72j126
61197G12821j881k001j154N76K799N231P899J0856J3810J6358J8518K0782K3506
61184H28120K6426K8886L0334L0560K9558K7391K4121J9903J5259J1231Q825Q104
61172A088718P980P252N722M053K645J046j414m745q274j1359j3880j6036j7952
61159A043756j9594k0913k1901k2480k2564k2222k1606k0622j8907j6379j3676
61148H22892j1695j0656r862q462o214l464p14J602L184M092M789N671O483O462
61134H04108N035K279j231m721p416q787q864q069o691m672k041P98L503O255
61120G69486R368J2608J5321J7273J8833K0386K2010K3813K6027K8398L0023L0305
$$ plain form
61108 1023851 1053602 1082959 1112398 1141888 1170853 1198553 1224321 1247797 1269199 1289005 1307049
61097 1307049 1322330 1334087 1342745 1349307 1354013 1356059 1354430 1348487 1337888 1322565 1302935 1279666
61085 1279666 1253214 1223956 1192803 1161115 1129838 1099157 1069144 1040254 1012879 986817 961658
61074 961658 937583 915403 895759 878463 862734 848082 834952 824335 816622 811064 806586 802901
61062 802901 800507 799820 800801 803372 807572 813216 819874 827297 835441 844038 852655 861312 870563 880800
61048 880800 891906 903727 916375 929975 944619 960745 978972 999345 1021353 1044946 1070873
61037 1070873 1099599 1130456 1162338 1194751 1227739 1261273 1295240 1329628 1364206 1398404 1431985
61026 1431985 1465484 1499543 1534184 1569159 1604635 1641082 1678852 1718277 1759876 1804083 1851270
$$ packed form
61108A023851K9751K9357K9439K9490K8965K7700K5768K3476K1402J9806J8044
61097A307049J5281J1757Q658O562M706K046j629n943j0599j5323j9630k3269
61085A279666k6452k9258l1153l1688l1277l0681l0013k8890k7375k6062k5159
61074I61658k4075k2180j9644j7296j5729j4652j3130j0617p713n558m478l685
61062H02901k394o87R81K571M200N644O658P423Q144Q597Q617Q657R251J0237
61048H80800J1106J1821J2648J3600J4644J6126J8227K0373K2008K3593K5927
61037A070873K8726L0857L1882L2413L2988L3534L3967L4388L4578L4198L3581
61026A431985L3499L4059L4641L4975L5476L6447L7770L9425M1599M4207M7187
$$ plain form
61015 1851270 1902328 1958588 2020608 2087439 2157442 2229242 2301795 2374813 2450182 2532243 2625769
61004 2625769 2734145 2859861 3005286 3171584 3357786 3562433 3785964 4031334 4304470
60995 4304470 4616302 4983377 5424769 5959947 6612038 7412070 8398725 9618576 11132976
60986 11132976 13022429 15374487 18261107 21720700 25731274 30142147 34587817 38493582
60978 38493582 41262159 42567626 42541382 41698790 40678415 40002091 39972052 40644236 41788220
60969 41788220 42876765 43225178 42282045 39891246 36332796 32134196 27819718 23760526
60961 23760526 20154839 17071190 14496199 12373494 10634547 9215550 8060016 7117809
60953 7117809 6347363 5716628 5199131 4770057 4407028 4092761 3815283 3566430 3340948
$$ packed form
61015A851270N1058N6260O2020O6831P0003P1800P2553P3018P5369Q2061R3526
61004B625769J08376J25716J45425J66298J86202K04647K23531K45370K73136
60995D304470L11832L67075M41392N35178O52091Q00032R86655J219851J514400
60986A1132976J889453K352058K886620L459593M010574M410873M445670L905765
60978C8493582K768577J305467k6244q42592j020375o76324l0039O72184J143984
60969D1788220J088545L48413r43133k390799l558450m198600m314478m059192
60961B3760526l605687l083649k574991k122705j738947j418997j155534r42207
60953G117809p70446o30735n17497m29074l63029l14267k77478k48853k25482
$$ plain form
60944 3340948 3135674 2948120 2776045 2618546 2476303 2349767 2237645 2137552 2047053 1963256
60934 1963256 1882287 1800526 1716502 1631242 1546991 1465854 1389174 1317591 1251570 1191750 1138455
60923 1138455 1091024 1048230 1009354 974302 942780 914202 888460 865899 846236 828342 811406
60912 811406 795611 781335 768487 756992 747131 738943 732053 726548 723124 721738 720956 719477 717630
60899 717630 716450 715909 715102 713749 712233 710256 706635 700874 694116 688095 683538 679833 675860 670866 664848
60884 664848 658382 652112 646386 641333 637045 633418 629965 626104 621569 616341 610316 603302 595234 586232
60870 586232 576584 566860 557783 549669 542216 535100 528515 522722 517413 512114 507155 503575 501939 501694
60856 501694 501819 501719 501327 500802 500447 500692 501873 504086 507349 511717 517075 522957 528788 534257 539408 544492
$$ packed form
60944C340948k05274j87554j72075j57499j42243j26536j12122j00093r0499q3797
60934A963256q0969q1761q4024q5260q4251q1137p6680p1583o6021n9820n3295
60923A138455m7431m2794l8876l5052l1522k8578k5742k2561j9663j7894j6936
60912H11406j5795j4276j2848j1495r861q188o890n505l424j386p82j479j847
60899G17630j180n41q07j353j516j977l621n761o758o021m557l705l973m994o018
60884F64848o466o270n726n053m288l627l453l861m535n228o025p014q068r002
60870E86232r648r724r077q114p453p116o585n793n309n299m959l580j636k45
60856E01694J25j00l92n25l55K45J181K213L263M368N358N882N831N469N151N084
$$ plain form
60840 544492 549877 556005 563130 570906 578262 583870 586963 587785 587258 586246 585152 584097 583115 582050 580507
60825 580507 578240 575631 573596 572889 573544 574983 576579 578071 579453 580579 581015 580327 578370 575158 570636
60810 570636 564789 557893 550345 542282 533712 524972 516655 508934 501413 493807 486381 479423 472722 466095
60796 466095 460081 455515 452438 450020 447611 445357 443576 441990 439969 437354 434668 432545 431148 430181
60782 430181 429299 428436 427819 427746 428320 429342 430438 431396 432378 433749 435654 437845 440076 442516 445607 449522
60766 449522 454037 458916 464195 470038 476551 483788 491700 499969 508163 516157 524148 532139 539694 546403
60752 546403 552278 557488 561993 565718 568792 571341 573283 574688 576046 577787 579727 581380 582569 583199
60738 583199 582656 580143 575605 569695 562743 554471 544931 535005 525472 516168 506590 496920 487800 479391
$$ packed form
60840E44492N385O128P125P776P356N608L093Q22n27j012j094j055r82j065j543
60825E80507k267k609k035p07O55J439J596J492J382J126M36o88j957l212m522
60810E70636n847o896p548q063q570q740q317p721p521p606p426o958o701o627
60796D66095o014m566l077k418k409k254j781j586k021k615k686k123j397r67
60782D30181q82q63o17p3N74J022J096R58R82J371J905K191K231K440L091L915
60766D49522M515M879N279N843O513P237P912Q269Q194P994P991P991P555O709
60752E46403N875N210M505L725L074K549J942J405J358J741J940J653J189O30
60738E83199n43k513m538n910o952q272r540r926r533r304r578r670r120q409
$$ plain form
60724 479391 471440 464208 458526 454652 451712 448680 445498 442760 440643 438779 437041 435857 435539 435864 436634
60709 436634 438248 441232 445367 449748 453749 457576 461845 466956 473012 479983 487699 495786 503830 511549
60695 511549 518847 525876 533055 540684 548339 554933 559674 562813 565240 567453 569179 569923 569670 569067 569019
60680 569019 569999 571655 573229 574544 576363 579611 584482 590624 597956 606818 617367 629240 641871 654839
60666 654839 667901 681131 695213 711230 729830 750615 772492 794553 816605 839039 862321
60655 862321 886545 911346 936120 960182 982648 1002408 1018486 1030424 1038168 1041731 1041212 1036933
60643 1036933 1029129 1017505 1001554 981483 958476 933890 908491 882634 856852 831948 808649
60632 808649 787359 768108 750624 734592 720057 707402 696816 687980 680490 674422 670143 667605
$$ packed form
60724D79391p951p232n682l874k940l032l182k738k117j864j738j184l18L25P70
60709D36634J614K984M135M381M001L827M269N111O056O971P716Q087Q044P719
60695E11549P298P029P179P629P655O594M741L139K427K213J726P44k53o03m8
60680E69019R80J656J574J315J819L248M871O142P332Q862J0549J1873J2631J2968
60666F54839J3062J3230J4082J6017J8600K0785K1877K2061K2052K2434K3282
60655H62321K4224K4801K4774K4062K2466J9760J6078J1938P744L563n19m279
60643A036933p804j1624j5951k0071k3007k4586k5399k5857k5782k4904k3299
60632H08649k1290j9251j7484j6032j4535j2655j0586q836p490o068m279k538
$$ plain form
60620 667605 666068 664550 662480 659929 657295 654754 651978 648455 644072 639218 634260 629188 623906 618600
60606 618600 613542 608683 603729 598535 593129 587481 581578 575703 570253 565212 560171 554977 550021 545659
60592 545659 541684 537706 533852 530642 528254 526305 524451 522870 521939 521707 521885 522179 522378 522319 522084 522246
60576 522246 523554 526241 529812 533631 537602 542166 547775 554524 562257 570866 580459 591329 603837 618419
60562 618419 635651 656103 679952 706845 736379 768462 802626 836822 867406 890798 905148
60551 905148 910386 907155 896269 878995 857314 833679 810608 790258 773898 761820 754114 751514
60539 751514 755084 765124 780880 801537 827101 858089 894521 935247 977844 1019026 1055557 1085135
60527 1085135 1106415 1118358 1120233 1112599 1097826 1079197 1059590 1041102 1025312 1013164 1004637 999016
$$ packed form
60620F67605j537j518k070k551k634k541k776l523m383m854m958n072n282n306
60606F18600n058m859m954n194n406n648n903n875n450n041n041n194m956m362
60592E45659l975l978l854l210k388j949j854j581r31k32J78K94J99n9k35J62
60576E22246J308K687L571L819L971M564N609O749P733Q609R593J0870J2508J4582
60562F18419J7232K0452K3849K6893K9534L2083L4164L4196L0584K3392J4350
60551I05148N238l231j0886j7274k1681k3635k3071k0350j6360j2078p706k600
60539G51514L570J0040J5756K0657K5564L0988L6432M0726M2597M1182L6531K9578
60527A085135K1280J1943J875p634j4773j8629j9607j8488j5790j2148q527n621
$$ plain form
60515 999016 995520 993426 991894 990220 988254 986186 984048 981940 980629 981177 983804 987697 992294 998201
60501 998201 1006373 1016894 1029280 1043890 1062337 1086467 1117509 1156595 1205626 1266978 1342196 1431184
60489 1431184 1532728 1645468 1768048 1898269 2032254 2164468 2288410 2397364 2484960 2545638
60479 2545638 2575052 2570402 2530982 2458862 2358997 2238136 2103272 1961031 1818059 1680930
60469 1680930 1554838 1442338 1343626 1257904 1184186 1121163 1067149 1020565 980265 945316 914802
60458 914802 888114 865044 845217 827578 810854 794537 779074 764998 752063 739383 726298
60447 726298 712957 700079 688251 677528 667763 659174 652334 647517 644334 642269 641437 642521 645987
60434 645987 651621 658762 666648 674498 681603 687545 692098 694822 695029 692378 687324 680766 673454 665894
$$ packed form
60515I99016l496k094j532j674j966k068k138k108j311N48K627L893M597N907
60501I98201Q172J0521J2386J4610J8447K4130L1042L9086M9031O1352P5218Q8988
60489A431184J01544J12740J22580J30221J33985J32214J23942J08954Q7596O0678
60479B545638K9414m650l9420p2120r9865j20861j34864j42241j42972j37129
60469A680930j26092j12500r8712q5722p3718o3023n4014m6584m0300l4949l0514
60458I14802k6688k3070j9827j7639j6724j6317j5463j4076j2935j2680j3085
60447G26298j3341j2878j1828j0723r765q589o840m817l183k065q32J084L466
60434F45987N634P141P886P850P105N942M553K724K07k651n054o558p312p560
$$ plain form
60420 665894 658551 651789 645770 640712 637100 635208 634485 633909 633108 632737 633544 635379 637377 638834 639590 639752
60404 639752 639472 639019 638714 638664 638789 639235 640564 643246 647030 651005 654377 657134 659979 663672 668423 673780
60388 673780 678978 683499 687361 690864 694054 696570 698109 698849 699262 699667 700235 701281 703090 705438 707678
60373 707678 709536 711487 714145 717637 721868 727046 733416 740624 747925 755108 762789 771621 781572 792216
60359 792216 803521 816067 830523 846964 864570 881846 897253 909865 919606 927006 932859 938069
60347 938069 943675 950947 961394 976572 997740 1025730 1061222 1105034 1158015 1220663 1292767 1372804
60335 1372804 1457005 1539054 1611429 1667708 1703876 1717888 1708824 1677020 1624810 1556679 1478555
60324 1478555 1396855 1317508 1244855 1180860 1125441 1077845 1037832 1005552 980587 961551 946833
$$ packed form
60420F65894p343o762o019n058l612j892p23n76q01l71Q07J835J998J457P56J62
60404F39752k80m53l05n0J25M46J329K682L784L975L372K757K845L693M751N357
60388F73780N198M521L862L503L190K516J539P40M13M05N68J046J809K348K240
60373G07678J858J951K658L492M231N178O370P208P301P183P681Q832R951J0644
60359G92216J1305J2546J4456J6441J7606J7276J5407J2612R741P400N853N210
60347I38069N606P272J0447J5178K1168K7990L5492M3812N2981O2648P2104Q0037
60335A372804Q4201Q2049P2375N6279L6168J4012r064l1804n2210o8131p8124
60324A478555q1700p9347p2653o3995n5419m7596m0013l2280k4965j9036j4718
$$ plain form
60313 946833 935475 927122 921372 917671 915885 916429 919548 924790 931479 939486 949302 961711 977719 998541
60299 998541 1025220 1058423 1098675 1145918 1197883 1249227 1293476 1326107 1345216 1349658 1338276 1311859
60287 1311859 1274868 1234190 1196446 1166821 1149364 1146851 1160122 1188239 1229085 1278984 1331859
60276 1331859 1380034 1416696 1437604 1440599 1424457 1389016 1336264 1270776 1198752 1126323 1058085
60265 1058085 996568 942689 896547 857790 825514 798365 775163 755440 739250 726422 716095
60254 716095 707078 698634 690790 683862 677872 672619 668089 664417 661439 658713 656037 653597 651476 649470
60240 649470 647448 645483 643474 641241 639247 638503 639242 640289 640472 640206 640898 643190 646699 651285 657459
60225 657459 665381 674397 683897 693918 704501 715040 724626 732630 738722 742827 745275 746483 746274 744098
$$ packed form
60313I46833j1358q353n750l701j786N44L119N242O689Q007R816J2409J6008K0822
60299I98541K6679L3203M0252M7243N1965N1344M4249L2631J9109M442j1382k6417
60287A311859l6991m0678l7744k9625j7457k513J3271K8117M0846M9899N2875
60276A331859M8175L6662K0908K995j6142l5441n2752o5488p2024p2429o8238
60265A058085o1517n3879m6142l8757l2276k7149k3202j9723j6190j2828j0327
60254G16095r017q444p844o928n990n253m530l672k978k726k676k440k121k006
60240F49470k022j965k009k233j994p44P39J047J83k66O92K292L509M586O174
60225F57459P922R016R500J0021J0583J0539R586Q004O092M105K448J208k09k176
$$ plain form
60211 744098 740250 736202 733277 731498 730223 729332 729136 729560 730241 731230 732814 734664 735854 735917 735345 734832
60195 734832 734425 733694 732500 731332 730884 731379 732287 732788 732579 732108 731987 732420 733371 734948 737327 740468 744259
60178 744259 748720 753646 758284 761840 764312 766257 767759 768172 767085 765109 763478 763206 764868 768780 774970
60163 774970 783071 792618 803480 815849 829790 844787 859701 873247 884672 893870 900547 903473
60151 903473 901185 893648 882669 870333 857480 844075 830519 817811 806701 797492 790659 786855
60139 786855 786087 787560 790647 795445 801954 809268 816253 822762 829590 837251 845294 852774 858868 862837
60125 862837 863852 861258 855011 845786 834784 823409 812860 803786 796322 790453 786221 783553 782081
60112 782081 781327 781087 781559 783058 785579 788679 791871 795193 799300 804952 812508 821870 832549 843609
$$ packed form
60211G44098l848m048k925j779j275q91j96M24O81R89J584J850J190O3n72n13
60195G34832m07p31j194j168m48M95R08N01k09m71j21M33R51J577K379L141L791
60178G44259M461M926M638L556K472J945J502M13j087j976j631k72J662L912O190
60163G74970Q101R547J0862J2369J3941J4997J4914J3546J1425R198O677K926
60151I03473k288p537j0979j2336j2853j3405j3556j2708j1110r209o833l804
60139G86855p68J473L087M798O509P314O985O509O828P661Q043P480O094L969
60125H62837J015k594o247r225j1002j1375j0549r074p464n869m232k668j472
60112G82081p54k40M72J499K521L100L192L322M107N652P556R362J0679J1060
$$ plain form
60098 843609 853950 863171 872073 881772 892167 901655 908503 912280 913880 914476 914595 913849 911317 906385
60084 906385 899492 892035 885462 880438 876706 873463 869996 866364 863492 862141 861689 860389 856975 851541
60070 851541 844656 836286 826129 814546 802559 791120 780847 772234 765532 760513 756804 754453 753757
60057 753757 754541 755928 756814 756368 754209 750353 744881 737533 727916 716308 703846 691624 680018 669312
60043 669312 660312 653594 648599 644420 641260 640214 641662 644744 648386 652023 655376 658483 661999 666398
60029 666398 670708 673172 673518 673466 674384 675555 675507 674021 671796 668952 665160 660817 656790 653092 648889 643920
60013 643920 638961 634798 631587 629398 628529 628845 629462 629664 629824 630918 633305 636392 639493 642805 647352
59998 647352 653997 662655 672590 683410 695456 709151 724279 740012 755273 768850 779536 786642
$$ packed form
60098H43609J0341R221Q902R699J0395R488O848L777J600N96J19p46k532m932
60084I06385o893p457o573n024l732l243l467l632k872j351m52j300l414n434
60070H51541o885q370j0157j1583j1987j1439j0273q613o702n019l709k351o96
60057G53757P84J387Q86m46k159l856n472p348r617j1608j2462j2222j1606j0706
60043F69312r000o718m995m179l160j046J448L082L642L637L353L107L516M399
60029F66398M310K464L46n2R18J171m8j486k225k844l792m343m027l698m203m969
60013F43920m959m163l211k189q69L16O17K02J60J094K387L087L101L312M547
59998F47352O645Q658R935J0820J2046J3695J5128J5733J5261J3577J0686P106
$$ plain form
59986 786642 790215 790514 787541 781410 772855 762912 752213 740965 729413 717873 706529 695589 685488
59973 685488 676472 668205 660278 652916 646609 641215 636089 631068 626704 623444 621226 619899 619455 619707 620340
59958 620340 621441 623327 625695 627590 628592 629388 630743 632380 633380 633321 632548 631611 630977 631128 632461 635077
59942 635077 638880 643701 649131 654448 659007 662538 664868 665675 664901 663150 661158 658963 656040 652228 648068
59927 648068 644132 640408 636573 632622 628994 626164 624290 623265 623003 623515 624665 625918 626625 626660 626627 627263
59911 627263 628736 630618 632411 633899 635095 636090 636942 637570 637729 637221 636138 634810 633522 632385 631436 630723
59895 630723 630291 630193 630564 631557 633157 635071 636908 638557 640414 643195 647442 653214 660227 668171 676773
59880 676773 685671 694431 702712 710315 717128 723122 728317 732584 735609 737294 738019 738140 737317 734794 730378
$$ packed form
59986G86642L573K99k973o131q555r943j0699j1248j1552j1540j1344j0940j0101
59973F85488r016q267p927p362o307n394n126n021m364l260k218j327m44K52O33
59958F20340J101J886K368J895J002P96J355J637J000n9p73r37o34J51J333K616
59942F35077L803M821N430N317M559L531K330Q07p74j751j992k195k923l812m160
59927F48068l936l724l835l951l628k830j874j025k62N12J150J253P07L5l3O36
59911F27263J473J882J793J488J196R95Q52O28J59n08j083j328j288j137r49p13
59895F30723m32r8L71R93J600J914J837J649J857K781M247N772P013P944Q602
59880F76773Q898Q760Q281P603O813N994N195M267L025J685P25J21q23k523m416
$$ plain form
59865 730378 724662 718238 711253 703997 697246 691451 685993 679949 673414 667483 662970 659688 657071 654964
59851 654964 653582 652988 652814 652340 650872 648318 645492 643652 643602 645339 648450 652575 657569 663573 671087
59836 671087 680734 692896 707725 725376 745762 767919 789941 809718 825571 836404 842064 844048
59824 844048 845363 848909 855826 865306 875387 883255 885285 878104 860460 834009 802283 769064 737511
59811 737511 709773 686615 667508 651501 638069 627053 618175 611059 605569 601628 598751 596173 593495
59798 593495 590814 588156 585177 581621 577715 573856 570155 566551 563176 560278 557931 556065 554663 553629
59784 553629 552637 551470 550442 549998 549885 549271 547933 546839 547004 548007 548247 546728 544116 541767 540113 538459
59768 538459 536201 533697 531782 530804 530490 530504 530718 530947 530878 530449 530038 530054 530543 531379 532593 534168 535680 536628
$$ packed form
59865G30378n716o424o985p256o751n795n458o044o535n931m513l282k617k107
59851F54964j382n94j74m74j468k554k826j840n0J737L111M125M994O004P514
59836F71087R647J2162J4829J7651K0386K2157K2022J9777J5853J0833N660J984
59824H44048J315L546O917R480J0081P868K030p181j7644k6451l1726l3219l1553
59811G37511k7738k3158j9107j6007j3432j1016q878p116n490l941k877k578k678
59798E93495k681k658k979l556l906l859l701l604l375k898k347j866j402j034
59784E53629r92j167j028m44j13o14j338j094J65J003K40j519k612k349j654j654
59768E38459k258k504j915r78l14J4K14K29o9m29m11J6M89Q36J214J575J512R48
$$ plain form
59750 536628 537183 538223 540451 543690 547177 550339 553085 555485 557515 559184 560774 562741 565252 567828
59736 567828 569669 570412 570434 570259 569886 569037 567861 566964 566726 567024 567668 568651 569744 570336 569949 568686 566949
59719 566949 565058 563381 562345 561894 561307 560098 558824 558423 558996 559954 561186 563141 565592 567320 567600 567332
59703 567332 567966 569760 571881 573911 576349 579545 583030 586313 589708 593851 598748 603898 609169 614934
59689 614934 621290 627597 632982 636913 639091 639231 637427 634611 632126 630674 629914 629186 628351 627767 627632 627666
59673 627666 627398 626597 625323 623711 621818 619677 617401 615142 612878 610325 607153 603350 599273 595309 591545
59658 591545 587844 584255 581275 579633 579756 581479 584335 588040 592493 597287 601623 604957 607482 609595
59644 609595 611095 611339 610116 607806 604673 600651 596030 591673 588058 584590 580498 576146 572817 571289
$$ packed form
59750E36628N55J040K228L239L487L162K746K400K030J669J590J967K511K576
59736E67828J841P43K2j75l73q49j176q97k38K98O44R83J093N92l87j263j737
59719E66949j891j677j036m51n87j209j274m01N73R58J232J955K451J728K80k68
59703E67332O34J794K121K030K438L196L485L283L395M143M897N150N271N765
59689F14934O356O307N385L931K178J40j804k816k485j452p60p28q35n84j35L4
59673F27666k68q01j274j612j893k141k276k259k264k553l172l803m077l964l764
59658E91545l701l589k980j642J23J723K856L705M453M794M336L334K525K113
59644F09595J500K44j223k310l133m022m621m357l615l468m092m352l329j528
$$ plain form
59630 571289 571193 571758 572582 573582 574682 575870 577251 578814 580324 581564 582542 583397 584305 585467 586898 588190
59614 588190 588760 588421 587416 585830 583386 580077 576670 574188 573002 572749 573046 573946 575628 577901 580192
59599 580192 581963 583071 583701 584009 583953 583480 582733 581905 581058 580279 579908 580230 580963 581418 581309 580990 580678 579818
59581 579818 577627 574092 570125 566730 564251 562271 559988 556739 552432 547493 542342 537077 531847 527297
59567 527297 524260 522990 522955 523370 523713 523805 523725 523782 524315 525400 526834 528427 530138 531923 533678 535392 537111
59550 537111 538701 539901 540779 541915 543900 546724 549823 552688 555287 557961 561076 564901 569821 576589
59536 576589 586101 598802 614460 632870 654357 678688 703079 722209 731414 730208 722288 712218
59524 712218 702696 694795 689475 687806 690082 695644 703619 713264 723560 733131 740875 746400 749711 750828
$$ packed form
59630E71289r6N65Q24J000J100J188J381J563J510J240R78Q55R08J162J431J292
59614E88190N70l39j005j586k444l309l407k482j186k53K97R00J682K273K291
59599E80192J771J108O30L08n6m73p47q28q47p79l71L22P33M55j09l19l12q60
59581E79818k191l535l967l395k479j980k283l249m307m939n151n265n230m550
59567E27297l037j270l5M15L43R2q0N7N33J085J434J593J711J785J755J714J719
59550E37111J590J200Q78J136J985K824L099K865K599K674L115L825M920O768
59536E76589R512J2701J5658J8410K1487K4331K4391J9130R205j206p920j0070
59524G12218r522p901n320j669K276N562P975R645J0296R571P744N525L311J117
$$ plain form
59510 750828 749822 746847 741860 734610 725186 714320 702910 691503 680496 670488 661922 654499 647388
59497 647388 640070 632690 625690 619480 614480 610983 608784 607211 605657 603970 602260 600662 599360 598607
59483 598607 598556 599245 600791 603427 607278 612348 618689 626382 635332 645462 657082 670534 685241 699496
59469 699496 711567 720740 727075 730556 730960 728377 723394 716825 709598 702863 697953 696088 698070 703980
59455 703980 713092 724444 737752 753495 771907 792318 813912 836769 861630 888857 918157 948991
59443 948991 980453 1010555 1036095 1053456 1059546 1052652 1033414 1005129 972410 939056 907139 877574
59431 877574 850621 825847 802569 780715 760741 742647 725919 710784 698611 690460 685881 683756
59419 683756 683857 686949 693851 705010 720598 740328 763437 789457 818821 852277 889989 931368
$$ packed form
59510G50828j006k975m987p250r424j0866j1410j1407j1007j0008q566p423p111
59497F47388p318p380p000o210n000l497k199j573j554j687j710j598j302p53
59483E98607n1O89J546K636L851N070O341P693Q950J0130J1620J3452J4707J4255
59469F99496J2071R173O335L481M04k583m983o569p227o735m910j865J982N910
59455G03980R112J1352J3308J5743J8412K0411K1594K2857K4861K7227K9300L0834
59443I48991L1462L0102K5540J7361O090o894j9238k8285l2719l3354l1917k9565
59431H77574k6953k4774k3278k1854j9974j8094j6728j5135j2173q151m579k125
59419F83756J01L092O902J1159J5588J9730K3109K6020K9364L3456L7712M1379
$$ plain form
59407 931368 974652 1015519 1046766 1061264 1056229 1034533 1002337 966274 932193 904489 885370 875277
59395 875277 874147 881083 892118 899615 895681 876765 844951 805576 764289 725541 691991 664376
59383 664376 642094 624157 609612 597571 587513 579559 573931 570134 567187 564659 562909 562162 561955
59370 561955 561775 561725 562132 562848 563453 564006 565112 567159 569800 572328 574427 576424 578835 581762 584785 587518
59354 587518 590235 593788 598880 605562 613565 622960 634236 647750 663356 680723 699773 720542 742705
59341 742705 765632 789064 813427 839081 865309 890381 912739 931802 947534 959514 966893 969190
59329 969190 966803 960610 951276 939093 924392 907873 890419 872606 854528 836253 818439 802251
59317 802251 788449 776656 765764 755091 744976 736264 729509 724763 721774 720006 718640 717030 715301
$$ packed form
59407I31368M3284M0867L1247J4498n035k1696l2196l6063l4081k7704j9119j0093
59395H75277j130O936J1035P497l934j8916l1814l9375m1287l8748l3550k7615
59383F64376k2282j7937j4545j2041j0058p954n628l797k947k528j750p47k07
59370E61955j80n0M07P16O05N53J106K047K641K528K099J997K411K927L023K733
59354E87518K717L553N092O682Q003R395J1276J3514J5606J7367J9050K0769K2163
59341G42705K2927K3432K4363K5654K6228K5072K2358J9063J5732J1980P379K297
59329I69190k387o193r334j2183j4701j6519j7454j7813j8078j8275j7814j6188
59317H02251j3802j1793j0892j0673j0115q712o755m746k989j768j366j610j729
$$ plain form
59304 715301 714156 713935 714141 714131 714017 714446 715695 717501 719856 723344 728346 734337 740516 746933 754491 763817
59288 763817 774644 786436 799304 814063 831621 852522 876971 905112 936954 971435 1005052
59277 1005052 1031790 1045659 1044275 1030135 1008458 984202 961107 942339 930439 926206 928369 934915
59265 934915 944569 956840 971018 985670 999144 1010281 1018549 1023650 1025205 1022844 1016463 1006257 992564
59252 992564 975874 957038 937225 917504 898482 880416 863512 847968 833821 820928 809087
59241 809087 798155 788184 779511 772634 767888 765298 764736 766027 768872 772984 778392 785245 793085 800648
59227 800648 806766 811143 813952 814953 813563 809592 803342 795089 784985 773415 760831 747195 732242
59214 732242 716487 701401 688293 677395 668289 660747 654774 650118 646195 642379 638216 633586 628878
$$ packed form
59304G15301j145k21K06j0j14M29J249J806K355L488N002N991O179O417P558R326
59288G63817J0827J1792J2868J4759J7558K0901K4449K8141L1842L4481L3617
59277A005052K6738J3869j384j4140k1677k4256k3095j8768j1900m233K163O546
59265I34915R654J2271J4178J4652J3474J1137Q268N101J555k361o381j0206j3693
59252I92564j6690j8836j9813j9721j9022j8066j6904j5544j4147j2893j1841
59241H09087j0932r971q673o877m746k590n62J291K845M112N408O853P840P563
59227H00648O118M377K809J001j390l971o250q253j0104j1570j2584j3636j4953
59214G32242j5755j5086j3108j0898r106p542n973m656l923l816m163m630m708
$$ plain form
59201 628878 624764 621613 619305 617649 616604 615945 615170 614064 612999 612395 612285 612726 614141 616715 619878
59186 619878 623058 626670 631610 637880 644472 650686 656815 663314 669983 676374 682471 688572 694873 701614
59172 701614 709255 717954 727015 735410 742920 750427 759044 769264 781003 794095 808455 823856 839757
59159 839757 855349 869769 882398 893166 902440 910381 916377 919356 918778 915141 909327 901665 891974
59146 891974 880448 867992 855518 843248 831000 818901 807420 796824 786978 777799 769588 762713
59134 762713 757044 751904 746705 741617 737556 735379 735168 736432 738911 742837 748374 755238 763145 772219
59120 772219 782627 794172 806734 820846 837177 855531 875001 895120 916125 937889 959259
59109 959259 978960 996685 1012872 1027676 1040613 1051042 1058722 1064123 1068383 1072539 1076387 1078511 1077901
$$ packed form
59201F28878m114l151k308j656j045o59p75j106j065o04j10M41J415K574L163
59186F19878L180L612M940O270O592O214O129O499O669O391O097O101O301O741
59172G01614P641Q699R061Q395P510P507Q617J0220J1739J3092J4360J5401J5901
59159H39757J5592J4420J2629J0768R274P941N996K979n78l637n814p662r691
59146H91974j1526j2456j2474j2270j2248j2099j1481j0596r846r179q211o875
59134G62713n669n140n199n088m061k177k11J264K479L926N537O864P907R074
59120G72219J0408J1545J2562J4112J6331J8354J9470K0119K1005K1764K1370
59109I59259J9701J7725J6187J4804J2937J0429P680N401M260M156L848K124o10
$$ plain form
59096 1077901 1075155 1071524 1067212 1061532 1054500 1047152 1040089 1032757 1024661 1016378 1008638 1001124 993015 984219
59082 984219 975095 965270 953761 940258 925385 909579 892647 874722 856776 839667 823326 807492
59070 807492 792670 779638 768355 758079 748424 739684 732165 725760 720216 715373 711122 707503 704819
59057 704819 703288 702587 702076 701348 700146 697985 694495 690138 685911 682224 678673 675096 672096 670145 668799
59042 668799 667330 665719 664530 664166 664766 666502 669414 673110 677088 681259 685765 690534 695504 701067 707707
59027 707707 715187 722648 729620 736517 744095 752821 762903 774517 787772 802575 818605 835202 851292
59014 851292 865684 877589 886782 893239 896824 897285 894513 888908 881641 874320 868179 863682 861095 861006
59000 861006 863879 869419 876948 886192 897067 908848 920333 930908 940694 949507 956447 960859 963088
$$ packed form
59096A077901k746l631m312n680p032p348p063p332q096q283p740p514q109q796
59082I84219r124r825j1509j3503j4873j5806j6932j7925j7946j7109j6341j5834
59070H07492j4822j3032j1283j0276r655q740p519o405n544m843m251l619k684
59057G04819j531p01n11p28j202k161l490m357m227l687l551l577l000j951j346
59042F68799j469j611j189l64O00J736K912L696L978M171M506M769M970N563O640
59027G07707P480P461O972O897P578Q726J0082J1614J3255J4803J6030J6597J6090
59014H51292J4392J1905R193O457L585M61k772n605p267p321o141m497k587q9
59000H61006K873N540P529R244J0875J1781J1485J0575R786Q813O940M412K229
$$ plain form
58987 963088 963840 963235 960863 956275 948976 938454 924778 908950 892260 875544 859340 844283 830787
58974 830787 818765 808291 800239 795588 794270 795387 798441 803598 810807 819585 829884 842275 856795
58961 856795 872311 887648 902799 918292 933624 947134 957360 963824 966447 964946 959203 949721
58949 949721 937164 921757 903661 883808 863828 845038 827902 812530 799221 788299 779850 774042
58937 774042 771381 772009 774805 777613 778598 777163 773640 768526 762167 754782 746463 737282 727582 718013 709105
58922 709105 700933 693307 686185 679808 674592 670976 669107 668505 668248 667755 667313 667734 669607 673001 677585
58907 677585 682817 688209 693718 699803 706900 715002 724004 734280 746489 760826 776758 793465 810267
58894 810267 826701 842620 858350 874437 891147 908497 926870 947291 970845 998070 1029007
$$ packed form
58987I63088P52o05k372m588p299j0522j3676j5828j6690j6716j6204j5057j3496
58974H30787j2022j0474q052m651j318J117L054N157P209Q778J0299J2391J4520
58961H56795J5516J5337J5151J5493J5332J3510J0226O464K623j501n743r482
58949I49721j2557j5407j8096j9853j9980j8790j7136j5372j3309j0922q449n808
58937G74042k661O28K796K808R85j435l523n114o359p385q319r181r700r569q908
58922G09105q172p626p122o377n216l616j869o02k57m93m42M21J873L394M584
58907F77585N232N392N509O085P097Q102R002J0276J2209J4337J5932J6707J6802
58894H10267J6434J5919J5730J6087J6710J7350J8373K0421K3554K7225L0937
$$ plain form
58883 1029007 1063430 1100485 1138213 1173896 1205163 1230704 1250033 1262948 1269381 1269529 1263796 1252557
58871 1252557 1236070 1214630 1188790 1159563 1128557 1097653 1068234 1040656 1014729 990685 969276
58860 969276 950722 933938 917162 899255 880199 860616 841229 822613 804874 787463 769731
58849 769731 751870 734994 720144 707459 696451 686726 678152 670575 663699 657193 650778 644326 638010
58836 638010 632179 626949 622061 617281 612736 608681 605118 601826 598681 595775 593302 591378 589856 588297
58822 588297 586427 584618 583593 583527 583837 584071 584589 586040 588522 591645 595062 598493 601446 603450 604515
58807 604515 605066 605495 606042 606888 608041 609284 610586 612329 614750 617423 619741 621676 623557 625351 626745
58792 626745 627718 628350 628237 626914 624826 623092 622221 621938 622447 624916 630194 637778 646596 656177 666428
$$ packed form
58883A029007L4423L7055L7728L5683L1267K5541J9329J2915O433J48n733j1239
58871A252557j6487k1440k5840k9227l1006l0904k9419k7578k5927k4044k1409
58860I69276j8554j6784j6776j7907j9056j9583j9387j8616j7739j7411j7732
58849G69731j7861j6876j4850j2685j1008r725q574p577o876o506o415o452o316
58836F38010n831n230m888m780m545m055l563l292l145k906k473j924j522j559
58822E88297j870j809j025o6L10K34N18J451K482L123L417L431K953K004J065
58807F04515N51M29N47Q46J153J243J302J743K421K673K318J935J881J794J394
58792F26745R73O32j13j323k088j734q71k83N09K469N278P584Q818R581J0251
$$ plain form
58777 666428 676879 686974 696794 706690 716264 724348 729954 732730 732581 729476 723807 716445 708215 699571
58763 699571 690829 682423 674720 667835 661767 656560 652235 648752 646221 644975 645244 646807 649145 651994
58749 651994 655605 660341 666124 672440 678883 685519 692682 700629 709534 719606 730927 743273 756295
58736 756295 769794 783604 797386 810881 824281 838007 852158 866473 880788 895092 909151
58725 909151 922493 934784 945820 955188 962529 968299 973681 979455 985461 991439 997843 1005353 1013978
58712 1013978 1023161 1032494 1041881 1051106 1059619 1066616 1071065 1071890 1068410 1060509 1048338 1032212 1012854
58699 1012854 991153 967354 941028 912259 882272 852399 823073 794517 767796 744207 723948
58688 723948 706373 691300 679015 669047 660051 651138 642407 634014 625679 617409 609762 602924 596328
$$ packed form
58777F66428J0451J0095R820R896R574Q084N606K776j49l105n669p362q230q644
58763F99571q742q406p703o885o068n207m325l483k531j246K69J563K338K849
58749F51994L611M736N783O316O443O636P163P947Q905J0072J1321J2346J3022
58736G56295J3499J3810J3782J3495J3400J3726J4151J4315J4315J4304J4059
58725I09151J3342J2291J1036R368P341N770N382N774O006N978O404P510Q625
58712A013978R183R333R387R225Q513O997M449Q25l480p901j2171j6126j9358
58699A012854k1701k3799k6326k8769k9987k9873k9326k8556k6721k3589k0259
58688G23948j7575j5073j2285r968q996q913q731q393q335q270p647o838o596
$$ plain form
58675 596328 589750 584049 580228 578280 577535 577655 578753 581040 585002 591438 600622 611672 623475 636037
58661 636037 650295 666634 684054 700676 714573 724286 729225 729866 727322 722677 716753 710199 703391
58648 703391 696426 689560 683350 677970 672711 666844 660754 655480 651183 646872 641873 636800 632722 629982
58634 629982 628325 627740 628557 630773 633750 636679 639120 641065 642512 643025 641879 638881 634980 631658 629647
58619 629647 628542 627738 627341 627967 630091 634006 640142 648895 660113 673032 686716 700386 713345 724836
58605 724836 734055 740315 743316 743419 741560 738746 735534 731996 728005 723531 718780 714165 709991 706114
58591 706114 702102 697887 694127 691839 691848 694640 700400 708865 719332 731133 744033 757924 772353 786720
58577 786720 800861 814990 828917 841645 851998 859589 865112 869731 874267 879061 884648 892283 903350
$$ packed form
58675E96328o578n701l821j948p45J20J098K287L962O436R184J1050J1803J2562
58661F36037J4258J6339J7420J6622J3897R713M939O41k544m645n924o554o808
58648G03391o965o866o210n380n259n867o090n274m297m311m999n073m078k740
58634F29982j657n85Q17K216K977K929K441J945J447N13j146k998l901l322k011
58619F29647j105q04l97O26K124L915O136Q753J1218J2919J3684J3670J2959J1491
58605G24836R219O260L001J03j859k814l212l538l991m474m751m615m174l877
58591G06114m012m215l760k288RK792N760Q465J0467J1801J2900J3891J4429J4367
58577G86720J4141J4129J3927J2728J0353P591N523M619M536M794N587P635J1067
$$ plain form
58564 903350 918154 935811 955588 977809 1002961 1030377 1058549 1086488 1113929 1140233 1163996
58553 1163996 1183916 1199322 1209599 1213994 1212550 1206589 1197538 1185641 1170410 1152040 1131719 1110734
58541 1110734 1089791 1069080 1048432 1027399 1005642 983270 960609 937814 915044 892817 871753
58530 871753 852178 834374 818943 806314 796078 787487 780573 776034 773973 773510 773902 775259 777780
58517 777780 780888 783729 786123 788476 790927 793015 794125 794063 793320 792912 793622 795288 797137 798930 801286
58502 801286 804626 808465 812188 815937 820024 823866 826391 827326 827251 826412 824304 820669 816167 811724 807710
58487 807710 804144 801265 799450 798755 798907 799737 801509 804945 810935 819930 831489 844644 858804 874014
58473 874014 890171 906267 920645 931877 939292 942914 943065 939861 933006 922345 908745 894063 879980
$$ packed form
58564I03350J4804J7657J9777K2221K5152K7416K8172K7939K7441K6304K3763
58553A163996J9920J5406J0277M395j444n961r051j1897j5231j8370k0321k0985
58541A110734k0943k0711k0648k1033k1757k2372k2661k2795k2770k2227k1064
58530H71753j9575j7804j5431j2629j0236q591o914m539k061m63L92J357K521
58517G77780L108K841K394K353K451K088J110o2p43m08P10J666J849J793K356
58502H01286L340L839L723L749M087L842K525R35p5q39k108l635m502m443m014
58487H07710l566k879j815o95J52Q30J772L436N990Q995J1559J3155J4160J5210
58473H74014J6157J6096J4378J1232P415L622J51l204o855j0661j3600j4682j4083
$$ plain form
58460 879980 867120 855547 845660 838068 832804 829312 827282 827087 829269 833934 840710 848876 857323 864739
58446 864739 870263 873867 875881 876226 874393 870221 864381 857902 851340 844662 837957 831956 827630 825436
58432 825436 825216 826724 829867 834381 839716 845457 851590 858126 864801 871514 878762 887156 896622 906538
58418 906538 916535 926522 935864 943242 947803 950095 951498 952989 954816 957050 959778 962635 964532 964114
58404 964114 960456 953523 944299 934519 925823 918815 913016 907901 903784 901444 901000 901568 902166 902634 903354
58389 903354 904284 904757 904340 903451 902797 902388 901449 899357 896387 893528 891731 891346 892062 893363 895154 897933
58373 897933 902246 908040 914807 922190 930081 938129 945740 952849 960285 969008 979176 990310 1002098
58360 1002098 1014628 1027938 1041795 1055975 1070437 1085135 1099835 1114119 1127349 1138674 1147400
$$ packed form
58460H79980j2860j1573r887p592n264l492k030j95K182M665O776Q166Q447P416
58446H64739N524L604K014L45j833m172n840o479o562o678o705o001m326k194
58432H25436k20J508L143M514N335N741O133O536O675O713P248Q394R466R916
58418I06538R997R987R342P378M561K292J403J491J827K234K728K857J897m18
58404I64114l658o933r224r780q696p008n799n115m117k340m44N68N98M68P20
58389I03354R30M73m17q89o54m09r39k092k970k859j797l85P16J301J791K779
58373H97933M313N794O767P383P891Q048P611P109P436Q723J0168J1134J1788
58360A002098J2530J3310J3857J4180J4462J4698J4700J4284J3230J1325Q726
$$ plain form
58349 1147400 1153487 1157612 1160679 1163302 1165671 1167790 1169966 1173111 1178305 1185779 1194629 1203850 1213393 1223791
58335 1223791 1235073 1246845 1259317 1273335 1289080 1305538 1321767 1338049 1355162 1372958 1390413
58324 1390413 1406844 1422296 1436779 1449823 1460994 1470390 1478527 1486101 1493934 1502667 1512308 1522405
58312 1522405 1532799 1543796 1555445 1567246 1579012 1591659 1606442 1623525 1641853 1660511 1679641
58301 1679641 1699846 1721175 1743145 1765395 1787839 1810258 1832260 1853790 1875295 1897234 1919748
58290 1919748 1943024 1967678 1994369 2023059 2052942 2083182 2113609 2144746 2177377 2212083 2249006
58279 2249006 2287851 2328103 2369232 2410756 2452315 2493930 2536128 2579559 2624450 2670598 2717989
58268 2717989 2767247 2819389 2875188 2934870 2998365 3065723 3137187 3212839 3292280 3374817 3459942
$$ packed form
58349A147400O087M125L067K623K369K119K176L145N194P474Q850R221R543J0398
58335A223791J1282J1772J2472J4018J5745J6458J6229J6282J7113J7796J7455
58324A390413J6431J5452J4483J3044J1171R396Q137P574P833Q733R641J0097
58312A522405J0394J0997J1649J1801J1766J2647J4783J7083J8328J8658J9130
58301A679641K0205K1329K1970K2250K2444K2419K2002K1530K1505K1939K2514
58290A919748K3276K4654K6691K8690K9883L0240L0427L1137L2631L4706L6923
58279B249006L8845M0252M1129M1524M1559M1615M2198M3431M4891M6148M7391
58268B717989M9258N2142N5799N9682O3495O7358P1464P5652P9441Q2537Q5125
$$ plain form
58257 3459942 3547376 3636604 3726642 3816456 3905385 3993019 4079043 4163701 4248280 4334618 4424136
58246 4424136 4517765 4616812 4723224 4838555 4962963 5095666 5236292 5385380 5543651 5711337
58236 5711337 5888662 6076660 6276848 6489913 6715261 6952333 7202005 7466265 7746885
58227 7746885 8045127 8362523 8701016 9062324 9448044 9860631 10303466 10779875 11293083
58218 11293083 11847357 12448147 13100682 13809574 14580531 15421529 16341920 17351590 18461819
58209 18461819 19686159 21040235 22542354 24215522 26088557 28196187 30581041 33297294
58201 33297294 36412421 40008456 44188408 49086766 54877440 61780859 70078304 80130066
58193 80130066 92386529 107395527 125808463 148346775 175675165 208192707 245797393
$$ packed form
58257C459942Q7434Q9228R0038Q9814Q8929Q7634Q6024Q4658Q4579Q6338Q9518
58246D424136R3629R9047J06412J15331J24408J32703J40626J49088J58271J67686
58236E711337J77325J87998K00188K13065K25348K37072K49672K64260K80620
58227G746885K98242L17396L38493L61308L85720M12587M42835M76409N13208
58218A1293083N54274O00790O52535P08892P70957Q40998R20391J009670J110229
58209A8461819J224340J354076J502119J673168J873035K107630K384854K716253
58201C3297294L115127L596035M179952M898358N790674O903419Q297445J0051762
58193H0130066J2256463J5008998J8412936K2538312K7328390L2517542L7604686
$$ plain form
58186 245797393 287591776 331434793 373492565 408361787 430298512 435268584 422627931
58179 422627931 395292026 358355276 317189402 276106377 237921908 204114684 175193310
58172 175193310 151071715 131370661 115610939 103324451 94122642 87712942 83856186
58165 83856186 82316371 82821239 84945051 87883704 90345063 90848894 88373382 82860403
58157 82860403 75154485 66467945 57837947 49903045 42954783 37060338 32153553 28103124
58149 28103124 24766117 22012415 19726636 17810484 16188571 14806097 13620303 12596838
58141 12596838 11710019 10939005 10262412 9659026 9112147 8609820 8141773 7699159 7276794
58132 7276794 6873457 6490477 6131330 5800895 5502449 5235360 4996660 4783872 4595145
$$ packed form
58186B45797393M1794383M3843017M2057772L4869222K1936725M970072j2640653
58179D22627931k7335905l6936750m1165874m1083025l8184469l3807224k8921374
58172A75193310k4121595j9701054j5759722j2286488r201809o409700l856756
58165H3856186j539815N04868K123812K938653K461359N03831k475512n512979
58157H2860403p705918q686540q629998p934902o948262n894445m906785m050429
58149B8103124l337007k753702k285779j916152j621913j382474j185794j023465
58141A2596838q86819p71014o76593o03386n46879n02327m68047m42614m22365
58132G276794m03337l82980l59147l30435k98446k67089k38700k12788j88727
$$ plain form
58123 4595145 4427896 4278791 4143960 4017750 3892480 3761629 3623450 3480730 3337732
58114 3337732 3198316 3065814 2942569 2829148 2724865 2628977 2540766 2458965 2382152 2309691
58104 2309691 2241586 2177520 2116657 2058259 2002002 1947818 1895791 1845944 1797834 1750716 1704427
58093 1704427 1659716 1617349 1577400 1539828 1505160 1473972 1446125 1421105 1398796 1379284 1362171
58082 1362171 1346645 1331949 1317226 1301258 1283105 1262865 1241129 1217831 1192356 1164873 1136823
58071 1136823 1109823 1084578 1061036 1039021 1018285 998357 978941 960454 943724 929122 916233
58060 916233 904469 893658 883782 874363 864504 853643 841996 830169 818589 807511 797290 788246
58048 788246 780253 772791 765509 758523 752095 746116 740054 733419 726282 719259 712843 706757 700221 692959
$$ packed form
58123D595145j67249j49105j34831j26210j25270j30851j38179j42720j42998
58114C337732j39416j32502j23245j13421j04283r5888q8211q1801p6813p2461
58104B309691o8105o4066o0863n8398n6257n4184n2027m9847m8110m7118m6289
58093A704427m4711m2367l9949l7572l4668l1188k7847k5020k2309j9512j7113
58082A362171j5526j4696j4723j5968j8153k0240k1736k3298k5475k7483k8050
58071A136823k7000k5245k3542k2015k0736j9928j9416j8487j6730j4602j2889
58060I16233j1764j0811r876r419r859j0861j1647j1827j1580j1078j0221r044
58048G88246p993p462p282o986o428n979o062o635p137p023o416o086o536p262
$$ plain form
58034 692959 685674 679252 673704 668128 661565 653587 644190 633549 622032 610235 598845 588428 579217
58021 579217 570981 563247 555776 548745 542422 536859 531935 527421 522907 518069 513175 508858 505170 501401
58007 501401 497239 493478 490984 489495 488292 487538 488007 489650 491524 493155 494984 497340 499949 502815 506631
57992 506631 511783 517612 523224 528496 533819 539308 544829 550398 556019 561310 565706 568927 570979 571903
57978 571903 571685 570229 567326 563018 558051 553501 549690 545924 541517 536592 531550 526310 520597 514616
57964 514616 508884 503606 498645 493949 489590 485575 481954 478943 476585 474461 472028 469046 465448 461103
57950 461103 456091 450968 446310 442136 438100 434087 430348 427300 425503 425444 426906 428925 430886 433347 437160
57935 437160 442129 447328 452610 458821 466355 474385 481878 488714 495310 501706 507553 512665 517093 520899
$$ packed form
58034F92959p285o422n548n576o563p978r397j0641j1517j1797j1390j0417r211
58021E79217q236p734p471p031o323n563m924m514m514m838m894m317l688l769
58007E01401m162l761k494j489j203p54M69J643J874J631J829K356K609K866L816
57992E06631N152N829N612N272N323N489N521N569N621N291M396L221K052R24
57978E71903k18j456k903m308m967m550l811l766m407m925n042n240n713n981
57964E14616n732n278m961m696m359m015l621l011k358k124k433k982l598m345
57950D61103n012n123m658m174m036m013l739l048j797n9J462K019J961K461L813
57935D37160M969N199N282O211P534Q030P493O836O596O396N847N112M428L806
$$ plain form
57921 520899 524277 527663 531208 534270 535926 535998 535118 533692 531161 526560 519568 510803 501236 491575 482115
57906 482115 472854 463590 454026 443913 433095 421495 409254 396956 385487 375420 366662 358880
57894 358880 352140 346734 342408 338218 333404 328217 323681 320633 319069 318236 317261 315945 315103 315930 318836
57879 318836 323055 327539 331983 336760 342105 347740 353155 357926 361768 364552 366336 367293 367707 368109 369128
57864 369128 370818 372263 372237 370323 367197 363893 361088 359036 357905 357953 359412 362079 365107 367593 369667
57849 369667 372615 377383 383236 388467 392331 395652 399626 404712 410778 417497 424286 430445 435782 440575
57835 440575 444582 446686 446058 443227 439404 435122 430194 424664 418960 413148 406831 399962 393197 387171
57821 387171 381939 377360 373624 371016 369466 368673 368569 369348 371082 373563 376593 380306 385033 390770 396823
$$ packed form
57921E20899L378L386L545L062J656P2q80j426k531m601o992q765r567r661r460
57906D82115r261r264r564j0113j0818j1600j2241j2298j1469j0067q758p782
57894C58880o740n406m326m190m814n187m536l048j564q33r75j316q42Q27K906
57879C18836M219M484M444M777N345N635N415M771L842K784J784R57M14M02J019
57864C69128J690J445k6j914l126l304k805k052j131M8J459K667L028K486K074
57849C69667K948M768N853N231L864L321L974N086O066O719O789O159N337M793
57835D40575M007K104o28k831l823m282m928n530n704n812o317o869o765o026
57821C87171n232m579l736k608j550p93j04P79J734K481L030L713M727N737O053
$$ plain form
57806 396823 402188 406307 409256 411084 411374 409844 407045 403766 399789 393949 385736 376248 367070 358531
57792 358531 349686 339891 329863 320966 313765 307558 301347 295054 289593 285680 282876 280034 276563 272844
57778 272844 269486 266704 264570 263347 263245 264155 265933 268641 272219 276304 280765 286100 292852 300866 309538
57763 309538 318407 326987 334410 340047 344338 348188 351555 353432 353357 352021 350066 347119 342599 336828 330695
57748 330695 324633 318617 312932 308228 304851 302532 300763 299110 297261 295105 292754 290248 287344 283825
57734 283825 279920 276136 272842 270176 268176 266687 265348 264009 263014 262724 262951 263267 263716 264694 266170 267563
57718 267563 268494 269185 269947 270668 271110 271435 272097 273274 274644 275764 276505 277060 277487 277453 276673 275602 275347 276629
57700 276629 279047 281607 283830 286069 288919 292656 297156 302022 306787 311213 315299 318824 321087 321476
$$ packed form
57806C96823N365M119K949J828K90j530k799l279l977n840q213r488r178q539
57792C58531q845r795j0028q897p201o207o211o293n461l913k804k842l471l719
57778B72844l358k782k134j223j02R10J778K708L578M085M461N335O752Q014Q672
57763C09538Q869Q580P423N637M291L850L367J877p5j336j955k947m520n771o133
57748C30695o062o016n685m704l377k319j769j653j849k156k351k506k904l519
57734B83825l905l784l294k666k000j489j339j339r95k90K27L16M49R78J476J393
57718B67563R31O91P62P21M42L25O62J177J370J120P41N55M27l4p80j071k55J282
57700B76629K418K560K223K239K850L737M500M866M765M426M086L525K263L89
$$ plain form
57686 321476 320161 317876 315173 312320 309836 308505 308765 310528 313760 318848 326331 336736 350907 370093
57672 370093 395443 427692 467700 517084 578140 653201 743964 850514 969617 1092828 1205963
57661 1205963 1291420 1333431 1324148 1266945 1174595 1063601 948563 839426 741563 657163 586543
57650 586543 528857 482256 444279 412869 387123 366739 350849 337947 326981 317915 310974 305869
57638 305869 301988 298861 296081 293245 290384 288177 287268 287543 288309 288927 289005 288333 287161 286327 286591 287720
57622 287720 288525 287895 285692 282704 279902 277714 275973 274524 273695 273899 274877 275791 276095 275884 275337 274414 273335
57605 273335 272750 272919 273162 272690 271649 270835 270604 270650 270701 270834 271119 271445 271821 272417 273168 273577 273014 271172 268324
57586 268324 265280 262925 261516 260593 259720 259034 258744 258411 257236 254979 252153 249360 246891 244926 243665
$$ packed form
57686C21476j315k285k703k853k484j331K60J763L232N088P483J0405J4171J9186
57672C70093K5350L2249M0008M9384O1056P5061R0763J06550J19103J23211J13135
57661A205963Q5457M2011r283n7203r2350j10994j15038j09137r7863q4400p0620
57650E86543n7686m6601l7977l1410k5746k0384j5890j2902j0966r066o941n105
57638C05869l881l127k780k836k861k207r09K75P66O18P8o72j172q34K64J129
57622B87720Q05o30k203k988k802k188j741j449q29K04R78R14L04k11n47r23j079
57605B73335n85J69K43m72j041q14k31M6N1J33K85L26L76N96P51M09n63j842k848
57586B68324l044k355j409r23q73o86k90l33j175k257k826k793k469j965j261
$$ plain form
57571 243665 243077 242793 242397 241677 240631 239415 238232 237129 236010 235024 234661 235091 235711 235803 235514 235693 236784
57554 236784 238425 240135 241825 243468 244804 245734 246731 248512 251347 254761 257826 259761 260501 260721 261178
57539 261178 262097 263330 264921 267073 269661 272270 274713 277038 278972 279930 279839 279545 280043 281516 283348 284790
57523 284790 285461 285540 285766 286936 289038 291080 292119 292318 292652 293693 295109 296343 297357 298541 300152 302117
57507 302117 304272 306529 308763 310699 312106 313059 313877 314756 315607 316325 317014 317747 318309 318463 318434 318821 319944
57490 319944 321548 323206 324812 326479 328096 329164 329140 327985 326421 325547 326043 327728 329994 332526 335423
57475 335423 338709 342020 344805 346666 347523 347728 347967 348757 350007 351284 352514 354015 355859 357672 359293
57460 359293 361158 363687 366617 369422 372138 375305 379096 382976 386360 389298 392300 395674 399221 402534
$$ packed form
57571B43665n88k84l96p20j046j216j183j103j119r86l63M30O20R2k89J79J091
57554B36784J641J710J690J643J336R30R97J781K835L414L065J935P40K20M57
57539B61178R19J233J591K152K588K609K443K325J934R58r1k94M98J473J832J442
57523B84790O71P9K26J170K102K042J039J99L34J041J416J234J014J184J611J965
57507C02117K155K257K234J936J407R53Q18Q79Q51P18O89P33N62J54k9L87J123
57490C19944J604J658J606J667J617J068k4j155j564q74M96J685K266K532K897
57475C35423L286L311K785J861Q57K05K39P90J250J277J230J501J844J813J621
57460C59293J865K529K930K805K716L167L791L880L384K938L002L374L547L313
$$ plain form
57446 402534 405454 408162 410868 413549 416140 418956 422629 427380 432497 436841 439929 442329 444973 448337
57432 448337 452355 456764 461218 465242 468556 471524 474922 479078 483540 487795 492008 496648 501618 506381
57418 506381 510939 516014 521907 527705 532172 535211 537894 541145 544894 548585 552011 555360 558778 562296
57404 562296 566086 570507 575742 581491 587064 591832 595659 599025 602764 607588 613640 620381 627008 633175
57390 633175 639272 645884 653052 660315 667400 674509 681861 689400 697139 705342 714028 722600 730424 737584
57376 737584 744656 751884 759029 765923 772740 779679 786748 793920 801146 808171 814624 820413 825890 831607
57362 831607 837979 845076 852552 859987 867518 875875 885418 895381 904576 912782 920926 929963 940099 951059
57348 951059 962432 973678 984459 995219 1006800 1019146 1031002 1041372 1050743 1060357 1070714 1081470
$$ packed form
57446D02534K920K708K706K681K591K816L673M751N117M344L088K400K644L364
57432D48337M018M409M454M024L314K968L398M156M462M255M213M640M970M763
57418E06381M558N075N893N798M467L039K683L251L749L691L426L349L418L518
57404E62296L790M421N235N749N573M768L827L366L739M824O052O741O627O167
57390F33175O097O612P168P263P085P109P352P539P739Q203Q686Q572P824P160
57376G37584P072P228P145O894O817O939P069P172P226P025O453N789N477N717
57362H31607O372P097P476P435P531Q357R543R963R195Q206Q144R037J0136J0960
57348I51059J1373J1246J0781J0760J1581J2346J1856J0370R371R614J0357J0756
$$ plain form
57336 1081470 1092481 1104106 1116443 1128976 1141220 1153274 1165459 1177799 1190156 1202701 1215908
57325 1215908 1230103 1245160 1260614 1275889 1290449 1303924 1316330 1328204 1340398 1353574 1367812
57314 1367812 1382690 1397761 1412949 1428543 1444829 1461741 1478877 1495927 1513050 1530675 1548930
57303 1548930 1567419 1585627 1603386 1620833 1638138 1655464 1673007 1690874 1709037 1727588 1746822
57292 1746822 1766777 1786936 1806755 1826401 1846517 1867260 1888009 1908173 1927901 1947810 1968210
57281 1968210 1988780 2008903 2028268 2047302 2067015 2088228 2110870 2134103 2157090 2179556 2201773
57270 2201773 2224327 2247757 2272070 2296513 2320136 2342746 2365161 2388507 2413377 2439554 2466310
57259 2466310 2492917 2519073 2544929 2570743 2596707 2623131 2650310 2677928 2705000 2730965 2756551
$$ packed form
57336A081470J1011J1625J2337J2533J2244J2054J2185J2340J2357J2545J3207
57325A215908J4195J5057J5454J5275J4560J3475J2406J1874J2194J3176J4238
57314A367812J4878J5071J5188J5594J6286J6912J7136J7050J7123J7625J8255
57303A548930J8489J8208J7759J7447J7305J7326J7543J7867J8163J8551J9234
57292A746822J9955K0159J9819J9646K0116K0743K0749K0164J9728J9909K0400
57281A968210K0570K0123J9365J9034J9713K1213K2642K3233K2987K2466K2217
57270B201773K2554K3430K4313K4443K3623K2610K2415K3346K4870K6177K6756
57259B466310K6607K6156K5856K5814K5964K6424K7179K7618K7072K5965K5586
$$ plain form
57248 2756551 2782977 2810519 2838515 2866613 2895134 2924128 2952918 2980924 3008308 3035415 3062082
57237 3062082 3087984 3113205 3138123 3162971 3187829 3212815 3237995 3263360 3289101 3315648 3343219
57226 3343219 3371556 3400289 3429349 3458887 3488992 3519556 3550201 3580366 3609835 3639237 3669613
57215 3669613 3701364 3733942 3766593 3798993 3831085 3862781 3893934 3924202 3952919 3979641 4004924
57204 4004924 4029890 4054865 4079065 4101954 4124152 4146593 4169351 4191883 4213956 4235788 4257634
57193 4257634 4279777 4302640 4326401 4350633 4374650 4398024 4420608 4442371 4463448 4483844 4502891
57182 4502891 4519568 4533788 4546792 4559738 4572378 4583685 4593261 4601424 4608368 4614106 4619031 4623698
57170 4623698 4628010 4631325 4633473 4635142 4637228 4640227 4644310 4649487 4655605 4662489 4670131 4678534 4687468 4696736
$$ packed form
57248B756551K6426K7542K7996K8098K8521K8994K8790K8006K7384K7107K6667
57237C062082K5902K5221K4918K4848K4858K4986K5180K5365K5741K6547K7571
57226C343219K8337K8733K9060K9538L0105L0564L0645L0165K9469K9402L0376
57215C669613L1751L2578L2651L2400L2092L1696L1153L0268K8717K6722K5283
57204D004924K4966K4975K4200K2889K2198K2441K2758K2532K2073K1832K1846
57193D257634K2143K2863K3761K4232K4017K3374K2584K1763K1077K0396J9047
57182D502891J6677J4220J3004J2946J2640J1307R576Q163O944N738M925M667
57170D623698M312L315K148J669K086K999M083N177O118O884P642Q403Q934R268
$$ plain form
57156 4696736 4706646 4717819 4730400 4743712 4756751 4768885 4779937 4789654 4797170 4801207 4800907 4796257 4787437
57143 4787437 4774045 4755538 4732262 4705288 4675200 4641922 4606031 4569391 4533957 4500651 4469899
57132 4469899 4442485 4418994 4398839 4380662 4363438 4346521 4328832 4308740 4284795 4256258 4223188
57121 4223188 4186562 4148287 4110675 4075782 4045151 4019677 3999406 3983711 3971904 3963487 3958052 3955803
57109 3955803 3958515 3969317 3991245 4026524 4077321 4146184 4235453 4347375 4485587 4655920 4865611
57098 4865611 5122978 5438609 5825970 6300413 6878659 7579515 8422996 9426824 10603643
57089 10603643 11960648 13498520 15208345 17070399 19056239 21129986 23248761 25369209
57081 25369209 27457819 29486281 31402413 33102045 34440086 35282416 35556175 35260232
$$ packed form
57156D696736R910J1173J2581J3312J3039J2134J1052R717P516M037l00m650q820
57143D787437j3392j8507k3276k6974l0088l3278l5891l6640l5434l3306l0752
57132D469899k7414k3491k0155j8177j7224j6917j7689k0092k3945k8537l3070
57121D223188l6626l8275l7612l4893l0631k5474k0271j5695j1807q417n435k249
57109C955803K712J0802K1928L5279N0797O8863Q9269J11922J38212J70333K09691
57098D865611K57367L15631L87361M74443N78246P00856Q43481J003828J176819
57089A0603643J357005J537872J709825J862054J985840K073747K118775K120448
57081B5369209K088610K028462J916132J699632J338041Q42330K73759k95943
$$ plain form
57073 35260232 34441364 33167964 31518721 29579976 27442159 25194471 22919792 20689713
57065 20689713 18560545 16572326 14750290 13106509 11641800 10349072 9216777 8230422
57057 8230422 7373271 6628259 5980032 5414997 4920476 4485160 4100058 3757939 3452228
57048 3452228 3177371 2929723 2706810 2505900 2324180 2159830 2011748 1878435 1758152
57039 1758152 1649897 1553189 1466975 1389640 1319958 1257249 1200854 1150175 1104977 1064832 1028608
57028 1028608 995253 964716 937293 912520 889741 869432 852935 840954 833250 829697 830870 837803
57016 837803 851975 875489 910750 960419 1028272 1119364 1238467 1388655 1570768 1780055 1998408
57005 1998408 2190204 2311999 2333230 2251731 2091893 1889672 1677516 1477031 1298778 1145582
$$ packed form
57073C5260232q18868j273400j649243j938745k137817k247688k274679k230079
57065B0689713k129168j988219j822036j643781j464709j292728j132295r86355
57057H230422q57151p45012o48227n65035m94521m35316l85102l42119l05711
57048C452228k74857k47648k22913k00910j81720j64350j48082j33313j20283
57039A758152j08255r6708q6214p7335o9682o2709n6395n0679m5198m0145l6224
57028A028608l3355l0537k7423k4773k2779k0309j6497j1981p704l553J173O933
57016H37803J4172K3514L5261M9669O7853R1092J19103J50188J82113K09287K18353
57005A998408J91796J21795K1231q1499j59838k02221k12156k00485j78253j53196
$$ plain form
56995 1145582 1016507 909445 821783 750449 692449 645343 607165 576370 552186 534569 523424
56984 523424 518075 517395 519851 523201 524752 522314 514715 501574 483355 461786 439333 417691 397181
56971 397181 377777 360088 344952 332686 323202 316422 312158 309986 309623 311156 314767 320701 329596
56958 329596 342145 357959 375263 392040 406869 418259 423926 421754 411459 394871 374761 353689
56946 353689 333594 315700 300553 288282 278812 271877 267144 264540 264259 266441 271243 279236 291115
56933 291115 306835 325655 347346 372433 400424 428170 450790 464197 466503 457726 439299 413925
56921 413925 385042 355818 328514 304418 283824 266155 250651 237062 225425 215415 206435 198366
56909 198366 191676 186692 183170 180620 178675 177022 175417 173961 173046 172849 173127 173689 174790 176819 179756
$$ packed form
56995A145582j29075j07062q7662p1334n8000m7106l8178l0795k4184j7617j1145
56984E23424n349o80K456L350J551k438p599j3141j8219k1569k2453k1642k0510
56971C97181j9404j7689j5136j2266r484o780m264k172l63J533L611N934Q895
56958C29596J2549J5814J7304J6777J4829J1390N667k172j0295j6588k0110k1072
56946C53689k0095j7894j5147j2271r470o935m733k604k81K182M802P993J1879
56933B91115J5720J8820K1691K5087K7991K7746K2620J3407K306q777j8427k5374
56921D13925k8883k9224k7304k4096k0594j7669j5504j3589j1637j0010q980q069
56909A98366o690m984l522k550j945j653j605j456r15j97K78N62J101K029K937
$$ plain form
56894 179756 183230 187163 192200 199345 209114 221184 235048 250949 269745 291569 314896 337224
56882 337224 356393 370843 378991 379442 372341 360022 345721 331648 318545 306868 297738 292402 290984
56869 290984 292337 295451 300907 310570 325743 346070 370617 399740 435234 478467 528678 582928
56857 582928 636832 684891 720932 739747 739255 721262 690219 651368 609682 569514 534160 505317
56845 505317 483112 466960 456563 452241 454571 463996 480976 506346 541250 586585 642654 709297
56833 709297 785795 869795 955855 1035115 1096892 1131629 1133909 1104289 1048994 977390 898709 819972
56821 819972 745845 679302 622023 574593 536943 508795 489744 479287 477187 483752 499557 524962
56809 524962 560048 604718 658240 718408 781120 840510 889330 919872 926000 905692 862282 803243
$$ packed form
56894A79756L474L933N037P145R769J2070J3864J5901J8796K1824K3327K2328
56882C37224J9169J4450Q148M51p101j2319j4301j4073j3103j1677r130n336j418
56869B90984J353L114N456R663J5173K0327K4547K9123L5494M3233N0211N4250
56857E82928N3904M8059L6041J8815m92j7993l1043l8851m1686m0168l5354k8843
56845E05317k2205j6152j0397m322K330R425J6980K5370L4904M5335N6069O6643
56833G09297P6498Q4000Q6060P9260O1777L4737K280k9620n5295p1604p8681p8737
56821H19972p4127o6543n7279m7430l7650k8148j9051j0457k100O565J5805K5405
56809E24962L5086M4670N3522O0168O2712N9390M8820L0542O128k0308m3410n9039
$$ plain form
56797 803243 737270 671485 610182 555334 507901 468552 437317 413190 394681 380906 371972 368499
56785 368499 371038 379754 394274 413915 438299 467311 499702 531772 558123 573919 576264 564160
56773 564160 538603 503104 462824 422120 383121 346825 314560 287479 265263 246429 229889
56762 229889 215574 203731 194274 186743 180387 174384 168437 163052 158806 155506 152495 149494 146670 144139
56748 144139 141990 140508 139777 139194 138033 136327 134621 133063 131495 130228 129846 130157 130155 129213 127630 125946
56732 125946 124461 123577 123729 124571 124969 124258 122975 121882 120906 119578 118057 117125 117331 118594 120383 121914
56716 121914 122477 122070 121540 121718 122560 123451 124194 125248 127043 129403 131590 132733 132289 130459 128177 126579
56700 126579 126367 127618 129925 132578 134812 136196 136805 136949 136770 136117 134686 132329 129433 126966 125813
$$ packed form
56797H03243o5973o5785o1303n4848m7433l9349l1235k4127j8509j3775q934l473
56785C68499K539Q716J4520J9641K4384K9012L2391L2070K6351J5796K345j2104
56773E64160k5557l5499m0280m0704l8999l6296l2265k7081k2216j8834j6540
56762B29889j4315j1843r457p531o356o003n947n385m246l300l011l001k824k531
56748A44139k149j482p31n83j161j706j706j558j568j267l82L11kr42j583j684
56732A25946j485q84J52Q42L98p11j283j093r76j328j521r32K06J263J789J531
56716A21914N63m07n30J78Q42Q91P43J054J795K360K187J143m44j830k282j598
56700A26579k12J251K307K653K234J384O09J44j79o53j431k357k896k467j153
$$ plain form
56685 125813 125962 126565 126862 126743 126381 125839 125313 125327 126205 127513 128390 128365 127631 126752 126404 127163 129081 131443
56667 131443 133276 134153 134328 134185 133908 133711 133953 134774 135791 136440 136615 136773 137351 138189 138705 138659 138512 138931
56649 138931 140074 141565 143068 144563 146049 147289 148037 148287 148173 147779 147203 146629 146167 145733 145229 144764 144545
56632 144545 144594 144717 144737 144751 145129 146257 148180 150558 153078 155780 158727 161437 163097 163470 163237 163180 163319
56615 163319 163223 162900 162884 163418 163991 163902 163044 161944 161229 161284 162269 164070 166114 167518 167715 166921 165893 165286
56597 165286 165337 165897 166503 166563 165910 165229 165476 166761 168161 168781 168591 167974 167003 165619 164206 163391 163360 163777
56579 163777 164322 164911 165571 166439 167780 169615 171459 172797 173653 174342 174935 175486 176565 178827 182116 185659
56563 185659 189242 193497 198926 205316 212396 220478 229974 240628 251541 261692 270247 276688 280981
$$ packed form
56685A25813J49O03K97j19l62n42n26J4Q78J308Q77k5p34q79l48P59J918K362
56667A31443J833Q77J75j43k77j97K42Q21J017O49J75J58N78Q38N16m6j47M19
56649A38931J143J491J503J495J486J240P48K50j14l94n76n74m62m34n04m65k19
56632A44545M9J23K0J4L78J128J923K378K520K702K947K710J660L73k33n7J39
56615A63319r6l23j6N34N73q9q58j100p15N5R85J801K044J404J97p94j028o07
56597A65286N1N60O06O0o53o81K47J285J400O20j90o17r71j384j413q15l1M17
56579A63777N45N89O60Q68J341J835J844J338Q56O89N93N51J079K262L289L543
56563A85659L583M255N429O390P080Q082R496J0654J0913J0151Q555O441M293
$$ plain form
56550 280981 283561 285093 286380 288268 291128 294344 296778 297912 298241 298554 299243 300287 301350 301743 300815
56535 300815 298612 295780 292749 289454 285829 281970 277705 272706 267223 262053 257509 253079 248383 243694
56521 243694 239168 234333 228956 223739 219490 216099 212993 210082 207563 205192 202579 199921 197704 195835
56507 195835 193739 191290 189044 187554 186882 186681 186316 185105 182956 180758 179688 180079 181187 181939 181669 180410
56491 180410 178857 177826 177427 177006 176186 175575 175948 177093 178038 178197 177775 177317 177413 178577 180760 183120 184875
56474 184875 186180 187548 188701 188894 188258 187897 188495 189630 190685 191616 192505 193109 193370 193808 194912 196529
56458 196529 198314 200361 202895 205650 208127 210331 212766 215676 218678 221224 223149 224684 226158 227832
56444 227832 229883 232271 234555 235970 235949 234662 232948 231633 230968 230751 230777 230994 231341 231669 231845 231856 231795 231797
$$ packed form
56550B80981K580J532J287J888K860L216K434J134L29L13O89J044J063L93r28
56535C00815k203k832l031l295l625l859m265m999n483n170m544m430m696m689
56521B43694m526m835n377n217m249l391l106k911k519k371k613k658k217j869
56507A95835k096k449k246j490o72k01l65j211k149k198j070L91J108P52k70j259
56491A80410j553j031l99m21q20o11L73J145R45J59m22m58R6J164K183K360J755
56474A84875J305J368J153J93o36l61N98J135J055R31Q89O04K61M38J104J617
56458A96529J785K047K534K755K477K204K435K910L002K546J925J535J474J674
56444B27832K051K388K284J415k1j287j714j315o65k17K6K17L47L28J76J1o1K
$$ plain form
56426 231797 231907 231934 231573 230775 229912 229488 229740 230518 231382 231830 231650 231115 230588 230004 229118 228250 228132 228728 228823
56407 228823 227408 225136 223762 224196 225653 226748 226958 226865 227266 228323 229536 230411 230950 231339 231452 231213 231352
56390 231352 232981 236105 239175 240655 240523 239748 238886 237882 236824 236031 235565 235351 235650 236767 238444 240228
56374 240228 242264 244967 248006 250459 252054 253508 255450 257717 259949 262191 264520 266632 268226 269443
56360 269443 270572 271528 271906 271420 270201 268777 267799 267528 267650 267745 267782 267884 267893 267712 267792 268573 269521 269573 268646 267856
56340 267856 267972 268453 268513 268368 268756 269724 270651 271240 271776 272534 273550 274995 277209 280200 283497 286641 289570
56323 289570 292422 295230 297970 300628 303023 304786 305795 306501 307478 308659 309379 309305 308911 308723 308451 307396
56307 307396 305611 304068 303614 304214 305358 306746 308401 310536 313516 317550 322154 326341 329562 332026 333877
$$ packed form
56426B31797J10K7l61p98q63m24K52P78Q64M48j80n35n27n84q86q68j18N96R5
56407B28823j415k272j374M34J457J095K10r3M01J057J213Q75N39L89J13k39J39
56390B31352J629L124L070J480j32p75q62j004j058p93m66k14K99J117J677J784
56374B40228K036K703L039K453J595J454J942K267K232K242K329K112J594J217
56360B69443J129R56L78m86j219j424r78k71J22R5L7J02Rj81Q0P81R48N2r27p90
56340B67856J16M81O0j45L88R68R27N89N36P58J016J445K214K991L297L144K929
56323B89570K852K808K740K658K395J763J009P06R77J181P20p4l94j88k72j055
56307C07396j785j543m54O00J144J388J655K135K980M034M604M187L221K464J851
$$ plain form
56292 333877 334643 333936 332210 330329 328748 327557 326904 326844 327092 327421 327949 328590 328807 328519 328726 330350 332836
56275 332836 334804 335849 336745 338039 339508 341048 343082 345761 348512 350740 352429 353869 355324 357111
56261 357111 359466 362151 364671 367012 369708 373089 376930 380893 384864 388805 392750 397018 401964 407476
56247 407476 413064 418398 423377 427921 432283 437386 444118 452340 461171 470086 479017 487520 494901 501232
56233 501232 507353 513625 519482 524452 528812 532877 536403 539023 540718 541518 541346 540425 539331 538361 537297
56218 537297 535854 533835 530895 526944 522860 519955 518532 517732 516943 516403 516139 515442 514020 512733 512412 512694
56202 512694 512768 512754 513501 515377 517879 520211 521836 522770 523745 525695 528715 531900 534494 536755 539398 542745
56186 542745 546798 551587 556906 562096 566553 570172 573043 575201 576983 579023 581420 583417 584382 584715 585310
$$ packed form
56292C33877P66p07j726j881j581j191o53o0K48L29N28O41K17k88K07J624K486
56275C32836J968J045Q96J294J469J540K034K679K751K228J689J440J455J787
56261C57111K355K685K520K341K696L381L841L963L971L941L945M268M946N512
56247D07476N588N334M979M544M362N103O732Q222Q831Q915Q931Q503P381O331
56233E01232O121O272N857M970M360M065L526K620J695Q00j72r21j094r70j064
56218E37297j443k019k940l951m084k905j423q00p89n40k64o97j422j287l21K82
56202E12694P4j4P47J876K502K332J625R34R75J950L020L185K594K261K643L347
56186E42745M053M789N319N190M457L619K871K158J782K040K397J997R65L33N95
$$ plain form
56171 585310 586472 587815 588849 589302 589177 588870 588954 589572 590421 591478 593283 596270 600344 605380 611444 618183
56155 618183 624679 630455 636170 642807 650650 659477 669199 679756 690818 702115 713765 725918 738565
56142 738565 752136 767743 786165 806878 828605 850567 872896 896253 921636 950434 984267
56131 984267 1024896 1074372 1134943 1208556 1296680 1400405 1519867 1653149 1796003 1942585
56121 1942585 2085890 2217969 2331687 2423841 2496529 2555216 2605721 2652552 2698007 2741103 2777653
56110 2777653 2802624 2812967 2808752 2792767 2769652 2744179 2718606 2691015 2656157 2607705 2540256
56099 2540256 2451037 2341310 2216238 2082935 1948611 1819970 1702619 1599855 1512389 1439704
56089 1439704 1380962 1334373 1297032 1266517 1242113 1223777 1210745 1201918 1196765 1194891 1195458 1197898
$$ packed form
56171E85310J162J343J034M53j25l07Q4O18Q49J057J805K987M074N036O064O739
56155F18183O496N776N715O637P843Q827R722J0557J1062J1297J1650J2153J2647
56142G38565J3571J5607J8422K0713K1727K1962K2329K3357K5383K8798L3833
56131I84267M0629M9476O0571P3613Q8124J03725J19462J33282J42854J46582
56121A942585J43305J32079J13718R2154P2688N8687N0505M6831M5455M3096L6550
56110B777653K4971J0343m215j5985k3115k5473k5573k7591l4858m8452o7449
56099B540256q9219j09727j25072j33303j34324j28641j17351j02764q7466p2685
56089A439704n8742m6589l7341l0515k4404j8336j3032q827n153j874N67K440
$$ plain form
56077 1197898 1202529 1209555 1218128 1227302 1237233 1248484 1260814 1273685 1287354 1302319 1318090 1333611
56065 1333611 1348588 1363611 1379328 1396239 1414852 1435199 1456581 1478396 1500664 1523177 1544994
56054 1544994 1565624 1585832 1606309 1626308 1644688 1661622 1678213 1695125 1712729 1731874 1753202
56043 1753202 1776169 1799967 1824994 1852278 1881924 1913223 1945910 1980155 2015624 2051559 2087561
56032 2087561 2123589 2159782 2197042 2236992 2280348 2326039 2372921 2421532 2473043 2527365 2583583
56021 2583583 2641510 2701480 2763349 2827021 2893345 2963160 3036145 3111812 3190824 3273931 3360392
56010 3360392 3448968 3539857 3634263 3732783 3835619 3943634 4057662 4177467 4302772 4434495
56000 4434495 4573575 4719555 4871988 5032283 5202427 5382701 5572403 5771988 5982706
$$ packed form
56077A197898M631P026Q573R174R931J1251J2330J2871J3669J4965J5771J5521
56065A333611J4977J5023J5717J6911J8613K0347K1382K1815K2268K2513K1817
56054A544994K0630K0208K0477J9999J8380J6934J6591J6912J7604J9145K1328
56043A753202K2967K3798K5027K7284K9646L1299L2687L4245L5469L5935L6002
56032B087561L6028L6193L7260L9950M3356M5691M6882M8611N1511N4322N6218
56021B583583N7927N9970O1869O3672O6324O9815P2985P5667P9012Q3107Q6461
56010C360392Q8576R0889R4406R8520J02836J08015J14028J19805J25305J31723
56000D434495J39080J45980J52433J60295J70144J80274J89702J99585K10718
$$ plain form
55991 5982706 6205029 6439264 6686998 6950188 7229617 7525786 7840272 8174702 8529721
55982 8529721 8906834 9309940 9743323 10209797 10712778 11258279 11852518 12499475 13203317
55973 13203317 13971373 14812273 15733472 16743823 17856773 19088378 20454840 21975795
55965 21975795 23678562 25597072 27770379 30246594 33087062 36366334 40175757 44635166
55957 44635166 49902571 56177202 63709028 72819510 83916701 97498165 114154032 134550569
55949 134550569 159334702 188947283 223405167 262049636 303150185 343423975 377972200
55942 377972200 401240490 408918479 399725931 375875548 341957735 303120470 263654161
55935 263654161 226443221 193056841 164081186 139471035 118844940 101687557 87459129
$$ packed form
55991E982706K22323K34235K47734K63190K79429K96169L14486L34430L55019
55982H529721L77113M03106M33383M66474N02981N45501N94239O46957P03842
55973A3203317P68056Q40900R21199J010351J112950J231605J366462J520955
55965B1975795J702767J918510K173307K476215K840468L279272L809423M459409
55957D4635166N267405O274631P531826R110482J1097191J3581464J6655867K0396537
55949A34550569K4784133K9612581L4457884L8644469M1100549M0273790L4548225
55942C77972200K3268290P677989r192548k3850383l3917813l8837265l9466309
55935B63654161l7210940l3386380k8975655k4610151k0626095j7157383j4228428
$$ plain form
55928 87459129 75651894 65823845 57609312 50708668 44876266 39915670 35672683 32023062
55920 32023062 28864843 26117381 23717773 21613393 19759258 18120472 16670638 15385683
55912 15385683 14242110 13220730 12307314 11488394 10749703 10079235 9468456 8909809 8395800
55903 8395800 7921037 7482428 7076727 6700021 6349768 6024975 5724055 5444502 5184668
55894 5184668 4943842 4720543 4512750 4319811 4142114 3978833 3827902 3688249 3560227
55885 3560227 3443775 3337940 3242355 3157629 3084192 3022318 2973381 2939624 2922452 2921932 2937619
55874 2937619 2968189 3010015 3056963 3101438 3134906 3148653 3136478 3097443 3035258 2955163 2861913
55863 2861913 2759358 2649578 2532309 2407038 2276240 2145582 2020819 1905400 1800667
$$ packed form
55928H7459129j1807235r828049q214533o900644n832402m960596m242987l649621
55920C2023062l158219k747462k399608k104380j854135j638786j449834j284955
55912A5385683j143573j021380r13416q18920p38691o70468o10779n58647n14009
55903H395800m74763m38609m05701l76706l50253l24793l00920k79553k59834
55894E184668k40826k23299k07793j92939j77697j63281j50931j39653j28022
55885C560227j16452j05835r5585q4726p3437o1874m8937l3757j7172n20J5687
55874B937619L0570M1826M6948M4475L3468J3747j2175l9035o2185q0095r3250
55863B861913j02555j09780j17269j25271j30798j30658j24763j15419j04733
$$ plain form
55854 1800667 1706784 1623065 1548474 1482292 1423828 1371743 1324455 1280978 1240590 1202185 1165000
55843 1165000 1129628 1097130 1067358 1039327 1013002 989426 969024 950850 933683 916952 900528
55832 900528 884450 868985 854377 840581 827675 816077 805610 794920 782823 769905 757778
55821 757778 747014 736718 725813 713750 700294 685747 671224 657711 645056 632798 621666
55810 621666 613126 607657 604519 602974 602606 602747 602974 604182 607902 614427 622669 631829 641965 652865
55796 652865 663600 673507 682499 690170 695616 698389 698648 696162 690197 680763 669081 656505 643765
55783 643765 631456 620294 610577 602039 594297 586549 576855 563070 545081 525270 506382 489708
55771 489708 475605 464577 457130 453399 453591 458048 466116 475508 483482 488306 489296 486201 479335 469889
$$ packed form
55854A800667r3883q3719p4591o6182n8464n2085m7288m3477m0388l8405l7185
55843A165000l5372l2498k9772k8031k6325k3576k0402j8174j7167j6731j6424
55832I00528j6078j5465j4608j3796j2906j1598j0467j0690j2097j2918j2127
55821G57778j0764j0296j0905j2063j3456j4547j4523j3513j2655j2258j1132
55810F21666q540n469l138j545l68J41K27J208L720O525Q242R160J0136J0900
55796F52865J0735R907Q992P671N446K773K59k486n965r434j1682j2576j2740
55783F43765j2309j1162r717q538p742p748r694j3785j7989j9811j8888j6674
55771D89708j4103j1028p447l731J92M457Q068R392P974M824R90l095o866r446
$$ plain form
55757 469889 459288 448294 437085 425926 415258 405289 395878 386764 377715 368622 359613 350909 342457
55744 342457 333970 325411 317169 309663 303019 297177 292050 287582 283945 281629 280984 281684 283003 284530 286172
55729 286172 287555 287989 287077 284899 281604 277312 272462 267712 263314 259021 254657 250387 246421 242903 240098
55714 240098 238266 237367 237301 238343 240772 244167 247677 251018 254662 259067 264255 269951 275341 278726 278390
55699 278390 274090 267142 258958 250227 241490 233515 226673 220704 215420 210986 207217 203425 199361 195639
55685 195639 192835 190808 189354 188792 189396 190821 192586 194591 196760 198728 200337 201788 202790 202205 199256
55670 199256 194644 189820 185562 181797 178351 175221 172425 170275 169414 169963 170914 171127 170761 171055 172797 175715
55654 175715 179327 183679 189028 195285 202039 208858 215445 221611 227134 231617 234693 236485 237537 238042
$$ packed form
55757D69889j0601j0994j1209j1159j0668r969r411r114r049r093r009q704q452
55744C42457q487q559q242p506o644n842n127m468l637k316o45P00J319J527J642
55729B86172J383M34r12k178l295m292m850m750m398m293m364m270l966l518k805
55714B40098j832q99o6J042K429L395L510L341L644M405N188N696N390L385l36
55699B78390m300o948q184q731q737p975o842n969n284m434l769l792m064l722
55685A95639k804k027j454n62O04J425J765K005K169J968J609J451J002n85k949
55670A99256m612m824m258l765l446l130k796k150q61N49R51K13l66K94J742K918
55654A75715L612M352N349O257O754O819O587O166N523M483L076J792J052N05
$$ plain form
55640 238042 237404 234932 230648 225038 218287 210320 201540 192929 185309 178745 172804 167169 161970 157685
55626 157685 154701 152887 151648 150461 149194 147891 146581 145480 145039 145414 146114 146515 146537 146463 146310 145829 145039
55609 145039 144294 143752 143158 142309 141487 141225 141691 142409 142588 141779 140214 138575 137510 137357 138008 138758 138486 136541
55591 136541 133467 130450 128060 126061 124419 123713 124204 125220 126013 126693 127682 128724 129169 129003 128826 128921 129090
55574 129090 129480 130892 133947 138409 143641 149457 156245 164321 173329 182273 190149 196603 201903 206246
55560 206246 209227 210129 208561 204748 199388 193350 187181 180655 173111 164539 156070 149024 143675 139333
55546 139333 135375 131693 128258 124846 121338 117968 115160 113294 112563 112741 113197 113448 113587 113845 113936 113336
55530 113336 112131 110967 110070 108947 107326 105890 105575 106386 107347 107526 106792 105584 104301 103089 102084 101535
$$ packed form
55640B38042o38k472m284n610o751p967q780q611p620o564n941n635n199m285
55626A57685k984j814j239j187j267j303j310j101m41L75P00M01K2p4j53m81p90
55609A45039p45n42n94q49q22k62M66P18J79q09j565j639j065j53O51P50k72j945
55591A36541l074l017k390j999j642p06M91J016P93O80R89J042M45j66j77R5J69
55574A29090L90J412L055M462N232N816O788Q076R008Q944P876O454N300M343
55560B06246K981R02j568l813n360o038o169o526p544q572q469p046n349m342
55546A39333l958l682l435l412l508l370k808j866p31J78M56K51J39K58R1o00
55530A13336j205j164q97j123j621j436l15Q11R61J79p34j208j283j212j005n49
$$ plain form
55514 101535 101540 101766 101688 101142 100373 99498 98245 96517 94890 94140 94414 95237 96184 97111 97832 98144 98222 98513 99074
55495 99074 99446 99333 98967 98547 97742 96151 94014 92108 91067 91071 91955 93253 94213 94163 92987 91123 89130
55478 89130 87424 86360 86258 87190 88854 90719 92329 93507 94355 95048 95582 95784 95595 95253 95041 94884 94391
55461 94391 93365 92204 91605 91879 92629 93203 93338 93250 93174 93098 93053 93310 94006 94731 94858 94292 93551 93111 92976 93014
55441 93014 93290 93838 94400 94764 95186 96056 97197 97858 97536 96501 95433 94755 94477 94466 94638 94928 95244 95484
55423 95484 95606 95734 96206 97278 98714 99860 100352 100592 101233 102297 103148 103344 103208 103435 104445 106242 108552
55406 108552 110833 112397 112882 112533 111776 110636 108887 106600 104177 101873 99674 97687 96199 95263 94620
55391 94620 94198 94312 95083 95999 96371 96033 95238 94119 92642 91072 90054 90125 91271 92941 94352 94890 94542
$$ packed form
55514A01535NK26p8n46p69q75j253j728j627p50K74Q23R47R27P21L12P8K91N61
55495I9074L72j13l66m20q05j591k137j906j041MQ84J298R60n0j176j864j993
55478H9130j706j064j02R32J664J865J610J178Q48O93N34K02j89l42k12j57m93
55461I4391j026j161n99K74P50N74J35q8p6p6m5K57O96P25J27n66p41m40j35L8
55441I3014K76N48N62L64M22Q70J141O61l22j035j068o78k78j1J72K90L16K40
55423I5484J22J28M72J072J436J146M92K40O41J064Q51J96j36K27J010J797K310
55406A08552K281J564M85l49p57j140j749k287k423k304k199j987j488r36o43
55391I4620m22J14P71R16L72l38p95j119j477j570j018P1J146J670J411N38l48
$$ plain form
55374 94542 93970 93915 94492 95200 95578 95623 95582 95623 95793 96030 96109 95762 94981 94086 93416 93170 93537 94673 96306 97655
55354 97655 98110 97925 97896 98393 99042 99431 99750 100418 101334 101868 101654 101066 100750 100838 100904 100653 100396 100655 101406 101924
55334 101924 101483 100080 98380 97043 96211 95607 94907 93981 92933 92037 91536 91436 91542 91718 91947 92073 91782
55317 91782 91081 90557 90779 91526 92038 92017 92000 92619 93854 95136 95832 95524 94307 93066 92982 94269 95746 96121
55299 96121 95432 94755 94771 95224 95652 95933 95994 95595 94671 93579 92833 92800 93650 95209 96836 97830 98094 98089 98164 98324
55279 98324 98654 99393 100415 101216 101642 102173 103113 103953 103917 102845 101190 99448 97930 96847 96251 96052 96286
55262 96286 97142 98486 99705 100373 100872 101976 103915 106100 107685 108206 107871 107409 107491 108153 108949 109601 110119
55245 110119 110285 109716 108676 108129 108548 109251 109453 109334 109387 109308 108505 107370 107021 107811 108918 109391 108895 107483
$$ packed form
55374I4542n72n5N77P08L78M5m1M1J70K37P9l47p81q95o70k46L67J136J633J349
55354I7655M55j85k9M97O49L89L19O68R16N34k14n88l16Q8O6k51k57K59P51N18
55334A01924m41j403j700j337q32o04p00r26j048q96n01j00J06J76K29J26k91
55317I1782p01n24K22P47N12k1j7O19J235J282O96l08j217j241q4J287J477L75
55299I6121o89o77J6M53M28K81O1l99r24j092p46l3Q50J559J627R94K64nP5J60
55279I8324L30P39J022Q01M26N31R40Q40l6j072j655j742j518j083n96j99K34
55262I6286Q56J344J219O68M99J104J939K185J585N21l35m62Q2O62P96O52N18
55245A10119J66n69j040n47M19P03K02j19N3p9q03j135l49P90J107M73m96j412
$$ plain form
55227 107483 105505 103743 102772 102024 100355 97765 95716 95372 96318 97429 98282 99087 99893 100559 101158 101793 102287
55210 102287 102488 102585 102661 102300 101216 100014 99676 100359 101257 101654 101614 101600 101894 102524 103388 104231 104708 104663 104214 103546
55190 103546 102742 101858 101056 100559 100510 100850 101296 101562 101685 102049 102921 104044 104798 104798 104246 103721 103627 103806 103710 103093
55170 103093 102517 102900 104459 106331 107427 107466 106941 106319 105650 104928 104386 104297 104725 105622 106929 108399 109509
55153 109509 109850 109604 109442 109862 110775 111755 112451 112663 112257 111359 110521 110291 110579 110802 110744 110846 111415 111990 111935
55134 111935 111364 110902 110765 110642 110433 110477 110876 111199 111067 110649 110288 110040 109845 109824 110067 110330 110246 109695 108806 107769
55114 107769 106783 106034 105637 105769 106746 108557 110388 111255 111278 111616 112734 113551 112975 111635 111101 111775 112660 113105
55096 113105 113629 114757 116054 116801 116886 116472 115451 113913 112654 112450 113053 113545 113506 113208 112744 111747 110149
$$ packed form
55227A07483j978j762r71p48j669k590k049l44R46J111Q53Q05Q06O66N99O35M94
55210A02287K01R7P6l61j084j202l38O83Q98L97m0j4K94O30Q64Q43M77m5m49o68
55190A03546q04q84q02m97m9L40M46K66J23L64Q72J123P54%n52n25r4J79r6o17
55170A03093n76L83J559J872J096L9n25o22o69p22n42q9M28Q97J307J470J110
55153A09509L41k46j62M20R13R80O96K12m06q98q38k30K88K23n8J02N69N75n5
55134A11935n71m62j37j23k09M4L99L23j32m18l61k48j95k1K43K63q4n51q89j037
55114A07769r86p49l97J32R77J811J831Q67K3L38J118Q17n76j340n34O74Q85M45
55096A13105N24J128J297P47Q5m14j021j538j259k04O03M92l9k98m64r97j598
$$ plain form
55079 110149 108641 108005 108317 109035 109586 109675 109315 108855 108704 108723 108171 106648 104921 104298 105169 106636 107728 108478
55061 108478 109531 111076 112574 113351 113099 111943 110435 109425 109491 110370 111210 111470 111297 111072 110909 110774 110727
55044 110727 110820 110977 111193 111645 112340 112855 112691 111840 110799 110070 109818 109931 110207 110471 110652 110764 110801 110766 110830 111291
55024 111291 112242 113388 114355 114993 115355 115568 115909 116675 117669 118102 117440 116186 115377 115376 115664 115812 116072 116811 117845
55005 117845 118697 119134 119132 118606 117579 116446 115651 115254 115155 115646 117188 119567 121721 122734 122770 122743 123228 124013
54987 124013 124635 125002 125316 125585 125521 124958 124201 123738 123671 123607 123237 122851 123045 123964 125098 125935 126548 127316 128241
54968 128241 128925 129231 129623 130602 132024 133217 133726 133758 133827 134103 134217 133733 132812 132251 132706 133916 134957 135335
54950 135335 135487 136022 136775 137019 136442 135439 134468 133559 132568 131578 130855 130689 131356 132895 134802 136267 136990
$$ packed form
55079A10149j508o36L12P18N51Q9l60m60j51J9n52j523j727o23Q71J467J092P50
55061A08478J053J545J498P77k52j156j508j010O6Q79Q40K60j73k25j63j35m7
55044A10727R3J57K16M52O95N15j64q51j041p29k52J13K76K64J81J12L7l5O4M61
55024A11291R51J146R67O38L62K13L41P66R94M33o62j254q09jK88J48K60P39J034
55005A17845Q52M37kn26j027j133p95l97r9M91J542K379K154J013L6k7M85P85
54987A24013O22L67L14K69o4n63p57m63o7o4l70l86J94R19J134Q37O13P68R25
54968A28241O84L06L92R79J422J193N09L2O9K76J14m84r21n61M55J210J041L78
54950A35335J52N35P53K44n77j003r71r09r91r90p23j66O67J539J907J465P23
$$ plain form
54933 136990 137470 138256 139241 140084 141043 142849 145752 149124 152157 154656 157073 160019 163892 168796 174623
54918 174623 181265 188826 197548 207455 218086 228541 237726 244613 248462 248970 246207 240527 232598 223439
54904 223439 214124 205281 196932 188899 181269 174369 168361 163070 158323 154368 151779 150830 151059 151496 151335
54889 151335 150324 148702 147017 145909 145752 146341 147174 148145 149776 152544 156274 160468 165085 170659 177670
54874 177670 186113 195698 206141 217023 227537 236598 243297 247249 248583 247634 244620 239578 232516 223637
54860 223637 213485 203008 193336 185227 178586 172727 167229 162350 158503 155596 153114 150670 148144 145405
54846 145405 142248 138726 135290 132460 130381 128717 127027 125356 124402 124827 126272 127469 127570 127049 126884
54831 126884 127134 126912 125649 123777 122117 121161 121100 121965 123371 124517 124846 124586 124410 124814 125984 127925 130281
$$ packed form
54933A36990M80P86R85Q43R59J806K903L372L033K499K417K946L873M904N827
54918A74623O642P561Q722R907J0631J0455R185O887L849N08k763n680p929r159
54904B23439r315q843q349q033p630o900o008n291m747l955k589r49K29M37j61
54889A51335j011j622j685j108j57N89Q33R71J631K768L730M194M617N574P011
54874A77670Q443R585J0443J0882J0514R061O699L952J334r49l014n042p062q879
54860B23637j0152j0477r672q109o641n859n498m879l847k907k482k444k526k739
54846A45405l157l522l436k830k079j664j690j671r54M25J445J197J01n21j65
54831A26884K50k22j263j872j660r56o1Q65J406J146L29k60j76M04J170J941K356
$$ plain form
54814 130281 132206 132952 132644 132176 132228 132608 132691 132320 132031 132421 133444 134469 134954 134931 134769 134710 134754 134864 134990
54795 134990 134938 134480 133649 132774 132185 132060 132512 133576 135023 136446 137596 138468 139030 139138 138857 138632 138921 139761
54777 139761 140878 142118 143662 145865 148898 152475 155942 158870 161625 165167 170189 176593 183893 191954
54763 191954 201183 212033 224357 237187 249213 259590 268196 274990 279382 280566 278248 272610 263810
54750 263810 252258 239369 227147 216669 207641 199721 193441 189214 186256 183393 180507 178296 176917
54737 176917 175832 174812 174178 173989 173880 173841 174350 175502 176722 177634 178592 180092 182280 185334 189620 195023
54721 195023 200777 206524 213012 221117 230595 240419 249878 258524 265290 268693 268104 264184 257865 249537
54707 249537 239452 228334 217153 206663 197437 189995 184425 180128 176335 172806 169699 166969 164326
$$ packed form
54814A30281J925P46l08m68N2L80Q3l71k89L90J023J025M85k3j62n9M4J10J26
54795A34990n2m58q31q75n89j25M52J064J447J423J150Q72N62J08k81k25K89Q40
54777A39761J117J240J544K203L033L577L467K928K755L542N022O404P300Q061
54763A91954R229J0850J2324J2830J2026J0377Q606O794M392J184k318n638q800
54750B63810j1552j2889j2222j0478r028p920o280m227k958k863k886k211j379
54737A76917j085j020o34j89j09l9N09J152J220R12R58J500K188L054M286N403
54721A95023N754N747O488Q105R478R824R459Q646O766L403n89l920o319q328
54707B49537j0085j1118j1181j0490r226p442n570m297l793l529l107k730k643
$$ plain form
54694 164326 161763 159611 157955 156368 154451 152346 150484 149064 148019 147327 147026 146991 147007 147040 147175 147323 147260
54677 147260 146967 146642 146349 145969 145573 145467 145720 145981 145950 145710 145359 144710 143723 142850 142465 142225 141542 140577 140149
54658 140149 140674 141765 142883 143821 144413 144389 143838 143341 143323 143605 143898 144307 145038 145896 146495 146738 146728 146460 146002
54639 146002 145816 146425 147786 149318 150515 151276 151739 152113 152619 153279 153740 153600 152859 151847 150803 149904 149638
54622 149638 150606 152737 155048 156487 156829 156573 156214 155895 155608 155365 155123 154849 154784 155383 156718 158070 158463
54605 158463 157666 156404 155448 154840 154279 153923 154164 154695 154592 153636 152959 153801 155908 157756 158228 157584 156784 156388
54587 156388 156288 156125 155679 155026 154494 154490 155206 156418 157484 157667 156674 154973 153324 152041 151070 150777 151910
54570 151910 154373 156696 157528 157262 157318 158061 158446 157787 156805 156498 156811 157065 157068 157192 157714 158671 160094 161855
$$ packed form
54694A64326k563k152j656j587j917k105j862j420j045o92l01l5J6L3J35J48o3
54677A47260k93l25k93l80l96j06K53K61l1k40l51o49r87q73l85k40o83r65m28
54658A40149N25J091J118R38N92k4n51m97j8K82K93M09P31Q58N99K43j0k68m58
54639A46002j86O09J361J532J197P61M63L74N06O60M61j40p41j012j044q99k66
54622A49638R68K131K311J439L42k56l59l19k87k43k42k74o5N99J335J352L93
54605A58463p97j262r56o08n61l56K41N31j03r56o77Q42K107J848M72o44q00l96
54587A56388j00j63m46o53n32mP16J212J066J83r93j701j649j283r71k93J133
54570A51910K463K323Q32k66N6P43L85o59r82l07L13K54LJ24N22R57J423J761
$$ plain form
54552 161855 163441 164328 164475 164139 163430 162427 161495 161057 161074 161112 160943 160797 161051 161877 163173 164718 166444 168575
54534 168575 171301 174274 176830 178818 180786 183005 184815 185437 185167 185110 185851 186936 187628 187717 187500 187426 187755
54517 187755 188276 188374 187745 187014 187174 188380 189715 190251 189941 189351 188906 188604 188167 187228 185612 183621 181873
54500 181873 180689 179777 178644 177175 175694 174567 173919 173639 173575 173649 173822 173991 174102 174356 175049 176048 176732 176696
54482 176696 176322 176334 177020 178179 179567 180903 181697 181741 181721 182746 185138 188194 191195 194095 197046 199833
54466 199833 202132 203957 205597 207347 209400 211632 213415 214115 213913 213686 213953 214433 214813 215239 215746 215854
54450 215854 215290 214581 214347 214434 214349 214149 214213 214399 214127 213199 211884 210259 208115 205554 203118 201175 199634
54433 199634 198373 197569 197378 197537 197428 196501 194768 193067 192599 193861 196075 197975 198954 199197 198985 198434 197815
$$ packed form
54552A61855J586Q87J47l36p09j003r32m38J7L8j69j46K54Q26J296J545J726K131
54534A68575K726K973K556J988J968K219J810O22k70n7P41J085O92Q9k17p4L29
54517A87755N21R8o29p31J60J206J335N36l10n90m45l02m37r39j616j991j748
54500A81873j184r12j133j469j481j127o48k80o4P4J73J69J11K54O93R99O84l6
54482A76696l74J2O86J159J388J336P94M4k0J025K392L056L001K900K951K787
54466A99833K299J825J640J750K053K232J783P00k02k27K67M80L80M26N07J08
54450B15854n64p09k34Q7q5k00O4J86k72r28j315j625k144k561k436j943j541
54433A99634j261q04j91J59j09r27j733j701m68J262K214J900R79K43k12n51o19
$$ plain form
54416 197815 197483 197444 197403 197305 197395 197710 197996 198183 198502 199040 199593 200037 200389 200478 200075 199544 199777 201191 203221 205094
54396 205094 206640 208000 209043 209600 209964 210560 211298 211736 211827 212045 212724 213714 214682 215363 215449 214608 212890 210895
54378 210895 209258 207998 206552 204403 201587 198592 195932 193941 192851 192843 193852 195394 196796 197711 198359
54363 198359 199226 200478 201703 202255 201931 201273 201089 201697 202776 203882 204734 204921 203827 201261 197943 194916
54347 194916 192663 191137 190369 190372 190597 190190 188991 187675 186660 185471 183507 180916 178278 175863 173678 171922
54331 171922 170848 170331 170029 169857 169934 170198 170430 170546 170507 170112 169348 168790 169084 170001 170611 170541 170493 171205 172343
54312 172343 172939 172669 172163 172073 172332 172488 172391 172299 172472 172942 173587 174161 174352 174073 173747 173969 174784 175638 176201 176876
54292 176876 178088 179415 179979 179619 179032 178674 178154 177005 175472 174072 172734 170945 168606 166276 164594
$$ packed form
54416A97815l32l9m1r8R0L15K86J87L19N38N53M44L52Q9m03n31K33J414K030J873
54396B05094J546J360J043N57L64N96P38M38R1K18O79R90R68O81Q6q41j718j995
54378B10895j637j260j446k149k816k995k660j991j090qJ009J542J402R15O48
54363A98359Q67J252J225N52l24o58j84O08J079J106Q52J87j094k566l318l027
54347A94916k253j526p68LK25m07j199j316j015j189j964k591k638k415k185j756
54331A71922j074n17l02j72P7K64K32J16l9l95p64n58K94R17O10p0m8P12J138
54312A72343N96k70n06r0K59J56r7r2J73M70O45N74J91k79l26K22Q15Q54N63O75
54292A76876J212J327N64l60n87l58n20j149j533j400j338j789k339k330j682
$$ plain form
54277 164594 163818 163911 164670 165692 166477 166751 166630 166518 166894 168019 169554 170561 170259 168856 167466 167067 167632
54260 167632 168277 168157 167228 166245 166036 166685 167459 167521 166654 165220 163722 162596 162237 162803 163935 164911 165152 164550
54242 164550 163416 162369 162136 163086 164784 166247 166806 166613 166282 166218 166332 166251 165654 164524 163173 162006 161216
54225 161216 160721 160321 159855 159283 158745 158495 158612 158905 159273 160028 161492 163271 164418 164557 164489 165291 166947 168267
54207 168267 168186 166814 165083 163685 162615 161635 160806 160408 160520 160888 161185 161287 161306 161477 161998 162892 163986 165088
54189 165088 166099 166824 166828 165775 163941 162060 160554 159253 158022 157267 157416 158139 158582 158363 157881 157642 157610
54172 157610 157376 156661 155482 154062 152731 151822 151439 151354 151240 150998 150864 151188 152015 152849 153013 152374 151591 151429
54154 151429 151888 152246 151901 150911 149731 148780 148392 148837 150063 151497 152406 152562 152475 152875 153981 155328 156345
$$ packed form
54277A64594p76R3P59J022P85K74j21j12L76J125J535J007l02j403j390l99N65
54260A67632O45j20r29r83k09O49P74O2q67j434j498j126l59N66J132R76K41o02
54242A64550j134j047k33R50J698J463N59j93l31o4J14q1n97j130j351j167p90
54225A61216m95m00m66n72n38k50J17K93L68P55J464J779J147J39o8Q02J656J320
54207A68267q1j372j731j398j070r80q29l98J12L68K97J02J9J71N21Q94J094J102
54189A65088J011P25Mj053j834j881j506j301j231p55J49P23M43k19m82k39l2
54172A57610k34p15j179j420j331r09l83q5j14k42j34L24Q27Q34J64o39p83j62
54154A51429M59L58l45r90j180r51l88M45J226J434R09J56q7M00J106J347J017
$$ plain form
54137 156345 156973 157524 158017 158092 157779 157953 159524 162269 164917 166433 166870 166890 166900 166831 166473 165699 164525 163143
54119 163143 161889 161043 160684 160767 161219 161927 162702 163296 163464 163167 162836 163174 164366 165547 165481 163886 161768 160348
54101 160348 159942 160032 160114 160158 160387 160910 161582 162088 162142 161705 161086 160856 161524 163087 164860 166002 166394 166705 167382
54082 167382 167956 167757 166976 166416 166397 166598 166845 167185 167163 166018 163957 162442 162634 164172 166031 167925 170164
54065 170164 172572 174391 175131 174938 174246 173566 173356 173613 173761 173454 173180 173527 174180 174391 174258 174649 175820 176970
54047 176970 177366 177243 177250 177625 178269 179152 180249 181440 182804 184706 187304 190209 192917 195339 197654 199915
54031 199915 202116 204501 207466 211115 215070 218797 222111 225410 229331 234046 238959 243296 246901 250162
54017 250162 253235 255746 257347 258212 258830 259543 260397 261194 261616 261495 261020 260416 259502 257897 255681 253384 251247
$$ packed form
54137A56345O28N51M93P5l13J74J571K745K648J516M37K0J0o9l58p74j174j382
54119A63143j254q46l59Q3M52P08P75N94J68k97l31L38J192J181o6j595k118j420
54101A60348m06R0Q2M4K29N23O72N06N4m37o19k30O68J563J773J142L92L11O77
54082A67382N74j99p81n60j9K01K47L40k2j145k061j515J92J538J859J894K239
54065A70164K408J819P40j93o92o80k10K57J48l07k74L47O53K11j33L91J171J150
54047A76970L96j23PL75O44Q83J097J191J364J902K598K905K708K422K315K261
54031A99915K201K385K965L649L955L727L314L299L921M715M913M337L605L261
54017B50162L073K511J601Q65O18P13Q54P97M22j21m75o04r14j605k216k297k137
$$ plain form
54000 251247 248882 245870 242331 238740 235548 233082 231405 230069 228469 226645 225280 224621 223944 222489 220444
53985 220444 218525 216968 215501 213978 212456 210842 209070 207485 206544 206255 206368 206871 207782 208650 208938 208815
53969 208815 208872 209117 208941 208183 207472 207320 207569 208021 208963 210617 212565 214242 215628 217062 218648 220344 222439
53952 222439 225448 229577 234549 239961 245739 252428 261100 272620 286766 302372 318455 334660 350146
53939 350146 362721 370046 371723 369490 365347 360203 354537 349449 346261 345251 345392 345334 344347 342361 339511
53924 339511 335875 331441 326181 320252 314223 309019 305420 303508 302691 302349 302396 303123 304629 306675 309169
53909 309169 312460 316889 322174 327579 332691 337721 342951 348125 352596 355924 358180 359741 360984 362062
53895 362062 362712 362241 360005 356158 351858 348473 346509 345396 344251 342652 340588 338019 334727 330553 325525
$$ packed form
54000B51247k365l012l539l591l192k466j677j336j600j824j365o59o77j455k045
53985B20444j919j557j467j523j522j614j772j585r41k89J13N03R11Q68K88j23
53969B08815N7K45j76p58p11j52K49M52R42J654J948J677J386J434J586J696K095
53952B22439L009M129M972N412N778O689Q672J1520J4146J5606J6083J6205J5486
53939C50146J2575P325J677k233m143n144n666n088l188j010J41n8r87j986k850
53924C39511l636m434n260n929o029n204l599j912q17l42M7P27J506K046K494
53909C09169L291M429N285N405N112N030N230N174M471L328K256J561J243J078
53895C62062O50m71k236l847m300l385j964j113j145j599k064k569l292m174n028
$$ plain form
53880 325525 319817 313784 307994 302838 298052 292923 287182 281561 277271 275001 274459 274639 274389 272971 270461
53865 270461 267605 265044 262719 260161 257275 254577 252633 251504 250763 249914 248747 247405 246196 245248 244388
53850 244388 243371 242179 240940 239629 238035 236007 233646 231293 229440 228515 228492 228760 228664 228145 227560 226931
53834 226931 225750 223709 221290 219318 218146 217482 216871 216059 214984 213721 212487 211538 210979 210748 210744 210859 210979
53817 210979 211125 211598 212736 214382 215781 216267 215990 215685 215696 215550 214775 213797 213565 214337 215456 216457 217852
53800 217852 220387 223943 227677 230996 233931 236796 240066 244414 250140 256484 262138 266555 270195 273427
53786 273427 276013 277987 280210 283384 287013 290029 292084 293597 294789 295469 295711 296049 296842 297886 298797
53771 298797 299465 300083 301124 303296 307221 313075 320742 330296 342046 356014 371421 386414 398119
$$ packed form
53880C25525n708o033n790n156m786n129n741n621m290k270n42J80k50j418k510
53865B70461k856k561k325k558k886k698j944j129p41q49j167j342j209r48q60
53850B44388j017j192j239j311j594k028k361k353j853r25k3K68r6n19n85o29
53834B26931j181k041k419j972j172o64o11q12j075j263j234r49n59k31mJ15J20
53817B10979J46M73J138J646J399M86k77l05J1j46p75r78k32P72J119J001J395
53800B17852K535L556L734L319K935K865L270M348N726O344N654M417L640L232
53786B73427K586J974K223L174L629L016K055J513J192O80K42L38P93J044R11
53771B98797O68O18J041K172L925N854P667R554J1750J3968J5407J4993J1705
$$ plain form
53758 398119 403427 400541 390043 374300 355912 336910 318872 302850 288992 276883 266508 258385
53746 258385 252611 248349 244586 240975 237673 234791 232366 230468 228953 227371 225520 223870 223059 223172 223790
53731 223790 224554 225304 225851 226026 225927 225793 225629 225218 224523 223859 223611 223846 224190 224046 223086 221582 220176 219300
53713 219300 218978 219098 219532 219894 219647 218768 218025 218252 219545 221342 223115 224712 226300 228257 230918 234161
53697 234161 237532 241054 245507 251416 258019 263865 268310 271870 275241 278578 281742 284518 286471 287255
53683 287255 287369 287965 289427 290620 290040 287441 283780 279834 275553 270823 266240 262711 260544 259227 258017
53668 258017 256487 254586 252528 250770 249882 250048 250663 250670 249509 247621 245874 244638 243582 242322 240987 240122
53652 240122 240133 240848 241560 241577 240818 239831 239158 238828 238562 238177 237615 236829 236000 235677 236190 237028 237290 236789 236218
$$ packed form
53758C98119N308k886j0498j5743j8388j9002j8038j6022j3858j2109j0375q123
53746B58385n774m262l763l611l302k882k425j898j515j582j851j650q11J13O18
53731B23790P64P50N47J75r9j34j64m11o95o64k48K35L44j44r60j504j406q76
53713B19300l22J20M34L62k47q79p43K27J293J797J773J597J588J957K661L243
53697B34161L371L522M453N909O603N846M445L560L371L337L164K776J953P84
53683B87255J14N96J462J193n80k599l661l946m281m730m583l529k167j317j210
53668B58017j530j901k058j758q88J66O15Pj161j888j747j236j056j260j335q65
53652B40122J1P15P12J7p59r87o73l30k66l85n62p86q29l23N13Q38K62n01n71
$$ plain form
53633 236218 236108 236192 236051 235902 236259 237136 238112 239001 240042 241385 242816 244045 245035 245960 247072 248649 250873
53616 250873 253643 256558 259183 261340 263178 265070 267364 270091 272880 275282 277218 278981 280792 282477
53602 282477 283712 284458 284968 285375 285566 285618 286137 287732 290122 292138 292891 292701 292624 293223 294138 294700 294556 293691
53584 293691 292313 290904 290042 289926 290148 290111 289563 288711 288018 287932 288534 289339 289690 289455 289062 288743 288156 287020
53566 287020 285717 284845 284436 284099 283772 283854 284582 285735 286948 287964 288563 288711 288932 290086 292521 295674 298675
53549 298675 301118 303072 304685 306119 307666 309609 311990 314704 317707 320879 323889 326567 329364 333025
53535 333025 337737 342927 348085 353430 359513 366427 373761 381217 388906 397102 406097 416343 428252 441526
53521 441526 454949 467265 478314 489105 500882 514252 529132 545181 562226 580461 600296
$$ packed form
53633B36218j10Q4j41j49L57Q77R76Q89J041J343J431J229R90R25J112J577K224
53616B50873K770K915K625K157J838J892K294K727K789K402J936J763J811J685
53602B82477J235P46N10M07J91N2N19J595K390K016P53j90p7N99R15N62j44q65
53584B93691j378j409q62j16K22l7n48q52o93q6O02Q05L51k35l93l19n87j136
53566B87020j303q72m09l37l27Q2P28J153J213J016N99J48K21J154K435L153L001
53549B98675K443J954J613J434J547J943K381K714L003L172L010K678K797L661
53535C33025M712N190N158N345O083O914P334P456P689Q196Q995J0246J1909J3274
53521D41526J3423J2316J1049J0791J1777J3370J4880J6049J7045J8235J9835
$$ plain form
53510 600296 621861 644682 668067 691779 716007 740691 765289 789400 813173 836798 859927
53499 859927 882114 903617 925279 947633 970590 993970 1017832 1042153 1066659 1091201 1115866
53488 1115866 1140412 1163987 1185876 1206253 1225684 1244044 1260510 1274682 1287174 1298869 1309992
53477 1309992 1320271 1329687 1338640 1347440 1355914 1363544 1369751 1374104 1376484 1377106 1376193 1373613 1368935 1361818
53463 1361818 1352176 1340052 1325640 1309435 1292055 1273792 1254611 1234637 1214198 1193168 1170728
53452 1170728 1146310 1120529 1094611 1069056 1043549 1018196 993996 971722 950999 931068 912003
53441 912003 894362 877865 861320 844130 827237 812147 799414 788523 779036 771300 765958 763079
53429 763079 762049 762242 763657 766878 772430 780276 789977 801266 814302 829293 846031 863968 882767
$$ packed form
53510F00296K1565K2821K3385K3712K4228K4684K4598K4111K3773K3625K3129
53499H59927K2187K1503K1662K2354K2957K3380K3862K4321K4506K4542K4665
53488A115866K4546K3575K1889K0377J9431J8360J6466J4172J2492J1695J1123
53477A309992J0279R416Q953Q800Q474P630O207M353K380O22r13k580m678p117
53463A361818r642j2124j4412j6205j7380j8263j9181j9974k0439k1030k2440
53452A170728k4418k5781k5918k5555k5507k5353k4200k2274k0723j9931j9065
53441I12003j7641j6497j6545j7190j6893j5090j2733j0891r487p736n342k879
53429G63079j030J93J415L221N552P846R701J1289J3036J4991J6738J7937J8799
$$ plain form
53416 882767 902654 924200 947819 973462 1000733 1029184 1058440 1088146 1118071 1148512 1180505
53405 1180505 1215253 1253089 1293171 1334463 1376946 1421664 1469602 1520763 1574305 1629266 1684993
53394 1684993 1741222 1798029 1855628 1913972 1972595 2030973 2088913 2146357 2203037 2258620 2313110
53383 2313110 2366539 2418114 2466141 2509222 2547333 2581442 2612284 2639870 2663973 2684463 2701051
53372 2701051 2713260 2721096 2725493 2727618 2727650 2724454 2716466 2702663 2682636 2656058 2622467 2581532 2533248
53359 2533248 2477863 2415978 2349019 2279331 2209287 2140141 2071913 2004400 1937925 1873057 1809997
53348 1809997 1748621 1688938 1631179 1575495 1521813 1469847 1419105 1368993 1319260 1270287 1222729
53337 1222729 1176969 1133103 1091346 1052101 1015626 981926 950942 922563 896530 872735 851662
$$ packed form
53416H82767J9887K1546K3619K5643K7271K8451K9256K9706K9925L0441L1993
53405A180505L4748L7836M0082M1292M2483M4718M7938N1161N3542N4961N5727
53394A684993N6229N6807N7599N8344N8623N8378N7940N7444N6680N5583N4490
53383B313110N3429N1575M8027M3081L8111L4109L0842K7586K4103K0490J6588
53372B701051J2209P836M397K125L2l196p988j3803k0027k6578l3591m0935m8284
53359B533248n5385o1885o6959o9688p0044o9146o8228o7513o6475o4868o3060
53348A809997o1376n9683n7759n5684n3682n1966n0742n0112m9733m8973m7558
53337A222729m5760m3866m1757l9245l6475l3700l0984k8379k6033k3795k1073
$$ plain form
53326 851662 834164 820535 809986 801171 793195 786220 781260 779246 779958 781976 784024 786239 789601 794267
53312 794267 799243 803898 809023 815914 824953 835581 847181 859417 872119 885507 900382 917482
53300 917482 936735 957597 979986 1004313 1030701 1058751 1088047 1118303 1149027 1179673 1210336
53289 1210336 1241677 1273811 1305722 1336179 1364879 1392248 1418314 1442218 1462894 1479951 1493828
53278 1493828 1505269 1514757 1522383 1528139 1532173 1534651 1535407 1533894 1529542 1522232 1512452 1501041 1488638
53265 1488638 1475219 1460179 1442862 1422877 1399876 1373460 1343619 1311042 1276603 1240640 1203068
53254 1203068 1164015 1123940 1083263 1042461 1002531 964700 929431 896141 864133 833389 804205
53243 804205 776448 749600 723256 697229 671393 645773 620634 596133 572041 548107 524583
$$ packed form
53326H51662j7498j3629j0549q815p976o975m960k014P12K018K048K215L362M666
53312G94267M976M655N125O891R039J0628J1600J2236J2702J3388J4875J7100
53300I17482J9253K0862K2389K4327K6388K8050K9296L0256L0724L0646L0663
53289A210336L1341L2134L1911L0457K8700K7369K6066K3904K0676J7057J3877
53278A493828J1441R488P626N756M034K478P56j513m352p310r780j1411j2403
53265A488638j3419j5040j7317j9985k3001k6416k9841l2577l4439l5963l7572
53254A203068l9053m0075m0677m0802l9930l7831l5269l3290l2008l0744k9184
53243H04205k7757k6848k6344k6027k5836k5620k5139k4501k4092k3934k3524
$$ plain form
53232 524583 502060 480915 461277 443447 427846 414411 402407 391119 380586 371386 363783 357285
53220 357285 351129 345072 339543 335062 331619 328690 325721 322429 318737 314676 310405 306084 301637 296842
53206 296842 291798 287143 283571 281194 279519 277964 276265 274449 272630 270870 269117 267176 264838 262080
53192 262080 259226 256835 255321 254575 254068 253398 252627 251953 251266 250323 249260 248456 247842 246836 245186 243490
53176 243490 242526 242361 242529 242858 243645 245030 246677 248098 248992 249206 248737 247924 247335 247246 247398 247398 247180 246917 246709
53157 246709 246555 246483 246409 246071 245429 245065 245666 246958 247672 246990 245715 245452 246716 248408 249189 248747 247497 245695
53139 245695 243487 241481 240521 240810 241694 242444 242955 243614 244777 246400 247968 248848 248946 248909 249327 249878 249738 248811
53121 248811 247935 247745 247899 247732 247159 246564 246201 246149 246550 247436 248428 249024 249137 249157 249544 250468 251626 252206 251326
$$ packed form
53232E24583k2523k1145j9638j7830j5601j3435j2004j1288j0533r200p603o498
53220C57285o156o057n529m481l443k929k969l292l692m061m271m321m447m795
53206B96842n044m655l572k377j675j555j699j816j819j760j753j941k338k758
53192B62080k854k391j514p46n07o70p71o74o87r43j063q04o14j006j650j696
53176B43490r64j65J68L29P87J385J647J421Q94K14m69q13n89q9J52%k18k63k08
53157B46709j54p2p4l38o42l64O01J292P14o82j275k63J264J692P81m42j250j802
53139B45695k208k006r60K89Q84P50N11O59J163J623J568Q80R8l7M18N51j40r27
53121B48811q76j90J54j67n73n95l63n2M01Q86R92N96J13K0L87R24J158N80q80
$$ plain form
53102 251326 248783 245238 241509 237961 234742 232224 230741 230106 229758 229302 228710 228138 227742 227419 226577 224593
53086 224593 221863 219876 219652 220455 220705 219938 219137 219197 219896 220538 220958 221494 222309 223046 223059 221959 220131 218567
53068 218567 217895 217708 217194 216203 215206 214410 213557 212555 211609 210713 209711 208920 208902 209399 209318 208192 206902 206398
53050 206398 206352 205856 204994 204860 206105 208165 209983 211059 211666 212397 213585 214893 215526 214979 213549 211939
53034 211939 210545 209395 208617 208497 209007 209596 209671 209168 208498 207965 207377 206351 204918 203596 202758 202247 201853
53017 201853 201866 202621 203678 204155 203920 203786 204212 204522 203876 202547 201648 201818 202680 203425 203500 202841 201836 201040
52999 201040 200702 200658 200820 201449 202655 203942 204601 204381 203420 201828 199772 197759 196327 195558 195220 195259 195726
52982 195726 196405 197004 197577 198308 198927 198859 197950 196638 195439 194664 194526 195026 195729 196176 196614 197822 200078 202761
$$ packed form
53102B51326k543l545l729l548l219k518j483o35l48m56n92n72l96l23q42j984
53086B24593k730j987k24Q03K50p67q01O0O99O42M20N36Q15P37J3j100j828j564
53068B18567o72j87n14r91r97p96q53j002r46q96j002p91j8M97q1j126j290n04
53050B06398m6m96q62j34J245K060J818J076O07P31J188J308O33n47j430j610
53034B11939j394j150p78j20N10N89P5n03o70n33n88j026j433j322q38n11l94
53017B01853J3P55J057M77k35j34M26L10o46j329q99J70Q62P45P5o59j005p96
52999B01040l38m4J62O29J206J287O59k20r61j592k056k013j432p69l38L9M67
52982A95726O79N99N73P31O19o8r09j312j199p75j38N00P03M47M38J208K256K683
$$ plain form
52964 202761 205111 206940 208411 209544 210253 210598 210751 210849 210994 211199 211248 210832 209898 208672 207346 206023 204904
52947 204904 204142 203402 202026 199818 197414 195658 194861 194774 194930 194863 194268 193224 192128 191300 190790 190555 190609 190952
52929 190952 191602 192672 194102 195351 195794 195499 195124 194930 194412 193160 191545 190218 189393 189016 189178 189833 190435
52912 190435 190428 189992 189797 190151 190770 191304 191624 191692 191567 191594 192165 193178 193997 194056 193284 191966 190439 189041 188094
52893 188094 187757 187902 188226 188496 188729 189165 189967 190953 191711 191991 191752 190860 189069 186561 184256 183226 183713
52876 183713 184914 185740 185817 185786 186609 188434 190300 191211 191338 191668 192527 193200 193252 193422 194636 196702 198694 200255
52858 200255 201736 203296 204679 205907 207406 209332 211300 212997 214559 216159 217653 218841 219729 220324 220425
52843 220425 219770 218229 215859 212924 209804 206631 203167 199431 196255 194604 194311 194085 192951 191248 189963
$$ packed form
52964B02761K350J829J471J133P09L45J53R8J45K05M9m16r34j226j326j323j119
52947B04904p62p40j376k208k404j756p97q7J56o7n95j044j096q28n10k35N4L43
52929A90952O50J070J430J249M43k95l75j94n18j252j615j327q25l77J62O55O02
52912A90435pm36j95L54O19N34L20O8j25K7N71J013Q19N9p72j318j527j398r47
52893A88094l37J45L24K70K33M36Q02R86P58K80k39q92j791k508k305j030M87
52876A83713J201Q26P7l1Q23J825J866R11J27L30Q59O73N2J70J214K066J992J561
52858B00255J481J560J383J228J499J926J968J697J562J600J494J188Q88N95J01
52843B20425o55j541k370k935l120l173l464l736l176j651k93k26j134j703j285
$$ plain form
52828 189963 189564 189744 189925 189753 189345 189266 189985 191199 192065 192295 192608 193806 195755 197612 198770 199225 199196 198772
52810 198772 197960 196940 196285 196800 198824 201645 204120 206035 208316 211513 214591 215887 214976 212957 210985
52795 210985 209185 207101 204649 202225 200054 197797 194901 191374 188099 186130 185621 185673 185377 184693 184101 183796
52779 183796 183654 183656 183774 183542 182408 180643 179409 179680 181382 183713 185914 187552 188435 188660 188630 188737 189101
52762 189101 189756 190847 192294 193418 193372 192163 190904 190748 191725 192935 193753 194388 195179 195886 196076 195903 195922
52745 195922 196219 196266 195789 195276 195374 196093 196878 197289 197392 197671 198615 200205 201725 202415 202414 202635 203565 204693 205388
52726 205388 205782 206276 206698 206653 206384 206536 207151 207546 207126 205721 203316 200210 197393 195881 195416 194634 192861
52709 192861 190962 189997 189784 189523 189206 189497 190411 191028 190683 189842 189520 190123 191035 191177 189937 187721 185606
$$ packed form
52828A89963l99J80J81j72m08p9P19J214Q66K30L13J198J949J857J158M55k9m24
52810A98772q12j020o55N15K024K821K475J915K281L197L078J296r11k019j972
52795B10985j800k084k452k424k171k257k896l527l275j969n09N2k96o84n92l05
52779A83796j42KJ18k32j134j765j234K71J702K331K201J638Q83K25l0J07L64
52762A89101O55J091J447J124m6j209j259j56R77J210Q18O35P91P07J90j73J9
52745A95922K97M7m77n13R8P19P85M11J03K79R44J590J520O90jK21R30J128O95
52726B05388L94M94M22m5k69J52O15L95m20j405k405l106k817j512m65p82j773
52709A92861j899r65k13k61l17K91R14O17l45q41l22O03R12J42j240k216k115
$$ plain form
52692 185606 184352 183902 183948 184645 186271 188361 189817 190113 189937 190361 191635 193083 194001 194299 194355 194565 195160
52675 195160 196170 197411 198570 199464 200129 200562 200469 199538 198003 196659 196109 196150 196143 195915 196005 196987 198841 201011
52657 201011 202890 204085 204485 204328 204094 204096 204245 204334 204494 205162 206615 208674 210890 212842 214169 214493 213529
52640 213529 211387 208725 206382 204751 203594 202546 201697 201417 201730 202210 202523 202719 202827 202563 201800 201061 201094
52623 201094 202028 203353 204625 205776 206688 207038 206788 206468 206554 206837 206790 206394 206130 206108 205706 204346 202372 200878
52605 200878 200681 201610 202762 203374 203462 203676 204478 205475 205796 205185 204464 204611 205659 206918 208089 209489 211039
52588 211039 211735 210709 208486 206643 206287 207297 208939 210637 212064 213026 213600 214132 214837 215568 216125 216564
52572 216564 216996 217291 217273 217120 217251 217789 218352 218441 217937 217155 216511 216175 216020 215831 215540 215232 214965 214660 214196
$$ packed form
52692A85606j254m50M6O97J626K090J456K96j76M24J274J448R18K98N6K10N95
52675A95160J010J241J159Q94O65M33r3r31j535j344n50M1pk28R0R82J854K170
52657B01011J879J195M00j57k34KJ49Q9J60O68J453K059K216J952J327L24r64
52640B13529k142k662k343j631j157j048q49k80L13M80L13J96J08k64p63p39L3
52623B01094R34J325J272J151R12L50k50l20Q6K83m7l96k64k2m02j360j974j494
52605B00878j97R29J152O12Q8K14Q02R97L21o11p21J47J048J259J171J400J550
52588B11039O96j026k223j843l56J010J642J698J427R62N74N32P05P31N57M39
52572B16564M32K95j8j53J31N38N63Q9n04p82o44l36j55j89k91l08k67l05m64
$$ plain form
52553 214196 213576 212925 212350 211819 211241 210657 210288 210300 210552 210728 210728 210708 210731 210658 210544 210810 211731 212977 213998 214655
52533 214655 215114 215360 215331 215362 215864 216595 216903 216778 216908 217474 217660 216881 215868 215835 216990 218544 219901 221116
52515 221116 222285 223275 224184 225450 227284 229440 231758 234516 237928 241591 244757 247065 248766 250226 251367
52500 251367 251650 250573 248181 245061 241912 239136 236743 234424 231732 228552 225513 223588 223067 223226 223281
52485 223281 223221 223334 223359 222841 222168 222439 224130 226521 228629 230198 231479 232593 233593 234776 236403 238164
52469 238164 239439 240121 240909 242586 245197 248015 250297 251948 253449 255272 257500 259893 262025 263322 263351
52454 263351 262308 260911 259485 257523 254571 251208 248456 246400 244244 241777 239841 238927 238140 236301 233605
52439 233605 231394 230483 230387 230180 229502 228573 227697 227024 226613 226466 226559 226840 227149 227250 227080 226855 226772 226745 226684 226878
$$ packed form
52553B14196o20o51n75n31n78n84l69J2K52J76%k0K3p3j14K66R21J246J021O57
52533B14655M59K46k9L1N02P31L08j25J30N66J86p79j013l3J155J554J357J215
52515B21116J169R90R09J266J834K156K318K758L412L663L166K308J701J460J141
52500B51367K83j077k392l120l149k776k393k319k692l180l039j925n21J59N5
52485B23281o0J13K5n18o73K71J691K391K108J569J281J114J000J183J627J761
52469B38164J275O82P88J677K611K818K282J651J501J823K228K393K132J297K9
52454B63351j043j397j426j962k952l363k752k056k156k467j936r14p87j839k696
52439B33605k211r11r6k07o78r29q76o73m11j47R3K81L09J01j70k25q3k7o1J94
$$ plain form
52419 226878 227750 229207 230556 231242 231433 231724 232407 233250 233928 234456 235061 235831 236731 238027 240343 243982 248402
52402 248402 252840 257531 263842 272879 284231 296320 307649 317327 324658 328860 329393 326301 320235 312311
52388 312311 303847 295809 288371 281258 274602 269135 265436 263274 261926 260932 260295 260090 260165 260230 260073 259686
52372 259686 259325 259473 260585 262734 265573 268664 271809 275001 278090 280650 282222 282646 282072 280719 278777
52357 278777 276567 274608 273254 272313 271229 269753 268349 267732 268031 268558 268502 267731 266778 266117 265730 265440 265351
52340 265351 265680 266338 267050 267882 269301 271647 274742 278052 280982 283054 284228 285267 287395 291258 296359
52325 296359 301768 307168 312956 319548 326919 334648 342016 348179 352610 355426 357010 357471 356911 356105 356277
52310 356277 357989 360652 363326 365645 367741 369685 371435 373152 375187 377769 380894 384385 387921 391223
$$ packed form
52419B26878Q72J457J349O86J91K91O83Q43O78N28O05P70R00J296K316L639M420
52402B48402M438M691O311R037J1352J2089J1329R678P331M202N33l092o066p924
52388C12311q464q038p438p113o656n467l699k162j348r94o37k05P5O5j57l87
52372B59686l61J48J112K149K839L091L145L192L089K560J572M24n74j353j942
52357B78777k210j959j354r41j084j476j404o17K99N27n6p71r53o61l87k90q9
52340B65351L29O58P12Q32J419K346L095L310K930K072J174J039K128L863N101
52325B96359N409N400N788O592P371P729P368O163M431K816J584M61n60q06J72
52310C56277J712K663K674K319K096J944J750J717K035K582L125L491L536L302
$$ plain form
52296 391223 394483 398349 403123 408094 412009 414183 414860 414533 413374 411380 408713 405654 402498 399662 397661
52281 397661 396711 396512 396612 396908 397583 398685 399941 401026 401890 402834 404328 406619 409468 412362 415101 417988
52265 417988 421253 424517 427170 429200 431344 434383 438560 443694 449496 455591 461401 466220 469491 471238
52251 471238 472415 474582 478652 483888 488625 492079 494853 497466 499219 499177 497721 496260 495638 495657 496039 496930
52235 496930 498353 499993 501878 504523 508037 511715 514982 518209 522071 526535 531092 535620 540351 545183
52221 545183 549687 553776 557790 561907 565973 569948 574058 578380 582716 586974 591299 595686 599808 603495
52207 603495 607092 611142 615873 621162 626869 633008 639608 646434 652832 658046 661937 665309 669187 673713
52193 673713 678089 681727 685035 688865 693472 698340 702887 707017 711004 715095 719249 723163 726505 729135
$$ packed form
52296C91223L260L866M774M971L915K174O77l27j159j994k667l059l156k836k001
52281C97661r50j99J00K96O75J102J256J085Q64R44J494K291K849K894K739K887
52265D17988L265L264K653K030K144L039M177N134N802O095N810M819L271J747
52251D71238J177K167M070N236M737L454K774K613J753m2j456j461o22J9L82Q91
52235D96930J423J640J885K645L514L678L267L227L862M464M557M528M731M832
52221E45183M504M089M014M117M066L975M110M322M336M258M325M387M122L687
52207F03495L597M050M731N289N707O139O600O826O398N214L891L372L878M526
52193F73713M376L638L308L830M607M868M547M130L987M091M154L914L342K630
$$ plain form
52179 729135 730987 731745 730897 728325 724685 720905 717359 713728 709583 704832 699576 693919 688163 682954 678910
52164 678910 676142 674308 673135 672621 672767 673455 674756 677116 680844 685506 690116 693960 696895 698814 699312
52149 699312 698304 696703 696031 697260 700248 704224 708437 712313 715457 717929 720330 723196 726217 728303
52135 728303 728561 727095 724753 722238 719691 717066 714556 712479 711018 710405 711251 714263 719576 726632 734819
52120 734819 743939 753921 764461 775237 786156 797016 807091 815435 821539 825395 827049 826476 823880
52107 823880 819720 814356 807977 800940 793865 787301 781549 776936 773994 773191 774645 778202 783656 790746
52093 790746 799051 808000 816934 825153 832054 837207 840194 840435 837402 831093 822166 811678 800854 791005
52079 791005 783251 778123 775499 774844 775352 776071 776362 776389 776826 778002 779605 781249 782965 784994 787396 790039
$$ packed form
52179G29135J852P58q48k572l640l780l546l631m145m751n256n657n756n209m044
52164F78910k768j834j173n14J46O88J301K360L728M662M610L844K935J919M98
52149F99312j008j601o72J229K988L976M213L876L144K472K401K866L021K086
52135G28303K58j466k342k515k547k625k510k077j461o13Q46L012N313P056Q187
52120G34819R120R982J0540J0776J0919J0860J0075Q344O104L856J654n73k596
52107H23880m160n364o379p037p075o564n752m613k942q03J454L557N454P090
52093G90746Q305Q949Q934Q219O901N153K987K41l033o309q927j0488j0824r849
52079G91005p754n128k624o55N08P19K91K7M37J176J603J644J716K029K402K643
$$ plain form
52063 790039 792677 794955 796606 797751 798678 799230 798866 797480 795725 794243 792959 791529 790118 789297 789339 789913
52047 789913 790281 789591 787282 783585 779369 775166 770660 765473 760064 755296 751379 747922 744969 743318 743623
52032 743623 745628 748382 750894 752575 753396 753783 754102 754243 753872 752998 751977 751115 750584 750599 751175 751765 751627
52015 751627 750656 749491 748808 748927 750130 752764 756812 761754 767048 772451 777749 782548 786490 789313 790528
$$ packed form
52063G90039K638K278J651J145R27N52l64j386j755j482j284j430j411q21M2N74
52047G89913L68o90k309l697m216m203m506n187n409m768l917l457k953j651L05
52032G43623K005K754K512J681Q21L87L19J41l71q74j021q62n31J5N76N90j38
52015G51627r71j165o83J19J203K634M048M942N294N403N298M799L942K823J215
$$ [...]
##END NTUPLES=NMR SPECTRUM
##END=
