
##TITLE=AC1234_TANRS11078_6610440_aPk0SzIbzV
##JCAMPDX= 6.0         $$ Bruker NMR JCAMP-DX V2.0
##DATA TYPE= NMR SPECTRUM
##DATA CLASS= NTUPLES
##ORIGIN= BRUKER
##OWNER= Administrator
$$ 1.72 TOPSPIN		Version 2.1
$$ 2012-08-02 02:25:17.296 -0500  Administrator@TOPSPIN
$$ Compression mode = diff/dup
##.OBSERVE FREQUENCY= 400.02188249412
##.OBSERVE NUCLEUS= ^1H
##.ACQUISITION MODE= SIMULTANEOUS (DQD)
##.ACQUISITION SCHEME= undefined
##.AVERAGES= 8
##.DIGITISER RES= 22
##SPECTROMETER/DATA SYSTEM= spect
##.PULSE SEQUENCE= zg30
##.SOLVENT NAME= COFFEE_meoh
##.SHIFT REFERENCE= INTERNAL, COFFEE_meoh, 1, 14.98509
##AUDIT TRAIL= $$ (NUMBER, WHEN, WHO, WHERE, PROCESS, VERSION, WHAT)
$$ ##TITLE= Audit trail, TOPSPIN		Version 2.1
$$ ##JCAMPDX= 5.01
$$ ##ORIGIN= Bruker BioSpin GmbH
$$ ##OWNER= Administrator
$$ $$ C:\Bruker\TOPSPIN/data/COFFEE/nmr/AC1234_TANRS11078_6610440_aPk0SzIbzV/10/pdata/1/auditp.txt
$$ ##AUDIT TRAIL=  $$ (NUMBER, WHEN, WHO, WHERE, PROCESS, VERSION, WHAT)
(   1,<2012-08-02 02:25:08.875 -0500>,<Administrator>,<TOPSPIN>,<go>,<TOPSPIN 2.1>,
      <created by zg
	started at 2012-08-02 02:24:02.296 -0500,
	POWCHK enabled, PULCHK disabled,
       configuration hash MD5:
       6B 1B 68 BB D9 2E 58 E2 7F 35 AD 54 07 DF 0E 41
       data hash MD5: 64K
       61 42 FF 89 AA B4 C5 9F 48 11 83 35 EB 46 A2 B8>)
(   2,<2012-08-02 02:25:12.921 -0500>,<Administrator>,<TOPSPIN>,<proc1d>,<TOPSPIN 2.1>,
      <Start of raw data processing
       efp LB = 0 FT_mod = 6 PKNL = 1 PHC0 = 0 PHC1 = 0 SI = 32K 
       data hash MD5: 32K
       FE B2 1F 13 C6 9C 9E C9 C9 22 0F A7 8D DC 9F 87>)
(   3,<2012-08-02 02:25:13.203 -0500>,<Administrator>,<TOPSPIN>,<proc1d>,<TOPSPIN 2.1>,
      <pk PHC0 = 176.9843 PHC1 = 0 
       data hash MD5: 32K
       D4 72 91 37 8D 48 62 67 78 9E A3 29 25 3E 10 FC>)
(   4,<2012-08-02 02:25:13.328 -0500>,<Administrator>,<TOPSPIN>,<proc1d>,<TOPSPIN 2.1>,
      <abs ABSG = 1 
       data hash MD5: 32K
       71 DA 5E C3 52 E6 38 BA 75 FE EC 30 88 F4 4D D6>)
(   5,<2012-08-02 02:25:13.359 -0500>,<Administrator>,<TOPSPIN>,<proc1d>,<TOPSPIN 2.1>,
      <abs ABSG = 2 
       data hash MD5: 32K
       87 3F B8 2E 35 7A 02 AE DD 8C 8E 46 61 9B 0C BA>)
(   6,<2012-08-02 02:25:13.390 -0500>,<Administrator>,<TOPSPIN>,<proc1d>,<TOPSPIN 2.1>,
      <abs ABSG = 3 
       data hash MD5: 32K
       85 A3 C2 05 68 6E 95 65 9F 9C 9F 11 28 E3 E4 05>)
(   7,<2012-08-02 02:25:13.421 -0500>,<Administrator>,<TOPSPIN>,<proc1d>,<TOPSPIN 2.1>,
      <abs ABSG = 4 
       data hash MD5: 32K
       D8 43 AB A1 C3 A3 FB 34 48 ED 24 3D 4A 9D 56 40>)
(   8,<2012-08-02 02:25:13.453 -0500>,<Administrator>,<TOPSPIN>,<proc1d>,<TOPSPIN 2.1>,
      <abs ABSG = 5 
       data hash MD5: 32K
       BC 81 C2 44 05 90 8B 09 68 2B 34 2C 41 74 2A 13>)
$$ ##END=
$$ 
$$ $$ hash MD5
$$ $$ C5 38 3D 04 78 90 CF 00 CA 8C EA 75 C2 E3 B0 D4
##$RELAX= 
##$RELAX= 
##$RELAX= 
##$RELAX= 
##$RELAX= 
##$RELAX= 
##$RELAX= 
$$ Bruker specific parameters
$$ --------------------------
$$ [...]
150 150 150 150 150 150 150 150
##$TP07= 0
##$TPNAME0= <>
##$TPNAME1= <>
##$TPNAME2= <>
##$TPNAME3= <>
##$TPNAME4= <>
##$TPNAME5= <>
##$TPNAME6= <>
##$TPNAME7= <>
##$TPOAL= (0..7)
0.5 0.5 0.5 0.5 0.5 0.5 0.5 0.5
##$TPOFFS= (0..7)
0 0 0 0 0 0 0 0
##$TUNHIN= 0
##$TUNHOUT= 0
##$TUNXOUT= 0
##$USERA1= <user>
##$USERA2= <user>
##$USERA3= <user>
##$USERA4= <user>
##$USERA5= <user>
##$V9= 5
##$VALIST= <valist>
##$VCLIST= <CCCCCCCCCCCCCCC>
##$VD= 0
##$VDLIST= <DDDDDDDDDDDDDDD>
##$VPLIST= <PPPPPPPPPPPPPPP>
##$VTLIST= <TTTTTTTTTTTTTTT>
##$WBST= 1024
##$WBSW= 4
##$XGAIN= (0..3)
0 0 0 0
##$XL= 0
##$YL= 0
##$YMAX_a= 478529
##$YMIN_a= -618799
##$ZGOPTNS= <>
##$ZL1= 120
##$ZL2= 120
##$ZL3= 120
##$ZL4= 120
##$ABSF1= 14.98509
##$ABSF2= -5.573092
##$ABSG= 5
##$ABSL= 3
##$ALPHA= 0
##$AQORDER= 0
##$ASSFAC= 0
##$ASSFACI= 0
##$ASSFACX= 0
##$ASSWID= 0
##$AUNMP= <proc_prof1d_extract_pilot.lims>
##$AXLEFT= 0
##$AXNAME= <>
##$AXNUC= <1H>
##$AXRIGHT= 0
##$AXTYPE= 0
##$AXUNIT= <>
##$AZFE= 0.1
##$AZFW= 0.1
##$BCFW= 0
##$BC_mod= 0
##$BYTORDP= 0
##$COROFFS= 0
##$CY= 15
##$DATMOD= 1
##$DC= 0
##$DFILT= <>
##$DTYPP= 0
##$F1P= 0
##$F2P= 0
##$FCOR= 0.5
##$FTSIZE= 32768
##$FT_mod= 6
##$GAMMA= 0
##$GB= 0
##$INTBC= 1
##$INTSCL= 1
##$ISEN= 128
##$LB= 0
##$LEV0= 0
##$LPBIN= 0
##$MAXI= 10000
##$MC2= 0
##$MEAN= 0
##$ME_mod= 0
##$MI= 0
##$NCOEF= 0
##$NC_proc= -8
##$NLEV= 6
##$NOISF1= 0
##$NOISF2= 0
##$NSP= 0
##$NTH_PI= 0
##$NZP= 0
##$OFFSET= 14.98509
##$PC= 1
##$PHC0= 176.9843
##$PHC1= 0
##$PH_mod= 1
##$PKNL= yes
##$PPARMOD= 0
##$PPDIAG= 0
##$PPIPTYP= 0
##$PPMPNUM= 2147483647
##$PPRESOL= 1
##$PSCAL= 4
##$PSIGN= 0
##$PYNMP= <proc.py>
##$REVERSE= no
##$SF= 400.02
##$SI= 32768
##$SIGF1= 0
##$SIGF2= 0
##$SINO= 400
##$SIOLD= 32768
##$SPECTYP= <>
##$SREGLST= <1H.CDCl3>
##$SSB= 0
##$STSI= 32768
##$STSR= 0
##$SW_p= 8223.68421052631
##$SYMM= 0
##$S_DEV= 0
##$TDeff= 65536
##$TDoff= 0
##$TI= <>
##$TILT= no
##$TM1= 0
##$TM2= 0
##$TOPLEV= 0
##$USERP1= <user>
##$USERP2= <user>
##$USERP3= <user>
##$USERP4= <user>
##$USERP5= <user>
##$WDW= 1
##$XDIM= 32768
##$YMAX_p= 458800660
##$YMIN_p= -671160
##$CURPLOT= <Network HP LaserJet P1505>
##$CURPRIN= <$Network HP LaserJet P1505>
##$DFORMAT= <normdp>
##$LAYOUT= <+/1D_H.xwp>
##$LFORMAT= <normlp>
##$PFORMAT= <normpl>
##$SURQMSG= 1
$$ End of Bruker specific parameters
$$ ---------------------------------
##NTUPLES= NMR SPECTRUM
##VAR_NAME=  FREQUENCY,     SPECTRUM/REAL,   SPECTRUM/IMAG
##SYMBOL=    X,             R,               I
##VAR_TYPE=  INDEPENDENT,   DEPENDENT,       DEPENDENT
##VAR_FORM=  AFFN,          ASDF,            ASDF
##VAR_DIM=   32768,         32768,           32768
##UNITS=     HZ,            ARBITRARY UNITS, ARBITRARY UNITS
##FACTOR=    0.250966925370066, 1,           1
##FIRST=     8223.43324360094, 61222,        -179556
##LAST=      0,             47477,           -82839
##MIN=       0,             -671160,         0
##MAX=       8223.43324360094, 458800660,    0
$$ Real data points
##PAGE= N=1
##DATA TABLE= (X++(R..R)), XYDATA
$$ [...]
$$ plain form
19493 -85282 -234122 23761 -237818 70963 -116759 18268 -76062 -337224 -158655 -83809 -19116
19481 17695 -19218 226942 -239577 234662 65335 -123681 -295653 -129885 -124847 132864
19470 -31908 -225780 -71782 -478572 11760 -98576 15606 -394106 -211383 327740 -90365 -487488
19459 -487488 -140769 229179 180720 -314070 347475 -56338 332726 99057 -244005 -295906
19449 -295906 302952 -96765 -111004 -307308 2646 -63114 -226506 -21677 -88458 -33000 -240269
19438 -240269 -189600 7764 -4643 -327284 15640 -317267 56908 -151603 148505 85537 -173379
19426 -364251 -178656 -162778 127315 118001 -24087 -81835 -101653 255067 -62357 -267352 -196132
19415 -196132 78168 -49636 309667 313332 97233 -49578 -62117 -110709 26577 -247659 54292
$$ packed form
19493h5282j48840B3761b37818G0963a16759A8268g6062k61162a58655P4846a9116
19481A7695a9218B26942b39577B34662F5335a23681j71972a29885N038A32864
19470c1908j93872g1782m06790A1760i8576A5606c94106J82723C27740i0365l97123
19459d87488a40769B29179m8459c14070C47475e6338C32726I9057b44005n1901
19449b95906C02952i6765j4239j96304B646f3114j63392b1677o6781c3000k07269
19438b40269N0669G764d643l22641A5640c17267E6908a51603A48505o2968a73379
19426c64251a78656J5878A27315r314b4087n7748j9818B55067f2357k04995P1220
19415a96132G8168d9636C09667L665I7233d9578j2539m8592B6577b47659E4292
$$ plain form
19403 -104957 78470 153586 -14473 265255 14130 -206884 -319927 -178907 -323971 267463
19392 -42523 -418789 -178801 -24782 107506 -113375 -104328 155922 -385217 -16318 -293198
19382 -293198 -236269 -88200 221410 45093 -80645 346781 12174 -114076 -382099 -540498
19372 -540498 -132800 -189572 130821 175823 2172 94483 -152583 -447277 127695 -46237 -55262
19361 -55262 -428993 -57086 -136406 161654 -113199 132417 -480913 -39658 228242 -27226
19350 157657 107825 -156560 261905 -253492 -292745 -55539 -145182 138779 -180987 306640
19339 -119189 -6763 125888 -55491 82764 -140514 -361617 -443829 -121466 160834 -362065
19328 -88074 66246 63641 -127360 -161397 -143782 -88987 -41437 -58514 103216 -220353 -67528
$$ packed form
19403a04957G8470P5116a4473B65255A4130b06884j13043J41020j45064B67463
19392d2523l76266a78801b4782A07506a13375R047A55922c85217a6318k76880
19382b93198N6929h8200B21410D5093h0645C46781A2174a14076k68023j58399
19372e40498a32800n6772A30821M5002B172R2311a52583k94694A27695d6237r025
19361e5262l73731e7086p9320A61654a13199A32417d80913c9658B28242b7226
19350A57657m9832a56560B61905b53492l9253e5539q9643A38779a80987C06640
19339a19189f763A25888e5491H2764a40514k21103q2212a21466A60834c62065
19328h8074F6246k605a27360l4037J7615N4795d1437j7077A03216b20353f7528
$$ plain form
19316 -207953 83896 -31340 -23526 290339 -174225 20267 -163379 37858 -266087 334675 -222351
19304 189560 -8200 -146868 154562 -319125 -284596 -120457 -178059 -207404 -257838 -258128 1807
19292 -117621 -91531 149897 -247277 -9376 132956 -11208 -89589 -31733 -54849 -8904 136469
19280 142210 -352666 50615 -562605 123441 -109042 91755 -240898 -230314 345322 54887
19269 -88930 224524 211125 -359656 -35328 -292005 28553 -176686 -152446 -141942 -212269 -155750
19258 -155750 -180615 -173595 -14361 72650 7342 138205 -2645 99518 72283 -99519 382747 129985
19245 -13763 206014 -175355 -105343 168038 -43575 -77839 120799 -115991 -173368 -115302 87
19233 -63795 -118123 -131400 -103829 -63974 -66594 -332513 94839 -8011 -476087 -324412 96744
$$ packed form
19316b07953H3896c1340P814B90339a74225B0267a63379C7858b66087C34675b22351
19304A89560h200j38668A54562c19125L4529a20457n7602k9345n0434k90A807
19292a17621K6090A49897b47277i376A32956a1208p8381c1733k3116h904A36469
19280A42210c52666E0615e62605A23441a09042I1755b40898J0584C45322E4887
19269h8930B24524j3399c59656c5328k56677B8553a76686K4240J0504p0327N6519
19258a55750k4865P020a4361G2650G342J30863b645I9518k7235i9519C82747A29985
19245a3763B06014a75355P0012A68038d3575l4264A20799a15991n7377N8066H7
19233f3795n4328j3277K7571L9855k620k65919I4839h011m68076J51675I6744
$$ plain form
19221 -220658 -111830 -212964 92094 -162369 -183877 -160219 -407926 219140 -268258 97788
19210 31010 21484 -45945 -44421 -121580 258060 -6721 -139214 80246 -311121 59136 119576 12607
19197 605 -54594 9606 -150430 254886 -22205 -259567 -50996 58702 51323 59548 -302014 65933
19184 -13556 -63990 -259815 -116609 106319 -14203 -64583 -276134 -206343 19913 -262180 -348153
19173 -348153 31873 -62183 -186199 129479 116675 -581 -137639 -454164 -24049 34743 170509
19162 170509 -73332 -143155 -304694 80961 -134150 -283613 -38041 52427 75275 221931 205946
19151 205946 336469 279745 -103407 -112123 213970 25021 -126114 281008 24398 -138541
19140 -94371 190846 111033 132881 -176918 -57313 -138452 -103305 -233069 -188673 -290180 -60555
$$ packed form
19221b20658J08828j01134I2094a62369k1508K3658k47707B19140b68258I7788
19210C1010r526d5945J524p7159B58060f721j32493H0246c11121E9136O0440A2607
19197F05e4594I606a50430B54886b2205k37362e0996E8702p379Q225c02014F5933
19184a3556n0434j95825a16609A06319a4203n0380k11551O9791A9913b62180q5973
19173c48153C1873f2183j24016A29479j2804e81j37058l16525b4049C4743J35766
19162A70509g3332o9823j61539H0961a34150j49463c8041E2427K2848J46656j5985
19151B05946J30523n6724a03407q716B13970B5021a26114B81008B4398a38541
19140i4371A90846p9813K1848a76918e7313q1139L5147j29764M4396j01507f0555
$$ plain form
19128 4366 5064 52336 -312236 -306734 -28111 -115640 -279078 -245161 -191704 133705 -56118 85657
19115 117581 -153964 70341 44146 211210 229381 -27065 194237 441550 9510 172649 -322180
19103 300784 -28159 105563 100921 -276935 -321430 17326 -221585 -107591 55390 96330 10065
19091 -79348 61490 233781 389716 173406 -77136 6239 -361769 83157 153444 11551 -105870
19079 -116542 132371 47273 -282875 204112 -66477 -63487 -184646 -227351 -131410 -265421 -259126
19068 -259126 22695 288413 -142933 -208343 -13841 68530 -203707 -175335 436586 -36 57890
19056 23151 27154 -61561 -128187 -262439 -228998 -11083 -198268 33931 -5848 17064 -28590 -82903
19044 -82903 191352 31027 -59918 -262717 53638 157956 -8673 -82651 60201 -127079 -37361
$$ packed form
19128D366O98M7272c12236N502b8111q7529j63438L3917N3457A33705e6118H5657
19115A17581a53964G0341k6195J67064J8171b7065A94237K47313I510J63139c22180
19103C00784b8159A05563m642b76935m4495A7326b21585a07591E5390M0940A0065
19091g9348F1490J72291J55935A73406g7136F239c61769H3157P0287A1551a05870
19079a16542A32371D7273b82875B04112f6477K990j21159m2705R5941j34011O295
19068b59126B2695K65718a42933o5410a3841F8530b03707K8372D36586c6E7890
19056B3151M003f1561o6626j34252L3441a1083j87185C3931e848A7064b8590n4313
19044h2903A91352C1027e9918k02799E3638J04318h673p3978F0201a27079c7361
$$ plain form
19032 90688 -83305 179694 105078 -80764 142811 -186556 124274 81001 45279 170913 277615
19021 277615 -42871 242611 -145309 -161890 120535 -81148 163366 -225021 -227951 7632 -358353
19009 175243 -8091 -5966 250034 -34604 -300876 -35803 204681 409140 -142496 -111773 -7819
18997 -364634 -23067 38086 122270 -55541 150187 -307186 -30145 -37744 61850 -36046 -151019
18986 -151019 11129 -94067 -214600 362250 28008 -194625 176786 -83261 -462124 44422
18975 -87407 -146460 -161517 -360309 -260877 -75339 21989 55816 -31823 64520 46639 51664 -130539
18962 -394498 60569 115022 -140151 168048 253327 437595 628054 292602 144329 -210972
18951 -12724 -250306 -56041 -42338 -20846 -9266 -155534 -142010 -73380 -144368 -338778 -153204
$$ packed form
19032I0688h3305A79694p4616h0764A42811a86556A24274m3273l5722J25634J06702
19021B77615d2871B42611a45309j6581A20535h1148A63366b25021k930G632c58353
19009A75243h091K125B50034c4604k66272c5803B04681K04459a42496L0723g819
18997c64634b3067C8086Q4184e5541A50187c07186c0145p599F1850c6046j14973
18986a51019A1129i4067j20533C62250B8008a94625A76786h3261l78863D4422
18975h7407n9053j5057j98792R9432g5339B1989L3827c1823F4520j7881N025a30539
18962c94498F0569N4453a40151A68048Q5279J84268J90459B92602A44329b10972
18951a2724k37582e6041J3703b0846i266j46268J3524O8630p0988j94410a53204
$$ plain form
18939 30882 -29259 58244 -103800 -26204 -100668 12890 -125454 -199547 -205501 90747 -175031
18927 -48162 -37229 -77349 45783 -53834 -186616 -408994 -112278 -298063 80352 147679 351345
18916 351345 -44694 -230054 148528 -28397 -299446 172244 -239259 -364652 -172383 -154787
18906 -154787 -464571 -210567 91117 70653 71136 -64210 -84302 67555 151356 164256 239739
18895 239739 240966 542543 391325 286466 511519 89952 -97857 -2492 120378 266323 91371
18883 -36093 419589 23026 -108437 40942 -95446 198233 -94022 5853 -97562 -126858 45635
18871 61614 -293998 -175739 -175874 -149544 -350897 -73375 -64927 -93320 -279750 -50524 -23775
18859 -308844 125074 131717 -288231 -77147 -341327 52460 -16566 223129 42031 -110537 5191
$$ packed form
18939C0882b9259E8244a03800b6204p4464A2890a25454p4093n954I0747a75031
18927d8162J0933m0120D5783e3834j32782k22378a12278j85785H0352O7327K03666
18916C51345d4694j85360A48528b8397k71049A72244b39259j25393a72383J7596
18906a54787l09784b10567I1117k0464M83f4210k0092F7555Q3801J2900P5483
18895B39739J227L01577j51218j04859K25053H9952i7857b492A20378J45945I1371
18883c6093D19589B3026a08437D0942i5446A98233i4022E853i7562k9296D5635
18871F1614b93998J18259j35K6330k01353g3375Q448k8393j86430e0524b3775
18859c08844A25074O643b88231g7147k64180E2460a6566B23129D2031a10537E191
$$ plain form
18847 -78661 51102 -56795 -180846 37556 142346 -153748 -76886 -39310 -250739 71209 136615
18836 136615 13740 -280597 -252916 92663 -6984 -155160 -292738 65528 107554 -133334 -174610
18825 -174610 -294413 296273 -315622 -34752 353508 -89876 -27930 -30866 -155024 77433 -41684
18813 134458 178725 46831 144058 272690 20386 82422 -172304 -406547 -488566 -72233 -242682
18802 -242682 -217681 -93409 -43594 123175 98922 112345 94778 -142692 -170538 -113410 -18964
18790 -26196 -185690 -102271 274372 -253331 -62233 25501 44705 -70392 4781 77624 -212259
18778 -73166 25547 -148276 124692 -262248 -221543 -482373 -70327 -83251 -175373 -163655 250232
18766 129911 -78033 -413379 -164782 -165111 6041 -6081 115045 -69963 76308 -168086 -143266
$$ packed form
18847g8661E1102e6795j24051C7556J04790a53748P6862L7576k11429G1209O5406
18836A36615A3740b80597K7681I2663f984j48176j37578F5528M2026a33334m1276
18825a74610j19803B96273c15622c4752C53508h9876b7930k936j24158G7433d1684
18813A34458M4267D6831R7227J28632B0386O2036a72304k34243q2019g2233j70449
18802b42682K5001i3409d3594A23175k4253J3423j7567a42692k7846N7128a8964
18790b6196j59494Q3419B74372b53331f2233B5501J9204g0392D781P2843b12259
18778g3166B5547a48276A24692b62248M0705k60830g0327j2924r2122J1718B50232
18766A29911g8033l35346a64782l29F041f081A15045f9963G6308a68086K4820
$$ plain form
18755 -143266 -196625 -398858 89816 28459 -138485 -114196 153531 97028 127537 -65928 -13001
18743 8059 70670 43631 7703 -33131 -240540 217157 -335615 215775 -388191 131295 -120652
18731 89824 -408785 -141545 178091 -210215 -219738 -276020 66515 -296025 29254 99636 -307
18719 -244690 -46589 69779 -397655 -106187 -151307 -305900 41301 378654 213513 58461
18708 301769 -74664 66411 143220 60055 247059 -6397 -390301 -257316 -63672 -21649 121891
18696 -495061 -92484 -194801 -123076 -269660 -131426 338121 -76205 25989 -88008 -419322
18686 -419322 212313 99261 -408080 66229 -102823 -290990 -304029 23815 127141 -49943
18675 117872 11769 25991 138746 61297 -162711 -71246 -73446 87839 -82573 23514 -101594
$$ packed form
18755a43266n3359k02233H9816B8459a38485K4289A53531n6503L0509f5928a3001
18743H059O2611k7039G703c3131k07409B17157c35615B15775c88191A31295a20652
18731H9824d08785a41545A78091b10215r523n6282F6515b96025B9254P0382c07
18719b44690d6589F9779c97655a06187m5120j54593D1301L37353j65141E8461
18708C01769g4664F6411P6809F0055J87004f397l83904J32985f3672b1649A21891
18696d95061i2484j02317P1725j46584a31426C38121g6205B5989h8008l31314
18686d19322B12313I9261d08080F6229a02823j88167j3039B3815J03326d9943
18675A17872A1769J4222J12755F1297a62711g1246k200H7839h2573B3514a01594
$$ plain form
18663 -96906 -221389 -210271 -332384 -284005 163596 -121245 -79764 -599804 -177744 -16351
18652 -26757 167398 -122743 171805 150971 -251165 -187319 19514 -28405 -18918 -132758 123619
18640 150739 -264958 -200394 -95494 39837 -268514 -187414 39104 54343 -22060 -321899 66022
18628 172234 -386544 -264204 364498 34745 -268345 12834 -326330 -21426 -322130 -296736
18618 -296736 -385529 -9249 132429 -124521 57415 -332375 2107 123833 -41871 -442658 58957
18606 -167501 -39209 1501 -1513 -177625 -13075 -119968 -58776 -115491 -105427 300939 -246604
18594 -38606 -115075 -337988 -96343 104512 -113559 -232608 -27439 177942 -173999 -10082
18583 -118792 8109 -40530 67403 207805 186217 -33992 5584 23714 257356 -133301 -221124
$$ packed form
18663i6906j24483J1118j22113M8379A63596a21245M1481n20040a77744a6351
18652b6757A67398a22743A71805k0834b51165O3846A9514b8405R487j13840A23619
18640A50739b64958O4564i5494C9837b68514Q1100C9104J5239b2060k99839F6022
18628A72234c86544J22340C64498C4745b68345A2834c26330b1426l00704K5394
18618b96736q8793i249A32429a24521E7415c32375B107J21726d1871m00787E8957
18606a67501c9209A501a513j76112a3075j06893e8776n6715J0064C00939b46604
18594c8606p6469k22913i6343A04512a13559j19049b7439A77942a73999a0082
18583a18792H109d0530F7403J40402k1588c3992E584J8130K33642a33301q7823
$$ plain form
18572 -221124 115029 -39280 -370964 -112922 -71444 -5645 62629 -93479 16167 -97184 68286
18560 -197788 -60374 -64950 80914 -289438 -222911 -157680 -88892 -140834 311889 -613568 129407
18548 -65575 15542 -103757 294109 -63745 -350211 63284 -92738 291398 -182312 73722 -224946
18536 41893 -98378 -120869 199074 94952 138143 -127354 27113 62027 104909 -297771 -211726
18525 -211726 -84241 -173661 -154681 263778 -87905 16370 -88775 -8278 -194125 115177 -124480
18513 -134506 261944 45777 -239029 170884 -261769 -322737 69074 296794 -296557 -284647
18503 -284647 199141 6188 126788 129249 -23063 103678 -300939 -132823 180328 -107105
18492 62014 -128539 169244 -354947 -188953 101384 170919 227658 75036 -130035 49354
$$ packed form
18572b21124A15029c9280l31684a12922M1478e645F2629i3479A6167i7184F8286
18560a97788f0374m576H0914b89438O6527O5231O8788n1942C11889f13568A29407
18548f5575A5542a03757B94109f3745k86466F3284i2738B91398a82312G3722b24946
18536D1893i8378k2491A99074I4952M3191a27354B7113L4914M2882b97771Q6045
18525b11726h4241q9420J8980B63778h7905A6370h8775h278j85847A15177a24480
18513a34506B61944D5777b39029A70884b61769o0968F9074K27720b96557J1910
18503b84647A99141F188J20600K461b3063A03678c00939a32823A80328a07105
18492F2014a28539A69244c54947J65994A01384O9535N6739G5036a30035D9354
$$ plain form
18481 80878 46174 108421 124915 -340940 -103709 249315 168604 -15917 -204402 -65402 -335899
18470 -335899 170068 -319700 114331 -112379 210830 305960 15204 -44284 63636 -40907
18459 -407833 -238751 43206 -123994 209574 -55691 100787 -274610 -389698 159750 -101562
18448 -15121 -209443 -38126 148878 -133965 -300238 71351 108349 -20225 -206870 -273062 134845
18436 -34884 -280792 141629 -388975 -197924 129473 49395 -77583 236841 -184874 199800
18425 -29519 244349 -55665 -46103 -10551 -178601 -32380 -148658 -386429 -91980 -128859 -39324
18413 -54339 -8073 -345598 104721 -166584 -7428 28022 242614 -275260 -91439 -77306 -165770
18402 -165770 37688 195729 -7980 370996 144840 103543 14355 56 106339 -14244 211925
$$ packed form
18481H0878l4704O2247J6494c40940a03709B49315q0711a5917j88485f5402k70497
18470c35899A70068c19700A14331a12379B10830R5130A5204d4284F3636d0907
18459d07833J69082D3206a23994B09574e5691A00787b74610j15088A59750a01562
18448a5121j94322c8126A48878a33965j66273G1351L6998b0225j86645o6192A34845
18436c4884k45908A41629c88975J91051A29473D9395g7583B36841a84874A99800
18425b9519B44349e5665R562a0551j68050c2380j16278k37771i1980l6879c9324
18413e4339h073l37525A04721a66584g428B8022K14592b75260i1439J4133q8464
18402a65770C7688J58041g980C70996A44840m1297A4355E6J06283a4244B11925
$$ plain form
18390 29041 -322037 -98786 -50625 112909 64027 79063 177656 102218 -68650 -194002 228785
18378 147875 -91889 20704 -205249 -220334 -194230 160268 -5160 -269910 -178275 173343 -58586
18366 4236 269931 -108292 203279 46360 134475 108478 287487 12502 97158 -208376 -112946
18355 -112946 44592 -178630 -28060 52873 196179 329499 139639 -162892 -10226 -122293
18345 -122293 -255898 -244809 -79607 -337595 -38125 26604 43824 -118546 -308025 -171021
18335 -171021 76376 108250 -225346 53847 54654 -46039 -32015 -68116 352712 36517 11106
18323 -411166 14089 -148744 45526 81754 -137678 200186 -83950 191579 -226868 99077
18312 -97650 -68780 -38498 -204121 -184822 57802 -180832 237311 126488 87346 -178729 31485
$$ packed form
18390B9041c22037i8786M8161A12909m8882J5036R8593p5438f8650j25352B28785
18378A47875i1889B0704b05249j5085K6104A60268e160k64750R1635A73343e8586
18366D236K65695a08292B03279D6360Q8115k5997J79009A2502Q4656b08376R5430
18355a12946D4592a78630b8060E2873J43306J33320A39639a62892a0226j12067
18345a22293j33605J1089g9607k57988c8125B6604J7220a18546j89479J37004
18335a71021G6376L1874b25346E3847Q07d6039J4024l6101C52712C6517A1106
18323d11166A4089a48744D5526L6228a37678B00186h3950A91579b26868I9077
18312i7650K8870L0282j65623J9299E7802a80832B37311j10823l9142a78729C1485
$$ plain form
18300 -320714 3326 -82516 -39297 93925 -145588 -266276 -263265 -323974 -153632 49069 -21139
18288 140823 -131535 -140681 -46692 -178226 27657 -329812 -125016 -195735 -117362 -80830 84648
18276 -214832 -291 -277470 -270527 -115630 -133831 -298152 184070 50445 71272 -96285 95786
18264 12343 191568 53186 -13848 -138360 -262439 -152224 220481 -66467 465513 -112901
18253 -183371 30475 39378 14873 34175 -177219 -99784 -63853 94270 -41555 -177863 -163800
18242 -163800 81070 36458 -139956 -179328 199177 -100122 76518 237422 240866 -171040 -4960
18230 -418744 -19716 49207 128582 64276 315077 105321 -488308 -313052 -325828 92444 -26557
18218 156142 67233 246047 61353 -87877 -104076 37189 263674 -42366 -70175 -136702 124433
$$ packed form
18300c20714C326h2516c9297I3925a45588j20688L011o0709a53632D9069b1139
18288A40823a31535r146d6692j31534B7657c29812a25016p0719P8373L6532H4648
18276b14832b91k77179O943a15630j8201j64321A84070E0445K0827i6285I5786
18264A2343J79225E3186a3848j24512j24079J10215B20481f6467D65513a12901
18253a83371C0475Q903A4873J9302a77219P7435L5931I4270d1555j36308J4063
18242a63800H1070C6458a39956l9372A99177a00122G6518J60904L444a71040d960
18230d18744a9716D9207P9375F4276K50801A05321d88308J75256j2776I2444b6557
18218A56142F7233J78814F1353h7877j6199C7189K26485d2366k7809o6527A24433
$$ plain form
18206 86737 -88983 -214434 -10555 111125 61354 10810 -6695 -12345 -42710 -371992 -23832
18194 -13082 24042 -106764 23846 -151161 99237 57995 120301 -125233 106875 -59790 169375
18182 -46824 -80138 -105569 110790 129305 247125 -67579 -154984 -164312 135436 23186 101599
18171 101599 134088 -147050 13707 -243157 87290 47372 -212990 -101577 66184 -107220
18160 -127109 -138142 -442694 -57331 107573 -55161 51056 293674 -173493 190091 -14940
18149 116808 -291884 -143977 33608 -43675 -68623 -113552 161489 101599 -122181 -257442
18139 -257442 200462 -148370 -39947 -15030 -28519 -129788 144886 55547 -180963 -368262
18129 -368262 -174469 -39536 301260 108387 -103188 92831 263 -1949 -285488 -543651 -12684
$$ packed form
18206H6737h8983j25451a0555A11125m9771A0810f695n650l0365l29282b3832
18194a3082B4042a06764B3846a51161I9237m1242O2306a25233A06875e9790A69375
18182d6824l3314k5431A10790J8515J17820f7579q7405r328A35436B3186P8413
18171A01599L2489a47050A3707b43157H7290l9918b12990a01577F6184a07220
18160a27109j1033l04552e7331A07573e5161E1056K42618a73493A90091a4940
18149A16808b91884a43977C3608d3675k4948m4929A61489n9890a22181j35261
18139b57442B00462a48370c9947a5030j3489j01269A44886E5547a80963j87299
18129c68262a74469c9536C01260A08387a03188I2831B63a949k83539k58163a2684
$$ plain form
18117 -34511 239872 -21978 -223169 -75927 116558 155788 23790 151565 185621 189509 -302179
18105 -70069 -184766 -160042 218680 197554 5023 132842 -240342 -4270 -201159 171323 36145
18093 56148 25555 -62311 194758 173092 -4774 -191718 21293 48501 142530 236184 151571
18082 151571 -98884 496658 311322 105517 -185035 263432 -373914 82589 31211 185423
18072 185423 -271582 228864 -141874 -134362 -174094 -624550 35695 -196816 71863 -332461
18061 -28339 -24643 -85342 -279449 -214162 531996 260507 -17935 -77275 -8820 -183139 216568
18049 -132923 86514 -144177 -121349 83221 -439708 27386 57051 191794 258826 -188941 -120619
18038 -120619 -218682 44214 110122 -277566 -166179 272495 96078 13325 -100769 281680
$$ packed form
18117c4511B39872b1978k01191g5927A16558L9230B3790J27775L4056L888c02179
18105g0069j14697K4724B18680k1126E023J27819b40342d270j96889A71323C6145
18093E6148B5555f2311A94758k1666d774j86944B1293K7208R4029R3654q4613
18082A51571i8884D96658j85336A05517a85035B63432c73914H2589C1211J54212
18072A85423b71582B28864a41874P512l9732m50456C5695a96816G1863c32461
18061b8339L696o0699j94107O5287E31996B60507a7935n9340h820j74319B16568
18049a32923H6514a44177K2828H3221d39708B7386K9665J34743O7032a88941O8322
18038a20619r8063D4214O5908b77566J11387B72495I6078A3325a00769B81680
$$ plain form
18027 96537 123805 -164069 -86184 -124098 -262184 -117482 -96426 -110269 -183705 -36797 -77304
18016 -77304 -65690 249116 30439 -22639 -128215 -29350 120 -91248 217596 136349 -173603
18004 -137419 -133456 -21882 -132128 127523 283173 66914 -5800 -77464 91693 11927 135679
17993 135679 -142146 -332892 253296 -109400 109919 -73924 -369711 329178 -105479 -69498
17983 -69498 -150717 235130 -2967 -52725 -171488 -93689 128095 -223626 -229249 272506 -326491
17971 38524 -45291 -38771 97375 174218 -94113 -61110 253876 56131 -135323 120954 82345
17960 82345 -16723 -91235 196851 -448053 213853 232118 410170 349888 -191701 -333426
17950 -333426 250616 -241395 -74248 -19612 -267324 246727 -87244 18405 -93645 86606 -67340
$$ packed form
18027I6537K7268a64069P7885l7914j38086a17482K1056j3843p3436c6797m0507
18016g7304J1614B49116C0439b2639j05576b9350A20i1248B17596q1247a73603
18004a37419L963b1882j10246A27523J55650F6914e800p1664I1693A1927J23752
17993A35679a42146j90746B53296a09400A09919g3924k95787C29178a05479L5981
17983f9498q1219B35130b967m9758j18763P7799A28095b23626n623B72506c26491
17971C8524d5291O520I7375P6843i4113L3003B53876E6131a35323A20954l8609
17960H2345a6723p4512A96851d48053B13853J8265J78052o0282a91701j41725
17950c33426B50616b41395g4248a9612k47712B46727h7244A8405i3645H6606f7340
$$ plain form
17938 56371 238142 -90009 52980 1495 294211 120874 -259938 -120461 260224 -23623 -162435
17927 -162435 -386650 -148008 5738 156985 -226372 -299592 344810 -183207 80294 -294317
17916 170979 -115148 -263905 41768 305072 510930 -16712 109375 204637 -126058 99353
17905 123093 118932 236157 -18047 -129269 87074 -50521 65005 329634 57921 -69782 -20548
17893 124141 -252957 235597 34446 -35797 -91889 136947 41125 229257 -244592 48508
17882 -215970 57723 -77716 78001 -81294 380904 424405 -95702 159729 143999 30464 25798
17871 25798 425719 -123778 26065 3099 -7601 -160270 295365 21759 50380 -86044 -70102
17860 -70102 -288666 83606 -248823 -155048 132970 -70537 -215917 -273041 -308686 -136176 -321721
$$ packed form
17938E6371J81771i0009E2980A495K92716A20874b59938a20461B60224b3623j38812
17927a62435k24215a48008E738J51247b26372p3220C44810a83207H0294b94317
17916A70979a15148j48757D1768K63304K05858a6712A09375R5262a26058I9353
17905A23093m161J17225a8047j11222H7074e0521F5005K64629E7921f9782b0548
17893A24141b52957B35597C4446c5797n6092A36947D1125J88132b44592D8508
17882b15970E7723g7716G8001h1294C80904M3501i5702A59729j5730C0464m666
17871B5798L99921a23778B6065C099g601j52669B95365B1759K8621h6044J5942
17860g0102k18564H3606b48823R3775A32970g0537j45380n7124l5645a36176j85545
$$ plain form
17849 -321721 156169 -299782 -55068 203410 308127 75189 218400 193447 -13765 284585
17838 272615 131691 -240758 6832 4328 -31651 121143 66857 217186 -121759 -70263 -88242
17827 -88242 139014 -233643 164258 -260113 -138293 8064 32735 -59218 303042 98703 -40154
17815 -15761 29175 117930 119997 45823 -1743 -179364 100635 69767 -118791 -53460 -246077
17804 -246077 74470 119341 -120041 22181 -261972 9971 170621 72189 -129788 132167 -80511
17792 260062 -108043 -331828 162394 -20078 158401 271524 -356819 343622 -181636 -452768
17782 -452768 -265790 37598 -1668 -8760 239498 3373 -106008 -142986 78369 147511 -217252
17770 165081 -84957 -18329 232895 136567 -90756 -221752 258207 208773 -90076 230978 240709
$$ packed form
17849c21721A56169b99782e5068B03410J04717G5189J43211k4953a3765B84585
17838B72615A31691b40758F832k504c1651A21143n4286J50329a21759N1496j7979
17827h8242A39014b33643A64258b60113J21820H064K4671e9218C03042I8703d0154
17815a5761B9175Q8755K067D5823a743j77621A00635l0868a18791e3460j92617
17804b46077G4470M4871a20041B2181b61972I971J60650G2189a29788A32167h0511
17792B60062a08043k23785A62394b0078A58401J13123c56819C43622a81636k71132
17782d52768J86978C7598a668p092B39498C373a06008l6978G8369O9142b17252
17770A65081h4957a8329B32895r6328i0756j30996B58207m9434i0076B30978R731
$$ plain form
17759 240709 23641 52484 -78543 31583 62653 -273998 250075 -309595 -146219 -163283 -22315
17747 130207 215343 -84400 -184627 109145 161179 240403 205966 336524 270391 143161 117137
17736 117137 17008 -330544 199618 65445 128979 -179079 154886 206961 -84915 14380 -70874
17724 48482 -81079 34195 -15344 253023 -151244 191708 -179200 -48109 256991 251817 -65879
17712 23280 237081 -111291 142388 -146865 -204457 29501 147534 5698 317668 70812 209451
17701 209451 43871 166843 -102827 77024 -140286 119078 -287803 -131053 137465 423311
17691 423311 201197 67129 -86837 130487 -44820 -203673 396460 116156 -49203 338491
17680 44489 307569 -200513 38363 -34486 340281 44474 31864 -159687 -215644 109495 186017
$$ packed form
17759B40709B3641K8843g8543C1583L1070b73998B50075c09595a46219j7064b2315
17747A30207Q5136h4400j00227A09145N2034P9224l4437J30558o6133j27230k6024
17736A17137A7008c30544A99618F5445O3534a79079A54886N2075h4915A4380g0874
17724D8482h1079C4195a5344B53023a51244A91708a79200d8109B56991n174f5879
17712B3280K13801a11291A42388a46865n7592B9501J18033E698L11970G0812J38639
17701B09451D3871J22972a02827G7024a40286A19078b87803a31053A37465K85846
17691D23311B01197F7129h6837A30487d4820j58853C96460A16156d9203C38491
17680D4489K63080b00513C8363c4486C40281D4474j2610a59687n5957A09495P6522
$$ plain form
17669 186017 42903 239288 161913 104946 339628 -92556 -72202 -27550 12608 154408 10233
17657 138697 -26419 129299 236597 167940 359844 -94472 -201209 -30822 450583 -85598
17646 183399 217986 -377369 12264 160069 36387 7320 7679 -51535 226445 393748 -116274
17634 147231 -23818 214986 -158177 -133978 256810 17929 110062 -40616 -38988 289555 230858
17623 230858 211492 205671 87629 83977 -2803 139128 31531 -109777 -4848 -237731 248879
17611 163719 353637 215030 226738 39732 166220 133031 -21911 548460 13344 430219
17601 430219 109739 241815 -60535 -84816 10871 -132171 -182192 449375 -8412 352827 204208
17590 204208 -27503 111055 -82667 346364 -32219 44093 -217558 20420 -262663 109148
$$ packed form
17669A86017D2903J96385p7375n6967K34682i2556K0354b7550A2608J41800A0233
17657A38697b6419A29299J07298o8657J91904i4472j06737c0822D50583h5598
17646A83399L4587c77369A2264J47805C6387G320L59e1535B26445J67303a16274
17634A47231b3818B14986a58177K4199B56810A7929R2133d0616J628B89555n8697
17623B30858j9366n821H7629l652b803A39128C1531a09777d848k32883B48879
17611A63719J89918j38607J1708C9732J26488l3189b1911E48460A3344M16875
17601D30219A09739J32076f0535k4281A0871a32171n0021D49375h412C52827j48619
17590B04208b7503A11055h2667C46364c2219D4093b17558B0420b62663A09148
$$ plain form
17579 -67565 213005 107585 211084 9592 -129645 144903 69602 165898 155257 -619 154754
17567 -12372 139130 31007 -35250 225820 88463 205039 -112470 287051 8422 -102639 -211179
17556 -211179 258473 29732 166072 83030 331890 104857 -184633 192911 -186649 227986
17545 -305823 374281 47298 2498 166903 271906 323862 194650 -33039 5970 246360 -34773
17533 258257 378825 139438 221408 241874 193714 182082 185162 208787 29254 461269 365370
17522 365370 191858 527501 178610 323073 51899 74660 314261 386487 126080 317115
17512 317115 48099 271006 426955 509171 293008 537926 467566 486273 294342 170766
17502 170766 529784 408846 134508 90179 103791 471724 362005 190110 144996 236264
$$ packed form
17579f7565B13005j05420J03499I592a29645A44903F9602R6296j0641f19A54754
17567a2372A39130C1007c5250B25820H8463J16576a12470B87051H422a02639j08540
17556b11179B58473B9732J36340H3030K48860A04857a84633A92911a86649B27986
17545c05823C74281D7298B498J64405J05003N1956j29212c3039E970K40390c4773
17533B58257J20568A39438Q1970K0466m8160j1632L080K3625B9254M32015r5899
17522C65370j73512L35643A78610J44463E1899K2761K39601P2226A26080J91035
17512C17115D8099K22907J55949Q2216k16163K44918p0360J8707j91931j23576
17502A70766L59018j20938A34508m4329J3612L67933j09719j71895m5114R1268
$$ plain form
17492 236264 524863 347619 184440 100303 -39819 296320 340424 305994 307581 273161 124939
17480 99286 36417 370647 111239 466062 -5595 656701 222951 150910 432818 406916 317193
17469 317193 340746 157453 -178753 270749 352338 -102383 132246 268843 161411 250275
17459 250275 513610 162910 -128417 -30092 153044 79636 226748 334831 605422 331951
17449 331951 116241 568040 213278 206020 475038 600803 393150 621243 241710 243537
17439 243537 423458 423961 513334 730969 155455 364776 682002 427536 653274 15279
17428 153770 362874 530808 232790 287927 294678 -61676 1331 342343 250391 519382 158485
17416 110981 536997 185646 399753 842265 602769 659653 493211 352660 450221 298507
$$ packed form
17492B36264K88599j77244j63179q4137c9819B96320M4104l4430J587l4420A24939
17480I9286C6417L34230A11239L54823e595F56701B22951p2041K81908k5902q9723
17469C17193K3553A57453a78753B70749Q1589a02383A32246J36597j07432Q8864
17459B50275K63335A62910a28417c0092A53044p3408J47112J08083K70591k73471
17449C31951A16241M51799B13278p258K69018J25765k07653K28093B41710J827
17439B43537J79921N03Q9373K17635A55455K09321L17226k54466K25738A5279
17428A53770K09104J67934B32790N5137O751f1676A331L41012r1952K68991A58485
17416A10981M26016A85646K14107M42512k39496N6884j66442j40551R7561j51714
$$ plain form
17406 298507 106773 443571 -86193 30238 20449 271186 22489 163863 54206 -1548 -10805
17395 -10805 556961 347654 9443 122856 492141 349012 229490 -4257 179792 164021 208545
17384 208545 -194529 244911 417516 88140 -46886 234413 338076 366537 331765 231673
17374 231673 496933 231181 -89795 -1698 320886 461042 550873 332256 217240 129619
17364 129619 418880 253921 280025 214259 38802 235312 38790 243111 456925 504606
17354 504606 122329 -35550 75944 134576 63310 404887 43654 263646 -41590 -10976 -80568
17343 -80568 279488 -12900 397724 205770 65028 237702 394543 113642 212011 257207
17333 257207 -144905 160627 346036 419170 476363 346269 149721 352539 435318 82390
$$ packed form
17406B98507A06773L36798h6193C0238r789K50737B2489J41374E4206a548r257
17395a0805E56961k09307I443J13413L69285j43129j19522d257A79792j5771M4524
17384B08545a94529B44911J72605H8140d6886B34413J03663K8461l4772j00092
17374B31673K65260B31181h9795a698C20886J40156Q9831k18617j15016q7621
17364A29619K89261j64959K6104o5766C8802J96510C8790K04321K13814M7681
17354E04606A22329c5550G5944N8632F3310L41577D3654K19992d1590a0976o9592
17343h0568B79488a2900C97724j91954F5028J72674J56841A13642R8369M5196
17333B57207a44905A60627J85409P3134N7193j30094A49721K02818Q2779H2390
$$ plain form
17322 439365 152801 100611 109908 -108767 141467 286613 574615 213714 280645 179431
17312 179431 325872 6313 88441 264111 91164 87867 389603 309269 -10159 280512 316818
17301 316818 187537 297639 246609 303915 140234 -90634 573481 83904 13802 200304
17291 200304 240958 315656 48996 18120 -169427 291896 429377 178385 615735 168606
17280 197080 356296 -71698 393982 323864 -40125 216010 327982 104868 57049 156805
17270 156805 515310 618172 440746 328686 185809 212589 607273 126899 435081 140117
17259 416682 64077 -87546 191598 220489 506953 471228 385132 342187 134858 141793 124901
17248 124901 779584 298073 277999 336059 429055 423868 292317 217401 316921 75514 285740
$$ packed form
17322D39365A52801n2190R297a08767A41467J45146K88002B13714O6931j01214
17312A79431J46441F313Q2128J75670I1164l297L01736q0334a0159B80512L6306
17301C16818j29281J10102n1030N7306A40234i0634E73481H3904A3802J86502
17291B00304M0654P4698D8996A8120a69427B91896J37481A78385M37350A68606
17280A97080J59216g1698C93982p0118d0125B16010J11972A04868m7819R9756
17270A56805L58505J02862j77426j12060j42877K6780L94684A26899L08182A40117
17259D16682F4077h7546A91598K8891K86464l5725q6096m2945A34858O935j6892
17248A24901O54683B98073k0074N8060R2996n187j31551p4916R9520G5514K10226
$$ plain form
17237 285740 130665 84461 282226 262139 955986 437923 294170 316274 124465 -63578
17226 455848 571484 252309 28805 452730 80518 496769 205559 225917 630950 208568
17215 518394 117930 429976 578612 460536 490323 441149 146471 593249 283048 177683
17205 177683 429488 285597 458377 227835 375312 361053 555565 273398 453669 208638
17194 648362 372950 298192 466550 255191 702652 177009 282984 249405 93660 390810
17184 390810 -38314 139009 543115 714162 242813 624812 546870 439665 329396 649205
17174 649205 480033 315258 281213 591639 559187 560251 409669 849866 512166 558287
17164 558287 225431 338185 236110 581616 311789 355888 607065 370527 361319 496542
$$ packed form
17237B85740A30665m6204J97765k0087O93847D37923j43753K2104A24465f3578
17226D55848J15636B52309B8805M23925H0518M16251B05559K0358M05033B08568
17215E18394A17930L12046J48636j18076K9787m9174A46471M46778B83048j05365
17205A77683K51805j43891J72780B27835J47477j4259J94512B73398J80271B08638
17194F48362k75412p4758J68358k11359M47461A77009J05975l3579I3660K97150
17184C90810c8314A39009M04106J71047B42813L81999p7942j07205j10269L19809
17174F49205j69172j64775l4045L10426l2452J064j50582M40197l37700M6121
17164E58287B25431J12754j02075L45506k69827M4099K51177k36538r208J35223
$$ plain form
17154 496542 263993 664108 403462 427016 138546 603284 506973 184193 283817 347679
17144 347679 619731 595444 743664 593517 244720 582166 371965 704007 255808 334071
17134 334071 381787 553556 173999 442886 444988 439449 424836 465642 251676 436874 304968
17123 304968 556662 519462 676390 626038 454605 307869 624609 691154 791956 424514
17113 424514 464262 403146 531306 680819 472450 473956 454396 235741 326886 440573 863247
17102 863247 663498 521963 564411 614169 509585 729923 401406 858494 807702 450821
17092 450821 517993 552571 537461 156157 796816 702852 631970 711691 498562 982344 971174
17081 971174 708174 863540 478225 602214 821491 671777 519666 612734 536371 884641
$$ packed form
17154D96542k32549M00115k60646K3554A38546M64738r6311A84193R9624O3862
17144C47679K72052k4287J48220j50147B44720L37446k10201L32042B55808P8263
17134C34071M7716J71769A73999K68887K102n539j4613M0806k13966J85198j31906
17123C04968K51694l7200J56928n0352j71433j46736L16740O6545J00802l67442
17113D24514L9748o1116J28160J49513k08369J506j9560k18655R1145J13687M22674
17102H63247j99749j41535M2448M9758j04584K20338l28517M57088n0792l56881
17092D50821O7172L4578j5110A56157O40659r3964p0882P9721k13129M83782j1170
17081I71174k63000J55366l85315J23989K19277j49714j52111R3068p6363L48270
$$ plain form
17071 884641 887015 813842 1022764 766711 943592 557494 1098983 740142 802574 775910
17061 775910 427747 861170 815779 575046 582143 861211 789201 820721 714883 804797 783564
17050 783564 814436 898824 931377 932955 645446 918090 1206084 760764 1088100 838218
17040 838218 657256 805559 1088989 696586 1136519 741365 1163829 1078215 768254 849220
17030 849220 793162 535302 1309391 724533 908508 1012618 832967 1100201 956682 977981
17020 977981 837437 1308221 902683 992553 818553 1012301 912721 815710 1384527 1082229
17010 1082229 892528 1057343 995382 1177059 946588 1104169 1212383 1241815 895215 1366414
17000 1366414 1018013 1197636 1136194 1307411 1163925 1139679 1073719 1270193 1187748 988356
$$ packed form
17071H84641K374p3173K08922k56053J76881l86098N41489l58841O2432k6664
17061G75910l48163M33423m5391k40733P097K79068p2010L1520j05838Q9914k1233
17050G83564L0872Q4388L2553J578k87509K72644K87994m45320L27336k49882
17040H38218j80962J48303K83430l92403M39933l95154M22464q5614l09961Q0966
17030H49220n6058k57860P74089n84858J83975J04110j79651K67234j43519K1299
17020I77981j40544M70784m05538Q9870j74000J93748r9580r7011N68817l02298
17010A082229j89701J64815o1961J81677k30471J57581J08214K9432l46600M71199
17000A366414l48401J79623o1442J71217j43486k4246o5960J96474q2445j99392
$$ plain form
16990 988356 1344883 1390101 949548 1101566 1442869 1309396 1336598 1220855 1241481 1561929
16980 1561929 1451836 1396539 1189499 1258038 1407308 1382354 1441061 1335058 1314347 1508318
16970 1508318 1622354 1197164 1507792 1274668 1346437 1195351 1380510 1518889 1371802 1392414
16960 1392414 1988762 1577612 1699508 1499271 1557649 1799289 1820228 1683820 1468744 1676272
16950 1676272 1518948 1559578 1756594 1867342 1553417 1648909 1712913 1773293 1512782 1750111
16940 1750111 1805863 1895575 1906178 1555670 2171828 1760646 1724875 1998767 1989696 2001735 1928952
16929 1928952 2271936 1956386 1897415 2056539 1870738 2039395 1914551 2398472 2554709 2066228
16919 2066228 2239938 2378263 2360166 2101666 2386095 2415918 2391037 2448789 2342299 2738963
$$ packed form
16990I88356L56527M5218m40553J52018L41303j33473K7202j15743K0626L20448
16980A561929j10093n5297k07040O8539J49270k4954N8707j06003k0711J93971
16970A508318J14036m25190L10628k33124P1769j51086J85159J38379j47087K0612
16960A392414N96348m11150J21896k00237N8378K41640K0939j36408k15076K07528
16950A676272j57324M0630J97016J10748l13925R5492O4004O0380k60511K37329
16940A750111N5752Q9712J0603l50508O16158m11182l5771K73892r071J2039p2783
16929A928952L42984l15550n8971J59124j85801J68657j24844M83921J56237m88481
16919B066228J73710J38325j8097k58500K84429K9823k4881N7752j06490L96664
$$ plain form
16909 2738963 2349356 2682790 2529264 2696388 2343975 2321924 2515190 2498262 2600080 2955427
16899 2955427 2635618 2581538 2881081 2908240 2882772 2927486 2626668 3071853 3213577 3212489
16889 3212489 3086712 3026756 2822528 2856380 3221485 3398662 3322000 3289850 3462154 3216204
16879 3216204 3301992 3434620 3371195 3798301 3922572 3775177 3422520 3806513 3736025 3569265
16869 3569265 4044978 4094937 4014365 4116199 4200989 4263879 4326708 4001523 4207299 4388185
16859 4388185 4553996 4845940 4509152 4543447 4927715 4665506 4817554 5141192 4784575 4692862
16849 4692862 5252988 4940957 4937235 5288283 5353365 5580949 5712376 5841916 5483821 5729507
16839 5729507 5739143 6000903 6298173 6362535 6316935 6490110 6552124 6453536 7124391 6900619
$$ packed form
16909B738963l89607L33434j53526J67124l52413k2051J93266j6928J01818L55347
16899B955427l19809n4080K99543K7159k5468M4714l00818M45185J41724j088
16889C212489j25777n9956k04228L3852L65105J77177p6662l2150J72304k45950
16879C216204Q5788J32628o3425M27106J24271j47395l52657L83993p0488j66760
16869C569265M75713M9959q0572J01834Q4790O2890O2829l25185K05776J80886
16859D388185J65811K91944l36788L4295L84268k62209J52048L23638l56617r1713
16849D692862N60126l12031l722L51048O5082K27584J31427J29540l58095K45686
16839E729507R636K61760K97270O4362m5600J73175O2014r8588O70855k23772
$$ plain form
16829 6900619 7065598 6865474 7000780 7323767 7300889 7311842 7849594 7837476 7990730 8118637
16819 8118637 8317040 8474624 9018914 8574999 9058195 9399586 9171557 9284311 9759950
16810 9759950 10109644 10073487 10475910 10566269 10902872 11364505 11382961 11638176 11703883 11997660
16800 11997660 12337034 12733884 12719734 13512148 13647542 14119687 13807026 14711974 14964806
16791 14964806 15215009 15764271 16162198 16438473 16844028 17503797 17856088 18402877 18753916
16782 18753916 19078122 19863054 20150256 21133734 21574110 22361682 23025521 23792120 24269094
16773 24269094 25091068 25920444 26873531 27631890 28351316 29360629 30198740 31239936 32599215
16764 32599215 33448286 34441595 35675985 36753901 38336623 39778156 41015803 42555613
$$ packed form
16829F900619J64979k00124J35306L22987k2878J0953N37752j2118J53254J27907
16819H118637J98403J57584N44290m43915M83196L41391k28029J12754M75639
16810I759950L49694l6157M02423R0359L36603M61633J8456K55215O5707K93777
16800A1997660L39374L96850j4150P92414J35394M72145l12661R04948K52832
16791A4964806K50203N49262L97927K76275M05555O59769L52291N46789L51039
16782A8753916L24206P84932K87202R83478M40376P87572O63839P66599M76974
16773B4269094Q21974Q29376R53087P58359P19426J009313Q38111J041196J359279
16764C2599215Q49071R93309J234390J077916J582722J441533J237647J539810
$$ plain form
16756 42555613 44569383 45907397 47738100 49282399 51335906 53258472 55328415 57461819
16748 57461819 59629922 62225983 64506308 67216768 69912815 72384783 75208545 78085139
16740 78085139 81083181 84109082 87101504 90196876 93412588 96627390 99977669 102983533
16732 102983533 106083833 109414028 112370261 115498469 117503974 120272878 122288817 124087813
16724 124087813 125908913 127262497 127998252 128426981 128280685 128470253 127455820 126883995 125101110
16715 125101110 123698732 121643914 119136464 116574893 113534535 110814377 107469076 104686784
16707 104686784 101511681 98024190 94684940 91385584 87986754 84865788 81713825 78696813
16699 78696813 75519325 72756756 69687510 67031343 64331975 61784890 59270970 57150727
$$ packed form
16756D2555613K013770J338014J830703J544299K053507J922566K069943K133404
16748E7461819K168103K596061K280325K710460K696047K471968K823762K876594
16740G8085139K998042L025901K992422L095372L215712L214802L350279L005864
16732A02983533L100300L330195K956233L128208K005505K768904K015939J798996
16724A24087813J821100J353584P35755M28729j46296J89568j014433n71825j782885
16715A25101110j402378k054818k507450k561571l040358k720158l345301k782292
16707A04686784l175103l487491l339250l299356l398830l120966l151963l017012
16699G8696813l177488k762569l069246k656167k699368k547085k513920k120243
$$ plain form
16691 57150727 54847263 52545377 50623345 48628075 46876689 44882861 43375761 41982734
16683 41982734 40184767 38553152 37101520 35836530 35195670 33528114 32508788 31058106
16675 31058106 29975775 29146195 27990163 27211998 26286798 25242482 24912389 23999200 23036714
16666 23036714 22467003 21670408 21087153 20397492 20058180 19329629 18946657 18217109 17851230
16657 17851230 17131596 16918824 16592305 16322071 15514450 15038283 14431085 14074817 14024045
16648 14024045 13823825 13278130 12978467 12980756 12290290 12067793 11567935 11552697 11217754 11131301
16638 11131301 10451574 10412311 10124938 10041160 9680420 9810956 9379482 9428609 8984409 8504694
16628 8504694 8915085 8498864 8272203 8005073 7924185 7573719 7845074 7493747 7353092 7244013
$$ packed form
16691E7150727k303464k301886j922032j995270j751386j993828j507100j393027
16683D1982734j797967j631615j451632j264990o40860j667556j019326j450682
16675C1058106j082331q29580j156032p78165r25200j044316l30093r13189r62486
16666B3036714n69711p96595n83255o89661l39312p28551l82972p29548l65879
16657A7851230p19634k12772l26519k70234q07621m76167o07198l56268n0772
16648A4024045k00220n45695k99663K289o90466k22497m99858j5238l34943q6453
16638A1131301o79727l9263k87373q3778l60740J30536m31474M9127m44200m79715
16628H504694M10391m16221k26661k67130q0888l50466K71355l51327j40655j09079
$$ plain form
16618 7244013 7079091 6764982 6797907 6612764 6433151 6583537 6298174 6141838 5916649 6206247
16608 6206247 5878442 5559967 5726067 5517179 5688805 5650080 5357982 5119004 5418000 4951680
16598 4951680 4925203 4957338 4937213 4649835 4660773 4543783 4581507 4683559 4170107 4448453
16588 4448453 3981690 4124945 3999572 4012946 4083241 4045024 3742246 3685935 3833522 3937742
16578 3937742 3555527 3824462 3586464 3634623 3337532 3346156 3197885 3098323 3187774 3364895
16568 3364895 3230540 3304667 3121516 2842513 3006590 2820591 2598081 3140594 2916172 2771475
16558 2771475 2794894 2936095 2642622 2812313 2626757 2620566 2746385 2510426 2192773 2244976
16548 2244976 2492784 2600195 2515839 2280834 2288230 2619927 2100655 2162665 2158702 2242065 1959871
$$ packed form
16618G244013j64922l14109L2925j85143j79613J50386k85363j56336k25189K89598
16608F206247l27805l18475J66100k08888J71626l8725k92098k38978K98996m66320
16598D951680k6477L2135k0125k87378J0938j16990L7724J02052n13452K78346
16588D448453m66763J43255j25373J3374P0295l8217l02778n6311J47587J04220
16578C937742l82215K68935k37998M8159k97091Q624j48271r9562Q9451J77121
16568C364895j34355P4127j83151k79003J64077j85999k22510N42513k24422j44697
16558B771475K3419J41201k93473J69691j85556o191J25819k35959l17653N2203
16548B244976K47808J07411q4356k35005P396L31697n19272O2010l963Q3363k82194
$$ plain form
16537 1959871 1956857 2219963 2176714 2302085 2102516 2147736 2005150 1848411 1975719 1724058
16527 1724058 2203589 1793405 1780280 2131941 1644713 1840606 1492241 1762706 1917425 1513906
16517 1513906 1491764 1656005 1460033 1545236 1731012 1698023 1884969 1516341 1585336 1552199
16507 1552199 1676920 1626501 1664628 1307340 1331181 1541762 1367636 1456299 1222410 1453930
16497 1453930 1589416 1163777 1656499 1533312 1424391 1297262 1231880 1135900 1373195 1050702
16487 1050702 1194361 1118005 1354076 1188815 1546014 1178301 993960 1390227 1254996 1090574
16477 1090574 1038338 1010613 1147419 817384 978169 1202197 945041 683547 1331589 1106909
16467 1106909 1081505 1478901 903877 1162404 1360688 1276827 1201121 884782 1244102 1108088
$$ packed form
16537A959871l014K63106m3249J25371j99569M5220j42586j56739J27308k51661
16527A724058M79531m10184j3125L51661m87228J95893l48365K70465J54719m03519
16517A513906k2142J64241j95972Q5203J85776l2989J86946l68628O8995l3137
16507A552199J24721n0419L8127l57288K3841K10581j74126Q8663k33889K31520
16497A453930J35486m25639M92722j23187j08921j27129o5382r5980K37295l22493
16487A050702J43659p6356K36071j65261L57199l67713j84341L96267j35231j64422
16477A090574n2236k7725J36806l30035J60785K24028k57156k61494O48042k24680
16467A106909k5404L97396n75024K58527J98284q3861p5706l16339L59320j36014
$$ plain form
16457 1108088 733951 975703 759058 1365732 994927 718199 946002 1213359 1139186 1096562
16447 1096562 769679 1115597 946035 638372 713853 928201 709388 1043853 814288 954793
16437 954793 916118 752641 1048766 597151 599137 786533 1018330 945873 1141837 657262
16427 657262 790003 902409 338258 927324 571587 771253 648591 603441 640757 892134
16417 892134 554516 727832 799280 865736 916900 727392 528341 552672 636420 397971
16407 397971 501551 579231 706000 506204 874807 557050 557360 458535 543294 890693 662520
16396 662520 218385 779119 672130 536255 395963 280220 481710 663593 363079 486719
16386 486719 568974 715760 762470 506963 728029 333005 249655 471647 799622 559347
$$ packed form
16457A108088l74137K41752k16645O06674l70805k76728K27803K67357p4173m2624
16447A096562l26883L45918j69562l07663P5481K14348k18813L34465k29565J40505
16437I54793l8675j63477K96125m51615J986J87396K31797p2457J95964m84575
16427F57262J32741J12406C38258N89066l55737J99666j22662m5150L7316K51377
16417H92134l37618J73316P1448O6456N1164j89508j99051K4331Q3748k38449
16407C97971J03580P7680J26769j99796L68603l17757L10r8825Q4759L47399k28173
16396F62520B18385N60734j06989j35875j40292j15743K01490J81883l00514J23640
16386D86719Q2255J46786M6710k55507K21066C33005q3350K21992L27975k40275
$$ plain form
16376 559347 223885 520266 665542 573843 618572 330738 473307 761331 232111 517627
16366 517627 461504 487201 829662 437556 549491 601354 527641 322600 585539 435741
16356 435741 778441 591396 101955 639411 241058 428702 484755 478141 372252 565821
16346 565821 285943 465823 200933 350127 446660 386286 300276 421872 502416 389800
16336 389800 809239 528282 426679 136536 461049 359546 533312 64022 381105 172035
16325 361190 257237 478333 522734 474991 270975 536367 88443 477308 498783 249503
16315 249503 365908 401136 433261 422568 417696 451045 162199 383123 -60172 130617 280794
16304 280794 536229 436066 454102 356986 498276 358313 272599 226729 95996 182928 563145
$$ packed form
16376E59347B23885K96381J45276r1699M4729k87834J42569K88024B32111K85516
16366E17627n6123K5697L42461l92106J11935N1863p3713k05041K62939j49798
16356D35741L42700j87045A01955N37456B41058J87644N6053o614j05889J93569
16346E65821k79878J79880B00933J49194R6533o0374q6010J21596Q0544j12616
16336C89800M19439k80957j01603A36536L24513j01503J73766F4022L17083A72035
16325C61190j03953K21096M4401m7743k04016K65392H8443L88865K1475k49280
16315B49503J16405L5228L2125j0693m872L3349A62199K20924f0172A30617J50177
16304B80794K55435j00163J8036r7116J41290j39963q5714m5870I5996Q6932L80217
$$ plain form
16293 563145 331084 364902 -84584 554092 451852 535087 364390 464566 32061 305109
16283 305109 345365 79082 857525 40242 320259 3136 15805 135342 196550 235777 347409
16272 347409 515958 275393 409526 56339 405115 230754 315712 -122305 151818 329576
16262 329576 233957 124201 354654 244655 348813 346187 642162 363771 72704 126490
16252 126490 308544 168258 211023 208674 85112 184949 101922 163392 241153 238840 276233
16241 276233 177221 307738 276848 505006 97126 240976 162161 272786 -109726 240097
16230 148448 127298 122302 12937 330991 318926 282307 166442 160560 -170903 269509 162085
16219 162085 157979 -55008 217558 206835 272396 54991 372235 343534 19614 -16794 154544
$$ packed form
16293E63145k32061L3818h4584E54092j02240Q3235j70697J00176C2061K73048
16283C05109M0256G9082P78443D0242K80017C136J2669J19537O1208L9227J11632
16272C47409J68549k40565J34133E6339L48776j74361Q4958a22305A51818J77758
16262C29576r5619j09756K30453j09999J04158k626K95975k78391G2704N3786
16252A26490J82054j40286M2765k349H5112R9837q3027O1470P7761k313L7393
16241B76233r9012J30517l0890K28158I7126J43850p8815J10625a09726B40097
16230A48448k1150m996A2937L18054j2065l6619j15865n882a70903B69509j07424
16219A62085m106e5008B17558j0723O5561E4991L17244k8701A9614a6794A54544
$$ plain form
16207 250311 -32931 239900 239104 25909 555329 111651 140945 491102 134474 245331 216253
16196 216253 361570 -69981 121419 199495 414700 131937 276043 429078 129569 205632
16186 205632 -142363 139372 101098 180397 82371 141975 203698 46989 31717 -178739 75182
16174 337217 133457 17164 494419 -5831 285188 79622 -18170 196225 167110 247649 137340
16163 137340 192536 174711 407111 123461 -105893 118054 -230711 155153 -66240 96205
16152 116254 517103 -5326 228795 308500 245414 -99405 -60825 -93589 -69238 184333 144263
16141 144263 86472 -407658 98799 -100247 337334 157292 292952 229062 209434 437977
16131 437977 156785 67429 208320 375134 -113441 -261442 -29122 -162561 260278 378131
$$ packed form
16207B50311c2931B39900p96B5909N29420A11651K9294L50157A34474J10857k9078
16196B16253J45317f9981A21419P8076K15205A31937J44106J53035A29569P6063
16186B05632a42363A39372l8274P9299H2371N9604O1723D6989j5272a78739G5182
16174C37217A33457A7164M77255e831B85188G9622a8170A96225k9115Q0539j10309
16163A37340N5196j7825K32400A23461a05893A18054b30711A55153f6240I6205
16152A16254M00849e326B28795P9705o3086i9405L8580l2764K4351A84333m0070
16141A44263n7791d07658I8799a00247C37334A57292J35660o3890j9628K28543
16131D37977A56785F7429J40891J66814a13441j48001b9122j33439B60278J17853
$$ plain form
16121 378131 29063 90839 14716 108374 44928 143406 -76834 196312 208852 -2542 146830
16109 -61592 189817 72893 -45126 30917 -176665 -165752 -97456 -144387 3335 118122 -100404
16097 38462 284729 69802 136657 240118 -109399 -85355 19494 105493 13135 47773 -93258
16085 64040 344629 25440 2503 -64380 119950 89197 339218 -47772 -13373 -166384 -105263
16074 -105263 -7958 86696 263664 361513 -205269 69224 -59016 -234664 40902 47426 175145
16063 175145 -115491 265951 370880 144229 248926 146873 264760 54705 -242974 -131118
16053 -131118 341670 17792 175403 204705 23697 243791 465813 71252 55743 242323
16043 242323 426081 -102892 -167794 138489 250189 -202158 -148633 139966 -159745 36505
$$ packed form
16121C78131B9063O1776A4716R3658D4928R8478g6834A96312J2540b542A46830
16109f1592A89817G2893d5126C0917a76665J0913O8296m6931C335J14787a00404
16097C8462K46267F9802O6855J03461a09399K4044A9494Q5999A3135L4638i3258
16085F4040K80589B5440B503f4380A19950l0753K50021d7772a3373j53011O1121
16074a05263g958H6696J76968R7849b05269F9224e9016j75648D0902O524J27719
16063A75145a15491B65951J04929A44229J04697j02053J17887E4705b42974J11856
16053a31118C41670A7792J57611K9302B3697K20094K22022G1252j5509J86580
16043B42323J83758a02892o4902A38489J11700b02158N3525A39966a59745C6505
$$ plain form
16032 -187669 221763 -13105 152221 -101318 222454 24681 -23488 -68777 195140 -127886
16021 -55533 120578 -24882 -247524 -456392 -350215 -278026 -11288 -85926 261693 111871
16010 -12065 -311783 73976 224382 -373411 304580 125895 479625 -113256 -191711 -45568
15999 -77137 -202342 73430 202697 48622 -24706 -35119 -5969 358876 -115343 -176608 -20983
15987 142926 -117155 45113 137307 95390 -80552 180215 168508 -186637 311111 554460
15977 554460 776782 491495 647691 378339 353002 110349 64588 -89121 110866 35854
15966 202957 379499 384 17640 84002 -31146 -78999 27750 -251421 -195125 248852 -503984
15954 -45860 55616 -66353 -88814 182217 36810 -134470 -22662 240440 -149179 -247475 -285448
$$ packed form
16032a87669B21763a3105A52221a01318B22454B4681b3488m5289A95140a27886
16021e5533A20578b4882k22642k08868J06177P2189a1288p4638B61693A11871
16010a2065k99718G3976J50406c73411C04580A25895L53730a13256p8455d5568
15999g7137j25205G3430J29267D8622b4706j0413e969C58876a15343o1265b0983
15987A42926a17155D5113R2194m1917h0552A80215j1707a86637C11111K43349
15977E54460K22322k85287J56196k69352k5337A10349m5761h9121A10866C5854
15966B02957J76542C84J7256O6362c1146m7853B7750b51421N6296B48852e03984
15954d5860E5616f6353k2461A82217C6810a34470b2662B40440a49179r8296l7973
$$ plain form
15943 -285448 -311168 -88983 19061 -135259 59488 240860 -202062 -430852 266457 163847
15933 163847 -63419 -12071 193667 230168 246586 -29793 -142773 -178511 244578 -85762 109785
15921 -28660 -255912 -171395 45763 -229554 -96315 -93740 -237958 -117761 260648 -36336 10459
15909 81106 -646 105351 -203806 220563 -21925 -265780 202457 185859 42888 84400 -239727
15897 81736 -135828 10214 126260 137488 -158942 -136918 190247 -273204 258036 -263527
15886 -23452 69699 36912 86711 33758 55872 -216060 -76442 -142821 -53949 -152280 -281639
15875 -281639 -188976 -66471 -212689 -134622 -48296 57742 144302 140987 117845 260689 -51774
15863 -166988 33330 -106670 174099 231844 325555 -152393 -434513 326576 288123 13197
$$ packed form
15943b85448k5720h8983A9061a35259E9488J81372b02062k28790B66457j02610
15933A63847f3419a2071A93667L6501J6418b9793j12980l5738B44578h5762A09785
15921b8660k27252Q4517D5763b29554i6315K575j44218a17761B60648c6336A0459
15909H1106f46A05351b03806B20563b1925k43855B02457j6598D2888M1512b39727
15897H1736a35828A0214J16046J1228a58942K2024A90247b73204B58036b63527
15886b3452F9699l2787M9799C3758K2114b16060g6442o6379e3949r8331j29359
15875b81639R2663f6471j46218P8067d8296E7742Q6560l315k3142J42844e1774
15863a66988C3330a06670A74099N7745R3711a52393k82120C26576l8453A3197
$$ plain form
15852 -55503 31102 96535 221767 146255 -259424 -50913 87005 127237 -222453 107463 -100689
15840 -346771 -258692 -143012 171345 19519 98476 -182503 -25655 76324 -113347 114858
15829 -194863 -220051 155538 117266 -481971 288843 295944 157991 49042 -209228 -27636 -304770
15818 -304770 35779 97202 17654 -272325 -98330 204573 -40142 119588 -78095 -120877 208896
15806 120449 253899 -397869 -123509 -207364 -210302 -127268 -227999 53286 -162333 -288488
15796 -288488 71059 -206759 4506 79402 1059 -135620 218688 103048 -140936 38218 -429306
15784 -247513 -134345 -35489 -326639 -241709 -686 -117519 38246 111229 301017 -10141 5635
15772 30443 -92481 -100593 -133683 72872 152332 58532 98283 141745 183736 -39064 -53609 147640
$$ packed form
15852e5503C1102O5433J25232p5512b59424e0913H7005M0232b22453A07463a00689
15840c46771Q8079J15680A71345A9519P8957a82503b5655G6324a13347A14858
15829a94863k5188A55538l8272d81971B88843P101j37953D9042b09228b7636k77134
15818c04770C5779O1423A7654b72325i8330B04573d0142A19588g8095m2782B08896
15806A20449J33450c97869a23509q3855k938Q3034j00731E3286a62333j26155
15796b88488G1059b06759D506P4896A059a35620B18688A03048a40936C8218d29306
15784b47513J13168c5489k91150Q4930f86j16833C8246P2983J89788a0141E635
15772C0443i2481q112l3090G2872P9460E8532L9751M3462M1991c9064j4545A47640
$$ plain form
15759 -108575 184859 -88183 244109 284752 141903 -124675 -78482 79764 -239694 -264028
15749 -264028 52503 -33519 44442 -39611 -61671 -57332 -45588 -46498 142821 286440 185326
15738 185326 -54593 75577 -6414 -165918 -188138 -319250 245822 167948 -38994 -321700 130152
15726 175425 -36192 108355 -117189 73725 -6346 179908 -98222 -267983 180298 -91234 104916
15714 -40587 74417 -88215 -299132 -122263 -223368 -177656 -127494 -23245 -78786 81237 19447
15702 -198519 -191918 -191247 124671 -102155 177964 -211570 -359229 -362463 -173492 -125009 212016
15690 -277290 180023 -207641 34396 -530755 -166588 54682 -124220 -69807 40818 -122461
15679 -63131 -152321 -104039 -210514 -42492 5630 -112051 8573 92900 351511 298172 -91030
$$ packed form
15759a08575A84859h8183B44109M0643A41903a24675M6193G9764b39694k4334
15749b64028E2503c3519D4442c9611k2060M339J1744r10A42821J43619j01114
15738A85326e4593G5577f414j59504k2220j31112B45822p7874c8994k82706A30152
15726A75425c6192A08355a17189G3725f346A79908i8222j69761A80298i1234A04916
15714d0587G4417h8215k10917a22263j01105M5712N0162b3245n5541H1237A9447
15702a98519O601O71A24671a02155A77964b11570j47659l234a73492M8483B12016
15690b77290A80023b07641C4396e30755a66588E4682a24220N4413D0818a22461
15679f3131q9190M8282j06475d2492E630a12051H573Q4327K58611n3339i1030
$$ plain form
15667 62268 159548 1793 -249413 193291 -155485 56288 -155719 -504068 -74640 -58797 67919
15655 -342402 77159 -107721 58674 -26090 -319237 191533 -236661 -54986 262257 -284470
15644 -123396 -273258 98745 87736 451702 -53251 -24118 -222386 -208926 101857 256242
15634 256242 171724 -91359 18271 -20583 -277915 -43712 -47692 -271203 337304 -20710 328888
15622 -89011 -38864 59466 -40716 172892 144607 -12771 -19575 -15950 232448 -273270 -227319
15611 -227319 -251673 -336034 -118161 -6345 -143564 51381 182428 -55412 -22438 -249655 -87174
15599 -252201 84995 -157461 -22735 60183 2859 -238319 142452 -64398 -246189 -167131 193135
15587 66418 113922 235905 319140 -136610 -92199 14576 -10491 239529 87108 -231714 357956
$$ packed form
15667F2268R7280A793b49413A93291a55485E6288a55719l48349g4640J5843F7919
15655c42402G7159a07721E8674b6090k93147A91533b36661e4986B62257b84470
15644a23396j49862I8745j1009L63966e3251b4118j98268J3460A01857J54385
15634B56242q4518i1359A8271b0583k57332d3712l980k23511C37304b0710C28888
15622h9011c8864E9466d0716A72892k8285a2771o804L625B32448b73270M5951
15611b27319k4354q4361a18161f345j37219E1381J31047e5412b2438k27217h7174
15599b52201H4995a57461b2735F0183B859b38319A42452f4398j81791P9058A93135
15587F6418M7504J21983Q3235a36610M4411A4576a0491B39529H7108b31714C57956
$$ plain form
15575 188081 -129451 182065 -57017 217000 33210 44109 2667 404679 84854 194740 -177780
15563 124686 218233 388688 288599 21658 108119 216390 -14417 183360 -21815 -144297
15553 -144297 123698 -301945 187998 -120869 345438 176532 -128201 15708 230394 368029
15543 368029 336041 31207 49384 -114117 104850 115995 -82178 271063 322980 -66865 197614
15531 108624 7019 159252 163915 -134045 309209 92801 391936 5821 339914 139517 -173205
15519 244945 -25688 282549 230900 72866 24318 -40834 -254569 102339 24612 -7051 190388
15507 -142743 -249002 283375 -21558 -324899 -78314 -12705 -240492 134112 -124249 -26109
15496 -188106 96418 45088 58557 -197577 -223199 119163 129403 -66420 222790 -354137 -39151
$$ packed form
15575A88081a29451A82065e7017B17000C3210J0899B667M02012H4854J09886a77780
15563A24686R3547J70455j00089B1658Q6461J08271a4417A83360b1815j22482
15553a44297A23698c01945A87998a20869C45438j68906a28201A5708K14686J37635
15543C68029l1988C1207J8177a14117A04850J1145h2178B71063N1917f6865A97614
15531A08624G019J52233M663a34045C09209I2801K99135E821L34093A39517a73205
15519B44945b5688B82549n1649G2866B4318d0834k13735A02339B4612g051A90388
15507a42743j06259B83375b1558l03341g8314a2705k27787A34112a24249b6109
15496a88106I6418D5088J3469a97577k5622A19163J0240f6420B22790c54137c9151
$$ plain form
15484 -191766 118830 -120929 233319 163326 90834 -157896 -148051 55594 -116419 -23432 182064
15472 133149 578782 225465 34872 99855 -61073 52540 145261 43362 -27190 -16047 -277825
15461 -277825 124021 334655 46620 -179252 -293821 506775 175042 208184 -46321 -255912
15451 -255912 -106159 -111271 61391 -20591 -87804 126531 284059 153982 222115 268559 177227
15440 177227 421011 17748 603722 306699 413405 163904 140994 126601 -126166 76037
15429 -23484 -210866 161410 191608 -391036 -3266 58705 467217 98510 -197549 -132848 24556
15417 -31633 -278438 63220 -200275 -145785 -146512 147359 -68831 253695 398483 -185220 161237
15405 15355 130745 8550 -150280 -64941 235080 -30438 10699 142042 -333173 210860 -10492
$$ packed form
15484a91766A18830a20929B33319o9993p2492a57896R845E5594a16419b3432A82064
15472A33149M45633B25465C4872O4983f1073E2540R2721D3362b7190J1143k61778
15461b77825A24021K10634D6620a79252j14569E06775A75042L3142d6321k09591
15451b55912a06159n112F1391b0591o7213A26531J57528j30077O8133M6444r1332
15440A77227K43784A7748N85974k97023J06706A63904k2910j4393a26166G6037
15429b3484j87382A61410L0198c91036c266E8705M08512I8510a97549O4701B4556
15417c1633k46805F3220b00275N4490p27A47359f8831B53695J44788a85220A61237
15405A5355J15390H550a50280f4941B35080c0438A0699J31343c33173B10860a0492
$$ plain form
15393 -304725 401978 70531 40119 -58971 -151958 -165046 153788 -152946 -114564 233728 -97025
15381 -256272 -12999 -229903 6109 129606 -61719 -64125 268880 145102 -85509 266807 -107224
15369 -244869 10508 96283 -145997 -25660 131792 -73700 -172960 135892 185242 164459 112669
15358 112669 64103 115433 203931 -76924 -11779 -90997 270515 173845 -191175 225020 -218056
15346 -153097 233193 67077 136627 187093 -117169 -10863 225372 -156648 -20981 239554
15335 255803 129934 57542 -223679 254605 76700 30442 213486 141324 297978 156987
15325 156987 135872 -44655 -95131 129784 53647 -111381 346147 279445 102212 83310 -95407
15313 83110 90207 -40869 198669 -11878 -82066 36666 245917 35458 80896 220098 65676
$$ packed form
15393c04725D01978G0531l0412e8971r2987j3088A53788a52946L8382B33728i7025
15381b56272a2999k16904F109J23497f1719k406B68880j23778h5509B66807a07224
15369b44869A0508Q5775a45997b5660A31792g3700r9260A35892M9350k0783n1790
15358A12669m8566N1330Q8498g6924a1779p9218B70515r6670a91175B25020b18056
15346a53097B33193F7077O9550N0466a17169a0863B25372a56648b0981B39554
15335B55803j25869E7542b23679B54605G6700C0442J83044p2162J56654j40991
15325A56987k1115d4655n0476A29784E3647a11381C46147o6702A02212j8902i5407
15313H3110P097d0869A98669a1878p0188C6666K09251C5458M5438J39202F5676
$$ plain form
15301 43627 331000 277739 374836 -25539 -51834 56267 -109960 57510 60633 101174 -124448
15289 -54491 -152235 -247767 -68714 11355 177027 320457 -37623 46961 105001 88601 -300454
15277 -22467 -337599 -179735 -3474 -285047 -83363 58520 -136975 -163269 12507 24019 -134828
15265 176116 297606 333816 -16259 43267 193677 220716 24427 -135950 132260 50172 -115974
15253 378217 120594 21927 51147 137680 93492 -140109 108405 137268 60026 92226 -25074
15241 -33772 69948 -37709 143826 425893 307356 273885 604997 434633 1283155 2536886
15231 2536886 3921399 2421325 3735117 2576145 498904 85233 125347 376436 -36551
15221 -130547 -187380 -52749 152744 -222444 -104780 -78658 130117 255708 -92349 -139500
$$ packed form
15301D3627K87373n3261R7097b5539k6295E6267a09960E7510L123M0541a24448
15289e4491r7744r5532f8714A1355J65672J43430c7623D6961N8040j6400c00454
15277b2467l15132J57864c474k81573h3363E8520a36975k6294A2507J1512a34828
15265A76116J21490L6210a6259D3267J50410K7039B4427a35950A32260E0172a15974
15253C78217A20594B1927K9220Q6533m4188a40109A08405K8863F0026L2200b5074
15241c3772F9948c7709A43826K82067j18537l3471L31112j70364Q48522J253731
15231B536886J384513j500074J313792j158972D98904H5233M0114K51089c6551
15221a30547n6833e2749A52744b22444a04780K6122A30117J25591i2349m7151
$$ plain form
15211 -139500 -128983 270767 290047 54943 -203877 -64410 150396 -83702 195605 162614 55076
15199 104335 75471 -142790 -184872 -305352 230191 42810 205465 -200370 2487 -144911
15188 320198 114296 208662 60624 233522 469928 3461 -212194 85418 2686 334271 950
15176 -128010 87670 -389761 77168 66942 -48447 -40824 69257 82239 227939 149460 230973
15165 230973 134760 12078 -14750 -128273 125014 42886 138475 176012 -124044 170308 263912
15154 263912 -65785 209547 -217309 -44771 214151 551334 27797 131821 256689 191459
15144 191459 253950 17333 -166474 -20462 78255 148209 -31829 34253 71245 317532 -247360
15132 169122 261763 86474 229634 -41820 336945 34376 -93464 155443 244613 521995 256468
$$ packed form
15211a39500J0517B70767J9280E4943b03877f4410A50396h3702A95605l2991E5076
15199A04335k8864a42790m2082j20480B30191D2810J62655b00370B487a44911
15188C20198A14296R4366F0624J72898K36406C461b12194H5418B686L31585I50
15176a28010H7670c89761G7168j0226d8447P623F9257J2982J45700p8479Q1513
15165B30973r6213A2078a4750j13523A25014D2886R5589L7537a24044A70308R3604
15154B63912f5785B09547b17309d4771B14151L37183B7797J04024J24868o5230
15144A91459O2491A7333a66474b0462G8255O9954c1829C4253L6992K46287b47360
15132A69122R2641H6474J43160d1820C36945C4376i3464A55443Q9170K77382B56468
$$ plain form
15120 404358 426726 -74442 426520 148305 65561 364524 103767 38978 47211 42464 106925
15109 106925 189700 368753 272266 344763 517999 900066 386263 113097 294751 279341
15099 279341 484393 532148 48800 -116982 196152 -187178 166172 131683 -409541 70981
15088 230177 48586 -6315 81135 156268 149180 439755 67401 257671 338608 369339 -90745
15076 9587 58911 -54706 14191 35317 65937 67279 330069 167208 167994 414463 181473 98861
15064 98861 244166 60266 -57231 120716 279545 197805 407797 401329 406910 118272 268432
15053 268432 345737 96251 433749 240891 -92326 -176485 509492 603292 201017 115256 321604
15042 321604 115836 231839 83651 -169906 188263 204586 330703 286879 110635 167286
$$ packed form
15120D04358K2368g4442D26520A48305F5561K98963A03767C8978Q233m747O4461
15109A06925Q2775J79053r6487P2497J73236L82067C86263A13097J81654j5410
15099B79341K05052M7755D8800a16982A96152a87178A66172l4489d09541G0981
15088B30177D8586f315H1135P5133p088K90575F7401J90270Q0937L0731i0745
15076I587M9324e4706A4191K1126L0620J342K62790j62861P86K46469A81473q2612
15064I8861J45305F0266e7231A20716J58829q1740K09992o468N581A18272J50160
15053B68432P7305I6251L37498j92858i2326q4159E09492R3800B01017q5761K06348
15042C21604A15836J16003H3651a69906A88263J6323J26117m3824A10635N6651
$$ plain form
15032 167286 594470 434456 68351 448916 315629 287925 430418 438287 311998 397714
15022 397714 316930 424606 102996 486938 235312 184959 202666 -116662 320463 280439
15012 280439 221587 400131 33166 523308 249540 444792 281614 467129 165164 143961
15002 143961 427418 57451 48096 -38327 178419 365563 433707 427151 265790 301736 125340
14990 320280 326902 601982 384875 241762 224883 359587 458698 206633 -31738 407149
14979 235740 712925 184548 311112 502174 236978 92467 530111 567818 364969 288792
14969 288792 61357 411454 195297 23944 173750 237532 46892 293010 174389 219929
14959 219929 131361 566330 -60047 370304 462523 201525 133359 227901 206462 630105 264299
$$ packed form
15032A67286M27184j60014F8351L80565j33287k7704J42493P869j26289Q5716
15022C97714q0784J07676A02996L83942B35312n0353J7707a16662C20463m0024
15012B80439n8852J78544C3166M90142B49540J95252j63178J85515A65164k1203
15002A43961K83457E7451r355c8327A78419J87144O8144o556j61361L5946A25340
14990C20280O622K75080k17107j43113j6879J34704R9111B06633c1738D07149
14979B35740M77185A84548J26564J91062B36978I2467M37644L7707k02849p6177
14969B88792F1357L50097A95297B3944J49806O3782D6892K46118j18621M5540
14959B19929q8568M34969f0047C70304R2219B01525o8166R4542k1439M23643B64299
$$ plain form
14947 404393 231668 811288 67872 581406 558670 354112 340585 509241 128 216744 241089
14936 241089 290972 161590 414752 589223 335685 68377 328483 440338 508646 712998
14926 712998 411812 730846 429831 969009 589025 247886 397273 467784 739728 920737
14916 920737 647385 1146359 912207 718552 1018891 568269 936570 345708 526279 150685
14905 415180 626840 413444 -3034 432027 383855 432081 294520 388116 370338 275353 323892
14894 323892 316390 327386 -82654 417331 725965 197818 399760 366023 243261 319055 512745
14883 512745 290716 618181 480613 643197 755306 348063 518156 438657 264083 257024
14873 257024 374185 233602 704929 663697 189443 318822 539875 510922 381953 747951
$$ packed form
14947D04393j72725N79620F7872N13534k2736k04558j3527J68656A28K16616K4345
14936B41089M9883j29382K53162J74471k53538F8377K60106J11855O8308K04352
14926G12998l01186L19034l01015N39178l79984B47886J49387P0511K71944J81009
14916I20737k73352M98974k34152j93655L00339m50622L68301C45708J80571A50685
14905D15180K11660k13396c034D32027m8172M8226j37561R3596j7778r4985M8539
14894C23892p502J0996h2654D17331L08634A97818K01942l3737j22762P5794J93690
14883E12745k22029L27465j37568J62584J12109C48063J70093p9499j74574p059
14873B57024J17161j40583M71327m1232A89443J29379K21053k8953j28969L65998
$$ plain form
14863 747951 249393 437242 375670 562237 307071 74941 -7682 344179 317407 506413
14853 506413 255155 308701 758097 759260 542690 411845 805456 433025 352058 996568
14843 996568 665450 315339 1000926 719824 622802 821195 710885 729764 702673 1056734
14833 1056734 614987 326111 711231 622820 606246 655828 332326 582099 569254 412040
14823 412040 369890 751317 211431 415204 730180 399407 653773 657299 625877 400805
14813 400805 623107 442037 256056 384034 812000 442161 795246 635894 853741 724285
14803 724285 699796 739900 645959 531476 564651 790906 260591 521341 446097 688980
14793 688980 491996 736336 615012 437401 660522 682636 581426 181632 764103 155205
$$ packed form
14863G47951B49393J87849o1572J86567k55166G4941g682C44179k6772J89006
14853E06413k51258N3546M49396J163k16570j30845L93611l72431q0967O44510
14843I96568l31118C15339O85587k81102r7022J98393j10310J8879k7091L54061
14833A056734m41747k88876L85120q8411j6574M9582l23502K49773j2845j57214
14823D12040m2150L81427B11431K03773L14976l30773K54366L526l1422k25072
14813D00805K22302j81070j85981J27978M27966l69839L53085j59352K17847j29456
14803G24285k4489M0104r3941j14483L3175K26255B60591K60750p5244K42883
14793F88980j96984K44340j21324j77611K23121K2114j01210A81632N82471A55205
$$ plain form
14782 281248 377408 435989 477182 367935 687936 598302 725099 1012421 921668 745176
14772 745176 693845 677414 383418 652356 441857 610224 245339 666726 980385 530005
14762 530005 564143 343067 507401 613342 465392 694755 769442 591656 628152 765506
14752 765506 445184 434895 327213 648501 828976 541623 658445 587968 800571 867391
14742 867391 428639 732677 800747 767675 884458 632242 626137 963968 795220 658354
14732 658354 529468 1107633 849281 823364 460724 1053745 924708 969776 999245 961218
14722 961218 907702 1012449 986124 870365 799001 984782 985178 611011 656740 799788 756990
14711 756990 755361 720889 1066667 844215 841672 1234981 1259627 418309 1027648 648156 971869
$$ packed form
14782B81248R6160N8581M1193j09247L20001q9634J26797K87322r0753j76492
14772G45176n1331j6431k93996K68938k10499J68367B45339M21387L13659m50380
14762E30005L4138k21076J64334J05941j47950K29363P4687j77786L6496J37354
14752G65506l20322j0289j07682L21288J80475k87353J16822p0477K12603O6820
14742H67391D28639L04038O8070l3072J16783k52216o105L37831j68748j36866
14732F58354j28886N78165k58352k5917l62640N93021j29037M5068K9469l8027
14722I61218n3516J04747k6325j15759p1364J85781L96l74167M5729J43048m2798
14711G56990j629l4472L45778k22452k543L93309K4646D18309O09339l79492L23713
$$ plain form
14700 971869 1208597 981216 1323836 1482010 1196502 1239983 1299687 1165541 929515 715963
14690 715963 713658 837862 865614 992174 745396 1095140 1060819 753309 769292 673993 854146
14679 854146 1128937 936651 709712 1059198 1007277 1102587 893706 1164635 1148409 1316162
14669 1316162 1461568 1238376 1425486 962791 878169 1098272 790428 1074187 857429 827970
14659 827970 1311409 1118964 1094269 1277850 1282071 1095906 1156080 1258243 1401371 787949
14649 787949 1348323 1557513 1290442 1274685 1191199 999313 1379519 1205803 1314169 915990
14639 915990 1155068 1287543 1335167 894243 1219021 1071014 1537627 1350563 1314885 1113014
14629 1113014 1322485 1213168 1226390 1251478 1427263 1101808 1350501 1106110 1496444 1005689
$$ packed form
14700I71869K36728k27381L42620J58174k85508M3481N9704j34146k36026k13552
14690G15963k305J24204K7752J26560k46778L49744l4321l07510J5983r5299J80153
14679H54146K74791j92286k26939L49486n1921R5310k08881K70929j6226J67753
14669A316162J45406k23192J87110m62695q4622K20103l07844K83759k16758k9459
14659H27970M83439j92445k4695J83581M221j86165O0174J02163J43128o13422
14649G87949N60374K09190k67071j5757q3486j91886L80206j73716J08366l98179
14639I15990K39078J32475M7624m40924L24778j48007M66613j87064l5678k01871
14629A113014K09471j09317J3222K5088J75785l25455K48693k44391L90334m90755
$$ plain form
14619 1005689 1295373 1410854 1484258 1548560 1426888 1879316 1682287 1186651 1991167 1539803
14609 1539803 1228293 1535311 1808815 1456221 1374464 1549546 1522264 1558428 1331403 1508818
14599 1508818 2041689 1474066 1637751 1630149 1818299 1674474 1482691 1466591 1663050 1697533
14589 1697533 1861171 1780788 1695915 1865734 1907491 2103502 1914916 2059563 1862602 1530966
14579 1530966 1835063 2006166 2091177 1902038 1989230 2110051 1955349 2221032 2534632 2566287
14569 2566287 2272504 2331477 2284734 2691606 2602604 2513172 2798673 2723232 2505663 2773190
14559 2773190 3001490 2985476 3053855 3255087 3222096 3807622 3997573 4321917 5144729 5793916
14549 5793916 7900384 11624171 19423102 40922495 44783414 16791318 6093559 3620843
$$ packed form
14619A005689K89684J15481P3404O4302j21672M52428j97029m95636Q04516m51364
14609A539803l11510L07018K73504l52594q1757J75082k7282L6164k27025J77415
14599A508818N32871n67623J63685p602J88150j43825j91783j6100J96459L4483
14589A697533J63638q0383q4873J69819M1757J96011j88586J44647j96961l31636
14579A530966L04097J71103Q5011j89139Q7192J20821j54702K65683L13600L1655
14569B566287k93783N8973m6743M06872q9002q9432K85501p5441k17569K67527
14559B773190K28300j6014O8379K01232l2991N85526J89951L24344Q22812O49187
14549E793916K106468L723787P798931K1499393L860919A6791318F093559k472716
$$ plain form
14541 3620843 2815850 2244548 2231502 2300156 2059601 2111017 1956646 2234074 2276648 2409982
14531 2409982 2805233 2727769 3072925 3984489 6961910 8918197 4189494 2495472 2429346
14522 2429346 2696736 2437066 2548449 2443713 2878036 2523955 2566615 2813810 2522873 2731383
14512 2731383 2369112 2783267 2746712 3196658 2665515 2954739 2752366 2953485 3287029 3161787
14502 3161787 2857424 3134325 3379558 3071038 2848671 3375159 3225385 3117331 3628338
14493 3628338 3315964 3417620 3583326 3578020 3650689 3846756 3342958 3630066 3733790 3876227
14483 3876227 3885165 3622886 4204877 3600574 4044625 3972060 4222889 4135048 4373918 4380085
14473 4380085 4329326 4522653 4405046 4339445 4630964 4594671 4609223 4479022 5007180 4818117
$$ packed form
14541C620843q04993n71302j3046O8654k40555N1416j54371K77428M2574J33334
14531B409982L95251p7464L45156R11564K977421J956287D189494j694022o6126
14522B429346K67390k59670J11383j04736M34323l54081M2660K47195k90937K08510
14512B731383l62271M14155l6555M49946n31143K89224k02373K01119L33544j25242
14502C161787l04363K76901K45233l08520k22367N26488j49774j08054N11007
14493C628338l12374J01656J65706n306P2669J96067n03798K87108J03724J42437
14483C876227Q938k62279N81991o04303M44051p2565K50829q7841K38870O167
14473D380085n0759J93327j17607o5601K91519l6293J4552j30201N28158j89063
$$ plain form
14463 4818117 4901822 4851381 4763786 4865641 5025716 4955819 4908009 5150446 4973240 5076963
14453 5076963 5285628 5273492 5631207 5826149 5839482 5647973 5362026 5599518 5828790 6082851
14443 6082851 5825660 5950566 5870426 6184523 6181361 6330290 6437233 6706131 6402959 6503900
14433 6503900 6531098 6546891 6970523 6929856 7015752 7298197 7013692 7468422 7589107 7708282
14423 7708282 7824758 7501778 7795041 8098876 8179967 8345485 8058414 8480432 8739920 8788251
14413 8788251 8564873 8935081 9134191 9268711 9335049 9098118 9589011 9909767 10088319 10023657
14403 10023657 10056475 10570526 10692975 10996428 11056266 11051656 11013829 11310612 11607430 11636116
14393 11636116 11732670 12373562 12685325 12979435 13283450 13114641 13326205 13517577 13847385
$$ packed form
14463D818117Q3705n0441q7595J01855J60075o9897m7810K42437j77206J03723
14453E076963K08665j2136L57715J94942J3333j91509k85947K37492K29272K54061
14443F082851k57191J24906q0140L14097l162J48929J06943K68898l03172J00941
14433F503900K7198J5793M23632m0667Q5896K82445k84505M54730J20685J19175
14423G708282J16476l22980K93263L03835Q1091J65518k87071M22018K59488M8331
14413H788251k23378L70208J99110J34520O6338k36931M90893L20756J78552o4662
14403A0023657L2818N14051J22449L03453N9838m610l7827K96783K96818K8686
14393A1636116R6554O40892L11763K94110L04015j68809K11564J91372L29808
$$ plain form
14384 13847385 13859813 14354729 14650352 15008266 14839272 15583727 15552532 15921081 16391960 16514525
14374 16514525 16719048 17239357 17542214 17732657 18017338 18742679 19048870 19088297 19776324
14365 19776324 20002326 20711478 21095002 21556247 22135516 22535400 22801760 23554984 23962604
14356 23962604 24221211 24952688 25647333 26289099 27026872 27454340 28200941 28796549 29667965
14347 29667965 30551512 31445491 32191309 32754091 33713383 34648120 35531435 36680168 37738142
14338 37738142 38622292 39947321 40981891 42477380 43307784 44717253 46400000 47557735
14330 47557735 48713692 50332980 52087801 53797980 55752243 57511647 59510250 61373005
14322 61373005 63773632 65921921 68286446 70438151 72984473 75754177 78793151 81693157
$$ packed form
14384A3847385J2428M94916K95623L57914j68994P44455l1195L68549M70879J22565
14374A6514525K04523N20309L02857J90443K84681P25341L06191L9427O88027
14365A9776324K26002P09152L83524M61245N79269L99884K66360P53224M07620
14356B3962604K58607P31477O94645O41766P37773M27468P46601N95608Q71416
14347B9667965Q83547Q93979P45818N62782R59292R34737Q83315J148733J057974
14338C7738142Q84150J325029J034570J495489Q30404J409469J682747J157735
14330D7557735J155957J619288J754821J710179J954263J759404J998603J862755
14322F1373005K400627K148289K364525K151705K546322K769704L038974K900006
$$ plain form
14314 81693157 84971459 88286866 91681815 95784410 99700232 103600065 108269325 112703617
14306 112703617 118020189 123099478 128427715 134406765 140557195 146939860 153587549 160973798
14298 160973798 168734388 176658567 185375000 194575404 204048938 214105068 224568909 235891939
14290 235891939 247267666 259672208 272729786 285613549 299310628 313325793 327687380
14283 327687380 342018171 356513452 370878361 385224635 398808117 411731392 423857135
14276 423857135 434714964 444019845 451334622 455307533 457128240 458277811 458800660 457199660
14268 457199660 452195463 446776099 437858614 426162255 413415578 399631760 384972623
14261 384972623 369685333 354161700 338552387 323127207 307879813 293038890 278647112
$$ packed form
14314H1693157L278302L315407L394949M102595L915822L899833M669260M434292
14306A12703617N316572N079289N328237N979050O150430O382665O647689P386249
14298A60973798P760590P924179Q716433R200404R473534J0056130J0463841J1323030
14290B35891939J1375727J2404542J3057578J2883763J3697079J4015165J4361587
14283C27687380J4330791J4495281J4364909J4346274J3583482J2923275J2125743
14276D23857135J0857829R304881P314777L972911J820707J149571N22849j601000
14268D57199660n004197n419364q917485j1696359j2746677j3783818j4659137
14261C84972623j5287290j5523633j5609313j5425180j5247394j4840923j4391778
$$ plain form
14254 278647112 264712588 251788704 238873958 226688092 215573014 204843529 194040802
14247 194040802 184719718 175535245 167095453 159637074 151710021 144051475 137383546 130728411
14239 130728411 125117663 124629083 118814730 112383242 107203259 102303224 97920502 94221244
14231 94221244 90746831 86945371 83333389 80380797 76903891 74179152 71610418 68446924
14223 68446924 66232302 64094951 61486196 60027572 57749365 55925553 53692369 51903703
14215 51903703 50429016 49215259 47859497 46498781 44994362 43386674 42280410 41006548
14207 41006548 40863374 39572392 38457669 36927806 35653808 34732959 34370021 33464499 32483256
14198 32483256 31655758 30807102 29661812 29142926 28957708 27685666 27147773 26558614 25836386
$$ packed form
14254B78647112j3934524j2923884j2914746j2185866j1115078j0729485j0802727
14247A94040802r321084r184473q439792p458379p927053p658546o667929o655135
14239A30728411n610748m88580n814353o431488n179983m900035m382722l699258
14231I4221244l474413l801460l611982k952592l476906k724739k568734l163494
14223F8446924k214622k137351k608755j458624k278207j823812k233184j788666
14215E1903703j474687j213757j355762j360716j504419j607688j106264j273862
14207D1006548j43174j290982j114723j529863j273998r20849l62938r05522r81243
14198C2483256q27498q48656j145290n18886j85218j272042n37893n89159p22228
$$ plain form
14189 25836386 25046680 24693793 23927749 23515352 23003458 22579925 22298614 21183649 20960418
14180 20960418 20739595 20582426 19666675 19127149 19245128 18477514 18426807 18125841 17521342
14171 17521342 17206673 16792708 16619394 16289690 15882788 15492919 15421627 15054522 14965010 14498183
14161 14498183 14185361 13996110 13935041 13508539 13105671 13099128 13017885 12553844 12618896 12169929
14151 12169929 11980384 11787790 11834074 11547914 11280918 11236197 11141767 10798979 10271024 10839554
14141 10839554 10291494 10035142 10179216 9777074 9721343 9641975 9490730 9335855 9408814 9013589
14131 9013589 9080388 8928463 8782524 8558066 8475348 8058860 8390881 8333455 8018926 8069935
14121 8069935 7819536 7775726 7763271 7549297 7563528 7155655 7267957 7143403 7231100 6797321
$$ packed form
14189B5836386p89706l52887p66044m12397n11894m23533k81311j114965k23231
14180B0960418k20823j57169r15751n39526J17979p67614n0707l00966o04499
14171A7521342l14669m13965j73314l29704m06902l89869p1292l67105q9512m66827
14161A4498183l12822j89251o1069m26502m02868o543q1243m64041O5052m48967
14151A2169929j89545j92594M6284k86160k66996m4721r4430l42788n27955N68530
14141A0839554n48060k56352J44074m02142n5731p9368j51245j54875P2959l95225
14131I013589O6799j51925j45939k24458q2718m16488L32021n7426l14529N1009
14121H069935k50399m3810j2455k13974J4231m07873J12302j24554Q7697m33779
$$ plain form
14111 6797321 6422845 6542696 6581692 6468050 6385756 6355274 6441719 5913047 6350924 6137509
14101 6137509 6191573 5996061 5768382 5717240 5691907 5809681 5519656 5232179 5168194 5502519
14091 5502519 5255667 5279235 5446777 5093449 5170810 5146855 4799274 4876881 4589524 4690848
14081 4690848 4499000 4640496 4467288 4614767 4591222 4327324 4137404 4597832 4360225 4397695
14071 4397695 4649749 4615101 4030144 4033141 4057482 4205072 3839679 3685345 3946871 3799880
14061 3799880 3478162 3919887 3673936 3432754 3517303 3402026 3402870 3796926 3544256 3801230
14051 3801230 3273851 3466588 3310867 3432281 3146863 3149513 3251236 3265689 3243480 3121356
14041 3121356 3245790 3156569 2837598 2803881 3395898 2776262 2968493 3007576 3276441 2772429
$$ packed form
14111F797321l74476J19851L8996j13642q2294l0482Q6445n28672M37877k13415
14101F137509N4064j95512k27679n1142k5333J17774k90025k87477o3985L34325
14091E502519k46852K3568J67542l53328P7361k3955l47581P7607k87357J01324
14081D690848j91848J41496j73208J47479k3545k63898j89920M60428k37607L7470
14071D397695K52054l4648n84957K997K4341J47590l65393j54334K61526j46991
14061C799880l21718M41725k45951k41182Q4549j15277Q44L94056k52670K56974
14051C801230n27379J92737j55721J21414k85418K650J01723J4453k2209j22124
14041C121356J24434q9221l18971l3717N92017o19636J92231L9083K68865n04012
$$ plain form
14031 2772429 3016922 2980316 2990923 3161460 3017844 2884817 2629663 2584550 2980680 2839634
14021 2839634 2688991 2536416 2774652 2506277 2584589 2636290 2906743 2731385 2589038 2374725
14011 2374725 2315130 2282324 2505350 2194141 2514711 2539215 2345942 2213362 2238102 2043569
14001 2043569 2190452 2168224 2337911 2426693 2017119 2214346 2378476 2630328 2610626 2303168
13991 2303168 2522526 3045776 4122318 6892776 12624401 31269099 49861673 24188464
13982 11392768 7159482 5542544 4568114 3938811 3527667 3400764 3289239 3003608 2665488
13973 2665488 2567980 2551799 2709271 2319976 2363630 2286204 2197191 2062183 2322278 2260535
13963 2260535 2313964 2452605 2359332 1987071 2111172 2209959 2127814 1975408 1685220 1719220
$$ packed form
14031B772429K44493l6606J0607J70537j43616j33027k55154m5113L96130j41046
14021B839634j50643j52575K38236k68375P8312N1701K70453j75358j42347k14313
14011B374725n9595l2806K23026l11209L20570K4504j93273j32580K4740j94533
14001B043569J46883k2228J69687Q8782m09574J97227J64130K51852j9702l07458
13991B303168K19358N23250J076542K770458N731625J8644698J8592574B4188464
13982A1392768m233286j616938r74430o29303m11144j26903j11525k85631l38120
13973B665488r7508j6181J57472l89295M3654p7426q9013j35008K60095o1743
13963B260535N3429J38641r3273l72261J24101R8787q2145j52406k90188L4000
$$ plain form
13953 1719220 1677437 1950678 1816332 1889470 1777596 1572176 2009741 1853422 1801942 2089621
13943 2089621 1620637 1886375 1689055 1797929 1758817 1641240 1812091 1499594 1385339 1403845
13933 1403845 1633282 1696273 1581214 1771789 1728596 1824709 1731707 1826416 1994847 1598631
13923 1598631 1145295 1321496 1345695 1629662 1182117 1487622 1175330 1648183 1512503 1504935
13913 1504935 1411089 1176777 1759056 1371938 1438650 1330225 1523696 1437961 1863762 1346895
13903 1346895 1597270 1272211 1269155 1408046 1468971 1205495 1203974 1204172 1245727 1591562 1721785
13892 1721785 1154901 1140206 1184973 1268619 1525284 1331947 988291 1195703 1326741 1256352
13882 1256352 1322621 1102892 1295504 1408122 976565 1175554 1246470 1095908 877904 1336410
$$ packed form
13953A719220m1783K73241j34346P3138j11874k05420M37565j56319n1480K87679
13943B089621m68984K65738j97320J08874l9112j17577J70851l12497j14255J8506
13933A403845K29437O2991j15059J90575m3193R6113r3002R4709J68431l96216
13923A598631m53336J76201K4199K83967m47545L05505l12292M72853j35680p568
13913A504935r3846k34312N82279l87118O6712j08425J93471q5735M25801n16867
13903A346895K50375l25059l056J38891O0925k63476j521J98M1555L45835J30223
13892A721785n66884j4695M4767Q3646K56665j93337l43656K07412J31038p0389
13882A256352O6269k19729J92612J12618m31557J98989P0916j50562k18004M58506
$$ plain form
13872 1336410 1273793 1388381 1014173 696507 1243091 932397 1230413 893669 958736 1216771
13862 1216771 1077150 1492601 1158126 1060546 837623 1024229 1074814 919782 779602 956952
13852 956952 1097822 964230 1254236 896304 1058154 1188926 1231311 1281521 1034925 1016880
13842 1016880 947918 975510 977828 855799 840018 962211 829602 865509 1098211 947344
13832 947344 875950 950256 1019820 616232 887352 1016566 921589 885988 1171958 935467
13822 935467 967303 891857 784245 919260 868707 907170 775671 1049579 1103161 798478
13812 798478 748365 761759 1042820 654206 788289 916830 789644 910861 1064690 819438
13802 819438 788110 568999 792535 754579 595673 864386 660733 882470 881033 536594
$$ packed form
13872A336410o2617J14588l74208l17666N46584l10694K98016l36744O5067K58035
13862A216771j39621M15451l34475r7580k22923J86606N0585j55032j40180J77350
13852I56952J40870j33592K90006l57932J61850J30772M2385N0210k46596j8045
13842A016880o8962K7592K318j22029j5781J22193j32609L5907K32702j50867
13832I47344p1394P4306O9564m03588K71120J29214r4977l5601K85970k36491
13822I35467L1836p5446j07612J35015n0553L8463j31499K73908N3582l04683
13812G98478n0113J3394K81061l88614J34083J28541j27186J21217J53829k45252
13802H19438l1328k19111K23536l7956j58906K68713k03653K21737j437l44439
$$ plain form
13792 536594 789166 549078 1157306 833900 868363 700837 820630 692197 670458 888835
13782 888835 872548 474649 780280 936290 917265 762857 840315 575961 628207 433325
13772 433325 725104 912769 584731 600443 662050 501617 724985 788741 766138 817363
13762 817363 738802 857263 655646 747181 714772 675421 753984 479927 565168 406871 492061
13751 492061 691789 646498 807032 735356 229094 336498 801525 433019 404896 885220
13741 885220 621149 419244 540053 964116 583572 733886 610488 263585 350748 823112
13731 823112 731809 639839 423223 692749 486438 754641 579620 548824 450239 905483
13721 905483 385871 583893 149262 703457 539536 622883 643245 467088 519611 544376
$$ packed form
13792E36594K52572k40088O08228l23406L4463j67526J19793j28433k1739K18377
13782H88835j6287l97899L05631J56010j9025j54408P7458k64354N2246j94882
13772D33325K91779J87665l28038J5712O1607j60433K23368O3756k2603N1225
13762H17363p8561J18461k01617R1535l2409l9351P8563k74057Q5241j58297Q5190
13751D92061J99728m5291J60534p1676B29094J07404M65027l68506k8123M80324
13741H85220k64071k01905J20809M24063l80544J50314j23398B63585Q7163M72364
13731H23112r1303r1970k16616K69526k06311K68203j75021l0796r8585M55244
13721I05483C85871J98022A49262N54195j63921Q3347K0362j76157N2523K4765
$$ plain form
13711 544376 717898 742863 358107 819486 262800 315909 622942 586715 464540 448646
13701 448646 522258 317977 533123 466457 429371 651671 392354 505132 530293 349256
13691 349256 609333 418443 344884 251633 614756 492007 435078 564915 552409 544692 711069
13680 711069 389014 331656 520884 275703 405764 414533 612681 526315 220013 412299
13670 412299 476109 823939 413318 506202 326999 905884 530047 143509 311518 538873
13660 538873 559410 583488 243826 775512 214581 558883 569195 222377 337550 572509
13650 572509 160780 306551 337669 475248 305874 297764 696061 607531 646469 546635 397570
13639 397570 491331 594272 451293 644295 571360 244247 154245 493215 221666 374544
$$ packed form
13711E44376J73522K4965C58107M61379B62800N3109L07033l6227j22175j5894
13701D48646P3612k04281K15146o6666l7086K22300k59317J12778K5161j81037
13691C49256K60077j90890p3559r3251L63123j22749n6929J29837j2506p717J66377
13680G11069l22055n7358J89228k45181J30061Q769J98148q6366B20013J92286
13670D12299O3810L47830m10621R2884j79203N78885l75837A43509J68009K27355
13660E38873K0537K4078B43826N31686B14581L44302J0312B22377J15173K34959
13650E72509A60780J45771L1118J37579j69374q110L98297q8530L8938r9834j49065
13639C97570R3761J02941j42979J93002p2935B44247r0002L38970B21666J52878
$$ plain form
13629 374544 612287 212063 112766 281071 409269 585174 175712 187038 255593 486159
13619 486159 494532 256004 254749 467113 370201 206842 371593 452658 205290 443366 584794
13608 584794 328328 519133 321235 547229 -80526 187959 468041 464170 321504 771183
13598 771183 134548 436474 438293 291034 373425 374457 353146 670528 177948 447978 406036
13587 406036 210680 602784 265266 275789 254744 267662 365292 369522 592742 238198 240719
13576 240719 531461 295773 191619 161839 647823 -42849 416871 228135 502179 107711
13565 85085 340701 23516 556809 252255 86493 372038 457686 185110 597462 425644
13555 425644 639071 744831 492091 96512 85492 274341 414757 64072 173069 -111995
$$ packed form
13629C74544K37743B12063r9297J68305J28198J75905A75712J1326O8555K30566
13619D86159Q373k38528j255K12364r6912j63359J64751Q1065B05290K38076J41428
13608E84794k56466J90805j97898K25994h0526A87959K80082l871j42666M49679
13598G71183A34548L01926J819j47259Q2391J032k1311L17382A77948K70030m1942
13587D06036j95356L92104B65266J0523k1045J2918R7630M230K23220B38198K521
13576B40719K90742k35688j04154k9780M85984d2849D16871j88736K74044A07711
13565H5085K55616B3516N33293B52255H6493K85545Q5648A85110M12352j71818
13555D25644K13427J05760k52740I6512j1020J88849J40416F4072J08997a11995
$$ plain form
13544 210201 202769 353074 517165 377976 281168 290155 351954 335620 255586 333446 172263
13533 172263 226714 223496 279074 391562 252824 263392 600555 380994 71471 445532 -37655
13521 -40853 105860 219820 108785 212210 405284 60702 493616 -5003 291785 97390
13510 137753 113714 474607 334913 289813 352445 152408 309541 158575 191493 3856 326367
13499 326367 137299 223327 291656 313754 79914 411970 235355 564087 387328 494287
13489 494287 117142 409715 288721 26273 37468 270793 319088 -4847 146552 205306 114385
13478 114385 509567 232319 85512 422950 420547 34320 -56363 572840 228369 458884
13468 458884 78819 284220 78535 182482 45751 376283 402702 104594 -55333 27293 251110
$$ packed form
13544B10201p432J50305J64091j39189r6808Q987O1799j6334q0034P7860j61183
13533A72263N4451l218N5578J12488j38738J0568L37163k19561G1471L74061c7655
13521d0853A05860J13960A08785J03425J93074F0702M32914e003B91785I7390
13510A37753k4039L60893j39694m5100O2632A52408J57133j50966L2918C856L22511
13499C26367A37299Q6028O8329K2098G9914L32056j76615L28732j76759J06959
13489D94287A17142K92573j20994B6273J1195K33325M8295d847A46552N8754r0921
13478A14385L95182B32319H5512L37438k403C4320e6363E72840B28369K30515
13468D58884G8819K05401G8535J03947D5751L30532K6419A04594e5333B7293K23817
$$ plain form
13457 251110 169277 378941 163128 142943 187007 205811 -155329 105958 223013 62586
13446 165989 316542 290566 136035 370445 173208 -208883 -77709 285201 -165210 111042
13435 290197 234062 292897 191634 126977 134717 212215 290326 412098 282857 359914 -70143
13423 251350 52248 249683 145682 316264 33335 127460 191453 241425 519874 302427
13413 302427 442827 259027 -12200 176909 160486 -81662 313942 63198 366597 348583
13403 348583 115810 158589 135924 72907 300245 65469 3865 413661 324608 259060 235937
13392 235937 82588 48848 -47479 193950 -46991 111752 420265 375572 160945 148778 342747
13381 342747 92589 -35517 185247 300824 413067 128353 261553 50467 178441 139567
$$ packed form
13457B51110q1833K09664A63128k0185M4064J8804a55329A05958J17055F2586
13446A65989J50553k5976A36035K34410A73208b08883g7709B85201a65210A11042
13435B90197n6135N8835j01263o4657P740P7498P8111J21772j29241P7057g0143
13423B51350E2248J97435j04001J70582C3335R4125O3993M9972K78449k17447
13413C02427J40400j83800a2200A76909j6423h1662C13942F3198L03399j8014
13403C48583A15810M2779k2665o3017K27338F5469C865M09796q9053o5548k3123
13392B35937H2588l3740d7479A93950d6991A11752L08513m4693A60945j2167J93969
13381C42747I2589c5517A85247J15577J12243A28353J33200E0467J27974l8874
$$ plain form
13371 139567 278477 118968 528306 -150186 246262 145888 276142 95973 -35596 -28126
13361 -28126 198490 59661 224573 -23792 64497 389056 183622 204341 136872 -13683 409819
13349 349849 53338 -26087 127697 331929 318271 340836 424549 110395 224990 398346
13339 398346 138005 402079 183350 -147600 271090 429858 63550 465614 385933 229998
13329 229998 67943 44542 -120991 176567 -16686 41390 435236 377406 135920 40132 46276
13318 46276 102284 581636 124760 51318 173890 -163903 322074 -94168 142991 11065
13307 27787 -276800 -138063 368537 283191 165039 435658 458438 68730 51276 -122675
13296 -35293 133600 467492 -181161 386773 308086 80827 -55655 186632 195769 240934 -104165
$$ packed form
13371A39567J38910A18968M09338a50186B46262j00374J30254I5973c5596P470
13361b8126A98490E9661J64912b3792F4497L24559A83622K0719o7469a3683D09819
13349C49849E3338b6087A27697K04232j3658K2565Q3713A10395J14595J73356
13339C98346A38005K64074A83350a47600B71090J58768F3550M02064p9681j55935
13329B29998F7943k3401a20991A76567a6686D1390L93846n7830A35920D0132O144
13318D6276N6008M79352A24760E1318J22572a63903C22074i4168A42991A1065
13307B7787b76800a38063C68537q5346j18152K70619K2780F8730j7454a22675
13296c5293A33600L33892a81161C86773p8687H0827e5655A86632R137M5165a04165
$$ plain form
13284 126084 -69775 -181054 127688 56427 111578 88076 211099 170599 133250 -172094 345379
13272 -29705 -114911 83323 270624 191799 -178048 97946 130348 293661 306572 -17479 368947
13260 269977 209600 82043 285138 -111843 39339 12754 42456 -12426 242815 -401 152867
13248 38086 -42075 198623 -16809 19143 170513 314178 477130 255811 -50337 140126
13237 -174309 179459 436538 -12670 -101551 389467 455463 -121278 30464 262689 417030
13227 417030 176825 148927 -80640 26695 -74375 225058 -76817 340448 268476 11876 147898
13216 147898 158859 175356 120304 -82459 -113482 223469 16312 105418 68396 157899 170599
13205 170599 -136329 -133563 203812 199683 137193 202387 -371033 223259 123667 -75263 17118
$$ packed form
13284A26084f9775j11279A27688E6427N5151k3502J23023m0500l7349a72094C45379
13272b9705q5206H3323J87301p8825a78048I7946L2402J63313J2911a7479C68947
13260B69977o0377H2043K03095a11843C9339A2754K9702a2426B42815d01A52867
13248C8086d2075A98623a6809A9143J51370J43665J62952k21319e0337A40126
13237a74309A79459K57079a2670q8881C89467O5996a21278C0464K32225J54341
13227D17030A76825k7898h0640B6695g4375B25058g6817C40448p1972A1876J36022
13216A47898J0961J6497n5052h2459l1023B23469A6312Q9106l7022Q9503J2700
13205A70599a36329K766B03812m129o2490O5194c71033B23259r9592g5263A7118
$$ plain form
13193 -15644 -116919 192730 439769 -80255 -79976 103103 -11005 170129 -154749 38760 151220
13182 151220 469 184635 -35841 253965 22434 71480 -14108 62775 -59846 188283 52143
13170 117305 -76749 240618 465753 248306 -80366 289743 200880 -13798 -18999 -175742 -222502
13159 -222502 -20834 60328 204314 196787 305081 15006 79235 240487 -170432 -162585 189977
13147 90414 359357 224246 83076 104781 244551 59612 39411 -88426 5958 131079 61434
13135 115213 -284305 339749 227430 -199369 433838 94589 44572 113645 88247 10088
13124 126654 28980 287840 34278 -120454 441152 -3281 177338 -32237 -112831 34760 82029
13113 82029 291705 64748 -234444 -64275 388367 24083 -123725 84158 269540 341938 -56275
$$ packed form
13193a5644j01275A92730K47039h0255K79A03103a1005A70129a54749C8760J12460
13182A51220D69J84166c5841B53965B2434M9046a4108F2775e9846A88283E2143
13170A17305g6749B40618K25135k17447h0366B89743q8863a3798n201j56743m6760
13159b22502b0834F0328J43986p527J08294A5006O4229J61252a70432P847A89977
13147I0414K68943j35111H3076K1705J39770E9612k0201h8426E958J25121F1434
13135A15213b84305C39749j12319a99369D33838I4589D4572O9073k5398A0088
13124A26654B8980K58860C4278a20454D41152c281A77338c2237q0594C4760M7269
13113H2029K09676F4748b34444f4275C88367B4083a23725H4158J85382P2398e6275
$$ plain form
13101 58377 128289 98354 280583 16362 -118877 -33728 -33848 -920 94841 -57235 101675 320889
13089 320889 152565 71909 63246 -104097 -121435 -18034 66231 -59502 264316 195839 19966
13077 -193127 -237660 164313 29427 208225 30787 243457 70671 350909 -114037 97188
13066 2106 160735 140040 177246 152076 5751 -22660 -185618 -340326 -41833 90424 4356 -113105
13053 416423 87283 -223501 -24854 -252008 -77482 -216937 157671 -123972 26130 127796
13043 127796 -237430 245293 66671 189604 -231380 83252 240191 -320376 -193748 -63073
13032 6450 -95905 -25034 183278 40581 58756 -320188 63651 359650 8732 113324 452149
13021 452149 43805 95005 -63884 -62157 -104959 53929 277362 148736 -132244 205620 -56015
$$ packed form
13101E8377O9912k9935J82229A6362a18877c3728j20i20I4841e7235A01675K19214
13089C20889A52565G1909q663a04097j7338a8034F6231e9502B64316o8477A9966
13077a93127m4533A64313B9427J78798C0787K12670G0671K80238a14037I7188
13066B106J58629k0695L7206k5170E751b2660j62958j54708d1833I0424D356a13105
13053D16423H7283b23501b4854k27154g7482j39455A57671a23972B6130J01666
13043A27796b37430B45293F6671J22933b31380H3252J56939c20376J26628f3073
13032F450i5905b5034A83278D0581J8175c20188F3651K95999H732J04592L38825
13021D52149D3805N1200f3884J727m2802E3929K23433j28626a32244B05620e6015
$$ plain form
13009 -152080 -25263 15043 24155 165031 146251 53260 -314879 109308 62407 23086 14366
12998 14366 -149224 233036 36815 181133 376067 246064 238917 -59426 320166 -127350
12987 -89945 273165 70209 96759 -254270 128336 -14377 84504 -43847 -27156 -1196 51335
12975 -228161 -96487 37551 196733 28258 86021 -327216 190726 161613 119491 6110 125178
12964 125178 -53561 -178114 131160 -206413 -53997 37588 102527 -90290 130746 -343844
12953 225026 31639 33214 21344 -193775 62280 -182194 -60833 -59488 185914 31396 69359
12942 69359 76522 -106369 -215901 -1485 -292122 53230 91721 80731 -101394 -138488 -127185
12931 -127185 149449 172846 94150 190010 216857 160027 41076 -79719 -80600 13238 21409 -117153
$$ packed form
13009a52080b5263A5043R112J40876j8780E3260c14879A09308m6901B3086q720
12998A4366a49224B33036C6815J44318J94934j30003p147e9426C20166a27350
12987h9945B73165G0209K6550b54270A28336a4377H4504d3847J6691a196E1335
12975b28161i6487C7551J59182B8258N7763c27216A90726k9113m2122F110J19068
12964A25178e3561j24553A31160b06413e3997C7588O4939i0290A30746c43844
12953B25026C1639J575j1870a93775F2280a82194f0833J345A85914C1396L7963
12942F9359P163a06369j09532a485k90637E3230L8491j0990a01394l7094J1303
12931a27185A49449K3397p8696R5860K6847n6830D1076g9719q81A3238Q171a17153
$$ plain form
12918 -202640 22732 -244921 79047 -191008 -216615 -325626 -19490 386449 -235130 -20093
12907 84254 -270017 -64720 -145528 -431447 914 -272925 60363 -102564 246392 2684 -246751
12895 -47795 -16268 216054 116623 -236679 388212 25989 -11709 -55441 92878 66913 244696
12884 244696 83010 -347251 -111983 -47412 -43268 26104 72360 44870 167142 -128644 141723
12872 217440 -266322 57766 -188967 -255336 -148607 -33012 -102905 -65659 -119992 -17510 59920
12860 149722 16486 -38085 128450 345294 -33543 -71140 282541 28191 263000 -186314
12849 5461 -108145 29768 -45584 41371 201904 96363 116788 52483 173461 68661 -137709
12837 124282 79334 -61893 412731 -93589 -341529 -24019 236813 257045 -251333 63710 252146
$$ packed form
12918b02640B2732b44921G9047a91008k5607j09011a9490C86449b35130b0093
12907H4254b70017f4720q0808k85919I14b72925F0363a02564B46392B684b46751
12895d7795a6268B16054r9431b36679C88212B5989a1709m3732I2878k5965J77783
12884B44696H3010c47251a11983d7412M144B6104M6256k7490J22272a28644A41723
12872B17440b66322E7766a88967o6369J06729c3012o9893L7246n4333a7510E9920
12860A49722A6486c8085A28450K16844c3543l7597B82541B8191K34809a86314
12849E461a08145B9768d5584D1371J60533I6363K0425E2483J20978F8661a37709
12837A24282m4948f1893D12731i3589k47940b4019B36813K0232b51333F3710J88436
$$ plain form
12826 252146 -366828 -44965 14195 158445 -210086 -59132 23361 -48585 285205 145826
12816 145826 -122465 234839 -7252 -54645 325967 -238138 152671 -40799 111060 -55540
12805 -82475 -91771 -180843 7544 -7975 203666 -337197 -62862 -84430 60516 253917 316318 224371
12793 224371 -164479 226324 172682 -242339 -192775 -110595 220670 -82230 168179 -38293
12782 -8510 -109934 159897 11370 219758 -124486 -235462 13708 -360768 20112 145367
12772 145367 -97601 8885 -132946 -212137 36421 -76440 12456 -240270 230423 158542 -16037
12760 -210069 -2659 -87297 -21989 48667 -301462 27874 -128699 52865 81845 -198133 49001
12748 273681 195215 154586 -126477 -194190 -263261 -176958 105320 258580 211067 88545 -36314
$$ packed form
12826B52146c66828d4965A4195J44250b10086e9132B3361d8585B85205j39379
12816A45826a22465B34839g252m7393C25967b38138A52671d0799A11060e5540
12805h2475r296q9072G544g975B03666c37197f2862k1568F0516J93401O2401r1947
12793B24371a64479B26324n3642b42339M9564Q2180B20670h2230A68179c8293
12782h510j01424A59897A1370K08388a24486j10976A3708c60768B0112J25255
12772A45367i7601H885a32946p9191C6421g6440A2456b40270B30423p1881a6037
12760b10069b659q4638b1989D8667c01462B7874a28699E2865K8980a98133D9001
12748B73681p8466m0629a26477o7713o9071Q6303A05320J53260m7513H8545c6314
$$ plain form
12736 -286605 -115605 206433 -17013 -2106 -156249 -19334 21950 -8319 271859 323037 -199245
12724 -119989 -308961 46725 123435 -101254 62737 161128 -251226 -252334 71690 175590 377096
12713 377096 -451235 -206419 47239 56917 54681 83786 211571 139877 126029 271905 111203
12701 314045 -17605 647 -238685 12749 218382 233293 60072 191057 215470 99599 114978
12690 114978 -164525 68605 116737 241729 52832 125638 55068 211632 162667 266334 49075
12678 205787 -139815 95624 -20983 -50232 561254 41903 163981 -133133 420371 62612
12667 64775 253800 -5162 -101986 224271 258269 109191 39263 325096 102432 155841 50548
12655 -199551 70667 292525 -179326 -38563 112881 -53789 -136686 297013 -159585 302813
$$ packed form
12736b86605a15605B06433a7013b106j54143a9334B1950h319B71859N1178a99245
12724a19989j88972D6725P6710a01254F2737R8391b51226j108G1690J03900K01506
12713C77096d51235b06419D7239R678k236K9105J27785p1694j3848J45876A11203
12701C14045a7605F47b38685A2749K05633J4911F0072J30985K4413I9599J5379
12690A14978a64525F8605M8132J24992E2832P2806E5068J56564m8965J03667D9075
12678B05787a39815I5624b0983k9249E61254D1903J22078a33133D20371F2612
12667F4775J89025e162r6824B24271L3998A09191C9263K85833A02432N3409E0548
12655a99551G0667K21858a79326c8563A12881e3789q2897B97013a59585C02813
$$ plain form
12644 120077 147702 -109819 65384 73124 -23664 9220 -26968 344693 -347099 -156129 304226
12632 259236 17501 -71421 72261 83229 160347 212559 248750 -13609 243685 299277 24520
12620 -64603 149484 418451 633 78959 -62046 -297727 -110118 210756 378497 31784 -65861
12608 17024 262699 -33467 75711 -42049 -111238 190434 81699 168617 356014 467628 79330
12596 -145250 -274927 55010 -66112 154523 13981 165495 -118298 248081 276559 -40321
12585 5393 -88177 -127854 -5015 -111424 -31603 369704 -112561 -57142 323098 -136614 -78876
12574 -78876 -146379 155668 304422 259182 -219549 -288426 -18423 106047 318100 278384 -43775
12562 60811 332354 -227677 -90553 -179585 254344 217697 -1881 58231 82196 122928 -354610
$$ packed form
12644A20077K7625a09819F5384P740b3664I220b6968C44693c47099a56129C04226
12632B59236A7501g1421G2261J0968P7118N2212L6191a3609B43685N5592B4520
12620f4603A49484K68967F33P8326f2046k35681a10118B10756J67741C1784f5861
12608A7024K45675c3467G5711d2049o9189A90434H1699Q6918J87397J11614G9330
12596a45250j29677E5010f6112A54523A3981J51514a18298B48081K8478d0321
12585E393h8177l9677e015j06409c1603C69704a12561N5419C23098a36614N7738
12574g8876o7503A55668J48754m5240b19549o8877a8423A06047K12053l9716d3775
12562F0811K71543b27677i0553q9032B54344l6647a881E8231K3965M0732c54610
$$ plain form
12550 -10269 -74833 59386 340561 142971 166140 -152102 117234 -72338 90600 -52782 -234209
12539 -234209 -321541 198430 -1107 244955 -100084 173924 197021 212541 197347 2538 -67665
12527 -106908 -268174 -62163 1142 161182 211298 53724 -112688 -249351 31781 -40997 128118
12515 -86084 35573 -54770 28941 -9400 90935 22819 45831 -229772 2138 107774 495014
12504 495014 271060 67622 37338 532155 88443 215401 -21305 -4371 161367 90058 88454
12493 88454 125925 -389317 -94890 353149 22246 232674 43201 -129267 -199867 28652 131735
12482 131735 -58564 -75987 -118624 -123662 9500 115899 279212 -120300 4128 273054 9509
12470 -87157 118973 122185 -8886 375741 89350 114966 55085 82610 -48986 7596 10338 -154879
$$ packed form
12550a0269o4564E9386K81175A42971K3169a52102A17234g2338I0600e2782j81427
12539b34209q7332A98430a107B44955a00084A73924K3097J5520j5194B538f7665
12527a06908j61266f2163A142J60040N0116E3724a12688j36663C1781d0997A28118
12515h6084C5573e4770B8941i400I0935B2819K3012b29772B138J05636L87240
12504D95014k23954F7622l0284M94817H8443J26958b1305d371A61367p1309j604
12493H8454L7471c89317i4890C53149B2246K10428D3201a29267p0600B8652J03083
12482A31735e8564j7423m2637n038I500J06399J63313a20300D128K68926I509
12470h7157A18973L212h886C75741H9350K5616E5085K7525d8986G596K742a54879
$$ plain form
12457 29496 26205 -178840 -210716 -149584 -348983 -113087 -266542 126382 -11958 -305894 289642
12445 -154581 163020 163117 -365095 417214 -189843 255363 14575 165034 -251673 19449 -234496
12433 -33669 -217041 -198573 72337 -121312 -199771 -12824 19742 -120287 -131653 190377 -107757
12421 71772 -206713 -25304 145028 -57436 31114 -22585 -74712 390463 135544 -211954 -23242
12409 15891 27614 -6813 -61274 -48223 316770 278705 208489 14360 209588 204705 -162486
12397 118236 -128134 70954 225113 666349 86523 75665 136861 333595 221000 -7423 -56969
12386 -56969 342637 295758 -31852 50457 -14612 219360 127152 -59174 213516 49472 267472
12375 267472 239230 181376 106557 60419 -63352 230937 200340 70369 -60495 -159959 -127669
$$ packed form
12457B9496l291a78840l1876O1132j99399a13087j53455A26382a1958k93936B89642
12445a54581A63020R7c65095D17214a89843B55363A4575J50459b51673A9449b34496
12433c3669j83372J8468G2337a21312p8459a2824A9742a20287j1366A90377a07757
12421G1772b06713b5304A45028e7436C1114b2585n2127C90463A35544b11954b3242
12409A5891J1723f813n4461J3051C16770l8065p0216A4360J95228m883a62486
12397A18236a28134G0954J54159M41236H6523j0858O1196J96734j12595g423m9546
12386e6969C42637m6879c1852E0457a4612B19360r2208e9174B13516D9472K18000
12375B67472k8242n7854p4819m6138f3352B30937l0597G0369f0495r9464L2290
$$ plain form
12364 -127669 200211 -245656 92045 9416 397645 131820 190644 -177852 55971 -82115 141561
12352 177140 342287 248063 -98480 43451 18657 -91554 -17885 115883 -41355 -126440 -267893
12341 -267893 -36980 47631 36457 -59588 8216 37969 -104684 274005 132022 -102171 413223
12329 340799 191280 114786 212357 97860 452106 -647 -39497 -284383 -320133 23476 602 110119
12317 110119 25514 539052 238727 2463 129949 127037 62547 71569 49790 145041 286606
12306 286606 -151162 18162 111363 103445 -21729 -155064 91099 -151562 208654 -159520 27330
12294 312750 97243 6364 127688 -137557 11225 221091 512672 219481 -14936 131341
12283 -179633 168078 275005 -102477 86304 178588 340226 292216 -31622 1076 182017 -122732
$$ packed form
12364a27669B00211b45656I2045I416L88229A31820N8824a77852E5971h2115A41561
12352A77140J65147r4224i8480D3451A8657i1554a7885A15883d1355q5085j41453
12341b67893c6980D7631j1174e9588H216K9753a04684B74005A32022a02171D13223
12329C40799j49519p6494R7571I7860L54246f47l8850k44886l5750B3476F02J09517
12317A10119B5514N13538B38727B463J27486k912F2547R022k1779R5251J41565
12306B86606a51162A8162R3201p918b1729j33335I1099a51562B08654a59520B7330
12294C12750I7243F364J21324a37557A1225K09866K91581B19481a4936A31341
12283a79633A68078J06927a02477H6304R2284J61638m8010c1622A076J80941a22732
$$ plain form
12271 35298 276061 337493 -42304 -11341 88006 185858 128837 39219 -34953 -107378 221371
12259 -173136 156127 -117589 355699 -96226 95611 75643 114106 30540 98519 369121 53251
12247 278282 155936 -217351 -104890 153469 182015 361096 343372 103125 -57654 228661
12236 107644 75719 127196 326147 199300 344338 237756 460087 -54273 315374 -233048
12225 -14680 342419 254264 366991 32633 286977 249287 364107 342407 -14732 416324 333513
12214 333513 -210924 144991 307736 169120 253731 -19525 124021 -336484 401372 -241167
12203 242681 126476 343829 365398 -51987 376127 231828 499488 32592 352208 301659
12193 301659 265296 255850 292673 112374 311848 240500 -23460 -26437 398616 654950 235937
$$ packed form
12271C5298K40763O1432d2304a1341H8006R7852n7021C9219c4953p2425B21371
12259a73136A56127a17589C55699i6226I5611j9968L8463C0540O7979K70602E3251
12247B78282j22346b17351a04890A53469K8546J79081j7724A03125e7654B28661
12236A07644l1925N1477J98951j26847J45038j06582K22331e4273C15374b33048
12225a4680C42419q8155J12727C2633K54344l7690J14820k1700a4732D16324q2811
12214C33513b10924A44991J62745j38616Q4611a9525A24021c36484D01372b41167
12203B42681j16205K17353K1569e1987C76127j44299K67660C2592L19616n0549
12193C01659l6363r446L6823A12374J99474p1348b3460k977C98616K56334B35937
$$ plain form
12181 366190 264184 512186 262295 263146 284285 199277 316144 44072 2220 187407 229896
12170 229896 273883 692511 237113 -6758 196475 170154 -94495 455611 465165 366301 383411
12159 383411 84949 245804 -185096 119633 454111 539276 415038 82430 445874 -130382
12148 408314 243299 385 284405 460686 198531 538767 -4550 399626 392068 -26105 89463
12136 525911 -68507 -112527 313459 133845 -135624 -43448 222571 353406 22268 249521
12126 249521 -97367 421980 48079 -21828 -72 222829 15405 -226927 195839 330710 277205
12115 277205 191653 352114 115875 92719 149316 30939 -186501 -73075 204549 61620 25677
12103 251012 55599 -75223 64073 -28032 -108683 330928 70294 72581 -177670 125111 71957
$$ packed form
12181C66190j02006K48002k49891Q51K1139q5008J16867D4072B220J85187M2489
12170B29896M3987M18628B37113f758A96475k6321i4495D55611R554r8864J7110
12159C83411H4949J60855a85096A19633L34478Q5165j24238H2430L63444a30382
12148D08314j65015C85K84020J76281A98531L40236d550C99626p558b6105H9463
12136E25911f8507m4020C13459A33845a35624d3448B22571J30835B2268K27253
12126B49521i7367D21980D8079b1828g2B22829A5405b26927A95839J34871n3505
12115B77205q5552J60461A15875k3156N6597C0939a86501g3075B04549F1620B5677
12103B51012E5599g5223F4073b8032q0651C30928G0294K287a77670A25111n3154
$$ plain form
12092 71957 191009 -13278 91871 -44836 -129880 -131362 238889 -235741 56554 141051 120727
12081 120727 58228 151338 48811 -1196 74464 231309 -161799 46298 -22107 394506 321297
12070 321297 -145926 -130188 -100825 340145 133459 239343 160430 113849 96184 -437627
12059 15997 205691 -21851 39917 -105658 -166430 -56282 9829 326272 126309 45408 -9794
12047 -195925 121966 100677 142823 58063 -211135 -165020 -54068 260479 -362145 -145609
12036 41044 -204802 34726 10883 -62566 140453 -317831 163595 -62748 38845 -15893 -107122
12025 -107122 118413 -192926 125401 -168309 168846 -21036 164664 216248 228925 134388
12015 134388 -62719 338191 36957 52450 -358989 -35096 -193452 -206699 283780 55464 1733
$$ packed form
12092G1957J19052a3278I1871d4836q5044j482B38889b35741E6554Q4497k0324
12081A20727E8228R3110D8811a196G4464J56845a61799D6298b2107C94506p3209
12070C21297a45926J5738K9363C40145A33459J05884p8913m6581j7665d37627
12059A5997J89694b1851C9917a05658o0772e6282I829L16443A26309D5408i794
12047a95925A21966k1289M2146E8063b11135M6115e4068B60479c62145a45609
12036D1044b04802C4726A0883f2566A40453c17831A63595f2748C8845a5893r1229
12025a07122A18413a92926A25401a68309A68846b1036A64664N1584J2677r4537
12015A34388f2719C38191C6957J5493c58989c5096j58356j3247B83780E5464A733
$$ plain form
12003 37254 205848 -69405 -281307 -285010 26619 196359 -243747 -18542 49327 -3348 -154 247420
11990 -255480 -199711 -172086 -271723 97708 17054 -31469 -188663 -61807 234182 -256395 -104458
11978 -107821 -161558 -133137 -73989 95824 15125 32017 392714 -561811 -167684 -141790 -74499
11967 -74499 -108660 -14393 97134 -300700 292177 -6557 -187644 -243028 -156646 -1438 57726
11955 -103636 155532 106709 389508 104456 -140547 -14792 -9292 169839 -151475 30233
11944 43239 217595 -87976 176965 -275252 76477 179313 -225648 -253203 64888 -13746 268291
11932 151377 -218260 -185122 -253582 -307873 49883 -184204 330518 156291 -16544 297723
11921 -280908 304203 67270 -127134 -130349 -138229 96594 -261272 -256409 -68783 -274827 -210492
$$ packed form
12003C7254J68594f9405k11902l703B6619J69740b43747a8542D9327c348a54B47420
11990b55480N5769K7625r9637I7708A7054c1469j57194f1807B34182b56395a04458
11978a07821n3737K8421N9148I5824A5125J6892L60697e61811a67684K5894O7291
11967g4499l4161a4393I7134c00700B92177f557j81087n5384Q6382a438E7726
11955a03636A55532m8823K82799A04456a40547a4792N500A69839a51475C0233
11944D3239J74356h7976A76965b75252G6477J02836b25648k7555F4888a3746B68291
11932A51377b18260L3138o8460n4291D9883a84204C30518A56291a6544B97723
11921b80908C04203F7270a27134l215p880I6594b61272M863f8783k06044O4335
$$ plain form
11910 -210492 210665 245048 -47098 -369168 -36944 324867 -172801 75448 322842 171603
11900 171603 -103981 -287855 27166 -413 -355683 -107642 -120814 -95004 -156896 -206544 73416
11888 -166240 -72399 109972 -302601 102008 44005 -85721 -92531 87182 -80689 -43153 336088
11876 -137090 -89015 48105 -316376 -91550 -229003 -269185 -28436 -233610 -916 -312976 336700
11864 -460056 162312 -1184 233716 -153769 65368 107155 135971 -69705 -71752 -59517 -227078
11853 -227078 -418756 -18303 -176744 -223690 -106456 96301 -246407 16746 -246182 -95499
11842 -196573 41728 28251 -20717 -14379 27755 -34624 -52528 247937 -462886 -91860 -16009
11830 -225348 100910 -39478 74174 49923 -115036 -281514 -4496 -192932 60049 8698 -152582
$$ packed form
11910b10492B10665L4383d7098l22070c6944C24867a72801G5448K47394j51239
11900A71603a03981j83874B7166d13l55270a07642j3172K5810o1892m9648G3416
11888a66240g2399A09972c02601A02008D4005h5721o810H7182h0689L7536C36088
11876a37090M8075D8105c16376i1550j37453m0182b8436k05174i16l12060C36700
11864d60056A62312a184B33716a53769F5368M1787K8816f9705k047J2235j67561
11853b27078j91678a8303j58441m6946a06456I6301b46407A6746b46182i5499
11842a96573D1728j3477b0717O338B7755c4624j7904B47937d62886i1860a6009
11830b25348A00910c9478G4174k4251a15036j66478d496j88436F0049H698a52582
$$ plain form
11818 -95362 89666 -165599 -87426 44099 -17945 204737 -51711 -151046 -287477 -66635 118923
11806 -97560 -7522 135042 -202661 -41290 -445741 -142725 -9158 44210 -29078 -182651 -154884
11795 -154884 -83617 -70734 -511797 -447732 29698 -147973 -154073 -330546 -109620 -240818 -91685
11783 115189 -28529 -127052 -72072 -201611 81783 48805 -75663 -170276 -61524 79907 -76835
11771 -16145 131290 -85760 -131681 -349437 -228700 -348626 27377 -30828 -137753 -124137 84397
11759 54493 -188709 -147320 250046 -192943 57462 210259 204774 35124 157010 -10101 105864
11747 -76698 -49510 -8923 167217 -50675 148425 -27946 -320414 93327 233269 -251056 -30862
11735 -75939 -68539 -62873 -17781 -67106 -41737 136288 8460 -96792 99229 -121949 54673 -29903
$$ packed form
11818i5362H9666a65599P8173D4099a7945B04737e1711r9335j36431f6635A18923
11806i7560g522A35042b02661d1290m04451a42725i158D4210b9078j53573K7767
11795a54884P1267J2883m41063O4065B9698a47973o100j76473a09620j31198i1685
11783A15189b8529r8523N4980j29539H1783l2978g5663r4613f1524G9907g6835
11771a6145A31290h5760m5921k17756J20737j19926B7377c0828j06925J3616H4397
11759E4493a88709M1389B50046a92943E7462J52797n485C5124J21886a0101A05864
11747g6698K7188h923A67217e0675A48425b7946k92468I3327J39942b51056c0862
11735g5939P400N666a7781m9325K5369A36288H460i6792I9229a21949E4673b9903
$$ plain form
11722 -42855 -279761 -314059 -11894 -168347 -303514 61760 116783 4740 -222114 63481 -11959
11710 126297 54939 -168350 159715 -67044 -131706 123197 -227681 137234 -30476 -130970
11700 -130970 -166607 -54209 184059 41152 -165859 -166068 -220191 -198196 462021 -226091 -201214
11689 -201214 -52795 286347 -496843 -98470 158130 108942 -265668 -186656 48563 -88169 -60772
11678 -60772 -79167 3786 274975 49025 2218 -346988 -16855 -139301 -106629 247883 -159743
11666 131909 -255955 -155720 147331 61268 -119840 -50027 -300026 -27646 216763 -178364
11655 -249050 -99454 -73749 -245379 -176031 -528806 -65556 131381 -85965 -227252 -48889 -121579
11644 -121579 498026 178602 67046 -48665 201665 -268559 172728 -3343 307593 -61004
$$ packed form
11722d2855k36906l4298a1894j56453j35167F1760N5023D740b22114F3481a1959
11710A26297E4939a68350A59715f7044o4662A23197b27681A37234c0476j00494
11700a30970l5637e4209A84059D1152a65859k09n4123K1995D62021b26091K4877
11689b01214e2795B86347d96843i8470A58130m9188b65668P9012D8563h8169K7397
11678f0772j8395C786K71189D9025B218c46988a6855j22446L2672B47883a59743
11666A31909b55955J00235A47331F1268a19840e0027k49999b7646B16763a78364
11655b49050i9454K5705j71630O9348l52775f5556A31381h5965j41287d8889p2690
11644a21579D98026A78602F7046d8665B01665b68559A72728c343C07593f1004
$$ plain form
11633 37759 300545 -121201 136685 -393056 16248 208360 -139921 274061 145297 280218
11623 280218 -47021 242828 -212864 286165 -26919 -88935 39359 206319 -62006 172419
11612 238917 -202850 -78335 -293957 27938 -165470 -293285 -90761 214398 104169 -62006
11601 -373005 -111340 111457 276745 -31383 -6724 112576 -280393 -236551 -206220 96603 -44893
11589 -116825 79067 -168218 -239339 -63545 110112 -270737 32781 82559 -360680 21362 136055
11578 136055 63063 -140786 -20927 -96600 -98315 211300 -115920 231466 124 -8176 -214185
11567 -214185 -177793 -200977 -303092 -140864 76723 -46097 120126 -6684 -224774 -51658 -30814
11556 -30814 -200063 113714 -90530 17332 166452 118938 306568 -132673 93874 -180605
$$ packed form
11633C7759K62786a21201A36685c93056A6248J92112a39921B74061j28764J34921
11623B80218d7021B42828b12864B86165b6919o2016C9359J66960f2006A72419
11612B38917b02850g8335k15622B7938a65470j27815i0761B14398A04169f2006
11601c73005a11340A11457J65288c1383f724A12576b80393M3842L0331I6603d4893
11589a16825G9067a68218p1121f3545A10112b70737C2781M9778c60680B1362J14693
11578A36055F3063a40786b0927p5673j715B11300a15920B31466A24h176k06009
11567b14185L6392k3184j02115a40864G6723d6097A20126f684k18090e1658K0844
11556c0814j69249A13714i0530A7332J49120m7514J87630a32673I3874a80605
$$ plain form
11545 -239352 -73310 123504 -244573 256573 101895 40661 -178480 -24872 63622 60393 -93705
11533 -1424 283422 -100520 404887 305415 258484 -175335 -23301 208277 -27702 184689 198974
11522 198974 -95617 -217663 252831 -29397 75230 88198 102560 196995 -349585 248301 -78442
11510 7227 150483 8721 -167641 228976 140284 -108053 252333 14047 46495 49597 119725
11499 119725 16646 150489 289487 214553 130486 29415 203100 177424 64015 81122 329279
11488 329279 403667 422505 174430 1730 258366 21452 229097 107230 -223868 117432
11477 254920 -350255 -138597 -1825 160603 297534 -163018 102303 240099 6814 85116
11467 85116 -91594 403177 275470 225177 -5564 305316 43521 448656 186019 -33808 138701
$$ packed form
11545b39352g3310A23504b44573B56573A01895D0661a78480b4872F3622l229i3705
11533a424B83422a00520D04887r9472m6931a75335b3301B08277b7702A84689J4285
11522A98974i5617j22046B52831b9397G5230J2968J4362R4435c49585B48301g8442
11510G227J43256H721a67641B28976q8692a08053B52333A4047L2448L102P0128
11499A19725A6646J33843J38998p4934q4067B9415J73685k5676F4015J7107K48157
11488C29279P4388J8838A74430A730K56636B1452K07645A07230b23868A17432
11477B54920c50255a38597a825A60603J36931a63018A02303J37796F814P8302
11467H5116i1594D03177j27707n0293e564C05316D3521M05135A86019c3808A38701
$$ plain form
11455 283613 43089 442910 91846 339424 140681 -207328 -18309 -44613 5305 -303217 -57411
11443 206977 -257349 58285 -41941 236440 -62371 163411 149073 219972 -89321 -115439 18576
11431 -19100 -169335 192644 -218879 35680 53361 230903 269802 -123389 16552 67709 109611
11420 109611 -153037 50934 326335 -15221 -158354 -204757 106948 156805 -56625 -262811
11410 -262811 76143 76959 -16268 4023 -63403 128390 41160 292122 169997 -220608 180340
11398 157889 38392 -171176 31355 -368105 -70175 133026 -3081 -164112 20444 14170 -117604
11386 -128276 -222330 9507 -134883 -44393 150559 -184429 97728 -396388 41205 -185673 259670
11374 -238023 136878 116268 -124101 -48651 -338721 243337 -459233 285723 -243030 -89718
$$ packed form
11455B83613D3089L99821I1846K47578A40681b07328a8309k6304E305c03217e7411
11443B06977b57349E8285d1941B36440f2371A63411j4338P0899h9321k6118A8576
11431a9100j50235A92644b18879C5680J7681J77542L8899a23389A6552N1157M1902
11420A09611a53037E0934K75401a5221j43133m6403A06948M9857e6625k06186
11410b62811G6143Q16a6268D023f3403A28390D1160K50962j22125b20608A80340
11398A57889C8392a71176C1355c68105g0175A33026c081j61031B0444o274a17604
11386a28276r4054I507a34883d4393A50559a84429I7728c96388D1205a85673B59670
11374b38023A36878k0610a24101d8651k90070B43337d59233B85723b43030h9718
$$ plain form
11363 -199971 -340577 18746 -161101 20805 -84312 -322217 114401 106580 -128216 204295
11352 -112756 -175904 -174728 -191908 -162804 -295082 -7973 196133 -8545 -68064 -121493 52795 301804
11340 301804 124250 27534 32869 73099 -73538 88290 -259788 -149016 129562 -60974 -128122
11329 -128122 -308785 -265418 -377003 -60472 76900 -83952 -22048 68646 -142496 -267459 -224559
11318 -224559 -35012 -22568 -154909 -52032 -40492 -140388 204756 191819 -87864 44744 8052
11306 -282366 -236302 -75451 -19689 -22697 -308579 -334702 -148485 43130 170522 351179 -69955
11294 25766 103036 92195 -284455 149214 93466 422108 -77415 -50912 -211986 62707 227811
11283 227811 -41498 -263881 -118615 316003 -71486 122971 56651 -133232 179407 125206
$$ packed form
11363a99971j40606A8746a61101B0805h4312k37905A14401p821a28216B04295
11352a12756o3148J176j7180K9104j32278g973A96133h545n9519n3429E2795K49009
11340C01804A24250B7534N335M0230g3538H8290b59788J10772A29562f0974o7148
11329a28122j80663M3367j11585f0472G6900h3952b2048F8646a42496j24963M2900
11318b24559c5012J2444j32341e2032J1540r9896B04756j2937h7864D4744H052
11306b82366M6064g5451a9689l008k85882k6123a48485D3130J27392J80657f9955
11294B5766P7270j0841b84455A49214n5748L28642g7415K6503j61074F2707J65104
11283B27811d1498k22383a18615C16003g1486A22971E6651a33232A79407n4201
$$ plain form
11273 125206 -196711 148212 235964 -79231 -450618 -167880 -26118 -86494 -137212 66054 -240795
11261 -62963 -5441 83071 60008 -156815 -448491 41185 -158832 -221015 -214379 -175685 -57713
11249 -43527 -2544 -74933 -288092 -268612 37448 -23931 166053 42165 -39786 -81328 207390
11237 -52655 97852 -98384 142988 375451 -181372 96500 102246 -113261 52431 -215841 -131928
11226 -131928 -118820 -216073 -144711 8454 -90205 14340 -184455 330791 334051 -150743 -59729
11214 -276040 -14892 162716 -41809 4026 20742 34296 168618 41490 -229974 10635 -231992
11202 144693 -162614 -119323 33539 -53927 142503 25698 185096 221470 242113 -180048 -214870
11191 -214870 -16552 277210 31279 -512434 -311223 43892 313916 -110720 -78431 -158606
$$ packed form
11273A25206a96711A48212Q7752g9231l71387a67880b6118o0376n0718F6054b40795
11261f2963e441H3071k3063a56815k91676D1185a58832o2183O636L8694e7713
11249d3527b544p2389k13159J9480C7448b3931A66053D2165c9786m1542B07390
11237e2655I7852i8384A42988K32463a81372I6500N746a13261E2431b15841Q3913
11226a31928J3108r7253P1362H454i0205A4340a84455C30791L260a50743e9729
11214b76040a4892A62716d1809D026J6716J3554J34322D1490b29974A0635b31992
11202A44693a62614M3291C3539e3927A42503B5698J59398L6374K0643a80048l4822
11191b14870a6552B77210C1279e12434K01211D3892K70024a10720L2289q0175
$$ plain form
11181 -158606 -38709 68975 -92921 -191426 -36343 -195634 -490997 -202774 -37137 19974 -356111
11169 -20105 -71328 -121387 41157 -13484 -235122 28151 -219134 31364 -222949 -240539 100852
11157 205004 -217547 -187632 -52348 58599 260352 -87452 93871 234659 -343386 -21502 -222839
11146 -222839 25481 -60406 11648 -45083 179327 -192225 20348 -301937 -174077 37811 140454
11135 140454 -47932 172571 -214767 -261581 -147519 -277027 76880 -170918 82161 -174859
11124 164438 61227 262637 -72615 196793 -103827 71009 -17584 277402 -9405 -14469 -5710
11112 -51620 247557 223622 35306 -159546 167363 217259 416948 57185 -63222 -53559 -106707
11101 -106707 -11395 96710 255899 125496 73726 463084 279266 -194865 49375 233200
$$ packed form
11181a58606c8709F8975i2921r8505c6343j59291k95363b02774c7137A9974c56111
11169b0105n1223n0059D1157a3484k21638B8151b19134C1364b22949j7590A00852
11157B05004b17547K9915e2348E8599K01753h7452I3871J40788c43386b1502k01337
11146b22839B5481f0406A1648d5083A79327a92225B0348c01937J27860C7811J02643
11135A40454d7932A72571b14767m6814J14062j29508G6880a70918H2161a74859
11124A64438F1227K01410g2615A96793a03827G1009a7584B77402i405n064e710
11112e1620B47557k3935C5306a59546A67363M9896J99689E7185f3222R663n3148
11101a06707a1395I6710J59189A25496n1770L89358j83818a94865D9375J83825
$$ plain form
11091 233200 191938 173003 274915 497462 466777 52513 -29347 -17592 233957 203981 -28518
11079 242604 401049 201555 21683 276591 147256 393112 508445 512766 134648 269338
11069 269338 148701 379492 344060 482001 606232 437672 286238 327766 557707 295708
11059 295708 541598 408919 671260 620299 534777 579977 126244 614135 431495 743928
11049 743928 885705 742670 1168563 611275 766044 892708 1018555 867871 800742 1114576
11039 1114576 802010 881339 926655 1015575 696038 920508 613392 967843 905995 1180503
11029 1180503 909964 837504 914038 683436 949286 1044651 819221 877159 1052013 731304
11019 731304 728263 785152 939931 692336 821321 432149 534543 733314 281803 903728
$$ packed form
11091B33200m1262j8935J01912K22547l0685E2513b9347J1755B33957k9976b8518
11079B42604J58445j99494B1683K54908j29335K45856J15333M321A34648J34690
11069B69338j20637K30791l5432J37941J24231j68560j51434M1528K29941k61999
11059B95708K45890j32679K62341n0961q5522M5200A26244M87891j82640L12433
11049G43928J41777j43035M25893n57288J54769J26664J25847j50684o7129L13834
11039A114576l12566P9329M5316Q8920l19537K24470l07116L54451o1848K74508
11029A180503k70539p2460P6534k30602K65850R5365k25430N7938J74854l20709
11019G31304l041N6889J54779k47595J28985l89172J02394J98771B81803O21925
$$ plain form
11009 903728 731771 594354 549166 824160 786910 703528 593068 562489 709671 820195
10999 820195 475202 898892 786717 709662 777505 446778 709195 908702 618606 659618
10989 659618 822473 902857 767925 994537 1024768 788197 1083725 1134230 924232 968358
10979 968358 1207560 1271705 1219466 1340774 1491901 1456680 1597801 2137117 2476834 2693762
10969 2693762 2964496 3153725 3326050 3367705 3338131 3588421 3345003 2870598 2355227 1834184
10959 1834184 1769773 1457023 1030370 881396 920714 1038291 667825 1081330 818099 351225
10948 466635 424684 633579 130778 490963 434989 356453 478223 -62134 204318 385044
10938 385044 -142290 164785 230415 102283 -18444 298522 118665 250394 25096 81694
$$ packed form
11009I03728j71957j37417m5188K74994l7250q3382j10460l0579J47182J10524
10999H20195l44993M23690j12175p7055O7843l30727K62417J99507k90096M1012
10989F59618J62855Q0384j34932K26612L0231k36571K95528N0505k09998M4126
10979I68358K39202O4145n2239J21308J51127l5221J41121N39316L39717K16928
10969B693762K70734J89229J72325M1655k9574K50290k43418m74405n15371n21043
10959A834184o4411l12750m26653j48974L9318J17577l70466M13505k63231C51225
10948D66635m1951K08895A30778L60185n5974p8536J21770f2134B04318J80726
10938C85044a42290A64785O5630A02283a8444B98522A18665J31729B5096N6598
$$ plain form
10928 81694 12704 148079 -45416 -58815 59280 166507 62044 335021 191759 8086 -12486
10916 -300378 -255345 -86908 205998 826 -55640 -194710 311571 42008 -3194 334703 -76940
10904 -159080 -222136 81460 153280 -108329 102297 -137020 100098 -19320 -5308 -39459 -157427
10893 -157427 109098 -49953 -293009 -154566 -212409 -211949 -132105 35268 -476765 -142189 -104803
10882 -104803 -29782 12309 -378921 -90340 180153 -270889 -101604 -210970 12151 5299 53155
10871 53155 95081 -205765 92891 -88979 -32257 -47090 90044 -182686 57902 -193170 52097
10859 -254025 -42300 -17398 194189 -55002 -215526 -206379 -370150 -85723 -218749 -111123 -23271
10847 -49938 192921 49206 -16429 -80705 -20519 -80671 -9816 -293332 274706 97378 21387
$$ packed form
10928H1694A2704J35375d5416j3399E9280J07227F2044K72977j43262H086a2486
10916c00378M5033h6908B05998H26e5640j39070C11571D2008c194C34703g6940
10904a59080o3056H1460P1820a08329A02297a37020A00098a9320e308l4151j17968
10893a57427A09098d9953k43056J38443n7843M60P9844C5268d76765a42189L7386
10882a04803b9782A2309c78921i0340A80153b70889a01604j09366A2151E299M7856
10871E3155M1926b05765I2891h8979c2257j4833I0044a82686E7902a93170E2097
10859b54025d2300a7398A94189e5002j60524R147j63771h5723j33026J07626b3271
10847d9938A92921D9206a6429o4276b0519o0152i816k83516B74706I7378B1387
$$ plain form
10835 0 -124089 -610 242862 75215 144937 18868 143720 -15964 111378 24547 146724 46780
10822 -134045 -212385 51006 27938 248502 -54953 138808 -129998 164488 87371 -22426 168255
10810 238301 -382517 126564 180425 -49019 -191572 32121 -89166 50420 6057 282718 -40396
10798 115437 216471 160522 -136857 -75019 14787 -358948 -172689 -9978 -154001 -510105
10788 -510105 -259724 -153303 280395 449644 -33984 -199684 221829 -126234 -187555 -35790
10777 -196279 162384 372902 343418 -243279 -215972 -229438 -350757 -9295 -144258 -59232 -151879
10766 -151879 -124182 262669 -183152 -127341 -192111 -177007 28408 170741 169831 -1203 50732
10754 38276 -8483 -83345 3168 156692 -79316 170633 32058 240560 58654 -31835 82844
$$ packed form
10835@a24089f10B42862G5215O9722A8868J24852a5964A11378B4547J22177D6780
10822a34045p8340E1006k3068K20564e4953A38808a29998A64488p7117b2426A68255
10810B38301c82517A26564N3861d9019j42553C2121h9166E0420F057K76661d0396
10798A15437J01034n5949a36857O1838A4787c58948a72689i978j44023l56104
10788e10105K50381J06421B80395J69249c3984j65700B21829a26234o1321c5790
10777a96279A62384K10518k9484b43279K7307j3466j21319i295j34963e9232r2647
10766a51879K7697B62669a83152N5811o4770J5104B8408J42333r10a203E0732
10754C8276h483p4862C168J53524g9316A70633C2058K08502E8654c1835H2844
$$ plain form
10742 153537 -313590 -184035 -23238 -110091 -489899 -191534 -83600 31059 -329325 52266
10731 31282 -333386 -220272 -121748 -315826 -164184 -170903 280869 -127561 130488 324784
10721 324784 -104565 -68619 -123141 -110615 -29353 -167106 28080 -391665 -265478 -114888
10710 -203032 -392686 -147869 -164350 -296082 -290580 -83597 197027 -150245 35244 -17383 -77278
10699 -77278 120870 -436525 -81696 -268127 159479 -365998 65579 169849 -206255 47098
10688 268996 -297447 -17920 -77386 -180803 -147341 80484 -313092 81713 224487 250732 31114
10676 -282502 3519 -30491 -41644 85454 -529227 -327807 -325925 127922 -207646 -109892 -340042
10665 -340042 -228730 199492 56323 -118541 281617 144249 -130198 -126780 -121690 -198995 235887
$$ packed form
10742A53537c13590J29555b3238q6853l79808a91534h3600C1059c29325E2266
10731C1282c33386J13114R8524j94078J51642o719B80869a27561A30488J94296
10721C24784a04565L5946n4522J2526b9353j37753B8080c91665J26187a14888
10710b03032j89654a47869j6481j31732N502h3597A97027a50245C5244a7383n9895
10699g7278A20870d36525h1696j86431A59479c65998F5579J04270b06255D7098
10688B68996b97447a7920n9466j03417L3462H0484c13092H1713J42774K6245C1114
10676b82502C519c0491j1153H5454e29227K01420J882A27922b07646R7754k30150
10665c40042J11312A99492E6323a18541B81617j37368a30198L418N090p7305B35887
$$ plain form
10653 -121553 -210145 -287621 -18511 -209808 -5294 -184663 104401 -337847 270660 -170340
10642 -107525 115263 -225213 -11462 -89206 213345 -207657 -6976 213533 51022 -65243 99977
10630 -7784 -431839 -108755 -330755 26350 -106257 -85436 -107598 166278 -173059 -113785 -15838
10618 -151886 207894 231894 226833 -85450 -57753 15381 48956 -275383 199955 -293168 223085
10606 422310 16167 -154682 -240232 -21201 319844 -25182 -237978 203490 3896 -231491 41862
10594 164625 -92416 -40408 -185896 147808 -50195 107425 -179213 -223146 16515 -163629
10583 -4601 28565 -242462 -259832 50105 -17214 260322 -197508 155959 -18392 -157773 -209263
10572 -209263 240300 -34685 -309707 -113367 -616155 130281 -275878 8670 34884 171478
$$ packed form
10653a21553q8592p7476a8511j91297e294j79369A04401c37847B70660a70340
10642a07525A15263b25213a1462p7744B13345b07657f976B13533E1022f5243I9977
10630g784m24055a08755k22000B6350a06257K0821k2162A66278a73059N9274a5838
10618a51886B07894K4000n061h5450K7697A5381L3575b75383A99955b93168B23085
10606D22310A6167a54682q5550b1201C19844b5182k12796B03490C896b31491D1862
10594A64625i2416d0408j45488A47808e0195A07425a79213m3933A6515a63629
10583d601B8565b42462j7370E0105a7214B60322a97508A55959a8392j39381n1490
10572b09263B40300c4685k75022a13367n02788A30281b75878H670K6214J36594
$$ plain form
10562 171478 55101 -173205 -64313 359659 -631646 -35955 -230137 2968 -242335 -28628 243139
10550 -365196 82151 -252119 -96505 -206753 -293181 -93267 -108269 -177773 -78350 -275415 -6064
10538 346707 135827 -104950 -80525 -10777 -123548 -36554 -418909 269912 49035 77676
10528 77676 -141249 -324499 -176579 -195030 -95566 -17466 276136 -136889 -318913 -123363
10517 83978 39648 -57233 -153429 301616 -176842 -148352 228465 -264854 17470 64469 141821
10506 141821 20346 -905 87203 172585 56499 -77370 250503 -141043 119536 63862 15161
10494 -223046 75083 -12563 -161644 -235478 -40986 -253123 65797 121750 -52759 -113331 194723
10482 -103908 6279 -195209 585 -80994 -15739 78258 137729 103437 -308311 239264 -274086
$$ packed form
10562A71478E5101a73205f4313C59659f31646c5955j94182B968b42335b8628B43139
10550c65196H2151b52119i6505j10248q6428i3267j5002o9504g8350j97065f064
10538C46707A35827a04950K4425a0777j12771c6554l82355B69912D9035K8641
10528G7676a41249j83250J47920j8451i5566a7466B76136a36889j82024a23363
10517H3978C9648e7233r6196C01616a76842K8490B28465b64854A7470M6999P7352
10506A41821B0346i05H7203Q5382E6499g7370B50503a41043A19536n5674A5161
10494b23046G5083a2563j49081p3834d0986k12137F5797N5953e2759o0572A94723
10482a03908F279a95209E85h0994a5739G8258N9471l4292c08311B39264b74086
$$ plain form
10470 -261118 75036 -198434 125054 57757 32760 257190 -19406 -224730 -430453 -261098
10460 -261098 9707 94098 -143741 -406067 42751 -133437 -487516 -18188 -36462 248878 -273622
10448 -112443 -84242 -78251 149866 213775 4457 118704 -308170 -208882 -158538 -156722 176748
10436 -75364 10429 -2956 -136284 116718 226727 180590 -111646 47013 529524 -37206 -8594
10424 32653 286621 -293968 70993 -339832 -56992 -3304 28637 -139416 -155195 -140300 327347
10412 -115441 23872 -429112 -282098 -224876 -166310 -261327 -62212 160846 -171236 232159
10401 149975 -112769 195448 83970 180285 44166 137613 84125 77187 -215973 183524 309713
10390 309713 -103405 159628 168251 172153 345553 -15554 88566 134174 111266 44650 98143
$$ packed form
10470b61118G5036a98434A25054E7757k4997K24430a9406k05324k05723J69355
10460b61098I707Q4391a43741k62326D2751a33437l54079a8188j8274B48878b73622
10448a12443K8201N991A49866O3909D457J14247c08170R9288N0344J816A76748
10436g5364A0429b956j33328A16718J10009m6137a11646D7013M82511c7206h594
10424C2653K53968b93968G0993c39832e6992c304B8637a39416j5779J4895C27347
10412a15441B3872d29112J47014N7222N8566r5017f2212A60846a71236B32159
10401A49975a12769A95448H3970R6315D4166R3447n3488o938b15973A83524J26189
10390C09713a03405A59628Q623L902J73400a5554H8566M5608k2908D4650N3493
$$ plain form
10379 98143 208815 116857 153801 -9661 189356 47174 267270 222255 105997 281265 111787
10367 295881 455383 183891 -30830 249449 411570 320104 594005 564500 480123 73719
10356 -177238 -175104 484797 224168 503169 420436 389980 779575 643814 598795 772824
10346 772824 788147 106030 187526 419239 279555 -100476 278130 141169 16601 -19686
10335 119611 482261 329515 -63975 122069 260218 125754 -152423 -25017 -116435 299175
10324 390350 91247 38550 160687 490898 120887 99721 168080 -73939 20237 428451 -72739
10312 -104108 29801 232971 92665 165080 48899 144912 166800 -227075 -296454 551937 -190954
10300 -361249 191175 164742 -70513 139715 32694 125530 -17107 -14928 -46909 -155829 -126591
$$ packed form
10379I8143J10672r1958L6944i661A89356D7174K20096m5015A05997J75268A11787
10367B95881J59502A83891c0830B49449J62121r1466K73901k9505q4377G3719
10356a77238K134D84797B24168K79001q2733l0456L89595j35761m5019J74029
10346G72824J5323A06030Q1496K31713j39684a00476B78130j36961A6601a9686
10335A19611L62650j52746f3975A22069J38149A25754a52423b5017r1418B99175
10324C90350I1247C8550J22137L30211A20887k1166O8359g3939B0237M08214g2739
10312a04108B9801K03170I2665P2415D8899R6013K1888b27075o9379E51937a90954
10300c61249A91175k6433g0513A39715C2694R2836a7107K179l1981j08920K9238
$$ plain form
10289 -126591 -254550 -172746 -101263 -79805 -103046 127518 247046 -181061 -103958 -84746 231322
10277 88404 26728 -11275 -230530 -427450 66469 61169 246561 -39790 197890 125057 -16494
10265 62116 447427 -139128 184942 -184392 -275851 -382782 -167820 -148931 271923 -1327
10254 129330 25029 -38798 -13223 -13423 -224640 -85505 -13852 -246995 156809 125911 -54848
10242 -55849 -11968 53538 -28836 -73646 -12300 49930 -341733 -56962 256702 -356691 -112608
10230 237550 -325302 -8619 -177365 -81317 -107488 -122928 76106 -298486 -219204 401516 120202
10218 -212667 -17623 -178600 -419211 -272695 35650 87040 -187891 -102736 -273520 -137360
10208 -137360 -306315 -74028 125383 -184560 21829 -77750 72735 -202468 -237502 -225321 136770
$$ packed form
10289a26591j27959Q1804P1483K1458k3241A27518J19528a81061P7103J9212B31322
10277H8404B6728a1275k19255j96920F6469n300J85392c9790A97890p2833a6494
10265F2116L85311a39128A84942a84392r1459j06931a67820J8889B71923a327
10254A29330B5029c8798a3223k00k11217h5505a3852k33143A56809l0898e4848
10242e5849a1968E3538b8836m4810a2300D9930c41733e6962B56702c56691a12608
10230B37550c25302h619j68746h1317k6171j5440G6106b98486P9282D01516A20202
10218b12667a7623j60977k40611J46516C5650N1390a87891Q5155j70784J36160
10208a37360j68955g4028A25383a84560B1829g7750G2735b02468l5034J2181A36770
$$ plain form
10196 63656 -90549 85651 -289940 -31168 -202533 298349 6882 -72605 -89789 -73723 -128270
10185 -128270 343860 126218 -116184 156299 20196 91042 -286458 -274450 -197795 -219409
10175 -219409 -360010 -46041 -112759 25876 -166354 -100828 77002 -151562 18974 38371 -175634
10163 284512 152312 -285916 -26964 -42229 -192998 220842 -80431 -364094 24839 -117755
10152 133704 -315258 -74265 46902 110747 229752 -284184 214827 -112918 36066 -251646
10141 1102 -145628 -35151 25119 -264664 -281460 -267215 -105343 -132137 138786 84681 -26616
10129 27536 178841 -105472 -133449 99492 -87383 -184200 22272 -132567 13234 62978 -51548
10117 -115157 -58423 52593 15371 24151 -3123 85847 -56757 -134388 -2690 -116073 44376 -290447
$$ packed form
10196F3656i0549H5651b89940c1168j71365B98349F882g2605j7184J6066n4547
10185a28270C43860A26218a16184A56299B0196P0846b86458J2008P6655k1614
10175b19409j40601d6041o6718B5876a66354O5526G7002a51562A8974J9397a75634
10163B84512j32200b85916b6964j5265j50769B20842h0431k83663B4839a17755
10152A33704c15258g4265D6902O3845J19005b84184B14827a12918C6066b51646
10141A102a45628c5151B5119b64664j6796J4245a05343k6794A38786n4105b6616
10129B7536J51305a05472k7977I9492h7383r6817B2272a32567A3234M9744e1548
10117a15157N6734E2593A5371Q780c123H5847e6757p7631b690j13383D4376b90447
$$ plain form
10104 104608 -290177 95023 47040 -114198 -164574 -120231 -170429 -24051 40419 -89393 107910
10092 -134246 -19993 261309 232897 -120146 194778 73071 103491 -109450 60046 -6113 51831
10080 -61115 -33828 -49305 -36641 -12047 -229107 -183188 -97224 104585 -70666 -28767 66972
10068 -67047 -57697 187249 -140467 -258463 -31907 -134941 -160092 -121297 -113397 -170369 -167130
10057 -167130 -194699 51063 -29382 -275858 133920 97528 -82276 32333 -343532 -254724 -276323
10046 -276323 33848 -142050 86027 220483 -10867 6217 160888 -214939 -24042 144356 382194
10035 382194 -415225 86550 -66380 119654 13370 63345 -46916 -9394 -367328 198059 -333490
10023 -62618 -133964 -345954 -60895 53599 -86299 -68253 -352225 -208681 -155222 214489 -11573
$$ packed form
10104A04608b90177I5023D7040a14198n0376M4343n0198b4051D0419h9393A07910
10092a34246a9993B61309k8412a20146A94778G3071L0420a09450F0046f113E1831
10080f1115K7287j5477J2664a2047k17060M5919Q5964A04585g0666b8767F6972
10068f7047R350A87249a40467j17996c1907j03034k5151L8795P900n6972L239
10057a67130k7569E1063b9382k46476A33920l6392h2276C2333c43532Q8808k1599
10046b76323C3848a42050H6027J34456a0867F217J54671b14939b4042A44356K37838
10035C82194d15225H6550f6380A19654A3370M9975d6916i394l57934A98059c33490
10023f2618p1346k11990f0895E3599h6299J8046k83972J43544N3459B14489a1573
$$ plain form
10011 59358 -47962 -98298 190380 202860 -201887 -247583 -141459 -86431 32065 42174 -273849
9999 -444787 -181257 -21600 25607 131548 -273918 -78614 40054 16257 -68358 -177764 -125627
9988 -125627 61107 -37470 94272 -156600 -321768 -40364 333410 16038 -66781 193673 -66443
9976 -68349 110606 -166736 -10786 23032 178277 134146 7462 -192522 -53414 52425 -4876
9964 75185 1374 -153805 -194521 -163199 -85090 -113400 -52332 -20399 -141121 -141063 -388042 92885
9951 5241 227904 95630 -91976 -135009 118192 254453 -74389 144342 -110684 -69513 168667
9939 -264603 17157 -341758 69655 114471 15509 -89054 55905 143358 50095 -106728 -105410
9928 -105410 1715 -110699 -230351 40065 93285 152590 -155365 -34347 182906 -148894 44863
$$ packed form
10011E9358d7962n0336A90380J2480b01887m5696J06124N5028C2065J0109b73849
9999d44787a81257b1600B5607J05941b73918g8614D0054A6257f8358j09406N2137
9988a25627F1107c7470I4272a56600j65168d0364C33410A6038f6781A93673f6443
9976f8349A10606a66736a0786B3032J55245m4131G462a92522e3414E2425d876
9964G5185A374a53805m0716L1322P8109k8310e2332b0399j20722N8k46979I2885
9951E241K22663I5630i1976m3033A18192J36261g4389A44342a10684M1171A68667
9939b64603A7157c41758F9655M4816A5509h9054E5905Q7453E0095a06728J318
9928a05410A715a10699j19652D0065N3220N9305a55365c4347A82906a48894D4863
$$ plain form
9916 -89765 -249970 -195526 -282962 114444 -50209 -252860 -257942 -497607 -58714 109002 39803
9904 -449712 48097 131838 13847 -320898 114495 70270 -55335 -42595 -102843 5641 -130404
9892 22905 10444 155353 -101236 -47725 147693 -305197 59363 42259 3993 -178030 -17839
9880 47456 -18939 -67364 -227360 -127705 -190274 -147696 -205345 172248 -1410 -140841 -141381 89697
9867 -199029 27411 -193459 -265337 21267 -316305 -28203 -19754 77925 -232711 9461 186990
9856 186990 -18862 3314 -135383 21988 -196738 179442 -124718 -103884 -98605 180930 103073
9845 103073 -135943 -98407 -89544 115136 -84452 264120 -195764 -47681 -103040 146670 270846
9834 270846 -205374 33402 112456 105556 6402 -388182 -40523 -269532 92869 223627 -265151
$$ packed form
9916h9765j60205N4444q7436A14444e0209k02651n082k39665e8714A09002C9803
9904d49712D8097Q3741A3847c20898A14495m4225e5335J2740o0248E641a30404
9892B2905A0444J44909a01236d7725A47693c05197E9363j7104C993a78030a7839
9880D7456a8939m8425j59996R9655o2569M2578n7649A72248a410j39431n40H9697
9867a99029B7411a93459p1878B1267c16305b8203Q449G7925b32711I461J77529
9856A86990a8862C314a35383B1988a96738A79442a24718K0834N279A80930p7857
9845A03073a35943L7536Q863A15136h4452B64120a95764d7681n5359A46670J24176
9834B70846b05374C3402P9054o900F402c88182d0523k29009I2869J30758b65151
$$ plain form
9822 84847 -420556 36179 -22621 -15018 124983 -255001 -188531 134296 617 27745 -218729
9810 117040 221573 319572 101064 -20640 -11402 -17531 -266961 139150 328107 -90157 -459385
9799 -459385 143304 -410024 -86925 249348 -170159 44989 -258625 153162 -127299 -88308
9789 -88308 -63123 -288778 42743 -104631 290808 12467 -141603 -102299 -84353 -156108 -86439
9778 -86439 -45779 -124890 -80533 98398 -73703 -174872 144730 -257428 29445 -140184 33039
9766 -96436 -112742 -37573 -66430 -345832 203854 -33873 193393 -118659 327771 -93523 -176923
9755 -176923 -156048 -147737 -243450 -368488 34522 197205 -302854 -38381 -209787 -57558 -53185
9744 -53185 -264566 -42444 -225098 -105578 -329185 96530 -358533 208035 -104382 -90424
$$ packed form
9822H4847d20556C6179b2621P603A24983b55001O6470A34296F17K7128b18729
9810A17040J04533R7999A01064b0640R238o129k49430A39150J88957i0157l69228
9799d59385A43304d10024h6925B49348a70159D4989b58625A53162a27299L8991
9789h8308K5185k25655D2743a04631B90808A2467a41603L9304J7946p1755O9669
9778h6439M0660p9111M4357I8398g3703j01169A44730b57428B9445a40184C3039
9766i6436j6306c7573k8857k79402B03854c3873A93393a18659C27771i3523q3400
9755a76923K0875Q311r5713j25038C4522J62683c02854c8381j71406e7558M373
9744e3185k11381d2444j82654a05578k23607I6530c58533B08035a04382J3958
$$ plain form
9734 -90424 -336569 187378 -432268 -117976 -160281 -54280 67495 58535 77341 62391 -242657
9722 70551 94783 -132361 130577 34473 100349 219028 -227084 161620 -367071 -161912
9711 -93286 -28475 -151615 33092 -358402 304316 -62864 -57259 -186926 -385362 94013 -195206
9699 50693 -13161 230054 62138 -329341 -350 76761 -20407 -162059 -142316 -225225 99048 -25791
9686 -7545 -51362 -245883 -236687 -197630 -123114 -28510 120192 145943 56413 -62616 -182913 -357406
9674 -357406 -4132 -98735 -51559 -251587 -139333 -224469 -279042 77468 -59144 -109750 -162616
9663 -162616 -81998 -208391 -78260 -17577 -197825 -65030 112650 -187220 -199665 230369 -81485
9651 -69546 -469099 -44134 57896 -119992 -97740 -30192 -81567 57697 -468262 66273 11263
$$ packed form
9734i0424k46145A87378d32268a17976m2305e4280F7495q960J8806j4950b42657
9722G0551K4232a32361A30577C4473O5876J18679b27084A61620c67071a61912
9711i3286b8475j23140C3092c58402C04316f2864N605j29667j98436I4013a95206
9699E0693a3161B30054F2138c29341c50G6761b0407j41652J9743q2909I9048b5791
9686g545m3817j94521R196L9057P4516b8510A20192K5751E6413f2616j20297j74493
9674c57406d132r4603M7176k00028J12254q5136n4573G7468e9144n0606n2866
9663a62616Q0618j26393g8260a7577j80248f5030A12650a87220j2445B30369h1485
9651f9546l99553d4134E7896a19992K2252c0192n1375E7697d68262F6273A1263
$$ plain form
9639 136389 -178915 56452 -115252 -59329 -31642 101680 3909 -102147 53344 -103365 119159
9627 -41923 -232657 -257338 -340203 -243706 -243006 -326271 -6409 127676 -224050 -21637 -278234 175881
9614 -29983 -153190 -218346 74109 562 -3971 181015 -18560 -100765 -267020 -232146 -72535 -61918
9602 -61918 -35522 -304202 -12778 67690 162490 -109433 -186338 -13080 -11950 97592 -339624
9590 -28571 -100715 -441996 72261 5443 -93691 213784 -85587 -153573 -191876 -21873 -47689 117684
9577 140777 -285920 48430 -343854 93522 190278 50036 -251232 -139842 -117497 -238232 -174616
9566 -174616 -42491 -7078 -336161 -107232 -77035 -453030 -111341 120752 235166 88580 -131693
9554 -17216 -262934 -12393 -102642 245640 -123946 104414 8813 -570357 46302 205283 -80727
$$ packed form
9639A36389a78915E6452a15252N5923K7687A01680C909a02147E3344a03365A19159
9627d1923j90734k4681q2865R6497P00q3265f409A27676b24050b1637k56597A75881
9614b9983j23207o5156G4109E62c971A81015a8560q2205j66255L4874g2535J0617
9602f1918K6396k68680a2778F7690R4800a09433p6905a3080J130I7592c39624
9590b8571p2144l41281G2261E443i3691B13784h5587o7986l8303b1873k5816A17684
9577A40777b85920D8430c43854I3522R6756E0036b51232J11390K2345j20735O3616
9566a74616d2491g078l29083a07232L0197l75995a11341A20752J14414H8580a31693
9554a7216k45718a2393r0249B45640a23946A04414H813e70357D6302J58981h0727
$$ plain form
9542 -20587 -148557 -151220 20753 -63836 185041 227059 177140 138365 -54636 51005 -193879
9530 -185695 -2246 97453 -325832 134589 14222 88559 -201474 -131015 275774 186540 -234349
9518 130467 -247648 25695 -136631 -106901 118598 191519 -247792 -85159 -158750 -273026 -224664
9507 -224664 283714 -182514 190886 -119993 -69732 -214453 -125719 -414470 128160 248212
9497 248212 -275371 -6853 207076 101779 431482 -222054 238352 -134792 149975 -402549
9486 -165867 -170576 181754 -121593 -316126 -93088 -314684 79998 -243925 -95668 -18832 449010
9474 -166172 -303597 -155810 -423728 57306 -64933 105714 450597 -535290 -119735 -269226
9464 -269226 -63857 -298874 -194296 -152472 -35609 197008 8747 -225222 -66938 51966 -32593
$$ packed form
9542b0587j27970k663B0753f3836A85041M2018m9919l8775e4636E1005a93879
9530a85695b246I7453c25832A34589A4222P4337b01474P0459B75774q9234b34349
9518A30467b47648B5695a36631K9730A18598P2921b47792h5159p3591j14276M8362
9507b24664B83714a82514A90886a19993N0261j44721Q8734k88751A28160J20052
9497B48212b75371f853B07076A01779L29703b22054B38352a34792A49975d02549
9486a65867m709A81754a21593j94533i3088k21596G9998b43925i5668a8832D49010
9474a66172j37425J47787k67918E7306f4933A05714L44883e35290a19735j49491
9464b69226f3857k35017J04578M1824c5609A97008H747b25222f6938E1966c2593
$$ plain form
9452 -125417 -256022 -31706 -324936 93240 -320470 93524 121561 33126 -94594 -240594 77414
9440 -143726 -78992 120338 -181369 -155375 38694 66814 -111796 -69334 -48852 -327971 68842
9428 -24376 -277124 -86597 30762 -175497 5699 -291952 64023 -60652 -116545 -389815 -260295
9417 -260295 -164942 145454 101626 -134918 -214069 -132318 71839 -66485 -74172 180314 -307203
9405 -207717 44349 323561 -203271 46589 -157708 -15370 53343 123170 221759 107675 28407
9393 29326 -280693 80871 -291030 -65228 -245422 -199830 258271 -141898 -112622 313504 -58328
9381 227542 278203 15219 -125614 -1042 36478 229350 55528 95505 -306452 31476 37017
9370 37017 -98850 -205436 -219144 45886 224931 29947 93139 252395 23237 -11657 -550506
$$ packed form
9452a25417j30605c1706k93230I3240c20470I3524K8037C3126i4594j46000G7414
9440a43726O4734A20338a81369K5994C8694K8120a11796M2462K0482k79119F8842
9428b4376k52748h6597C0762a75497E699b91952F4023f0652n5893k73270J29520
9417b60295R5353A45454m3828a34918p9151Q1751G1839f6485p687A80314c07203
9405b07717D4349K79212b03271D6589a57708a5370E3343O9827R8589A07675B8407
9393B9326b80693H0871b91030f5228j80194M5592B58271a41898K9276C13504e8328
9381B27542N0661A5219a25614a042C6478J92872E5528L9977c06452C1476N541
9370C7017i8850j06586j3708D5886J79045B9947O3192J59256B3237a1657n38849
$$ plain form
9359 -550506 235639 -328982 270378 -150238 -129376 230593 144269 -250821 -75 -2815 -282534
9348 -282534 200382 -282251 160182 -135780 -128827 280923 215145 -35726 -38563 -15695 -204985
9337 -204985 -314504 -283002 -192823 257568 -24364 -286842 -132878 38927 -1539 -79644 -257559
9326 -257559 355668 -39668 47179 4970 -220493 22748 -124587 -208306 17572 -354481 -226409
9315 -226409 84303 94212 -49244 -73186 -375356 -104178 -62853 495240 318138 -311310 -267550
9304 -267550 -211755 -51578 -270057 -36292 -52618 185852 208403 78125 75604 -302401 192265
9292 93051 -204105 262159 150740 131754 -271538 -21555 259025 -148418 112481 36120
9281 172755 103810 -240734 -299100 -48394 6843 -52384 26076 -95818 -91145 26581 -215285 -106223
$$ packed form
9359e50506B35639c28982B70378a50238K0862B30593q6324b50821g5k740k79719
9348b82534B00382b82251A60182a35780O953B80923o5778c5726k837a5695j89290
9337b04985j09519L1502R0179B57568b4364k62478a32878C8927a539p8105j77915
9326b57559C55668c9668D7179D970b20493B2748a24587q3719A7572c54481J28072
9315b26409H4303R909d9244k3942l02170a04178M1325D95240j77102c11310M3760
9304b67550N5795e1578k18479c6292j6326A85852K2551G8125k521c02401A92265
9292I3051b04105B62159j11419j8986b71538b1555B59025a48418A12481C6120
9281A72755o8945b40734n8366d8394F843e2384B6076i5818M673B6581b15285a06223
$$ plain form
9268 -175347 295047 -82146 -463124 -192998 11865 -159202 -54379 70659 145475 -206046 270697
9256 -181320 -250487 20269 -146283 203179 -113490 -322835 173787 56973 -229780 -313667
9246 -313667 -180954 -35629 -41290 -281764 -22656 -89060 -82577 -258987 -62642 -359106 21888
9234 -143592 29170 105922 -311116 117033 -32045 -30974 -7274 29787 -67595 30730 -80452 -89040
9222 -89040 -326494 -429426 21355 65360 -157830 235555 152505 43150 -109176 -191901 -10553
9210 -126589 -27371 -12685 -162224 34282 -92467 -277997 22623 -460609 -154526 23624 5940
9198 -138754 -59629 171902 108254 89714 -64631 -210827 -218774 -235097 -11128 246471 -115151
9186 130864 -38 148515 -201468 -228431 -9088 252115 -202866 96334 3725 99719 -45037 -34133
$$ packed form
9268a75347B95047h2146l80978a92998A1865a59202e4379G0659P4816b06046B70697
9256a81320o9167B0269a46283B03179a13490k09345A73787E6973b29780q3887
9246c13667J32713c5629n661k40474b2656o6404O483j76410f2642k96464B1888
9234a43592B9170P6752c11116A17033c2045J071g274B9787f7595C0730h0452q588
9222h9040k37454j02932B1355M4005a57830B35555q3050D3150a09176q2725a0553
9210a26589b7371a2685j49539C4282i2467j85530B2623d60609a54526B3624E940
9198a38754e9629A71902o3648j8540f4631j46196p947j6323a1128B46471a15151
9186A30864c8A48515b01468k6963i088B52115b02866I6334C725R5994d5037J0904
$$ plain form
9174 -34133 -150308 -3156 210205 -275534 -75500 -90414 -146642 -113975 190684 -27045 50750
9162 156051 10210 -132952 89810 -287807 283373 102689 43767 -190253 -92473 -305950
9152 -305950 -243751 -120891 4544 -146954 -172073 54949 -142308 -147402 -383879 -182180 170220
9140 -54820 22125 -52129 -7393 -399664 107066 16153 220042 8100 21706 50268 144459 78561
9128 78561 -3613 -286861 -205530 210468 -199946 -387979 94239 -257596 -366214 81553 -60239
9116 104381 -310362 -370662 70244 -254109 -109621 -87879 -43605 -12983 -542527 15118 -21105
9104 22151 75288 134022 -8455 -287372 203730 -156573 50148 -137074 -320860 -21524 -52649
9093 -52649 -90624 -126545 174409 -201990 -161155 74292 -51965 -116373 -218019 -113297 -11223
$$ packed form
9174c4133j16175c156B10205b75534g5500j4914n6228L2667A90684b7045E0750
9162A56051A0210a32952H9810b87807B83373A02689D3767a90253i2473k13477
9152c05950O2199a20891D544a46954k5119E4949a42308n094k36477a82180A70220
9140e4820B2125e2129g393l92271A07066A6153K03889H100J3606K8562R4191o5898
9128G8561c613k83248Q1331B10468a99946j88033I4239b57596j08618H1553f0239
9116A04381c10362o0300G0244b54109a09621K1742d3605a2983n29544A5118b1105
9104B2151N3137N8734h455k78917B03730a56573E0148a37074j83786b1524l1125
9093e2649l7975l5921A74409b01990M0835G4292e1965o4408j01646J04722a1223
$$ plain form
9081 -27441 -264878 19812 83609 -104266 -128490 361026 -149270 -79062 270083 117419 -188753
9069 -128866 -239455 -241226 -250773 -118356 -131510 -11224 -23304 91804 -228979 -24268 189849
9057 35874 -199624 -147035 161765 -421429 -230588 -214414 -302648 -6144 73850 -42765 -106164
9046 -106164 -161076 -69757 -95555 175506 -210359 177266 188017 -77638 -177182 -288148 87533
9034 -64035 120816 -58408 256162 -260216 -50204 -48656 -18750 -312901 -327595 54684 -289320
9022 95457 -132590 -327133 178217 57418 -224007 -182705 210337 -44889 82826 -123355 305613
9010 -188451 -122601 146420 -238069 -510810 148462 139510 -21835 39560 -114357 162064 -164312
8998 -185166 15818 -174836 4231 16476 190469 -246379 147452 27340 -103305 -69080 128342
$$ packed form
9081b7441k37437A9812O3797a04266k4224C61026a49270P0208B70083A17419a88753
9069a28866j10589j771r547a18356j3154a1224j2080I1804b28979b4268A89849
9057C5874a99624N2589A61765d21429J90841J6174q8234f144G3850d2765o3399
9046a06164n4912f9757k5798A75506b10359A77266J0751g7638r9544j10966H7533
9034f4035A20816e8408B56162b60216e0204J548a8750k94151j4694E4684b89320
9022I5457a32590j94543A78217E7418b24007M1302B10337d4889H2826a23355C05613
9010a88451O5850A46420b38069k72741A48462q952b1835C9560a14357A62064a64312
8998a85166A5818a74836D231J2245J73993b46379A47452B7340a03305L4225A28342
$$ plain form
8986 -91903 14418 69856 55138 -124924 -65504 -37422 409532 -116419 -189318 -754 -34676 -205931
8974 -205931 -156017 -103032 -181586 -303212 -98447 -4210 -172529 254958 -236069 -160557 -122342
8963 -122342 -107242 71774 50943 183720 60149 -470718 -281132 -396470 -75842 -230388 419049
8951 -384782 -157286 66398 -27359 -459434 -277377 -15805 -19572 115399 -199141 -129124 -123145
8940 -123145 45012 -140546 353418 -172034 -83393 -10177 -151540 -317947 242210 -5862 -101184
8929 -101184 -32597 130006 60003 -97689 320175 199597 441449 716873 1531029 4291473
8919 4291473 15778143 4178919 892406 417539 360889 57729 99308 -58631 453369 -359731
8908 469337 -314375 -19429 132053 217545 -57290 -215898 35884 137088 -134014 -258452
$$ packed form
8986i1903A4418N5438j4718a24924N9420K8082D09532a16419p2899g54l3922j71255
8974b05931M9914N2985p8554j21626i8447d210j68319B54958b36069P5512L8215
8963a22342J5100G1774k0831J32777F0149d70718J89586j15338g5842j54546D19049
8951c84782a57286F6398b7359m32075J82057a5805l767A15399a99141P0017N979
8940a23145D5012a40546C53418a72034h3393a0177j41363j66407B42210e862r5322
8929a01184c2597A30006F0003i7689C20175j20578K41852K75424Q14156K760444
8919D291473J1486670D178919H92406D17539n6650E7729M1579e8631D53369c59731
8908D69337c14375a9429A32053Q5492e7290j58608C5884J01204a34014j24438
$$ plain form
8898 -258452 252465 225977 275 167294 -167428 206424 -265503 58149 -256158 -127230 140538
8886 238584 208940 60631 -245067 -165578 69051 -226590 106625 -251838 145031 126085 366184
8875 366184 -156087 150500 -4045 28693 -348132 -150594 36715 17917 -19820 128189 118271
8864 118271 -280741 -134758 -94338 -151224 125421 -214046 -138542 127729 -286896 5350 194930
8853 194930 -39426 -11247 -93039 -64562 -301979 38206 30949 -78423 100695 104051 97552 5413
$$ packed form
8898b58452B52465k6488B75J67019a67428B06424b65503E8149b56158a27230A40538
8886B38584k9644F0631b45067P9489F9051b26590A06625b51838A45031j8946K40099
8875C66184a56087A50500d045B8693c48132a50594C6715A7917a9820A28189r918
8864A18271b80741a34758M0420n6886A25421b14046P5504A27729b86896E350J89580
8853A94930c9426a1247q1792K8477k37417C8206p257g8423A00695L356o499E413
$$ [...]
##END NTUPLES=NMR SPECTRUM
##END=
