
##TITLE=AC1234_TANRS11078_6610440_aPk0SzIbzV
##JCAMPDX= 6.0         $$ Bruker NMR JCAMP-DX V2.0
##DATA TYPE= NMR SPECTRUM
##DATA CLASS= NTUPLES
##ORIGIN= BRUKER
##OWNER= Administrator
$$ 1.72 TOPSPIN		Version 2.1
$$ 2012-08-02 02:38:32.640 -0500  Administrator@TOPSPIN
$$ Compression mode = diff/dup
##.OBSERVE FREQUENCY= 400.02188249412
##.OBSERVE NUCLEUS= ^1H
##.ACQUISITION MODE= SIMULTANEOUS (DQD)
##.ACQUISITION SCHEME= undefined
##.AVERAGES= 64
##.DIGITISER RES= 22
##SPECTROMETER/DATA SYSTEM= spect
##.PULSE SEQUENCE= noesygpps1d.comp
##.SOLVENT NAME= COFFEE_meoh
##.SHIFT REFERENCE= INTERNAL, COFFEE_meoh, 1, 14.96237
##AUDIT TRAIL= $$ (NUMBER, WHEN, WHO, WHERE, PROCESS, VERSION, WHAT)
$$ ##TITLE= Audit trail, TOPSPIN		Version 2.1
$$ ##JCAMPDX= 5.01
$$ ##ORIGIN= Bruker BioSpin GmbH
$$ ##OWNER= Administrator
$$ $$ C:\Bruker\TOPSPIN/data/COFFEE/nmr/AC1234_TANRS11078_6610440_aPk0SzIbzV/12/pdata/1/auditp.txt
$$ ##AUDIT TRAIL=  $$ (NUMBER, WHEN, WHO, WHERE, PROCESS, VERSION, WHAT)
(   1,<2012-08-02 02:38:16.953 -0500>,<Administrator>,<TOPSPIN>,<go>,<TOPSPIN 2.1>,
      <created by zg
	started at 2012-08-02 02:26:45.125 -0500,
	POWCHK enabled, PULCHK disabled,
       configuration hash MD5:
       6B 1B 68 BB D9 2E 58 E2 7F 35 AD 54 07 DF 0E 41
       data hash MD5: 64K
       53 96 C0 18 4F 55 DB 97 EA 42 13 DA 9D 22 7B 8E>)
(   2,<2012-08-02 02:38:24.875 -0500>,<Administrator>,<TOPSPIN>,<proc1d>,<TOPSPIN 2.1>,
      <Start of raw data processing
       efp LB = 0.3 FT_mod = 6 PKNL = 1 PHC0 = 0 PHC1 = 0 SI = 128K 
       data hash MD5: 128K
       4A 99 AB A9 A5 09 E8 FD 3B F3 84 35 92 0C C4 80>)
(   3,<2012-08-02 02:38:27.390 -0500>,<Administrator>,<TOPSPIN>,<proc1d>,<TOPSPIN 2.1>,
      <pk PHC0 = -0.6976318 PHC1 = 0 
       data hash MD5: 128K
       AF 18 51 DD 3D AB 74 C0 37 EB 5F F4 02 8A FE 1B>)
(   4,<2012-08-02 02:38:29.875 -0500>,<Administrator>,<TOPSPIN>,<proc1d>,<TOPSPIN 2.1>,
      <abs ABSG = 1 
       data hash MD5: 128K
       5E CE B7 4D 8B CE E5 25 4B D1 DA 89 38 FB 37 4A>)
(   5,<2012-08-02 02:38:30.359 -0500>,<Administrator>,<TOPSPIN>,<proc1d>,<TOPSPIN 2.1>,
      <abs ABSG = 2 
       data hash MD5: 128K
       39 22 E7 3F 8A 46 78 F2 67 BB 5E DE 58 07 4B DE>)
(   6,<2012-08-02 02:38:30.765 -0500>,<Administrator>,<TOPSPIN>,<proc1d>,<TOPSPIN 2.1>,
      <abs ABSG = 3 
       data hash MD5: 128K
       61 2C 3A 21 90 1C 73 63 39 A0 06 EC D1 5D B9 83>)
(   7,<2012-08-02 02:38:31.296 -0500>,<Administrator>,<TOPSPIN>,<proc1d>,<TOPSPIN 2.1>,
      <abs ABSG = 4 
       data hash MD5: 128K
       3E 96 B5 19 3F 25 BC 44 F9 64 04 92 67 6D 31 EB>)
(   8,<2012-08-02 02:38:31.765 -0500>,<Administrator>,<TOPSPIN>,<proc1d>,<TOPSPIN 2.1>,
      <abs ABSG = 5 
       data hash MD5: 128K
       2A F2 94 70 E3 F3 82 50 CD 59 17 79 D8 95 F9 53>)
$$ ##END=
$$ 
$$ $$ hash MD5
$$ $$ 4B F6 1D F6 65 BD 22 57 58 73 9D 28 FF 32 FB 0F
##$RELAX= 
##$RELAX= 
##$RELAX= 
##$RELAX= 
##$RELAX= 
##$RELAX= 
##$RELAX= 
##$RELAX= 
$$ Bruker specific parameters
$$ [...]
##$TP07= 0
##$TPNAME0= <>
##$TPNAME1= <>
##$TPNAME2= <>
##$TPNAME3= <>
##$TPNAME4= <>
##$TPNAME5= <>
##$TPNAME6= <>
##$TPNAME7= <>
##$TPOAL= (0..7)
0.5 0.5 0.5 0.5 0.5 0.5 0.5 0.5
##$TPOFFS= (0..7)
0 0 0 0 0 0 0 0
##$TUNHIN= 0
##$TUNHOUT= 0
##$TUNXOUT= 0
##$USERA1= <user>
##$USERA2= <user>
##$USERA3= <user>
##$USERA4= <user>
##$USERA5= <user>
##$V9= 5
##$VALIST= <valist>
##$VCLIST= <CCCCCCCCCCCCCCC>
##$VD= 0
##$VDLIST= <DDDDDDDDDDDDDDD>
##$VPLIST= <PPPPPPPPPPPPPPP>
##$VTLIST= <TTTTTTTTTTTTTTT>
##$WBST= 1024
##$WBSW= 4
##$XGAIN= (0..3)
0 0 0 0
##$XL= 0
##$YL= 0
##$YMAX_a= 14417447
##$YMIN_a= -8438393
##$ZGOPTNS= <>
##$ZL1= 120
##$ZL2= 120
##$ZL3= 120
##$ZL4= 120
##$ABSF1= 14.96237
##$ABSF2= -5.595812
##$ABSG= 5
##$ABSL= 3
##$ALPHA= 0
##$AQORDER= 0
##$ASSFAC= 0
##$ASSFACI= 0
##$ASSFACX= 0
##$ASSWID= 0
##$AUNMP= <proc_prof1d_extract.lims>
##$AXLEFT= 0
##$AXNAME= <>
##$AXNUC= <1H>
##$AXRIGHT= 0
##$AXTYPE= 0
##$AXUNIT= <>
##$AZFE= 0.1
##$AZFW= 0.1
##$BCFW= 0
##$BC_mod= 0
##$BYTORDP= 0
##$COROFFS= 0
##$CY= 15
##$DATMOD= 1
##$DC= 0
##$DFILT= <>
##$DTYPP= 0
##$F1P= 0
##$F2P= 0
##$FCOR= 0.5
##$FTSIZE= 131072
##$FT_mod= 6
##$GAMMA= 0
##$GB= 0
##$INTBC= 1
##$INTSCL= 1
##$ISEN= 128
##$LB= 0.3
##$LEV0= 0
##$LPBIN= 0
##$MAXI= 10000
##$MC2= 0
##$MEAN= 0
##$ME_mod= 0
##$MI= 0
##$NCOEF= 0
##$NC_proc= -2
##$NLEV= 6
##$NOISF1= 0
##$NOISF2= 0
##$NSP= 0
##$NTH_PI= 0
##$NZP= 0
##$OFFSET= 14.96237
##$PC= 1
##$PHC0= -0.6976318
##$PHC1= 0
##$PH_mod= 1
##$PKNL= yes
##$PPARMOD= 0
##$PPDIAG= 0
##$PPIPTYP= 0
##$PPMPNUM= 2147483647
##$PPRESOL= 1
##$PSCAL= 4
##$PSIGN= 0
##$PYNMP= <proc.py>
##$REVERSE= no
##$SF= 400.020009087744
##$SI= 131072
##$SIGF1= 0
##$SIGF2= 0
##$SINO= 400
##$SIOLD= 131072
##$SPECTYP= <>
##$SREGLST= <1H.CDCl3>
##$SSB= 0
##$STSI= 131072
##$STSR= 0
##$SW_p= 8223.68421052631
##$SYMM= 0
##$S_DEV= 0
##$TDeff= 65536
##$TDoff= 0
##$TI= <>
##$TILT= no
##$TM1= 0
##$TM2= 0
##$TOPLEV= 0
##$USERP1= <user>
##$USERP2= <user>
##$USERP3= <user>
##$USERP4= <user>
##$USERP5= <user>
##$WDW= 1
##$XDIM= 131072
##$YMAX_p= 431465696
##$YMIN_p= -11793
##$CURPLOT= <Network HP LaserJet P1505>
##$CURPRIN= <$Network HP LaserJet P1505>
##$DFORMAT= <normdp>
##$LAYOUT= <+/1D_H.xwp>
##$LFORMAT= <normlp>
##$PFORMAT= <normpl>
##$SURQMSG= 1
$$ End of Bruker specific parameters
$$ ---------------------------------
##NTUPLES= NMR SPECTRUM
##VAR_NAME=  FREQUENCY,     SPECTRUM/REAL,   SPECTRUM/IMAG
##SYMBOL=    X,             R,               I
##VAR_TYPE=  INDEPENDENT,   DEPENDENT,       DEPENDENT
##VAR_FORM=  AFFN,          ASDF,            ASDF
##VAR_DIM=   131072,        131072,          131072
##UNITS=     HZ,            ARBITRARY UNITS, ARBITRARY UNITS
##FACTOR=    0.0627417313425164, 1,          1
##FIRST=     8223.62146879497, 151,          -57824
##LAST=      0,             2229,            -57796
##MIN=       0,             -11793,          0
##MAX=       8223.62146879497, 431465696,    0
$$ Real data points
##PAGE= N=1
##DATA TABLE= (X++(R..R)), XYDATA
$$ [...]
63459F32257j1974j0530r685r062p832n912m062k811j968j287q92p97o74l31J30
$$ 632257 620283 609753 600068 591006 583174 577262 573200 570389 568421 567134 566242 565445 564771 564440 564570
63444E64570P21J560K313K382J817J421J627K017K237K722L950N590O927P850
$$ 564570 565291 566851 569164 571546 573363 574784 576411 578428 580665 583387 587337 592927 599854 607704
63430F07704Q807J0117J1731J3507J5357J7179J8987K0996K3389K6052K8655L0867
$$ 607704 616511 626628 638359 651866 667223 684402 703389 724385 747774 773826 802481 833348
63418H33348L2509L3711L4875L6218L7309L7298L5485L1525K5354J7432Q910J001
$$ 833348 865857 899568 934443 970661 1007970 1045268 1080753 1112278 1137632 1155064 1163974 1164975
63406A164975n744j1162j4854j6540j6838j6805j6778j6400j5856j6067j7506
$$ 1164975 1159231 1148069 1133215 1116675 1099837 1083032 1066254 1049854 1033998 1017931 1000425
63395A000425j9696k2102k4590k6733k7611k6904k5424k4002k2450k0224j7498
$$ 1000425 980729 958627 934037 907304 879693 852789 827365 803363 780913 760689 743191
63384G43191j4958j2927j1167r296p096m784l039k301j958r40P93K241L006L928
$$ 743191 728233 715306 704139 694843 687747 682963 679924 677623 675665 674725 675518 677759 680765 684693
63370F84693N626P469Q713R633J0746J1760J2303J2953J4503J6704J8768K0628
$$ 684693 690319 697788 706501 716134 726880 738640 750943 763896 778399 795103 813871 834499
63358H34499K2639K4491K5530K6024K6878K8050K8238K6264K2055J6113Q938J180
$$ 834499 857138 881629 907159 933183 960061 988111 1016349 1042613 1064668 1080781 1089719 1090899
63346A090899o202j2303j6624j9077k0070k0392k0582k0516k0024j9620j9957
$$ 1090899 1084697 1072394 1055770 1036693 1016623 996231 975649 955133 935109 915489 895532
63335H95532k0807k1397k1717k2640k4524k6464k7274k6663k5097k3036k0717
$$ 895532 874725 853328 831611 808971 784447 757983 730709 704046 678949 655913 635196
63324F35196j8317j5923j3550j1493j0375j0503j1285j1678j1205j0277r513r003
$$ 635196 616879 600956 587406 575913 565538 555035 543750 532072 520867 510590 501077 492074
63312D92074q385p411o256n297m798m835n226n476n139m432m261n175o531p166
$$ 492074 483689 476278 470022 464725 459927 455092 449866 444390 439251 434819 430558 425383 418852 411686
63298D11686o781o171o039o284o491o547o413n872m919m081l845m017l935l241
$$ 411686 404905 398734 392695 386411 379920 373373 366960 361088 356169 352088 348243 344226 340291 337050
63284C37050k201j351r98j006j008r10r81j272j255n20L91N60Rl09J22P96J079
$$ 337050 334849 333498 332500 331494 330486 329576 328595 327323 326068 325548 325939 326499 326508 326199 326321 327117 328196
63267C28196R05L99l30p11k9J352J986J193N7r8O06J248J634K156K643K599K262
$$ 328196 329101 329500 329170 328459 328430 329782 331768 332961 333018 332920 333526 334774 336408 338564 341207 343806 346068
63250C46068K411L103L560L335K883K810L157L554L669L432L127L163L550L804
$$ 346068 348479 351582 355142 358477 361360 364170 367327 370881 374550 377982 381109 384272 387822 391626
63236C91626L637L360L310L330L252L363L831M157L865L323L167L316L327L346
$$ 391626 395263 398623 401933 405263 408515 411878 415709 419866 423731 427054 430221 433537 436864 440210
63222D40210L852M637N078N259N904P101Q094Q387Q284P989P010M894J992q40
$$ 440210 444062 448699 453777 459036 464940 472041 480135 488522 496806 504795 511805 516699 518691 517851
63208E17851k955m082m217l690l021k477j903j118k76L00M83M37N17J010J816
$$ 517851 514896 510814 506597 502907 499886 497409 495506 494388 494112 494412 494895 495332 495849 496859 498675
63193D98675K481K684K637K789L286L854M157M091L829L714L905M167M240M404
$$ 498675 501156 503840 506477 509266 512552 516406 520563 524654 528483 532197 536102 540269 544509 548913
63179E48913N186O394P114O937O589O905P761Q440Q520P922O666N253M638N104
$$ 548913 554099 560493 567607 574544 581133 588038 595799 604239 612759 620681 627347 632600 637238 642342
63165F42342N626N186M252M079M884N709N829N347M471L151J529m0j495k984m285
$$ 642342 647968 653154 657406 661485 666369 672078 677907 683254 687725 690876 692405 692365 690870 687886 683601
63150F83601n032n469o248p432q366q644q558q511q535q483q212p553o601n863
$$ 683601 678569 673100 666852 659420 651054 642410 633852 625341 616806 608323 600111 592558 585957 580094
63136E80094n629n356m326k863k082k395k996l019k542k195k265k485k412j873
$$ 580094 574465 569109 564783 561920 559838 557443 554447 551428 548886 546691 544426 541941 539529 537656
63122E37656j184r23j284j842k208k484k765k695k083j453j345j501j493j542
$$ 537656 536472 535549 534265 532423 530215 527731 524966 522271 520188 518735 517390 515889 514396 512854
63108E12854j883j847p53P36J385J326J817L159M277M530M522M803N083N306O151
$$ 512854 510971 509124 508371 509107 510492 511818 513635 516794 521071 525601 530123 534926 540009 545315 551466
63093E51466P752Q949Q667P210N483L625J289j354l610n012n557n497n247n132
$$ 551466 559218 568167 576834 584044 589527 593152 594441 593087 589477 584465 578908 573411 568164 563032
63079E63032n032m649m157l993l968l405k378j813j966j809n30J177K080J974
$$ 563032 558000 553351 549194 545201 541233 537828 535450 533637 531671 529862 529332 530509 532589 534563
63065E34563J545J233J039J028J232J266O78m92j846l085m039m620n089n917p021
$$ 534563 536108 537341 538380 539408 540640 541906 542584 542092 540246 537161 533122 528502 523413 517496 510475
63050E10475p722p789p933q672r368r108q076p235o927o656o112n635n579n800
$$ 510475 502753 494964 487031 478359 468991 459883 451807 444572 437645 430989 424877 419242 413663 407863
63036D07863n916n681m996l904k569j178Q1Q85Q97K48m26p15q93j316j766j780
$$ 407863 401947 396266 391270 387366 384797 383619 383700 384585 385482 385730 385304 384589 383696 382380 380614 378834
63020C78834j376r50o58m13l22o34j229j633j664j620j730j646q79M73J677K199
$$ 378834 377458 376508 375850 375437 375115 374481 373252 371619 369955 368335 366605 364959 364080 364553 366230 368429
63004C68429K307K690L529M336M735M979N497O322P284Q403R659J0727J1484J2343
$$ 368429 370736 373426 376955 381291 386026 391005 396502 402824 410108 418511 428170 438897 450381 462724
62990D62724J3539J4402J4251J3604J3544J3983J3703J2238J0672J0085J0209
$$ 462724 476263 490665 504916 518520 532064 546047 559750 571988 582660 592745 602954
62979F02954J0078R286Q070O760N598M597L233Q23k512n796q420j0744j3234j5735
$$ 602954 613032 622318 630388 637148 642746 647343 650576 651399 648887 643091 634671 623927 610693 594958
62965E94958j8003k0144k2056k3105k2936k2087k1335k0907k0649k0337j9480
$$ 594958 576955 556811 534755 511650 488714 466627 445292 424385 403736 383399 363919
62954C63919j7571j4964j2724j1243r916q544p880q070p874o525n226n365o161
$$ 363919 346348 331384 318660 307417 297501 288957 281077 273007 265133 258608 253382 248017 241856
62941B41856n713l812k048j377j278j302j787k664l009k419j685j581j847j878
$$ 241856 236143 232331 230283 228906 227628 226326 224539 221875 218866 216447 214762 213181 211334 209456
62927B09456j632j312r36o93r93j691j883j086m7K54j04l02o9J32j3k52l25l41
$$ 209456 207824 206512 205576 204883 203890 202199 200316 199230 199183 199437 199333 199031 198962 199094 199081 198829 198504 198163
62909A98163m87o50o00l13M4L61O18O84L25m26j062j044m22K43O45J044J639K080
$$ 198163 197676 197026 196426 196113 196157 196518 197136 197820 198145 197719 196657 195613 195191 195434 196079 197123 198762 200842
62891B00842J966J568J555K059K457K105J001l31j262j377o05O89J925K726L102
$$ 200842 202808 204376 205931 207990 210447 212552 213553 213222 211960 210583 209978 210667 212592 215318 218420
62876B18420L251L256L086K760K483K543K990L600M220N021O084O877O670N553
$$ 218420 221671 224927 228013 230773 233256 235799 238789 242389 246609 251630 257714 264591 271261 276814
62862B76814M501M205M210L637K384J143L95p7o87j543k534l608m686n402n266
$$ 276814 281315 285520 289730 293367 295751 296894 297289 297212 296525 294982 292448 288840 284154 278752 273486
62847B73486m229l032k644l229l936l920l286k670k242j737j213j060j198j096
$$ 273486 269257 266225 263581 260352 256416 252496 249210 246540 244298 242561 241348 240288 239090 237994
62833B37994o93o08j122j731j960j973j950j639r96o07q17j035o20M1J15m01p67
$$ 237994 237301 236693 235571 233840 231880 229907 227957 226318 225322 224715 223898 222863 222243 222284 222399 221998 221231
62816B21231o25k81pJ64N7n40j357j843j915j951k081k042j826j879k420l021
$$ 221231 220606 220325 220318 220482 220539 219999 218642 216799 214884 212933 210852 208810 206984 205105 202685 199664
62800A99664l151k873k670k736k649j845l85Q81J111L64m84p42m86j28J53L13
$$ 199664 196513 193640 190970 188234 185585 183740 183355 184236 185347 185711 185227 184485 183999 183871 184024 184337
62784A84337J72l65j011j312j046l50L99P67O12K64N5j53n70p40o0J022J277M28
$$ 184337 184509 184144 183133 181821 180775 180425 180824 181591 182203 182467 182522 182369 181799 181059 180999 182021 183298 183726
62766A83726m22m95m07q88j414j077n7Q08J303J701J875J651J573K266L222L336
$$ 183726 183304 182809 182402 181514 180100 179023 178966 179774 181077 182778 184653 186304 187877 190143 193365 196701
62750A96701K514J736J643J956K304K670K909K720K202J821J745J827K041K343
$$ 196701 199215 200951 202594 204550 206854 209524 212433 215153 217355 219176 220921 222748 224789 227132
62736B27132K318J790J466J990K617K012K91j002j164j191j902k582k340j762
$$ 227132 229450 231240 232706 234696 237313 239325 239616 238614 237450 236259 234357 231775 229435 227673
62722B27673k058l178l854l315k121j245r93r83q16n34m82p36q57m13L98J003
$$ 227673 225615 222437 218583 215268 213147 211902 210909 209926 209110 208576 208094 207358 206501 206088 206486 207489
62706B07489J274J666K464L426M230M855N338N608N726N913O182O381O689P620
$$ 207489 208763 210429 212893 216319 220549 225404 230742 236350 242076 247989 254171 260552 267241 274861
62692B74861R218J0766J1653J2249J3440J5515J7836J9528K0303K0607K1213K2535
$$ 274861 284079 294845 306498 318747 332187 347702 365538 385066 405369 425976 447189 469724
62680D69724K4273K5691K6197K5613K4026K1659J8863J5903J2696Q913M438m73
$$ 469724 493997 519688 545885 571498 595524 617183 636046 651949 664645 673558 677996 677523
62668F77523n403j0001j3978j7189j9718k1741k3279k4278k4808k4994k4686k3507
$$ 677523 672120 662119 648141 630952 611234 589493 566214 541936 517128 492134 467448 443941
62656D43941k1338j8721j6636j5773j5799j5491j3907j1473r490q559q030p159
$$ 443941 422603 403882 387246 371473 355674 340183 326276 314803 305313 296754 288724 281565
62644B81565o154n571n285m740l865l164l012l384m041m560m448l713l033k868
$$ 281565 275411 269840 264555 259815 255950 252786 249774 246390 242349 237789 233341 229628 226595 223727
62630B23727k781k173j276p85p87q65r62j367j963k220j963j476r75n53m85r10
$$ 223727 220946 218773 217497 216712 215925 215060 214098 212731 210768 208548 206585 205109 204134 203581 203096 202186
62614B02186j365j325r82q63q63n46j00j18m83m64M6L55J29j76k03j9M71J544
$$ 202186 200821 199496 198514 197651 196788 196242 196142 196024 195541 195077 195123 195478 195607 195431 195228 195209 195680 197224
62596A97224K747K957J780J88o22l69N22J521K113J972J466J380J881K348K374
$$ 197224 199971 202928 204708 204896 204274 203905 204427 205948 208061 210033 211499 212879 214760 217108 219482
62581B19482K245K252K223K026J845J659J157M18J5J62L89L20J03j59n50q05m54
$$ 219482 221727 223979 226202 228228 230073 231732 232889 233307 233322 233484 233873 234193 234296 234137 233587 232782 232328
62564B32328J72K6j124k191k270j766j397j057m08J52M9n01q17o54j60N48J149
$$ 232328 232500 232526 231402 229211 226941 225175 223778 222721 222313 222465 222514 222013 221196 220542 220382 220930 222079
62547B22079J041J46p15q28m84k69r1L55P91Q35P45P99N69k58q91m38N26O88J21
$$ 222079 223120 223266 222551 221723 221239 220970 220879 221234 222025 222860 223605 224404 224973 224715 223824 223386 223912 224600 224721
62528B24721K59J615K875K763J726J052J140J437J549J594J713J882K139K541
$$ 224721 224980 226595 229470 232233 233959 235011 236151 237588 239137 240731 242444 244326 246465 249006
62514B49006K934L089L085L279L860M664N413N945O229O374O720P667R188J0728
$$ 249006 251940 255029 258114 261393 265253 269917 275330 281275 287504 293878 300598 308265 317453 328181
62500C28181J1795J2544J3450J4523J5329J5737J6027J6091J5212J3094J0488
$$ 328181 339976 352520 365970 380493 395822 411559 427586 443677 458889 471983 482471
62489D82471Q262O281L918J164j528m120o796r135j0486j1038j1522j1858j1229
$$ 482471 490733 497014 500932 502096 500568 496448 489652 480517 470031 458993 447471 435613 424384
62476D24384r630q230p887q266q775r292r531q793p076n503m958m972m691m128
$$ 424384 414754 406524 398637 390371 381596 372304 362773 353980 346904 341401 336443 331471 326780 322652
62462C22652l642k928j526J54J200J354J063P40O11R47J679K098J655P92L25L37
$$ 322652 319010 316082 314556 314710 315910 317264 318327 319067 319678 320625 322304 324402 326057 326849 327174 327511
62446C27511L71L49N23P14N16J68L96J331K246K487K086J449R05P37J113J892
$$ 327511 327882 328231 328754 329468 329984 330152 330548 331879 334125 336612 338698 340147 341052 341789 342902 344794
62430C44794K744L470L917L840L207K554K505L049L715M298N000N810O292O078
$$ 344794 347538 351008 354925 358765 361972 364526 367031 370080 373795 378093 383093 388903 395195 401273
62416D01273N292M406L938M210N130O214O985P348P433P321P138P200P741Q597
$$ 401273 406565 410971 414909 419119 424249 430463 437448 444796 452229 459550 466688 473888 481629 490226
62402D90226R437J0107J0570J0745J0696J0726J0938J1015J0741J0489J0732J1225
$$ 490226 499663 509770 520340 531085 541781 552507 563445 574460 585201 595690 606422 617647
62390F17647J1217J0342Q930P412N884M381L210K722K796K787K138J080M54P08
$$ 617647 628864 639206 648136 655548 661432 665813 669023 671745 674541 677328 679466 680546 681000 681708
62376F81708J414K016K787M381O694Q890J0576J2192J4125J6239J8419K0794K3173
$$ 681708 683122 685138 687925 692306 699000 707890 718466 730658 744783 761022 779441 800235 823408
62363H23408K5148K7113L0274L5124M0775M6285N1742N7388O2545O6466O9392
$$ 823408 848556 875669 905943 941067 981842 1028127 1079869 1137257 1199802 1266268 1335660
62352A335660P1646P2313O9998O4605N7202M8367L7846K5861J3627K336p649j6373
$$ 1335660 1407306 1479619 1549617 1614222 1671424 1719791 1757637 1783498 1797125 1799461 1791812 1775439
62340A775439k3872l0396l6443m2200m7224n0788n2379n2039n0467m8572m6508
$$ 1775439 1751567 1721171 1684728 1642528 1595304 1544516 1492137 1440098 1389631 1341059 1294551
62329A294551m3454l8794l3144k7748k3211j9411j6314j3996j2078r877p241m616
$$ 1294551 1251097 1212303 1179159 1151411 1128200 1108789 1092475 1078479 1066401 1056524 1049283 1044667
62317A044667k321k89J544L160M698O327P902R186J0266J1306J2193J2918J3933
$$ 1044667 1042346 1042057 1043601 1046761 1051459 1057786 1065688 1074874 1085140 1096446 1108639 1121557 1135490
62304A135490J5453J6759J6904J6008J5037J4486J4029J3373J2635J1874J1008
$$ 1135490 1150943 1167702 1184606 1200614 1215651 1230137 1244166 1257539 1270174 1282048 1293056
62293A293056J0292J0171J0563J0945J1142J1525J2324J3334J4323J5190J5743
$$ 1293056 1303348 1313519 1324082 1335027 1346169 1357694 1370018 1383352 1397675 1412865 1428608
62282A428608J5941J6240J7125J8348J9242J9717K0278K1140K2052K2951K4050
$$ 1428608 1444549 1460789 1477914 1496262 1515504 1535221 1555499 1576639 1598691 1621642 1645692
62271A645692K5276K6341K7382K8768L0362L1728L3092L5120L7760M0257M2504
$$ 1645692 1670968 1697309 1724691 1753459 1783821 1815549 1848641 1883761 1921521 1961778 2004282
62260B004282M5293M8949N2803N6514O0838O6362P2278P7199Q0478Q1989Q1229
$$ 2004282 2049575 2098524 2151327 2207841 2268679 2335041 2407319 2484518 2564996 2646985 2728214
62249B728214P7559P1014O2067N0950L8040K4747J3027L781l699j0425j6375k0752
$$ 2728214 2805773 2876787 2938854 2989804 3027844 3052591 3065618 3069399 3065700 3055275 3038900 3018148
62237C018148k3307k4824k6227k7518k7902k6812k4462k1328j7626j3607r849
$$ 3018148 2994841 2970017 2943790 2916272 2888370 2861558 2837096 2815768 2798142 2784535 2774686
62226B774686o739l857n32L127O360Q767J0621J2235J3637J4907J6169J7181J7630
$$ 2774686 2767947 2764090 2763558 2766685 2773045 2781812 2792433 2804668 2818305 2833212 2849381 2866562 2884192
62213B884192J7879J8708K0076K1009K1029K0885K1373K2139K2379K2176K2338
$$ 2884192 2902071 2920779 2940855 2961864 2982893 3003778 3025151 3047290 3069669 3091845 3114183
62202C114183K3107K3865K4066K3895K3869K4208K4788K5455K6189K7005K7812
$$ 3114183 3137290 3161155 3185221 3209116 3232985 3257193 3281981 3307436 3333625 3360630 3388442
62191C388442K8434K8913K9680L1177L3250L5150L6224L6313L5257L2501K7604
$$ 3388442 3416876 3445789 3475469 3506646 3539896 3575046 3611270 3647583 3682840 3715341 3742945
62180C742945K1031J3880O747o85q595j5886k0719k2294k1630k0185j8148j4710
$$ 3742945 3763976 3777856 3784603 3783918 3775323 3759437 3738718 3716424 3694794 3674609 3656461 3641751
62168C641751r761m380N42N279J0415J5612J9980K3147K5185K5714K3810J8864
$$ 3641751 3631990 3627610 3628152 3633431 3643846 3659458 3679438 3702585 3727770 3753484 3777294 3796158
62156C796158J1136J603q340j7274k4469l0189l5042l9300m3171m7228n1787n6184
$$ 3796158 3807294 3808897 3800557 3783283 3758814 3728625 3693583 3654283 3611112 3563884 3512097 3455913
62144C455913n9411o1253o2074o1788o0016n7151n4260n1792m9366m6836m4698
$$ 3455913 3396502 3335249 3273175 3211387 3151371 3094220 3039960 2988168 2938802 2891966 2847268
62133B847268m3117m1600l9971l8760l8108l7165l5282l3148l1896l1551l1138
$$ 2847268 2804151 2762551 2722580 2683820 2645712 2608547 2573265 2540117 2508221 2476670 2445532
62122B445532l0058k8622k7296k6095k4874k3750k2989k2628k2395k1974k1346
$$ 2445532 2415474 2386852 2359556 2333461 2308587 2284837 2261848 2239220 2216825 2194851 2173505
62111B173505k0849k0823k1207k1553k1457k0959k0539k0672k1337k1895k1762
$$ 2173505 2152656 2131833 2110626 2089073 2067616 2046657 2026118 2005446 1984109 1962214 1940452
62100A940452k1106k0620k0503k0188j9214j7847j6512j5238j4005j3035j2169
$$ 1940452 1919346 1898726 1878223 1858035 1838821 1820974 1804462 1789224 1775219 1762184 1750015
62089A750015j0634q207n936m750l914k000J014L919O289Q920J2083J4816J6344
$$ 1750015 1739381 1731174 1725238 1720488 1716574 1714574 1715588 1719507 1725796 1734716 1746799 1761615 1777959
62076A777959J7036J7325J6727J4691J1649Q418N211J862j308l605m713m884m533
$$ 1777959 1794995 1812320 1829047 1843738 1855387 1863805 1869016 1870878 1869570 1865965 1861252 1856368 1851835
62063A851835l869k873j420L49J866K517K155Q18j663n167q543j0176r660q420
$$ 1851835 1847966 1845093 1843673 1844022 1845888 1848405 1850560 1851378 1849715 1844548 1836005 1825829 1816169 1807749
62049A807749q773j2642k0728l1819m2931n1053n5018n5157n1683m4876l6911
$$ 1807749 1798976 1786334 1765606 1733787 1690856 1639803 1584785 1529628 1477945 1433069 1396158
62038A396158l1679l1697l5941m1302m5352m7121m6378m3399l9153l4765l0742
$$ 1396158 1364479 1332782 1296841 1255539 1210187 1163066 1116688 1073289 1034136 999371 968629
62027I68629k7069k3694k0582j7716j5419j4261j4288j4729j4788j4346j3630
$$ 968629 941560 917866 897284 879568 864149 849888 835600 820871 806083 791737 778107
62016G78107j2724j1633j0403q939p151n402m133k950q43K367N605P979R874J2181
$$ 778107 765383 753750 743347 734408 727257 721855 717722 714772 713929 716296 721901 729880 739754 751935
62002G51935J5066J8079K0900K3397K5289K6123K5329K2252J6763R936L274k892
$$ 751935 767001 785080 805980 829377 854666 880789 906118 928370 945133 955069 958343 955451
61990I55451r451j6700k3490k8565l1839l3773l4399l3671l1992k9758k6917k3519
$$ 955451 946000 929300 905810 877245 845406 811633 777234 743563 711571 681813 654896 631377
61978F31377k0100j7067j4376j2092j0448r012o915m394k923l033l257k175l96
$$ 631377 611277 594210 579834 567742 557294 548282 541367 536973 534050 531017 527760 525585 525189
61965E25189O22P59R32J455K073L040M722O514P426P513P638Q157Q896J0079J2101
$$ 525189 525811 526570 527502 528957 531030 534070 538792 545306 552732 560245 567883 576040 584936 595015 607116
61950F07116J4568J6703J8553K0786K3474K6090K8581L1396L4507L7330L9673
$$ 607116 621684 638387 656940 677726 701200 727290 755871 787267 821774 859104 898777
61939H98777M1839M3817M5197M5835M5907M5375M4147M2623M1282L9894L7876
$$ 898777 940616 984433 1029630 1075465 1121372 1166747 1210894 1253517 1294799 1334693 1372569
61928A372569L5139L1885K7904K3071J8196J4264J1036P639M436L075M499Q123
$$ 1372569 1407708 1439593 1467497 1490568 1508764 1523028 1534064 1541703 1546139 1549214 1553713 1561836
61916A561836J3219J9917K8321L7777M7625N7938O8841P9759Q9921R9122J07488
$$ 1561836 1575055 1594972 1623293 1661070 1708695 1766633 1835474 1915233 2005154 2104276 2211764
61905B211764J14927J21354J27197J33244J40120J48154J57520J68082J78967
$$ 2211764 2326691 2448045 2575242 2708486 2848606 2996760 3154280 3322362 3501329
61896C501329J88170J92642J88995J74557J47896J08770N8445O40n8512j12555
$$ 3501329 3689499 3882141 4071136 4245693 4393589 4502359 4560804 4561444 4502932 4390377
61886D390377j57239j91107k14337k27809k32895k31189k23996k12500j98194
$$ 4390377 4233138 4042031 3827694 3599885 3366990 3135801 2911805 2699305 2501111
61877B501111j82594j66565j50367j34313j18957j04721r1770q0055o9249n8924
$$ 2501111 2318517 2151952 2001585 1867272 1748315 1643594 1551824 1471769 1402520 1343596
61867A343596m9223m0859l3958k7567k0879j4321q538k968L382J0261J6565K2185
$$ 1343596 1294373 1253514 1219556 1191989 1171110 1156789 1148251 1145283 1148665 1158926 1175491 1197676
61855A197676K8074L4532M0762M6245N1290N5889N9316O1246O2213O2339O0686
$$ 1197676 1225750 1260282 1301044 1347289 1398579 1454468 1513784 1575030 1637243 1699582 1760268
61844A760268N6416M9746M1158L0576J8144N231o174j4814k0540k3788k5044k4453
$$ 1760268 1816684 1866430 1907588 1938164 1956308 1961539 1955365 1940551 1920011 1896223 1871179 1846726
61832A846726k1538j5749p615J127Q871J5204K0293K3695K4356K1514J5305O606
$$ 1846726 1825188 1809439 1801824 1802951 1811822 1827026 1847319 1871014 1895370 1916884 1932189 1938795
61820A938795l447j4058k5029l6180m6519n4536n9486o1930o2711o1944n9397
$$ 1938795 1935348 1921290 1896261 1860081 1813562 1759026 1699540 1637610 1574899 1512955 1453558
61809A453558n5403n0851m6420m2167l7807l3109k8025k2641j7085j1592o609
$$ 1453558 1398155 1347304 1300884 1258717 1220910 1187801 1159776 1137135 1120050 1108458 1101849
61798A101849k634L58L116O380J0049J3427J6172J8609K1218K4298K7963L2151
$$ 1101849 1099215 1099573 1102689 1109069 1119118 1132545 1148717 1167326 1188544 1212842 1240805 1272956
61786A272956L6637M1492M7315N4521O2640P0954P9649Q9616J01251J14233J28539
$$ 1272956 1309593 1351085 1398400 1452921 1515561 1586515 1666164 1755780 1857031 1971264 2099803
61775B099803J44728J63098J83321K05233K29261K55747K84319L14103L43777
$$ 2099803 2244531 2407629 2590950 2796183 3025444 3281191 3565510 3879613 4223390
61766D223390L70933L91727M01411L94934L67325L14864K37161J38507K7319q5623
$$ 4223390 4594323 4986050 5387461 5782395 6149720 6464584 6701745 6840252 6867571 6781948
61756F781948j89330k75126l38682l80001m01354m05507l95593l75426l48878
$$ 6781948 6592618 6317492 5978810 5598809 5197455 4791948 4396355 4020929 3672051
61747C672051l19021k88145k58215k30717k06217j84325j64252j45491j28294
$$ 3672051 3353030 3064885 2806670 2575953 2369736 2185411 2021159 1875668 1747374
61738A747374j13392j00953r0013p9501o9591o1247n4570m8467m2145l5963l0434
$$ 1747374 1633982 1533029 1443016 1363515 1293924 1232677 1178107 1129640 1087495 1051532 1021098
61727A021098k5358k0477j6159j2853j0466q926q707j0175j2883j6126j9698k3515
$$ 1021098 995740 975263 959104 946251 935785 926859 918152 907977 895094 878968 859270 835755
61715H35755k6935k9251l0467l0910l0447k8768k6237k3698k1511j9415j7254
$$ 835755 808820 779569 749102 718192 687745 658977 632740 609042 587531 568116 550862
61704E50862j5292j3797j2762j2043j1325j0173q550p152o722p061p278o928o412
$$ 550862 535570 521773 509011 496968 485643 475470 466920 459768 453046 445985 438707 431779 425367
61691D25367o235o431o766p029o979o530o075o133o495o258n060l753l367l812
$$ 425367 419132 412701 405935 398906 391927 385397 379322 373189 366694 360436 355376 351623 348256 344444
61677C44444m174m034l786l700l440k817k303k337k602k497j958j272l96Q10J836
$$ 344444 340270 336236 332450 328750 325310 322493 320190 317853 315251 312754 310796 309524 309128 309938 311774
61662C11774J897J149O64J018J612J746J642J856K382K941L670M802O029O861
$$ 311774 313671 314820 315484 316502 318114 319860 321502 323358 325740 328681 332351 337153 343182 350043
61648C50043P336P780Q154Q261Q292Q488Q493P794O553N372M342L035J372j71
$$ 350043 357379 365159 373313 381574 389866 398354 406847 414641 421194 426566 430908 433943 435315 435144
61634D35144j140j363p68M54J734K817M273O639R363J1416J2592J3133J2461R627
$$ 435144 434004 432641 431873 432327 434061 436878 441151 447790 457153 468569 481161 494294 506755 516382
61620E16382N116P27k733o279j0721j5007j7521j8115j7950j7777j7291j5935
$$ 516382 521498 522225 519492 513213 502492 487485 469964 451849 433899 416122 398831 382896
61608C82896j3687j1157r196q205p686o815n521m499m037l581k654j555p53j64
$$ 382896 369209 358052 348856 340651 332965 326150 320629 316130 312093 308512 305858 304303 303550 303386
61594C03386N52J457K365K974K813J725N46M95J603K590K674K616L355M605N553
$$ 303386 303938 305395 307760 310734 313547 315272 315818 316313 317916 320506 323180 325796 329151 333756 339309
61579C39309O241P209Q341R004R128R267R763J0545J1543J2714J3691J4074J3944
$$ 339309 345550 352759 361100 370104 379232 388499 398262 408807 420350 433064 446755 460829 474773
61566D74773J3682J3378J2857J2082J1135J0040R006Q543Q806R089Q557P327O290
$$ 474773 488455 501833 514690 526772 537907 547947 556953 565496 574302 583391 591948 599275 605565
61553F05565N895N680M985L706K264J087L17j60m07k35M59J229J364O78l89j594
$$ 605565 611460 617140 622125 625831 628095 629182 629499 629339 628932 628697 629156 630385 631749 632427 632038 630444
61537F30444l171n051o511p109p394q030q673q450p220n591l878j864L98K326
$$ 630444 627273 622222 615711 608602 601208 593178 584505 576055 568835 563244 559366 557502 557900 560226
61523E60226L620M770O453Q757J1349J4038J6839J9573K1810K3446K5134K7890
$$ 560226 563846 568616 575069 583826 595175 609213 626052 645625 667435 690881 716015 743905
61511G43905L2112L7210M2355M7328N2376N7540O2675O7954P3636P9239Q3471
$$ 743905 776017 813227 855582 902910 955286 1012826 1075501 1143455 1217091 1296330 1379801
61500A379801Q5181Q3882P9242P0784N8503M3274K6335Q794q181k3278l5761m5871
$$ 1379801 1464982 1548864 1628106 1698890 1757393 1800667 1827002 1835796 1827615 1804337 1768576 1722705
61488A722705n4002n9758o2305o1530n8437n4413n0298m6020m0981l4998k8864
$$ 1722705 1668703 1608945 1546640 1485110 1426673 1372260 1321962 1275942 1234961 1199963 1171099
61477A171099k3730j9911j6728j3513j0216o959l687o58J457K453L132M422O272
$$ 1171099 1147369 1127458 1110730 1097217 1087001 1080042 1076355 1075697 1077154 1079607 1082739 1087161 1093433
61464A093433P957R176J0354J1991J3996J5675J6299J5841J5181J5196J5786J6218
$$ 1093433 1101390 1110566 1120920 1132911 1146907 1162582 1178881 1194722 1209903 1225099 1240885 1257103
61452A257103J6335J6639J7286J7963J8918K0924K3795K6127K7145K7714K8544
$$ 1257103 1273438 1290077 1307363 1325326 1344244 1365168 1388963 1415090 1442235 1469949 1498493
61441A498493K8449K5732K0608J4948R983N540J311k406n363p648r202r810r736
$$ 1498493 1526942 1552674 1573282 1588230 1598213 1603753 1605064 1602658 1597295 1589647 1580445 1570635 1560899
61428A560899r588r443q977q404q443r119r488r023q556r282j1223j3144j3842
$$ 1560899 1551311 1541868 1532891 1524487 1516044 1506925 1497437 1488414 1479858 1470576 1459353 1446209 1432367
61415A432367j3144j1826j0812j0473j0535j0589j0527j0454j0416j0477j0876
$$ 1432367 1419223 1407397 1396585 1386112 1375577 1364988 1354461 1344007 1333591 1323114 1312238
61404A312238j1717j2627j3016j2608j1510r881p819n466k887L8L386O989J0751
$$ 1312238 1300521 1287894 1274878 1262270 1250760 1240879 1233060 1227594 1224707 1224745 1228131 1235120 1245871
61391A245871J5063K0492K7044L4046M0774M7039N3133N9442O6051P2676P8889
$$ 1245871 1260934 1281426 1308470 1342516 1383290 1430329 1483462 1542904 1608955 1681631 1760520
61380A760520Q4384Q8800R1364R1026Q7078P9424O8233N3772L6749J8502N96j5700
$$ 1760520 1844904 1933704 2025068 2116094 2203172 2282596 2350829 2404601 2441350 2459852 2460448 2444748
61368B444748k9593m0943n0264n8134o4466o8899p1832p4234p6163p6372p3905
$$ 2444748 2415155 2374212 2323948 2265814 2201348 2132449 2060617 1986383 1910220 1833848 1759943
61357A759943o9456o4463n9505n4277m8611m2695l6630l0576k5123k0825j7452
$$ 1759943 1690487 1626024 1566519 1512242 1463631 1420936 1384306 1353730 1328607 1307782 1290330
61346A290330j4247j0908p763n215l435k402j748p63R61L067N005O785Q626J0187
$$ 1290330 1276083 1265175 1257412 1252197 1248762 1246360 1244612 1243849 1244810 1247877 1252882 1259667 1268293 1278480
61332A278480J0793J0294R149P725O119M563L508L165L349L641L526K599J026
$$ 1278480 1289273 1299567 1308716 1316441 1322560 1327123 1330631 1333796 1337145 1340786 1344312 1346911 1347937
61319A347937m30j263j807k567l303l386k821k266k131k303k660l295m074m553
$$ 1347937 1347507 1346244 1344437 1341870 1338567 1335181 1332360 1330094 1327963 1325660 1323000 1319705 1315631 1311078
61305A311078m509m294m520n574p277q860r413q673p261n967n057m357l597k334
$$ 1311078 1306569 1302275 1297755 1292181 1284904 1276044 1266631 1257958 1250697 1244730 1239673 1235316 1231719 1229385
61291A229385j32K681M781M959L232M80k688o066r280j1824j3571j4639j4855
$$ 1229385 1229253 1231934 1236715 1241674 1244906 1245386 1242698 1236632 1227352 1215528 1201957 1187318 1172463
61278A172463j3932j2114j0092q288o705n337m136k703n46K326N547R080J3201
$$ 1172463 1158531 1146417 1136325 1128037 1121332 1115995 1111859 1109156 1108610 1110936 1116483 1125563 1138764
61265A138764J7829K2463K6882L1405L6176M0567M3559M4584M3842M1947L9445
$$ 1138764 1156593 1179056 1205938 1237343 1273519 1314086 1357645 1402229 1446071 1488018 1527463
61254A527463L6655L3937L1971L1481L2653L4968L7583L9575L9840L7269L1189
$$ 1527463 1564118 1598055 1630026 1661507 1694160 1729128 1766711 1806286 1846126 1883395 1914584
61243A914584K1387P783r169k7651m4797n8356o7669p2902p4253p2339o8476o3636
$$ 1914584 1935971 1943754 1934585 1906934 1862137 1803781 1736112 1663210 1588957 1516618 1448142 1384506
61231A384506n7652n0211m2170l4978k9055k3637j8074j2706q469o264o445q374
$$ 1384506 1326854 1276643 1234473 1199495 1170440 1146803 1128729 1116023 1107554 1101290 1094845 1086471
61219A086471j0586j1873j2100j1682j0631q788o615n097m834n694p131q493r249
$$ 1086471 1075885 1064012 1051912 1040230 1029599 1020811 1014196 1009099 1004265 998571 991440 982947 973698
61206I73698r401r483r729r622q645p080n572m275k974j716p68k69l60j331l029
$$ 973698 964297 954814 945085 935463 926818 919738 914166 909891 906917 905201 904433 904164 903804 902473 899444
61191H99444m517m877m003k249K03L019N437P108Q811J1493J5003J8423K1143
$$ 899444 894927 890050 886047 883798 884001 887020 892457 899565 908376 919869 934872 953295 974438
61178I74438K2797K2635J9988J5172R142K556m032r612j3350j5615j7363j8747
$$ 974438 997235 1019870 1039858 1055030 1064172 1066728 1062696 1053084 1039734 1024119 1006756 988009
61166I88009j9274j9127j9159j9647k0014j9976j9922k0031j9794j8740j6947
$$ 988009 968735 949608 930449 910802 890788 870812 850890 830859 811065 792325 775378
61155G75378j4782j2627j0870r568q123n941l341j202J23R94J701K314L101M329
$$ 775378 760596 747969 737099 727531 719408 713467 710126 708924 709047 710041 711742 714056 717157 721486
61141G21486N680O657P539R127J1506J3856J5460J6193J5806J3640R433L846k129
$$ 721486 727166 733823 741362 750489 761995 775851 791311 807504 823310 836950 846383 850229 848100
61128H48100p925j3332j7998k1257k2431k1430j9126j6825j5119j3622j2031j0782
$$ 848100 840175 826843 808845 787588 765157 743727 724601 707776 692657 679035 667004 656222
61116F56222j0258r963r299q565q386q550q299p541o887o617o444o128n623m732
$$ 656222 645964 636001 626702 618137 609751 601201 592902 585361 578474 571857 565413 559285 553662 548930
61102E48930l383k079j383j081n22M00J341K400M087O411Q725J0514J1755J2431
$$ 548930 545547 543468 542085 541004 540482 540882 542223 544623 548710 555121 563846 574360 586115 598546
61088E98546J2247J0822P961L834p24m564p160q843r795r587q234o843o265n793
$$ 598546 610793 621615 629576 633410 632686 628122 620962 612119 602324 592737 584503 577660 571395 565602
61074E65602m257j941k42K71L11N36Q33R55J007J062J017Q81P52O09M89O74J254
$$ 565602 561345 559404 559162 559433 559744 560280 561113 562068 563075 564137 565154 566035 566787 567396 567885 568559 569813
61057E69813J848K149K352K628K736K621K752L288L584L216K780K970L486L668
$$ 569813 571661 573810 576162 578790 581526 584147 586899 590187 593771 596987 599767 602737 606223 609891
61043F09891L517L372L250L228L799M986N934O127O174O608O865O397N818N862
$$ 609891 613408 616780 620030 623258 627057 632043 637977 644104 650278 656886 663751 670148 675966 681828
61029F81828O243O579P418R004J0122R703Q657Q581R430R983R920R760R333Q074
$$ 681828 688071 694650 702068 711072 721194 730897 739554 748135 757565 767548 777468 787228 796561 804635
61015H04635O428N433N105M546L449K296J355N69J70M46J255K355L663M706M901
$$ 804635 811063 816496 821601 826147 829596 831892 833247 833816 833986 834432 835687 838042 841705 846411 851312
61000H51312M935O479R733J2767J4222J5017J6220J7257J7647J8564K0876K3407
$$ 851312 856247 862726 872459 885226 899448 914465 930685 947942 965589 984153 1005029 1028436
60988A028436K5039K6682K9300L1833L3241L4681L7396M0308M2010M3291M5283
$$ 1028436 1053475 1080157 1109457 1141290 1174531 1209212 1246608 1286916 1328926 1372217 1417500
60977A417500M7104M7901M9144N2053N4840N5506N5284N6322N8081N9338O1486
$$ 1417500 1464604 1512505 1561649 1613702 1668542 1724048 1779332 1835654 1893735 1953073 2014559
60966B014559O6201P2133P7551Q4028R3462J03811J11929J18214J24217J28597
$$ 2014559 2080760 2152893 2230444 2314472 2407934 2511745 2623674 2741888 2866105 2994702
60956B994702J30604J34683J46015J63878J85013K10420K42156K76358L07012
$$ 2994702 3125306 3259989 3406004 3569882 3754895 3965315 4207471 4483829 4790841
60947D790841L34568L64058L98084M39827M98585N81816O85390Q03330R43028
$$ 4790841 5125409 5489467 5887551 6327378 6825963 7407779 8093169 8896499 9839527
60938I839527J117085J326214J570203J872080K267201K773138L405120M208487
$$ 9839527 10956612 12282826 13853029 15725109 17992310 20765448 24170568 28379055
60930B8379055N181512O090284O422954N692390L890698J616939l14349j405210
$$ 28379055 33560567 39650851 46073805 51766195 55656893 57273832 56959483 55554273
60922E5554273j629248j174193k13581R95531J930647J955433P83304j231812
$$ 55554273 53925025 52750832 52537251 53532782 55463429 57418862 58202166 56970354
60914E6970354l323476m839607n566874n648334n323371m778447m144322l515958
$$ 56970354 53646878 48807271 43240397 37592063 32268692 27490245 23345923 19829965
60906A9829965k943965k439583k003895j640988j346202j103781r02679p42298
$$ 19829965 16886000 14446417 12442522 10801534 9455332 8351551 7448872 6706574
60898F706574o20253n26783m53922l99289l58239l22341k88373k59923k37558
$$ 6706574 6086321 5559538 5105616 4706327 4348088 4025747 3737374 3477451 3239893
60889C239893k15759j91761j69101j49785j30964j12354r9359r5129r5757r6425
$$ 3239893 3024134 2832373 2663272 2513487 2382523 2270169 2170810 2075681 1979924 1883499
60879A883499r6517r5865r2062q4773p7568p2455o7190o0381n4266n0064m5515
$$ 1883499 1786982 1691117 1599055 1514282 1436714 1364259 1297069 1236688 1182422 1132358 1086843
60868A086843l9669l5261l3694l2271k9139k6489k6070k5805k3709k1225j9847
$$ 1086843 1047174 1011913 978219 945948 916809 890320 864250 838445 814736 793511 773664
60857G73664j8178j5106j2390j1422j0778r320q383q699q560p216o517p031o278
$$ 773664 755486 740380 727990 716568 705790 696470 688087 679388 670828 663612 657095 650064 643786
60844F43786l286j075j872l477l272k484l322m989n741o201p466q351p494o039
$$ 643786 640500 639425 637553 634076 630804 628320 624998 620009 614268 608067 600601 592250 584756 578717
60830E78717n559n384m493l823m290m594l462j992j477r79O94K659L804M830O348
$$ 578717 573158 567774 563281 559458 555168 550574 547112 545120 543643 542664 543358 546017 549821 554651 560999
60815E60999P082O121M872M678M632L770L150L533L329J263j084j857j967l097
$$ 560999 568081 574202 579074 583752 588384 592154 595304 598837 602166 603429 602345 600488 598521 595424
60801E95424m664n264n288n662n741m907m520n864p737q387q195q255q060o986
$$ 595424 590760 585496 580208 574546 568805 563898 559378 553514 545777 537390 529195 520940 512880 505894
60787E05894o253o923p601o643n115m931n591n376m450m079l987l099j911j573
$$ 505894 499641 492718 485117 478474 473359 468428 462837 457461 453011 448932 444945 441846 439935 438362
60773D38362j627j015l40o53j038O5K019K917K750L053L989M219L450K862L105
$$ 438362 436735 435720 435380 434727 433689 433754 435773 438690 441440 444493 448482 452701 456151 459013 462118
60758D62118L772M662N827O532N852M090K288P34q01j943k237k222k664l240l219
$$ 462118 465890 470552 476379 482911 488763 492853 495141 495875 495074 493131 490894 488672 486008 482768 479549
60743D79549k782k574k670l113m550p123r606j0761j0718j0052q742p075o211
$$ 479549 476767 474193 471523 468410 463860 456737 447131 436370 425652 415600 406858 399783 393572
60730C93572o530o718n819m826m801m908m000k788k563k916k599j665j029p95
$$ 393572 387042 380324 374505 369679 364878 359970 355970 353182 350619 347703 345104 343439 342410 341615
60716C41615n96p18j380j777j323p95r04r00k7R00R40P27J143J605J330R89J259
$$ 341615 341019 340301 338921 337144 335821 335026 334122 333222 333195 334095 335035 335762 336905 338510 339840 340829 342088
60699C42088J171j77j560j337m3Q25J372K505L615L431K386J900J984J691J258
$$ 342088 343259 343082 341522 340185 340142 340967 342339 344844 348459 351890 354276 356176 358160 359851 361109
60684C61109J634K432K474J905J861K435K857L124L626L780K915J963K365L769
$$ 361109 362743 365175 367649 369554 371415 373850 376707 379831 383457 387237 390152 392115 394480 398249
60670C98249M667M813N081N469N195M507M504N315O103O551O882O786N914M975
$$ 398249 402916 407729 412810 418279 423474 427981 432485 437800 443903 450454 457336 464122 470036 475011
60656D75011M837N069M704L831L003J927L05q63n96L00M44R1K42M21n90k476l819
$$ 475011 479848 484917 489621 493452 496455 498382 498687 497824 497228 497528 497972 498063 498305 498726 498136 495660 491841
60639D91841m295m592m775m568m567n268n582m328k477j868k310k255j614j508
$$ 491841 487546 482954 478179 473611 469044 463776 458194 453866 451389 449521 447211 444956 443342 441834
60625D41834j685p86J004K015J863J813K314K395J793J511J918K194K058K305
$$ 441834 440149 439363 440367 442382 444245 446058 448372 450767 452560 454071 455989 458183 460241 462546
60611D62546L248M197M830N663O924Q211R247R873R537Q102O702O362O325N317
$$ 462546 465794 469991 474821 480484 487408 495619 504866 514739 524276 532378 539080 545442 551767 557084
60597E57084L823L323L774L880L483L629M457N062N384O349Q119R925J1483J2862
$$ 557084 560907 564230 568004 571884 575367 578996 583453 588515 593899 600248 608367 618292 629775 642637
60583F42637J3180J1382Q095M884J876j946o354r955j2472j4833j6916j7415j6205
$$ 642637 655817 667199 675294 680178 682054 680108 673754 663799 651327 636494 619578 602163 585958
60570E85958j4704j3617j2222j0249q511p319n991m402l307k866k385j745j557
$$ 585958 571254 557637 545415 535166 526655 519336 513345 508943 505636 502770 500385 498640 497083
60557D97083j714j374n16M6K67Q87J833K246K066K019K094J676J064J080J330
$$ 497083 495369 493995 493479 493525 493792 494679 496512 498758 500824 502843 504937 506613 507677 508757 510087
60542E10087P44k74j95J108K151K176J859J679J613K317M447O775P237O030N447
$$ 510087 510831 510557 510362 511470 513621 515797 517656 519335 520948 523265 527712 534487 541724 547754 553201
60527E53201O431P683Q489R831J2018J3661J4092J4613J6286J8380K0068K1981
$$ 553201 559632 567315 575804 585635 597653 611314 625406 640019 656305 674685 694753 716734
60515G16734K4929K8603L2490L6750M1409M6027N0820N6857O4649P3813Q4441
$$ 716734 741663 770266 802756 839506 880915 926942 977762 1034619 1099268 1173081 1257522
60504A257522R7247J11937J26897J40722J52511J60341J61402J54182J39039J16372
$$ 1257522 1354769 1466706 1593603 1734325 1886836 2047177 2208579 2362761 2501800 2618172
60494B618172Q6172N0016J1645k5240n8426q6220j06924j20060j26518j26919
$$ 2618172 2704344 2754360 2766005 2740765 2682339 2596119 2489195 2369135 2242617 2115698
60484B115698j21307j10748r7475q2871o7006n0488l4906k0786o989P247K1437
$$ 2115698 1994391 1883643 1786168 1703297 1636291 1585803 1550897 1530111 1523122 1530369 1551806
60473A551806L5500N0181O4891P6869Q3534Q4187P8929O7672N1162L1348R987
$$ 1551806 1587306 1637487 1702378 1779247 1862781 1946968 2025897 2093569 2144731 2176079 2186066
60462B186066j1630l1080m4998n1802n2776m9722m3351l4556k5189j6287p161
$$ 2186066 2174436 2143356 2098358 2046556 1993780 1944058 1900707 1866151 1840962 1824675 1817514
60451A817514K814J3033K3084L3622M4839N5781O5991P6066Q5687R2894R6595
$$ 1817514 1820328 1833361 1856445 1890067 1934906 1990687 2056678 2132744 2218431 2311325 2407920
60440B407920R8175R9499J01006J03003J07244J15893J30048J50300J77377K11327
$$ 2407920 2506095 2605594 2706600 2809603 2916847 3032740 3162788 3313088 3490465 3701792
60430C701792K51403K97361L49316M05546M62165N15476N62063N95165O03434
$$ 3701792 3953195 4250556 4599872 5005418 5467583 5983059 6545122 7140287 7743721
60421G743721N75945N08060M01915K63770J03186o6673k30838l75506m89793n67110
$$ 7743721 8319666 8827726 9229641 9493411 9596597 9529924 9299086 8923580 8433787 7866677
60411G866677o07014o14949n98605n64750n19410m68650m17139l66996l19442
$$ 7866677 7259663 6644714 6046109 5481359 4961949 4493299 4076160 3709164 3389722
60402C389722k76480k39619k08309j81220j58145j39311j23814j10299r8403q8336
$$ 3389722 3113242 2873623 2665314 2484094 2325949 2186638 2062824 1952525 1854122 1765786
60392A765786p9808p2454o6393o1312n6051n0178m4890m1255l8628l5968l3531
$$ 1765786 1685978 1613524 1547131 1485819 1429768 1379590 1334700 1293445 1254817 1218849 1185318
60381A185318l1905l0448k8184k5454k3342k2056k1017j9949j8846j7506j5930
$$ 1185318 1153413 1122965 1094781 1069327 1045985 1023929 1002912 982963 964117 946611 930681
60370I30681j4504j3157j1205q605o316m785l311j595m65k89j04P47J609K121
$$ 930681 916177 903020 891815 883210 876894 872109 868798 867203 866738 866449 866345 867092 868701 870822
60356H70822L249N526P836R288J0788J3316J6136J8275K0399K3455K6587K8139
$$ 870822 874071 879597 887433 896721 907509 920825 936961 955236 975635 999090 1025677 1053816
60344A053816K7841K6382K3696J9335J3856Q354L207j559n432q030r736j0579
$$ 1053816 1081657 1108039 1131735 1151070 1164926 1173280 1176487 1174928 1169496 1161466 1151730 1141151
60332A141151r440n499M50P236J4769K3192L1802M0219M9316N9449O8693P4320
$$ 1141151 1131711 1126212 1126662 1133898 1148667 1171859 1203661 1243880 1293196 1352645 1421338 1495658
60320A495658P5121P1058O1821M7469K9513R777j1060l2309n1522o5737p3942
$$ 1495658 1570779 1641837 1703658 1751127 1780640 1790417 1779357 1747048 1695526 1629789 1555847
60309A555847p7115p6438p2818o7451o1358n4814m8138m2249l7470l2796k7515
$$ 1555847 1478732 1402294 1329476 1262025 1200667 1145853 1097715 1055466 1017996 985200 957685
60298I57685k2402j8208j4251r846n791k827KL646O842P668O315M419K428l59
$$ 957685 935283 917075 902824 892978 887187 884360 884362 888008 894850 902518 908833 913252 915680 915321
60284I15321l796p079j0380j4348j8205k0201j9860j8338j6722j5326j4273j3363
$$ 915321 911525 904446 894066 879718 861513 841312 821452 803114 786392 771066 756793 743430
60272G43430j1758r043o179m244k858j183M22J248J962L790O534R053J1267J4023
$$ 743430 731672 722629 716450 712206 709348 708165 708587 709835 711797 715587 722121 731174 742441 756464
60258G56464J7304K0131K1894K2402K1113J7803J3549R630N949K026j112j734
$$ 756464 773768 793899 815793 838195 859308 877111 890660 900290 906239 908265 907153 905419
60246I05419K76L536P289J1728J6503K0652K4040K7375L0685L3164L4592L5657
$$ 905419 905695 909231 916520 928248 944751 965403 989443 1016818 1047503 1080667 1115259 1150916
60234A150916L6772L7526L7338L5860L2957K9040K5012K1231J7013J1863O401
$$ 1150916 1187688 1225214 1262552 1298412 1331369 1360409 1385421 1406652 1423665 1435528 1441929
60223A441929J318l579q347j2097j4335j6004j7785j8599j7279j4664j2221r635
$$ 1441929 1443247 1439668 1431321 1419224 1404889 1388885 1371100 1352501 1335222 1320558 1308337 1298702
60211A298702n674o78L898P891J2404J7680K2793K7355L1836L6360M0597M4655
$$ 1298702 1293028 1292350 1296248 1304139 1316543 1334223 1357016 1384371 1416207 1452567 1493164 1537819
60199A537819M8682N1815N2767N1261M7875M3025L7186L1340K5921J9987J2695
$$ 1537819 1586501 1638316 1691083 1742344 1790219 1833244 1870430 1901770 1927691 1947678 1960373
60188A960373M798k529r321j5961k1914k6831l1663l6754m0064l9547l6292l2996
$$ 1960373 1965171 1962642 1953321 1937360 1915446 1888615 1856952 1820198 1780134 1740587 1704295 1671299
60176A671299l0118k5960j9968j3402p012m56O016J1480J6058K0803K5926L0795
$$ 1671299 1641181 1615221 1595253 1581851 1574839 1574383 1580399 1591879 1607937 1628740 1654666 1685461
60164A685461L5453M0328M4679M7236M8103M8401M8370M7707M7158M7746M8825
$$ 1685461 1720914 1761242 1805921 1853157 1901260 1949661 1998031 2045738 2092896 2140642 2189467
60153B189467M9053M8960N0328N3331N6433N8896O1027O2062O0124N4572M6384
$$ 2189467 2238520 2287480 2337808 2391139 2447572 2506468 2567495 2629557 2689681 2744253 2790637
60142B790637L6319K4783J3462M889J69r60K020J0227K3142L8834N6517P6521
$$ 2790637 2826956 2851739 2865201 2870090 2870259 2869299 2871319 2881546 2904688 2943522 3000039 3076560
60130C076560R7714J17386J34083J48161J59071J64472J62811J54722J41373J23395
$$ 3076560 3174274 3291660 3425743 3573904 3732975 3897447 4060258 4214980 4356353 4479748
60120D479748J02078P9601N7331L5563J5194k337j7263l1618m6584o1496p5840
$$ 4479748 4581826 4661427 4718758 4754321 4769515 4767178 4749915 4718297 4671713 4610217 4534377
60109D534377r0203j04570j17689j28720j37785j44314j46809j44906j39879j32499
$$ 4534377 4444174 4339604 4221915 4093195 3955410 3811096 3664287 3519381 3379502 3247003
60099C247003j22301j09515r5785q2097o7866n2812l7945k3901j0146L256J4833
$$ 3247003 3124702 3015187 2919402 2837305 2769439 2716627 2678682 2654781 2644635 2647891 2662724
60088B662724K3686L0672L6661M1050M2967M2657M0692L7056L1793K5432J8167
$$ 2662724 2686410 2717082 2753743 2794793 2837760 2880417 2921109 2958165 2989958 3015390 3033557
60077C033557R689L20q793j7033k4668l1615l7275m1814m6144n0347n3588n5811
$$ 3033557 3043246 3043566 3034773 3017740 2993072 2961457 2924182 2882368 2836224 2785877 2732289 2676478
60065B676478n7896n9841o0432n9126n6595n3145m8341m2549l6981l1783k5863
$$ 2676478 2618582 2558741 2498309 2439183 2382588 2329443 2281102 2238553 2201572 2169789 2143926
60054B143926j9098j2804p447j808M840J1546J7404K2788K8068L2791L6971M1523
$$ 2143926 2124828 2112024 2104577 2102769 2107609 2119155 2136559 2159347 2187415 2220206 2257177 2298700
60042B298700M6630N1166N4408N6826N8569N8888N7698N6085N4536N2288M9122
$$ 2298700 2345330 2396496 2450904 2507730 2566299 2625187 2682885 2738970 2793506 2845794 2894916
60031B894916M6059M3489M0234L5236K8709K0918J1399J70j1777k3782l5821m7012
$$ 2894916 2940975 2984464 3024698 3059934 3088643 3109561 3120960 3121130 3109353 3085571 3049750 3002738
60019C002738n5613o1101o4605o6688o6499o3674n9142n3426m6052l7333k8717
$$ 3002738 2947125 2886024 2821419 2754731 2688232 2624558 2565416 2511990 2465938 2428605 2399888
60008B399888k0590j1840k362O197J3206K0260K8418L6293M2292M6634M9652N0055
$$ 2399888 2379298 2367458 2365096 2371293 2384499 2404759 2433177 2469470 2511762 2558396 2608048 2658103
59996B658103M6685M0447L2941K4554J5328O137k484j1418k1415l1638m0916m9119
$$ 2658103 2704788 2745235 2778176 2802730 2818058 2824195 2821711 2810293 2788878 2757240 2716324 2667205
59984B667205n6119o0843o2584o1978n9552n4779m7670l9806l2422k4927j6546
$$ 2667205 2611086 2550243 2487659 2425681 2366129 2311350 2263680 2223874 2191452 2166525 2149979
59973B149979q026l29O922J4330K1276K6963L1734L6095L9548M1618M2857M3784
$$ 2149979 2141953 2141624 2148546 2162876 2184152 2211115 2242849 2278944 2318492 2360110 2402967 2446751
59961B446751M3929M2981M1654M0428L8748L6369L4137L2509L0828K8997K8294
$$ 2446751 2490680 2533661 2575315 2615743 2654491 2690860 2724997 2757506 2788334 2817331 2845625
59950B845625K9388L1181L2759L4905L8526M3225M8616N5281O2999O9779P4139
$$ 2845625 2875013 2906194 2938953 2973858 3012384 3055609 3104225 3159506 3222505 3292284 3366423
59939C366423P6777P8608P8845P6703P3448P1051P0153P0815P3703P8792Q4268
$$ 3366423 3443200 3521808 3600653 3677356 3750804 3821855 3892008 3962823 4036526 4115318 4199586
59928D199586Q8375R1007R1974Q9116P9946O3987M2017J4576j7092m9931q0803
$$ 4199586 4287961 4378968 4470942 4560058 4640004 4703991 4746008 4760584 4743492 4693561 4612758
59917D612758j08309j31637j49175j59918j64873j65328j61165j52561j41723
$$ 4612758 4504449 4372812 4223637 4063719 3898846 3733518 3572353 3419792 3278069
59908C278069j30880j19875j07680r4962q2971p1254n8754m6137l4825k4498j3729
$$ 3278069 3147189 3027314 2919634 2824672 2741701 2670447 2611693 2565556 2530731 2506233 2492504
59897B492504k353Q755J9419K9827L9229M6850N3248N8995O2852O3125N9812N3496
$$ 2492504 2490151 2498906 2518325 2548152 2587381 2634231 2687479 2746474 2809326 2872451 2932263 2985759
59885B985759M3173K7469P435j3889l4237n2659o8169p9999q8692r5117r8823
$$ 2985759 3028932 3056401 3063836 3049947 3015710 2963051 2894882 2814883 2726191 2631074 2532251
59874B532251r9114r7083r4764r2715r0190q7055q3716p9738p4394o8135o1921
$$ 2532251 2433137 2336054 2241290 2148575 2058385 1971330 1887614 1807876 1733482 1665347 1603426
59863A603426n5599m8651m1744l5802l0199k3801j7229j2151q766n839k940q66
$$ 1603426 1547827 1499176 1457432 1421630 1391431 1367630 1350401 1338250 1329484 1323645 1320705 1319839
59851A319839r1l18j250k328k255k93K476M586O289Q735J1905J4836J7164J8727
$$ 1319839 1319748 1319430 1318180 1315852 1313597 1313304 1315780 1320366 1326655 1335390 1347295 1362131 1379295 1398022
59837A398022J8559J5962J1818P152J367o209j4089k0057k4008k7188k9467k9818
$$ 1398022 1416581 1432543 1444361 1451513 1452880 1446671 1432582 1412525 1388517 1361329 1331862 1302044
59825A302044k8838k8261k8260k7582k6137k5023k4154k2293j9426j6840j4607
$$ 1302044 1273206 1244945 1216685 1189103 1162966 1137943 1113789 1091496 1072070 1055230 1040623
59814A040623j1345o808k584L80L076O598J0576J4051J6685J8667K0336K1985
$$ 1040623 1029278 1022470 1019886 1020266 1023342 1029940 1040516 1054567 1071252 1089919 1110255 1132240
59802A132240K3216K2841K0415J7273J4804J2489R143N363K804J659Q76M64J492
$$ 1132240 1155456 1178297 1198712 1215985 1230789 1243278 1252421 1257784 1260588 1262247 1263123 1263587 1265079
59789A265079L940O672R602J3919J9908K6447L2921M0083M8526N7585O5879P1949
$$ 1265079 1269019 1275691 1285293 1299212 1319120 1345567 1378488 1418571 1467097 1524682 1590561 1662510
59777A662510P4693P4541P4142P6549Q2957R3154J07165J24351J41093J51283
$$ 1662510 1737203 1811744 1885886 1962435 2045392 2138546 2245711 2370062 2511155 2662438
59767B662438J49453J32680J00634N6161N734m2811q3808j14626j34184j42614
$$ 2662438 2811891 2944571 3045205 3101366 3107100 3064289 2980481 2865855 2731671 2589057
59757B589057j41948j35061j23776j09300r3802p9607o7064n5146m3851l4145
$$ 2589057 2447109 2312048 2188272 2078972 1985170 1905563 1838499 1783353 1739502 1705357
59747A705357k5890j7990j0568m843p93L185Q047J3345J8744K4502L0357L5598
$$ 1705357 1679467 1661477 1650909 1646066 1645273 1648458 1656505 1669850 1688594 1713096 1743453 1779051
59735A779051M0445M5814N1718N7457O3267P0130P8079Q6316R4850J04409J14962
$$ 1779051 1819496 1865310 1917028 1974485 2037752 2107882 2185961 2272277 2367127 2471536 2586498
59724B586498J26020J38020J51567J65684J78783J91005K03455K15300K23906
$$ 2586498 2712518 2850538 3002105 3167789 3346572 3537577 3741032 3956332 4180238
59715D180238K27821K27428K22727K12875J98357J81535J64724J49521J38040
$$ 4180238 4408059 4635487 4858214 5071089 5269446 5450981 5615705 5765226 5903266
59706E903266J32483J32990J37781J45624J56248J68235J78798J86072J89580
$$ 5903266 6035749 6168739 6306520 6452144 6608392 6776627 6955425 7141497 7331077
59697G331077J88039J79040J61648J37466J08407P5304L9375L225l0521o0184
$$ 7331077 7519116 7698156 7859804 7997270 8105677 8180981 8220356 8223581 8193060 8132876
59687H132876q4168j00783j09642j11852j08306r9004q4279o5254m2808j7378
$$ 8132876 8048708 7947925 7838283 7726431 7618125 7519121 7434842 7369588 7326780 7309402
59677G309402J0154L8827O8859J00966J34542J68217K01959K36560K70950L01971
$$ 7309402 7319556 7358383 7427242 7528208 7662750 7830967 8032926 8269486 8540436 8842407
59667H842407L26875L43943L50506L42609L17349K73880K12177J33257M1389n5923
$$ 8842407 9169282 9513225 9863731 10206340 10523689 10797569 11009746 11143003 11184392 11128469
59657A1128469j51102k38450l13112l70645m08724m27875m29921m17030l92380
$$ 11128469 10977367 10738917 10425805 10055160 9646436 9218561 8788640 8371610 7979230
59648G979230l59890l22741k83496k45758k14107j92221j82454j86493k03834
$$ 7979230 7619340 7296599 7013103 6767345 6553238 6361017 6178563 5992070 5788236
59639E788236k29384k55080k74738k85997k88202k81319k67321k49750k30704
$$ 5788236 5558852 5303772 5029034 4743037 4454835 4173516 3906195 3656445 3425741
59630C425741k10141j88583j68127j50037j33619j18326j04885r3474q2980p2956
$$ 3425741 3215600 3027017 2858890 2708853 2575234 2456908 2352023 2258549 2175569 2102613
59620B102613o4306n7256n0607m3783l7593l2302k6974k1547j7367j4841j2676
$$ 2102613 2038307 1981051 1930444 1886661 1849068 1816766 1789792 1768245 1750878 1736037 1723361
59609A723361j0298q926r340j0632j2194j4729j8370k1798k4364k7015l0109l2243
$$ 1723361 1713063 1704137 1694797 1684165 1671971 1657242 1638872 1617074 1592710 1565695 1535586 1503343
59597A503343l2441l1560l0541k9130k7328k6069k5422k4081k1629j9336j7744
$$ 1503343 1470902 1439342 1408801 1379671 1352343 1326274 1300852 1276771 1255142 1235806 1218062
59586A218062j5630j2554j0096r196q403o307l753k042o82J329L570N112O026
$$ 1218062 1202432 1189878 1179782 1170586 1162183 1155876 1152123 1150081 1149399 1150728 1154298 1159410 1165436
59573A165436O707P009P200Q300J0390J2059J2525J2728J3451J4088J4310J5090
$$ 1165436 1172143 1179152 1186352 1194652 1205042 1217101 1229626 1242354 1255805 1269893 1284203 1299293
59561A299293J6930J8823K0134K1828K4633K7758L0548L3645L7426M1056M4273
$$ 1299293 1316223 1335046 1355180 1377008 1401641 1429399 1459947 1493592 1531018 1572074 1616347
59550A616347M8288N3706N9403O4547O9870P5746Q1053Q5191Q9225R3577R6637
$$ 1616347 1664635 1718341 1777744 1842291 1912161 1987907 2068960 2154151 2243376 2336953 2433590
59539B433590R7077R5564R2794Q7974Q0920P3484O7126O1019N4468M8914M5095
$$ 2433590 2530667 2626231 2719025 2806999 2887919 2961403 3028529 3089548 3144016 3192930 3238025
59528C238025M0033K9681J3797l800j9045k9868l5790l7296l5362l0372k2027
$$ 3238025 3278058 3307739 3321536 3317736 3298691 3268823 3233033 3195737 3160375 3130003 3107976
59517C107976j0808J738J4892K9260M4510N8407O9111P6575Q0466P8839P0394
$$ 3107976 3097168 3098906 3113798 3143058 3187568 3245975 3315086 3391661 3472127 3550966 3621360
59506C621360N6252L7937J5545j0519l7932o4391q9411j12482j31361j44167j51501
$$ 3621360 3677612 3715549 3731094 3720575 3682643 3618252 3528841 3416359 3284998 3140831 2989330
59495B989330j54591j53047j46438j36415j25194j13283j00642q8460p7824o8015
$$ 2989330 2834739 2681692 2535254 2398839 2273645 2160362 2059720 1971260 1893436 1825421
59485A825421n8143m8981m1289l3910k5696j7873j2183p923l040K888Q861J4571
$$ 1825421 1767278 1718297 1677008 1643098 1617402 1599529 1587346 1579423 1576383 1579271 1588132 1602703
59473A602703K0334K5869L1030L6768M3584N0229N5662O1019O7684P4738Q0297
$$ 1602703 1623037 1648906 1679936 1716704 1760288 1810517 1866179 1927198 1994882 2069620 2149917
59462B149917Q4159Q7019Q8235Q6480Q1682P4319O3749M9238L1835J3383n383
$$ 2149917 2234076 2321095 2409330 2495810 2577492 2651811 2715560 2764798 2796633 2810016 2804633
59451B804633k4233m1977n7383p0443q1207q8549r1835r2459r1957q9950q5733
$$ 2804633 2780400 2738423 2681040 2610597 2529390 2440841 2349006 2256547 2164590 2074640 1988907
59440A988907q0386p5284o9923o3372n6577n1006m6191m0725l4680k9026k3720
$$ 1988907 1908521 1833237 1763314 1699942 1643365 1592359 1546168 1505443 1470763 1441737 1418017
59429A418017j8414j3870j0714p981m662j474P83L121O638J0484J3557J6542K0065
$$ 1418017 1399603 1385733 1375019 1367038 1362376 1360902 1361685 1364806 1371444 1381928 1395485 1412027 1432092
59416A432092K2759K3689K4831K8246L2474L4846L5839L7894M1398M5298N0338
$$ 1432092 1454851 1478540 1503371 1531617 1564091 1598937 1634776 1672670 1714068 1759366 1809704
59405A809704N7525O3889O4021N6454M5518L6523L1865L1829L5901M2434M9500
$$ 1809704 1867229 1931118 1995139 2051593 2097111 2133634 2165499 2197328 2233229 2275663 2325163
59394B325163N6957O5794P5100Q1537Q2357P7710P0191O3552O1227O4285P0871
$$ 2325163 2382120 2447914 2523014 2604551 2686908 2764618 2834809 2898361 2959588 3023873 3094744
59383C094744P8816Q7867R8103J07874J15632J22516J30591J39494J47378J54246
$$ 3094744 3173560 3261427 3359530 3467404 3583036 3705552 3836143 3975637 4123015 4277261
59373D277261J61629J69688J77403J84915J92751J99193K01260J98062J90617
$$ 4277261 4438890 4608578 4785981 4970896 5163647 5362840 5564100 5762162 5952779
59364E952779J78942J62365J42520J22855J04886Q7609P0818N6216M4779L5488
$$ 5952779 6131721 6294086 6436606 6559461 6664347 6751956 6822774 6878990 6923769 6959257
59354F959257K7298K0148J3621O506j946j2053k4885m1518o1038q1048j00037
$$ 6959257 6986555 7006703 7020324 7026830 7024884 7012831 6987946 6946428 6885390 6804342 6704305
59343F704305j17654j33160j45616j55201j62478j66886j67922j67016j65867
$$ 6704305 6586651 6453491 6307875 6152674 5990196 5823310 5655388 5488372 5322505
59334E322505j63607j58157j49836j41002j32612j23898j15093j07615j01527
$$ 5322505 5158898 5000741 4850905 4709903 4577291 4453393 4338300 4230685 4129158
59325D129158r5590q9864q5699q3121q0795p8660p7942p8515p8822p8646p9301
$$ 4129158 4033568 3943704 3858005 3774884 3694089 3615429 3537487 3458972 3380150 3301504 3222203
59314C222203q0768q1209p9805p7774p6041p4121p1603o8806o5659o1928n8563
$$ 3222203 3141435 3060226 2980421 2902647 2826606 2752485 2680882 2612076 2546417 2484489 2425926
59303B425926n6812n6047n4559n2308n0641m9508m7430m4201m1157l8707l5944
$$ 2425926 2369114 2313067 2258508 2206200 2155559 2106051 2058621 2014420 1973263 1934556 1898612
59292A898612l2719k9755k6730k2641j8050j4465j1575p623k468K346O519J1209
$$ 1898612 1865893 1836138 1809408 1786767 1768717 1754252 1742677 1735054 1732586 1734932 1741451 1752660
59280A752660J6272K0203K3141K7135L2870L8816M4023M9123N4074N7555N9226
$$ 1752660 1768932 1789135 1812276 1839411 1872281 1911097 1955120 2004243 2058317 2115872 2175098
59269B175098O0089O0039N7598N2528M6269L9203L0101J8884P510k624j1823k0043
$$ 2175098 2235187 2295226 2352824 2405352 2451621 2490824 2520925 2539809 2547319 2544695 2532872 2512829
59257B512829k6107k9648l1640l2361l0967k7584k3637j9631j4811r355m658r36
$$ 2512829 2486722 2457074 2425434 2393073 2362106 2334522 2310885 2291254 2276443 2267088 2262430 2261494
59245B261494L157Q128J2999J7363K1830K6239K9757L2985L7518M3170M8137N2157
$$ 2261494 2264651 2272779 2285778 2303141 2324971 2351210 2380967 2413952 2451470 2494640 2542777 2594934
59233B594934N7036O3755P1512P9898Q9559J00541J12232J24461J35664J40594
$$ 2594934 2651970 2715725 2787237 2867135 2956694 3057235 3169467 3293928 3429592 3570186
59223C570186J34143J18341J02054R2650R0948R4574J02141J12371J22688J31112
$$ 3570186 3704329 3822670 3924724 4017374 4108322 4202896 4305037 4417408 4540096 4671208
59213D671208J37313J40407J37991J28682J13319R2678O6436L5323J707l2928
$$ 4671208 4808521 4948928 5086919 5215601 5328920 5421598 5488034 5523357 5525064 5492136
59203E492136o8460j03226j33480j56915j74064j85259j89198j85871j77941j67597
$$ 5492136 5423676 5320450 5186970 5030055 4855991 4670732 4481534 4295663 4117722 3950125
59193C950125j54653j39192j23486j09494r6825q4708p3846o4984n7711n1849
$$ 3950125 3795472 3656280 3532794 3423300 3326475 3241767 3167921 3102937 3045226 2993377
59183B993377m7789m4543l9942l3769k8214k4192k0006j4743j0092p322n320l190
$$ 2993377 2945588 2901045 2861103 2827334 2799120 2774928 2754922 2740179 2730087 2722765 2717445 2714255
59171B714255k094k854m327n718q078j2005j6365k0721k6355l3341l9347m3152
$$ 2714255 2712161 2709307 2704980 2699262 2691184 2679179 2662814 2642093 2615738 2582397 2543050 2499898
59159B499898m6643n1413n5966n8364n9232o0057o0647o0327n9685n9217n8014
$$ 2499898 2453255 2401842 2345876 2287512 2228280 2168223 2107576 2047249 1987564 1928347 1870333
59148A870333n5504n2679n0230m7359m3692m0212l7246l3711k9529k6244k4134
$$ 1870333 1814829 1762150 1711920 1664561 1620869 1580657 1543411 1509700 1480171 1453927 1429793
59137A429793k1377j7456j4455j3482j2714j0659q411o854m644r51K604M994P899
$$ 1429793 1408416 1390960 1376505 1363023 1350309 1339650 1331239 1324385 1319741 1318790 1321394 1326388 1334287
59124A334287J2590J7389K0651K3563K7536L1340L3396L4657L6645L8693L9524
$$ 1334287 1346877 1364266 1384917 1408480 1436016 1467356 1500752 1535409 1572054 1610747 1650271
59113A650271L9563L9587L9183L8493L9073M1006M1700L9695L7025L5522L3782
$$ 1650271 1689834 1729421 1768604 1807097 1846170 1887176 1928876 1968571 2005596 2041118 2074900
59102B074900L0467K7662K7840L0073L2477L5937M1815M8016N0939M9727M5276
$$ 2074900 2105367 2133029 2160869 2190942 2223419 2259356 2301171 2349187 2400126 2449853 2495129
59091B495129L6760K2660M139j5930l6370n7194p6737r2255j02767j08921j11010
$$ 2495129 2531889 2554549 2558688 2542758 2506388 2449194 2372457 2280202 2177435 2068514 1957504
59080A957504j09367j05648j01197r5185q6607p6980o8823o2517n6876n1569m6821
$$ 1957504 1848137 1742489 1641292 1546107 1459500 1382520 1313697 1251180 1194304 1142735 1095914
59069A095914m1992l6664l2042k9157k6889k3747k0295j7813j5980j3887j1902
$$ 1095914 1053922 1017258 985216 956059 929170 905423 885128 867315 851335 837448 825546
59058H25546j0547q946o409m045k837j850l20L65r71k781l012k143j667j236K31
$$ 825546 814999 806053 799644 795599 792762 790912 790592 790957 789986 787205 784193 782050 780383 779147 779378
59043G79378K200L743N656Q987J2988J6655K0667K5568K9845L2063L3033L3498
$$ 779378 781578 785321 790977 799964 812952 829607 850274 875842 905687 937750 970783 1004281
59031A004281L1881K7023K1223J7580J6034J4844J4100J4668J5344J4303J2101
$$ 1004281 1036162 1063185 1084408 1101988 1118022 1132866 1146966 1161634 1176978 1191281 1203382
59020A203382J0292Q372M979Q96k030l691m817m740k885r09m51j69J998N167P131
$$ 1203382 1213674 1222046 1227025 1227921 1225891 1222200 1217383 1212643 1209758 1208849 1208398 1208229 1210227 1215394 1222525
59005A222525Q074R417J0340Q880N343J326l600j0830j9187k5960l0732l4992
$$ 1222525 1230599 1240016 1250356 1259236 1264579 1265905 1262305 1251475 1232288 1206328 1175596 1140604
58993A140604l8530l9528l7945l5720l3739l1226k7952k4545k1021j7200j3969
$$ 1140604 1102074 1062546 1024601 988881 955142 923916 895964 871419 850398 833198 819229
58982H19229j2023j0191p222m144k575j849k74K009L932N976R092J2303J4140
$$ 819229 807206 797015 789793 785649 783074 781225 780951 782960 786892 792868 801960 814263 828403
58969H28403J5317J7332J9539K0266J9693J8975J7696J4927J1553Q851O120K422
$$ 828403 843720 861052 880591 900857 920550 939525 957221 972148 983701 992552 998672 1001094
58957A001094p46j449n93k40r2J361L688N629P839J1235J4074J4095J2377J1612
$$ 1001094 1000348 998899 998306 998066 997974 999335 1003023 1008652 1016491 1027726 1041800 1055895 1068272 1079884
58943A079884J1842J1353J0565J1341J3484J5459J7653K1405K5750K8631L0329
$$ 1079884 1091726 1103079 1113644 1124985 1138469 1153928 1171581 1192986 1218736 1247367 1277696
58932A277696L2274L3596L2604L0656L0684L2723L4666L6544M0119M5018M9270
$$ 1277696 1309970 1343566 1376170 1406826 1437510 1470233 1504899 1541443 1581562 1626580 1675850
58921A675850N3146N8496O4824O9958P4298Q0457Q8959R8029J07384J18445J30980
$$ 1675850 1728996 1787492 1852316 1922274 1996572 2077029 2165988 2264017 2371401 2489846 2620826
58910B620826J43310J55686J69921J85773K01198K15784K30322K43294K51541
$$ 2620826 2764136 2919822 3089743 3275516 3476714 3692498 3922820 4166114 4417655
58901D417655K54187K52330K45126K29907K06051J75103J37350R2083M1284j0627
$$ 4417655 4671842 4924172 5169298 5399205 5605256 5780359 5917709 6009792 6051076 6040449
58891F040449o0747j08117j50572j84954k10441k28376k39028k41924k38856k32946
$$ 6040449 5979702 5871585 5721013 5536059 5325618 5097242 4858214 4616290 4377434 4144488
58881D144488k25023k14303k01922j90067j78463j65661j53071j43396j35739
$$ 4144488 3919465 3705162 3503240 3313173 3134710 2969049 2815978 2672582 2536843
58872B536843j26696j15925j06090r7678q8620p8941p0967o4748n8060n1209m6966
$$ 2536843 2410147 2294222 2188132 2090454 2001834 1922893 1851926 1787178 1729118 1677909 1630943
58861A630943m5359m3324m0211l8730l9523l9547l7155l4274l2210k9484k5341
$$ 1630943 1585584 1542260 1502049 1463319 1423796 1384249 1347094 1312820 1280610 1251126 1225785
58850A225785k1459j8712j5755j2022q839o571m104j594l96K16K447N798P408
$$ 1225785 1204326 1185614 1169859 1157837 1148998 1142427 1138323 1136729 1136333 1136549 1138996 1144794 1152202
58837A152202P020P596J0408J3590J6069J8867K1910K3704K4908K8043L2948L6771
$$ 1152202 1159222 1166818 1177226 1190816 1206885 1225752 1247662 1271366 1296274 1324317 1357265 1394036
58825A394036L9059M2482M7730N2256N5071N8345O3019O7248P0469P4759Q0860
$$ 1394036 1433095 1475577 1523307 1575563 1630634 1688979 1751998 1819246 1889715 1964474 2045334
58814B045334Q7004R2911J00785J11119J21608J31459J42603J55519J68083J79731
$$ 2045334 2132338 2225249 2326034 2437153 2558761 2690220 2832823 2988342 3156425 3336156
58804C336156J92443K06313K18446K27389K34269K38310K35789K24886K07081
$$ 3336156 3528599 3734912 3953358 4180747 4415016 4653326 4889115 5114001 5321082
58795E321082J82480J48628J05684N8068R156m1038r1133j36293j73223k02889
$$ 5321082 5503562 5652190 5757874 5815942 5825098 5784060 5692927 5556634 5383411 5180522
58785E180522k26060k40625k45809k44781k40430k32400k20435k06751j92705
$$ 5180522 4954462 4713837 4468028 4223247 3982817 3750417 3529982 3323231 3130526
58776C130526j77056j59715j43494j30072j18084j07069r9234r5177r1853q7023
$$ 3130526 2953470 2793755 2650261 2520189 2402105 2295036 2195802 2100625 2008772 1921749
58766A921749q1898p7483p2316o5819n9855n4976m9214m2352l7031l3714k9192
$$ 1921749 1839851 1762368 1690052 1624233 1564378 1509402 1460188 1417836 1380805 1347091 1317899
58755A317899k2197j5871j2300r291n075j439N00L003P276J0906J2627J5101J9953
$$ 1317899 1295702 1279831 1267531 1258240 1253165 1251726 1252226 1255229 1262505 1273411 1286038 1301139 1321092
58742A321092K4584K6996K9198L2363L3152K8553K0354J1238P52j1246k1223k6287
$$ 1321092 1345676 1372672 1401870 1434233 1467385 1495938 1516292 1527530 1528282 1517036 1495813 1469526
58730A469526k8334l0215l1197k9971k8553k9313l1169l2372l3952l6995l9629
$$ 1469526 1441192 1410977 1379780 1349809 1321256 1291943 1260774 1228402 1194450 1157455 1117826
58719A117826m0104l9860m0414m0300l8194l5786l4417l2227k7791k3252k0732
$$ 1117826 1077722 1037862 997448 957148 918954 883168 848751 816524 788733 765481 744749
58708G44749j8911j6337j4550j4778j4994j3520j2077j2075j1533q940o459n927
$$ 744749 725838 709501 694951 680173 665179 651659 639582 627507 615974 607034 600575 594648
58696E94648n410l229j589k516l939l590l163m632o080n222l694l767m105k709
$$ 594648 589238 586009 584420 581904 577965 574375 571212 566580 560500 555278 551584 547817 543712 541003
58682E41003q33p4J078L871N913N185M046N126O663O132N209O660R394J0999J2168
$$ 541003 540170 540096 541174 545045 550958 556143 560189 565315 571978 578110 583319 589979 599373 610372 622540
58667F22540J4166J4989J2545Q988P451P135N787M174L704K450j887p537j1518
$$ 622540 636706 651695 664240 673228 680679 687814 693601 697775 701479 703929 702042 694505 682987
58654F82987j4403j8047k1161k1577k0476k0059j9390j6725j3529j1933j0547
$$ 682987 668584 650537 629376 607799 587323 567264 547874 531149 517620 505687 495140
58643D95140o946k183J206L440N926P829P954P641Q169P919N659L771M492N925
$$ 495140 488194 486011 487217 490657 496583 504412 512366 520007 528176 536095 541754 545525 550017 555942
58629E55942N592M855N880P383P533P895J0227J2539J2686J2761J5448J9112K1037
$$ 555942 561534 566389 572269 579652 587185 595080 605307 617846 630532 643293 658741 677853 698890
58616F98890K2501K6068L0793L4664L8840M4902N0845N4414N7454O2471O7949
$$ 698890 721391 747459 778252 812916 851756 896658 947503 1001917 1059371 1121842 1189791
58605A189791P1573P4736P9071Q1864P9887P4453O7841N8146M3029K5127Q298
$$ 1189791 1261364 1336100 1415171 1497035 1576922 1651375 1719216 1777362 1820391 1845518 1853816
58594A853816q191k6167m2620n3265n9167o3894o6924o5673o1365n6985n1895
$$ 1853816 1845625 1819458 1776838 1723573 1664406 1600512 1533588 1467915 1406550 1349565 1297670
58583A297670m4251l6125l0472k5591j8558j1409p938o879m475j287k95n41J104
$$ 1297670 1253419 1217294 1186822 1161231 1142673 1131264 1123326 1116447 1111972 1110685 1110390 1109849 1110953
58570A110953L991N705P845J3664K1954K9146L5349M2258M7251M5740L7555K5347
$$ 1110953 1114944 1120649 1128494 1142158 1164112 1193258 1228607 1270865 1318116 1363856 1401411 1426758
58558A426758R142j1504l2443m8462n9720o8761p3869p1973o5551n9738n4738
$$ 1426758 1435900 1424396 1391953 1343491 1283771 1215010 1141141 1069168 1003617 943879 889141
58547H89141m7813m0437l6331l4417l0834k6131k3594k2311j8973j4709j3033
$$ 889141 841328 800891 764560 730143 699309 673178 649584 627273 608300 593591 580558
58536E80558j2834j0474p093o439p358n848k887k598m159l300o18m95k850l630
$$ 580558 567724 557250 550157 543718 536360 530512 527625 525027 520868 517568 516950 516455 513605 509975
58522E09975k648l256m978m090j012L03k47O40K672K651J325K271M699M723K901
$$ 509975 507327 504071 499093 495003 493991 494294 494047 494687 497359 500010 501335 503606 508305 513028 515929
58507E15929L128M996M795L187M078O732O931N257O239R790J1587J1520J3681
$$ 515929 519057 524053 528848 532035 536113 542845 549776 555033 561272 571062 582649 594169 607850
58494F07850J8207K1148K2358K5497L0276L2554L2054L2141L2195K8168K0641
$$ 607850 626057 647205 669563 695060 725336 757890 789944 822085 854280 882448 903089
58483I03089J4374J0043M277k573o943r988j6380k5227l0707l1769l2653l3895
$$ 903089 917463 927506 931783 929210 922267 912279 895899 870672 839965 808196 775543 741648
58471G41648l1738k6710k3817k3484k1147j6374j3628j3320j0995o299l845m262
$$ 741648 709910 683200 659383 635899 614752 598378 584750 571430 560435 554136 550291 546029
58459E46029l240l74l4k320k196J079K608J237J388M097N074L305K912M865N412
$$ 546029 542789 542415 542381 540061 537865 538944 541552 542789 544177 548274 553348 556653 559565 564430 569842
58444E69842M180N171Q353Q997O856P177J1094J3843J4033J5775J9881K1792K0009
$$ 569842 574022 579193 587546 596543 603399 610576 621670 635513 649546 665321 685202 706994 727003
58431G27003J7956J6127J1043L331k004m530q612j3921j5180j2337j1156j2582
$$ 727003 744959 761086 772129 775460 773456 768926 760314 746393 731213 718876 707720 695138
58419F95138j1488p211m919n160k672K712M876L045L593Q065J0558R500J0705
$$ 695138 683650 676439 671520 666360 663688 666400 671276 674321 677914 685979 696537 706037 716742
58406G16742J5754J8588J7039J6554J8920J8348J2663P433N106Q05o992j2305
$$ 716742 732496 751084 768123 784677 803597 821945 834608 842041 847147 847952 840960 828655
58394H28655j2422j2331j4421j4193j0258q101r669r604n819l383m024k457K789
$$ 828655 816233 803902 789481 775288 765030 756929 747260 737656 731837 728454 724430 721973 724762
58381G24762N763M303L960O703O989L245J804M870O108K961J722N378P958O201
$$ 724762 730525 734828 738788 745491 752480 755725 757529 762399 768507 771468 773190 778568 786526 792727
58367G92727N457Q685J0932R857J0345J3590J3353Q187N463Q051R263O354O306
$$ 792727 798184 806869 817801 827658 838003 851593 864946 873133 878596 886647 895910 902264 908570
58354I08570J2233J6915J6249J6441K1192K4327K2071K0162K1726K0546J3501
$$ 908570 920803 937718 953967 970408 991600 1015927 1037998 1058160 1079886 1100432 1113933
58343A113933P356O021L492l431q022o421m923p260p376k216J396j6L64N872R251
$$ 1113933 1121289 1127310 1130802 1127371 1119349 1112928 1108005 1100745 1093369 1091153 1092549 1092533 1092897 1098769 1108020
58328A108020O907O394J1666J5024J2113J0596J5110J8156J5107J3748J9265K4224
$$ 1108020 1114927 1121321 1132987 1148011 1160124 1170720 1185830 1203986 1219093 1232841 1252106 1276330
58316A276330K3270K3304K9072L3301L1283L0459L5019L6207K8644K1140K0203
$$ 1276330 1299600 1322904 1351976 1385277 1416560 1447019 1482038 1518245 1546889 1568029 1588232
58305A588232J8351J0229M477P372J0404O717M243R618J4753J2741J1462J7660
$$ 1588232 1606583 1616812 1621289 1628661 1639065 1645782 1650025 1659643 1674396 1687137 1698599 1716259
58293A716259K3115K0625J8222K3413K8748K7262K6476L2729L7612L4719L3601
$$ 1716259 1739374 1759999 1778221 1801634 1830382 1857644 1884120 1916849 1954461 1989180 2022781
58282B022781M1990N0617N1041N1805O1051P0172P1137P2793Q3046R2114R0739
$$ 2022781 2064771 2115388 2166429 2218234 2279285 2349457 2420594 2493387 2576433 2668547 2759286
58271B759286Q7604R0992R1006P8287O2554N4088M4955K7614J3449J2983J6263
$$ 2759286 2846890 2937882 3028888 3107175 3169729 3223817 3268772 3296386 3309835 3322818 3339081
58260C339081J2836J2098K3355L5499L7774M0747N4718O7881O8742O9192Q1615
$$ 3339081 3351917 3364015 3387370 3422869 3460643 3501390 3556108 3623989 3692731 3761923 3843538
58249C843538R4458R5061R4986J07134J19780J19857J19646J32898J47149J48116
$$ 3843538 3937996 4033057 4128043 4235177 4354957 4474814 4594460 4727358 4874507 5022623
58239E022623J48436J62928J78987J81799J84680K02997K22915K28504K34187
$$ 5022623 5171059 5333987 5512974 5694773 5879453 6082450 6305365 6533869 6768056
58230F768056K56585K80864K90199L00861L31110L64041L80154L96940M35337
$$ 6768056 7024641 7305505 7595704 7896565 8227675 8591716 8971870 9368810 9804147
58221I804147M77896N03304N30179N81154O37153O75433P17976P91168Q74355
$$ 9804147 10282043 10785347 11315526 11896680 12533833 13209266 13927242 14718410 15592765
58212A5592765R42589J021297J140603J277035J403044J550222J756114J996194
$$ 15592765 16535354 17556651 18697254 19974289 21377333 22927555 24683669 26679863
58204B6679863K242443K538548K936408L413250L939669M568173N356587O275597
$$ 26679863 28922306 31460854 34397262 37810512 41750181 46318354 51674941 57950538
58196E7950538P307821Q562197J0164058J2129677J4506132J7519628K1397908
$$ 57950538 65258359 73820556 83984614 96114291 110620423 128140051 149537959
58189A49537959K6203066L2045502L9017121M6059772M9837511M5869992L1994458
$$ 149537959 175741025 207786527 246803648 292863420 342700931 388570923 420565381
58182D20565381J0900315j1200725k8602736l8961621m3005373m2614060l9520353
$$ 420565381 431465696 420264971 391662235 352700614 309695241 267081181 227560828
58175B27560828l5059383l0190277k5464065k1135832j7361281j4226976j1683842
$$ 227560828 192501445 162311168 136847103 115711271 98349990 84123014 72439172
58168G2439172r608016p923852o594995n544691m678349l958246l383092k920068
$$ 72439172 62831156 54907304 48312309 42767618 38089269 34131023 30747931 27827863
58160B7827863k520215k174829j897953j673808j471262j289525j144081j025491
$$ 27827863 25307648 23132819 21234866 19561058 18089796 16800271 15656190 14630699
58152A4630699r12032q06019p21707o52739n83074n15571m61761m16735l68610
$$ 14630699 13718667 12912648 12190941 11538202 10955128 10439557 9977796 9561061 9192451
58143I192451l20329k80954k46984k10048j72094j38313j05212o7097k4908J9010
$$ 9192451 8872122 8591168 8344184 8134136 7962042 7823729 7718517 7651420 7626512 7645522
58133G645522O5160J10799J48568J73578J85730J89258J97265K27834K87124L67980
$$ 7645522 7710682 7821481 7970049 8143627 8329357 8518615 8715880 8943714 9230838 9598818
58123I598818M70790O05758P69026R46436J149801J412349J740625K122627K593346
$$ 9598818 10069608 10675366 11444392 12390828 13540629 14952978 16693603 18816230 21409576
58114B1409576L223090M034974N043031O371648Q086054R699773J0050608Q090912
$$ 21409576 24632666 28667640 33710671 40082319 48168373 57868146 67918754 76009666
58106G6009666L954596r41481m966866p356065q285718q250651p633482o711233
$$ 76009666 79964262 79022781 74055915 66699850 58414132 50163481 42529999 35818766
58098C5818766n716579m776855l913617l147033k524434k047172j662498j342426
$$ 35818766 30102187 25325332 21411715 18264682 15740248 13693076 12030578 10688152
58090A0688152j099796r23217p68433o22628n13728m47720l94044l39898l04954
$$ 10688152 9588356 8665139 7896706 7274078 6760350 6312630 5918586 5578688 5273734
58081E273734k94490k86896k74350k70324k71401k55054k20483j90823j70922
$$ 5273734 4979244 4692348 4417998 4147674 3876273 3621219 3400736 3209913 3038991
58072C038991j42885j07030q7364r0873r8209r9780j05860j16389j15551j02087
$$ 3038991 2896106 2789076 2701712 2610839 2512630 2412850 2306990 2190601 2075050 1972963
58062A972963r2852r1251q2858o6167n7072n8660n6265m6570m2660m6315m3826
$$ 1972963 1880111 1788860 1706002 1639835 1582763 1524103 1467838 1421268 1378608 1332293 1288467
58051A288467l3480k9343l3617l2520k3787k1272k7736k9425k2531j9408k3467
$$ 1288467 1254987 1225644 1192027 1159507 1135720 1114448 1086712 1057287 1034756 1015348 991881
58040I91881k3083j5654j3208j8560j9628j2966r935j3991j4567q988q121j4492
$$ 991881 968798 953144 939936 921376 901748 888782 878847 864856 850289 841301 833180 818688
58028H18688j6588j0910q494j3410j5523j0764q449j2139j2803p303m737q206
$$ 818688 802100 791190 782696 769286 753763 742999 734550 722411 709608 702305 697568 689362
58016F89362q719l229o34l984m489Q62L328k95j533K900N137K573L445J0361J4707
$$ 689362 680643 677414 676780 672796 668307 669169 672497 672202 670669 673569 678706 681279 684724 695085 709792
58001G09792J3198J3688J8934K0775J6154J2962J4151J1883L383l109m098p060
$$ 709792 722990 736678 755612 776387 792541 805503 819654 831537 834920 831811 827713 820653
57989H20653j4897j9529j7371j6093j9595k0963j6890j4574j7573j8941j5156
$$ 820653 805756 786227 768856 752763 733168 712205 695315 680741 663168 644227 629071
57978F29071j2959j5676j6382j1475p641q579q076k948K00j950k626J867M924
$$ 629071 616112 600436 584054 572579 564938 556359 548283 545335 545535 543585 540959 542826 547750
57965E47750K620J380N384Q575O611M899P288Q185L590j164j997l595r120j3079
$$ 547750 550370 551750 557134 565709 572320 577219 584507 592692 596282 595118 593121 589526 580406 567327
57951E67327j1699j0093j2077j2934r285o044o663o474k523p6k409l966o32K821
$$ 567327 555628 545535 533458 520524 511239 505195 498532 492058 489535 489459 487050 483084 482452 485273
57937D85273K389K323O004Q935P878P679J1707J4551J1599P144N769M279n00m283
$$ 485273 487662 489985 495989 504924 512802 520481 532188 546739 558338 565482 571251 575530 575030 570747
57923E70747l120p34r92p32L043O463O071N322P218P913M275M08J36J67k899n986
$$ 570747 567627 566893 565901 565169 568212 574675 580746 586068 593286 601199 605474 605882 606018 606185 603286 597300
57907E97300o182o738j0259j3103j2644j2848j6507j9275j7638j5440j6258j6678
$$ 597300 591118 584380 574121 561018 548374 535526 519019 499744 482106 466666 450408 433730
57895D33730j3601j0801j1479j1556p294k729k457l627k002L58L05J68K462M068
$$ 433730 420129 409328 397849 386293 378999 376270 373813 370186 368184 368542 368847 369015 371477 375545
57881C75545K380J220M122P634P765P061Q846J0371Q390N800O158P068N446L796
$$ 375545 377925 379145 383267 390901 398666 405727 414573 424944 433334 439134 445292 452360 457806 461602
57867D61602M906N801L319L00O6J42k366m724m029l110m772n834l248m80j265
$$ 461602 466508 472309 475628 475928 475994 476136 473770 469046 465017 461907 457135 451301 448053 447573 446308
57852D46308k596o08K072J614L30J844M112M061M135P326J0546R978Q242R359
$$ 446308 443712 443104 445176 446790 447120 448964 453076 457137 461272 468598 479144 489122 497364 506723
57838E06723J1251J0238Q326Q916R717P145L485K582K435o96m783n770n170o756
$$ 506723 517974 528212 536538 545454 555171 562316 565801 568383 570818 570122 565339 559569 554399 547643
57824E47643r270r368q476r728j1290r621o329n177n251l549j309j270j722K89
$$ 547643 538373 529005 520529 510801 499511 489890 483561 478384 473133 469584 468275 467005 465283 465572
57810D65572K883K794J766L125N074L957J211M75O61j477m566n028l814m231n464
$$ 465572 468455 471249 473015 476140 481214 485171 486382 486857 487518 486041 481475 476447 472633 468402 462938
57795D62938m642l053l853n694m894k055m81m1J555L420L273K488L682N304M219
$$ 462938 458296 455243 451390 445696 440802 438747 438266 438225 439780 443200 446473 448961 452643 457947 462166
57780D62166J542L72K6j858l843l093r89o82j219K24K595L133L038N134Q180R227
$$ 462166 463708 464080 464106 462248 458405 455312 454323 453641 452422 452646 455241 458374 461412 466546 474726 483953
57764D83953R470J1847J5096J5994J5326J5718J5792J2572P625M742L426O72k823
$$ 483953 493423 505270 520366 536360 551686 567404 583196 595768 603393 608135 611561 612233 609410
57751F09410m387n189q026j1261j1365r694j0190j2012j1178q122o864p676p233
$$ 609410 605023 599834 591808 580547 569182 559488 549298 537286 526108 517986 511122 503446 496213
57738D96213n360n032o211n967m322l982m598l255k16J532K025L848O484O861
$$ 496213 490853 485821 479610 473643 469321 465339 460741 457486 457270 458802 460827 464675 471159 478020
57724D78020N166M454M788L524J059O35K459L535L226L702M978M742L130K625
$$ 478020 483186 487640 492428 495952 497011 497646 500105 503640 506866 510568 515546 520288 523418 526043
57710E26043L337L277K813L970N781N480L797L928N772O456O032P250J0064J1842
$$ 526043 529380 532657 535470 539440 545221 550701 554498 558426 564198 570654 576686 583936 594000 605842
57696F05842J2752J5496J9759K2301K2538K2741K2841K0430J6025J3000J2058
$$ 605842 618594 634090 653849 676150 698688 721429 744270 764700 780725 793725 805783
57685H05783J0900R486J0359J3642J6877K0105K5891L3976M1124M6681N3278O1672
$$ 805783 816683 826169 836528 850170 867047 887152 913043 947019 988143 1034824 1088102 1149774
57673A149774O9851P7669Q7162R7734J06077J11604J17130J23424J27916J29798
$$ 1149774 1219625 1297294 1384456 1482190 1588267 1699871 1817001 1940425 2068341 2198139
57663B198139J32007J36769J42036J41730J26233Q5250J7224o3459j34375j81565
$$ 2198139 2330146 2466915 2608951 2750681 2876914 2962164 2979388 2915929 2781554 2599989
57653B599989k05056k10226k01058j82291j60529j39694j19540j00200q3851p0831
$$ 2599989 2394933 2184707 1983649 1801358 1640829 1501135 1381595 1281395 1197544 1126713
57643A126713n8816m7222l8114l1892k6439k1318j8218j6564j3432q731n628m886
$$ 1126713 1067897 1020675 982561 950669 924230 902912 884694 868130 854698 845967 840339 835453
57631H35453l527j72L075N157P627J0623J2024J1936J3304J6783J9702K1260K3976
$$ 835453 831926 831754 834829 839986 847613 858236 870260 882196 895500 912283 931985 953245 977221
57618I77221K8502L2022L3558L6060M1194M6583N0303N3818N8289O1944O3177
$$ 977221 1005723 1037745 1071303 1107363 1148557 1195140 1245443 1299261 1357550 1419494 1482671
57607A482671O2576O0065N3713M3088L0313J6430M47j6851l2096m3722n3280o1228
$$ 1482671 1545247 1605312 1659025 1702113 1732426 1748856 1749303 1732452 1700356 1656634 1603354 1542126
57595A542126o5539o5950o5280o4880o2750n7843n2274m7612m2837l7629l3724
$$ 1542126 1476587 1410637 1345357 1280477 1217727 1159884 1107610 1059998 1017161 979532 945808
57584I45808l1397k8418k4132k0710j8986j7031j4334j3073j3623j3124j0412
$$ 945808 914411 885993 861861 841151 822165 805134 790800 777727 764104 750980 740568
57573G40568q067p567o752m347k727l536m494l405j707j304j245j92Q50Q33Q91
$$ 740568 732501 724934 718182 713835 711108 707572 703078 699673 697966 696662 695417 695225 696075 696908 697799
57558F97799J981K951K919K912L487L618L343M428O880Q111P095O036O400O848
$$ 697799 699780 702731 705650 708562 712049 715667 719010 723438 730318 738429 745524 751560 757960 764808
57544G64808O673P535R861J1193J0280R400J0658J3076J5223J7345J9258J9499
$$ 764808 771481 779016 788877 800070 810350 819750 830408 843484 858707 876052 895310 914809
57532I14809J8402J8532K0516K1980K2103K3146K5780K7340K6863K7417L0847
$$ 914809 933211 951743 972259 994239 1016342 1039488 1065268 1092608 1119471 1146888 1177735
57521A177735L4493L6047L7467M0928M4720M6606M7698M9560N0547M8441M3838
$$ 1177735 1212228 1248275 1285742 1326670 1371390 1417996 1465694 1515254 1565801 1614242 1658080
57510A658080L7853K9333J7414M110q442k0608l2475m1603m6480m9221n1802n2543
$$ 1658080 1695933 1725266 1742680 1746790 1738348 1717740 1685265 1643662 1597182 1547961 1496159 1443616
57498A443616m9482m4406m0204l6736l2543k8220k4894k1618j7334j3382j1130
$$ 1443616 1394134 1349728 1309524 1272788 1240245 1212025 1187131 1165513 1148179 1134797 1123667
57487A123667r282o223l006j342p14K3M02O5M28K176L538L434L747O084Q845J0123
$$ 1123667 1114385 1108162 1105156 1103814 1103100 1103123 1103525 1103590 1104018 1106194 1109732 1113166 1116913 1122997 1131842 1141965
57471A141965J0904J2662J4476J5286J6479J9368K2497K4253K5749K8380L1150
$$ 1141965 1152869 1165531 1180007 1195293 1211772 1231140 1253637 1277890 1303639 1332019 1363169
57460A363169L3114L5837M0397M4669M6707M8284N1671N5340N6208N4063N0331
$$ 1363169 1396283 1432120 1472517 1517186 1563893 1612177 1663848 1719188 1775396 1829459 1879790
57449A879790M4504L5182K3099J0017l647j7402k8775l5844l9895m2902m4332
$$ 1879790 1924294 1959476 1982575 1992592 1988945 1971543 1942768 1906924 1867029 1824127 1779795
57438A779795m3075m0348l7834l4944l0822k6865k4334k1663j7191j2489r882
$$ 1779795 1736720 1696372 1658538 1623594 1592772 1565907 1541573 1519910 1502719 1490230 1480348
57427A480348q659o816m615l268k087J0J964K519K801M096N207M911M808O633
$$ 1480348 1471689 1464873 1460258 1456990 1454903 1454913 1456877 1459396 1462197 1466293 1471500 1476411 1481219 1487852
57413A487852Q928R666R877J1307J2762J2379J1464J2286J3902J3955J2907J2823
$$ 1487852 1496780 1506446 1516323 1527630 1540392 1552771 1564235 1576521 1590423 1604378 1617285 1630108
57401A630108J3518J3522J3300J4093J5003J4697J4339J5467J6724J6185J5092
$$ 1630108 1643626 1657148 1670448 1684541 1699544 1714241 1728580 1744047 1760771 1776956 1792048
57390A792048J5603J6724J6327J5390J6144J7675J7615J6728J7523J9439J9759
$$ 1792048 1807651 1824375 1840702 1856092 1872236 1889911 1907526 1924254 1941777 1961216 1980975
57379A980975J8337J7304J6980J6117J5381J6419J8187J8236J7058J7220J8779
$$ 1980975 1999312 2016616 2033596 2049713 2065094 2081513 2099700 2117936 2134994 2152214 2170993
57368B170993J9542J9213J9314J9501J8102J6034J6051J8121J9326J8529J7549
$$ 2170993 2190535 2209748 2229062 2248563 2266665 2282699 2298750 2316871 2336197 2354726 2372275
57357B372275J7652J8264J9161K0687K1854K1342K0152K0271K1254K1287K0869
$$ 2372275 2389927 2408191 2427352 2448039 2469893 2491235 2511387 2531658 2552912 2574199 2595068
57346B595068K1920K3893K4495K3815K3992K5127K5364K4743K5131K6416K6555
$$ 2595068 2616988 2640881 2665376 2689191 2713183 2738310 2763674 2788417 2813548 2839964 2866519
57335B866519K5537K5500K6755K7413K7120K7524K8693K8760K7622K7403K8669
$$ 2866519 2892056 2917556 2944311 2971724 2998844 3026368 3055061 3083821 3111443 3138846 3167515
57324C167515K9568K9329K9336L0065L0164K9359K9193L0148L0814L0613L0660
$$ 3167515 3197083 3226412 3255748 3285813 3315977 3345336 3374529 3404677 3435491 3466104 3496764
57313C496764L1399L1989L2336L3268L4451L4769L4762L5993L7976L8554L7439
$$ 3496764 3528163 3560152 3592488 3625756 3660207 3694976 3729738 3765731 3803707 3842261 3879700
57302C879700L6519L6629L6818L6920L7858L9235L9525L8828L8737L9437L9641
$$ 3879700 3916219 3952848 3989666 4026586 4064444 4103679 4143204 4182032 4220769 4260206 4299847
57291D299847L9343L9685M0286L9739L8644L9032M0731M1561M1167M1451M2918
$$ 4299847 4339190 4378875 4419161 4458900 4497544 4536576 4577307 4618868 4660035 4701486 4744404
57280D744404M3870M3564M3136M3107M2869M2755M3589M4163M2356L8813L6247
$$ 4744404 4788274 4831838 4874974 4918081 4960950 5003705 5047294 5091457 5133813 5172626 5208873
57269E208873L5066L3068K9654K6766K5294K4053K2786K2724K3657K3835K3249
$$ 5208873 5243939 5277007 5306661 5333427 5358721 5382774 5405560 5428284 5451941 5475776 5499025
57258E499025K3732K5398K6505K7142K9344L2983L5436L6072L7271M0031M2366
$$ 5499025 5522757 5548155 5574660 5601802 5631146 5664129 5699565 5735637 5772908 5812939 5855305
57247E855305M3250M4319M6285M7285M6442M5627M6093M6452M5642M4853M4892
$$ 5855305 5898555 5942874 5989159 6036444 6082886 6128513 6174606 6221058 6266700 6311553 6356445
57236F356445M4561M3183M2017M1634M0632L8350L6302L5548L5167L4520L4483
$$ 6356445 6401006 6444189 6486206 6527840 6568472 6606822 6643124 6678672 6713839 6748359 6782842
57225F782842L5334L6006L6423L7892M0264M1490M1040M0999M2664M4881M6603
$$ 6782842 6818176 6854182 6890605 6928497 6968761 7010251 7051291 7092290 7134954 7179835 7226438
57214G226438M8303M9872N0154M9511M9880N1266N1299M9281M7371M6626M5231
$$ 7226438 7274741 7324613 7374767 7424278 7474158 7525424 7576723 7626004 7673375 7720001 7765232
57203G765232M2063L8701L6352L4003L1208K9567K9684K9731K8690K8067K8734
$$ 7765232 7807295 7845996 7882348 7916351 7947559 7977126 8006810 8036541 8065231 8093298 8122032
57192H122032K9110K8206K7446K7697K7483K5900K4314K3331K1188J7178J3663
$$ 8122032 8151142 8179348 8206794 8234491 8261974 8287874 8312188 8335519 8356707 8373885 8387548
57181H387548J2464J2001J0228P771N960M295K009j77j857m163p464j0214j1812
$$ 8387548 8400012 8412013 8422241 8430012 8435972 8440267 8442276 8442099 8440242 8436079 8428615 8418401 8406589
57168H406589j3886j7120j9722k0866k2631k6275k9614l0597l0645l1741l2738
$$ 8406589 8392703 8375583 8355861 8334995 8312364 8286089 8256475 8225878 8195233 8163492 8130754
57157H130754l1371k7837k3683j9193j4341j0480q557p227m921k096K45K344M143
$$ 8130754 8099383 8071546 8047863 8028670 8014329 8003849 7995292 7988065 7983144 7981048 7981293 7983637 7987780
57144G987780M010R84l557q217j3509j9919k6322l2050l8210m5103n0630n3064
$$ 7987780 7991790 7992774 7989217 7981000 7967491 7947572 7921250 7889200 7850990 7805887 7755257 7702193
57132G702193n3089n1432m7120m0067l2757k7318k3431k1011k1991k7120l3669
$$ 7702193 7649104 7597672 7550552 7510485 7477728 7450410 7426979 7405968 7383977 7356857 7323188
57121G323188l8763m2314m4372m2626l5538k5495j5821o964J598Q102J0508J0019
$$ 7323188 7284425 7242111 7197739 7155113 7119575 7094080 7078259 7071295 7072893 7080995 7091503 7101522
57109G101522R828J2008J7953K9716M8037P0869R6423J26179J62849K07671K61996
$$ 7101522 7111350 7123358 7141311 7171027 7219064 7289933 7386356 7512535 7675384 7883055 8145051
57098H145051L28995M10997N07192O16476P40425Q80956J037238J207122J388523
$$ 8145051 8474046 8885043 9392235 10008711 10749136 11630092 12667330 13874452 15262975
57089A5262975J575996J758046J920955K053521K146071K187932K169502K085593
$$ 15262975 16838971 18597017 20517972 22571493 24717564 26905496 29074998 31160591
57081C1160591J935466J723167J459149J155251Q12881M21548k3034n00912r73942
$$ 31160591 33096057 34819224 36278373 37433624 38246505 38668053 38645019 38144107 37170165
57072C7170165j408496j787040k100378k338135k490149k552425k529186k432204
$$ 37170165 35761669 33974629 31874251 29536116 27045967 24493542 21964356 19532152
57064A9532152k279316k090386j882452j668945j461575j269357j095987r41324
$$ 19532152 17252836 15162450 13279998 11611053 10149478 8880121 7784134 6842810
57056F842810q05494o89171n90771n06778m34910l74414l23695k80494k44013
$$ 6842810 6037316 5348145 4757374 4250596 3815686 3441272 3117577 2837083 2593070
57047B593070k14226j89491j67446j47777j31573j18518j07167r7326q9584q3226
$$ 2593070 2378844 2189353 2021907 1874130 1742557 1624039 1516872 1419546 1329962 1246736
57037A246736p7041p1416o7082o2913n7471n1763m7721m4948m1707l8009l4981
$$ 1246736 1169695 1098279 1031197 968284 910813 859050 811329 766381 724674 686665 651684
57026F51684l2239k8803k5541k3882k3067k1472j9437j8081j6655j4051j1561
$$ 651684 619445 590642 565101 541219 518152 496680 477243 459162 442507 428456 416895
57015D16895j0968j1226j0281q741q413q581p334n384m864n407n101m202m277
$$ 416895 405927 394701 384420 375679 367266 358685 351351 345967 341103 335696 330595 326393 322116
57002C22116m667l648k044j930k579j661M46J412J249J957L641M823N883Q315
$$ 322116 317449 313801 311757 309827 307248 305587 306033 307445 308694 310651 314292 319115 324998 333313
56988C33313J1355J3226J4899J8766K4300K8854L1732L3559L2930K8102K1123
$$ 333313 344668 357894 372793 391559 415859 444713 476445 510004 542934 571036 592159
56977E92159J5912J3166J1285J0925J4240K0934K9534M0902N6037P2729Q9506
$$ 592159 608071 621237 632522 643447 657687 678621 708155 749057 805094 877823 967329
56966I67329J10084J38391J72722K11194K58601L20256L95711M88826O12271P56099
$$ 967329 1077413 1215804 1388526 1599720 1858321 2178577 2574288 3063114 3675385 4431484
56956D431484Q50791P93476N37030J47806k38757n16446o59372o97276o69693
$$ 4431484 5282275 6075751 6612781 6760587 6521830 6005384 5346012 4648736 3979043
56947C979043o06414n28432m48887l73462l04924k46130j97836j57719j23773
$$ 3979043 3372629 2844197 2395310 2021848 1716924 1470794 1272958 1115239 991466
56938I91466r6151p4633n6993m1072k6514j3762k995N523J1104J2684Q583k425
$$ 991466 895315 820682 763689 722617 696103 682341 679346 684869 695973 708657 717240 714815
56926G14815j8582l4848m6665n3029n4982n3045m7807m1235l5321l0381k6098
$$ 714815 696233 661385 614720 561691 506709 453664 405857 364622 329301 298920 272822
56915B72822k2739k0043j6711j2592r578q795q695p512n727m408l178j664r67
$$ 272822 250083 230040 213329 200737 191159 182364 173669 166157 160430 156022 152844 151180 150213
56902A50213j654k147j074N71J450K180L652N037N555O405Q757J1528J3366J5140
$$ 150213 148559 146412 145338 145909 147359 149539 153191 158228 163783 170188 178945 190473 203839 218979
56888B18979J8332K2541K6567L0179L2527L0714K2722J0673j136j0305j6609j9836
$$ 218979 237311 259852 286419 316598 349125 379839 402561 413234 412098 401793 385184 365348
56876C65348j9972j8389j6456j3717r323m257r9L364P396J2056J6608K1268K6754
$$ 365348 345376 326987 310531 296814 287491 283234 283135 286499 293895 305951 322559 343827 370581
56863C70581L2987L9934M8835O0615P3192Q1413P9435O3472L4584L7l0071m9480
$$ 370581 403568 443502 492337 552952 626144 707557 786992 850464 885048 885085 855014 805534
56851H05534n8565o0488n7162n0008m1508l3358k4797j4881m755M232J2759K1950
$$ 805534 746969 686481 629319 579311 537803 504445 479648 464767 460012 464244 477003 498953
56839D98953L1361M0609N1172O4474Q0044R7248J15842J31461J33133J10320O3326
$$ 498953 530314 570923 622095 686569 766613 863861 979703 1111164 1244297 1354617 1417943
56828A417943M623m9847q9304j10568j16404j12381j03111r0423p5231n9701m5955
$$ 1417943 1422566 1372719 1283415 1172847 1056443 944062 840951 750528 675297 615596 569641
56817E69641l3928k2465j1629k095O764J6247K6512L7206M9168O3602P9483R2514
$$ 569641 535713 513248 501619 499524 506288 522535 549047 586253 635421 699023 778506 871020
56805H71020R6054Q3417N2162Q304l5461o8045q6228r2676r0724q3128p3093o2975
$$ 871020 967074 1050491 1102653 1110957 1075496 1007451 921223 828547 737823 654695 581602 518627
56793E18627n2706m1685l1131k2625j5750r282l236K327Q823J7075K5462L2535
$$ 518627 465921 424236 393105 370480 354730 345448 342212 344539 353362 370437 395899 428434
56781D28434L9574M7394N2069M7471L1842R269j4454l4792m8358n3682n2666m8986
$$ 428434 468008 515402 567471 614942 646784 656053 641599 606807 558449 504767 452101 403115
56769D03115m4631l9562l3988k8808k4114j9402j5145j2353j0901r923r280r069
$$ 403115 358484 318922 284934 256126 232012 212610 197465 185112 174211 164288 155008 145939
56757A45939q489o962n565n521o110n816m679l671k768j588r20j592k669k824
$$ 145939 137450 130488 124923 119402 113292 107476 102797 99126 96358 94770 93850 92258 89589 86765
56743H6765k475k705l057k494j511j144r66j86L50m44j559j259J42J151J710K557
$$ 86765 84290 81585 78528 76034 74523 73379 72413 72227 72577 72133 70574 69315 69457 70608 72318 74875
56727G4875L022K013L62k40Q7J33P4P48J392P10n27n27N91J306J434J842K135
$$ 74875 77897 79910 80272 80032 80119 80252 80326 81074 82466 83176 82649 82122 82713 84019 85453 87295 89430
56710H9430J283q2n38m37j159k345k491j673j197j117n78N0j27l21P69K237K136
$$ 89430 90713 90631 90093 89656 88497 86152 83661 81988 80791 79674 79096 79146 79019 78698 79467 81704 83840
56693H3840P53M1K91J75m26m23M9o4l47M44J687J629M96J02O98R10N46O66J126
$$ 83840 84593 84634 84925 85100 84674 84251 84300 84236 83889 84333 86020 87649 88145 88247 88945 89855 90401 91067 92193
56674I2193Q74M26J177K488K376J018N86J582K236J745J262J306R63k9p69j136
$$ 92193 93067 93493 94670 97158 99534 100552 101138 102720 104956 106701 107963 109269 110232 110203 109434 108298
56658A08298j844k535k082p97p8q4R5K43m87j377j019M6K51n9N71J446N59j584
$$ 108298 106454 103919 101837 101040 100962 100878 100973 101216 100729 99352 98333 98379 98630 98571 99142 100588 101147 99563
56640I9563k295q37Q39J585K087K401J637L69K67J066Q75l13n18O09J278R66J099
$$ 99563 97268 96431 97270 98855 100942 103343 104980 105349 105616 106682 107557 107244 106726 107335 108613 109579 110678
56623A10678J921J853N74l18k91o10j578k008j881k494l557l192j374k58n41n88
$$ 110678 112599 114452 115026 114708 114417 113807 112229 110221 108340 105846 102289 99097 97723 97465 96924 96336
56607I6336K46O34K02L27J234J437P91R38K023K178J097Q34K084K954K489K198
$$ 96336 96582 97216 97418 97745 98979 100416 101207 102145 104168 106346 107443 108277 110361 113315 115804 118002
56591A18002K881L088K067J225J370J344O78O96J725K042R22M9N46J271J229J140
$$ 118002 120883 123971 126038 127263 128633 129977 130655 131351 133076 135118 136040 136089 136635 137906 139135 140275
56575A40275J420J241O11Q78K147K807K437K481L322L563K984L165M281M486L408
$$ 140275 141695 142936 143547 144425 146572 149379 151816 154297 157619 161182 164166 167331 171612 176098 179506
56560A79506L093M324N326N232N554O929P760P479P762R070R372P987P252Q515
$$ 179506 182599 186923 192249 197481 203035 209964 217724 225203 232965 242035 251407 259394 266646 275161
56546B75161R739R132P987P880P949P094O074N506M348K225O49K44n45k387l598
$$ 275161 284900 294032 302019 309899 317848 324942 331016 336522 340870 343095 343744 343988 343443 341056 337458
56531C37458l355l423m910o305o524o881q140q704p727p031p838q537p760o779
$$ 337458 334103 330680 325770 319465 312941 306060 297920 289216 281489 274458 266620 258083 250323 243544
56517B43544o752o567n532n258o638p795p205o104n688m965l544l372n243o635
$$ 243544 236792 230225 224693 219435 212797 205002 197797 191693 186005 181040 177496 174124 168881 162246
56503A62246n599l877l566l631k433r14m26j13Q82J217M9p32K81J285M99n75j3
$$ 162246 156647 152770 149204 145573 143140 142226 141800 141687 142569 143786 143835 143103 143384 144669 145168 144593 144580
56486A44580J035O84k81k68K15K73Q40K392L010J528Q5O38J596R80J73J187K640
$$ 144580 145615 146299 146018 145750 145965 146238 147078 149470 152480 154008 154093 154731 156327 157307 157480 158667 161307
56469A61307K178O79N02J404J648J498K258L427L816L969M702M978M027L526M845
$$ 161307 163485 164164 164666 166070 167718 169216 171474 174901 178717 182686 187388 192366 196393 199919 204764
56454B04764O202N559M195M311N103M576L363L368M270M553M557N356O138N608
$$ 204764 210966 216525 220720 225031 230134 234710 238073 241441 245711 250264 254821 260177 266315 271923
56440B71923M523M146L856K917K634L968N098M230K790K843L489K924J901J838
$$ 271923 276446 280592 284448 287365 289999 293967 299065 303295 306085 308928 312417 315341 317242 319080
56426C19080J605m36l009l916l703m142m843m591m201m889n630n182m801n788
$$ 319080 320685 320249 317240 313324 309621 305479 300636 296045 291844 286955 281325 276143 271342 265554
56412B65554o607n623m458n168o369n818m528m565m886l376r63K27Q44K416L539
$$ 265554 258947 253324 248866 243698 237329 231511 226983 222418 217532 214156 213193 213420 214264 216680 220219
56397B20219K127l10q61K1k4o90j98O64q6j619j838j457k432l851l611k640l213
$$ 220219 222346 222036 221175 221196 221172 220482 220284 220948 220862 219243 217405 215948 213516 209665 206054 203414 200201
56380B00201m531m382l616m408n497l952n88J134P86R54K291L060L028L503M035
$$ 200201 195670 191288 187672 183264 177767 173815 173227 174361 175147 176101 178392 181452 184480 187983 192018
56365A92018L153J682J424J485p0k016j664L01R62J59M3O17J75p54k65R30P73
$$ 192018 195171 196853 198277 199762 199692 197676 196012 196313 197275 197434 197477 198094 198269 197515 197250 198180 198953
56348A98953J12J268L299L268J481Q60J807K215J839K162K717K007J198K386M108
$$ 198953 199065 200333 203632 206900 208381 209241 211048 213263 215102 217264 219981 221988 223186 225572 229680
56333B29680L363J107P64K156K088L40k58O88Q58J99J055L226L937K800K166K517
$$ 229680 233043 234150 234914 237070 239158 239498 239240 239928 240786 240985 242040 245266 249203 252003 254169 256686
56317B56686K164J362K079L856M441M219N379P223P149N719N781P047O698M855
$$ 256686 258850 260212 262291 266147 270588 274807 280186 287409 294558 300277 306058 313105 319803 324658
56303C24658M219M714L825J947J922L485L640K287K013K593J375j063j466m1j93
$$ 324658 328877 333591 337416 339363 341285 344770 348410 350697 352710 355303 356678 355615 354149 354108 353915
56288C53915k190k990k376l076m708l974j233m94k219k598p38pj200r16J743L241
$$ 353915 351725 348735 346359 343283 338575 334601 333368 332874 330655 328057 327319 327312 326112 325196 326939 330180
56272C30180K080J208K195K771J864J569K462K367J158J416L045K826N63q1J820
$$ 330180 332260 333468 335663 338434 340298 341867 344329 346696 347854 349270 352315 355141 355704 355623 357443
56257C57443K794J376M26J514K605K862M182O514P106N807N628P007P099N678
$$ 357443 360237 361613 362039 363553 366158 369020 373202 379716 386822 392629 398257 405264 412363 418041
56243D18041N756P372P095M703L963N525N711L790L536N879O922N234M357N902
$$ 418041 423797 431169 438264 442967 446930 452455 458166 461956 465492 471371 478293 483527 487884 493786
56229D93786O883O055O227Q050Q289O426O224Q526R328P321O205P117O156K158
$$ 493786 500669 506724 512951 521001 529290 535716 541940 550466 559794 567115 573320 580437 586593 588751
56215E88751m71K91N91j668l066j903j875m778o701n234l678m220l926j314L8
$$ 588751 588280 588571 589162 587494 584428 582525 580650 575872 569171 563937 560259 556039 552113 550799 550837
56200E50837j625k552o84M46j111j666P43K077j20j839qK015J160J95J696K944
$$ 550837 549212 546660 545976 546422 545311 543645 544388 546465 546345 544506 544498 546513 547673 547868 549564 552508
56184E52508J724R43K601L495J568L24K168L737K576J977M346O282N189M273N945
$$ 552508 554232 555175 557776 561271 562839 563163 565331 569068 571644 573621 577967 584249 589438 593711 599656
56169E99656O774M183J696K298K973J053m36J037K357R64j76J113J551q12j989
$$ 599656 606430 610613 612309 614607 617580 618633 618197 619234 621591 622555 622379 623492 625043 624231 622242
56154F22242N48K782J773J271M145O470N050L691N814Q054P398P488J1291J4650
$$ 622242 622790 625572 627345 628616 632761 639231 644281 647972 653786 661840 669238 676726 688017 702667
56140G02667J3915J3019J6056J9608J9456J8304J9840K1670K0992K0877K4222
$$ 702667 716582 729601 745657 765265 784721 803025 822865 844535 865527 886404 910626
56129I10626K7841K9075L1513L7793M3896M7141N2251O2763P4177Q2825R3580
$$ 910626 938467 967542 999055 1036848 1080744 1127885 1180136 1242899 1317076 1399901 1493481
56118A493481J11333J32782J54283J79254K09356K36340K51355K54629K47939
$$ 1493481 1604814 1737596 1891879 2071133 2280489 2516829 2768184 3022813 3270752
56109C270752K26836J90414J50597J21027J03223R2324Q7896Q8570Q4178O5453
$$ 3270752 3497588 3688002 3838599 3959626 4062849 4155173 4243069 4331639 4415817 4481270
56099D481270L6239O555j9818m1795n3568n2567m8537n3867p0450r4713j27479
$$ 4481270 4517509 4524064 4504246 4462451 4408883 4356316 4307779 4253912 4183462 4088749 3961270
56088C961270j67789k04710k27177k36098k36907k27909k06944j81436j59751
$$ 3961270 3793481 3588771 3361594 3125496 2888589 2660680 2453736 2272300 2112549
56079B112549j39464j15717r3382p8924o7919n3336l8903l1523k7750k0699j3217
$$ 2112549 1973085 1857368 1763986 1685062 1617143 1563807 1524904 1493381 1465631 1444932 1431715
56068A431715j1091j0382m805J468J622l77K480O675N864M327Q684J4034J2874
$$ 1431715 1420624 1410242 1405437 1406905 1408527 1408150 1410630 1417305 1423169 1427496 1436180 1450214 1463088
56055A463088R938J3280J8555J7516J4189J6804K1495K0247J7234K0726K6470
$$ 1463088 1473026 1486306 1504861 1522377 1536566 1553370 1574865 1595112 1612346 1633072 1659542
56044A659542K5992K3582K7822L4100L3320L0042L3733L9909L8725L4425L6950
$$ 1659542 1685534 1709116 1736938 1771038 1804358 1834400 1868133 1908042 1946767 1981192 2018142
56033B018142M2089L9715L4209L6336M2432M2166L9402M4245N2037N1926M8647
$$ 2018142 2060231 2099946 2134155 2170491 2212923 2255089 2294491 2338736 2390773 2442699 2491346
56022B491346N3716O2661O3670O0972O6335P5305P5884P2796P8390Q7744Q8193
$$ 2491346 2545062 2607723 2671393 2732365 2798700 2874005 2949889 3022685 3101075 3188819 3277012
56011C277012Q5135R1906J02747J03451J00028J08012J21929J25460J23365J32049
$$ 3277012 3362147 3454053 3556800 3660251 3760279 3868291 3990220 4115680 4239045 4371094
56001D371094J46727J50614J48608J58259J74949J80921J81171J94360K15627
$$ 4371094 4517821 4668435 4817043 4975302 5150251 5331172 5512343 5706703 5922330
55992E922330K25726K29511K46629K71784K84694K91729L15283L49566L71283
$$ 5922330 6148056 6377567 6624196 6895980 7180674 7472403 7787686 8137252 8508535
55983H508535L86358M19378M64478M95965N20014N64028O22232O66597P04206
$$ 8508535 8894893 9314271 9778749 10274714 10794728 11358756 11980988 12647585 13351791
55974A3351791P65925Q45859R13789R79840J080850J210487J333767J463020J643111
$$ 13351791 14117716 14963575 15877364 16857204 17938054 19148541 20482308 21945328 23588439
55965B3588439J870012K107619K376880K737138L188064L690420M273229N007712
$$ 23588439 25458451 27566070 29942950 32680088 35868152 39558572 43831801 48839513
55957D8839513N888877O875681Q038223R516924J1355353J3558118J6295777J9828139
$$ 48839513 54728390 61604071 69642294 79159218 90514571 104072689 120368466 140196605
55949A40196605K4259743K9658327L6230759M3534325M9046510M8322128L7938308
$$ 140196605 164456348 194114675 230345434 273879759 322926269 371248397 409186705
55942D09186705J8847982l539777k2907907l5690933m1778323m2823804m0618654
$$ 409186705 428034687 424494910 401587003 365896070 324117747 281293943 240675289
55935B40675289l6605171l1880435k7131987k2682042j8710880j5354871j2618467
$$ 240675289 204070118 172189683 145057696 122375654 103664774 88309903 75691436
55928G5691436j0380201q543170p080932n936715n001732m214388l581574l087060
$$ 75691436 65311235 56768065 49687133 43750418 38748686 34534298 30952724 27865664
55920B7865664k668773k298538j999471j770328j567956j376106j220788j105674
$$ 27865664 25196891 22898353 20898882 19128554 17560598 16184492 14963704 13858030
55912A3858030r97345q85241p95020p31847o67692n94887n38064n02979m64602
$$ 13858030 12860685 11975444 11180424 10448577 9780885 9185998 8647934 8144955 7680353
55903G680353m15723l78811l59879l36764l02843k78493k69457k55614k30632
$$ 7680353 7264630 6885819 6525940 6189176 5886333 5607840 5338383 5082769 4852137
55894D852137k13004k08193j98018j76954j62538j60344j53564j36580j25352
$$ 4852137 4639133 4430940 4232922 4055968 3893430 3733086 3579522 3442942 3317590
55885C317590j25206j20519j05620r5192r4913r1242p9084p1333p2427o9723n9148
$$ 3317590 3192384 3071865 2966245 2871053 2776140 2684898 2605814 2534481 2462054 2392331 2333183
55874B333183n3015n4593n0847l7903k8431k6455j9793m703O618J0451J9175L6688
$$ 2333183 2280168 2225575 2174728 2136825 2108394 2081939 2062146 2057443 2064061 2074512 2093687 2130375
55862B130375M9613N0794M8835M6643L3300N903k1996m2213o1717q3061r5830
$$ 2130375 2179988 2230782 2279617 2326260 2359560 2365463 2343467 2301254 2239537 2156476 2060646
55851B060646r6046r4330r6355r4025q3872p5334p2678o7210n5461m7034m6253
$$ 2060646 1964600 1870270 1773915 1679890 1596018 1520684 1448006 1380796 1325335 1278301 1232048
55840A232048m3769l4628k7406k6999k5246j7202j0463r749p915p82M243K639
$$ 1232048 1188279 1153651 1126245 1099246 1074000 1056798 1046335 1036586 1028671 1027889 1032132 1034771
55828A034771J214M150N001L77k697p95j304p803j2055q581l747k398J403J1946
$$ 1034771 1035985 1040135 1045136 1045513 1042816 1042021 1040717 1032914 1020859 1012278 1008531 1006133 1007536 1019482
55814A019482K2414K5563K2423J3883l744k7691m5721n1617n2377n3765n1206
$$ 1019482 1041896 1067459 1089882 1103765 1100021 1072330 1026609 974992 922615 868850 817644
55803H17644m1837l2669k8725k4821j6926j0260q552o576j125J759j697n131l538
$$ 817644 775807 743138 714413 689592 672666 662406 653854 647278 646153 647912 646215 641084 637546
55790F37546k065n471r157q689q307j1895j4980j3538j1739j3316j4188j0889
$$ 637546 635481 630010 620853 612164 603857 591962 576982 563444 551705 538389 524201 513312
55778E13312p514p251n870m67M252N041O157R623R087R73p668j0175j0283j3248
$$ 513312 505798 498547 492677 492210 496462 501503 507660 517283 526370 527343 519675 509500 499217 485969
55764D85969j5859j3693j0156r696r289m823O86K703K414J657k328j0235j5963
$$ 485969 470110 456417 446261 436565 427276 422453 423139 425842 428256 429913 427585 417350 401387
55751D01387j5482j3399j4241j4658j1128p654q259r106n814j824j803l288k340
$$ 401387 385905 372506 358265 343607 332479 324825 316566 307460 301646 299822 298019 294731 292391
55738B92391j254l159n044l560j701k674l170M0L027J576r21P7J779l17l850m475
$$ 292391 291137 287978 282934 279374 277673 274999 271829 271869 274896 276472 275551 275628 277407 277090 273240 268765
55722B68765m069o348r096q351n885n372n363l088q49j701l050j305J312J219
$$ 268765 264696 258348 249252 240901 235016 229644 224281 221193 220344 218643 215593 214288 215600 216819
55708B16819M31K397N141N169M216N540P339O291L888L171K983J298J79J525K140
$$ 216819 217250 219647 224788 229957 234173 239713 247052 253343 257231 260402 263385 264683 264862 266387 268527
55693B68527q93m252l819j692j542j524J567N310N781M762O099Q345P834N702
$$ 268527 267634 263382 259563 257871 256329 254805 256372 261682 267463 272225 278324 286669 294503 300205
55679C00205N267N539L640O63r39k705o873j1065j2081j1723j2975j3948j1711
$$ 300205 305472 311011 314651 315314 314375 311670 304797 293732 281651 269928 256953 243005 231294
55666B31294q578q210q863o966m204m432o425o275m338l533l288j376P70O55J07
$$ 231294 222716 214506 205643 198677 194473 190041 183616 177341 173003 169470 166182 164806 165576 166231 166338
55651A66338K037M478L830J411P94J226k06k434k608j929l198m938m088k147k448
$$ 166338 168375 172853 176683 178094 178888 180114 179908 177474 174866 172937 169739 164801 160713 158566 156118
55636A56118l671k342L85Q01m81l1J835K227J645K657M143K982J31q78j86o73
$$ 156118 152447 150105 150490 151291 150810 150779 152614 154841 156486 159143 163286 166268 166399 165521 165335 164662
55620A64662k205k409j752k356l205j982p5l02j422m26J524J202m14O6J992K009
$$ 164662 162457 160048 158296 155940 152735 150753 150678 150376 148954 148528 150052 151254 150840 150906 152898 154907
55604A54907L99J51R09n5j955j597M81P56j045k125k210l368m994m484k401j665
$$ 154907 155306 155457 156366 156311 154356 152759 153240 153996 152951 150826 148616 145248 140254 135770 133369 131704
55588A31704k278j969j122j815k975j971j0m29k522k626o35L52J27J330L752M479
$$ 131704 129426 127457 126335 124520 121545 119574 119564 119135 116613 113987 113352 113704 113831 115161 118913 123392
55572A23392L549L930N903O836O516P438R882J1724J3036J5733J8881J9464J7633
$$ 123392 126941 130871 136774 143610 150126 157564 167446 179170 192206 207939 226820 246284 263917
55559B63917J6076J4503J0007K769l794q523j3059j7086j8305j7216j6766j7125
$$ 263917 279993 294496 304503 307272 303478 294955 281896 264810 246505 229289 212523 195398
55547A95398j5854j3178j1885j1926j0444p343n632n900n639m397m355n413m919
$$ 195398 179544 166366 154481 142555 132111 124768 119136 113236 107597 103200 98845 93432 88513
55534H8513k841k108l147l208j730j311k539k905j710j230k007j822k95K09p60
$$ 88513 85672 83564 80417 77209 75479 74168 71629 68724 67014 65784 63777 61955 61660 61869 61109
55519F1109p74Q20J857J839K785M677M734K374L87K2n26j734j439P46K124J427
$$ 61109 60335 61155 63012 64851 67636 72313 77047 79421 79808 79830 79304 77570 76131 76877 79001 80428
55503H0428N12L11p34k847l781k904k444l389l985l502l507m207l446p40J546
$$ 80428 80940 81251 80517 77670 73889 70985 68541 65152 61167 57665 54158 49951 46505 45765 47311
55488D7311K231K808L792L497J698O22R75P29r25k080j855j852k703k798j698
$$ 47311 49542 52350 56142 59639 61337 61959 62934 63663 62738 60658 58803 56951 54248 51450 49752
55473D9752j205j812j690l52K57m94p45J47L71o85j205m84j89r05r99j5M18j9
$$ 49752 48547 46735 45045 44693 44950 44456 43711 43858 44229 43544 42339 41855 41666 40761 39762 39747 40165 40146
55455D0146K96J258O80j351j900k24P96l01j268n46J51m48p83J39O69l7j7J861
$$ 40146 40442 41700 42380 41029 39129 38905 39701 39400 38132 37586 37737 37289 36506 36645 37314 37277 37260 39121
55437C9121L558L251K068J493R98O8k95K18L08k89n0J145J258k04j006p9P95N42
$$ 39121 42679 45930 47998 49491 50489 50557 50262 50480 50788 50499 50449 51594 52852 52648 51642 51563 52358 52900
55419E2900O07J585J571l00j947j829j242j378j241j91M91K61N35J700K077J384
$$ 52900 53507 55092 56663 56363 54416 52587 51345 49967 48726 48535 49026 49287 49822 51522 53599 54983
55403E4983J812M001N411M534L379L713M199L395K385K221J749K06r34q24j092
$$ 54983 56795 60796 66207 70741 74120 77833 82032 85427 87812 90033 91782 91988 91054 90230 89138
55388H9138k744m111l913l542m197m572l525k352k257k184j185l81o64r39m63
$$ 89138 86394 82283 78370 74828 70631 66059 62534 60182 57925 55741 54556 54175 53511 52572 52109
55373E2109l15r06p88M46R24j52r15l31j27j375k367j901j531k379k833j712o03
$$ 52109 51794 50888 50100 50546 51470 51318 50403 50072 49945 48570 46203 44302 42771 40392 37559 35847 35244
55356C5244p93r12L4L93q84j769n96R12P03l21o37r49k003k323q86N32L79M4R31
$$ 35244 34451 33539 33573 33966 33082 31313 30717 31629 32332 32011 31374 30425 28422 26099 25213 25745 26124 26168 27099
55337B7099J548M25p60r4J037M84q46r11k19m09r85n00N94J070J352K217K719
$$ 27099 28647 29072 28312 28218 29255 29739 28893 27982 27763 27354 26369 25869 26463 27533 28885 31102 33821
55320C3821J862P11M66K93o72j182j12J116Q07k50o19p69j397j392MJ125N51l02
$$ 33821 35683 36394 36860 37153 36481 35299 35187 36303 37110 36860 36241 35472 34075 32683 32687 33812 34363 34061
55302C4061K16R94M94k02L75J031J97p56J58J754J583R1m15K83O03K95K47K06
$$ 34061 34277 35271 35765 35563 35938 36969 37166 36410 36568 38322 39905 39996 39581 39864 40467 40762 41009 41215
55284D1215n24j056k55R16Q55P9Q5O84Q15P67J236J469O63j15K94Q53K29o14k03
$$ 41215 40691 39635 39380 40296 41151 41230 41315 41999 42814 43581 44817 46286 46949 46834 47128 47981 48210 47596 47393
55265D7393N87J08j025j085j88M34P52J168Q14q40k128j464j36k56j372j722j375
$$ 47393 47980 48088 47063 45978 45790 46224 46976 48144 48958 48118 45990 44526 44390 44134 42762 41040 39665
55248C9665j439j491o07K83j72j138j043m29p48j523j424r15j172j545p33N81
$$ 39665 38226 36735 36128 36411 36239 35101 34058 33629 32881 31358 29934 29019 27847 26302 25569 26150
55232B6150R29O49P64O81l78j069Q2J731J742P69P85J332N23j209j762r90n36
$$ 26150 27079 27728 28492 29173 28795 27726 27808 29539 31281 32050 32835 34167 34690 33481 31719 30729 30193
55215C0193o21r1Q14P51n4j57M76P02N30Q23J236Q73K43L00M14m06j294j001l30
$$ 30193 29572 29481 30295 31046 30992 30835 31311 32013 32543 33366 34602 35475 35718 36018 36432 36026 34732 33731 33401
55196C3401o39j147n00L65j63j187q38K62K56l72R4R97L65j201j295J09P65L3
$$ 33401 32762 31615 31115 31480 31317 30130 29292 29554 29810 29438 29532 30529 30894 29693 28398 28507 29272 29305
55178B9305p03j136k188l297k853j258l95k91N83J994K191J242R41J535J655J340
$$ 29305 28602 27466 25278 21981 19128 17870 17475 17184 17767 19761 21952 23194 24135 25670 27325 28665
55162B8665J834K560J722j12m55R15J583O69n2L67O60J69l3M81P36N94J086K072
$$ 28665 30499 33059 34781 34669 34214 35129 36712 37381 37329 37696 38356 38525 38492 38973 39709 40303 41389 43461
55144D3461K116J153O04O65J11r41r15K35P12om61m1J80j53j44J16n39j778j867
$$ 43461 45577 46730 47334 47999 48110 47169 46254 46489 47201 47195 46734 46693 46873 46720 46576 46692 46153 44375 42508
55125D2508p35k18p97r11l6M09p9j26Q39J560J418J402J916K071J793K130K842
$$ 42508 41773 41555 40758 39847 39811 40220 40141 40015 40854 42414 43832 45234 47150 49221 51014 53144 55986
55108E5986K253K20j280j241q22q61p28l35o25j365j040K26L34j250k327j430
$$ 55986 58239 58459 57179 55938 55116 54255 53527 53192 52567 51202 50162 50388 50722 49472 47145 45715
55092D5715P9N59K77j18r97k275k643j602m53j86k10N8K14K64R51J957J882P16
$$ 45715 45794 46353 46630 46512 45515 43240 40597 38995 38542 38356 38146 38204 38418 38682 39633 41590 43472 44188
55074D4188J29O28O60n94j770j696r72k99N74J329P51r41j697o64M86L89nM96
$$ 44188 44317 44945 45605 45011 43241 41545 40573 40274 40848 42177 42928 41987 40290 39626 40112 40501 40496 40992
55056D0992J310J473J278J263J172J022J467K271K158J052N37J201J581P23k85
$$ 40992 42302 43775 45053 46316 47488 48510 49977 52248 54406 55458 55995 57196 58777 59500 59215
55041E9215m34l67o35m63M62R33L13j73L65Q54K72m58j64N39N16M7K3L18M10N09
$$ 59215 58781 58414 57779 57316 57778 58711 59024 58851 59216 60070 60342 59884 59720 60259 60775 60822 60845 61163 61573 62082
55021F2082R15J210J130J196J631J745J194P25R33J399J710K092K535K527K176
$$ 62082 62997 64207 65337 66533 68164 69909 71103 71828 72761 74160 75870 77962 80497 83024 85200
55006H5200K214K498K044Q51J09J20k24j346k168k013j583j466j411j584k655
$$ 85200 87414 89912 91956 92807 92916 93036 92812 91466 89298 87285 85702 84236 82825 81241 78586
54991G8586m091m329l274k582k846k700j556q06j270j646q84M3M3k42J13O62P58
$$ 78586 74495 70166 66892 64310 61464 58764 57208 56402 55132 53486 52602 52645 52688 52446 52559 53221 53979
54974E3979P75J072J155R14J068J577J355M11K57J277J795R27K09R21J918J778
$$ 53979 54754 55826 56981 57895 58963 60540 61895 62306 62563 63840 65635 66562 66771 67692 69610 71388
54958G1388J248J773L097M003M141L745K790J596J117J515J845J952K964N019
$$ 71388 72636 74409 77506 81509 85650 89395 92185 93781 94898 96413 98258 100210 103174 108193
54944A08193O414O152N486N745O485P129Q410J0715J2750J3441J3497J3645J3030
$$ 108193 114607 120759 126245 131990 138475 145604 154014 164729 177479 190920 204417 218062 231092
54931B31092J0808P675M353L08m576q796j1255j2793j4214j4656j3562j2331j2100
$$ 231092 241900 249575 253928 254236 249660 240864 229609 216816 202602 187946 174384 162053 149953
54918A49953j1710r848p564o455n945m640l018k457k652k259j290p73p69n79k02
$$ 149953 138243 128395 120831 114376 108431 103791 100773 98316 95664 93405 92115 91342 90573 89994 89792
54903H9792M9O62K042L347L715L868M942O632P976R099J0632J2244J3199J3581
$$ 89792 89841 90503 92545 95892 99607 103475 108417 115049 123025 132124 142756 155000 168199 181780
54889A81780J3586J2457R539N519J436k662o815j0032j1493j1905j2291j2414
$$ 181780 195366 207823 217362 222881 224317 221655 214840 204808 193315 181410 169119 156705
54877A56705j1605j0206q917p705o480n772n540m598k456m47K10J32K70K15n01
$$ 156705 145100 134894 125977 118272 111792 106020 100480 95882 93426 92979 93189 93321 93591 93806 93305
54862I3305r19k24M89j68j623k376k265k068j875j485j433k033k394j724o55L2
$$ 93305 92386 92162 92651 92483 90860 88484 86219 84151 82276 80791 79358 77325 74931 73207 72552 72584
54846G2584O98J564J552N5j584j930j561j625j773j326j014j622k253j916j517
$$ 72584 73282 74846 76398 76453 74869 72939 71378 69753 67980 66654 65640 64018 61765 59849 58332
54831E8332k215l054k490j065l61k75K87R96P27j04j68M02M64J65O04J597J887
$$ 58332 56117 53063 50573 49508 49147 48872 49159 50155 50882 50778 50610 51012 51476 51641 52245 53842 55729
54814E5729J258O02J75m17q56m63M34J004J327J834K064J497R09J274K053K204
$$ 55729 56987 57589 57764 57347 56491 56028 56462 57466 58793 60627 62691 64188 65097 66371 68424 70628
54798G0628K038K393K850K606K285K973M246M967N323O146P112P511Q019R586
$$ 70628 72666 75059 77909 80515 82800 85773 90019 94986 100309 106455 113567 121078 129097 138683
54784A38683J1337J1798J1610J2724J5255J7250J7339J5685J2685Q711M790J719
$$ 138683 150020 161818 173428 186152 201407 218657 235996 251681 264366 273077 277867 279586
54772B79586j249n042q599r982r237q185p694p063n841m403k822r33P27J633K507
$$ 279586 278337 273295 264696 254714 245477 237292 229598 222535 216694 212291 209469 208536 209263 210896 213403
54757B13403M269O159O634N644M363L135J428n65k002k750l207l249k708k157
$$ 213403 217672 223831 230465 236109 240472 243607 245035 244470 242468 239718 236511 233262 230554 228397
54743B28397j856q79J299L528M935O659R671J2422J2990J2125J1446J0082O168
$$ 228397 226541 225662 226961 230489 235424 242083 251754 264176 277166 289291 300737 310819 316987
54730C16987O40l774o674r751j2922j4197j3358j2445j2189j1168q954p175o726
$$ 316987 317627 313853 307179 297428 284506 270309 256951 244506 232317 221149 212195 205020 198294
54717A98294o638o277o253o551o179n233m959n363n064l917l319l509l055j691
$$ 198294 191656 185379 179126 172575 166396 161163 156204 150841 145777 141860 138541 135032 131977 130286
54703A30286j067j971l069l224k903k585j885j050j138j991k055r08M6O7J14P25
$$ 130286 129219 127248 124179 120955 118052 115467 113582 112532 111394 109403 107348 106440 106486 106553 106667 107392
54687A07392R70M47J89O94R62M29k2J48J71k56p8J218K449K531J968J662J629
$$ 107392 108362 108809 108998 109692 110654 111083 111061 111209 111380 111124 111046 112264 114713 117244 119212 120874 122503
54670A22503J634J797J936J574J052J251J963K150J966K691M280N074M477L891
$$ 122503 124137 125934 127870 129444 130496 131747 133710 135860 137826 140517 144797 149871 154348 158239
54656A58239M323N034N452O406Q431J0585J1999J3145J4607J5988J6909J7614
$$ 158239 162562 167596 173048 179454 187885 198470 210469 223614 238221 254209 271118 288732
54644B88732J7819J6382J2916Q386L572j589o635j0233j1982j2976j3825j3745
$$ 288732 306551 322933 335849 344235 347807 346218 339583 329350 317368 304392 290567 276822
54632B76822j2313j0518r279q328p362o761o431n465l739k422k120k018j516j244
$$ 276822 264509 253991 244712 236384 229022 222261 215830 210365 206626 204204 202084 200066 198550 197306
54618A97306j618j907j548j069r76j013j126j696k348j994o59K78J49k74o34j681
$$ 197306 195688 193781 192233 191164 190188 189175 188049 186353 184005 182011 181352 181630 181779 181505 180871 179190
54602A79190l452m594m378l728l424l032k438k601l692m266l450k407k448l151
$$ 179190 175738 171144 166766 163038 159614 156582 154144 151543 147851 143585 140135 137728 135280 132129
54588A32129l474l322l003k367j543j251j491j228j78N25K13k33m3K15j0j98M1
$$ 132129 128655 125333 122330 119963 118420 117169 115678 114450 114272 114797 115010 114777 114734 114949 114939 114741 114782
54571A14782J35j56j45K79P7j032j712j092j58l8l44k39K98J153K531L832L780
$$ 114782 114917 114761 114616 114895 114972 113940 112228 111136 110978 110940 110596 110357 110655 111808 114339 118171 121951
54554A21951K518J932K864L859L702L186L166K865J743J168K395M441N668O086
$$ 121951 124469 126401 129265 133124 136826 140012 143178 146043 147786 148954 151349 155790 161458 167544
54540A67544O526O915O998P406Q384Q734P624O139N484N031L703J923M14j504
$$ 167544 174070 180985 187983 195389 203773 212507 220131 226270 231754 236785 240488 242411 242825 241321
54526B41321m477p215q065p530p284p492p036n729m404l387k487k045k353k584
$$ 241321 236844 229629 221564 214034 206750 199258 192222 186493 182089 178702 176215 174170 171817 169233
54512A69233j753l20N45P14Q79J194J387J573J762J241l16j832k117j475r14n94
$$ 169233 167480 167160 167705 168419 169298 170492 171879 173452 175214 176455 176139 174307 172190 170715 169801 169207
54496A69207k16l7k44j42O62J195N37n40p84m36m83p37l09N61P87K29k45j90O9
$$ 169207 168991 168954 168710 168568 169230 170425 170962 170422 169638 169202 168719 167982 167673 168234 169021 169250 169005 168815 168884
54477A68884K83M72N81P31J308K148K369J704J058R99Q10J2m97J0O27K56n93q79
$$ 168884 169167 169639 170220 170951 172259 174407 176776 178480 179538 180537 181347 181359 180862 180872 181499 181755 181162 180283
54459A80283q49j245j696j414p38n15o68o91p51r85o60M94J177K70j270j862j697
$$ 180283 179434 178189 176493 175079 174341 173826 173158 172467 171716 170731 170071 170565 171742 172012 170742 168880 167183
54442A67183j930k397k107j332j176j576j482q23n15p64r39r34j194j566j504
$$ 167183 165253 162856 160749 159417 158241 156665 155183 154360 153845 153081 152142 151208 150014 148448 146944
54427A46944j163j056j012n97j21l8M2N37Q25L40j51K11O56O6q71o02P94J962
$$ 146944 145781 144725 143713 143116 142995 142957 142999 143536 144361 144701 144550 144761 145417 145483 144612 144010 144804 146766
54409A46766K561L289L965L738L030L184M122M282L162K032J761J657J021L56
$$ 146766 149327 152616 156581 160319 163349 166533 170655 174937 178099 180131 181892 183549 184570 184926
54395A84926L26O57P40M97K25J90N44J070J059J14j131j722j617j462j547j707
$$ 184926 185252 185909 186649 187146 187371 187561 188105 189175 190234 190348 189217 187495 185878 184416 182869 181162
54379A81162j926k239k413k376k454k617k183j047k67n91j285j380j121j095j002
$$ 181162 179236 176997 174584 172208 169754 167137 164954 163907 163640 163049 161764 160384 159263 158168 157166
54364A57166n18l04q34j204o51j22p27j687j584p74n27o59q9Q35Q04l8k96K20
$$ 157166 156648 156344 155510 154306 153655 153533 152806 151119 149535 148761 148234 147575 147486 148321 149125 149087 148791 149011
54346A49011L31k84o94o05q03j544k169k454k832l201k984k377k106k024j438
$$ 149011 149342 149058 148364 147759 146956 145412 143243 140789 137957 134756 131772 129395 127289 125265 123827
54331A23827o41n97j224j555j448j617k045k007j594j635k078k057j559j480j985
$$ 123827 123186 122589 121365 119810 118362 116745 114700 112693 111099 109464 107386 105329 103770 102290 100305
54316A00305k273k027j662j208m18J38l82j538k068j869j925k398k410j738j084
$$ 100305 98032 96005 94343 93135 92717 92855 92473 90935 88867 86998 85073 82675 80265 78527 77443
54301G7443o44P0Q83R79L14l78r08j539j810j056K6P6q29j409j361j502j868j670
$$ 77443 76799 76869 77752 78731 79045 78667 77759 76220 74410 73354 73380 73456 72627 71218 69857 68355 66487 64817
54283F4817j117j244j831j516k71L30k50o58oP86P38K43l0j82l57l03j78n26j109
$$ 64817 63700 62456 60625 59109 58838 59168 58918 58260 58254 59040 59778 60021 59991 59809 59452 59149 58971 58445 57336
54264E7336j038k91K08J70J46J46l72j015o62N53J231R23O26Q30Q73N87P32J351
$$ 57336 56298 56007 56215 56385 56531 56677 56305 55290 54628 55181 56412 57335 57961 58791 59664 60251 60983 62334
54246F2334J436P66L05L36l6j004j513j063m02J83J290K606K653J134l30o38n92
$$ 62334 63770 64536 64841 65177 65141 64137 62624 61561 61159 61342 62632 65238 67891 69025 68695 68057 67465
54229F7465j028j382j072o28m87k64m6p24k115k599j539m37n25r95p43k28k32
$$ 67465 66437 65055 63983 63355 62868 62604 62558 61834 59719 57120 55581 55144 54619 53624 52881 52653 52421
54212E2421l47k9K09j11l91k31l65j238j908j596j010r60r08k26M22K16l44m36
$$ 52421 52074 52045 52254 52143 51752 51521 51156 49918 48010 46414 45404 44444 43536 43310 43732 43948 43604 43168
54194D3168l19n86r56r72r26j029o92L20J060P39o1n06o89q07l87N61Q95J0j022
$$ 43168 42849 42263 41307 40335 39409 38380 37688 38008 39068 39807 39746 39240 38551 37744 37357 37918 38813 38823 37801
54175C7801j149q94j020r19J39J302J281L20m26p01r18r13l56K64M09N37J138
$$ 37801 36652 35758 34738 33819 33958 35260 36541 36861 36435 35734 34816 33903 33547 33811 34220 34757 35895
54158C5895J487P19n65j102q08m98l59l5L06K77K01N29Q56O82N61J194J862J246
$$ 35895 37382 38101 37536 36434 35626 35128 34769 34734 35040 35317 35518 36047 36903 37585 38146 39340 41202 42448
54140D2448m43j535j069K40J230J441R97K72k37k59q1j38m68q58j067o90N86K186
$$ 42448 42005 40470 39401 39641 40871 42312 43309 43581 43344 43085 43004 42866 42398 41540 40473 39783 40369 42555
54122D2555K838K095R62M69M50L07J15K00M00M75N31M68j85j231j582q29o6k48
$$ 42555 45393 47488 48450 48919 49369 49676 49791 49991 50391 50866 51397 51865 51680 50449 48867 48038 47972 47724
54104D7724p68o12R0O94J250J961K218J453L00k30k00k71m44k90J05M22P81J193
$$ 47724 46956 46344 46434 47128 48378 50339 52557 54010 54310 54080 53880 53609 53165 52875 52980 53402 54183 55376
54086E5376J054J24p12o13n0J69K26O15Q85L97l52m49j34l16r87j341j095o20
$$ 55376 56430 56554 55842 55229 55179 55348 55574 56189 57074 57471 57119 56670 56536 56220 55233 53892 52797 52177
54068E2177r4M20N30J51P7Q88J857K033J710J625J414L48q84q89J73O65j34j123
$$ 52177 52083 52503 53033 53184 53261 54149 56006 58039 59749 61374 62788 63136 62252 61363 61536 62201 62067 60944
54050F0944j151m42J26K30J68L66R79J640J689J069N69P84J260J322J069Q66N62
$$ 60944 59793 59351 59477 59707 59875 60241 61220 62860 64549 65618 66187 66971 68231 69553 70622 71488 72050
54033G2050J20L01J600L099L542L093K849L046L071K912L227M006M391M007L416
$$ 72050 72170 72471 74071 77170 80712 83805 86654 89700 92771 95683 98910 102916 107307 111314 114730
54018A14730L119K996K890K946L245L614L771L386K270R31L49P05J006O31L48
$$ 114730 117849 120845 123735 126681 129926 133540 137311 140697 142967 143898 144247 144952 145958 146589 146937
54003A46937R26J574J083k03r10p06m70o91j090j618k503l336l366k782k502k679
$$ 146937 147863 149437 150520 150317 149407 148701 148231 147540 146450 144832 142329 138993 135627 132845 130343 127664
53987A27664k563j923j441j460j452j055p72j152j939k395k055j097l20o09j965
$$ 127664 125101 123178 121737 120277 118825 117770 116998 115846 113907 111512 109457 108360 108040 107431 105466
53972A05466l207l187k058q96l92m67q17j111j000n02j29n1K99J225J996J913
$$ 105466 102259 99072 97014 96118 95726 95259 94442 93331 92331 91829 91700 91649 91948 93173 95169 97082
53956I7082J502J658K146K056J372Q90R21J089J269J602J780J359O52L87O07Q26
$$ 97082 98584 100242 102388 104444 105816 106706 107627 108716 109985 111587 113367 114726 115378 115765 116372 117198
53940A17198J143K115L584M590M638M275M361N199O380P089O851O281O551P641
$$ 117198 118341 120456 124040 128630 133268 137543 141904 147103 153483 160572 167423 173704 180255 187896
53926A87896Q043O812M961L794K879J067j327k956l551l931m302m158l643l418
$$ 187896 195939 202751 207712 211506 214385 215452 214125 211169 207618 203687 199385 195227 191584 188166
53912A88166l177j952oJ197J180J145K062L400M250M517M480M171L818L992M805
$$ 188166 184989 183037 183031 184228 185408 186553 188615 192015 196265 200782 205262 209433 213251 217243 222048
53897B22048N560N569M823L682K519J714J384J023Q5j125j789j714j430j209q78
$$ 222048 227608 233177 238000 241682 244201 245915 247299 248322 248407 247282 245493 243779 242349 241140 240262
53882B40262n43o87j431k404l361m287m935m965m522m078l841l792m080m690n015
$$ 240262 239719 239032 237601 235197 231836 227549 222614 217649 213127 209049 205208 201416 197336 192646 187631
53867A87631m531l566k792k352k191k617l611m120l251j768j259k058l127l682
$$ 187631 183100 179534 176742 174390 172199 169582 165971 161851 158600 156832 155573 153515 150388 146706
53853A46706l747l393k672k146k363k850k690j928j358j168r40p10p93q34k70
$$ 146706 142959 139566 136894 134748 132385 129535 126845 124917 123559 122391 121451 120741 119948 119114 118844
53838A18844M14J97q76j793k095k009j450k82O51L23p05q86rO02K18n34j125j719
$$ 118844 119258 119455 118579 116786 114691 112682 111232 110950 111601 111924 111219 110333 110324 110926 111144 110610 109485 107766
53820A07766k143j820j037p78j036q22m7K38j94k98K69M42k94q83m92J72K16j1
$$ 107766 105623 103803 102766 101988 100952 100130 100083 100321 100127 99829 100098 100540 100246 99363 98871 99043 99259 99248
53802I9248K40R56J800K699L346L189K528K507L370L889L210K107J679J941K470
$$ 99248 99488 100444 102244 104943 108289 111478 114006 116513 119883 123772 126982 129089 130768 132709 135179
53787A35179L259M086M124L167K323K482K927K451J163K10K23Q86J598J819J229
$$ 135179 138438 142524 146648 149815 152138 154620 157547 159998 161161 161371 161594 162480 164078 165897 167126
53772A67126J73m26j66K73N3p51j464j664j362q44o29j129k031k518k234j629
$$ 167126 167299 166873 166707 166980 167033 166282 164818 163154 161792 160948 160319 159190 157159 154641 152407 150778
53756A50778j211j062j078j112q98m65m50j239k029j793r01o00j049j223q06o53
$$ 150778 149567 148505 147427 146315 145417 144952 144502 143263 141234 139441 138540 137940 136891 135668 134862 134209
53740A34209j163j618j590j619k037k374k380k429k476j937j025q46j634k226
$$ 134209 133046 131428 129838 128219 126182 123808 121428 118999 116523 114586 113561 112715 111081 108855
53726A08855j905j323j030m76O24J328R21J70J45P28J118R75K89r23k068k184
$$ 108855 106950 105627 104597 104121 104745 106073 106994 107164 107309 108037 109155 110130 110419 109496 107428 105244
53710A05244j324p18r83j228o82P1K86K42M16N89O32R81J541J394M75J73J234
$$ 105244 103920 103202 102219 100991 100309 100380 100666 100908 101324 101913 102545 103526 105067 106461 106936 107109 108343
53693A08343K446K555K081J900J550N50mR64K325K208Q69J15M17O12J99J5M96
$$ 108343 110789 113344 115425 117325 118875 119425 119421 120385 122710 124918 125787 125902 126319 126931 127130 127145 127641
53676A27641J022J223J531K141K614K724K673K387J588O24K39M22M29N8J3P89
$$ 127641 128663 129886 131417 133558 136172 138896 141569 143956 145544 146168 146407 146829 147258 147316 147329 148118
53660A48118J893K432J967P25n46j080q12m72n75p19l81J20J56j31j38J84L99
$$ 148118 150011 152443 154410 155135 154589 153509 152697 152225 151650 150931 150550 150670 150826 150695 150557 150741 151140
53643A51140M73P36J082R84K75p11j618k196k141j443o32j28L74J259K038J850
$$ 151140 151613 152349 153431 154415 154690 153979 152361 150165 148024 146581 145949 145821 146195 147454 149492 151342
53627A51342P20l95q53q45p38n27q3M60Q20Q15N37L48N56J009J225J057Q62R20
$$ 151342 152062 151667 150814 149969 149231 148704 148621 149081 149901 150716 151253 151601 152157 153166 154391 155448 156310 157230
53609A57230J100J245J422J572J513J502K169L536M674M784M122L502L336L505
$$ 157230 158330 159575 160997 162569 164082 165584 167753 171289 175963 180747 184869 188371 191707 195212
53595A95212L652L292K172Q11J71N79J523K515L420L821L148J781R47J062J197
$$ 195212 198864 202156 204328 205139 205310 205889 207412 209927 213347 217168 220316 222097 223044 224106 225303
53580B25303P03L03Q07J843K596K950K994K357R76k37m52o6J9l58q15j183j281
$$ 225303 226006 226309 227116 228959 231555 234505 237499 239856 240832 240595 240143 240077 240096 239738 238923 237740 236459
53563B36459p24K66O21j33j013r64l53p9q5J93O09O65N21N12L13l70q29k05J072
$$ 236459 235735 236001 236622 236489 235476 234512 234159 234080 233995 234188 234797 235462 235983 236495 236808 236438 235609 235404 236476
53544B36476J836J751J373J098J054J516K410K840K184J237J184J883K284K175
$$ 236476 238312 240063 241436 242534 243588 245104 247514 250354 252538 253775 254959 256842 259126 261301
53530B61301K216K549K669K603L038M108N078N423N473N876O914Q401R774J0393
$$ 261301 263517 266066 268735 271338 274376 278484 283562 288985 294458 300334 307248 315649 325423 335816
53516C35816J0169R701R541R814J0674J2343J4291J5305J5026J4549J4789J5301
$$ 335816 345985 355686 365227 375041 385715 398058 412349 427654 442680 457229 472018 487319
53504D87319J5559J6199J7874J9859K1114K1965K3338K5107K6574K7870K9384
$$ 487319 502878 519077 536951 556810 577924 599889 623227 648334 674908 702778 732162
53493G32162L0417L0044K8814K8020K7690K6903K5800K5534K6332K7285K8102
$$ 732162 762579 792623 821437 849457 877147 904050 929850 955384 981716 1009001 1037103
53482A037103K9424L1255L2663L3353L4150L5515L6772L7237L6932L5912L3858
$$ 1037103 1066527 1097782 1130445 1163798 1197948 1233463 1270235 1307472 1344404 1380316 1414174
53471A414174L0841K7563K4547K1789J9348J7497J6127J4765J3292J2042J1219
$$ 1414174 1445015 1472578 1497125 1518914 1538262 1555759 1571886 1586651 1599943 1611985 1623204
53460A623204J0846J1070J1796J2228J1653J0394R104P420M480N68k977n620q201
$$ 1623204 1634050 1645120 1656916 1669144 1680797 1691191 1700295 1707715 1712195 1712763 1709786 1704166 1695965
53447A695965j1465j4968j7784j9618k0932k2438k4530k6803k8331k8818k9065
$$ 1695965 1684500 1669532 1651748 1632130 1611198 1588760 1564230 1537427 1509096 1480278 1451213
53436A451213k9825l0828l1566l2265l3105l3289l2103l0274k9012k8223k7108
$$ 1451213 1421388 1390560 1358994 1326729 1293624 1260335 1228232 1197958 1168946 1140723 1113615
53425A113615k5967k5839k6500k6438k4772k1981j8819j5770j3406j1871j0127
$$ 1113615 1087648 1061809 1035309 1008871 984099 962118 943299 927529 914123 902252 892125
53414H92125p075l218J31L007O494J0504J3718J5869J8212K1353K4304K6265K7793
$$ 892125 885050 881832 881963 884970 891464 901968 915686 931555 949767 971120 995424 1021689 1049482
53401A049482K9529L1215L2613L4109L5770L7001L7749L8907M0885M2936M4547
$$ 1049482 1079011 1110226 1142839 1176948 1212718 1249719 1287468 1326375 1367260 1410196 1454743
53390A454743M6366M9046N2140N4937N7521O0322O3259O5974O8358P0394P1898
$$ 1454743 1501109 1550155 1602295 1657232 1714753 1775075 1838334 1904308 1972666 2043060 2114958
53379B114958P2759P3064P2919P2637P2981P4398P6112P6763P5877P3886P0999
$$ 2114958 2187717 2260781 2333700 2406337 2479318 2553716 2629828 2706591 2782468 2856354 2927353
53368B927353O7161O2886N8912N5006N0313M4933L9915L5717L1915K8510K6105
$$ 2927353 2994514 3057400 3116312 3171318 3221631 3266564 3306479 3342196 3374111 3402621 3428726
53357C428726K4579K2893K0496J7674J4364R999M752n40o104j3561k3993l6763
$$ 3428726 3453305 3476198 3496694 3514368 3528732 3538731 3543483 3542943 3536839 3523278 3499285 3462522
53345C462522n0397o3427p4277q1876q6828r0602r3373r4084r2855r1418r0700
$$ 3462522 3412125 3348698 3274421 3192545 3105717 3015115 2921742 2827658 2734803 2643385 2552685
53334B552685q9754q7849q5763q4167q2517q0545p9206p8911p8452p6896p5016
$$ 2552685 2462931 2375082 2289319 2205152 2122635 2042090 1962884 1883973 1805521 1728625 1653609
53323A653609p3492p1253o7283o2689n9197n6525n3169m8947m4929m1179l6565
$$ 1653609 1580117 1508864 1441581 1378892 1319695 1263170 1210001 1161054 1116125 1074946 1038381
53312A038381l0755k4927k0244j6659j3500j0343p208m370k062o2K094M309N888
$$ 1038381 1007626 982699 962455 945796 932296 921953 914745 910375 908313 908251 910345 914654 920542
53299I20542O661P386Q571R666J0072J0220J0858J1961J3107J4321J5827J7470
$$ 920542 927203 934589 943160 952826 962898 973118 983976 995937 1009044 1023365 1039192 1056662
53287A056662J9209K1517K4549K7440K9314L0530L2073L4010L5450L5881L5762
$$ 1056662 1075871 1097388 1121937 1149377 1178691 1209221 1241294 1275304 1310754 1346635 1382397
53276A382397L5809L6165L6294L5501L3761L1989L1095L0786K9871K7814K5201
$$ 1382397 1418206 1454371 1490665 1526166 1559927 1591916 1623011 1653797 1683668 1711482 1736683
53265A736683K2697K0531J9076J8830J9295J9108J7749J6118J4824J3031R770
$$ 1736683 1759380 1779911 1798987 1817817 1837112 1856220 1873969 1890087 1904911 1917942 1927712
53254A927712N404R17l311p234j0644j3886j8200k4271l1080l7051m1756m5659
$$ 1927712 1933116 1934033 1930722 1923488 1912844 1898958 1880758 1856487 1825407 1788356 1746600 1700941
53242A700941m8900n1405n3535n5613n7212n7688n7028n5470n2869m9205m5201
$$ 1700941 1652041 1600636 1547101 1491488 1434276 1376588 1319560 1264090 1211221 1162016 1116815
53231A116815m1641l8667l6378l5371l5833l6814l7327l7625l8459l9675m0516
$$ 1116815 1075174 1036507 1000129 964758 928925 892111 854784 817159 778700 739025 698509
53220F98509m0769m0631l9864l8091l5545l2633k9173k5045k1105j8420j6801
$$ 698509 657740 617109 577245 539154 503609 470976 441803 416758 395653 377233 360432
53209C60432j5173j3189j1489j0418r549q535p671p254p036o518n577m656m391
$$ 360432 345259 332070 320581 310163 300614 292079 284408 277154 270118 263600 258023 253367 248976
53196B48976m873n320m907l924l480l953m514m542m537n096n763n709m894l894
$$ 248976 244103 238783 233876 229952 226472 222519 218005 213463 208926 203830 198067 192358 187464 183570
53182A83570l051k463k297k507k676k616k684l032l238l019k696k496k176j729
$$ 183570 180519 178056 175759 173252 170576 167960 165276 162244 159006 155987 153291 150795 148619 146890
53168A46890j640j976k097j758j484j403q86lj8j441k855k758j559n61o8K27R6
$$ 146890 145250 143274 141177 139419 137935 136532 135646 135643 135625 134184 131329 128571 127012 126451 126383 126610 126706
53151A26706n59p94N5R71O68l35o70m67r18k018k586k380k284k432j889m79O66
$$ 126706 126147 125353 125408 126379 127047 126712 126042 125575 124657 122639 120053 117673 115389 112957 111068 110589 111255
53134A11255P78L83J54Q3J52P12J639K037J346J26o47n70M2N46M14k75q60r38
$$ 111255 112033 112416 112570 112653 112805 113517 115156 117193 118539 118665 118018 117448 117490 118036 118450 118175 117315 116377
53116A16377q80j078j188p59j16K35N45J172J524Q05m16p36J01Q90P71K22K6J79
$$ 116377 115497 114419 113231 112472 112356 112591 113136 114308 115832 116637 116221 115485 115586 116476 117247 117469 117495 117674
53098A17674K37N0k16l66l30k48l67n81m17J75N66M32L49P11Q39O5r25j036m90
$$ 117674 117911 117961 117745 117379 117049 116801 116434 115853 115436 115611 116177 116609 116958 117669 118508 118573 117648 116612 116122
53079A16122m02q76r02j26M98R5j067k128k467j948r39j74m7j82j55k92j012j893
$$ 116122 115720 114844 113942 113816 114314 114409 113342 111214 108747 106799 105860 105686 105639 105457 105302 105010 103998 102105
53061A02105k180j882j527j175o15j72l03o95o68k93j15j13J03L35N0n86r12q40
$$ 102105 99925 98043 96516 95341 94726 94554 94251 93556 92888 92595 92480 92367 92470 92805 92855 92269 91357 90517
53043I0517p90q41q67j168j975k682k588k021j637j195k40N14L5j209j807j516
$$ 90517 89727 88886 88019 86851 84876 82194 79606 77585 75948 74753 74513 75027 75062 73853 72046 70530
53027G0530j211r77j18R67Q88m23j360j097o60q98j122o65l27j046k236k650k080
$$ 70530 69319 68342 68224 69191 70079 69656 68296 67199 66539 65641 64519 63854 63527 62481 60245 57595 55515
53010E5515j229n01R2K96j83j036j454r41K23J188J248N82Q4K17M32K13L7L94
$$ 55515 54286 53785 53877 54173 53990 52954 51500 50559 50782 51970 53218 53800 53884 54101 54533 54746 54783 55177
52992E5177O49K3p39k83J024J376K05j027j104m92m3K52N80O18L19K78O47O81
$$ 55177 55826 55849 55110 54827 55851 57227 57432 56405 55301 54809 54766 55018 55598 56216 56535 56813 57460 58141
52974E8141j3p81r97q75n94K25J484K053J190k75j017q29m27k27q1J60M12M90
$$ 58141 58128 57347 56350 55475 54881 55106 56590 58643 59833 59558 58541 57712 57285 57058 56977 57137 57549 58039
52956E8039J70m74p61j12R54J321Q65N60Q78J200J203J497K298K675K021J266
$$ 58039 58209 57735 56974 56862 57816 59137 60002 60562 61440 62640 63843 65340 67638 70313 72334 73600
52940G3600J548K465K660J661K06q99j382j266p69l49l41o27r56j262j461j313
$$ 73600 75148 77613 80273 81934 82140 81241 79859 78593 77824 77475 77134 76507 75551 74289 72828 71515
52924G1515p98k56O9K58K96l0o20r75r01p86r47j208j333j411j589j808j939j845
$$ 71515 70717 70461 70530 70788 71084 71054 70434 69459 68558 67772 66825 65617 64284 62873 61284 59476 57537 55692
52906E5692j351o01k72p34j243q69QJ32o84j223p20J36L54j48q59j329j141j34
$$ 55692 54341 53740 53468 52734 51491 50622 50630 50762 50078 48855 48135 48271 48625 48477 47618 46289 45148 45014
52888D5014J027J359Q70N04O40O85L34O4M7k43r26j311j088p63n09K67J576K339
$$ 45014 46041 47400 48270 48774 49414 50099 50433 50497 50544 50301 49375 48064 46976 46213 45704 45971 47547 49886
52870D9886J900R13P5q08j771j979j057m5L7l95m44k06k09k82nL90N54P36J090
$$ 49886 51786 52699 52774 51966 50195 48216 47159 47114 47151 46756 46312 46106 45897 45615 45610 46000 46554 47290 48380
52851D8380J031K37m51j77O14R52Q13P46P35N17N06J227K293K888K899K741K553
$$ 48380 49411 49648 49197 49020 49634 50586 51399 52145 52880 53397 53903 55130 57423 60311 63210 65951 68504
52834F8504K450K858L743M071L123J680Q37K51j119l022m050l573k293r96P3O51
$$ 68504 70954 73812 77555 81626 84749 86429 87266 87517 86398 83376 79326 75753 73460 72464 72537 73188
52818G3188M87L1J25Q50J488J588J329Q56R5p35j210j298j263j034m05K24J42
$$ 73188 73675 73706 73831 74681 76169 77757 79086 79942 80037 79302 78092 76794 75531 74497 74092 74316 74458
52801G4458o64j432j671j617j624j695j696j611j495j508j791k050j629m56M86
$$ 74458 73794 72362 70691 69074 67450 65755 64059 62448 60953 59445 57654 55604 53975 53519 54005
52786E4005K81o84j320j289j043p47o6R79J832K197K272K097J350Oj303j830j360
$$ 54005 54286 53602 52282 50993 49950 49203 49137 50116 51948 54145 56417 58514 59864 59870 58567 56737 55377
52769E5377k89O03O38j27q43p83j95J52ol22n27o57o77m84j77O8L29O73P72K85
$$ 55377 55088 55691 56329 56202 55359 54576 54381 54533 54527 54205 53678 53021 52344 51860 51683 51751 52080 52753 53525 53810
52749E3810m61p98o77p06j115j328p63L01J062J114P70M97L59J22k15l77l21m53
$$ 53810 53349 52551 51874 51168 50053 48725 47962 48263 49325 50439 51209 51706 52065 52187 51972 51595 51274 50821
52731E0821r81j406j123k81M68Q56J030R30M18j08j50r6p42j798j998r79J53N39
$$ 50821 49840 48434 47311 47030 47498 48354 49384 50314 50732 50624 50474 50378 49636 47838 45840 44861 45014 45553
52713D5553O71J098J285O92pJ73J013J528J355Q95N11L80O96J291J504J035L85
$$ 45553 46224 47322 48607 49299 49292 49465 50478 52006 53361 54256 54767 55147 55843 57134 58638 59673 60058
52696F0058l5n05j159j420j025p33j080j338p54J6K2k22M59J807K411J842J108
$$ 60058 60023 59518 58359 56939 55914 55181 54101 52763 52009 52025 52047 51825 52284 54091 56502 58344 59452
52679E9452R32R32N94O7l00l23J45R91J627J698J794K534L289K895J444K44o5
$$ 59452 60384 61316 61910 61977 61677 61354 61499 62490 64117 65815 67609 70143 73432 76327 77771 78015 77950
52662G7950j92p68j407j481j091p52p45r82j125q05j34J38m88j424j716j281p58
$$ 77950 77758 76990 75583 74102 73011 72259 71514 70532 69407 68602 68468 68606 68118 66694 64978 63697 62939
52645F2939m28j83l24j220k233k187j085k32k89k81P78K178K304P15j288k095
$$ 62939 62511 62328 62004 60784 58551 56364 55279 55047 54758 54477 55255 57433 59737 60452 59164 57069
52629E7069j316P3Q19N52o1k31R9M52N44M75L71K29Q0l7j57l18m83o66q67q70
$$ 57069 55753 55826 56645 57197 57136 56905 57004 57456 58000 58475 58846 59075 59155 59118 58961 58643 58160 57494 56627 55757
52609E5757m24K13M60K57J57L22K03m39r57p89k87J8J88L19M3o75j010m34L63
$$ 55757 55333 55546 56006 56263 56420 56742 56945 56506 55549 54760 54473 54491 54679 54998 55041 54366 53356 52922 53285
52590E3285N53M32N82O62J96j87K68Q88M74o16q92k4P77O82Q8m90j029j324r65
$$ 53285 53838 54270 54852 55514 55710 55523 55791 56679 57153 56537 55645 55621 56398 57080 57168 56678 55649 54325 53360
52571E3360k36Q8MK69R72J294R18N30O15P88P06O21O49M14j61m30P9R78J557J559
$$ 53360 53124 53212 53216 53485 54457 55751 56669 57199 57814 58602 59308 59929 60578 60992 60831 60401 60480 61458 63015 64574
52551F4574J183P69O00O18M16j04m08j76l2n57j115o96L99R44O25K14O1k61p10
$$ 64574 65757 66526 67126 67744 68160 68056 67648 67472 67440 66883 65768 65072 65471 66415 67040 67254 67315 67054 66344
52532F6344o00Q5M68K27N7L52N98M36K66K71k0o71q77j94O51Q05L80p7m50q11
$$ 66344 65744 65829 66297 66524 66581 66933 67531 67967 68233 68504 68484 67813 66936 66742 67393 68198 68578 68501 68051 67240
52512F7240r14n39N0M31M24K4o33j078q74k41J74J94J39P6k29o17o47l94l35m40
$$ 67240 66326 65787 65837 66268 66692 66716 66083 65005 64131 63890 64064 64258 64397 64473 64244 63627 62980 62586 62251 61811
52492F1811k90k9j83n83n25q4m9m43l55M31R52O78L44O48J152J158P25J74n12
$$ 61811 61521 61492 61309 60726 60201 60117 60068 59625 59270 59701 60653 61331 61675 62323 63475 64633 65358 65532 65020
52473F5020j167j201m73K98N45M84L81N0m54m83J67P08M61j91m90l27p8N7Q0J16
$$ 65020 63853 62652 62179 62477 63022 63506 63887 63937 63483 63000 63167 63875 64336 64145 63655 63328 63250 63307 63387 63503
52453F3503M97J328J857J200k30r85n29K22N47P85J076O73n87j419p39P01J453
$$ 63503 64000 65328 67185 68385 68155 67170 66641 66863 67410 68195 69271 69944 69357 67938 67199 67900 69353
52436F9353J305R97P67K93l11n26k06L34P80Q86N02o4k32q9m41j427j934j031
$$ 69353 70658 71655 72422 72715 72404 71878 71672 72006 72786 73672 74174 74110 73878 73789 73348 71921 69987 68956
52418F8956P22K059K449K027R29m79j312j033k34J68Q2j5j0j22l46n50q16j080
$$ 68956 69678 71737 74186 76213 77142 76663 75351 74318 74084 74252 74334 74319 74309 74187 73841 73291 72475 71395
52400G1395r75m05J28K85L60N84O29L27J56M12O63O24P46J251J404O60k00j05
$$ 71395 70420 70015 70143 70428 70788 71372 72001 72328 72484 72896 73559 74183 74929 76180 77584 78244 78044 77939
52382G7939O45Q57J37p68j106p31J37J008J256P92L14L53N57M40K86M82O32K10
$$ 77939 78584 79441 79578 78810 77704 76973 77110 78118 79374 80166 80480 80833 81390 81830 82116 82598 83230 83440
52364H3440l81l32L09P73P09L67r5o42r29o24r4nk91k19N61J554J999J572O15
$$ 83440 83059 82727 83036 83809 84518 84885 84790 84148 83219 82595 82501 82496 82205 81986 82547 84101 86100 87672 88287
52345H8287j9L16J266J752J357Q46R83J398J268M92m14j083j379j145n66l13p17
$$ 88287 88268 88584 89850 91602 92959 93805 94788 96186 97454 97946 97532 96449 95070 93925 93359 93046 92329
52328I2329j202j074l71M88J332J879J535K83q51j026o78o07o66l13J68J24k46
$$ 92329 91127 90053 89682 90170 91502 93381 94916 95199 94348 93322 92644 92037 91371 91058 91226 91350 91104
52311I1104k25K05N51Q48J449K036J963J428J221J370J185O22N11J168J810J743
$$ 91104 90879 91084 91635 92483 93932 95968 97931 99359 100580 101950 103135 103757 104268 105436 107246 108989
52295A08989J278J137J520K085K438K370J947J599J781K476L231L623L568L187
$$ 108989 110267 111404 112924 115009 117447 119817 121764 123363 125144 127620 130851 134474 138042 141229
52281A41229K632J917R62Mj98R16K677L681L463K912K708K383J433M23Q4K06K59
$$ 141229 143861 145778 146740 146744 146546 147462 150139 153820 157283 160195 162903 165286 166719 167142 167226 167432 167691
52264A67691L91Q02Q70K6j005r89J13J261J822J961J756J037K2o94q14l64O01
$$ 167691 168082 168884 169754 169780 168775 167786 167899 169160 170982 172943 174699 175736 175758 175064 174250 173886 174487
52247A74487J746K329K051J608J628J654J048L15M07J164J634J636J826K385K840
$$ 174487 176233 178562 180613 182221 183849 185503 186551 186866 187273 188437 190071 191707 193533 195918 198758
52232A98758L070L360L527L070K151J453J115P80N62R46J707K048J871J900K410
$$ 198758 201828 205188 208715 211785 213936 215389 216504 217284 217846 218792 220499 222547 224418 226318 228728
52217B28728K738K369J645J210J317J833K394K591K458K523K962L107K538J983
$$ 228728 231466 233835 235480 236690 238007 239840 242234 244825 247283 249806 252768 255875 258413 260396
52203B60396K236K777K587J892J753K255K524K373K486K951L030K585K446L005
$$ 260396 262632 265409 267996 269888 271641 273896 276420 278793 281279 284230 287260 289845 292291 295296
52189B95296L641L804L655L394K920K515K761L571M085L863L287K767K377K341
$$ 295296 298937 302741 306396 309790 312710 315225 317986 321557 325642 329505 332792 335559 337936 340277
52175C40277K831L242K697J454P05R34J456J697J771J660J064K93N3J49l51j396
$$ 340277 343108 346350 349047 350501 351206 352140 353596 355293 357064 358724 359788 360081 360134 360283 359932 358536
52159C58536j766j018k52l07n53j78M64O39L23k33j105k121k620k464k401k739
$$ 358536 356770 355752 355500 355193 354640 354462 354926 355565 355888 355655 354550 352429 349809 347345 344944 342205
52143C42205k684j749p81o78j015r57o84q42j228j173o93l21j43Rj86j096k258
$$ 342205 339521 337772 336991 336313 335298 334341 333657 332815 331587 330414 329721 329400 329257 329266 329080 327984 325726
52126C25726k840k769k632k559k133j347q45j054j641k020j976j726j587j650
$$ 325726 322886 320117 317485 314926 312793 311446 310601 309547 307906 305886 303910 302184 300597 298947
52112B98947j657j210l43L35J62r41k357l181k834j582l74J08J11K03K62k14j072
$$ 298947 297290 296080 295737 296072 296234 295293 292936 289755 286921 285339 284965 285073 285184 285387 285649 285435 284363
52095B84363j523j284q32m68Q3Q94J487J575J478J498J533J527J588J478P70k25
$$ 284363 282840 281556 280724 280256 280339 281233 282720 284295 285773 287271 288804 290331 291919 293397 294167 293942
52079B93942m41O31K294L592M137L853K841J813J731K501K899K290J491J361J587
$$ 293942 293501 294132 296426 300018 304155 308008 310849 312662 314393 316894 319793 322083 323574 324935 326522
52064C26522J573J550J835J872J075N4r4O51J366J580J601J635J472J071P49P72
$$ 326522 328095 329645 331480 333352 334427 334481 334387 335038 336404 337984 339585 341220 342692 343763 344512 345284
$$ [...]
##END NTUPLES=NMR SPECTRUM
##END=
