
##TITLE=AC1235_CETAH12095_6610385_JaHScvh5pF
##JCAMPDX= 6.0         $$ Bruker NMR JCAMP-DX V2.0
##DATA TYPE= NMR SPECTRUM
##DATA CLASS= NTUPLES
##ORIGIN= BRUKER
##OWNER= Administrator
$$ 1.72 TOPSPIN		Version 2.1
$$ 2012-08-02 01:48:26.937 -0500  Administrator@TOPSPIN
$$ Compression mode = diff/dup
##.OBSERVE FREQUENCY= 400.02188249412
##.OBSERVE NUCLEUS= ^1H
##.ACQUISITION MODE= SIMULTANEOUS (DQD)
##.ACQUISITION SCHEME= undefined
##.AVERAGES= 8
##.DIGITISER RES= 22
##SPECTROMETER/DATA SYSTEM= spect
##.PULSE SEQUENCE= zg30
##.SOLVENT NAME= COFFEE_meoh
##.SHIFT REFERENCE= INTERNAL, COFFEE_meoh, 1, 14.98509
##AUDIT TRAIL= $$ (NUMBER, WHEN, WHO, WHERE, PROCESS, VERSION, WHAT)
$$ ##TITLE= Audit trail, TOPSPIN		Version 2.1
$$ ##JCAMPDX= 5.01
$$ ##ORIGIN= Bruker BioSpin GmbH
$$ ##OWNER= Administrator
$$ $$ C:\Bruker\TOPSPIN/data/COFFEE/nmr/AC1235_CETAH12095_6610385_JaHScvh5pF/10/pdata/1/auditp.txt
$$ ##AUDIT TRAIL=  $$ (NUMBER, WHEN, WHO, WHERE, PROCESS, VERSION, WHAT)
(   1,<2012-08-02 01:48:18.546 -0500>,<Administrator>,<TOPSPIN>,<go>,<TOPSPIN 2.1>,
      <created by zg
	started at 2012-08-02 01:47:12.078 -0500,
	POWCHK enabled, PULCHK disabled,
       configuration hash MD5:
       6B 1B 68 BB D9 2E 58 E2 7F 35 AD 54 07 DF 0E 41
       data hash MD5: 64K
       51 CF 9E FE 3E 59 26 E1 7F CB E1 52 45 6B 14 FD>)
(   2,<2012-08-02 01:48:22.609 -0500>,<Administrator>,<TOPSPIN>,<proc1d>,<TOPSPIN 2.1>,
      <Start of raw data processing
       efp LB = 0 FT_mod = 6 PKNL = 1 PHC0 = 0 PHC1 = 0 SI = 32K 
       data hash MD5: 32K
       FE B8 41 63 DD CF 59 33 D2 AA BA C9 2F 08 9A 63>)
(   3,<2012-08-02 01:48:22.890 -0500>,<Administrator>,<TOPSPIN>,<proc1d>,<TOPSPIN 2.1>,
      <pk PHC0 = 179.6265 PHC1 = 0 
       data hash MD5: 32K
       8E A8 56 C7 D8 F6 A3 47 72 B6 06 E5 9F 92 82 BF>)
(   4,<2012-08-02 01:48:22.968 -0500>,<Administrator>,<TOPSPIN>,<proc1d>,<TOPSPIN 2.1>,
      <abs ABSG = 1 
       data hash MD5: 32K
       EC F6 26 88 81 48 CB 2D 2E 61 11 17 9A B9 E1 C2>)
(   5,<2012-08-02 01:48:22.984 -0500>,<Administrator>,<TOPSPIN>,<proc1d>,<TOPSPIN 2.1>,
      <abs ABSG = 2 
       data hash MD5: 32K
       60 54 E1 05 83 9A 77 EE 67 7D 61 A8 7A F6 7D BC>)
(   6,<2012-08-02 01:48:23.031 -0500>,<Administrator>,<TOPSPIN>,<proc1d>,<TOPSPIN 2.1>,
      <abs ABSG = 3 
       data hash MD5: 32K
       95 71 3C 0D 1A 81 EB 2A C6 52 81 3C 00 F3 9A 5C>)
(   7,<2012-08-02 01:48:23.062 -0500>,<Administrator>,<TOPSPIN>,<proc1d>,<TOPSPIN 2.1>,
      <abs ABSG = 4 
       data hash MD5: 32K
       A4 0C E2 99 A1 39 59 F8 2E 35 AC DC F4 75 50 4E>)
(   8,<2012-08-02 01:48:23.093 -0500>,<Administrator>,<TOPSPIN>,<proc1d>,<TOPSPIN 2.1>,
      <abs ABSG = 5 
       data hash MD5: 32K
       79 21 15 95 80 80 12 F6 9C 1B 18 C2 0A 7B 41 93>)
$$ ##END=
$$ 
$$ $$ hash MD5
$$ $$ 94 B9 58 51 09 AC 5E 1B 4B EA 15 68 3D 8B 6E C4
##$RELAX= 
##$RELAX= 
##$RELAX= 
##$RELAX= 
##$RELAX= 
##$RELAX= 
##$RELAX= 
$$ Bruker specific parameters
$$ --------------------------
$$ [...]
##$TP= (0..7)
150 150 150 150 150 150 150 150
##$TP07= 0
##$TPNAME0= <>
##$TPNAME1= <>
##$TPNAME2= <>
##$TPNAME3= <>
##$TPNAME4= <>
##$TPNAME5= <>
##$TPNAME6= <>
##$TPNAME7= <>
##$TPOAL= (0..7)
0.5 0.5 0.5 0.5 0.5 0.5 0.5 0.5
##$TPOFFS= (0..7)
0 0 0 0 0 0 0 0
##$TUNHIN= 0
##$TUNHOUT= 0
##$TUNXOUT= 0
##$USERA1= <user>
##$USERA2= <user>
##$USERA3= <user>
##$USERA4= <user>
##$USERA5= <user>
##$V9= 5
##$VALIST= <valist>
##$VCLIST= <CCCCCCCCCCCCCCC>
##$VD= 0
##$VDLIST= <DDDDDDDDDDDDDDD>
##$VPLIST= <PPPPPPPPPPPPPPP>
##$VTLIST= <TTTTTTTTTTTTTTT>
##$WBST= 1024
##$WBSW= 4
##$XGAIN= (0..3)
0 0 0 0
##$XL= 0
##$YL= 0
##$YMAX_a= 484593
##$YMIN_a= -635170
##$ZGOPTNS= <>
##$ZL1= 120
##$ZL2= 120
##$ZL3= 120
##$ZL4= 120
##$ABSF1= 14.98509
##$ABSF2= -5.573092
##$ABSG= 5
##$ABSL= 3
##$ALPHA= 0
##$AQORDER= 0
##$ASSFAC= 0
##$ASSFACI= 0
##$ASSFACX= 0
##$ASSWID= 0
##$AUNMP= <proc_prof1d_extract_pilot.lims>
##$AXLEFT= 0
##$AXNAME= <>
##$AXNUC= <1H>
##$AXRIGHT= 0
##$AXTYPE= 0
##$AXUNIT= <>
##$AZFE= 0.1
##$AZFW= 0.1
##$BCFW= 0
##$BC_mod= 0
##$BYTORDP= 0
##$COROFFS= 0
##$CY= 15
##$DATMOD= 1
##$DC= 0
##$DFILT= <>
##$DTYPP= 0
##$F1P= 0
##$F2P= 0
##$FCOR= 0.5
##$FTSIZE= 32768
##$FT_mod= 6
##$GAMMA= 0
##$GB= 0
##$INTBC= 1
##$INTSCL= 1
##$ISEN= 128
##$LB= 0
##$LEV0= 0
##$LPBIN= 0
##$MAXI= 10000
##$MC2= 0
##$MEAN= 0
##$ME_mod= 0
##$MI= 0
##$NCOEF= 0
##$NC_proc= -8
##$NLEV= 6
##$NOISF1= 0
##$NOISF2= 0
##$NSP= 0
##$NTH_PI= 0
##$NZP= 0
##$OFFSET= 14.98509
##$PC= 1
##$PHC0= 179.6265
##$PHC1= 0
##$PH_mod= 1
##$PKNL= yes
##$PPARMOD= 0
##$PPDIAG= 0
##$PPIPTYP= 0
##$PPMPNUM= 2147483647
##$PPRESOL= 1
##$PSCAL= 4
##$PSIGN= 0
##$PYNMP= <proc.py>
##$REVERSE= no
##$SF= 400.02
##$SI= 32768
##$SIGF1= 0
##$SIGF2= 0
##$SINO= 400
##$SIOLD= 32768
##$SPECTYP= <>
##$SREGLST= <1H.CDCl3>
##$SSB= 0
##$STSI= 32768
##$STSR= 0
##$SW_p= 8223.68421052631
##$SYMM= 0
##$S_DEV= 0
##$TDeff= 65536
##$TDoff= 0
##$TI= <>
##$TILT= no
##$TM1= 0
##$TM2= 0
##$TOPLEV= 0
##$USERP1= <user>
##$USERP2= <user>
##$USERP3= <user>
##$USERP4= <user>
##$USERP5= <user>
##$WDW= 1
##$XDIM= 32768
##$YMAX_p= 463182244
##$YMIN_p= -732457
##$CURPLOT= <Network HP LaserJet P1505>
##$CURPRIN= <$Network HP LaserJet P1505>
##$DFORMAT= <normdp>
##$LAYOUT= <+/1D_H.xwp>
##$LFORMAT= <normlp>
##$PFORMAT= <normpl>
##$SURQMSG= 1
$$ End of Bruker specific parameters
$$ ---------------------------------
##NTUPLES= NMR SPECTRUM
##VAR_NAME=  FREQUENCY,     SPECTRUM/REAL,   SPECTRUM/IMAG
##SYMBOL=    X,             R,               I
##VAR_TYPE=  INDEPENDENT,   DEPENDENT,       DEPENDENT
##VAR_FORM=  AFFN,          ASDF,            ASDF
##VAR_DIM=   32768,         32768,           32768
##UNITS=     HZ,            ARBITRARY UNITS, ARBITRARY UNITS
##FACTOR=    0.250966925370066, 1,           1
##FIRST=     8223.43324360094, 74839,        27206
##LAST=      0,             -193387,         82327
##MIN=       0,             -732457,         0
##MAX=       8223.43324360094, 463182244,    0
$$ Real data points
##PAGE= N=1
##DATA TABLE= (X++(R..R)), XYDATA
$$ [...]
$$ plain form
19487 -106288 81417 154863 -351599 -109265 118216 147287 70961 -298493 41408 10767 -185625
19475 -170198 -17043 -140285 -413165 -354385 -7042 -304986 -226228 -1581 -61825 -250557 87340
19463 -132431 -111818 85548 -79911 531279 -123492 -49045 -77784 124585 7012 -354194 -129639
19451 -183069 -80926 -139359 145465 -237426 48313 10924 49417 -37723 -81649 -369139 68379
19439 -54380 -139245 -23588 -5849 142367 5083 59760 -105088 -161140 -281375 112340 -197437
19427 -23493 -266908 41789 95350 53048 -51484 142822 10037 95520 203912 328144 -77994
19415 145707 174411 26696 -25865 -135687 -97787 87138 -260189 -234629 -442617 -143194 -218571
19404 -218571 -353234 -365456 -89146 191858 -202495 44312 -183752 43259 -138564 60795
$$ packed form
19487a06288H1417P3446c51599a09265A18216K9071G0961b98493D1408A0767a85625
19475a70198a7043j23242k72880N8780g042k97944P8758a581o0244j88732H7340
19463a32431K0613H5548g9911E31279a23492d9045k8739A24585G012c54194a29639
19451a83069h0926n8433A45465b37426D8313A0924L8493c7723m3926k87490F8379
19439e4380q4865b3588e849A42367E083N4677a05088n6052j20235A12340a97437
19427b3493k43415D1789N3561m2302e1484A42822A0037Q5483J08392J24232g7994
19415A45707K8704B6696b5865j09822L7900H7138b60189K5560k07988a43194p5377
19404b18571j34663j2222h9146A91858b02495D4312a83752D3259a38564F0795
$$ plain form
19393 295249 -91889 -52937 -28026 148210 -143997 409537 277617 64716 -103908 52959
19382 -129238 -77865 130261 -54122 30382 -324563 -29473 -13680 -312972 88582 74969 -24412
19370 -236502 -229954 55864 -425673 -125297 21411 68436 253382 179288 -151920 -133832 119752
19358 -122364 -258892 -33354 -129709 253680 218859 6663 -168314 -160729 36528 -56743 375042
19346 -89180 -233564 149902 -107390 -30666 -89897 -169950 -140421 -218797 193284 -126042 274428
19334 -66828 -271049 -237745 -358951 -105775 -166874 -234536 -4342 136386 -387858 -22782 36636
19322 -1278 -204378 -9155 -232637 -280898 274567 3986 52968 -78221 43912 -96165 -417413
19311 -417413 -292089 -118085 -242943 -168532 -30554 121989 -173359 -152296 -44918 444210
$$ packed form
19393B95249i1889L8952K4911A48210a43997D09537j31920F4716a03908E2959
19382a29238N1373A30261e4122C0382c24563b9473a3680k99292H8582j3613b4412
19370b36502O548E5864d25673a25297B1411M7025J84946p4094a51920J8088A19752
19358a22364j36528c3354r6355B53680l4821F663a68314P585C6528e6743C75042
19346h9180j44384A49902a07390c0666n9231q0053K9529p8376A93284a26042B74428
19334f6828k04221L3304j21206a05775o1099o7662d342A36386c87858b2782C6636
19322a278k03100i155k23482m8261B74567C986M8982g8221D3912i6165l21248
19311d17413J25324a18085j24858P4411c0554A21989a73359K1063d4918D44210
$$ plain form
19300 57472 -494177 12870 -2141 51254 25489 6068 -218115 72869 -74918 -54211 -8814 55589
19287 -76839 156959 -46639 -17236 -170359 159325 -114591 167660 10632 -332637 -64900
19276 -98315 263816 -70736 -3779 17789 -383746 -100553 -144998 84536 -212326 -103265 -297587
19265 -297587 -382737 -393843 -21498 72910 25477 -57036 90333 -47421 -228288 -147272 7411
19253 -87276 -86128 7684 -30700 211334 -392183 -214917 -233718 177646 -60491 -166858 252385
19241 -23542 242743 61739 25530 -29141 -138202 -28759 -88833 -92879 -119398 -405169 47628
19229 -329938 -84625 -92909 51612 180631 -294011 -244967 -103498 42190 -137583 -95843 -54616
19218 -54616 -291035 -90354 -354756 -178647 96803 -139811 -173879 18740 83251 2910 57734
$$ packed form
19300E7472d94177A2870b141E1254B5489F068b18115G2869g4918K0707h814E5589
19287g6839A56959d6639a7236j53123A59325a14591A67660A0632c32637f4900
19276i8315B63816g0736c779A7789c83746a00553m4445H4536b12326a03265j94322
19265b97587q5150j1106b1498G2910B5477e7036I0333d7421j80867Q1016G411
19253h7276J148G684c0700B11334c92183J77266j8801A77646f0491j06367B52385
19241b3542B42743F1739B5530b9141j09061b8759o0074m046k6519k85771D7628
19229c29938h4625q284E1612J29019b94011M9044a03498D2190a37583M1740M1227
19218e4616k36419i0354k64402J76109I6803a39811l4068A8740O4511B910N4824
$$ plain form
19207 57734 -383869 97770 -402082 273474 -256198 -257416 1364 -158024 115754 -175071 -128633
19196 -128633 -206510 -142929 201192 -114852 -294216 -114542 -270831 -68093 -197715 -110701
19186 -110701 -113078 -183327 83230 -77716 -105814 -132230 59278 176185 -274356 331103 -42971
19174 -112707 -45097 -116791 -57629 -84324 -50376 -70798 -124619 68013 -172801 -147154 -7168
19162 -307194 -136528 29664 -259205 48015 -315895 -17735 -109955 189536 298499 116286
19151 242609 193915 -280460 15642 -190391 5908 -149439 -126735 69854 -52954 101918 -105075
19139 -323342 -57917 70593 92028 193249 -185264 -143007 -216182 -209691 11899 -148003 -106218
19128 -106218 58528 -42157 8606 -79218 -142795 227199 79703 -147411 -44536 13403 -163579
$$ packed form
19207E7734c83869I7770d02082B73474b56198j218A364a58024A15754a75071M6438
19196a28633p7877O3581B01192a14852j79364a14542j56289f8093j29622Q7014
19186a10701k377p0249H3230g7716k8098k6416E9278J16907b74356C31103d2971
19174a12707d5097p1694e7629k6695L3948k0422n3821F8013a72801K5647g168
19162c07194a36528B9664b59205D8015c15895a7735r2220A89536J08963A16286
19151B42609m8694b80460A5642a90391E908a49439K2704F9854e2954A01918a05075
19139c23342e7917G0593K1435J01221a85264M2257p3175O491A1899a48003M1785
19128a06218E8528d2157H606g9218o3577B27199G9703a47411d4536A3403a63579
$$ plain form
19116 180277 69054 -143254 -350446 98209 370804 -21200 -82604 -203671 -184818 -108399 -17616
19104 -421127 118423 441998 -43596 -172148 -199854 -256523 -14398 -130810 2396 -258613 70535
19092 -200309 149666 12168 -187016 58206 -115860 222942 124547 -43967 93460 -104401
19081 -49621 -103216 -278460 -143337 154129 -18880 61490 -153841 171259 -65802 -144822 214905
19069 117229 251456 9617 25326 81177 -75907 343608 -228006 99316 -154964 -245386 -436576
19058 -436576 37389 -44394 131590 -323839 -246714 -226153 -95301 -112557 84314 -330435 246467
19046 -288292 -365483 -43695 109211 99902 103735 56700 -121023 -141676 117266 -256987 -534893
19035 -534893 -74941 9628 -324844 -330121 -197359 -95320 211065 37353 180992 6081 226188
$$ packed form
19116A80277F9054a43254k07192I8209K72595b1200o1404j21067J8853P6419a7616
19104d21127A18423L23575d3596j28552k7706n6669a4398j16412B396b58613G0535
19092b00309A49666A2168a87016E8206a15860B22942r8395d3967I3460a04401
19081d9621n3595j75244J35123A54129a8880F1490a53841A71259f5802p9020B14905
19069A17229J34227I617J5709N5851g5907C43608b28006I9316a54964r0422j91190
19058d36576C7389d4394A31590c23839P7125K0561i5301j7256H4314c30435B46467
19046b88292p7191d3695A09211r309L833m7035a21023k0653A17266b56987k77906
19035e34893g4941I628c24844n277J32762i5320B11065C7353J43639F081K20107
$$ plain form
19024 226188 -11919 -228517 391050 201998 45277 53447 90844 19056 17050 -392811 -423968
19013 -423968 328849 -279593 -160232 149470 -168154 -67626 -2824 -214740 105069 14639
19002 -82108 -415026 174740 -133973 -118322 351605 -341968 171444 -10598 -230232 -348557
18992 -348557 179404 -252751 217907 -7080 264704 -22023 58027 -70653 89476 14932 -258680
18980 -188264 -232365 -63218 11361 119746 79590 -446558 265633 261681 128216 479994 453305
18969 453305 399190 -50116 -7284 -125642 381371 -186177 -114818 249335 -143291 -91879 -191994
18958 -191994 -84916 53447 -66863 -282065 225122 177102 -156402 193004 30198 -151531
18947 -232142 -41340 -161934 -395013 77150 -175345 -127070 -515904 -293702 -126293 36007
$$ packed form
19024B26188a1919k16598C91050j89052D5277Q170L7397A9056k006c92811l1157
19013d23968C28849b79593J19361A49470a68154f7626b824k11916A05069A4639
19002h2108l32918A74740a33973J5651C51605c41968A71444a0598k19634j18325
18992c48557A79404b52751B17907g080B64704b2023E8027g0653H9476A4932b58680
18980a88264m4101f3218A1361J08385m0156d46558B65633l952A28216L51778k6689
18969D53305n4115e0116g284j18358C81371a86177P1359B49335a43291N1412j00115
18958a91994h4916E3447f6863k15202B25122m8020a56402A93004C0198a51531
18947b32142d1340j20594k33079G7150a75345M8275l88834K22202a26293C6007
$$ plain form
18936 82053 -125861 -42578 238766 -362073 374040 36192 -3255 44898 -32136 -172947 -303331
18925 -303331 -49959 284746 -143888 -228460 193550 106575 -175099 93509 -36238 -109707 -146244
18914 -146244 -179325 31182 312667 -361218 -270944 180886 234882 196163 372072 126434
18903 16028 97979 -128950 150197 -286644 -15919 225684 201021 -227691 -59301 -10816 -146452
18892 -146452 -256270 -165303 66793 42269 -79906 -34206 84854 106375 -184186 114199 192217
18881 192217 -36066 50548 316718 117688 -16543 -56113 -166103 4692 -337359 -238520 -74223
18869 -95414 -88415 -25579 -213334 -290051 -285246 -257632 -171531 -77755 62336 -118452 112223
18857 9851 246608 -129231 93328 -147981 -338624 -224881 -339652 -175804 52252 34401
$$ packed form
18936H2053a25861d2578B38766c62073C74040C6192c255D4898c2136j40811j30384
18925c03331d9959B84746a43888q4572A93550q6975a75099I3509c6238p3469l6537
18914a46244l3081C1182K81485c61218R0274A80886N3996l8719J75909A26434
18903A6028Q1951a28950A50197b86644a5919B25684k4663b27691e9301a0816j35636
18892a46452j09818R0967F6793k4524g9906c4206H4854K1521a84186A14199P8018
18881A92217c6066E0548K66170A17688a6543l9570j09990D692c37359R8839g4223
18869i5414O999b5579j87755p6717M805K7614Q6101g7755F2336a18452A12223
18857I851K36757a29231I3328a47981j90643J13743j14771J63848E2252j7851
$$ plain form
18847 34401 58563 51134 39533 198975 -202993 -93691 -300363 -7664 -308667 122423 -49371
18835 16724 -146331 170844 -36349 82387 -192233 90540 109405 37473 147159 73453 442428
18824 442428 -25654 12597 -150562 160218 -72414 156650 323163 -156100 2162 41722 -227646
18812 -110149 -170960 124149 -6050 158635 95669 -72489 73145 -202843 184231 -18408 -14249
18801 -14249 -53390 -36050 -26125 -64519 -196591 -312667 39160 151094 -237314 -196620 -33786
18789 -169537 -145082 -225072 -265195 -178885 87752 -37071 -141674 -10139 -142623 -121 156296
18777 -188225 -17958 -9982 -75594 94655 67293 -221371 -178131 -168980 -11479 353016 268142
18766 268142 53462 252722 97740 99717 -244914 90794 -245491 -325388 154285 56933 162475
$$ packed form
18847C4401K4162p429j1601J59442b02993i3691k06672g664l01003A22423d9371
18835A6724a46331A70844c6349H2387a92233I0540J8865C7473J09686G3453L68975
18824D42428b5654A2597a50562A60218g2414A56650J66513a56100B162L9560b27646
18812a10149o0811A24149f050A58635o2966g2489G3145b02843A84231a8408M159
18801a4249l9141J7340R925l8394j32072j16076C9160J11934b37314M0694c3786
18789a69537K4455p9990m0123Q6310H7752c7071j04603a0139j32484a21A56296
18777a88225a7958P976o5612I4655k7362b21371M3240R151a1479C53016q4874
18766B68142E3462J99260I7740J977b44914I0794b45491p9897A54285E6933J05542
$$ plain form
18755 162475 -139774 -192100 -152887 -143772 -324905 126349 -96006 143541 -157258 -163509 90479
18743 -168847 -144069 75490 -118471 -39363 124288 139002 -96659 -235037 146466 -66487 154844
18731 -32129 -74794 678 -308581 140619 -69481 221477 -294449 269779 146856 15212 -226627
18719 -192056 -181080 142562 82470 -8952 96062 -280586 -114963 -14400 -68229 -140739 22754
18707 -25798 117275 336970 -76152 -69451 -374062 -303387 -49059 -162494 100041 -173349 -140414
18696 -140414 -56165 -37116 118506 -91142 -326257 -13904 -144284 -104753 -143043 -64468 -107936
18685 -107936 112159 -197722 196105 202273 -93464 -44775 -67862 -191069 -133750 -375204 -117833
18673 146157 -69187 357769 -44348 44935 -159715 -103575 -79934 -65199 -178336 -56555 15524
$$ packed form
18755A62475a39774n2326L9213R115j81133A26349i6006A43541a57258o251I0479
18743a68847K4778G5490a18471c9363A24288J4714i6659j38378A46466f6487A54844
18731c2129m2665F78c08581A40619f9481B21477b94449B69779j22923A5212b26627
18719a92056J0976A42562o0092h952I6062b80586a14963a4400n3829p2510B2754
18707b5798A17275K19695g6152O701l04611P0675d9059j13435A00041a73349L2935
18696a40414e6165J9049A18506i1142k35115a3904j30380L9531l8290f4468m3468
18685a07936A12159a97722A96105O168i3464d4775k3087j23207N7319k41454a17833
18673A46157f9187C57769d4348D4935a59715N6140K3641J4735j13137e6555A5524
$$ plain form
18661 -192185 -334955 -19513 379306 -223698 -110447 46874 106466 49322 119490 76171 -258610
18649 107479 -277850 -250614 -130985 171480 -252756 -227733 -82661 455235 -193837 99350
18638 85804 -61426 -357715 -138048 58482 5735 -380299 72453 85694 -206778 -89485 69024
18626 27277 266364 -12184 -120811 132115 84065 39777 20774 206098 -289967 34295 -409959
18614 -56346 -122009 -194988 -132246 -83106 31361 31315 -328156 135619 14866 -53353 88297 -79822
18601 176006 -20180 278152 -134432 -254383 292761 56544 164665 12778 -1706 316412
18590 131892 -249342 -526662 2099 -135162 -140145 -42515 -95473 -208610 95232 -64981 -137730
18579 -137730 -94139 93465 -124721 -537326 244271 -196623 -370622 198409 204207 -1610 238102
$$ packed form
18661a92185j42770a9513C79306b23698a10447D6874N9592D9322P0168m3319b58610
18649A07479b77850K7236J19629A71480b52756K5023h2661D55235a93837I9350
18638H5804f1426k96289a38048E8482E735c80299G2453J3241b06778h9485F9024
18626B7277K39087a2184j08627A32115m8050C9777j9003J85324b89967C4295d09959
18614e6346o5663p2979O2742M9140C1361m6c28156A35619A4866e3353H8297g9822
18601A76006b0180B78152a34432j19951B92761E6544J08121A2778a706C16412
18590A31892b49342k77320B099a35162m983d2515n2958j13137I5232f4981p2749
18579a37730M3591I3465a24721m12605B44271a96623j73999A98409N798a610B38102
$$ plain form
18567 -19046 -4624 -80202 -237475 -54001 -264014 -33983 -67390 58160 -82940 -258691 -67631
18555 -65402 145767 65464 -160852 -289892 -289324 -47709 349755 245503 68067 653326 72829
18543 152520 -22989 -80058 187980 271429 -23738 -469845 49065 -497088 -80752 -215296 -157384
18532 -157384 64615 -27651 -267837 191623 -75139 21696 12062 216078 -92588 -15419 -127946
18521 -127946 141176 -68889 -155701 -186961 -65296 21503 268310 131596 109742 61639 42454
18510 42454 244270 -60197 -189270 125193 57604 54001 -326940 -87849 119144 -331896 40902
18498 101565 -26267 46667 -37808 -77510 -437924 13758 71674 -326613 -149039 -112089 -300354
18487 -300354 -373906 -92665 -170557 -83958 -101742 19383 98090 -53329 11288 -71626 -163672
$$ packed form
18567a9046d624p5578j57273e4001k10013c3983l3407E8160h2940j75751f7631
18555f5402A45767F5464a60852j29040N68d7709C49755j04252F8067N85259G2829
18543A52520b2989n7069A87980Q3449b3738m46107D9065d97088h0752j34544N7912
18532a57384F4615b7651k40186A91623g5139B1696r634K04016i2588a5419j12527
18521a27946A41176f8889q6812l1260f5296B1503K46807A31596k1854m8103j9185
18510D2454K01816f0197j29073A25193E7604l603c26940h7849A19144c31896D0902
18498A01565b6267D6667c7808l9702l60414A3758N7916c26613a49039L6950j88265
18487c00354p3552i2665p7892h3958j7784A9383P8707e3329A1288g1626r2046
$$ plain form
18476 -163672 103553 188547 -128082 -238722 -10892 -77345 -2791 -235084 -108349 -179701 -240115
18465 -240115 -243624 9464 127669 -415085 47008 20273 749 -109897 -58440 -321792 75028
18453 86343 -96854 212616 -387419 -66859 123132 91374 -108835 -80869 308463 -15242 -194637
18442 -194637 -24405 240071 -252815 94446 262012 171665 -50304 72420 88507 22269 -7777
18430 -54852 -38250 -294503 205796 34371 -246711 131450 65606 -111969 -238223 535246
18419 -100767 61987 -276265 77719 59804 -171304 -344369 -116608 17316 -113428 127070
18408 85303 53506 41639 240813 149198 188993 116467 -240403 -69860 425641 -321348 131290
18396 58765 -32590 85424 129670 -113491 231705 54351 -53903 -270835 -171507 44423 -294967
$$ packed form
18476a63672A03553Q4994a28082j10640a0892o6453b791k32293a08349p1352o0414
18465b40115l509I464J18205d15085D7008B0273G49a09897N1457k63352G5028
18453H6343i6854B12616c87419f6859A23132l1758a08835K7966C08463a5242j79395
18442a94637b4405B40071b52815I4446J67566r0347e0304G2420J6087B2269g777
18430e4852J6602k56253B05796C4371b46711A31450F5606a11969j26254E35246
18419a00767F1987b76265G7719j7915a71304j73065a16608A7316a13428A27070
18408H5303l1797j1867J99174r1615L9795p2526b40403f9860D25641c21348A31290
18396E8765c2590H5424M4246a13491B31705E4351e3903k16932R9328D4423b94967
$$ plain form
18384 10454 -103991 83550 -241731 -471181 -146580 425394 -198932 70054 -28471 1028 -146443
18372 -473815 -53926 -230974 351020 98619 434328 -136785 -6323 -171407 128333 -189945
18361 -52569 -151256 -40934 284508 19405 -240564 -129334 -196433 245170 158775 167454 -77905
18349 393997 -178025 245415 -473518 101581 -211659 -298222 -37195 -125277 -116662 147238
18338 -144250 250282 34703 -72514 -2290 -182570 166565 339497 -7170 -45216 -14404 -183006
18327 -183006 -293045 -185131 146161 -102026 16093 -265271 176568 -170596 62779 -122277
18316 -154035 -62222 -71820 20717 -238616 -298860 219543 -229897 -2674 -30187 -5466 4293 -138084
18303 -318547 293969 -90509 -205964 -53474 -160071 26121 -68918 -205443 -74610 270001
$$ packed form
18384A0454a03991H3550b41731k29450a46580D25394a98932G0054b8471A028a46443
18372d73815e3926j77048C51020I8619L35709a36785f323j65084A28333a89945
18361e2569r8687d0934B84508A9405b40564J11230o7099B45170q6395Q679g7905
18349C93997a78025B45415d73518A01581b11659q6563c7195q8082Q615A47238
18338a44250B50282C4703g2514b290j80280A66565J72932g170l8046a4404j68602
18327a83006j10039J07914A46161a02026A6093b65271A76568a70596F2779a22277
18316a54035f2222r598B0717b38616o0244B19543b29897b674k7513e466D293a38084
18303c18547B93969i0509j15455e3474j06597B6121f8918j36525g4610B70001
$$ plain form
18292 -125223 -280843 192814 -31050 368905 -235436 -57294 -51978 -299765 -212075 -32140 -190537
18281 -190537 -114303 -134363 23551 -186007 55896 -7258 195337 -112936 -83799 -72352 -8438
18269 -69275 -48840 20081 -161871 23058 -750 -25129 94582 -185337 118861 93821 -14830
18257 -190879 205861 109695 117474 -72977 -32389 162628 -47888 -72171 124204 277735 196703
18246 196703 -68463 -120844 -4946 172061 -318367 38795 -413928 -36647 258412 -342979 303693
18234 -275084 -369568 -110463 345644 -155111 -122812 192626 -76998 -28177 34331 90692 175059
18223 175059 -126102 -56940 -22964 -64449 -48186 79007 110093 155666 95505 -218610 156474
18211 114229 -131253 -36270 -264120 -154244 368280 94715 -94986 100588 -240720 -121821
$$ packed form
18292a25223j55620A92814c1050C68905b35436e7294N316k47787Q7690c2140j58397
18281a90537P6234k0060B3551a86007E5896g258A95337a12936K9137J1447h438
18269f9275K0435B0081a61871B3058g50k4379I4582a85337A18861k5040a4830
18257a90879B05861r6166P779g2977c2389A62628d7888k4283A24204J53531q1032
18246A96703f8463n2381d946A72061c18367C8795d13928c6647B58412c42979C03693
18234b75084r4484a10463C45644a55111L2299A92626g6998b8177C4331N6361Q4367
18223A75059a26102e6940b2964m1485J6263G9007L1086M5573o0161b18610A56474
18211A14229a31253c6270k27850J09876C68280I4715i4986A00588b40720J18899
$$ plain form
18201 -121821 -98614 -113915 -38389 92498 -461207 301885 -254560 152518 166106 51042 -255354
18189 64859 279165 -100237 21863 114883 -27599 49239 27973 -21775 190444 128021 -278777
18177 161815 -16775 7235 112934 292479 84751 84944 67331 81574 -475988 -268266 -174096
18166 -174096 25809 233449 61320 -354347 112918 -196039 426441 127024 453116 11449
18155 -63461 -10994 -334026 -368728 -157160 -48216 30949 -303125 16751 65895 105849 238017
18144 238017 40261 -267659 -150607 3683 -518598 76265 -118367 273418 -1914 172920 -94815
18132 -57985 -117674 -191599 36917 -155275 51603 -11871 127804 -101961 -224499 -179870 226230
18120 68408 -319163 -254652 -215131 -2929 -70905 386857 -169673 -335556 336463 16478 -320513
$$ packed form
18201a21821K3207j5301c8389I2498d61207C01885b54560A52518J3588E1042b55354
18189F4859K14306a00237B1863R3020b7599D9239k1266b1775A90444o2423b78777
18177A61815a6775G235J05699J79545H4751J93j7613J4243d75988K07722R4170
18166a74096B5809K07640F1320c54347A12918a96039D26441A27024L26092A1449
18155f3461a0994l23032l4702a57160d8216C0949c03125A6751M9144L9954J32168
18144B38017D0261b67659J17052C683e18598G6265a18367B73418a914A72920i4815
18132e7985n9689p3925C6917a55275E1603a1871A27804a01961j22538M4629B26230
18120F8408c19163O4511L9521b929o7976C86857a69673j65883C36463A6478c20513
$$ plain form
18108 -53034 -119807 167441 290381 -195577 -48608 206170 128830 -42635 -315819 -156854
18097 -218115 16435 140169 -387081 -136408 -108567 -287703 376360 376815 -117147 -108923 -82501
18086 -82501 203494 -292018 177376 118089 -53076 -170018 -227409 326286 154444 61852
18075 63546 168963 -94282 14363 -122291 24762 -5357 131635 -51041 -8760 273402 96826
18063 94363 71516 -84956 167702 91072 39745 224312 -74257 99531 -60731 -273885 76254
18051 65372 235880 190405 -566242 21219 71144 -51431 -200487 53621 115951 78982 194509
18040 194509 -138641 -136216 180434 56756 -136978 121012 -74502 -118218 -7144 99130 150217
18029 150217 1278 -49021 215032 -112539 -181045 -26860 50027 -141175 37462 58970 182949
$$ packed form
18108e3034o6773A67441J22940a95577d8608B06170p7340d2635k73184a56854
18097b18115A6435J23734c87081a36408K7841j79136C76360M55a17147Q224K6422
18086h2501B03494b92018A77376n9287e3076j16942n7391C26286A54444F1852
18075F3546J05417i4282A4363a22291B4762e357A31635e1041h760B73402I6826
18063I4363k2847h4956A67702p6630C9745J84567g4257I9531f0731k13154G6254
18051F5372J70508m5475e66242B1219M9925e1431j49056E3621O2330l6969J15527
18040A94509a38641K425A80434E6756a36978A21012g4502m3716g144I9130N1087
18029A50217A278d9021B15032a12539o8506b6860E0027a41175C7462K1508J23979
$$ plain form
18018 182949 165719 -175855 73805 238377 45773 -120994 84669 -321559 230521 249880
18008 249880 125387 -88902 58722 -40752 -154640 -150096 192346 284334 242307 397816 -19862
17996 -4781 -68993 -95836 41473 34968 -52639 95740 114935 -216584 30925 -260946 -168109 -16696
17983 -211555 67104 -258425 124218 -89156 -47632 -246952 -228031 284164 9067 198117 151490
17972 151490 24609 155033 -102522 218186 232450 133253 133199 145515 -218266 60135 79082
17961 79082 -276994 -46151 -250406 -120732 -227252 207660 129714 162643 -188436 169721
17950 283677 115911 287576 11729 -149665 -53574 179529 -123010 153648 81115 -507 -203949
17939 -203949 -124840 174545 -188675 -66178 -391154 -262567 141640 -374884 85814 66834
$$ packed form
18018A82949j7230a75855G3805J64572D5773a20994H4669c21559B30521J9359
18008B49880j24493h8902E8722d0752j13888M544A92346R1988m2027J55509a9862
17996d781o4212k6843D1473o505e2639I5740J9195b16584C0925b60946R2837a6696
17983b11555F7104b58425A24218h9156M1524j99320J8921B84164I067J89050m6627
17972A51490B4609J30424a02522B18186J4264r9197n4J2316b18266F0135J8947
17961G9082b76994d6151k04255a20732j06520B07660p7946L2929a88436A69721
17950B83677A15911J71665A1729a49665e3574A79529a23010A53648p2533e07k03442
17939b03949P9109A74545a88675f6178l24976J28587A41640c74884H5814j8980
$$ plain form
17929 66834 9253 20108 -79519 14996 -105390 131919 -49361 -65798 336140 -155689 -10968
17917 85664 -128114 313313 121634 -176655 -343393 113848 314799 -19524 150976 59035
17906 -354723 -349734 -137359 134594 -73372 -193162 -11306 -65194 223056 129022 238648 -291236
17894 325237 339403 166506 -50695 7390 10599 147754 63483 -67760 -235259 -186503 -192114
17883 -192114 -78946 -45161 128274 -325380 -76660 132784 174747 -85806 422417 70962 189854
17872 189854 -30993 -414192 434610 -299418 -95895 90049 -8122 9837 46600 509928 -24953
17860 215000 375483 -91031 -337602 29418 -310078 -288631 145583 -371353 -116439 159001
17849 39793 -265986 -326 -75624 14810 -172466 -39232 -239780 116832 -177664 36986 6837
$$ packed form
17929F6834I253J0855g9519A4996a05390A31919d9361j6437C36140a55689a0968
17917H5664a28114C13313A21634a76655j66738A13848K00951a9524A50976E9035
17906c54723M989a37359A34594g3372j19790a1306n3888B23056r4034J09626b91236
17894C25237J4166A66506e0695G390L209J37155F3483f7760j67499M8756n611
17883a92114g8946L3785A28274c25380g6660A32784M1963h5806D22417G0962J18892
17872A89854c0993l83199D34610b99418i5895I0049h122I837L6763M63328b4953
17860B15000J60483i1031k46571B9418c10078K1447A45583c71353a16439A59001
17849C9793b65986c26p5298A4810a72466c9232k00548A16832a77664C6986F837
$$ plain form
17837 182919 -206166 43051 100081 456595 78100 -270431 312951 -61626 -96314 280942
17826 -44087 294499 180230 30416 -89402 99071 -9522 56243 3295 281600 -132615 146586
17814 -16938 33170 472986 136570 371010 -3445 -484 -1016 171994 204680 -30597 109580 102469
17802 102469 1040 -190953 286676 -117870 248856 -31502 66699 23875 194416 -408285
17791 273715 -108837 221014 -173763 13714 -27546 256290 294257 221778 80859 -95074 197758
17779 -39734 -121559 -54120 -166115 117031 277889 240881 138217 -96858 34333 -17865 350216
17767 -44873 187095 82932 524299 41221 80418 -198030 5020 61539 -167551 -17506 -39245
17756 -39245 -155320 -52672 115066 140444 162656 -43720 539652 -59601 -166914 641057 267394
$$ packed form
17837A82919b06166D3051N7030L56514G8100b70431C12951f1626l4688B80942
17826d4087B94499j14269C0416h9402I9071i522E6243C295K78305a32615A46586
17814a6938C3170M39816A36570K34440c445d84n32A71994L2686c0597A09580p111
17802A02469A040a90953B86676a17870B48856c1502F6699B3875J70541d08285
17791B73715a08837B21014a73763A3714b7546B56290L7967p2479H0859i5074A97758
17779c9734q1825e4120j11995A17031J60858l7008j02664i6858C4333a7865C50216
17767d4873A87095H2932M41367D1221L9197a98030E020N6519a67551a7506k1739
17756c9245j16075e2672A15066K5378K2212d3720E39652e9601j07313F41057B67394
$$ plain form
17744 75174 66895 45067 208799 -31011 160783 -9120 96712 81610 85919 -20895 165906 -57121
17731 142379 -173927 -117589 -58254 107345 25566 293035 -280742 34990 29587 48829 257221
17720 257221 -14331 -215903 137599 -95838 7061 332250 200710 274210 173754 322277
17710 322277 134870 -125824 224544 -173780 -198923 241451 147877 -56366 139144 -57776
17699 324517 124209 -326780 -66343 232388 81549 276811 -31996 374061 73859 155528
17689 155528 -59724 69604 175333 -142394 -98916 549157 95236 -90060 140975 29403 77120
17678 77120 -174064 1893 115716 -17567 -179033 -230680 83569 224487 244140 251380 323298
17667 323298 -9099 90475 -42348 74547 77988 42696 38549 254037 -40071 -202412 -353755
$$ packed form
17744G5174q279k1828J63732c1011A60783i120I6712j5102M309b0895A65906e7121
17731A42379a73927N6338e8254A07345B5566K67469b80742C4990n403J9242K08392
17720B57221a4331k01572A37599i5838G061L25189j31540P3500j00456J48523
17710C22277A34870a25824B24544a73780k5143B41451r3574e6366A39144e7776
17699C24517A24209c26780f6343B32388H1549J95262c1996C74061G3859Q1669
17689A55528e9724F9604J05729a42394M3478E49157I5236i0060A40975B9403M7717
17678G7120a74064A893J13823a7567j61466n1647H3569J40918J9653P240P1918
17667C23298i099I0475d2348G4547L441l5292m147K15488d0071j62341j51343
$$ plain form
17656 -353755 100933 160906 -287813 -296910 -102713 95872 227461 179653 86820 195846 -111445
17644 316776 3547 126851 85711 -19297 444577 76772 186191 111483 96101 77074 62871
17633 62871 192887 -47950 -223782 192799 235786 -130872 361117 123062 271454 -32784
17622 118046 31414 110720 36545 85956 28999 256232 273114 -75737 9653 333610 187744
17611 187744 -98421 105339 50712 344845 416042 38427 140931 -128230 226569 -17102
17600 -273329 -80162 104703 10800 -31116 158515 361274 31616 134038 180358 -36890 -28736
17589 -28736 -56850 23697 30591 -96736 -67102 321319 129783 185450 -37043 232449 99164
17577 -17958 57780 140608 330360 127162 -117774 62560 453555 454120 156318 331150 215980
$$ packed form
17656c53755A00933N9973b87813r097a02713I5872J31589m7808H6820J09026a11445
17644C16776C547J23304m1140a9297D44577G6772J09419p4708j5382j9027j4203
17633F2871J30016d7950j75832A92799M2987a30872C61117A23062J48392c2784
17622A18046C1414P9306C6545M9411B8999K27233J6882g5737I653L23957j45866
17611A87744i8421A05339E0712K94133P1197C8427J02504a28230B26569a7102
17600b73329h0162A04703A0800c1116A58515K02759C1616J02422M6320c6890Q154
17589b8736k8114B3697O894i6736K9634C21319A29783N5667c7043B32449I9164
17577a7958E7780Q2828J89752A27162a17774F2560L90995N65A56318J74832j15170
$$ plain form
17566 215980 419961 435728 199023 -67396 215902 -55684 -66489 357352 302781 504299
17556 504299 -88508 328749 37594 77384 340846 409251 277032 234507 190982 96629 407401
17545 407401 127103 120924 243306 236006 243744 277562 -66117 168135 377852 344759 23410
17533 203215 557515 491261 -119910 170246 256208 274486 254669 444279 1277961 861616
17523 861616 891957 1379842 956322 499608 291955 382420 161029 425206 193360 214324
17513 214324 329517 342567 416751 1007509 926589 1076447 1024461 964553 524303 559140 733220
17502 733220 586820 364277 98579 108484 438415 -10918 163669 308314 631278 227940
17491 396156 143513 29071 458237 47946 421305 373264 365384 249995 211241 450271 344924
$$ packed form
17566B15980K03981J5767A99023f7396B15902e5684j0805C57352n4571K01518
17556E04299h8508C28749C7594L9790K63462O8405j32219m2525m3525r4353L10772
17545D07401A27103o179J22382p300P738L3818f6117A68135K09717l3093B3410
17533B03215L54300o6254a19910A70246Q5962J8278j9817J89610Q33682m16345
17523H61616L0341M87885m23520m56714k07653R0465A61029K64177A93360K0964
17513B14324J15193J3050P4184N90758q0920J49858n1986n9908m40250L4837J74080
17502G33220j46400k22543I8579R905L29931a0918A63669J44645L22964B27940
17491C96156A43513B9071M29166D7946L73359m8041p880j15389l8754K39030j05347
$$ plain form
17480 344924 345174 449870 75764 137513 181801 225427 148861 78970 336583 405080 318543
17469 318543 370176 12405 202135 244260 263460 142394 393862 402278 -126287 148762 65973
17457 225606 241357 189666 307964 332643 372943 203181 401148 224636 170171 175316 494972
17446 494972 442629 514218 476894 545675 162937 78112 175514 518206 585642 203184 456336
17435 456336 602070 245256 411299 367237 266435 502970 333510 121570 532934 455752
17425 455752 107371 314624 496179 393872 129793 469716 504437 414550 221472 371165
17415 371165 287388 630282 318248 395269 397836 572924 147328 167504 440010 509026 501138
17404 501138 37564 179206 -46137 203490 -35519 229299 431259 649039 89506 102286
$$ packed form
17480C44924K50J04696G5764O1749M4288M3626p6566o9891K57613O8497q6537
17469C18543N1633A2405J89730M2125J9200j21066K51468Q416a26287A48762F5973
17457B25606J5751n1691J18298K4679M0300j69762J97967j76512n4465N145L19656
17446D94972n2343P1589l7324O8781A62937G8112R7402L42692O7436B03184K53152
17435D56336J45734B45256J66043m4062j00802K36535j69460A21570M11364p7182
17425D55752A07371K07253J81555j02307A29793L39923L4721q9887j93078J49693
17415C71165q3777L42894l12034P7021K567J75088A47328K0176K72506O9016p888
17404E01138C7564J41642d6137B03490c5519B29299K01960K17780H9506J2780
$$ plain form
17394 102286 104056 362582 345071 96583 387170 188889 125871 180477 236461 128869 32067
17382 652882 -6085 340502 213712 224482 118610 568918 68426 220879 210574 364770
17372 364770 326889 396956 532252 373485 -18206 229224 273450 620930 486601 25859
17361 67413 262264 -70120 135947 -24947 173925 92313 159201 411872 306498 46394 157727
17350 157727 508385 169333 182945 370718 433208 264971 -36236 40293 -22796 379031
17339 334843 91613 52654 489048 546225 -35500 124359 -174488 586770 -62097 435451
17328 189244 309763 689363 158831 21096 -1560 271444 83830 387313 217788 -21174
17317 152862 380762 397702 364616 283715 221112 154586 298961 334136 216143 383935 82819
$$ packed form
17394A02286J770K58526j7511I6583K90587A88889o3018N4606N5984j07592C2067
17382F52882f085C40502j26790J0770j05872M50308F8426J52453j0305J54196
17372C64770l7881P0067J35296j58767a8206B29224M4226L47480j34329B5859
17361F7413J94851g0120A35947b4947A73925q1612O6888K52671j05374D6394J11333
17350A57727L50658A69333J3612J87773O2490j68237c6236D0293b2796C79031
17339C34843I1613l8959M36394N7177c5500A24359a74488E86770f2097D35451
17328A89244J20519L79600A58831B1096a560B71444H3830L03483j69525b1174
17317A52862K27900J6940l3086q0901o2603o6526J44375L5175j17993J67792H2819
$$ plain form
17305 186294 500564 227752 450872 264387 139259 -128034 512466 60354 -16026 353032
17294 368160 286496 330256 298450 97065 91545 48615 397236 243929 644926 495078 350678
17283 350678 373826 110592 286239 251742 398671 25047 177870 490158 182472 344462
17273 344462 101116 154611 556751 382298 377466 385324 270516 245825 296679 321144 281301
17262 281301 426684 217336 172259 339299 267947 143972 320312 660850 219342 400953
17252 400953 209797 194824 283406 582408 631899 422377 264175 536505 609352 498435
17242 498435 565538 295556 273979 543756 347651 425666 702560 98335 318931 264027
17232 264027 266811 897142 320239 8577 309036 378349 321696 314340 372785 222414 128689
$$ packed form
17305A86294L14270B27752K23120j86485j25128a28034E12466F0354a6026C53032
17294C68160q1664M3760l1806I7065n520m2930L48621j53307M00997j49848j44400
17283C50678K3148A10592J75647l4497J46929B5047J52823L12288A82472J61990
17273C44462A01116N3495M02140j74453m832P858j14808k4691N0854K4465l9843
17262B81301J45383k09348m5077J67040p1352j23975J76340L40538B19342J81611
17252D00953j91156j4973Q8582K99002M9491k09522j58202K72330P2847j10917
17242D98435O7103k69982k1577K69777j96105P8015K76894I8335K20596n4904
17232B64027K784O30331C20239H577L00459O9313n6653p356N8445j50371r3725
$$ plain form
17221 128689 164858 325708 373686 340025 457528 339585 485113 345381 133307 378122
17211 378122 372893 456857 525268 468814 -38223 613066 306923 530854 503346 568086 439751
17200 439751 418560 532951 456137 662836 281332 223109 695421 216734 422330 505502
17190 505502 342186 475755 333887 588293 237954 373889 363793 687091 257939 260147
17180 260147 605034 513314 569337 338563 517750 525652 425349 307417 610163 569103
17170 569103 307967 410970 540030 524797 437212 434629 338519 484820 229543 662304
17160 662304 198971 753078 459002 574220 354491 437967 666667 424882 574196 300352
17150 300352 95840 325835 733304 493381 410828 135613 753372 449526 660637 404937
$$ packed form
17221A28689L6169J60850M7978l3661J17503j17943J45528j39732A33307K44815
17211C78122n229Q3964O8411n6454c8223F13066l06143K23931k7508O4740j28335
17200D39751k1191J14391p6814K06699B81332n8223M72312B16734K05596Q3172
17190E05502j63316J33569j41868K54406B37954J35935j0096L23298B57939K208
17180B60147L44887r1720N6023k30774J79187P902j00303j17932L02746m1060
17170E69103k61136J03003J29060j5233q7585k583r6110J46301B29543M32761
17160F62304A98971N54107k94076J15218k19729Q3476K28700k41785J49314k73844
17150C00352I5840K29995M07469k39923q2553A35613O17759l03846K11111k55700
$$ plain form
17140 404937 510961 348835 689520 562436 499902 656732 586052 427401 725830 512378
17130 512378 744471 535462 286606 274572 516733 378359 749125 633227 502997 700278
17120 700278 530724 849532 901686 285211 584679 690203 923236 601480 408340 660642
17110 660642 714260 716067 762639 289723 701362 501203 548110 660446 511501 310244
17100 310244 848030 600692 581697 1070331 613145 569816 647574 680465 772696 831199 735057
17089 735057 657812 393137 521471 582248 799580 699521 725190 581829 756746 520446
17079 520446 770979 528620 904934 469458 767460 675420 926150 717642 858555 928974
17069 928974 652235 633193 867115 911741 780413 887253 662087 945030 851392 1061969
$$ packed form
17140D04937J06024j62126L40685j27084o2534J56830p0680j58651K98429k13452
17130E12378K32093k09009k48856j2034K42161j38374L70766j15898j30230J97281
17120G00278j69554L18808N2154B85211K99468J05524K33033l21756j93140K52302
17110F60642N3618J807M6572B89723M11639k00159M6907J12336j48945k01257
17100C10244N37786k47338j8995M88634m57186m3329P7758L2891R2231N8503r6142
17089G35057p7245k64675J28334O0777K17332j00059K5669j43361J74917k36300
17079E20446K50533k42359L76314m35476K98002r2040K50730k08508J40913P0419
17069I28974k76739j9042K33922M4626j31328J06840k25166K82943r3638K10577
$$ plain form
17059 1061969 856453 794258 871668 821842 699439 1241665 1204550 900161 957550 742228
17049 742228 913507 654182 865740 723355 652150 913288 816395 1010706 883329 1188478
17039 1188478 781529 693003 928030 885160 975175 831221 963951 879346 1039027 1027037
17029 1027037 811254 996765 1031651 846345 630672 1080329 905563 714045 948109 1349624
17019 1349624 1089310 1119512 1044951 955026 1050157 1197148 1149110 773011 1169788 1055768
17009 1055768 1031879 979790 811240 1304771 997895 1060094 1364615 1369843 1472545 1207470
16999 1207470 1354203 972721 1086333 1271059 1230336 1525234 1239176 1607687 1103343 1520008
16989 1520008 1100091 1366976 1146610 1244858 1475190 1315686 1422017 1199907 1346286 1271714
$$ packed form
17059A061969k05516o2195P7410m9826j22403N42226l7115l04389N7389k15322
17049G42228J71279k59325K11558j42385p1205K61138r6893J94311j27377L05149
17039A188478m06949q8526K35027m2870R0015j43954J32730q4605J59681j1990
17029A027037k15783J85511L4886j85306k15673M49657j74766j91518K34064M01515
17019A349624k60314L0202p4561q9925R5131J46991m8038l76099L96777j14020
17009A055768k3889n2089j68550M93531l06876O2199L04521N228J02702k65075
16999A207470J46733l81482J13612J84726m0723K94898k86058L68511n04344M16665
16989A520008m19917K66885k20366R8248K30332j59504J06331k22110J46379p4572
$$ plain form
16979 1271714 1372979 1415707 1069142 1232822 1288161 1125659 1410508 1636787 1712381 1530091
16969 1530091 1874640 1557773 1463604 1812519 1359457 1417410 1599261 1690273 1788067 1461219
16959 1461219 1906506 1614475 1420666 1607454 1691596 1591081 1602039 1832667 2005524 1826947
16949 1826947 1817818 1756826 1762266 1651227 1949919 1964379 2143884 1893735 1983970 1696109 1706158
16938 1706158 1754458 2086268 2001955 1989659 1719449 2181837 1920983 2135672 2359321 2018244
16928 2018244 2140807 2113988 2123426 2162611 2340729 1943434 2178366 2185774 2250922 2492247 2193348
16917 2193348 2318969 2395310 2417288 2479942 2038303 2694409 2644615 2836760 2749557 2527484
16907 2527484 2543970 2848955 2685287 2852749 2595035 2846250 3228419 2973840 2815549 2662291
$$ packed form
16979A271714J01265M2728l46565J63680N5339j62502K84849K26279P5594j82290
16969A530091L44549l16867r4169L48915m53062N7953J81851R1012R7794l26848
16959A461219M45287k92031j93809J86788Q4142j00515J0958K30628J72857j78577
16949A826947r129o0992N440j11039K98692J4460J79505k50149R0235k87861J0049
16938A706158M8300L31810q4313j2296k70210M62388k60854K14689K23649l41077
16928B018244J22563k6819R438L9185J78118l97295K34932P408O5148K41325k98899
16917B193348J25621P6341K1978O2654m41639O56106m9794J92145q7203k22073
16907B527484J6486L04985j63668J67462k57714K51215L82169k54579j58291j53258
$$ plain form
16897 2662291 3095877 3109423 2973248 3121864 2885869 2997479 3148996 3035669 3226411 3312690
16887 3312690 3337334 3356451 3628059 3319052 3435331 3428587 3678839 3316087 3712367 3700997
16877 3700997 3868669 3694587 3841195 3757828 3815409 3801988 3828869 3746138 4292637 4272919
16867 4272919 3991721 4383823 4425673 4301872 4441346 4547460 4648658 4822264 4873133 5117892
16857 5117892 4617327 4817858 5085981 4908025 5257504 5246115 5284760 5545270 5686840 5775391
16847 5775391 5630681 5808579 5816636 5784219 6031254 5776326 6242265 6063265 6301740 6457157
16837 6457157 6551782 6285950 6742022 6756077 7382337 7089829 7454994 7222569 7853061 7422378
16827 7422378 7559333 8193517 8092471 8420782 8437630 8498815 8599958 8902478 9035880 9271010
$$ packed form
16897B662291M33586J3546j36175J48616k35995J11610J51517j13327J90742Q6279
16887C312690K4644J9117K71608l09007J16279o744K50252l62752L96280j1370
16877C700997J67672j74082J46608q3367N7581j3421K6881q2731N46499j9718
16867D272919k81198L92102M1850j23801J39474J06114J01198J73606N0869K44759
16857E117892n00565K00531K68123j77956L49479j1389L8645K60510J41570Q8551
16847E775391j44710J77898Q057l2417K47035k54928M65939j79000K38475J55417
16837F457157R4625k65832M56072J4055O26260k92508L65165k32425O30492m30683
16827G422378J36955O34184j01046L28311J6848O1185J01143L02520J33402K35130
$$ plain form
16817 9271010 9423492 9476109 9878745 9642078 10154294 10073489 10265036 10774167 11070961 11190944
16807 11190944 11152333 11643487 11751137 12129502 12238357 12624579 12991557 13123669 13625736
16798 13625736 13842722 14110819 14192809 14824987 15129601 15461663 15830307 15975653 17003616
16789 17003616 16961678 17458036 17719095 18155707 19065236 19731572 20081747 20596151 21001232
16780 21001232 21700215 22370221 22685071 23408636 24130761 24943477 25674332 26172968 27252164
16771 27252164 27732199 29080627 29855055 30676981 31387021 32570823 33392419 34616921 35719231
16762 35719231 37196173 38183684 39567619 40801337 42440814 43737352 45137968 46900802
16754 46900802 48551556 50177517 51990299 54138583 56073638 57743634 60164404 62010935
$$ packed form
16817I271010J52482N2617M02636k36667N12216q0805J91547N09131K96794J19983
16807A1190944l8611M91154J07650L78365J08855L86222L66978J32112N02067
16798A3625736K16986K68097Q1990O32178L04614L32062L68644J45346J027963
16789A7003616m1938M96358K61059M36612R09529O66336L50175N14404M05081
16780B1001232O98983O70006L14850P23565P22125Q12716P30855M98636J079196
16771B7252164M80035J348428P74428Q21926P10040J183802Q21596J224502J102310
16762C5719231J476942R87511J383935J233718J639477J296538J400616J762834
16754D6900802J650754J625961J812782K148284J935055J669996K420770J846531
$$ plain form
16746 62010935 64313465 66651364 69057896 71263972 73826031 76433616 79140438 81769705
16738 81769705 84154236 87246703 89975811 92875815 95294035 97869585 100280688 103029173
16730 103029173 105332834 108107813 109500583 111602988 113547352 114887875 116163919 117211111
16722 117211111 117725427 118532049 118625883 118239892 117707990 117194504 116032433 114803790 113009508
16713 113009508 111642869 109532724 107527099 105294708 102946424 100359175 97350356 94847124
16705 94847124 92268313 89368629 86819692 84006023 81269549 78312427 75889716 73459698
16697 73459698 70690853 68601144 66037674 63684434 61359293 59068160 57055427 55164023
16689 55164023 53278853 51355656 49269717 47917872 45952175 44474571 43143823 41565637
$$ packed form
16746F2010935K302530K337899K406532K206076K562059K607585K706822K629267
16738H1769705K384531L092467K729108K900004K418220K575550K411103K748485
16730A03029173K303661K774979J392770K102405J944364J340523J276044J047192
16722A17211111N14316Q06622R3834l85991n31902n13486j162071j228643j794282
16713A13009508j366639k110145k005625k232391k348284k587249l008819k503232
16705I4847124k578811k899684k548937k813669k736474k957122k422711k430018
16697G3459698k768845k089709k563470k353240k325141k291133k012733j891404
16689E5164023j885170j923197k085939j351845j965697j477604j330748j578186
$$ plain form
16681 41565637 40300401 38979185 37589898 36231908 35391790 34059600 32941406 31938397
16673 31938397 30994365 29832133 28906739 28162560 27268152 26454225 25607561 24861977 24150378
16664 24150378 23181780 22857376 22403887 21678585 21069680 20434512 19719970 19343896 18872283
16655 18872283 18497793 17773451 17429070 16942805 16575746 16212020 15893872 15261931 15053986
16646 15053986 14986047 14262629 13832142 13868523 13561939 13162123 13121164 12759736 12179166 11906343
16636 11906343 11544416 11582728 11081270 10659396 10553379 10465343 10594215 9941272 9988469 9651486
16626 9651486 9352788 9263576 9417796 9065392 9104039 8784083 8452000 8402361 8482329 8066543
16616 8066543 7931562 7859814 7630149 7253272 7223275 7223194 7121680 7015535 6485738 6750093
$$ packed form
16681D1565637j265236j321216j389287j357990q40118j332190j118194j003009
16673C1938397r44032j162232r25394p44179q94408q13927q46664p45584p11599
16664B4150378r68598l24404m53489p25302o08905o35168p14542l76074m71613
16655A8872283l74490p24342l44381m86265l67059l63726l18148o31941k07945
16646A5053986o7939p23418m30487L6381l06584l99816m0959l61428n80570k72823
16636A1906343l61927L8312n01458m21874j06017q8036J28872o52943M7197l36983
16626I651486k98698q9212J54220l52404L8647l19956l32083m9639P9968m15786
16616H066543j34981p1748k29665l76877k9997q1j01514j06145n29797K64355
$$ plain form
16606 6750093 7008481 6408350 6537207 6588294 6464207 6063511 6198740 5967253 5746550 5846688
16596 5846688 5389534 5708567 5582960 5127749 5394552 5120610 5173024 5239353 5100664 5106726
16586 5106726 4759037 4524368 4833586 4545973 4523230 4558095 4745306 4290446 4328865 4244192
16576 4244192 3901699 4255299 3925219 4368793 3848570 4441345 3974697 3720707 3647396 3622199
16566 3622199 4141217 3729062 3684563 4003040 3563065 3577653 3573691 3520338 3237644 3388881
16556 3388881 3647684 3514000 2997454 3217191 2956194 3294659 2981536 3127258 2795503
16547 2795503 3121804 3097194 2921231 2851468 2890711 3011284 2436733 2761874 2911905 2717960
16537 2717960 2738517 2459021 2910103 2908703 2609083 2767478 2509112 2567772 2182164 2347665
$$ packed form
16606F750093K58388o00131J28857N1087j24087m00696J35229k31487k20703J00138
16596E846688m57154L19033j25607m55211K66803k73942N2414O6329j38689O062
16586E106726l47689k34669L09218k87613k2743L4865J87211m54860L8419q4673
16576D244192l42493L53600l30080M43574n20223N92775m66648k53990p3311k5197
16566C622199N19018m12155m4499L18477m39975J4588l962n3353k82694J51237
16556C388881K58803j33684n16546K19737k60997L38465l13123J45722l31755
16547B795503L26301k4610j75963o9763L9243J20573n74551L25141J50031j93945
16537B717960K0557k79496M51082j400k99620J58395k58366N8660l85608J65501
$$ plain form
16527 2347665 2381785 2060149 2114056 2356935 2527574 2389950 2210969 2217570 1756604 2176564
16517 2176564 2106382 2314618 2287459 2363236 1920709 2048396 2371798 2484187 2051410 1890437
16507 1890437 1967681 2076853 1999124 2107594 2092332 1823361 1981913 1943597 1883948 1538721
16497 1538721 1619309 1638496 1850358 1747379 1920789 1587262 1627038 1819594 1721876 1625964
16487 1625964 1620733 1704664 1562618 1538449 1323645 1420433 1514686 1841502 1446570 1684484
16477 1684484 1212932 1456610 1307594 1484421 1648315 1424024 1782535 1361409 1254597
16468 1254597 1384207 1425447 1418020 1491315 1367556 1310741 1180307 1243068 1535588 1513581 1672104
16457 1672104 1444284 1459407 1479646 1416182 1292176 980955 1145833 1365541 1196959 918553
$$ packed form
16527B347665L4120l21636N3907K42879J70639j37624j78981O601m60966M19960
16517B176564p0182K08236k7159P5777m42527J27687L23402J12389m32777j60973
16507A890437P7244J09172p7729J08470j5262k68971J58552l8316n9649l45227
16497A538721Q0588J9187K11862j02979J73410l33527L9776J92556r7718r5912
16487A625964n231Q3931j42046k4169k14804R6788R4253L26816l94932K37914
16477A684484m71552K43678j49016J76827J63894k24291L58511m21126j06812
16468A254597J29610M1240p427P3295j23759n6815j30434O2761K92520k2007J58523
16457A672104k27820J5123K0239o3464j24006l11221J64878K19708j68582k78406
$$ plain form
16447 918553 1218206 1092093 1130484 1270658 1296101 1401487 974464 1224448 973486 1450640
16437 1450640 1512454 894810 1154510 1178508 1181112 1073253 1007354 1234257 842050 1319787
16427 1319787 1179089 1118545 1371870 1379870 1043960 758173 864806 1130308 1004152 1219224
16417 1219224 1140102 1168606 855190 1424442 636794 993714 671042 1071065 1105597 879575
16407 879575 840009 999095 1193690 990883 813739 826242 911052 1027702 547230 980408
16397 980408 692634 830356 919679 819616 1115630 904957 843641 1006237 931986 898402
16387 898402 678577 667265 691422 1072269 824839 753654 689275 756430 754783 538213 902785
16376 902785 758327 660947 700955 721256 842736 890726 848013 852958 652542 634722 538857
$$ packed form
16447I18553K99653j26113L8391J40174K5443J05386m27023K49984k50962M77154
16437A450640O1814o17644K59700K3998K604j07859o5899K26903l92207M77737
16427A319787j40698o0544K53325Q000l35910k85787J06633K65502j26156K15072
16417A219224p9122K8504l13416N69252F36794L56920l22672M00023L4532k26022
16407H79575l9566J59086J94595k02807j77144J2503Q4810J16650m80472M33178
16397I80408k87774J37722Q9323j00063K96014k10673o1316J62596p4251l3584
16387H98402k19825j1312K4157L80847k47430p1185o4379O7155j647k16570L64572
16376I02785j44458r7380M0008K0301J21480M7990m2713M945k00416j7820r5865
$$ plain form
16365 538857 665197 683187 710632 991731 435865 687329 691094 632558 563820 957219 628630
16354 628630 950355 550044 633786 686952 665954 411349 1206245 227975 634684 683722
16344 683722 905091 552237 723765 222315 682614 385493 731498 683148 683948 684493 448345
16333 448345 524563 663908 504140 480823 369748 469514 925413 831858 860663 334837
16322 770802 701363 529823 365211 629746 390361 610632 635742 474573 395652 665115
16312 665115 507299 528118 344078 420365 653688 354637 488508 278235 507475 455735
16302 455735 504945 576382 599527 687370 689719 440896 605059 481942 341230 585868 513640
16291 513640 780354 614279 557353 389740 612473 474038 686661 690505 234304 529061
$$ packed form
16365E38857J26340J7990K7445K81099D35865K51464L765n8536o8738L93399l28589
16354F28630L21725m00311Q3742N3166k0998k54605P94896B27975M06709M9038
16344F83722K21369l52854J71528B22315M60299k97121L46005m8350Q00N45k36148
16333D48345P6218J39345j59768k3317j11075R9766M55899r3555K8805C34837
16322G70802o9439j71540j64612K64535k39385K20271K5110j61169p8921K69463
16312F65115j57816K0819j84040P6287K33323k99051J33871k10273K29240n1740
16302D55735M9210P1437K3145Q7843K349k48823J64163j23117j40712K44638p2228
16291E13640K66714j66075n6926j67613K22733j38435K12623L844B34304K94757
$$ plain form
16281 529061 843160 748019 408287 502598 334397 256062 539578 405941 579694 419874
16271 419874 429351 444304 397849 537883 476016 410492 482313 318046 576552 153613 306152
16260 306152 277661 402038 672542 614775 432628 512302 225379 493347 731215 235107
16249 197007 763129 289188 183664 743977 188803 570099 177292 336183 442794 570570
16239 570570 510242 362651 402827 388624 192140 417577 350188 235077 302253 576042
16229 576042 279399 360488 140160 423023 217277 531490 492251 842618 294052 539857
16219 539857 428338 406080 431882 320071 184966 540677 133277 74846 35643 377508
16209 377508 409980 162470 442839 43490 502650 266546 274201 146029 103361 223891
$$ packed form
16281E29061L14099r5141l39732R4311j68201p8335K83516j33637J73753j59820
16271D19874R477J4953m6455J40034o1867o5524P1821j64267K58506A53613J52539
16260C06152k8491J24377K70504n7767j82147P9674B25379K67968K37868B35107
16249A97007N66122B89188j05524N60313A88803L81296A77292J58891J06611J27776
16239E70570o0328j47591M0176j4203A92140K25437o7389j15111O7176K73789
16229E76042B79399Q1089A40160K82863k05746L14213l9239L50367B94052K45805
16219E39857j11519k2258K5802j11811j35105L55711A33277n8431C5643L41865
16209C77508L2472A62470K80369D3490M59160k36104P655j28172m2668J20530
$$ plain form
16199 223891 544758 512119 263974 -182173 210186 117422 396321 265809 189054 112641
16189 112641 430839 68383 334925 163812 -36329 105846 249982 284364 175560 234922
16179 234922 286479 352366 128150 115626 468564 243038 184368 361540 343168 -136248
16168 249637 -17672 -68089 -44575 598500 421033 94376 291841 238667 409117 626496
16158 626496 -76505 -76895 167189 171974 302795 10830 108364 18325 5264 608703 251350
16146 335626 304768 137896 93899 168599 44279 351522 376536 89420 620874 266124 -93813
16134 62776 579945 -41889 237652 147579 354730 333747 104007 -13344 -295861 288090
16123 45493 137901 369997 342867 382777 82440 -97767 123810 408474 -138702 166456 394067
$$ packed form
16199B23891L20867l2639k48145a82173B10186r2764K78899j30512p6755p6413
16189A12641L18198F8383K66542A63812c6329A05846J44136L4382j08804N9362
16179B34922N1557O5887A28150j2524L52938k25526n8670J77172j8372a36248
16168B49637a7672n0417K3514E98500j77467I4376J97465n3174J70450K17379
16158F26496g6505l90A67189M785J30821A0830R7534A8325E264O03439B51350
16146C35626l0858A37896m3997P4700D4279L07243K5014H9420N31454B66124i3813
16134F2776N17169d1889B37652r0073K07151k0983A04007a3344k82517B88090
16123D5493R2408K32096k7130L9910H2440i7767A23810K84664a38702A66456K27611
$$ plain form
16112 394067 105555 10144 149245 228361 455202 364408 -248840 225023 -233822 259506
16101 -176666 30428 -77311 370746 76099 189544 210689 108316 106674 -37330 95901 174529
16090 174529 423376 55904 93776 154783 158701 252314 253322 334845 75707 78308 -135911 -64035
16077 95391 23443 54367 -255759 128243 47696 84052 48793 51831 -7411 186562 22265
16065 -98415 87264 208844 173675 -22227 -45017 -352078 260563 236542 139568 535 -132392
16053 104612 150215 -24105 184136 130254 188202 -34861 182652 -91979 -106924 332219 80914
16041 -88877 -80804 -90258 -428569 -37814 -18601 411065 410164 -132071 -41347 184686 235364 -276648
16028 436100 83054 146649 278827 -11379 327783 -12311 -31694 -172103 354692 20732 -214286
$$ packed form
16112C94067A05555A0144J39101P9116K26841r0794b48840B25023b33822B59506
16101a76666C0428g7311C70746G6099J13445K1145j02373j642c7330I5901P8628
16090A74529K48847E5904L7872O1007L918R3613J008Q1523G5707K601a35911f4035
16077I5391B3443L0924b55759A28243D7696L6356l5259L038g411A86562B2265
16065i8415H7264J21580l5169b2227k2790l07061B60563k4021r6974E35a32392
16053A04612M5603b4105A84136n3882N7948c4861A82652i1979j4945C32219H0914
16041h8877Q073r454l38311c7814a8601D11065r01a32071d1347A84686N0678b76648
16028D36100H3054O3595J32178a1379C27783a2311j9383j40409C54692B0732b14286
$$ plain form
16016 247415 176987 113362 72825 -105701 238799 217861 250447 125052 55647 -50099 462317
16004 47976 -96894 83303 -168607 344985 -335983 -198990 153350 88470 23368 -105002
15993 -104399 169230 -168435 110630 297316 264812 539147 710130 638066 1421181 1115401
15983 1115401 1385602 702446 794956 559753 -73272 189496 167919 38284 278801 14762
15972 374052 -156579 -144329 -41573 -235910 -89174 15817 48245 91762 43796 126932 -109516
15960 -132205 97467 161141 -67108 22899 -105758 69708 -183983 -95416 -15788 329164 3393
15948 -120232 278406 35181 103188 91846 190469 -2916 -255394 -242947 -9058 -137674 235776
15936 74543 204360 54276 -39762 66726 242593 -23645 -82389 204237 -302411 -84203 95237
$$ packed form
16016B47415p0428o3625m0537a05701B38799k0938L2586A25052E5647e0099D62317
16004D7976i6894H3303a68607C44985c35983J36993A53350o4880B3368a05002
15993a04399A69230a68435A10630J86686l2504K74335J70983p2064P83115l05780
15983A115401K70201o83156R2510k35203g3272A89496k1577C8284K40517A4762
15972C74052a56579J2250d1573j94337h9174A5817L2428M3517D3796Q3136a09516
15960a32205I7467O3674f7108B2899a05758F9708a83983Q8567a5788C29164C393
15948a20232B78406C5181O8007j1342R8623b916k52478J2447i058j28616B35776
15936G4543J29817E4276c9762F6726J75867b3645n8744B04237c02411h4203I5237
$$ plain form
15924 234397 -62158 17214 -170300 -125750 9419 253500 -42513 -211640 -79234 -163309 26566
15912 -162601 -133521 285456 -520615 85063 9890 -61202 -156778 -89922 122848 270145 6301
15900 110378 108217 -157217 -211042 -401658 40663 -109907 74042 -97819 -73655 -168933 -11611
15888 182583 -214659 -59216 199683 -38967 302283 85805 156519 -121862 -207430 217925
15877 169439 -217355 91884 16850 198283 5813 40153 236898 533073 -78217 -30107 -144736
15866 -144736 -413848 96880 -73602 -71316 -88693 -227478 -134550 -271499 -83756 -151265 -208932
15855 -208932 43050 -7882 -5028 -93581 -168994 193378 4622 183353 118587 -101993 431856
15843 122830 2682 -7343 -141652 54250 -130296 50346 -226614 -30616 17346 4680 -105244
$$ packed form
15924B34397f2158A7214a70300M4550I419K44081d2513j69127g9234q4075B6566
15912a62601K9080B85456e20615H5063I890f1202r5576O6856A22848J47297F301
15900A10378k161a57217n3825j90616D0663a09907G4042i7819K4164r5278a1611
15888A82583b14659e9216A99683c8967C02283H5805P0714a21862q5568B17925
15877A69439b17355I1884A6850J81433E813L4340J96745K96175g8217c0107j14629
15866a44736k69112I6880g3602K286j7377j38785R2928j36949h3756o7509n7667
15855b08932D3050g882K854q8553p5413A93378D622J78731o4766a01993D31856
15843A22830B682g343j34309E4250a30296E0346b26614c0616A7346D680a05244
$$ plain form
15831 -224926 -59865 35782 -132198 -323067 167469 244161 138953 -46597 -85892 -265535
15821 -265535 -95561 157757 -42166 -87037 -202321 359913 70878 -374074 -182073 -192839
15811 -192839 240180 -120968 -138425 -360703 118684 -133951 -65355 -169207 -357309 -50356
15800 195380 -173406 -13440 97898 -46148 -118811 86004 -339926 -284225 -97801 348927 27869
15788 75046 -49720 44360 159822 20500 8253 76014 76838 -281454 40922 -93065 213635 85142
15775 -131383 -176820 -147955 11855 -116878 -23636 36611 158329 142570 -135139 -20760 -28646
15764 -28646 131212 215412 23500 -47539 -100391 -34763 -64831 -188446 24854 -72326 -218013
15753 -218013 97379 72179 92971 192291 -992 -129138 42961 -295873 242594 -87555 -327771
$$ packed form
15831b24926e9865C5782a32198j90869A67469P6692j05208d6597l9295j79643
15821b65535i5561A57757d2166m4871j15284C59913G0878c74074a82073j0766
15811a92839B40180a20968j7457k22278A18684a33951f5355j03852j88102e0356
15800A95380a73406a3440I7898d6148p2663H6004c39926N5701i7801C48927B7869
15788G5046d9720D4360J15462B0500H253O7761Q24b81454D0922i3065B13635H5142
15775a31383m5437K8865A1855a16878b3636C6611J21718j5759a35139b0760p886
15764b8646A31212Q4200B3500d7539n2852c4763l0068j23615B4854g2326j45687
15753b18013I7379k5200K0792R9320i92j28146D2961b95873B42594h7555k40216
$$ plain form
15742 -327771 77135 13856 51175 -168876 211784 -252135 10697 127193 -56500 285982
15731 -121907 136321 238366 -12945 3233 59072 -440748 -118532 -34803 -88661 192450 -44783
15719 153579 -163591 -148089 -82538 1344 118025 -134573 -113543 168679 -136214 17425 114051
15708 114051 -353148 -219292 291127 -243768 -14548 -140575 252034 254793 -389848 -258311
15698 -258311 235349 157572 -153523 5301 137486 -64666 -63410 129801 353976 -84980 84341
15686 -248852 307426 27253 -84822 -67039 19297 -115074 134242 -192604 2535 -140945 -56210
15674 163400 319410 -73196 64979 -133176 77509 143020 188432 -90788 178226 45955 229483
15663 229483 58926 -111884 -79729 -188568 175820 86414 -3571 -174815 -6263 34747 345244
$$ packed form
15742c27771G7135A3856L7319a68876B11784b52135A0697J16496e6500B85982
15731a21907A36321J02045a2945C233N5839d40748a18532c4803n3858A92450d4783
15719A53579a63591J5502O5551A344J16681a34573K1030A68679a36214A7425R6626
15708A14051c53148J33856B91127b43768a4548j26027B52034K759c89848J31537
15698b58311B35349p7777a53523E301J32185f4666J256A29801K24175h4980H4341
15686b48852C07426B7253h4822J7783A9297a15074A34242a92604B535a40945e6210
15674A63400J56010g3196F4979a33176G7509O5511M5412i0788A78226D5955J83528
15663B29483E8926a11884L2155j08839A75820H6414c571j71244f263C4747L10497
$$ plain form
15652 345244 -11326 -228676 -141200 109393 -266704 -174976 -61417 297372 263329 -255664
15641 -32235 -406478 -93779 -84039 34506 151505 -130028 -308433 -130757 197957 -203228
15630 220959 -270999 -86927 321950 445789 207535 84244 -54453 52497 85154 53140 147717
15619 147717 76822 11720 55320 -65976 111787 -48101 130056 21381 -1942 -54507 -204304
15608 -204304 189953 -116313 -43509 182584 -211590 -194444 220903 -408335 -321658 -107087
15597 6065 -67642 -406605 -129050 -106452 -44764 75912 -85891 152284 151138 -9743 -122410
15586 -122410 103030 121887 307051 1970 26594 -145367 232091 13467 191781 -65373 283794
15574 -302463 166505 13331 8287 38470 -127784 102338 134002 -179558 -118036 -92265 37254
$$ packed form
15652C45244a1326k17350Q7476A09393b66704R1728f1417B97372l4043b55664
15641c2235l74243i3779R740C4506J16999a30028j78405a30757A97957b03228
15630B20959b70999h6927C21950J23839B07535H4244e4453E2497L2657l2014R4577
15619A47717p0895A1720M3600f5976A11787d8101A30056B1381a942n2565j49797
15608b04304A89953a16313d3509A82584b11590J7146B20903d08335Q6677a07087
15597F065f7642l38963a29050K2598d4764G5912h5891A52284j146i743j12667
15586a22410A03030J8857J85164A970K4624a45367B32091A3467J78314f5373B83794
15574c02463A66505A3331n044L0183a27784A02338L1664a79558O1522K5771C7254
$$ plain form
15562 246271 60267 74661 -98710 185911 -213942 -18207 -319345 -69703 -240229 58594 -256974
15550 177681 -169847 -29524 145674 337438 -60740 -109120 96167 130417 -168906 -65099 215898
15538 235446 -84228 -84542 -65078 23891 -5275 23572 55806 -5424 190934 -119539 -265065 -85235
15525 -76761 -334621 322040 -444986 61983 -5255 99237 134959 26531 -82633 146324 46007
15513 -53398 295639 354740 173870 -3080 356882 367610 -141129 -15087 -6822 331103 -20475
15501 -124966 101455 100518 84716 429266 -65079 -160969 -40435 -100806 43268 -86986 -215607
15490 -215607 207663 249443 109263 439072 156534 -57903 28064 287367 273186 -106691
15479 23629 19009 186532 249513 390384 340934 362704 442376 369447 572056 173531 -110983
$$ packed form
15562B46271F0267J4394i8710A85911b13942a8207l01138f9703j70526E8594b56974
15550A77681a69847b9524A45674J91764f0740m8380I6167L4250a68906f5099B15898
15538B35446h4228l14J9464B3891e275B3572L2234e424A90934a19539j45526h5235
15525g6761k57860C22040d44986F1983e255I9237L5722B6531h2633A46324D6007
15513e3398B95639N9101A73870c080C56882J0728a41129a5087f822C31103b0475
15501a24966A01455r37j5802L44550f5079r5890d0435o0371D3268h6986j28621
15490b15607B07663M1780A09263L29809A56534e7903B8064K59303j4181a06691
15479B3629m620J67523O2981J40871m9450K1770P9672p2929K02609A73531a10983
$$ plain form
15467 207418 -166469 -158475 340142 126301 -115242 -343984 270176 177878 -156154 -157277
15457 -157277 -84694 -70506 -50082 77139 346466 120204 -64518 241850 -280233 -99628 537735
15445 359807 477861 601633 386856 433952 859057 1086348 982247 631596 679518 393604
15435 393604 48103 24368 8653 -61641 -86658 -33476 194397 214243 -68902 400912 -51193
15423 -288769 -88719 -274551 182812 -21035 177199 11027 -274872 45040 -78240 -216442
15413 -216442 192530 -15085 268307 94336 -184519 -226963 14068 173855 14351 -201472
15402 139103 -32414 28825 253912 -108333 -102223 77285 79203 -519813 -30066 -30264 -71647 -71784
15390 -71784 -115855 -161228 106881 -7560 95175 535309 124751 210688 134189 159517 204928
$$ packed form
15467B07418a66469P994C40142A26301a15242k28742B70176r2298a56154j123
15457a57277P2583J4188K0424G7139K69327A20204f4518B41850b80233i9628E37735
15445C59807J18054J23772k14777M7096M25105K27291j04101l50651M7922k85914
15435C93604D8103k3735H653f1641k5017c3476A94397J9846f8902D00912e1193
15423b88769h8719j85832A82812b1035A77199A1027b74872D5040g8240j38202
15413b16442A92530a5085B68307I4336a84519m2444A4068J59787A4351b01472
15402A39103c2414B8825K25087a08333O110G7285J918e19813c0066j98m1383j37
15390g1784m4071m5373A06881g560I5175M40134A24751Q5937p6499K5328M5411
$$ plain form
15379 204928 96271 -159919 -59556 48426 13901 264282 420386 229139 53801 323958
15369 323958 240597 -80288 56871 13890 107932 216968 -51556 304231 200290 211636 -99781
15357 252391 50028 290882 168416 -161161 66377 -28159 152787 175090 150504 259926
15347 259926 363527 224996 12120 220645 530442 425185 241656 -93935 72759 127657
15337 127657 -68067 239498 201678 -19179 -101071 332596 187925 32232 317465 179286
15327 179286 407423 366401 -41946 385607 105500 17515 -61858 -262977 -44989 -112595 -120380
15316 -120380 -77495 394930 -175008 421838 79188 321294 572113 431540 524976 56261
15305 -44258 252367 261235 178232 156926 185996 -233061 -44698 84935 209790 105663 43182
$$ packed form
15379B04928I6271a59919e9556D8426A3901K50381J56104j91247E3801K70157
15369C23958q3361h0288E6871A3890R4042J09036e1556C04231j03941J1346i9781
15357B52391E0028K40854j22466a61161F6377b8159A52787K2303k4586J09422
15347B59926J03601j38531A2120K08525L09797j05257j83529i3935G2759N4898
15337A27657f8067B39498l7820a9179q1892C32596j44671C2232K85233j38179
15327A79286K28137m1022d1946C85607A05500A7515f1858k01119d4989o7606p785
15316a20380M2885C94930a75008D21838G9188K42106K50819j40573R3436E6261
15305d4258B52367Q868q3003k1306K9070b33061d4698H4935J24855j04127D3182
$$ plain form
15293 72456 -14177 245618 234681 -97943 -88032 -153495 69197 -61444 -13796 474993 -17774
15281 177108 -27108 -66793 -92317 129768 111677 -111281 210965 93312 61423 -24884 397989
15269 257159 205915 -63586 -52187 -81525 -93257 -10113 -66208 86297 185986 116989 -25858
15257 -278089 -67317 379079 28386 -98238 -54130 -45624 221651 130171 -19840 -20004 33936 135926
15245 135926 54510 218998 642717 1929094 1861808 1536101 2376361 1003829 182704 323552
15235 323552 255104 -131675 9170 -281792 187148 29202 -220014 61357 -59092 -175703 157617
15223 360142 9919 -97235 300899 310324 411817 42296 -186306 86476 116576 88835 -256899
15211 133332 218302 228211 444958 121801 494369 -68785 -17213 54748 460347 82252 89304
$$ packed form
15293G2456a4177B45618j0937i7943R911o5463F9197f1444a3796D74993a7774
15281A77108b7108l9685k5524A29768j8091a11281B10965I3312l1889b4884C97989
15269B57159n1244f3586J1399k9338j1732a0113n6095H6297R9689o8997b5858
15257b78089f7317C79079B8386i8238M4108Q506B21651r1480a9840j64C3936J01990
15245A35926E4510J64488M23719J286377o7286l25707Q40260A003829A82704J40848
15235C23552o8448a31675I170b81792A87148B9202b20014F1357e9092j16611A57617
15223C60142I919i7235C00899R425J01493D2296a86306H6476L0100k7741b56899
15211A33332Q4970R909K16747A21801L72568f8785a7213E4748M05599H2252P052
$$ plain form
15200 89304 182578 62652 -107270 158117 -17655 413386 -28778 234694 197929 266247 121007
15188 3720 171977 388041 62612 205801 73329 202770 148857 198569 219977 227024 138600
15177 138600 -107390 18987 91101 8733 369807 28127 -27853 -151112 149927 -73135 154298
15165 175776 174419 52560 -240011 5720 155742 -43572 -195548 39089 142914 67508 259403
15154 259403 6615 20813 211808 71518 18825 334641 8177 428871 179599 -148620 227796
15142 72279 45600 38959 252116 -6673 -955 -42086 239469 -12107 176316 -192201 238161
15130 146011 161024 283450 44978 -83439 64948 229296 221226 -5581 626149 451033 398192
15119 398192 366761 832239 339381 406518 153874 332726 -112398 -4629 328405 15439
$$ packed form
15200H9304R3274F2652a07270A58117a7655D13386b8778B34694l6765O8318A21007
15188C720J68257K16064F2612J43189G3329J29441n3913M9712K1408P047q8424
15177A38600a07390A8987P2114H733L61074B8127b7853j23259A49927g3135A54298
15165A75776j357E2560b40011E720J50022d3572j51976C9089J03825F7508J91895
15154B59403F615J4198J90995G1518A8825L15816H177M20694A79599a48620B27796
15142G2279k6679o641K13157f673i55m1131B39469a2107A76316a92201B38161
15130A46011J5013J22426D4978h3439F4948J64348q070e581F26149j75116n2841
15119C98192l1431M65478C39381O7137A53874J78852a12398d629C28405A5439
$$ plain form
15108 15676 -62448 315996 -37483 257969 186505 11899 -45162 -141646 371156 -77232 -63861
15097 -63861 -137279 -226346 23304 150889 -242521 326543 86924 110580 -106493 90287 9250
15085 34305 92344 238210 75974 12557 -12694 140447 422799 151010 279567 264512 -14917
15073 -29002 345277 176906 270120 215887 67458 85314 -61797 58682 -68327 290224 -21773
15061 63011 90224 252379 135469 512496 292599 422134 168076 283949 44383 40479
15051 40479 403260 444668 -31737 591234 519324 291911 423701 192071 361877 441184
15041 441184 90997 331491 465883 69162 225319 65690 492688 99882 468368 178205
15030 531745 547851 985819 435405 676665 732248 481879 395121 506216 672298 622164
$$ packed form
15108A5676f2448C15996c7483B57969p1464A1899d5162r6484C71156g7232J3371
15097f3861p3418q9067B3304J27585b42521C26543H6924K3656a06493I0287I250
15085C4305N8039J45866G5974A2557a2694A40447K82352A51010J28557j5055a4917
15073b9002C45277j68371R3214n4233F7458J7856f1797E8682f8327B90224b1773
15061F3011K7213J62155j16910L77027k19897J29535A68076J15873D4383l904
15051D0479L62781M1408c1737E91234p1910k27413J31790A92071J69806P9307
15041D41184I0997K40494J34392F9162J56157F5690M26998I9882L68486A78205
15030E31745J6106M37968D35405K41260N5583k50369q6758J11095J66082n0134
$$ plain form
15020 622164 685233 610225 294918 550507 647357 205073 170823 538596 497527 228627
15009 489327 50922 258243 232703 10634 568677 299849 204638 151489 221130 618115 309917
14998 309917 397721 575122 333248 367425 26036 418266 622454 556316 343418 501867
14988 501867 619450 709253 235026 296925 398201 511232 508040 831463 962533 516944
14978 516944 243034 747720 674221 387289 642702 599917 456084 655421 313780 942353
14968 942353 514432 624871 340938 574074 457154 455406 40582 228898 550247 425402
14958 425402 225669 314982 87393 377824 120542 699721 365836 -97230 317119 317069 738581
14947 738581 113608 179480 669246 502777 496593 624493 675324 341264 251924 328828 454292
$$ packed form
15020F22164O3069p5008B94918K55589R6850B05073l4250L67773m1069B28627
15009D89327E0922K07321k5540A0634N58043k68828r5211n3149O9641L96985l08198
14998C09917Q7804J77401k41874L4177B6036L92230K04188o6138k12898J58449
14988E01867J17583Q9803B35026O1899J01276J13031l192L23423J31070m45589
14978E16944B43034N04686p3499k86932K55413m2785j43833J99337C13780O28573
14968I42353m27921J10439k83933K33136j16920j748D0582J88316L21349j24845
14958D25402j99733Q9313H7393K90431A20542N79179l33885i7230C17119n0M21512
14947G38581A13608O5872M89766j66469o184J27900N0831l34060q9340P6904J25464
$$ plain form
14936 454292 381178 321530 611535 441474 875962 876942 1036584 1059669 1153709 1065781 1389931
14925 1389931 1670227 1478106 1522331 1488406 1541653 1292370 1764526 1668471 2056329 2212847
14915 2212847 1888574 1584696 1409164 1419616 1358277 1089978 938742 397129 507944 379898
14905 379898 467695 484289 541562 437035 851884 537391 180592 -101514 466417 518213
14895 518213 312135 529009 251092 304813 377213 565103 185372 653006 573256 479381
14885 479381 646421 1136389 828603 789208 542180 836731 587762 870051 786208 552146
14875 552146 503393 535842 405980 519301 669574 1024873 239780 594590 697037 656106
14865 656106 610068 1032931 575220 779403 250010 364645 210380 517354 318426 238441
$$ packed form
14936D54292p3114n9648K90005j70061M34488R80J59642K3085R4040q7928L24150
14925A389931K80296j92121M4225l3925N3247k49283M72156r6055L87858J56518
14915B212847l24273l03878j75532J0452o1339k68299j51236C97129J10815j28046
14905C79898Q7797J6594N7273j04527M14849l14493A80592a01514D66417N1796
14895E18213k06078K16874B51092N3721P2400J87890A85372M67634p9750r3875
14885D79381J67040M89968l07786l9395k47028K94551k48969K82289q3843k34062
14875E52146m8753L2449j29862J13321J50273L55299B39780L54810J02447m0931
14865F56106m6038M22863m57711K04183B50010J14635j54265L06974j98928p9985
$$ plain form
14855 238441 407277 369100 599606 487000 498114 349421 30843 285392 595087 562949
14845 562949 724266 720634 811702 1084361 1199798 1065071 867860 1045537 723364 806569
14835 806569 1009007 747635 885336 696527 532496 376347 629751 714839 375781 569686
14825 569686 154031 485932 758570 594668 936774 668207 889538 840233 894912 914743
14815 914743 648818 611865 596317 391937 350618 729680 611887 655142 787743 731819
14805 731819 1011820 720123 1115182 991193 802020 943003 586250 906515 469838 382341
14795 382341 494449 386655 652222 675738 655705 806753 489751 500940 681197 805365
14785 805365 623699 499212 459231 440154 470295 658462 804903 794775 832273 821059 1086680
$$ packed form
14855B38441J68836l8177K30506j12606J1114j48693C0843K54549L09695l2138
14845E62949J61317l632R1068K72659J15437j34727j97211J77677l22173Q3205
14835H06569K02438k61372J37701j88809j64031j56149K53404Q5088l39058J93905
14825E69686A54031L31901K72638j63902L42106k68567K21331m9305N4679J9831
14815I14743k65925l6953j5548k04380m1319L79062j17793M3255J32601n5924
14805G31819K80001k91697L95059j23989j89173J40983l56753L20265m36677q7497
14795C82341J12108j07794K65567K3516k0033J51048l17002J1189J80257J24168
14785H05365j81666j24487l9981j9077L0141J88167J46441j0128L7498j1214K65621
$$ plain form
14774 1086680 877955 1084186 1064282 907894 792299 1082412 468711 910424 797488 751973
14764 751973 954647 698734 657229 536464 523791 395005 771142 424175 1090152 644993
14754 644993 430184 295902 741768 513959 843946 626063 891124 671463 579832 823914
14744 823914 820459 835738 624552 701630 871764 987844 927139 433045 598033 938986
14734 938986 1119353 1078245 917368 803917 806730 1133045 1413007 1657227 1669859 2008085
14724 2008085 1755892 1456340 1288974 1118957 974304 897059 675149 986138 937583 687437
14714 687437 819568 630230 683997 973003 1075024 959842 648483 1208999 857701 889332
14704 889332 1004233 1142621 1471023 1715064 1556957 1624619 1643615 1727445 1124576 1303727
$$ packed form
14774A086680k08725K06231j9904j56388j15595K90113D68711M41713j12936m5515
14764G51973K02674k55913m1505j20765j2673j28786L76137l46967O65977m45159
14754F44993k14809j34282M45866k27809L29987k17883K65061k19661r1631K44082
14744H23914l455J5279k11186P7078J70134J16080o0705D33045J64988L40953
14734I38986J80367m1108j60877j13451K813L26315K79962K44220J2632L38226
14724B008085k52193k99552j67366j70017j44653p7245k21910L10989m8555k50146
14714F87437J32131j89338N3767K89006J02021j15182l11359N60516l51298L1631
14704H89332J14901J38388L28402K44041j58107O7662J8996Q3830o02869J79151
$$ plain form
14694 1303727 1298641 979188 884645 1018841 1150000 759932 833713 1011808 835277 904063
14684 904063 600433 922523 1015718 943083 889139 810140 819895 728796 1061984 873078 1161296
14673 1161296 829543 1121674 1396208 1310281 680952 776732 966705 1040114 970728 720079
14663 720079 1058576 1217928 1150658 1163993 812339 1266038 1089964 1090320 1156391 1313256 926216
14652 926216 1575415 1390674 1432191 987795 1545976 1402421 998193 1094832 1210732 1339534
14642 1339534 941189 1342745 1028085 1156479 1287001 1373924 1292414 1255838 1302909 852089
14632 852089 1125439 1317331 1105277 1398164 883544 1322834 1305464 1457688 1215267 1270890
14622 1270890 1164630 1152632 1381476 1462187 1656180 1534039 1434633 1453244 1614495 1524959
$$ packed form
14694A303727n086l19453r4543J34196J31159l90068P3781J78095j76531O8786
14684I04063l03630L22090R3195p2635n3944p8999R755r1099L33188j88906K88218
14673A161296l31753K92131K74534q5927o29329R5780J89973P3409o9386k50649
14663G20079L38497J59352o7270J3335l51654M53699j76074L56O6071J56865l87040
14652I26216O49199j84741M1517m44396N58181j43555m04228R6639J15900J28802
14642A339534l98345M01556l14660J28394J30522Q6923q1510l6576M7071m50820
14632H52089K73350J91892k12054K92887n14620M39290j7370J52224k42421N5623
14622A270890j06260j1998K28844Q0711J93993j22141r9406J8611J61251q9536
$$ plain form
14612 1524959 1322513 1467649 1434180 1615271 1711371 1334628 1439527 1687462 1792479 1669077
14602 1669077 1426914 1832383 1472218 1352934 1698240 1520705 1797275 1603761 1444329
14593 1444329 1529854 1891924 1702858 1704993 1767716 1651690 1927055 2041365 1802494 1602912
14583 1602912 1885538 1873874 1797349 2198909 2163269 2040105 1590534 2178807 1924032 1955505
14573 1955505 2082636 1807789 2113227 2350608 2497733 2175214 2380989 2383761 2349312 2510872
14563 2510872 2428278 2581005 2649581 2656876 2643840 2902682 2791487 2953546 3317131 3506921
14553 3506921 3491273 4124241 4581605 5350112 7087507 10594305 18545013 38539327 45152967
14544 45152967 20522729 8816086 4814909 3498688 3175506 3024080 4168638 6430141
$$ packed form
14612A524959k02446J45136l3469J81091R6100l76743J04899K47935J05017j23402
14602A669077k42163M05469l60165j19284L45306j77535K76570j93514j59432
14593A444329Q5525L62070j89066K135O2723j16026K75365J14310k38871j99582
14583A602912K82626j1664p6525M01560l5640j23164m49571N88273k54775L1473
14573A955505J27131k74847L05438K37381J47125l22519K05775K772l4449J61560
14563B510872q2594J52727O8576P295j3036K58842j11195J62059L63585J89790
14553C506921j5648O32968M57364P68507J737395L506798P950708J9994314O613640
14544D5152967B0522729H816086m001177j316221l23182j51426J144558K261503
$$ plain form
14536 6430141 3475522 2679100 2085170 1994986 2151636 2401063 2222477 2227042 2282517 2221776
14526 2221776 2265390 2343404 2385279 2150665 2318467 2365631 2184643 2223341 2393523 2637691
14516 2637691 2614661 2526574 2442758 2804681 2551899 2684958 2294658 2896975 2758202 2940472
14506 2940472 3087076 2945440 2955123 3126435 3000883 3067009 2988711 3370411 3063531 3771052
14496 3771052 3164928 3158375 2973412 3223238 3369360 3386902 3381791 3496484 3463799 3455117 3406643
14485 3406643 4052127 3641864 3805587 3786199 3652086 3618158 3935689 3810884 3810564 3654298
14475 3654298 3882474 3952323 4143967 4020043 4401863 4225318 4317422 4324033 4329625 4619358
14465 4619358 4399229 4759665 4477290 4639827 4595276 4721841 5134443 4837139 4827708 5350907
$$ packed form
14536F430141k954619p96422n93930r0184J56650K49427j78586M565N5475o0741
14526B221776M3614P8014M1875k34614J67802M7164j80988L8698J70182K44168
14516B637691k3030q8087q3816L61923k52782J33059l90300O02317j38773J82270
14506B940472J46604j41636R683J71312j25552O6126p8298L81700l06880P07521
14496C771052o06124o553j84963K49826J46122J7542n111J14693l2685q682m8474
14485C406643O45484m10263J63723j9388j34113l3928L17531j24805l20j56266
14475C654298K28176O9849J91644j23924L81820j76545R2104O611N592K89733
14465D619358k20129L60436k82375J62537m4551J26565M12602k97304r431N23199
$$ plain form
14455 5350907 5124285 5236234 5100486 5071375 5183346 5211989 5601618 5647763 5431166 5927205
14445 5927205 5749357 5525659 5788678 6297202 6052439 5925855 6225325 6323548 6255039 6374243
14435 6374243 6407669 6614328 6495858 6769655 6740694 6807161 6794335 6985745 7595734 7359771
14425 7359771 7354740 7369513 7377909 7711785 8095475 8034695 8486516 8655820 8899729 8595425
14415 8595425 8582900 8737523 8691700 8815720 9107781 9174861 9353622 9414187 9899969 9917802
14405 9917802 9810665 10143741 10489649 10591711 10369173 10420158 10691280 10973221 10971014 11205631
14395 11205631 11272087 11317020 11786070 12009871 12095501 12131133 12538067 12770840 12996727 13432085
14385 13432085 13280661 13725523 14223424 14227871 14944727 15048265 15245216 15473612 15798705 15754938
$$ packed form
14455E350907k26622J11949j35748k9111J11971K8643L89629M6145k16597M96039
14445E927205j77848k23698K63019N08524k44763j26584K99470R8223o8509J19204
14435F374243L3426K06659j18470K73797k8961O6467j2826J91410O09989k35963
14425G359771n031J4773Q396L33876L83690o0780M51821J69304K43909l04304
14415H595425j2525J54623m5823J24020K92061O7080J78761O0565M85782J7833
14405I917802j07137L33076L45908J02062k22538N0985K71122K81941k207K34617
14395A1205631O6456M4933M69050K23801Q5630L5632M06934K32773K25887M35358
14385A3432085j51424M44862M97901M447P16856J03538J96951K28396L25093m3767
$$ plain form
14375 15754938 16291121 16281181 16866856 17020997 17537108 17910667 18559913 18640304 19136835 19603941
14365 19603941 19858957 20383442 21103720 20670814 21300101 21887675 22271077 22753378 23336760
14356 23336760 23924709 24233325 24847041 25509566 26084112 26666746 27209039 27916533 28826061
14347 28826061 29595118 30291387 31172080 31934863 32519540 33475628 34354060 35362474 36275994
14338 36275994 37176660 38367247 39420804 40756968 41684605 43045116 44271178 45700115
14330 45700115 46861939 48594048 50125755 51726688 53151435 55033339 56797085 58915718
14322 58915718 60940557 62778645 65229907 67735053 70038628 72769938 75157813 77895586
14314 77895586 81277647 84233739 87468478 91221966 94749238 98964698 102954601 107209653
$$ packed form
14375A5754938N36183r940N85675J54141N16111L73559O49246Q0391M96531M67106
14365A9603941K55016N24485P20278m32906O29287N87574L83402M82301N83382
14356B3336760N87949L08616O13716O62525N74546N82634N42293P07494R09528
14347B8826061P69057O96269Q80693P62783N84677R56088Q78432J008414R13520
14338C6275994R00666J190587J053557J336164R27637J360511J226062J428937
14330D5700115J161824J732109J531707J600933J424747J881904J763746K118633
14322E8915718K024839J838088K451262K505146K303575K731310K387875K737773
14314G7895586L382061K956092L234739L753488L527272M215460L989903M255052
$$ plain form
14306 107209653 112229411 117120830 122265747 127919930 133591537 139862008 146251151 153187699
14298 153187699 160583357 168347924 176753076 185376131 194961382 204892113 215059882 226000452
14290 226000452 237362901 249422315 262124785 275304931 289212938 303452216 317795861
14283 317795861 332622094 347562965 362896107 377966191 392852665 407252441 421150271
14276 421150271 433464917 444828012 453916871 459613861 461919936 463182244 462869688 460968746
14268 460968746 456904333 452183664 444684714 435544424 425341046 414124267 401197025
14261 401197025 387477465 372991039 358039998 342363600 326467114 310956280 295774415
14254 295774415 280933634 267191387 253426698 240702876 228049449 216351899 207134107
$$ packed form
14306A07209653N019758M891419N144917N654183N671607O270471O389143O936548
14298A53187699P395658P764567Q405152Q623055R585251R930731J0167769J0940570
14290B26000452J1362449J2059414J2702470J3180146J3908007J4239278J4343645
14283C17795861J4826233J4940871J5333142J5070084J4886474J4399776J3897830
14276D21150271J2314646J1363095R088859N696990K306075J262308l12556j900942
14268D60968746m064413m720669p498950r140290j0203378j1216779j2927242
14261D01197025j3719560j4486426j4951041j5676398j5896486j5510834j5181865
14254B95774415j4840781j3742247j3764689j2723822j2653427j1697550r217792
$$ plain form
14247 207134107 196979758 187076625 177754523 169859095 161253984 153719737 146461927 139779634
14239 139779634 133688944 128025870 122214052 116699673 111541755 107027861 102275436 98553628
14231 98553628 94935749 91325049 87200445 83946359 80487147 77363099 74739176 71696932
14223 71696932 69215022 66887250 64564455 62581682 60280474 58347544 55987274 54119262
14215 54119262 52667429 51317234 49923614 47972993 46417427 44947386 43603043 42808413
14207 42808413 42275672 41188888 39194229 38180249 36903758 36458288 35769841 34775065 33508085
14198 33508085 32761254 31621273 30682444 30268646 29747281 28996444 27890861 27407942 26827379
14189 26827379 25968688 25246579 24917498 24205589 23834498 23469356 22569054 22096332 21717377
$$ packed form
14247B07134107j0154349r903133r322102p895428q605111p534247p257810o682293
14239A39779634o090690n663074n811818n514379n157918m513894m752425l721808
14231I8553628l617879l610700m124604l254086l459212l124048k623923l042244
14223G1696932k481910k327772k322795j982773k301208j932930k360270j868012
14215E4119262j451833j350195j393620j950621j555566j470041j344343p94630
14207D2808413n32741j086784j994659j013980j276491m45470o88447r94776j266980
14198C3508085p46831j139981r38829m13798n21365p50837j105583m82919n80563
14189B6827379q58691p22109l29081p11909l71091l65142r00302m72722l78955
$$ plain form
14180 21717377 21258118 20588379 20515167 19696015 19344939 19080791 18671573 18395471 17812845
14171 17812845 17654275 17614887 16894916 16903737 16459988 15881621 16182293 15661397 15152151 15035983
14161 15035983 14574291 14488883 14110796 13595372 13444565 13647310 12893301 13063142 12575994
14152 12575994 12463640 12346229 12085733 12231589 11454633 11358370 11417871 10945955 11237161 11113442
14142 11113442 10345501 10492994 10398233 10225585 10246889 9924140 9708482 9621868 9311518 9245254
14132 9245254 9472620 9212094 9024282 8787389 8639451 8463250 8653808 8451452 8379798 8082995
14122 8082995 8243253 7933882 7915092 7897409 7837083 7928793 7428040 7114157 7120899 7145187 6994766
14111 6994766 6979535 6881088 6863935 6717262 6617631 6461000 6565016 6312134 6476625 6167675
$$ packed form
14180B1717377m59259o69739p3212q19152l51076k64148m09218k76102n82626
14171A7812845j58570l9388p19971Q821m43749n78367L00672n20896n09246j16168
14161A5035983m61692q5408l78087n15424j50807K02745p54009J69841m87148
14152A2575994j12354j17411k60496J45856p76956r6263N9501m71916K91206j23719
14142A1113442p67941J47493r4761j72648K1304l22749k15658q6614l10350o6264
14132I245254K27366k60526j87812k36893j47938j76201J90558k02356p1654k96803
14122H082995J60258l09371j8790j7683o0326R1710n00753l13883O742K4288j50421
14111F994766j5231r8447j7153j46673r9631j56631J04016k52882J64491l08950
$$ plain form
14101 6167675 6197184 6312773 5847237 5837865 5815068 5811828 5792735 5724064 5545298 5648418 5496659
14090 5496659 5331190 5264661 5038581 5287637 5326830 4858361 5222614 4998977 4845442 4634824
14080 4634824 4708014 4654948 4968587 4876602 4287513 4595582 4501860 4451719 4453428 4558552 4304820
14069 4304820 4191390 4221876 4274919 4459805 4037186 4185371 4294816 4213733 4208344 4231231
14059 4231231 3985219 4258784 3898374 4090026 4149356 3655454 3741623 3619828 3422862 3403400
14049 3403400 3808039 3473148 3376463 3296670 3533886 3378635 3534271 3626475 2913578 3476465
14039 3476465 2884950 3269179 3163933 3164854 3059842 2700255 3254883 3216129 3046264 2981809
14029 2981809 3207678 3131518 2766937 2864298 2875670 2792618 2872382 3021309 2568320 2865148
$$ packed form
14101F167675K9509J15589m65536r372k2797l240j9093o8671j78766J03120j51759
14090E496659j65469o6529k26080K49056L9193m68469L64253k23637j53535k10618
14080D634824P3190n3066L13639r1985n89089L08069r3722n0141J709J05124k53732
14069D304820j13430L0486N3043J84886m22619J48185J09445q1083n389K2887
14059D231231k46012K73565l60410J91652N9330m93902Q6169j21795j96966j9462
14049C403400M04639l34891r6685p9793K37216j55251J55636R2204p12897N62887
14039C476465n91515L84229j05246R21j05012l59587N54628l8754j69865o4455
14029B981809K25869p6160l64581R7361J1372q3052P9764J48927m52989K96828
$$ plain form
14019 2865148 2755947 2493753 2359594 2720287 2514941 2551521 2690465 2693339 2585677 2437168
14009 2437168 2442498 2355864 2263144 2731316 2168157 2282509 2009493 2137073 2213592 2025648
13999 2025648 2287507 2207574 1873670 2248735 1915789 1949618 2207244 2122618 2459458 2711831
13989 2711831 3403459 5594938 11143669 28436068 49077192 28486324 14703518 8852339
13981 8852339 6097829 5012522 4394156 3947479 3640949 3133048 2794101 2797498 2765850 2666658
13971 2666658 2646814 2437207 2530443 2369738 2510614 2323528 2423792 2436251 2538152 2177371
13961 2177371 2126136 2080929 2386949 1763903 2236587 2016823 1925104 2089075 1969326 1831324
13951 1831324 1956490 2118939 1874775 1779645 2054200 1936894 1893436 2109885 1979981 1947682
$$ packed form
14019B865148j09201k62194j34159L60693k05346L6580J38944K874j07662j48509
14009B437168N330q6634r2720M68172n63159J14352k73016J27580P6519j87944
13999B025648K61859p9933l33904L75065l32946L3829K57626q4626L36840K52373
13989B711831O91628K191479N548731J7292399K0641124k0590868j3782806n851179
13981H852339k754510j085307o18366m46677l06530n07901l38947L397l1648r9192
13971B666658j9844k09607R3236j60705J40876j87086J00264J2459J01901l60781
13961B177371n1235m5207L06020o23046M72684k19764r1719J63971j19749j38002
13951A831324J25166J62449k44164r5130K74555j17306m3458K16449j29904l2299
$$ plain form
13941 1947682 1899182 1932689 1716964 1701877 1625063 1929156 1850005 1778819 1836511 1653885 1818890
13930 1818890 1819932 1176413 1570222 1553287 1918981 1890472 1657466 1480992 1561363 1383866
13920 1383866 1705918 1455140 1730729 1481002 1230616 1582961 1625051 1416817 1735675 1532869
13910 1532869 1282750 1442539 1354550 1292363 1249428 1614158 1357389 1200222 1048312 1518327
13900 1518327 1477214 1428634 1314326 1378001 1349982 1148435 1359745 1268765 1357861 1380430 1203658
13889 1203658 1331240 1393491 1200436 1338730 998924 1327121 1209405 1163403 1130741 1480715
13879 1480715 1111805 884900 1231456 1098641 1151793 1254671 1172204 1261542 1198643 1308454
13869 1308454 778122 887665 1290460 1086121 1249760 1014555 1480273 788597 1119612
$$ packed form
13941A947682m8500L3507k15725j5087p6814L04093p9151p1186N7692j82626J65005
13930A818890J042o43519L93809j6935L65694k8509k33006j76474Q0371j77497
13920A383866L22052k50778K75589k49727k50386L52345M2090k08234L18858k02806
13910A532869k50119J59789q7989o2187m2935L64730k56769j57167j51910M70015
13900A518327m1113m8580j14308O3675k8019k01547K11310r0980Q9096K2569j76772
13889A203658J27582O2251j93055J38294l39806L28197j17716m6002l2662L49974
13879A480715l68910k26905L46556j32815N3152J02878q2467Q9338o2899J09811
13869A308454n30332J09543M02795k04339J63639k35205M65718o91676L31015
$$ plain form
13860 1119612 857403 945834 1177048 1177355 873187 1212308 995402 991200 974406 737635 802259
13849 802259 1063266 658767 902173 700379 1103438 940592 1106440 558286 531140 909989
13839 909989 859869 1068745 800867 860790 720413 632576 644297 916197 767317 793718
13829 793718 809092 941721 731508 655853 837196 696803 982227 734200 767388 769921
13819 769921 770951 794030 973987 795054 679385 407326 1063850 823126 637426 539018
13809 539018 648619 534817 920956 429310 877447 807151 482855 736413 1090582 1039709
13799 1039709 891373 934573 767944 835283 747250 664257 884300 464974 943429 896195
13789 896195 751647 605509 837668 1079464 954804 738478 804682 719101 585154 862011
$$ packed form
13860A119612k62209Q8431K31214L07l04168L39121k16906m202j6794k36771O4624
13849H02259K61007m04499K43406k01794M03059j62846J65848n48154k7146L78849
13839I09989n0120K08876k67878N9923j40377q7837J1721K71900j48880K6401
13829G93718J5374J32629k10213p5655J81343j40393K85424k48027L3188K533
13819G69921J030K3079J79957j78933j15669k72059O56524k40724j85700r8408
13809E39018J09601j13802L86139D29310M48137p0296l24296K53558L54169n0873
13799A039709j48336M3200j66629O7339q8033q2993K20043m19326M78455m7234
13789H96195j44548j46138K32159K41796j24660k16326O6204q5581j33947K76857
$$ plain form
13779 862011 854114 850671 829955 729431 553253 833222 589738 602920 644646 825563 724160
13768 724160 752927 504454 445861 655673 859359 550500 568265 581413 603683 885460
13758 885460 765377 714430 590418 870821 569271 631576 880708 590707 654783 886235
13748 886235 851125 484975 554220 518503 576262 364909 774551 705925 421099 580346
13738 580346 548122 468670 916086 665234 820815 641944 602506 238221 433006 748812
13728 748812 626964 370160 617218 605603 451670 592869 715617 623896 335516 584516
13718 584516 533905 892420 576189 566879 825317 863991 394301 485331 441133 537122 595826
13707 595826 577851 865140 712524 585088 250405 427836 560212 499576 390745 401677
$$ packed form
13779H62011p897l443k0716j00524j76178K79969k43484J3182M1726J80917j01403
13768G24160K8767k48473n8593K09812K03686l08859J7765J3148K2270K81777
13758H85460j20083n0947j24012K80403l01550O2305K49132k90001O4076K31452
13748H86235l5110l66150O9245l5717N7759k11353M09642o8626k84826J59247
13738E80346l2224p9452M47416k50852J55581j78871l9438B38221J94785L15806
13728G48812j21848k56804K47058j1615j53933J41199J22748r1721k88380K49000
13718E84516n0611L58515l16231r310K58438L8674C94301R1030m4198R5989N8704
13707E95826j7975K87289j52616j27436B50405J77431J32376o0636j08831J0932
$$ plain form
13697 401677 231570 632183 550952 841523 314217 157324 169050 269183 486991 466365
13687 466365 445772 643869 485150 595364 464583 396079 616492 565819 497943 522687
13677 522687 649560 566080 297226 777391 667926 494442 296456 492970 264761 550531
13667 550531 409795 592598 444006 443566 350642 445109 545149 341085 191455 408367
13657 408367 216723 492804 429259 198629 668103 419430 436413 515964 488561 609838
13647 609838 563209 401919 253413 455956 326371 322288 335620 384263 559881 342747
13637 342747 391773 444806 438434 313145 731585 722816 359372 480234 194762 125089 391889
13626 391889 349925 336291 229881 549364 337149 285361 424585 343761 428010 266697
$$ packed form
13697D01677j70107M00613q1231K90571C14217j56893J1726J00133K17808k0626
13687D66365k0593J98097j58719J10214j30781o8504K20413n0673o7876K4744
13677E22687J26873q3480k68854M80165j09465j73484j97986J96514k28209K85770
13667E50531j40736J82803j48592m40r2924R4467J00040k04064j49630K16912
13657D08367j91644K76081o3545A98629M69474k48673J6983P9551k7403J21277
13647F09838m6629j61290j48506K02543j29585m083J3332M8643J75618k17134
13637C42747M9026N3033o372j25289M18440q769C59372J20862A94762o9673K66800
13626C91889m1964j3634j06410L19483k12215n1788J39224q0824Q4249j61313
$$ plain form
13616 266697 170125 881666 309867 333610 511932 632301 551995 99158 591047 746780
13606 746780 475997 440002 408765 91680 136512 280024 545410 179055 530867 97704
13595 137059 274718 599065 204190 356308 274052 466804 582228 375090 311450 20016
13584 686619 484099 335789 92626 912759 283500 227262 211983 258555 463520 468048 797428
13573 797428 77591 365264 60592 258145 486924 333568 288669 406604 513557 355747
13563 355747 506029 -221125 227375 543268 463616 397767 331729 709075 113408 498142
13553 498142 403660 186922 71082 251782 257821 286920 167909 473102 666585 -8574 119361
13541 322275 -191856 108671 346207 159645 352633 172812 292945 165986 469991 685422
$$ packed form
13616B66697r6572P11541C09867K3743J78322J20369q0306I9158M91889J55733
13606G46780k70783l5995l1237I1680M4832J43512K65386A79055L51812I7704
13595A37059J37659L24347B04190J52118q2256J92752J15424k07138o3640B0016
13584F86619k02520j48310I2626Q20133B83500n6238j5279M6572K04965M528L29380
13573G97428G7591K87673F0592J97553K28779j53356m4899J17935J06953j57810
13563C55747J50282b21125B27375L15893p9652o5849o6038L77346A13408L84734
13553D98142r4482A86922G1082J80700O039K9099j19011L05193J93483h574A19361
13541C22275a91856A08671K37536A59645J92988A72812J20133j26959L04005K15431
$$ plain form
13531 685422 26665 225384 413168 197430 218047 467014 352815 554742 110200 236172
13521 236172 34025 197267 433994 -89689 278684 82035 380082 365643 387222 31611 396026
13510 396026 428784 393065 69448 304747 325734 -88901 -167754 184082 341574 239478 149471
13499 149471 364492 230665 111690 92130 164360 427461 380480 322084 413563 316187 297227
13488 297227 379480 433688 308061 149630 165893 678719 255190 252174 300899 148269 178007
13477 178007 77813 226625 24791 155746 292212 77787 214085 270246 -10229 160405
13466 241848 149314 105200 220708 68080 281537 383725 -34582 300612 433496 35314
13455 331996 196549 -42874 183333 395247 -112796 79739 286906 -73427 -49677 573035
$$ packed form
13531F85422B6665J98719J87784A97430K0617K48967j14199K01927A10200J25972
13521B36172C4025J63242K36727h9689B78684H2035K98047j4439K1579C1611L64415
13510C96026L2758l5719F9448K35299K0987h8901p8853A84082J57492j02096r0007
13499A49471K15021j33827A11690j9560P2230K63101m6981n8396R1479r7376j8960
13488B97227Q2253N4208j25627A49630J6263N12826B55190l016M8725A48269K9738
13477A78007G7813J48812B4791J30955J36466G7787J36298N6161a0229A60405
13466B41848r2534m4114J15508F8080K13457J02188c4582C00612J32884C5314
13455C31996j35447d2874A83333K11914a12796G9739K07167g3427K3750E73035
$$ plain form
13444 472994 193903 82561 581342 119732 154661 285015 250675 258825 129094 88724 209960
13433 209960 248616 426021 404717 -23793 225074 54186 134777 333442 443368 540353 82694
13421 188149 135601 -184590 -89314 241146 312714 205862 135122 219920 3272 213346 298934
13410 298934 101408 -108042 343170 244841 196789 246009 -106278 -245254 47110 143110
13400 143110 -109578 216208 -82327 83413 -253027 250228 372143 193778 73527 358239
13390 358239 402064 403087 38267 23554 215327 280049 426185 285194 80820 1790 91304
13379 91304 193684 373156 194108 42321 57311 66011 360801 283399 312043 79849 84978
13368 84978 168535 246769 133713 43700 242720 3339 282133 195117 504976 419412 335978
$$ packed form
13444D72994A93903H2561M98781A19732L4929J30354l4340Q150A29094m0370J21236
13433B09960L8656J77405k1304b3793B25074E4186Q0591J98665J09926R6985H2694
13421A88149n2548a84590h9314B41146P1568j06852p0740Q4798C272K10074Q5588
13410B98934A01408a08042C43170r8329m8052M9220a06278j38976D7110R6000
13400A43110a09578B16208h2327H3413b53027B50228J21915j78365G3527K84712
13390C58239M3825J023C8267j4713J91773O4722J46136j40991H0820A790Q9514
13379I1304J02380J79472j79048D2321J4990Q700K94790p7402K8644G9849N129
13368H4978Q3557P8234j13056D3700J99020C339K78794q7016L09859q5564q3434
$$ plain form
13357 335978 351010 190038 49647 -80364 396661 142420 537701 21258 278357 221115
13347 221115 260835 68472 189572 135403 355632 397625 629504 204088 262869 74323 364396
13336 364396 389293 729911 425930 102143 155993 238013 164412 519560 -26093 -172150
13326 -172150 391230 314737 299901 215000 84682 419643 -92772 280804 -58561 568129 243840
13314 82695 -59830 231356 41389 338623 332395 77223 139523 413036 -67742 200567 311143
13303 311143 272341 161896 108872 40996 245462 258311 -63790 495258 -101894 435142
13292 -11056 351018 175244 60918 -66909 105447 153097 407832 298454 134673 187523
13282 187523 281618 238838 323017 -10828 10527 62603 564451 -28700 48398 279132 104452
$$ packed form
13357C35978J5032j60972D9647h0364C96661A42420L95281B1258K57099n7242
13347B21115L9720F8472J21100n4169K20229M1993K31879B04088N8781G4323K90073
13336C64396K4897L40618l03981A02143N3850Q2020p3601L55148b6093j46057
13326a72150C91230p6493j4836q4901H4682L34961i2772B80804e8561E68129B43840
13314H2695e9830B31356D1389K97234o228G7223O2300K73513f7742B00567J10576
13303C11143l8802j10445n3024D0996K04466J2849f3790D95258a01894D35142
13292a1056C51018A75244F0918f6909A05447M7650K54735j09378A34673N2850
13282A87523R4095m2780Q4179a0828A0527N2076N01848b8700D8398K30734A04452
$$ plain form
13270 246198 401 372875 10211 -72931 -44803 203691 218879 77750 -124227 193297 22472
13258 86701 -35379 67177 -11198 -28842 141622 -112277 79088 31247 391969 97884 80804
13247 80804 -81646 538643 84779 -115611 555807 -80227 -57322 112602 90828 72742 -124368
13235 -20595 51351 37114 146235 4554 643263 124603 92288 109850 -47398 107563 -67144
13223 23831 11191 -49414 -103302 -120036 -254891 245880 87247 -272810 18154 532524 157685
13211 75189 232943 255687 94587 -328 147483 89337 139438 -179980 118130 -83852 -142173
13200 -142173 66621 -8294 213650 -43983 61376 -286451 53010 124639 198620 -213492 160029
13188 -89671 63072 695710 85088 -202426 65772 -29785 66248 85042 -132023 -80795 266987
$$ packed form
13270B46198D01L72474A0211g2931K8128B03691J5188G7750a24227A93297B2472
13258H6701c5379F7177a1198j7644A41622a12277G9088C1247L60722I7884j7080
13247H0804h1646E38643H4779a15611E55807h0227K2905A12602k1774j8086a24368
13235b0595E1351j4237J09121D554O38709A24603l2315J7562d7398A07563f7144
13223B3831A1191d9414n3888j6734j34855B45880H7247b72810A8154N14370A57685
13211G5189J57754K2744I4587c28A47483n8146N0101a79980A18130h3852n8321
13200a42173F6621h294B13650d3983F1376b86451E3010P1629P3981b13492A60029
13188h9671F3072O32638H5088b02426F5772b9785F6248J8794a32023N1228B66987
$$ plain form
13176 -64974 456484 52317 -148368 273130 -32446 90051 184061 -78439 -8967 -15263 135400
13164 29616 -215478 42432 55019 222627 62470 -371834 -268286 324763 222513 -31165
13153 154231 -158095 332719 -145615 120681 -183651 -54695 -120455 204787 13167 215507
13143 215507 51473 -149901 218192 -194622 71250 72476 -279608 298676 209259 150764 109101
13132 109101 121598 255698 -156567 52654 129487 76648 -105564 239933 483686 -236456
13121 -65243 325661 306416 201988 24598 322780 129438 -41116 14108 110427 58449 182004
13110 182004 -271068 310658 466419 134658 -26714 8826 -139558 -127761 217027 156716
13100 156716 79417 184564 78346 -16869 -160988 157216 203363 187425 286861 -267035 71256
$$ packed form
13176f4974D56484E2317a48368B73130c2446I0051R4010g8439h967o296A35400
13164B9616b15478D2432J2587J67608F2470c71834J03548C24763j02250c1165
13153A54231a58095C32719a45615A20681a83651e4695o5760B04787A3167K02340
13143B15507E1473a49901B18192a94622G1250J226b79608B98676q9417n8495m1663
13132A09101J2497J34100a56567E2654P6833n2839a05564B39933K43753b36456
13121f5243C25661j9245j04428B4598K98182A29438d1116A4108R6319n1978J23555
13110A82004b71068C10658J55761A34658b6714H826a39558J1797B17027o0311
13100A56716p7299J05147G8346a6869j44119A57216M6147j5938R9436b67035G1256
$$ plain form
13088 228856 81948 93151 -3607 94741 83020 118418 -5721 244363 107921 255859 114579
13076 121779 163731 291479 -164395 16791 178132 176925 -123381 160425 -57267 -152122 67902
13064 66718 89390 -221949 211840 124036 84889 -246890 -213461 91868 -5527 56290 177817
13053 177817 174513 214501 5650 -51 -129084 158229 148786 175245 12520 11075 -107560 -209500
13041 -209500 328188 132178 273892 77035 187700 -22468 115721 19381 -120263 301953
13030 -277090 -17066 -161684 -15259 -42875 -133208 162826 276921 -82609 -8528 140482 169830
13019 169830 171626 187521 179825 114672 88258 -252 83638 101339 -20602 -92102 70808 346301
13007 346301 -175545 288174 333225 18254 194970 94628 186371 -23711 -198648 232491
$$ packed form
13088B28856H1948J1203c607I4741j1721L5398e721B44363A07921J47938A14579
13076A21779M1952J27748a64395A6791J61341j207a23381A60425e7267r4855F7902
13064F6718K2672b21949B11840q7804l9147b46890L3429I1868e527E6290J21527
13053A77817l304L9988E650e1j29033A58229r443K6459A2520j445a07560j01940
13041b09500C28188A32178J41714G7035J10665b2468A15721A9381a20263C01953
13030b77090a7066j44618a5259k7616r0333A62826J14095h2609h528A40482K9348
13019A69830J796J5895p696o5153k6414b52H3638J7701b0602p1500G0808K75493
13007C46301a75545B88174M5051A8254J76716I4628R1743b3711j74937B32491
$$ plain form
12996 -205017 383367 -279926 23292 304134 292328 164427 151502 11782 129113 115256
12986 115256 -6646 38902 220703 214518 -115923 -19746 46093 -74909 120272 -274344 -45658
12974 -47880 486847 22442 -48891 -49313 144769 -5226 -51988 -198111 116314 65070 180733
12963 180733 143878 -174611 117994 -22279 -170856 216019 -19032 42157 188435 12320
12952 -46286 -47150 -243890 -75523 181882 112477 349126 469857 5513 255632 57509 78271
12941 78271 -103336 -335036 93170 -24476 -87381 -21445 -75754 368827 -168507 -14060 151380
12929 -157024 354714 -231438 -184899 -17832 281689 107049 395049 107895 184707 -148420
12918 123353 265804 -237454 -124928 -165904 208428 11593 128827 93025 64613 90108
$$ packed form
12996b05017C83367b79926B3292K80842j1806j27901j2925A1782J17331j3857
12986A15256f646C8902J81801o185a15923a9746D6093g4909A20272b74344d5658
12974d7880D86847B2442d8891m22A44769e226m6762j46123A16314n1244J15663
12963A80733l6855a74611A17994b2279j48577B16019a9032D2157J46278A2320
12952d6286q64j96740g5523A81882o9405K36649J20731E513K50119E7509K0762
12941G8271a03336k31700I3170b4476o2905b1445n4309C68827a68507a4060A51380
12929a57024C54714b31438M6539a7832B81689A07049K88000A07895P6812a48420
12918A23353J42451b37454J12526m0976B08428A1593J17234l5802k8412K5495
$$ plain form
12908 90108 218488 -109134 -222254 -104755 164787 -201916 -19612 -89934 142283 -185243
12897 -294976 188765 124211 -398974 -154767 223761 25518 5798 -60188 -87099 75124 53379
12886 53379 171541 23017 3229 323246 295760 27158 377389 -51723 -79503 -168382 -202122
12875 -202122 -320968 12597 100611 135104 285407 64642 45192 375712 41842 -273498 -81204
12863 220123 201350 -47519 -63571 -20574 432650 -101088 -149337 99563 -440374 147930 -1364
12851 177301 186628 -183750 112834 -80874 259623 -103508 138991 -208713 29589 -127363
12840 43226 4917 275659 -121970 -64005 179016 187476 -40483 134604 -175924 -36621 55743
12828 16934 -33654 94812 287631 189956 165776 134027 -270071 -195734 82464 402603 -58289
$$ packed form
12908I0108J28380a09134j13120a04755A64787b01916a9612p0322A42283a85243
12897b94976A88765o4554c98974a54767B23761B5518E798f0188k6911G5124k1745
12886E3379J18162B3017C229L20017k7486B7158L50231e1723k7780q8879l3740
12875b02122j18846A2597Q8014L4493J50303F4642j9450L30520D1842b73498h1204
12863B20123j8773d7519j6052b0574D32650a01088m8249I9563d40374A47930a364
12851A77301R327a83750A12834h0874B59623a03508A38991b08713B9589a27363
12840D3226D917K70742a21970N7965A79016Q460d0483A34604a75924c6621E5743
12828A6934c3654I4812J92819r7675k4180l1749b70071P4337H2464L20139e8289
$$ plain form
12816 16973 -52153 384551 -51316 -145307 361366 -63624 -17844 -38100 51106 34549 1407
12804 -51884 -4856 -123847 499499 167173 192721 160673 195619 -28196 -90085 -66702 -120873
12793 -120873 -116655 169085 -415456 129078 -250263 25903 -54531 483446 27167 317172
12783 317172 34643 240478 -33737 163308 -325710 14587 286935 122960 67362 140354
12773 140354 -149381 137864 36959 -123468 161156 -51158 333222 -68192 170606 35731
12762 -274306 -27571 203517 3586 22358 203350 -245560 -47267 -93725 -69967 159466 -351712
12750 23568 -205129 -91741 61960 60756 206353 -487194 -77798 -335920 -180952 -18370 48245
12738 100832 180619 96129 214341 -422631 -436641 195460 163600 -53119 -123372 493314 -113508
$$ packed form
12816A6973e2153C84551e1316r3991C61366f3624a7844k0256E1106j6557A407
12804e1884d856j18991D99499A67173K5548l2048L4946b8196o1889K3383n4171
12793a20873M218A69085d15456A29078b50263B5903e4531D83446B7167K90005
12783C17172C4643K05835c3737A63308c25710A4587K72348A22960n5598P2992
12773A40354a49381A37864C6959a23468A61156e1158C33222f8192A70606C5731
12762b74306b7571B03517C586J8772J80992b45560d7267m6458K3758A59466c51712
12750B3568b05129i1741F1960j204J45597d87194g7798k58122J54968a8370D8245
12738A00832P9787q4490J18212d22631j4010A95460l1860e3119p0253D93314a13508
$$ plain form
12726 43207 -58809 -41243 -12882 -44831 321182 -224264 -234776 -85370 9918 173258 -86152
12714 -30413 5284 -114084 -219741 21750 81667 228380 224642 213120 159585 234061 -88312
12702 55147 22648 47343 129268 56568 139646 43158 63951 -106185 -415655 8293 99838
12691 99838 158003 -58970 39678 -15982 -128767 -187460 191629 -69511 -73296 99382 40744
12679 243303 187954 -261738 -167367 -274339 -100068 -129396 -178681 -5361 -196000 104597 -115276
12667 69933 -116115 37070 -6627 638 175185 -126180 428911 280666 -76632 71072 -12117
12655 -66283 254019 260026 189496 -13858 218219 33327 174270 106496 197917 228541 -42283
12643 -26552 -196132 258155 -363890 35724 16479 -7616 -310685 -74381 56714 444921 158555
$$ packed form
12726D3207e8809J7566a2882l1949C21182b24264j0512h5370I918J63340h6152
12714c0413E284a14084j05657B1750N9917J46713l738j1522n3535P4476h8312
12702E5147B2648K4695Q1925E6568Q3078D3158K0793a06185l09470H293R1545
12691I9838N8165e8970C9678a5982j12785n8693A91629f9511l785I9382D0744
12679B43303n5349b61738R4371j06972a00068k9328m9285e361j90639A04597a15276
12667F9933a16115C7070f627F38J74547a26180D28911j48245g6632G1072a2117
12655f6283B54019O007p0530a3858B18219C3327J40943o7774R1421L0624d2283
12643b6552j69580B58155c63890C5724A6479g616l03069g4381E6714L88207A58555
$$ plain form
12631 123108 166541 101086 117279 80526 203608 -46865 235383 -6565 -216041 -8923 237020
12619 -84358 -314410 87090 137327 745 -1096 120168 -216793 82324 4195 -104296 -90789 402270
12606 -11437 -78480 -261622 71620 130378 482548 -28798 -108994 49033 -297885 234005 -74433
12594 -94053 -97984 -50862 124257 -46172 148516 -67025 -208426 287443 231449 -43993 -295430
12583 -295430 40558 -208126 148073 -5416 223666 157994 -261280 291419 171760 56107
12572 160777 9907 45077 100253 693490 -249187 -12082 28347 -37869 -21456 12417 140585
12561 140585 -314330 -124997 501373 81713 353578 -136168 -19638 19131 -594 163746 -208067
12549 171523 72199 31559 -10496 213794 32204 -67326 -163156 -278156 42345 61450 -236852
$$ packed form
12631A23108M3433o5455J6193l6753J23082d6865B35383f565k09476h923B37020
12619h4358k30052H7090N0237G45a096A20168b16793H2324D195a04296J3507D02270
12606a1437o7043j83142G1620N8758L52170b8798q0196D9033b97885B34005g4433
12594i4053l931M7122A24257d6172A48516f7025j41401B87443n5994d3993k51437
12583b95430D0558b08126A48073e416B23666o5672b61280B91419j19659E6107
12572A60777I907L5170N5176N93237b49187a2082B8347c7869J6413A2417J28168
12561A40585c14330a24997E01373H1713K71865a36168a9638A9131e94A63746b08067
12549A71523G2199C1559a0496B13794C2204f7326r5830j15000D2345J9105b36852
$$ plain form
12537 -195585 91420 -296816 161673 83939 -13737 -52098 76054 128226 -293115 -142967 73772
12525 163215 -67026 13892 -117563 84743 -128927 -272215 -446132 -172605 40276 67314
12515 67314 151402 -92299 -112783 60267 -19980 -77182 -4608 -98564 30878 178720 87698 -161358
12502 199484 -21167 44676 37029 172944 -43833 -224508 72066 117095 -108918 236940 -80200
12490 171816 50317 -126438 76160 -402813 -48456 323461 202374 -172792 67336 -149530
12479 -18346 -119244 118648 59416 -249117 -30028 49814 237548 -132870 25511 96697 -174786
12467 -101124 172648 -171535 64457 -125826 99036 -287705 69680 38833 42802 -123481 -291307
12456 -291307 -270821 -337322 -156513 -288877 -91159 55143 -21400 -90613 -117636 -125916 2437
$$ packed form
12537a95585I1420b96816A61673p7734a3737l8361G6054N2172b93115a42967G3772
12525A63215f7026A3892a17563H4743a28927j43288j73917a72605D0276K7038
12515F7314Q4088i2299k0484F0267a9980n7202d608r3956C0878J47842H7698a61358
12502A99484b1167D4676p647J35915d3833j80675G2066M5029a08918B36940h0200
12490A71816E0317a26438G6160d02813d8456C23461j21087a72792F7336a49530
12479a8346j00898A18648n9232b49117c0028D9814J87734a32870B5511P1186a74786
12467a01124A72648a71535F4457a25826I9036b87705F9680l0847L969a23481j67826
12456b91307K0486o6501a56513j32364i1159E5143b1400o9213k7023q280B437
$$ plain form
12444 -14216 -255084 316943 -275099 63068 57352 -332215 194814 82569 92026 -6451 139691
12432 -287218 76802 81038 232583 43894 99318 -60216 263332 -292443 -192282 -299616 173869
12420 148669 -56843 -96211 -16059 103135 -9182 145255 -19238 1957 295963 263463 217992
12409 217992 -305065 -163994 -298804 -186201 99882 -136748 -124623 -73145 16253 96661
12399 96661 -274546 -69095 170635 -126975 -114234 216689 84478 212402 19977 121500
12389 121500 -169004 434627 210267 112023 -72685 99226 -56111 -233698 48131 165673
12379 165673 265738 121018 153845 130464 185439 235031 10193 -149672 120977 -86456 74529
12367 431223 -84345 160013 123821 119416 -255350 -64825 353431 -236910 -89734 52147 -263664
$$ packed form
12444a4216k40868C16943b75099F3068n716c32215A94814H2569R457f451A39691
12432b87218G6802M236J51545D3894N5424f0216B63332b92443J00161j07334A73869
12420A48669e6843l9368a6059A03135i182A45255a9238A957K94006l2500m5471
12409B17992c05065J41071j34810J12603I9882a36748J2125N1478A6253Q0408
12399I6661b74546f9095A70635a26975J2741B16689H4478J27924A9977J01523
12389A21500a69004D34627B10267r8244g2685I9226e6111j77587D8131J17542
12379A65673J00065A21018L2827k3381N4975M9592A0193a49672A20977h6456G4529
12367D31223h4345A60013l6192m405b55350f4825C53431b36910h9734E2147b63664
$$ plain form
12355 -7747 -93879 -329 92339 108189 -24008 307102 378129 -71782 -38165 -348036 -15519 65728
12342 -196708 287338 -207485 81346 34319 432138 -144064 -70614 49275 25426 -18821 99910
12330 444911 114917 51267 265128 391624 -236803 258654 131238 91985 45764 229048
12320 229048 -238780 241293 119522 6596 320622 -38035 294595 163155 397871 -321345
12309 27186 368442 102419 194424 141543 1564 42801 16980 -78225 215508 47966 42567
12298 42567 -64881 38370 -137842 57488 35774 97565 406742 230499 124962 339530 75784
12286 39088 27033 173599 172637 211722 422061 101298 333725 214280 14124 98627 575196
12275 575196 15765 -20109 228234 -28253 12437 255523 237597 -54556 288426 83739 128653
$$ packed form
12355g747q6132c29I2339J5850b4008C07102P1027g1782L3617l09871a5519F5728
12342a96708B87338b07485H1346C4319L97819a44064g0614D9275k3849a8821I9910
12330D44911A14917E1267K13861J26496b36803B58654j27416l9253D5764J83284
12320B29048b38780B41293A19522F596L14026c8035B94595j31440K34716c21345
12309B7186L41256A02419R2005n2881A564M1237A6980g8225B15508D7966n399
12298D2567f4881C8370a37842E7488k1714O1791L09177j76243j05537K14568G5784
12286C9088j2055J46566r62L9085K10339A01298K32427j19445A4124Q4503M76569
12275E75196A5765b0109B28234b8253A2437K43086j7926e4556B88426H3739M4914
$$ plain form
12264 128653 307897 124936 387781 463273 -40116 304353 178275 192443 -150126 139736
12253 -112655 454208 -14034 149108 293107 35660 4182 343794 41057 218221 116232
12243 116232 -42173 335053 83909 33004 151380 -187729 -75360 116404 -143045 -2308 -82188
12232 -82188 -81997 12922 -183667 60238 313316 24399 -261771 230624 60994 331353 157340
12220 13055 77513 259556 203502 189513 311116 -26357 109495 121903 59292 57754 10773
12208 172409 328758 -66093 76451 165132 352395 -19750 22297 197224 157303 266424 235698
12197 235698 202006 468090 239451 283192 85465 412879 -129288 272951 252075 45098
12186 78350 -36242 83089 348067 -17010 -108078 229856 207355 435913 -83598 216634 394600
$$ packed form
12264A28653J79244A24936K62845P5492d0116C04353j26078J4168a50126A39736
12253a12655D54208a4034A49108J43999C5660D182L39612D1057J77164j01989
12243A16232d2173C35053H3909C3004J18376a87729g5360A16404a43045b308p9880
12232h2188J91A2922a83667F0238K53078B4399b61771B30624F0994K70359A57340
12220A3055O4458J82043n6054j3989J21603b6357A09495J2408E9292j538A0773
12208A72409J56349f6093G6451Q8681J87263a9750B2297J74927l9921J09121l0726
12197B35698l3692K66084k28639M3741H5465L27414a29288B72951k0876D5098
12186G8350c6242H3089K64978a7010r1068B29856k2501K28558h3598B16634J77966
$$ plain form
12175 394600 54414 362879 298313 447114 507442 6359 -1175 97036 -140119 118217 350777
12164 350777 255886 234259 257564 39174 9753 147852 208693 120884 233186 228109 -156344
12152 -206098 48729 123800 104969 165071 178348 -231135 176263 253530 263272 127832 82389
12141 82389 -135188 257821 -36108 141647 -177056 48573 91046 5341 64419 210026 -62013
12129 324297 -15134 82898 99946 148185 382327 371165 18780 336555 59714 50737 277254
12118 277254 427028 271854 -66166 -81333 11641 -27736 97865 -20836 -75756 -33152 95144
12106 371419 107070 270677 267106 264414 160752 310315 196640 70686 -20409 282473 -19717
12094 153738 155986 274994 84238 181141 403027 129831 199582 192244 -82126 33592 -132374
$$ packed form
12175C94600E4414L08465o4566J48801O0328F359a175I7036a40119A18217K32560
12164C50777r4891k1627K3305C9174I753J38099O0841q7809J12302n077a56344
12152b06098D8729P5071j8831O0102J3277b31135A76263P7267R742A27832m5443
12141H2389a35188B57821c6108A41647a77056D8573M2473E341N9078J45607f2013
12129C24297a5134H2898J7048M8239K34142j1162A8780L17775E9714q977K26517
12118B77254J49774j55174f6166j5167A1641b7736I7865b0836n4920c3152I5144
12106C71419A07070J63607l571k692j03662J49563j13675G0686b0409B82473a9717
12094A53738K248J19008H4238R6903K21886A29831O9751p338h2126C3592a32374
$$ plain form
12082 -10865 -102029 343105 252379 203144 132930 23101 351274 -87462 71858 -5496 173581
12070 -7897 225743 -97100 362903 -102127 469387 165339 -147431 -297842 121936 267410
12060 267410 -119965 152659 61057 -110159 22925 118052 -96405 147129 92127 -49888 -428293
12049 -428293 311353 44538 140236 25680 -379550 169317 39453 87771 -37759 -92900 -184208
12038 -184208 23236 96320 23241 13521 -350806 125107 -111795 122527 -117896 -241865
12028 -241865 -45988 -1085 -584 199677 -85220 108814 -136433 325989 -21073 244206 225472
12017 225472 102522 -199387 3385 129129 257374 65830 202589 -176989 -275062 354075
12006 76785 -35598 177643 135839 17909 -75577 196940 464799 347401 -28630 -74798 40769
$$ packed form
12082a0865r1164C43105r0726m9235p0214B3101L28173h7462G1858e496A73581
12070g897B25743i7100C62903a02127D69387A65339a47431j50411A21936J45474
12060B67410a19965A52659F1057a10159B2925R5127i6405A47129n5002d9888l78405
12049d28293C11353D4538R5698B5680c79550A69317C9453M8318c7759n5141r1308
12038a84208B3236P3084B3241r720c50806A25107a11795A22527a17896j23969
12028b41865d5988a085N01A99677h5220A08814a36433C25989b1073B44206j8734
12017B25472A02522a99387C385J25744J28245F5830J36759a76989r8073C54075
12006G6785c5598A77643m1804A7909g5577A96940K67859j17398b8630m6168D0769
$$ plain form
11994 273861 -91971 -88837 45338 -333506 -204015 115878 -262881 -235044 -174115 50992 335975
11983 335975 -140025 299033 -169170 127165 -20617 -64142 122185 -124532 52714 151802
11973 151802 -27290 141734 -111752 -81741 -271199 109842 104668 -98228 -298118 -2339 -249326
11962 -249326 -311147 -8214 130885 -9842 -278074 41033 -191556 -91120 -40414 -44540 -46734 -50784
11950 -50784 -42449 -62892 -140702 -135100 74243 601440 -119632 37123 26974 176335 -15636
11938 168686 105818 -184428 116541 -163831 296598 187795 35256 30727 -131464 -74012
11928 -74012 -81262 -455629 61573 122235 183533 -514621 59034 141477 120101 -64890 -165495
11917 -165495 115798 73343 60907 143569 -93717 -78743 179471 -129599 157549 -28810 -238288
$$ packed form
11994B73861i1971L134D5338c33506J29491A15878b62881K7837O0929E0992K84983
11983C35975a40025B99033a69170A27165b0617m3525A22185a24532E2714R9088
11973A51802b7290A41734a11752L0011j89458A09842n174i8228j99890b339k46987
11962b49326o1821h214A30885i842k68232D1033a91556i1120d0414m126k194m050
11950e0784Q335k0443p7810N602G4243N27197a19632C7123j0149J49361a5636
11938A68686o2868a84428A16541a63831B96598j08803C5256m529a31464N7452
11928g4012p250l74367F1573O0662O1298e14621E9034Q2443k1376f4890j00605
11917a65495A15798m2455j2436Q2662i3717J4974A79471a29599A57549b8810k09478
$$ plain form
11906 -238288 -302780 57492 -11287 1082 78547 -215037 -66366 -76725 -188240 -11593 188665
11894 -54203 130746 251041 -181396 -34310 -80240 -345956 44935 -46560 -67188 -127454 131825
11882 336100 -319804 184453 -144475 -12245 15393 -60354 -74889 -226380 -28280 -12587 -287645
11871 -287645 152055 -182555 183235 236728 -485887 -7473 9598 -13568 -339954 282221 -285441
11859 11726 77569 -5538 -262358 37593 -61954 31269 87988 -196721 -68601 -373234 -202712
11848 -202712 -242744 60795 75106 -40340 -189749 -27324 -74386 -62306 -115542 237970 -107745
11836 -275648 119031 -208517 -284896 -28191 -104355 87427 -3871 -2931 -17350 -199236 -93742
11824 23555 -34276 204364 -133147 -111816 -132453 -21135 172404 329735 -116034 117499
$$ packed form
11906b38288o4492E7492a1287A082P7465b15037f6366j0359j11515a1593A88665
11894e4203A30746J20295a81396c4310m5930k65716D4935d6560k0628o0266A31825
11882C36100c19804A84453a44475a2245A5393f0354j4535j51491b8280a2587k75058
11871b87645A52055a82555A83235N3493d85887g473I598a3568l26386B82221b85441
11859A1726O5843e538k56820C7593f1954C1269N6719a96721f8601l04633J70522
11848b02712m0032F0795J4311d0340j49409b7324m7062J2080n3236B37970a07745
11836b75648A19031b08517p6379b8191p6164H7427c871R40j4419j81886i3742
11824B3555c4276B04364a33147K1331k0637b1135A72404J57331a16034A17499
$$ plain form
11813 231045 69881 -199413 383570 32236 -41623 -59602 227404 -97697 21021 247190 -206424
11801 -191381 -76478 -20826 152261 109925 -129909 13501 196058 56381 -58203 -70998 -93291
11790 -93291 -184355 -49625 -188318 -357652 -107441 -116719 162408 -197740 -155797 -342607 -64055
11778 -85643 -166690 138936 -140673 85294 -264952 -132418 -278049 13658 201689 -63961
11767 -176666 -209869 97465 -142805 -22139 6991 36207 -142277 -163761 72145 -22858 -102596
11756 -102596 -194988 38876 2930 249268 29667 182230 -336214 -110711 64188 -57646 -173620
11745 -173620 31204 -78829 177569 157489 -17898 7580 64527 52459 -179419 235320 -82589
11733 -40938 145315 89049 42128 290912 13104 20772 226848 -121120 76276 -61378 7417
$$ packed form
11813B31045F9881a99413C83570C2236d1623j7979B27404i7697B1021K26169b06424
11801a91381g6478b0826A52261m2336a29909A3501J82557E6381e8203j2795k2293
11790i3291r1064d9625j38693j69334a07441r278A62408a97740M1943j86810f4055
11778h5643q1047A38936a40673H5294b64952a32418j45631A3658J88031f3961
11767a76666l3203I7465a42805b2139F991K9216a42277k1484G2145b2858p9738
11756a02596r2392C8876B930K46338B9667J52563c36214a10711F4188e7646j15974
11745a73620C1204g8829A77569k0080a7898G580N6947j2068a79419B35320h2589
11733d0938A45315n6266D2128K48784A3104P668K06076a21120G6276f1378G417
$$ plain form
11721 -78387 259533 9867 21645 -28758 16685 142336 -131236 -32577 -99358 99069 -35299
11709 57698 -24757 138860 70379 191011 -19450 278731 129883 72817 346265 112016
11698 -247346 -53022 -158067 12449 46111 16214 82882 -32084 93384 -136996 308052 394269
11687 394269 36793 89559 -55662 210295 -127336 163139 82020 -173283 142817 350606
11677 350606 93920 -177649 3581 70048 -130833 35152 12891 -154550 -87146 -80981 -16043
11665 36849 225048 -22037 126165 -304781 -247824 131720 -246330 182386 243293 -306357
11654 167245 -231699 58198 124864 193863 121751 -33055 204658 -107199 208125 236313 189560
11643 189560 15935 282126 -172000 46395 -37558 -127778 49052 -45140 185257 7518 -304300
$$ packed form
11721g8387B59533I867J1778b8758A6685J25651a31236c2577o6781I9069c5299
11709E7698b4757A38860o8481J20632a9450B78731A29883n7066K73448A12016
11698b47346e3022j05045A2449L3662A6214O6668c2084I3384a36996C08052Q6217
11687C94269C6793N2766e5662B10295a27336A63139q1119a73283A42817K07789
11677C50606I3920a77649C581O6467a30833C5152A2891a54550O7404O165a6043
11665C6849J88199b2037A26165c04781N6957A31720b46330A82386O0907c06357
11654A67245b31699E8198O6666O8999p2112c3055B04658a07199B08125K8188m6753
11643A89560A5935K66191a72000D6395c7558r0220D9052d5140A85257G518c04300
$$ plain form
11631 120592 52592 195818 125503 -236805 225790 344887 67725 -159983 30579 -96571
11620 205847 -49910 304802 23051 -35072 24756 -26630 241216 -225106 -59279 -51089 129696
11608 186602 155687 -138333 -40953 17748 121707 33932 299910 -440162 -22311 -46307 -72759
11597 -72759 -78420 -137742 -55585 -85408 105619 6389 91590 70407 -56278 42195 108920 -176245
11584 73268 239647 -12895 -363794 304517 -77108 -175250 113950 70150 255873 145088
11574 145088 191097 -151026 76544 91993 143325 -183655 -124422 1321 -69484 -64985 103865
11562 -47251 146821 -17725 -7132 7276 75145 -168737 69301 145226 -57640 174202 -28555
11550 -109691 6440 89262 118272 169842 -158327 146400 49424 18812 18439 135920 -137911
$$ packed form
11631A20592E2592J43226p0315b36805B25790J19097F7725a59983C0579i6571
11620B05847d9910C04802B3051c5072B4756b6630B41216b25106e9279Q190A29696
11608A86602l0915a38333d0953A7748J03959C3932K65978d40162b2311k3996k6452
11597g2759n661n9322e5585k9823A05619F389Q5201k1183e6278D2195O6725a76245
11584G3268J66379a2895l50899C04517g7108r8142A13950m3800J85723j10785
11574A45088M6009a51026G6544J5449N1332a83655N9233A321f9484M499A03865
11562d7251A46821a7725g132G276O7869a68737F9301P5925e7640A74202b8555
11550a09691F440Q2822K9010N1570a58327A46400D9424A8812l73J17481a37911
$$ plain form
11538 247249 369687 172666 35477 99032 -127701 254657 356444 -81055 175381 -32940
11527 160297 169482 153898 -134657 -14269 73502 209267 217443 298545 -18365 333984 -24890
11515 29417 -233023 -94114 190530 113351 -177120 165220 67292 -116178 115265 -105068
11504 144534 -74674 -30819 -177848 210340 200729 284395 -135459 181156 129589 129163 56452
11492 181012 245596 272511 17616 202148 139578 -7226 83964 278149 121320 -52780 118846
11480 44676 217978 154985 -40659 18957 116065 -150152 48982 9897 297044 207434 149603
11469 149603 136831 439643 88872 133816 -53597 369011 -51217 313266 347613 -28314 213888
11457 33175 38534 240084 -158676 104266 297091 102704 202455 -44096 176431 -222314
$$ packed form
11538B47249J22438A72666C5477O3555a27701B54657J01787h1055A75381c2940
11527A60297R185j5584a34657a4269G3502J35765Q176Q1102a8365C33984b4890
11515B9417b33023i4114A90530p7179a77120A65220F7292a16178A15265a05068
11504A44534g4674c0819j47029B10340r611Q3666a35459A81156n1567m26E6452
11492A81012O4584K6915A7616J84532o2570g226H3964J94185A21320e2780A18846
11480D4676J73302o2993d0659A8957R7108a50152D8982I897K87147q9610n7831
11469A49603j2772L02812H8872M4944e3597C69011e1217C13266L4347b8314B13888
11457C3175N359K01550a58676A04266J92825A02704R9751d4096A76431b22314
$$ plain form
11446 -31557 55810 188102 70510 100893 -257288 -172662 70759 -133096 121095 113820 -142705
11434 -207648 -290515 349381 100513 2551 -255608 64731 34157 105217 -208290 -60112 204025
11422 -45594 81726 -167216 -97898 -39884 36026 118303 160325 -9983 -54705 40945 -133951
11410 -92398 -148492 71438 160205 65291 136058 65895 84541 -3554 -49372 192358 100544 -56315
11397 200709 36913 -139985 -94441 35494 44202 65931 37441 125183 206488 89576 -321636
11385 -197397 220081 -305690 -70725 150655 162879 87508 178037 152233 -26409 -107334 61854
11373 42898 54277 133102 -44152 -31141 93302 390244 178409 -134254 63473 -138723 170762
11361 -7327 -268618 -383513 -2491 -255632 -210337 -22806 -375624 -135103 -139821 -49265 291484
$$ packed form
11446c1557E5810J32292G0510L0383b57288Q4626G0759a33096A21095p275a42705
11434b07648q2867C49381A00513B551b55608F4731l0574P1060b08290f0112B04025
11422d5594H1726a67216O9318c9884C6026Q2277M2022i983m4722D0945a33951
11410i2398n6094G1438Q8767F5291P0767F5895J8646c554m5818A92358r1814e6315
11397B00709C6913a39985M5544C5494Q708K1729k8490Q7742Q1305H9576c21636
11385a97397B20081c05690g0725A50655J2224p5371R0529k5804b6409q0925F1854
11373D2898J1379P8825d4152J3011I3302K96942A78409a34254F3473a38723A70762
11361g327k61291j14895b491k53141M5295b2806l52818a35103m718d9265B91484
$$ plain form
11349 -159982 151574 -171369 -144782 197351 -151485 90200 -102571 174864 -62140 314621
11338 -10974 46763 -23183 32330 228378 -133089 139689 -190272 25787 2085 198265 241734
11327 241734 -144320 -18460 -238619 -163507 117153 -44034 228888 290478 -4794 -144773 351395
11315 420470 -176603 184976 72106 116229 -95762 151712 -141338 -195320 -127543 -447721
11305 -447721 -104062 -11608 -9363 -62483 -381922 -136963 -36053 -174249 -410986 -64039 -175052
11294 -175052 -385128 -204479 -11125 -52140 -312781 97515 -167578 -19925 -18835 -67373 47367
11282 199038 270689 -179095 -13310 -335674 -122030 -315785 -43653 170872 -162526 -44532
11271 -191930 -145818 -215510 -213784 28142 10786 -83351 -114689 -184066 18610 -78901 207210
$$ packed form
11349a59982A51574a71369K6587A97351a51485I0200a02571A74864f2140C14621
11338a0974D6763b3183C2330J96048a33089A39689a90272B5787B085J96180M3469
11327B41734a44320a8460k20159P5112A17153d4034B28888O1590d794j39979C51395
11315D20470a76603A84976G2106M4123i5762A51712a41338n3982O7777l20178
11305d47721a04062a1608K245n3120l19439a36963c6053j38196k36737f4039j11013
11294a75052k10076J80649a1125m1015k60641I7515a67578a9925J090m8538D7367
11282A99038P1651a79095a3310l22364a22030j93755d3653A70872a62526d4532
11271a91930M6112o9692J726B8142A0786h3351l1338o9377A8610g8901B07210
$$ plain form
11259 -254963 -182310 -131803 -222196 -121009 -222154 -358578 -448 -85182 -69913 115560 -31973
11247 -213381 -122205 3467 -30638 41274 -270056 195316 -319352 -198553 -398866 42433 125106
11236 125106 84667 -366089 214071 101751 -211218 -123535 15415 -23065 100425 266556
11226 266556 141812 146248 334757 -125010 147066 -73513 -38976 -118856 13197 -54107 182437
11214 -13512 -92871 -88494 68945 -165710 -98649 -397092 -101230 -64250 31835 88432 -104237
11202 -233732 5308 -40274 -177446 -210742 -76612 -91387 -144915 -2580 277553 -336367 -197237
11191 -197237 165966 -170754 -147294 118935 -321564 18800 8735 126605 -136094 -189629
11181 -189629 -321768 -155265 -156429 130769 166276 -183162 -269661 80013 -73091 -213271 -94856
$$ packed form
11259b54963P2653N0507r0393J01187j01145j36424d48q4734J5269A15560c1973
11247b13381R1176C467c0638D1274b70056A95316c19352J20799k00313D2433Q2673
11236A25106m0439c66089B14071A01751b11218Q7683A5415b3065A00425J66131
11226B66556j24744M436J88509a25010A47066g3513L4537p9880A3197e4107A82437
11214a3512p9359M377F8945a65710O7061k98443a01230L6980C1835N6597a04237
11202b33732E308d0274j37172l3296g6612j4775n3528b580B77553c36367J39130
11191a97237A65966a70754K3460A18935c21564A8800H735J17870a36094n3535
11181a89629j32139a55265j164A30769L5507a83162q6499H0013g3091j40180i4856
$$ plain form
11169 -60784 57777 41706 -31204 -20858 124101 -292815 -123385 -278094 -349992 -20953 -147781
11158 -147781 -55845 82647 416670 180709 12272 145536 -307470 -208235 -188901 -67204 62639
11146 408808 353315 -75015 -248467 -214868 -326932 329857 60639 24251 51873 130460 366578
11135 366578 -202282 -139673 -150128 -35504 91090 346872 61214 4975 -25606 189100 28109
11123 -30786 116706 163950 178017 77317 -217835 -66540 43376 103887 163911 307418 -81276
11111 25670 273758 112826 -125402 -261030 -248610 398154 327544 -4419 289557 95259 -434170
11099 -73736 81522 -75460 89020 80529 -128807 302206 221350 270841 273040 287513 106491
11087 321008 267462 125487 310087 489796 122436 151967 134741 270541 200539 301247
$$ packed form
11169f0784E7777j6071c1204J0346A24101b92815a23385j54709p1898b0953j26828
11158a47781e5845H2647L34023A80709A2272J33264c07470R9235J9334f7204F2639
11146D08808n5493g5015j73452L3599j12064C29857F0639B4251K7622P8587K36118
11135C66578b02282O2609j0455c5504I1090K55782F1214D975b5606A89100B8109
11123c0786A16706M7244J4067G7317b17835f6540D3376O0511O0024J43507h1276
11111B5670K48088A12826a25402j35628J2420C98154p0610d419B89557I5259d34170
11099g3736H1522g5460H9020q491a28807C02206q0856M9491K199J4473A06491
11087C21008n3546A25487J84600J79709A22436K9531j7226J35800p0002J00708
$$ plain form
11077 301247 376005 -37336 378238 302500 189903 -302017 16025 235232 108696 588469
11067 588469 85454 492591 231380 393300 361486 265033 184432 580069 268136 296899
11057 296899 453534 698768 658735 535936 761631 801897 752045 632331 615056 849782
11047 849782 596720 570989 788214 589740 562738 810712 793710 764111 955185 645174
11037 645174 605658 1042245 555777 766398 652296 427122 889959 572121 690474 402739
11027 402739 679509 1199899 413100 548680 992626 829961 894182 635753 32538 770683
11017 770683 717897 827543 378920 599291 259181 596897 301725 538540 509739 568774
11007 568774 539756 436310 582599 617192 503843 679908 599178 546834 513816 484935 523071
$$ packed form
11077C01247P4758c7336C78238p5738j12597c02017A6025K19207A08696M79773
11067E88469H5454M07137B31380J61920l1814r6453q0601L95637B68136K8763
11057B96899J56635K45234m0033j22799K25695M0266m9852j19714j7275K34726
11047H49782k53062k5731K17225j98474k7002K47974j7002k9599J91074l10011
11037F45174l9516M36587m86468K10621j14102k25174M62837l17838J18353k87735
11027D02739K76770N20390D13100J35580M43946j62665O4221k58429C2538P38145
11017G70683n2786J09646C78920K20371B59181L37716k95172K36815k8801N9035
11007E68774k9018j03446J46289L4593j13349J76065q0730n2344l3018k8881L8136
$$ plain form
10996 523071 642214 717374 346343 632794 362025 632054 874594 864695 794240 1012879
10986 1012879 370564 812223 1081269 774213 677929 1054643 1121928 1076515 690315 1444466
10976 1444466 885989 1506913 1219464 1599913 1761668 1763243 2431659 2379473 2379424 2599479 2518965
10965 2518965 2427201 2373272 2143048 2199358 2108310 1541696 1420052 1506490 1559371 1730928
10955 1730928 1396811 1832779 1591218 1526792 1216446 968068 843323 1186110 964174 565972
10945 565972 393065 457391 503871 284761 497774 152033 67586 379981 290123 -24448
10934 275713 -146919 87762 168858 -115680 -76548 153944 -32412 -104294 -108554 -71114 -121829
10923 -121829 292966 2720 -82422 -37811 168598 178570 163916 106723 62007 196717 155812
$$ packed form
10996E23071J19143P5160C46343K86451k70769K70029K42540r899p0455K18639
10986A012879C70564M41659K69046l07056r6284L76714O7285m5413l86200P54151
10976A444466n58477O20924k87449L80449J61755J575O68416n2186m9K20055q0514
10965B518965r1764n3929k30224N6310r1048n66614j21644Q6438N2881J71557
10955A730928l34117M35968k41561o4426l10346k48378j24745L42787k21936l98202
10945E65972j72907O4326M6480k19110K13013A52033F7586L12395q9858b4448
10934B75713a46919H7762Q1096a15680L9132A53944c2412p1882m260L7440n0715
10923a21829B92966B720h2422c7811A68598R972j4654n7193m4716J34710m0905
$$ plain form
10912 155812 -287859 -92693 -17411 363504 -43003 75071 -66538 252556 54989 103997 -234386
10900 93677 -67491 68665 43516 136843 -109899 286283 252794 -141770 -71022 -248186 -65954
10888 113795 76629 -152839 -50667 -23176 194121 78588 -106734 78532 276700 -63274 -212758
10877 -212758 -167952 30950 -48509 364313 -275829 11112 129789 -55790 -146694 78658 138883
10866 138883 233125 95880 -162022 -34080 -5394 39921 172852 125999 -64556 221151 55524
10854 -190792 233674 -205772 -21325 -91483 -448082 -134678 -44890 33066 54223 231312
10844 231312 -72507 -262094 -111295 -149820 -374809 -98057 -61584 113137 -146401 -73138
10833 215103 143548 306980 -58709 -216580 16818 -122264 -34613 238904 25939 372933
$$ packed form
10912A55812b87859i2693a7411C63504d3003G5071f6538B52556E4989M9008b34386
10900I3677f7491F8665k5149R3327a09899B86283l3489a41770P0748j77164f5954
10888A13795l7166a52839e0667b3176A94121G8588a06734G8532J98168f3274j49484
10877b12758M4806C0950d8509C64313b75829A1112J18677e5790r0904G8658O0225
10866A38883R4242I5880a62022c4080e394C9921J32931m6853f4556B21151E5524
10854a90792B33674b05772b1325p0158l56599a34678d4890C3066K1157J77089
10844B31312g2507j89587a11295l8525k24989i8057L6473A13137a46401g3138
10833B15103p1555J63432e8709j57871A6818a22264c4613B38904B5939L46994
$$ plain form
10823 372933 -321734 -40451 18930 -126394 -133445 -102066 -241146 -263955 67158 -248416 -53283
10811 -42522 -95519 40188 128038 -252800 7801 43384 -193228 -276099 -120762 -47682 -179582
10800 -179582 -322328 -211031 -95139 189661 -275628 -102004 -82570 294849 -100801 127891
10789 -52869 -43204 -232393 44289 -159101 -90620 297837 38302 34356 -245647 116435 -312050
10777 -96648 90828 16787 -203266 -245761 -15945 -169914 -49731 -268958 -47168 -185161 -124487
10766 -124487 127155 46690 -120427 193378 -152931 465030 245480 -102071 -109143 231647
10755 -195725 -276020 -155762 -77864 26479 -41380 39210 -135469 -21269 1467 344216 89987
10743 145502 17099 -114599 -15444 -126824 25860 -349760 67295 38203 -165842 -144431 -459150
$$ packed form
10823C72933c21734d0451A8930a26394p051L1379j39080k2809F7158b48416e3283
10811d2522n2997D0188Q7850b52800G801L5583a93228q2871a20762d7682j31900
10800a79582j42746J11297i5139A89661b75628a02004J9434B94849a00801A27891
10789e2869R665j89189D4289a59101O8481B97837C8302l946b45647A16435c12050
10777i6648I0828A6787b03266m2495a5945j53969d9731k19227d7168j37993O0674
10766a24487A27155D6690a20427A93378a52931D65030k19550a02071p072B31647
10755a95725q0295J20258g7864B6479d1380C9210a35469b1269A467L42749H9987
10743A45502A7099a14599a5444j11380B5860c49760F7295k9092a65842K1411l14719
$$ plain form
10732 -459150 -70332 -277590 99902 -67587 47491 -99784 322115 -7733 170530 -143099 92187
10720 -167478 290134 -85508 -110991 -156243 -249076 -76301 154723 45995 -6910 -139429 41982
10708 -184923 125998 -75911 -165876 -17757 -192411 -443606 -125666 -112990 5843 -39707 352513
10696 248319 -222755 305298 -22387 86523 -75334 137402 -135972 -71639 49855 184849
10686 184849 -129203 -79653 37184 -22342 196310 -9597 50181 257191 -250793 270281 61517
10674 195284 -190179 176166 -216374 -15438 240500 302558 -480423 69360 12840 17552 26626
10663 26626 -105716 92543 -248230 -208599 -130710 1073 49411 -382814 126830 154816 -178434
10651 -25322 -52276 -179119 -51635 169936 78217 128020 -76978 350171 -139737 30782 89409
$$ packed form
10732d59150g0332k07258I9902f7587D7491i9784C22115g733A70530a43099I2187
10720a67478B90134h5508k5483m5252r2833g6301A54723D5995f910j32519D1982
10708a84923A25998g5911q9965a7757j74654k51195a25666J2676E843c9707C52513
10696B48319b22755C05298b2387H6523g5334A37402a35972O4333D9855J34994
10686A84849a29203M9550C7184b2342A96310i597E0181K07010b50793B70281F1517
10674A95284a90179A76166b16374a5438B40500O2058d80423F9360A2840M712R074
10663B6626a05716I2543b48230L9631P7889A073M8338c82814A26830K7986a78434
10651b5322k6954j26843e1635A69936G8217M9803g6978C50171a39737C0782N8627
$$ plain form
10640 89409 -143951 55400 -271678 -200346 372841 155106 -6786 -32646 -42226 49990 -28461
10628 -34628 143086 -282873 -49804 -260405 -45989 -304667 -41756 24438 -97768 -202753 -111909
10617 -111909 84075 -141946 -312529 -113459 231357 -97698 -304685 198445 -48144 99296
10606 -433085 27090 39526 -233413 -263269 -231528 -4300 -48612 -178382 -89971 -199535 -145366
10595 -145366 55076 -223185 -174491 -60535 121425 -106587 14310 -11222 -409388 12743 -428933
10583 -78640 -2518 166540 -277812 -159335 -85638 50772 24338 -63887 207087 -411092 -186957
10571 -82650 -140382 -174715 20815 -198434 -116024 -128874 -192276 -110779 -229736 -148675 75640
10559 -6672 -142006 -54042 -189017 -103584 -257450 -139809 -340896 -298148 153014 -36053 -48993
$$ packed form
10640H9409a43951E5400b71678P1332C72841A55106f786k5860r580D9990b8461
10628c4628A43086b82873d9804k10601d5989k58678d1756B4438i7768j04985R0844
10617a11909H4075a41946j70583a13459B31357i7698k06987A98445d8144I9296
10606d33085B7090J2436b33413k9856L1741d300m4312j29770Q8411j09564N4169
10595a45366E5076b23185M8694f0535A21425a06587A4310a1222l98166A2743d28933
10583g8640b518A66540b77812J18477P3697E0772B4338f3887B07087d11092a86957
10571h2650n7732l4333B0815a98434Q2410j2850o3402Q1497j18957Q1061G5640
10559f672j35334e4042j34975Q5433j53866J17641k01087M2748A53014c6053j2940
$$ plain form
10548 -48993 -106143 100443 -197800 -130800 -32963 -47618 195615 -265121 6844 218155 -84554
10536 -221246 -145633 -212886 -277941 -266681 -109318 154381 -82891 -327646 -171633 145565
10525 252412 -335223 -188480 7535 -215074 37466 -28703 44363 -74414 79736 -79308 -97212
10514 -97212 82372 285932 -249352 -86194 -38217 -295282 329665 -286024 102781 -112579
10503 -66638 -359344 106674 -211554 -27056 86282 95261 -130507 -163007 -73105 -47803 -78189
10492 -78189 154376 52373 78632 193074 202497 -18347 318951 19746 316664 373840 96159
10480 -289134 15660 184589 196704 40347 128694 372835 151442 345997 256645 15815 11929
10469 11929 86834 126312 43843 67608 -293283 166255 -474340 -189768 -58945 -341893 108553
$$ packed form
10548d8993n7150A00443a97800O7000c2963j4655A95615b65121F844K11311h4554
10536b21246P5613o7253o5055J1260a09318A54381h2891k44755J56013A45565
10525B52412c35223J46743G535b15074C7466b8703D4363g4414G9736g9308j7904
10514i7212H2372K03560b49352h6194c8217k57065C29665b86024A02781a12579
10503f6638k92706A06674b11554b7056H6282Q979a30507l2500g3105K5302l0386
10492g8189A54376E2373K6259J14442R423a8347C18951A9746K96918N7176I6159
10480b89134A5660J68929J2115D0347Q8347K44141A51442J94555q9352A5815l886
10469A1929P4905L9478D3843K3765b93283A66255d74340a89768e8945k82948A08553
$$ plain form
10457 465765 -246805 -162428 -28000 -218531 187714 46355 90008 -43041 -243268 -50323 235585
10445 -55668 -204317 119195 -406709 -399257 75168 -272138 -143639 115426 -270752 -243832
10435 -243832 257410 -103376 72140 96381 -91104 -145094 -100944 67962 54276 -180495 -294542
10424 -294542 -135494 -152348 -125973 11609 36302 -250156 -251173 -18432 -95123 -291699 85108
10412 397630 -264743 -13316 7837 -45625 -36768 104151 116351 -91790 290090 20666 410079
10401 410079 -4295 -154236 -92321 -12478 58929 117551 -275770 77684 -169934 192574 -24693
10389 150572 347113 96751 20924 30336 99843 -139728 13851 122475 -187161 5937 -11961
10377 657178 264724 66190 5204 85718 380659 83147 -101710 69732 228806 348790 553220
$$ packed form
10457D65765b46805Q4377b8000j90531A87714D6355M3653d3041k00227e0323B35585
10445e5668j48649A19195d06709P452G5168b72138J28499A15426b70752K6920
10435b43832B57410a03376G2140K4241i1104n3990M4150F7962j3686a80495j14047
10424b94542a35494j6854K6375A1609K4693b50156j017a8432p6691j96576H5108
10412C97630b64743a3316G837d5625Q857A04151J2200i1790B90090B0666L89413
10401D10079d295j49941O1915a2478E8929N8622b75770G7684a69934A92574b4693
10389A50572J96541I6751B0924R412O9507a39728A3851J08624a87161E937a1961
10377F57178B64724F6190E204Q0514K94941H3147a01710F9732J59074J19984K04430
$$ plain form
10366 553220 407770 132916 330763 786489 269203 602897 373141 145278 149887 245625
10356 245625 315044 -52547 -42190 395049 443872 311165 307723 393937 476837 241170 359654
10345 359654 193497 546815 553788 363049 340930 364078 18869 197852 158487 487315 165971
10333 874 59043 -89807 148405 139022 -6342 -168119 240259 115700 -63824 -137243 48334 246769
10321 246769 251683 264530 58150 394671 551648 132454 316577 -55519 273947 -74265 172925
10309 -104521 205508 234781 7272 -57874 -205256 42917 96209 -103151 -341146 -55451 47090
10297 140937 128904 204748 217014 -317063 92637 4344 -75605 -91443 47642 -112261 -143218
10286 -143218 199449 20162 -186791 106351 -137911 -224341 -235324 270769 89637 399039
$$ packed form
10366E53220j45450A32916J97847M55726B69203L33694k29756A45278M609R5738
10356B45625O9419e2547J0357C95049M8823j32707l442Q6214Q2900k35667J18484
10345C59654j66157L53318O973j90739k2119K3148A8869J78983l9365L28828A65971
10333H74N8169h9807A48405r383f342j61777B40259A15700f3824p3419D8334J98435
10321B46769M914J2847E8150L36521J56977A32454J84123e5519B73947g4265A72925
10309a04521B05508K9273G272e7874j47382D2917N3292a03151k37995e5451D7090
10297A40937j2033P5844J2266c17063I2637D344g5605j5838D7642a12261l0957
10286a43218A99449B0162a86791A06351a37911q6430j0983B70769H9637L09402
$$ plain form
10276 399039 -68178 191318 -243511 245506 -155347 72025 -310385 25716 -120026 5167
10265 63742 3063 47906 -328529 50120 -39618 -77660 200328 -57829 -25912 431281 -110805
10253 175982 -73748 241856 173798 359773 99097 405202 -178854 -22423 -162477 250206
10242 -218360 14542 -73975 134012 11913 -101179 -102724 -121073 -113426 -224973 -368224 -38516
10230 -119328 150992 76375 140051 -211834 -26441 -254236 80495 261107 -5611 -117595 384879
10218 -203935 -43621 -384148 -437578 12033 46181 -210811 -257681 717 -338061 161333 197256
10207 197256 36551 -292728 89687 -507212 -271894 202318 -51069 -64565 -54897 204780 -147959
10195 112552 -352870 140985 -170915 -76370 -79860 -50741 -9769 -288590 138097 -109534 -17036
$$ packed form
10276C99039f8178A91318b43511B45506a55347G2025c10385B5716a20026E167
10265F3742C063M4843c28529E0120c9618l8042B00328e7829b5912D31281a10805
10253A75982g3748B41856o8058J85975I9097L06105a78854b2423j40054B50206
10242b18360A4542g3975A34012A1913a01179j545j8349P647j11547j43251c8516
10230a19328A50992p4617O3676b11834b6441k27795H0495J80612e611j11984C84879
10218b03935d3621l40527n3430A2033L4148b10811m6870G17c38061A61333L5923
10207A97256C6551b92728H9687e07212K35318B02318e1069j3496R668B04780a47959
10195A12552c52870A40985a70915g6370l490K9119i769k78821A38097a09534a7036
$$ plain form
10183 268276 -190430 179489 -285488 42308 58414 75195 162707 -134110 43518 -62748 312331
10171 -260153 -167747 -17746 -177716 -153134 1630 -122463 148068 -308059 -162656 -170436 36208
10159 180353 -230393 -200389 41641 -56716 -215366 -54381 -351196 -41484 -235223 92186 -150522
10147 -122176 -34934 11646 34918 -392292 178891 -252678 -257690 -230027 -160749 -265635 13182
10135 77390 73383 -237526 8585 47184 -460078 330836 -19214 -73681 176076 -193519 -234189
10124 -234189 29598 301410 -57298 -164403 -190790 -288890 6418 228833 -90368 -83119 -167245
10113 -167245 -48621 -242404 -148748 -229532 29840 33890 -376375 -105056 -70599 51481 -202790
10101 17045 316234 -110666 -216157 -137489 -86963 343679 -133866 24225 -32649 145187
$$ packed form
10183B68276a90430A79489b85488D2308J6106J6781Q7512a34110D3518f2748C12331
10171b60153R2406a7746j59970K4582A630a22463A48068c08059J45403p780C6208
10159A80353b30393L0004D1641e6716j58650e4381k96815d1484j93739I2186a50522
10147a22176c4934A1646K3272c92292A78891b52678n012K7663O9278j04886A3182
10135G7390m007b37526H585L8599d60078C30836a9214n4467A76076a93519m0670
10124b34189B9598K71812e7298j07105k6387r8100F418K22415i0368P249q4126
10113a67245d8621j93783R3656q0784B9840M050c76375a05056L4457E1481b02790
10101A7045K99189a10666j05491P8668N0526C43679a33866B4225c2649A45187
$$ plain form
10090 -110169 -238949 317276 -227294 -92680 -153335 249759 -8561 -94438 -201328 54104 216269
10079 216269 -67097 169893 60579 -75367 76753 -248624 -10572 -34153 -50623 -78457 -95565
10068 -95565 -211731 -284391 202517 207193 254963 -222807 75631 39730 261090 161528 -10839
10056 -97449 -53415 -138702 -187117 163462 -28483 -220407 172316 -388468 324981 18603 -251876
10044 -139090 -60976 -27999 -233353 -73462 -113208 30560 181343 75646 214497 9555 -8076
10032 -274420 153316 -169572 -327483 30119 -58489 29819 -105708 -309877 296628 -290223
10021 3906 -213397 106182 189964 -341671 -158713 -103172 -34622 101285 -198941 -110236 -152036
10010 -152036 -138310 149174 -68025 -91038 74670 -66267 -2152 -1039 -631657 -247553 -135666
$$ packed form
10090a10169j28780C17276b27294i2680o0655B49759h561q5877j06890E4104J62165
10079B16269f7097A69893F0579g5367G6753b48624a0572k3581j6470k7834j7108
10068i5565j16166p2660B02517M676M7770b22807G5631l5901K21360r9562a0839
10056i7449M4034q5287m8415A63462b8483j91924A72316c88468C24981A8603b51876
10044a39090f0976b7999k05354g3462l9746C0560J50783G5646J38851I555h076
10032b74420A53316a69572j57911C0119e8489B9819a05708k04169B96628b90223
10021C906b13397A06182Q3782c41671a58713N5541c4622A01285a98941Q8705m1800
10010a52036J3726A49174f8025k3013G4670f6267b152a039o30618b47553J11887
$$ plain form
9999 -135666 -57957 -226508 30337 -76223 -71891 -192313 176143 -91319 203327 107145 42253
9987 -65085 99017 286171 16142 -105171 -132984 94312 92972 153138 -331470 109228 168958
9976 168958 44082 -131871 -212443 40269 212132 55488 -237360 -332921 308864 -319867 32769
9964 148270 36643 -43956 79251 11394 -16657 317916 -201654 -229383 -40491 -94088 147143
9952 -74641 -401601 94218 -323878 -162320 -214017 198119 -118412 302854 -353162 -39560
9941 -383196 -43805 -77227 11751 -110532 94046 -222544 -94831 44977 278946 -494776 -99202
9929 128187 281150 -333262 -98650 -108800 -215369 147680 -73240 -225841 139160 -56779
9918 53791 135573 -183300 -73925 -228259 45066 151809 -365485 101476 128969 -354824 -118649
$$ packed form
9999a35666e7957j68551C0337g6223M332j20422A76143i1319B03327r6182D2253
9987f5085I9017J87154A6142a05171k7813I4312j340O0166c31470A09228N9730
9976A68958D4082a31871q0572D0269J71863E5488b37360r5561C08864c19867C2769
9964A48270C6643d3956G9251A1394a6657C17916b01654k7729d0491n3597A47143
9952g4641l26960I4218c23878J61558n1697A98119a18412C02854c53162c9560
9941c83196d3805l3422A1751a10532I4046b22544i4831D4977K33969d94776i9202
9929A28187J52963c33262i8650j0150j06569A47680g3240j52601A39160e6779
9918E3791Q1782a83300g3925j54334D5066J06743c65485A01476K7493c54824a18649
$$ plain form
9906 -10940 -126363 -216732 -116294 6405 -26919 -18249 -171720 84696 -25114 232490 -55118
9894 -212246 57376 71118 221991 6723 -3956 -137691 -35544 -47387 -298644 50298 -300354
9882 -313821 294955 -211327 -225270 -4834 -118600 -79021 -290898 330774 -60226 142941 -73940
9870 196397 -18269 -99779 -119203 236387 190682 -113886 1799 -11860 -31794 -371001 -429905
9859 -429905 33778 -178679 -207582 57691 -149355 -147321 -124168 -65385 -317776 -169291 17752
9847 -6947 136914 -147217 -99221 -30477 -314722 -848 24470 130912 114935 -298934 -23271
9835 7014 76280 35539 -63607 -97261 27202 14779 -73006 -198832 273208 -217450 -138556
9824 -138556 -74649 -14245 -329774 -66761 -96391 -82155 -4710 23094 91464 3741 -100481 -84638
$$ packed form
9906a0940j15423r0369J00438F405b6919Q670j53471H4696b5114B32490e5118
9894b12246E7376J3742J50873F723c956j33735c5544j1843k51257E0298c00354
9882c13821B94955b11327j3943d834j13766L9579k11877C30774f0226A42941g3940
9870A96397a8269q1510j9424B36387m5705a13886A799a1860j9934l39207n8904
9859d29905C3778a78679k8903E7691a49355K034K3153N8783k52391J48485A7752
9847f947A36914a47217M7996c0477k84245h48B4470J06442j5977b98934b3271
9835G014O9266C5539f3607l3654B7202j2423g3006j25826B73208b17450P8894
9824a38556O3907a4245l15529f6761k9630J4236d710B3094O8370C741a00481J5843
$$ plain form
9812 -84638 -67755 -77285 15970 -108246 61320 -320305 275454 -442220 35231 130042 -22136
9800 -334893 122875 -128239 75992 -49382 -266324 -151437 94857 -106826 -183004 164141
9789 -200735 332378 -414514 -331147 277436 27362 64310 12939 88134 -144060 -352414 -137563
9777 -382868 -214519 250517 76114 117653 27813 -360950 291477 -107487 87064 -381346
9766 -152694 -64873 -269496 106573 -195669 -40495 -75920 38864 -102413 -364896 -372556 -192726
9755 -192726 90176 -30076 100447 162737 -62251 98406 -155389 -245837 -341500 98680 -295686
9743 146395 141010 289769 61615 114576 -59394 -18576 100003 -365285 -304466 9172 -164986
9731 414405 218771 115017 -86929 224062 160664 -353333 74601 -23272 120710 -141742
$$ packed form
9812h4638J6883r530A5970a08246F1320c20305B75454d42220C5231R4811b2136
9800c34893A22875a28239G5992d9382k16942J14887I4857a06826p6178A64141
9789b00735C32378d14514Q3367B77436B7362L6948A2939P5195a44060k08354a37563
9777c82868J68349B50517G6114M1539B7813c60950B91477a07487H7064c81346
9766a52694f4873k04623A06573a95669d0495l5425C8864a02413k62483p660J79830
9755a92726I0176c0076A00447O2290f2251I8406a55389r0448r5663I8680b95686
9743A46395n385J48759F1615N2961e9394a8576A00003c65285O0819I172a64986
9731D14405j95634j03754h6929B24062o3398c53333G4601b3272A20710a41742
$$ plain form
9720 71510 -214691 54928 -163870 -42835 -234860 14851 -228912 -133410 -109282 -335051 9903
9708 -243274 -42216 -364275 231443 -98184 -41302 -67851 12990 -43260 -161909 13335 -32653
9696 212637 -3739 111401 -323908 -36346 36930 41318 -125728 -418503 -87797 -96608 35436
9684 -65743 59151 -242840 -146402 -238370 106996 -80860 -215896 -255009 -304406 52107 -19512
9672 -229683 211880 1797 -62423 -155488 -118246 40 -292375 107208 -190813 141177 -127601
9660 -88747 -2599 -321972 13198 -46638 -217592 -166755 -732457 108045 141942 125670 -71470
9648 1201 25069 234090 110491 -595970 294877 -91290 64791 -125049 -135649 -10093 139677
9636 101552 91200 -23691 -116452 -110578 -236802 -137084 -298552 -150689 -300300 244048 -134664
$$ packed form
9720G1510b14691E4928a63870d2835j92025A4851b28912R5502K4128k25769I903
9708b43274d2216l22059B31443i8184d1302k6549A2990d3260j18649A3335c2653
9696B12637c739A11401c23908c6346C6930M388a25728k92775h7797q811C5436
9684f5743E9151b42840R6438r1968A06996h0860j35036l9113m9397E2107a9512
9672b29683B11880A797f2423r3065L7242D0b92375A07208a90813A41177a27601
9660h8747b599l19373A3198d6638j70954N0837n65702A08045L3897j6272g1470
9648A201K3868K09021A10491e95970B94877i1290F4791a25049j0600a0093A39677
9636A01552j0352b3691r2761N874j26224R9718j61468J47863j49611B44048a34664
$$ plain form
9624 -171037 -96475 -37812 300 -85070 33355 111281 -87288 -19304 101317 121327 -150819 -99480
9612 -99480 -41704 93889 -58681 -117720 -255877 -193690 -21078 -236209 248090 -35176 84720
9600 39451 -316877 -19228 -220358 -88040 -101583 -236869 -116193 -91009 189580 -37222 72731
9588 -58887 13290 76529 -204533 23870 -263465 -235092 -316658 -166134 -16406 17358 133834
9577 133834 -91002 -128659 -354045 -14088 -123212 -100591 60938 24444 99929 29459 -319485
9565 -69465 13491 -238460 -170034 231098 -135546 66825 126475 -314553 -122570 -83652 -32577
9553 -69794 140722 -65868 -142001 -10765 -90179 -90384 -156734 -335658 232747 44600 -52179 -311134
9541 -311134 41325 -62456 236591 -407451 396424 48766 -15122 -178000 115637 30757 -235577
$$ packed form
9624a71037P4562c7812C00h5070C3355P7926h7288a9304A01317K0010a50819N1339
9612i9480d1704I3889e8681n9039j38157O2187b1078k15131B48090c5176H4720
9600C9451c16877a9228k01130h8040j3543j35286a16193K5184A89580c7222G2731
9588e8887A3290O3239b04533B3870b63465K8373q1566J50524a6406A7358J16476
9577A33834i1002l7657k25386a4088j09124K2621F0938B4444P5485B9459c19485
9565f9465A3491b38460O8426B31098a35546F6825N9650c14553a22570L8918c2577
9553f9794A40722f5868p6133a0765p9414k05o6350j78924B32747D4600e2179k58955
9541c11134D1325f2456B36591d07451C96424D8766a5122j62878A15637C0757b35577
$$ plain form
9529 -256971 -254521 -148887 114269 104713 51278 -47135 -277994 56129 43514 10286 92396
9518 92396 198642 -87776 95063 -35288 -86779 -32003 178460 -428725 23942 -132666 114646
9506 -246594 234868 72182 -284282 -220144 24927 194793 -137194 262460 -207573 -110057
9496 -110057 113429 25897 -360608 -6173 -99750 -43231 176556 -120537 -45537 -165044 99208
9484 -32389 -166735 -391712 -329292 -210133 86381 143882 -109681 -316339 -339331 -544693 -37661
9472 -117971 94287 -396585 -236861 -68489 -30409 -70099 -81726 36588 -188488 -298447 -240587
9461 -240587 -435591 37799 180136 -82076 73060 -288188 51781 -26933 6433 -291213 -24361
9449 -10274 177496 643834 169827 -35478 21285 -94682 180235 -145620 123987 -285309
$$ packed form
9529b56971K450J05634A14269r556E1278d7135k30859E6129j2615A0286Q2110
9518I2396J06246h7776I5063c5288n1491c2003A78460d28725B3942a32666A14646
9506b46594B34868G2182b84282O4138B4927J69866a37194B62460b07573R7516
9496a10057A13429B5897c60608f173r3577d3231A76556a20537d5537j19507I9208
9484c2389j34346k24977O2420J19159H6381N7501a09681k06658k2992k05362c7661
9472a17971I4287c96585J59724f8489c0409l9690j1627C6588a88488j09959N7860
9461b40587j95004C7799J42337h2076G3060b88188E1781b6933F433b91213b4361
9449a0274A77496M66338A69827c5478B1285i4682A80235a45620A23987b85309
$$ plain form
9438 214500 -171780 222982 71501 -154280 169386 92334 -145538 -247470 -145126 -77128
9428 -77128 259314 201818 -20396 -3943 -253619 145472 -11901 243594 -146433 55623 45055
9417 45055 -199339 -88285 123867 91735 -76033 -102506 193489 -155675 -267624 -212148 81125
9405 -113225 -162490 -313919 16149 311473 -294148 -223258 -470885 -69585 92600 -101886 -267601
9394 -267601 -97035 74814 -20371 -40156 -195124 -1807 267661 113456 -173771 -266 -156417
9383 -156417 47981 -89941 -173218 -307069 -68683 -3987 -202818 -14744 52987 42095 -120165
9371 -78172 222666 57415 -68766 -317344 -89899 170702 -70928 25302 -295219 -259049 -170097
9360 -170097 -523290 258459 -84611 -187547 15813 -398050 42449 131421 -2787 -251781 -41140
$$ packed form
9438B14500a71780B22982G1501a54280A69386p7052a45538j01932J02344O7998
9428g7128B59314n7496b0396c943k49676A45472a1901B43594a46433E5623j0568
9417D5055a99339h8285A23867l2132g6033k6473A93489a55675j11949N5476H1125
9405a13225m9265j51429A6149K95324b94148P0890k47627f9585I2600a01886j65715
9394b67601i7035G4814b0371j9785j54968a807B67661A13456a73771b66j56151
9383a56417D7981h9941q3277j33851f8683c987j98831a4744E2987j0892a20165
9371g8172B22666E7415f8766k48578h9899A70702g0928B5302b95219L6170Q8952
9360a70097l53193B58459h4611j02936A5813c98050D2449Q8972b787k48994d1140
$$ plain form
9348 -201216 -20095 -131505 16438 -213358 -81011 -33393 -435315 -394714 26840 -165873 -276581
9337 -276581 38212 18022 -52135 -98759 -109761 -133087 -229242 -5914 -70191 188979 -375551
9325 -90941 -79101 -92231 110794 -136264 -296401 -26444 210494 -156637 -189245 104839 -220055
9313 -155334 -277029 -52790 -161681 -96836 -55043 -17370 -127172 409300 -97270 -3872 91318
9301 205071 -161547 129156 -110993 -87439 -394161 -241084 -76090 -13826 -58382 -327121
9291 -327121 267746 51317 -131328 8119 128385 159420 -115314 -181593 57258 -126004 13731
9279 -6306 -229261 -231931 55636 -51827 -3774 -76269 -64964 -114100 60589 -213761 -123814 -202134
9267 -202134 -169140 11806 -77345 -52922 170722 -312409 -125822 -22275 -168158 275292 30853
$$ packed form
9348b01216b0095j11410A6438b13358h1011c3393m01922M0601B6840a65873j10708
9337b76581C8212A8022e2135m6624j1002k3326r6155e914o4277A88979c75551
9325i0941J1840j3130A10794a36264j60137b6444B10494a56637l2608A04839b20055
9313a55334j21695e2790j08891O4845M1793a7370j09802D09300i7270c872I1318
9301B05071a61547A29156a10993K3554l06722J53077g6090a3826m4556k68739
9291c27121B67746E1317a31328H119J20266L1035a15314o6279E7258a26004A3731
9279f306k22955k670E5636e1827c774p2495J1305m9136F0589b13761Q9947p8320
9267b02134L2994A1806g7345K4423A70722c12409a25822b2275j45883B75292C0853
$$ plain form
9255 -115122 -199779 -313199 -79961 -198634 -73436 191176 -191440 -69716 -93544 -84155 -136598
9244 -136598 228155 16410 -137209 -149596 -181778 -239342 -284514 10023 -110779 -383579 15637
9232 -267338 382202 -8178 -33419 -125796 96940 -153289 -76346 -164002 -20575 -167334 -114572
9221 -114572 94000 -161293 132858 -106784 100849 -542 -144226 -54315 68274 193842 -464545
9209 1375 322906 -123353 -387045 -166232 -84222 -169648 168716 -456389 97130 111345 -23133
9197 -151376 -335599 -40146 -316579 -77906 -501699 -72390 -78980 -122647 -26220 -524010 106434
9185 -210276 -118000 -23305 164382 20052 -183453 -288563 -47182 181293 -3029 76479 -121145
9173 -356600 346387 121089 -189475 233215 -222004 -125406 159879 202685 -124734 -183427
$$ packed form
9255a15122q4657j13420g9961j18673g3436A91176a91440f9716k3828R389n2443
9244a36598B28155A6410a37209j2387l2182n7564m5172A0023a10779k72800A5637
9232b67338C82202h178k5241r2377I6940a53289g6346q7656b0575j46759N2762
9221a14572I4000a61293A32858a06784A00849e42j43684e4315F8274J25568d64545
9209A375L21531a23353k63692a66232Q2010q5426A68716d56389I7130J4215b3133
9197a51376j84223d0146k76433g7906m23793g2390o590m3667b6220m97790A06434
9185b10276R2276b3305A64382B0052a83453j05110d7182A81293c029G6479a21145
9173c56600C46387A21089a89475B33215b22004R6598A59879M2806a24734n8693
$$ plain form
9163 -183427 348336 -1552 -60809 -17234 -39699 -98661 -326259 62 -256534 -156563 -336148 89000
9150 -46357 -41565 143464 -76081 -296917 -120566 -71889 82662 235778 132886 33788 -85643
9138 86957 182102 153676 91755 34232 -29648 38682 -47254 94317 482087 -195309 -233822
9127 -233822 24462 42346 191192 -412796 194223 -96120 -419793 142998 -577347 222683
9116 -160044 71493 100153 -250435 -242704 -7323 -147468 116998 -42092 -99775 -140828 -90133
9105 -90133 -94372 8718 -243378 -135280 10963 109272 -172923 293263 -258147 78484 -66315
9093 -397465 143382 68427 -268268 -200253 -425219 -17319 -137567 98176 -280807 89264 8009
9081 -270354 -216071 -51074 -124726 -403502 -234135 -148 -72990 -73943 -8396 95049 126783 -6298
$$ packed form
9163a83427C48336a552n9257a7234k2465n8962k27598F2b56534R9971j79585H9000
9150d6357M792A43464g6081k20836a20566M8677H2662J53116j02892C3788h5643
9138H6957R5145k8426o1921C4232b9648C8682d7254I4317L87770a95309l8513
9127b33822B4462J7884J48846d12796A94223i6120l23673A42998e77347B22683
9116a60044G1493K8660b50435P731g323j40145A16998d2092n7683m1053N0695
9105i0133m239H718b43378J08098A0963R8309a72923B93263b58147G8484f6315
9093c97465A43382F8427b68268O8015k24966a7319j20248I8176b80807H9264H009
9081b70354N4283e1074p3652k78776J69367a48p2842r53h396I5049L1734f298
$$ plain form
9068 -92143 -192256 -201546 -233705 111344 107570 -101443 5935 51187 14433 41803 -24551 -154172
9056 -154172 7733 -97285 -8630 -215954 99281 -213160 14450 204686 -154462 -41432 -105650
9045 -105650 99903 -86296 -122689 -299383 36276 74694 -303123 115272 202242 -51488 -333184
9034 -333184 -250347 -183031 -65642 -49468 146934 -80065 -125203 46652 116976 -14513 108546
9022 -66129 1934 -14119 -2599 -114363 -231786 28981 -320763 134941 153343 -90584 -31647
9010 278277 -229728 40247 55922 46628 -121199 -142932 -94934 47769 -81349 -31450 -72934
8999 -72934 -238622 -296363 -83957 -99787 173924 -5238 -383518 278392 -78113 -158254 -76175
8987 -110646 -311372 -164591 -130597 234767 -14951 222176 -101736 31427 14504 11386 -155402
$$ packed form
9068i2143j00113r290l2159A11344l774a01443E935M5252A4433K7370b4551j29621
9056a54172G733i7285h630k07324I9281b13160A4450J90236a54462d1432o4218
9045a05650I9903h6296l6393j76694C6276L8418c03123A15272Q6970e1488k81696
9034c33184Q2837O7316f5642J6174A46934h0065m5138D6652P0324a4513A08546
9022f6129A934a4119b599j11764j17423B8981c20763A34941J8402i0584c1647
9010B78277b29728D0247J5675r294a21199k1733M7998D7769h1349c1450m1484
8999g2934j65688n7741h3957j5830A73924e238l78280B78392g8113q0141g6175
8987a10646k00726J46781L3994B34767a4951B22176a01736C1427A4504l118a55402
$$ plain form
8975 -264915 255644 -7269 186891 -233172 177761 249021 86727 111663 -66648 -107589 158029
8963 -234454 41892 -240943 -52340 -107655 -174441 -292223 152408 -254022 -129785 -69110 -238301
8952 -238301 -243118 98288 -30094 -242634 -90030 -244884 -134566 -222693 130841 487090 43630
8940 -26062 -322820 -176802 222531 9554 -481087 -164383 43408 141219 441645 -86882 -87407
8929 -87407 -143120 -15558 -138488 -92409 -305310 -356237 423570 686910 1357556 4770193
8919 4770193 15566469 4964140 1608700 621727 624466 215182 -129922 187539 -23102
8909 62642 -239456 45303 -184202 309712 239 -174068 87762 173365 -247961 107808 -65807
8897 -20242 7363 -78825 -280687 302404 123777 60971 105183 -27032 182509 179080 -224369
$$ packed form
8975b64915B55644g269A86891b33172A77761P1260H6727K4936f6648m0941A58029
8963b34454D1892b40943e2340n5315o6786j17782A52408b54022J24237O0675j69191
8952b38301m817I8288c0094k12540i0030j54854J10318q8127A30841L56249D3630
8940b6062k96758J46018B22531I554d81087a64383D3408R7811L00426h6882n25
8929h7407n5713a5558j22930M6079k12901n0927D23570K63340O70646L412637
8919D770193J0796276D964140A608700F21727K739B15182a29922A87539b3102
8909F2642b39456D5303a84202C09712B39a74068H7762Q5603b47961A07808f5807
8897b0242G363g8825k01862C02404A23777F0971M4212b7032A82509l429b24369
$$ plain form
8885 250678 -109683 118490 -190172 -187381 312826 -75639 -193577 -120827 -117773 21864 -156225
8873 118925 201672 305284 -15785 -35891 66971 -219390 -107283 33445 13478 52940 147795
8862 147795 -145932 45125 -174258 27050 -199809 -381796 204125 16147 83494 29344 -138658
8850 246946 94358 -31834 -279249 125142 96373 -46710 -153929 63953 -253558 1858 183309
$$ packed form
8885B50678a09683A18490a90172K791C12826g5639j17938P2750L054B1864a56225
8873A18925Q2747J03612a5785k0106F6971b19390a07283C3445A3478L9462R4855
8862A47795a45932D5125a74258B7050a99809j81987B04125A6147O7347B9344a38658
8850B46946I4358c1834k47415A25142k8769d6710j07219F3953b53558A858J81451
$$ [...]
##END NTUPLES=NMR SPECTRUM
##END=
