
##TITLE=AC1235_CETAH12095_6610385_JaHScvh5pF
##JCAMPDX= 6.0         $$ Bruker NMR JCAMP-DX V2.0
##DATA TYPE= NMR SPECTRUM
##DATA CLASS= NTUPLES
##ORIGIN= BRUKER
##OWNER= Administrator
$$ 1.72 TOPSPIN		Version 2.1
$$ 2012-08-02 02:01:30.421 -0500  Administrator@TOPSPIN
$$ Compression mode = diff/dup
##.OBSERVE FREQUENCY= 400.02188249412
##.OBSERVE NUCLEUS= ^1H
##.ACQUISITION MODE= SIMULTANEOUS (DQD)
##.ACQUISITION SCHEME= undefined
##.AVERAGES= 64
##.DIGITISER RES= 22
##SPECTROMETER/DATA SYSTEM= spect
##.PULSE SEQUENCE= noesygpps1d.comp
##.SOLVENT NAME= COFFEE_meoh
##.SHIFT REFERENCE= INTERNAL, COFFEE_meoh, 1, 14.96241
##AUDIT TRAIL= $$ (NUMBER, WHEN, WHO, WHERE, PROCESS, VERSION, WHAT)
$$ ##TITLE= Audit trail, TOPSPIN		Version 2.1
$$ ##JCAMPDX= 5.01
$$ ##ORIGIN= Bruker BioSpin GmbH
$$ ##OWNER= Administrator
$$ $$ C:\Bruker\TOPSPIN/data/COFFEE/nmr/AC1235_CETAH12095_6610385_JaHScvh5pF/12/pdata/1/auditp.txt
$$ ##AUDIT TRAIL=  $$ (NUMBER, WHEN, WHO, WHERE, PROCESS, VERSION, WHAT)
(   1,<2012-08-02 02:01:25.234 -0500>,<Administrator>,<TOPSPIN>,<go>,<TOPSPIN 2.1>,
      <created by zg
	started at 2012-08-02 01:49:55.000 -0500,
	POWCHK enabled, PULCHK disabled,
       configuration hash MD5:
       6B 1B 68 BB D9 2E 58 E2 7F 35 AD 54 07 DF 0E 41
       data hash MD5: 64K
       1E 88 A5 1C 55 1C 6C AE 7C 9D 39 41 15 98 CE 01>)
(   2,<2012-08-02 02:01:28.109 -0500>,<Administrator>,<TOPSPIN>,<proc1d>,<TOPSPIN 2.1>,
      <Start of raw data processing
       efp LB = 0.3 FT_mod = 6 PKNL = 1 PHC0 = 0 PHC1 = 0 SI = 128K 
       data hash MD5: 128K
       5D C1 D9 60 4E E9 AC AF B0 1F D1 C6 70 37 C9 AC>)
(   3,<2012-08-02 02:01:29.281 -0500>,<Administrator>,<TOPSPIN>,<proc1d>,<TOPSPIN 2.1>,
      <pk PHC0 = 1.774292 PHC1 = 0 
       data hash MD5: 128K
       61 0E 8E 86 63 B3 53 95 B4 31 F1 C2 5C 8A 60 A8>)
(   4,<2012-08-02 02:01:30.031 -0500>,<Administrator>,<TOPSPIN>,<proc1d>,<TOPSPIN 2.1>,
      <abs ABSG = 1 
       data hash MD5: 128K
       9D 8E 0C AA CA 70 D0 A7 F0 4D 91 0D 96 80 6C 10>)
(   5,<2012-08-02 02:01:30.125 -0500>,<Administrator>,<TOPSPIN>,<proc1d>,<TOPSPIN 2.1>,
      <abs ABSG = 2 
       data hash MD5: 128K
       BA BE 23 3F 10 60 E0 03 55 0D B6 5A AC 15 8C 00>)
(   6,<2012-08-02 02:01:30.187 -0500>,<Administrator>,<TOPSPIN>,<proc1d>,<TOPSPIN 2.1>,
      <abs ABSG = 3 
       data hash MD5: 128K
       5B 64 58 26 39 6D B4 03 B2 20 12 8C 65 F7 77 6D>)
(   7,<2012-08-02 02:01:30.281 -0500>,<Administrator>,<TOPSPIN>,<proc1d>,<TOPSPIN 2.1>,
      <abs ABSG = 4 
       data hash MD5: 128K
       B8 19 7D DD 17 A6 B5 E0 9F CB D7 43 EE 0E DA 40>)
(   8,<2012-08-02 02:01:30.343 -0500>,<Administrator>,<TOPSPIN>,<proc1d>,<TOPSPIN 2.1>,
      <abs ABSG = 5 
       data hash MD5: 128K
       95 BD 21 9C 53 69 53 1E 25 7B C2 63 64 2E 3A 87>)
$$ ##END=
$$ 
$$ $$ hash MD5
$$ $$ F5 B9 63 11 84 E8 1F 19 79 08 15 68 43 F9 A3 FB
##$RELAX= 
##$RELAX= 
##$RELAX= 
##$RELAX= 
##$RELAX= 
##$RELAX= 
##$RELAX= 
##$RELAX= 
$$ Bruker specific parameters
$$ [...]
150 150 150 150 150 150 150 150
##$TP07= 0
##$TPNAME0= <>
##$TPNAME1= <>
##$TPNAME2= <>
##$TPNAME3= <>
##$TPNAME4= <>
##$TPNAME5= <>
##$TPNAME6= <>
##$TPNAME7= <>
##$TPOAL= (0..7)
0.5 0.5 0.5 0.5 0.5 0.5 0.5 0.5
##$TPOFFS= (0..7)
0 0 0 0 0 0 0 0
##$TUNHIN= 0
##$TUNHOUT= 0
##$TUNXOUT= 0
##$USERA1= <user>
##$USERA2= <user>
##$USERA3= <user>
##$USERA4= <user>
##$USERA5= <user>
##$V9= 5
##$VALIST= <valist>
##$VCLIST= <CCCCCCCCCCCCCCC>
##$VD= 0
##$VDLIST= <DDDDDDDDDDDDDDD>
##$VPLIST= <PPPPPPPPPPPPPPP>
##$VTLIST= <TTTTTTTTTTTTTTT>
##$WBST= 1024
##$WBSW= 4
##$XGAIN= (0..3)
0 0 0 0
##$XL= 0
##$YL= 0
##$YMAX_a= 16244458
##$YMIN_a= -9490731
##$ZGOPTNS= <>
##$ZL1= 120
##$ZL2= 120
##$ZL3= 120
##$ZL4= 120
##$ABSF1= 14.96241
##$ABSF2= -5.595772
##$ABSG= 5
##$ABSL= 3
##$ALPHA= 0
##$AQORDER= 0
##$ASSFAC= 0
##$ASSFACI= 0
##$ASSFACX= 0
##$ASSWID= 0
##$AUNMP= <proc_prof1d_extract.lims>
##$AXLEFT= 0
##$AXNAME= <>
##$AXNUC= <1H>
##$AXRIGHT= 0
##$AXTYPE= 0
##$AXUNIT= <>
##$AZFE= 0.1
##$AZFW= 0.1
##$BCFW= 0
##$BC_mod= 0
##$BYTORDP= 0
##$COROFFS= 0
##$CY= 15
##$DATMOD= 1
##$DC= 0
##$DFILT= <>
##$DTYPP= 0
##$F1P= 0
##$F2P= 0
##$FCOR= 0.5
##$FTSIZE= 131072
##$FT_mod= 6
##$GAMMA= 0
##$GB= 0
##$INTBC= 1
##$INTSCL= 1
##$ISEN= 128
##$LB= 0.3
##$LEV0= 0
##$LPBIN= 0
##$MAXI= 10000
##$MC2= 0
##$MEAN= 0
##$ME_mod= 0
##$MI= 0
##$NCOEF= 0
##$NC_proc= -2
##$NLEV= 6
##$NOISF1= 0
##$NOISF2= 0
##$NSP= 0
##$NTH_PI= 0
##$NZP= 0
##$OFFSET= 14.96241
##$PC= 1
##$PHC0= 1.774292
##$PHC1= 0
##$PH_mod= 1
##$PKNL= yes
##$PPARMOD= 0
##$PPDIAG= 0
##$PPIPTYP= 0
##$PPMPNUM= 2147483647
##$PPRESOL= 1
##$PSCAL= 4
##$PSIGN= 0
##$PYNMP= <proc.py>
##$REVERSE= no
##$SF= 400.020009072549
##$SI= 131072
##$SIGF1= 0
##$SIGF2= 0
##$SINO= 400
##$SIOLD= 131072
##$SPECTYP= <>
##$SREGLST= <1H.CDCl3>
##$SSB= 0
##$STSI= 131072
##$STSR= 0
##$SW_p= 8223.68421052631
##$SYMM= 0
##$S_DEV= 0
##$TDeff= 65536
##$TDoff= 0
##$TI= <>
##$TILT= no
##$TM1= 0
##$TM2= 0
##$TOPLEV= 0
##$USERP1= <user>
##$USERP2= <user>
##$USERP3= <user>
##$USERP4= <user>
##$USERP5= <user>
##$WDW= 1
##$XDIM= 131072
##$YMAX_p= 443820001
##$YMIN_p= -12176
##$CURPLOT= <Network HP LaserJet P1505>
##$CURPRIN= <$Network HP LaserJet P1505>
##$DFORMAT= <normdp>
##$LAYOUT= <+/1D_H.xwp>
##$LFORMAT= <normlp>
##$PFORMAT= <normpl>
##$SURQMSG= 1
$$ End of Bruker specific parameters
$$ ---------------------------------
##NTUPLES= NMR SPECTRUM
##VAR_NAME=  FREQUENCY,     SPECTRUM/REAL,   SPECTRUM/IMAG
##SYMBOL=    X,             R,               I
##VAR_TYPE=  INDEPENDENT,   DEPENDENT,       DEPENDENT
##VAR_FORM=  AFFN,          ASDF,            ASDF
##VAR_DIM=   131072,        131072,          131072
##UNITS=     HZ,            ARBITRARY UNITS, ARBITRARY UNITS
##FACTOR=    0.0627417313425164, 1,          1
##FIRST=     8223.62146879497, 1030,         -61046
##LAST=      0,             3367,            -61200
##MIN=       0,             -12176,          0
##MAX=       8223.62146879497, 443820001,    0
$$ Real data points
##PAGE= N=1
##DATA TABLE= (X++(R..R)), XYDATA
$$ [...]
$$ plain form
63240 400427 409734 419066 428932 440429 454261 470398 488411 507729 527831 548712 570946 594845
63228 594845 619793 644898 670075 695769 721711 746589 769160 789289 807792 825637 843405
63217 843405 861218 879003 896914 915382 934603 954052 972760 989952 1005076 1017257 1025134 1027458
63205 1027458 1023777 1014462 1000093 980864 956614 927530 894788 860360 826160 793488 763150 735717
63193 735717 711490 690491 672670 658035 646580 638306 633259 631267 631701 633921 637997 644591 654092
63180 654092 666265 680759 697344 715479 734239 753007 771837 790849 809700 827921 845396
63169 845396 862247 878597 894606 910344 925411 939076 950932 960910 968540 972807 972983 968983 960728
63156 960728 947920 930825 910621 888432 864610 839338 813254 786945 760554 734487 709884
$$ packed form
63240D00427R307R332R866J1497J3832J6137J8013J9318K0102K0881K2234K3899
63228E94845K4948K5105K5177K5694K5942K4878K2571K0129J8503J7845J7768
63217H43405J7813J7785J7911J8468J9221J9449J8708J7192J5124J2181P877K324
63205A027458l681r315j4369j9229k4250k9084l2742l4428l4200l2672l0338k7433
63193G35717k4227k0999j7821j4635j1455q274n047j992M34K220M076O594R501
63180F54092J2173J4494J6585J8135J8760J8768J8830J9012J8851J8221J7475
63169H45396J6851J6350J6009J5738J5067J3665J1856R978P630M267J76m000q255
63156I60728j2808j7095k0204k2189k3822k5272k6084k6309k6391k6067k4603
$$ plain form
63145 709884 687674 667712 649523 633320 619481 607520 596450 585911 576218 567688 560602 555417
63133 555417 552155 549879 547595 545387 543886 542983 542063 541229 541213 542049 542892 543313 543816 544871 546279 547893
63117 547893 550172 553527 557642 561895 566090 570333 574490 578226 581578 585203 589816 595370 600941 605659
63103 605659 609729 614114 619159 624062 627976 631098 634137 637163 639555 640859 641165 640854 640412 640256 640322 640080
63087 640080 639350 638716 638715 639134 639673 640808 643185 646536 650092 653794 658195 663347 668754 674481 681352 689802
63071 689802 699304 709207 719510 730534 742291 754506 766992 779935 794010 810095 828485 848523
63059 848523 869419 891266 914792 940445 968306 998705 1032082 1068264 1106589 1146806 1189257
63048 1189257 1234153 1281323 1330653 1382024 1434666 1487258 1538855 1589148 1637735 1683942 1727706
$$ packed form
63145G09884k2210j9962j8189j6203j3839j1961j1070j0539r693q530p086n185
63133E55417l262k276k284k208j501r03r20q34j6Q36Q43M21N03J055J408J614
63117E47893K279L355M115M253M195M243M157L736L352L625M613N554N571M718
63103F05659M070M385N045M903L914L122L039L026K392J304L06l11m42j56O6k42
63087F40080p30o34jM19N39J135K377L351L556L702M401N152N407N727O871Q450
63071F89802R502R903J0303J1024J1757J2215J2486J2943J4075J6085J8390K0038
63059H48523K0896K1847K3526K5653K7861L0399L3377L6182L8325M0217M2451
63048A189257M4896M7170M9330N1371N2642N2592N1597N0293M8587M6207M3764
$$ plain form
63037 1727706 1770019 1812008 1853914 1895329 1936173 1977073 2018874 2061898 2105461 2147966 2187458
63026 2187458 2222037 2249682 2268174 2275758 2271849 2256700 2230468 2193079 2145002 2087761 2023677 1955391
63014 1955391 1885466 1815917 1748010 1682733 1621353 1565273 1515585 1473076 1438320 1411254 1390961
63003 1390961 1376503 1367860 1365582 1369706 1379510 1394090 1412567 1433944 1457463 1483072 1510947 1540672
62991 1540672 1571414 1602684 1634233 1665406 1695418 1724237 1752412 1779927 1805830 1829032 1848782
62980 1848782 1864342 1874755 1879056 1876331 1865711 1846859 1820260 1786462 1745333 1696745 1641737 1582201
62968 1582201 1519733 1455603 1391488 1329042 1268848 1210903 1156053 1105761 1060392 1019021 981153
62957 981153 947353 917771 891324 866936 844594 824569 806637 790735 777422 766812 757740 748754
$$ packed form
63037A727706M2313M1989M1906M1415M0844M0900M1801M3024M3563M2505L9492
63026B187458L4579K7645J8492P584l909j5149k6232l7389m8077n7241o4084o8286
63014A955391o9925o9549o7907o5277o1380n6080m9688m2509l4756k7066k0293
63003A390961j4458q643k278M124R804J4580J8477K1377K3519K5609K7875K9725
62991A540672L0742L1270L1549L1173L0012K8819K8175K7515K5903K3202J9750
62980A848782J5560J0413M301k725j0620j8852k6599l3798m1129m8588n5008n9536
62968A582201o2468o4130o4115o2446o0194n7945n4850n0292m5369m1371l7868
62957I81153l3800k9582k6447k4388k2342k0025j7932j5902j3313j0610r072q986
$$ plain form
62945 748754 739481 730405 721835 713719 705984 698480 690892 683109 675295 667351 658842 649772 640867 632748
62931 632748 625329 618299 611532 604774 597712 590780 585113 581053 577315 572298 565787 558922 553024 548936
62917 548936 546843 546028 545143 543340 540852 538209 535442 532491 529745 527532 525535 523339 521126 519293 517821
62902 517821 516596 515906 515986 516522 517232 518482 520557 522623 523246 521892 519308 516504 513928 511558 509153 506326
62886 506326 502812 498879 495271 492694 491324 490619 489570 487506 484828 482602 481311 480460 479601 479061 479247
62871 479247 479745 479722 478888 477572 476136 474769 473602 472613 471651 470839 470508 470369 469319 466697 463303 460410
62855 460410 458055 455090 450897 446244 442368 439792 438219 437007 435442 432942 429453 425624 422392 420232
62841 420232 418813 417442 415909 414743 414436 414604 414300 413166 411816 410938 410493 410048 409531 409302 409676 410582 411582
$$ packed form
62945G48754r273r076q570q116p735p504p588p783p814p944q509r070q905q119
62931F32748p419p030o767o758p062o932n667m060l738n017o511o865n898m088
62917E48936k093q15q85j803k488k643k767k951k746k213j997k196k213j833j472
62902E17821j225o90Q0N36P10J250K075K066O23j354k584k804k576k370k405k827
62886E06326l514l933l608k577j370p05j049k064k678k226j291q51q59n40J86
62871D79247M98k3q34j316j436j367j167r89r62q12l31j39j050k622l394k893
62855D60410k355k965m193m653l876k576j573j212j565k500l489l829l232k160
62841D20232j419j371j533j166l07J68l04j134j350q78m45m45n17k29L74R06J000
$$ plain form
62824 411582 412089 411692 410383 408399 406086 404063 403110 403312 403595 402887 401616 401228 402269 403910 405437 407057
62808 407057 408910 410498 411833 414116 418294 423633 428749 433545 439132 446106 453879 461720 469640 478183
62794 478183 487927 499260 512209 526380 541385 557339 574743 593930 614810 637128 660934 686926
62782 686926 716287 749870 787536 828633 873058 921489 974730 1033388 1097967 1168387 1243445
62771 1243445 1321743 1403284 1489028 1578519 1668971 1757089 1840645 1917626 1985178 2040581 2082572
62760 2082572 2110664 2123833 2120935 2102032 2068463 2021990 1964533 1898123 1824285 1744026 1659167
62749 1659167 1572894 1487938 1404896 1323504 1244843 1170856 1102095 1037534 976630 920161 868886
62738 868886 822629 781017 743954 710902 680612 652075 625179 600150 576989 555763 536840
$$ packed form
62824D11582N07l97j309j984k313k023r53K02K83p08j271l88J041J641J527J620
62808D07057J853J588J335K283M178N339N116M796N587O974P773P841P920Q543
62794D78183R744J1333J2949J4171J5005J5954J7404J9187K0880K2318K3806K5992
62782F86926K9361L3583L7666M1097M4425M8431N3241N8658O4579P0420P5058
62771A243445P8298Q1541Q5744Q9491R0452Q8118Q3556P6981O7552N5403M1991
62760B082572K8092J3169k898j8903l3569m6473n7457o6410p3838q0259q4859
62749A659167q6273q4956q3042q1392p8661p3987o8761o4561o0904n6469n1275
62738H68886m6257m1612l7063l3052l0290k8537k6896k5029k3161k1226j8923
$$ plain form
62727 536840 520512 506710 495200 485591 477135 469103 461525 455126 450424 447250 445179 443971 443612 444329
62713 444329 446595 450684 456227 462541 469362 476937 485603 495708 507695 521791 537776 555568 575776
62700 575776 599164 625817 655478 688397 725100 765499 809105 856090 907280 962975 1022508
62689 1022508 1085079 1150214 1217084 1284025 1349124 1410879 1467915 1518429 1560256 1591481 1610980
62678 1610980 1618589 1614685 1599472 1572830 1535093 1487771 1433182 1373627 1311158 1247610 1184178 1121215
62666 1121215 1059085 999035 942522 889876 840376 793607 749998 709980 673380 639912 609639
62655 609639 582681 558786 537423 518059 500278 483856 468679 454505 441036 428455 417434
62644 417434 408168 399752 391119 382283 374073 366869 360240 353656 346910 340069 333536 327964 323441 319043
$$ packed form
62727E36840j6328j3802j1510r609q456q032p578o399m702l174k071j208l59P17
62713D44329K266M089N543O314O821P575Q666J0105J1987J4096J5985J7792K0208
62700E75776K3388K6653K9661L2919L6703M0399M3606M6985N1190N5695N9533
62689A022508O2571O5135O6870O6941O5099O1755N7036N0514M1827L1225J9499
62678A610980P609l904j5213k6642l7737m7322n4589n9555o2469o3548o3432o2963
62666A121215o2130o0050n6513n2646m9500m6769m3609m0018l6600l3468l0273
62655F09639k6958k3895k1363j9364j7781j6422j5177j4174j3469j2581j1021
62644D17434r266q416q633q836q210p204o629o584o746o841o533n572m523m398
$$ plain form
62630 319043 313867 308247 303196 299030 295424 292576 291182 291263 292011 292902 293964 294858 294698 293181 291108 289482
62614 289482 288779 289248 291101 294107 297656 301510 305856 310499 314879 319121 324238 330855 338493 346574 355404
62599 355404 365630 377390 390653 405872 423602 443774 466024 490611 518466 550338 586181
62588 586181 625363 667237 711447 757717 805324 852872 898826 942146 982138 1017785 1047631
62577 1047631 1070320 1084906 1090782 1087783 1076454 1057829 1032954 1002937 969293 933687 897294 860713
62565 860713 824455 789023 754612 721240 689205 659058 631208 605964 583712 564410 547032
62554 547032 530165 513182 496375 480123 464567 449910 436319 423580 411524 400592 391159 382485
62542 382485 373330 363620 354505 346689 339771 333364 327753 323062 318937 315582 314081 314932 317134 319477
$$ packed form
62630C19043n176n620n051m166l606k848j394Q1P48Q91J062Q94j60j517k073j626
62614B89482p03M69J853L006L549L854M346M643M380M242N117O617P638Q081Q830
62599C55404J0226J1760J3263J5219J7730K0172K2250K4587K7855L1872L5843
62588E86181L9182M1874M4210M6270M7607M7548M5954M3320L9992L5647K9846
62577A047631K2689J4586N876k999j1329j8625k4875l0017l3644l5606l6393l6581
62565H60713l6258l5432l4411l3372l2035l0147k7850k5244k2252j9302j7378
62554E47032j6867j6983j6807j6252j5556j4657j3591j2739j2056j0932r433q674
62542C82485r155r710r115p816o918o407n611m691m125l355j501Q51K202K343
$$ plain form
62528 319477 322028 325516 329923 334629 339528 345043 351195 357534 364047 371447 380402 390980 402983 416450
62514 416450 431541 448167 466088 485493 507228 532111 560069 590363 622807 658154 696731
62503 696731 737121 776847 814164 848513 879449 905973 927004 941854 950071 951295 945306 931920
62491 931920 911113 883856 852505 819563 786187 752585 719467 687943 658131 629241 601315
62480 601315 575769 553750 534944 518439 503852 491122 480072 470740 463430 457915 453284 449083
62468 449083 445966 444709 445174 446661 448646 450739 452583 454347 456767 460242 464341 468604 473264 478769
62454 478769 485205 492628 501358 511378 521881 531931 541308 550400 559660 569321 579080 587758 593875
62441 593875 596882 597285 595347 590340 581482 569023 554078 537953 521843 506380 491130 475266 459142
$$ packed form
62528C19477K551L488M407M706M899N515O152O339O513P400Q955J0578J2003J3467
62514D16450J5091J6626J7921J9405K1735K4883K7958L0294L2444L5347L8577
62503F96731M0390L9726L7317L4349L0936K6524K1031J4850Q217J224n989j3386
62491I31920k0807k7257l1351l2942l3376l3602l3118l1524k9812k8890k7926
62480F01315k5546k2019j8806j6505j4587j2730j1050r332p310n515m631m201
62468D49083l117j257M65J487J985K093J844J764K420L475M099M263M660N505
62454D78769O436P423Q730J0020J0503J0050R377R092R260R661R759Q678O117
62441E93875L007M03j938n007q858j2459j4945j6125j6110j5463j5250j5864j6124
$$ plain form
62428 459142 444370 431961 421281 411364 402302 394574 387948 382034 377301 374509 373519 373524 374101 375276 376909
62413 376909 378850 381498 385457 390761 397058 404251 412371 421016 429579 437913 446274 454736 463077 471073
62399 471073 478452 484734 489507 492768 494756 495593 495301 493805 490809 486058 479954 473473 467248 461176 455132
62384 455132 449460 444523 440366 437215 435665 435985 437814 440954 445894 453153 462744 474704 489444 507047
62370 507047 526885 548579 572735 600180 631053 665260 703197 745393 791941 842820 898120
62359 898120 957193 1018149 1078871 1138050 1194631 1246916 1293014 1331579 1361369 1380772 1388870 1386664
62347 1386664 1376335 1359522 1337004 1309532 1277918 1242475 1203281 1160996 1116783 1071637 1026427
62336 1026427 982419 941040 903190 869172 838939 811900 786922 763159 740516 718819 697224
$$ packed form
62428D59142j4772j2409j0680r917r062p728o626n914m733k792r90NN77J175J633
62413C76909J941K648L959N304O297P193Q120Q645Q563Q334Q361Q462Q341P996
62399D71073P379O282M773L261J988Q37k92j496k996m751o104o481o225o072o044
62384D55132n672m937m157l151j550L20J829L140M940P259R591J1960J4740J7603
62370E07047J9838K1694K4156K7445L0873L4207L7937M2196M6548N0879N5300
62359H98120N9073O0956O0722N9179N6581N2285M6098L8565K9790J9403Q098k206
62347A386664j0329j6813k2518k7472l1614l5443l9194m2285m4213m5146m5210
62336A026427m4008m1379l7850l4018l0233k7039k4978k3763k2643k1697k1595
$$ plain form
62325 697224 675323 654247 635555 619330 604399 590266 577778 567859 560531 555289 551667 549230
62313 549230 547640 546819 546623 546389 545317 543206 540277 536463 531423 525236 518536 511932 505641 499572 493471
62298 493471 487176 481068 475935 472030 468631 464980 461263 458234 456334 455720 456662 459198 462767 466816 471460
62283 471460 476967 482987 489053 495490 503110 512100 521866 531860 542135 553238 565821 580054 595230
62270 595230 610492 626129 643411 662888 683957 706648 732514 762767 796665 833042 872514
62259 872514 916676 965797 1018731 1074504 1132291 1190011 1244561 1293560 1335712 1369576 1393394
62248 1393394 1406363 1409079 1402638 1388141 1366816 1339536 1306226 1266778 1222381 1175011 1125879 1075603
62236 1075603 1025730 978682 936050 897964 864116 834268 807872 784486 764666 749238 737589
$$ packed form
62325F97224k1901k1076j8692j6225j4931j4133j2488r919p328n242l622k437
62313E49230j590q21j96k34j072k111k929l814n040o187o700o604o291o069o101
62298D93471o295o108n133l905l399l651l717l029j900o14R42K536L569M049M644
62283D71460N507O020O066O437P620Q990R766R994J0275J1103J2583J4233J5176
62270E95230J5262J5637J7282J9477K1069K2691K5866L0253L3898L6377L9472
62259H72514M4162M9121N2934N5773N7787N7720N4550M8999M2152L3864K3818
62248A393394J2969K716o441j4497k1325k7280l3310l9448m4397m7370m9132n0276
62236A075603m9873m7048m2632l8086l3848k9848k6396k3386j9820j5428j1649
$$ plain form
62225 737589 727928 719382 712570 707886 704491 701411 698524 696059 694052 692610 691774 690866 688925 685964 682871
62210 682871 679928 676559 672710 669307 667014 665643 665098 665813 667856 670714 674357 679505 686426 694552 703746
62195 703746 714861 728529 744409 762203 782458 805743 831848 860275 890605 921851 952333
62184 952333 980717 1006378 1028361 1045109 1055999 1062320 1066066 1068495 1070370 1072661 1076226 1081517 1089232
62171 1089232 1100595 1116369 1136349 1160397 1189094 1222607 1259569 1297827 1335583 1371097 1402081
62160 1402081 1426481 1443675 1454293 1459339 1460083 1458123 1454547 1449135 1440885 1429065 1413408 1393940 1371361
62147 1371361 1347285 1323480 1301108 1281019 1264187 1251152 1241361 1233675 1227328 1222017 1217412 1213107
62135 1213107 1208837 1204429 1199837 1195454 1192014 1189899 1188984 1189279 1191061 1194171 1198002 1202644 1209208 1218408
$$ packed form
62225G37589r661q546o812m684l395l080k887k465k007j442q36r08j941k961l093
62210F82871k943l369l849l403k293j371n45P15K043K858L643N148O921Q126R194
62195G03746J1115J3668J5880J7794K0255K3285K6105K8427L0330L1246L0482
62184I52333K8384K5661K1983J6748J0890O321L746K429J875K291L565N291P715
62171A089232J1363J5774J9980K4048K8697L3513L6962L8258L7756L5514L0984
62160A402081K4400J7194J0618N046P44j960l576n412q250j1820j5657j9468k2579
62147A371361k4076k3805k2372k0089j6832j3035r791p686o347n311m605m305
62135A213107m270m408m592m383l440k115r15K95J782L110L831M642O564R200
$$ plain form
62121 1218408 1229486 1241238 1253461 1266700 1281133 1296533 1312904 1330343 1348599 1367513 1387598
62110 1387598 1409423 1432537 1455686 1478102 1500150 1522894 1547364 1574014 1602412 1631704 1661710
62099 1661710 1693223 1726874 1762206 1798500 1836167 1876625 1920945 1969077 2019998 2071840 2122038
62088 2122038 2168368 2210377 2249673 2288774 2329911 2374678 2424049 2478027 2535108 2592338 2646317
62077 2646317 2694626 2736545 2772633 2804038 2832446 2860164 2889310 2920783 2954540 2990789 3030253
62066 3030253 3073156 3118716 3165794 3213284 3259621 3302741 3341141 3374552 3403335 3427846 3448761
62055 3448761 3467297 3484338 3499655 3512387 3521946 3528071 3530424 3528706 3523020 3513960 3502600 3490466
62043 3490466 3478948 3468428 3458409 3448629 3439566 3431708 3424969 3419023 3413517 3407749 3400915 3393131 3385481
$$ packed form
62121A218408J1078J1752J2223J3239J4433J5400J6371J7439J8256J8914K0085
62110A387598K1825K3114K3149K2416K2048K2744K4470K6650K8398K9292L0006
62099A661710L1513L3651L5332L6294L7667M0458M4320M8132N0921N1842N0198
62088B122038M6330M2009L9296L9101M1137M4767M9371N3978N7081N7230N3979
62077B646317M8309M1919L6088L1405K8408K7718K9146L1473L3757L6249L9464
62066C030253M2903M5560M7078M7490M6337M3120L8400L3411K8783K4511K0915
62055C448761J8536J7041J5317J2732R559O125K353j718n686r060j1360j2134
62043C490466j1518j0520j0019r780r063p858o739n946n506n768o834p784p650
$$ plain form
62030 3385481 3378645 3372128 3365256 3358145 3351176 3344251 3337178 3330093 3322924 3315139 3306699 3298594 3291673 3285571
62016 3285571 3279579 3273980 3269670 3266915 3265350 3264878 3265737 3267950 3271456 3276532 3283481 3292119 3302177 3313849
62002 3313849 3327387 3342556 3359056 3376896 3395485 3412814 3426470 3435254 3438996 3437156 3428707 3413306
61990 3413306 3391576 3364163 3331501 3294757 3256119 3217633 3180140 3143552 3107600 3072000 3036386
61979 3036386 3000605 2965031 2930325 2896887 2864573 2832956 2801777 2771064 2740793 2710724 2680890
61968 2680890 2652072 2625196 2600198 2576031 2551946 2528183 2505202 2482916 2461116 2440092 2420331
61957 2420331 2401922 2384627 2368231 2352561 2337611 2323869 2311956 2301626 2291748 2281756 2272516 2265249
61945 2265249 2260141 2256552 2254126 2253112 2253943 2256975 2262208 2268847 2275654 2282246 2289594 2298865 2310371 2324041
$$ packed form
62030C385481o836o517o872p111o969o925p073p085p169p785q440q105o921o102
62016C285571n992n599m310k755j565m72Q59K213L506N076O949Q638J0058J1672
62002C313849J3538J5169J6500J7840J8589J7329J3656Q784L742j840q449j5401
61990C413306k1730k7413l2662l6744l8638l8486l7493l6588l5952l5600l5614
61979C036386l5781l5574l4706l3438l2314l1617l1179l0713l0271l0069k9834
61968B680890k8818k6876k4998k4167k4085k3763k2981k2286k1800k1024j9761
61957B420331j8409j7295j6396j5670j4950j3742j1913j0330r878r992r240p267
61945B265249n108l589k426j014Q31L032N233O639O807O592P348R271J1506J3670
$$ plain form
61931 2324041 2340139 2358715 2379010 2400253 2422611 2446694 2472698 2500974 2532952 2570521 2614727
61920 2614727 2665935 2725075 2793870 2873908 2966296 3072228 3193383 3331892 3490380 3671850
61910 3671850 3879131 4114799 4382130 4685621 5030044 5419452 5857730 6349294 6897903
61901 6897903 7504479 8166021 8874924 9616669 10366667 11089436 11741546 12277090 12654560
61892 12654560 12844190 12833599 12629159 12253159 11738736 11123999 10446158 9737446 9024064
61883 9024064 8326823 7661273 7037506 6461017 5934197 5457062 5027553 4642530 4298741
61874 4298741 3992519 3719284 3474526 3255202 3059293 2884290 2727175 2585800 2459154
61865 2459154 2346128 2244965 2154069 2072492 1999365 1933630 1874627 1822336 1776869 1738176 1706189
$$ packed form
61931B324041J6098J8576K0295K1243K2358K4083K6004K8276L1978L7569M4206
61920B614727N1208N9140O8795Q0038R2388J05932J21155J38509J58488J81470
61910C671850K07281K35668K67331L03491L44423L89408M38278M91564N48609
61901F897903O06576O61542P08903P41745P49998P22769O52110N35544L77470
61892A2654560J89630j0591k04440l76000n14423o14737o77841p08712p13382
61883I024064o97241o65550o23767n76489n26820m77135m29509l85023l43789
61874D298741l06222k73235k44758k19324j95909j75003j57115j41375j26646
61865B459154j13026j01163r0896q1577p3127o5735n9003n2291m5467l8693l1987
$$ plain form
61854 1706189 1680535 1660062 1643257 1629327 1618351 1610346 1604677 1600329 1596316 1591979 1587377 1583137 1579302
61841 1579302 1574622 1567820 1559346 1551109 1544588 1540002 1537125 1535837 1535859 1536979 1539761 1545094 1552739 1561128
61827 1561128 1568924 1576059 1582917 1589197 1594027 1596771 1597369 1596288 1594349 1592250 1590149 1588014 1586372 1586253
61813 1586253 1588440 1593238 1601004 1612293 1627378 1646044 1668041 1693498 1722934 1757114 1796620 1841206
61801 1841206 1889908 1942346 1999558 2062938 2132736 2208453 2290401 2379906 2478018 2585004 2701259
61790 2701259 2827911 2966461 3118605 3286536 3472713 3679212 3908042 4162217 4445892
61781 4445892 4763468 5119422 5519167 5969234 6476338 7047094 7688963 8410643 9220768
61772 9220768 10126297 11131719 12238059 13440255 14723352 16058938 17402709 18694060
$$ packed form
61854A706189k5654k0473j6805j3930j0976q005n669m348m013m337m602m240l835
61841A579302m680o802q474q237o521m586k877j288K2J120K782N333P645Q389
61827A561128P796P135O858O280M830K744N98j081j939k099k101k135j642j19
61813A586253K187M798P766J1289J5085J8666K1997K5457K9436L4180L9506M4586
61801A841206M8702N2438N7212O3380O9798P5717Q1948Q9505R8112J06986J16255
61790B701259J26652J38550J52144J67931J86177K06499K28830K54175K83675
61781D445892L17576L55954L99745M50067N07104N70756O41869P21680Q10125
61772I220768R05529J005422J106340J202196J283097J335586J343771J291351
$$ plain form
61764 18694060 19859166 20818589 21498931 21846083 21835814 21477420 20809217 19889064 18784283
61755 18784283 17562896 16286565 15006214 13761001 12579089 11478188 10466429 9545011
61747 9545011 8711605 7962165 7291174 6692097 6158246 5682872 5258912 4879736 4540202
61738 4540202 4236269 3963867 3719083 3499151 3302111 3125479 2966326 2822647 2693547
61729 2693547 2577975 2474300 2381210 2297851 2222862 2154297 2090800 2031870 1976764 1924236 1873682
61718 1873682 1825492 1779850 1736202 1694344 1655014 1618767 1585066 1553119 1522938 1495031 1469634
61707 1469634 1446716 1426090 1407088 1388671 1370340 1352446 1335321 1318636 1301917 1285097 1268205
61696 1268205 1251036 1233513 1216007 1199042 1182986 1168026 1154072 1140806 1128285 1117212 1107886
$$ packed form
61764A8694060J165106R59423O80342L47152j0269l58394o68203r20153j104781
61755A8784283j221387j276331j280351j245213j181912j100901j011759r21418
61747I545011q33406p49440o70991n99077n33851m75374m23960l79176l39534
61738D540202l03933k72402k44784k19932j97040j76632j59153j43679j29100
61729B693547j15572j03675r3090q3359p4989o8565o3497n8930n5106n2528n0554
61718A873682m8190m5642m3648m1858l9330l6247l3701l1947l0181k7907k5397
61707A469634k2918k0626j9002j8417j8331j7894j7125j6685j6719j6820j6892
61696A268205j7169j7523j7506j6965j6056j4960j3954j3266j2521j1073r326
$$ plain form
61685 1107886 1099261 1090067 1080626 1072300 1065189 1057823 1049418 1040999 1033748 1027540 1021881 1017126 1013733 1011085
61671 1011085 1008048 1004269 1000214 996349 992842 989625 986252 982102 977088 971731 966279 960429 954181 948298
61657 948298 943454 939490 935882 932396 929031 925900 923448 922144 921686 921208 920467 920052 920209 920372 920221 920239
61641 920239 920723 921142 921144 921436 922956 925762 929307 933285 937697 942659 948595 956071 964942 974260 983410 992702
61625 992702 1002378 1011671 1019392 1024907 1028072 1028702 1026640 1022017 1015214 1006927 998287 990184 982362 973880
61611 973880 964569 955127 945699 935507 924257 912753 901593 890315 878493 866734 855925 846346
61599 846346 838065 831302 825731 820373 814846 809911 806181 803309 801102 800286 801183 802676 803618 804450 806360
61584 806360 809624 813890 819409 826721 835605 845476 856417 868829 882470 896924 912643 930497 950525
$$ packed form
61685A107886q625r194r441q326p111p366q405q419p251o208n659m755l393k648
61671A011085l037l779m055l865l507l217l373m150n014n357n452n850o248n883
61657I48298m844l964l608l486l365l131k452j304m58m78p41m15J57J63j51J8
61641I20239M84M19KK92J520K806L545L978M412M962N936P476Q871R318R150R292
61625I92702R676R293P721N515L165O30k062m623o803q287q640q103p822q482
61611I73880r311r442r428j0192j1250j1504j1160j1278j1822j1759j0809r579
61599H46346q281o763n571n358n527m935l730k872k207q16Q97J493R42Q32J910
61584H06360L264M266N519P312Q884R871J0941J2412J3641J4454J5719J7854K0028
$$ plain form
61571 950525 972100 995058 1019750 1046138 1073758 1102410 1132130 1162587 1193229 1223785 1253936
61560 1253936 1282701 1308981 1332668 1354577 1375408 1395337 1414448 1432901 1450661 1467522 1483403
61549 1483403 1498343 1512303 1525137 1536442 1545274 1550511 1551788 1549628 1544427 1535882 1523725 1508420
61537 1508420 1490795 1471620 1451858 1432602 1414305 1396771 1380286 1365902 1354181 1344583 1336703 1331200
61525 1331200 1328747 1328915 1330981 1335097 1341972 1352188 1366658 1386817 1413292 1445078 1481082 1521914
61513 1521914 1569235 1624078 1686899 1758697 1840824 1934029 2038806 2156377 2288369 2435793
61503 2435793 2599254 2779832 2978765 3196332 3431528 3682106 3943761 4209335 4469539
61494 4469539 4714201 4932562 5113598 5247957 5330166 5358924 5336181 5266841 5158472 5019649
$$ packed form
61571I50525K1575K2958K4692K6388K7620K8652K9720L0457L0642L0556L0151
61560A253936K8765K6280K3687K1909K0831J9929J9111J8453J7760J6861J5881
61549A483403J4940J3960J2834J1305Q832N237J277k160n201q545j2157j5305
61537A508420j7625j9175j9762j9256j8297j7534j6485j4384j1721r598p880n503
61525A331200k453J68K066M116O875J0216J4470K0159K6475L1786L6004M0832
61513A521914M7321N4843O2821P1798Q2127R3205J04777J17571J31992J47424
61503B435793J63461J80578J98933K17567K35196K50578K61655K65574K60204
61494D469539K44662K18361J81036J34359Q2209K8758k2743o9340j08369j38823
$$ plain form
61484 5019649 4858142 4680995 4495435 4308364 4124972 3948676 3782138 3627598 3486561
61475 3486561 3359953 3248338 3151411 3067938 2997016 2938886 2893791 2860767 2838515 2826727 2825431
61464 2825431 2833609 2849628 2872563 2902014 2937134 2976926 3020947 3068552 3117981 3167363 3216146
61453 3216146 3264387 3311289 3355855 3398427 3440193 3481601 3522683 3564414 3608107 3653776 3700628
61442 3700628 3748835 3799086 3850647 3901677 3951467 4000541 4048336 4092582 4131374 4164314 4191202
61431 4191202 4211197 4223786 4229109 4226698 4215232 4194323 4165598 4131379 4093058 4051082 4005699 3957475
61419 3957475 3907962 3859994 3816292 3777594 3743048 3712369 3686404 3665589 3649447 3637961 3631944
61408 3631944 3631301 3634089 3637923 3641345 3643312 3642579 3638405 3630990 3620497 3606461 3588799 3568634 3547594
$$ packed form
61484E019649j61507j77147j85560j87071j83392j76296j66538j54540j41037
61475C486561j26608j11615r6927q3473p0922n8130m5095l3024k2252j1788j296
61464B825431Q178J6019K2935K9451L5120L9792M4021M7605M9429M9382M8783
61453C216146M8241M6902M4566M2572M1766M1408M1082M1731M3693M5669M6852
61442C700628M8207N0251N1561N1030M9790M9074M7795M4246L8792L2940K6888
61431D191202J9995J2589N323k411j1466k0909k8725l4219l8321m1976m5383m8224
61419C957475m9513m7968m3702l8698l4546l0679k5965k0815j6142j1486o017
61408C631944o43K788L834L422J967p33m174p415j0493j4036j7662k0165k1040
$$ plain form
61395 3547594 3527115 3508940 3495391 3488372 3488812 3497730 3517185 3549482 3596079 3658047 3737078 3835192
61383 3835192 3953681 4092995 4253508 4435803 4640189 4866238 5112679 5377299 5656509
61374 5656509 5944632 6233361 6512130 6769367 6993716 7174841 7304744 7379785 7401403 7374161
61364 7374161 7303142 7193222 7049534 6876996 6679491 6460679 6225501 5979792 5728459 5475182
61354 5475182 5223734 4978236 4741701 4515368 4299809 4095884 3904469 3726186 3561749
61345 3561749 3411842 3276520 3155381 3048275 2955023 2874526 2805237 2746633 2699348 2663698
61335 2663698 2639000 2624438 2619577 2623799 2636057 2655491 2681600 2713777 2751363 2794013 2841156 2891155
61323 2891155 2941959 2992460 3042265 3090377 3135360 3176831 3215545 3251913 3285555 3316375 3344866
$$ packed form
61395C547594k0479j8175j3549p019M40Q918J9455L2297M6597O1968P9031R8114
61383C835192J18489J39314J60513J82295K04386K26049K46441K64620K79210
61374E656509K88123K88729K78769K57237K24349J81125J29903P5041K1618k7242
61364G374161p1019j09920j43688j72538j97505k18812k35178k45709k51333k53277
61354E475182k51448k45498k36535k26333k15559k03925j91415j78283j64437
61345C561749j49907j35322j21139j07106r3252q0497o9289n8604m7285l5650
61335B663698k4698j4562m861M222J2258J9434K6109L2177L7586M2650M7143M9999
61323B891155N0804N0501M9805M8112M4983M1471L8714L6368L3642L0820K8491
$$ plain form
61312 3344866 3371211 3395292 3417699 3439411 3460198 3478422 3492606 3502044 3505855 3502949 3493342 3478182
61300 3478182 3458090 3432626 3401688 3366056 3326121 3281452 3232196 3179687 3125069 3068491 3010256
61289 3010256 2951686 2894240 2838790 2786233 2737766 2694068 2655183 2621521 2593906 2572295 2555650
61278 2555650 2543326 2535223 2530185 2525831 2520683 2515092 2509412 2502656 2493793 2483055 2471063 2457878 2443860
61265 2443860 2430280 2418058 2406861 2396350 2387345 2380900 2377208 2376404 2379698 2388943 2405838 2432091 2469366
61252 2469366 2518384 2578983 2651609 2737624 2837501 2949835 3072694 3204487 3342471 3481574
61242 3481574 3615675 3738870 3844534 3924545 3971265 3980155 3950111 3882626 3781913 3654884
61232 3654884 3509410 3352479 3190145 3027933 2870245 2720059 2579857 2451729 2335847
$$ packed form
61312C344866K6345K4081K2407K1712K0787J8224J4184R438L811k906r607j5160
61300C478182k0092k5464l0938l5632l9935m4669m9256n2509n4618n6578n8235
61289C010256n8570n7446n5450n2557m8467m3698l8885l3662k7615k1611j6645
61278B555650j2324q103n038m354n148n591n680o756q863j0738j1992j3185j4018
61265B443860j3580j2222j1197j0511r005o445l692q04L294R245J6895K6253L7275
61252B469366M9018O0599P2626Q6015R9877J12334J22859J31793J37984J39103
61242C481574J34101J23195J05664Q0011M6720Q890l0044o7485j00713j27029
61232C654884j45474j56931j62334j62212j57688j50186j40202j28128j15882
$$ plain form
61223 2335847 2230199 2133073 2044884 1966533 1897141 1834743 1778344 1727919 1683116 1643194 1607725
61212 1607725 1576339 1548471 1524196 1504485 1489654 1478539 1470241 1465700 1466296 1471811 1481041 1493542
61200 1493542 1509357 1527692 1547182 1566896 1585891 1602500 1615351 1624554 1630763 1633800 1633392 1630436
61188 1630436 1626113 1620291 1612100 1601444 1588638 1573225 1554631 1533538 1511187 1487763 1462773 1436562
61176 1436562 1410082 1383624 1357107 1331197 1306651 1282885 1258688 1234124 1210289 1187337 1164211
61165 1164211 1140329 1116192 1092228 1068234 1044165 1020484 997583 975616 954773 934977 915600
61154 915600 896356 878178 862179 847953 833767 818275 801217 782804 763424 743808 724627
61143 724627 706048 688311 672304 658811 647694 638553 631624 627137 624367 622319 620853 620278 620486
$$ packed form
61223B335847j05648r7126q8189p8351o9392o2398n6399n0425m4803l9922l5469
61212A607725l1386k7868k4275j9711j4831j1115q298m541N96N515R230J2501
61200A493542J5815J8335J9490J9714J8995J6609J2851R203O209L037m08k956
61188A630436m323n822q191j0656j2806j5413j8594k1093k2351k3424k4990k6211
61176A436562k6480k6458k6517k5910k4546k3766k4197k4564k3835k2952k3126
61165A164211k3882k4137k3964k3994k4069k3681k2901k1967k0843j9796j9377
61154I15600j9244j8178j5999j4226j4186j5492j7058j8413j9380j9616j9181
61143G24627j8579j7737j6007j3493j1117r141o929m487k770k048j466n75K08
$$ plain form
61130 620486 621481 624077 628958 635545 642806 650569 658986 667523 675787 684721 695528 707825 720136 731795
61116 731795 743124 754235 764997 775822 787188 798665 809507 819762 829657 838473 845294 850312
61104 850312 854055 855866 854602 850375 844263 836752 827870 818338 809075 799993 790718 781966 774598 767741
61090 767741 759571 749745 739461 729387 719134 708566 697995 687217 675893 664760 654990 646491
61078 646491 638217 629884 621998 614632 607737 602202 598882 596909 594707 592341 591029 590684 589954 588549 587514
61063 587514 587219 587048 587132 588439 590953 593572 595991 598965 602633 606288 609835 613777 617751 620866 623397
61048 623397 626355 629547 632093 634651 638869 644609 650049 654727 660100 666773 673616 680165 687611 696688
61034 696688 706705 717350 729382 742841 756532 769936 783729 797915 811473 824400 838000
$$ packed form
61130F20486R95K596M881O587P261P763Q417Q537Q264Q934J0807J2297J2311J1659
61116G31795J1329J1111J0762J0825J1366J1477J0842J0255R895Q816O821N018
61104H50312L743J811j264m227o112p511q882r532r263r082r275q752p368o857
61090G67741q170r826j0284j0074j0253j0568j0571j0778j1324j1133r770q499
61078F46491q274q333p886p366o895n535l320j973k202k366j312l45p30j405j035
61063E87514k95j71Q4J307K514K619K419K974L668L655L547L942L974L115K531
61048F23397K958L192K546K558M218N740N440M678N373O673O843O549P446R077
61034F96688J0017J0645J2032J3459J3691J3404J3793J4186J3558J2927J3600
$$ plain form
61023 838000 852542 866735 880101 893764 908267 922787 937161 952551 969431 987049 1005437
61012 1005437 1025769 1048212 1071816 1097018 1125704 1158312 1193648 1232192 1276543 1327623 1383346
61001 1383346 1441941 1503518 1567579 1632625 1699625 1772459 1853672 1943539 2044609 2162534 2299972
60990 2299972 2453779 2620773 2802294 3001235 3220475 3468300 3760170 4110582 4528130
60981 4528130 5023023 5613495 6320073 7163162 8176895 9418806 10956012 12854186 15195668
60972 15195668 18075111 21491698 25182583 28591676 31101281 32382392 32559830 32064812
60964 32064812 31363828 30823282 30727176 31253775 32323579 33494245 34113610 33673050 32068269
60955 32068269 29567797 26581637 23462157 20446461 17679088 15232777 13120926 11322724
$$ packed form
61023H38000J4542J4193J3366J3663J4503J4520J4374J5390J6880J7618J8388
61012A005437K0332K2443K3604K5202K8686L2608L5336L8544M4351N1080N5723
61001A383346N8595O1577O4061O5046O7000P2834Q1213Q9867J01070J17925J37438
60990B299972J53807J66994J81521J98941K19240K47825K91870L50412M17548
60981D528130M94893N90472P06578Q43089J013733J241911J537206J898174K341482
60972A5195668K879443L416587L690885L409093K509605J281111J77438m95018
60964C2064812p00984n40546r6106N26599J069804J170666O19365m40560j604781
60955C2068269k500472k986160l119480l015696k767373k446311k111851j798202
$$ plain form
60947 11322724 9809018 8548428 7503479 6635893 5915955 5321104 4828181 4413421 4058462
60938 4058462 3750866 3479684 3235162 3012086 2809071 2624359 2455118 2300079 2159610
60929 2159610 2033315 1920027 1819508 1731348 1652448 1578029 1505123 1433204 1362181 1292253 1225373
60918 1225373 1164280 1109660 1060065 1014506 973280 936308 902698 872230 845510 822325 801345
60907 801345 781705 763530 746798 731133 716877 704912 695090 686195 677727 670385 664436 658991 653424
60894 653424 648361 644677 642541 641995 643417 646660 650547 654029 657319 661236 665909 670712 675110 679040
60880 679040 682657 686044 688968 690767 690827 689290 686861 683800 679604 673993 667673 661670 656259 650987 645520
60865 645520 639997 634707 629798 625332 621423 618290 616201 615209 614923 614790 614749 615375 617220 620253 624194 629154
$$ packed form
60947A1322724j513706j260590j044949q67586p19938n94851m92923m14760l54959
60938D058462l07596k71182k44522k23076k03015j84712j69241j55039j40469
60929B159610j26295j13288j00519q8160p8900p4419p2906p1919p1023o9928o6880
60918A225373o1093n4620m9595m5559m1226l6972l3610l0468k6720k3185k0980
60907H01345j9640j8175j6732j5665j4256j1965r822q895q468p342n949n445n567
60894F53424n063l684k136n46J422L243L887L482L290L917M673M803M398L930
60880F79040L617L387K924J799O0j537k429l061m196n611o320o003n411n272n467
60865F45520n523n290m909m466l909l133k089r92k86j33m1O26J845L033L941M960
$$ plain form
60849 629154 635561 643545 652732 662693 673414 685373 699334 715930 735016 755274 774684 791649
60837 791649 805695 817196 826771 835101 842964 851005 859442 868164 877024 885770 893802 900309 904741 907002
60823 907002 907344 906418 905308 904916 905091 904756 903171 900762 898529 896988 895965 894975 893366 890387 885672 879592
60807 879592 872795 865498 857566 849107 840512 832029 823705 815756 808586 802352 796808 791603 786615 782103
60793 782103 778771 777404 778067 779840 781852 784434 788762 795477 804249 814636 826632 840198 854931
60780 854931 870492 886782 903337 919104 933345 946357 958741 970275 980108 987938 994347 999948
60768 999948 1004765 1008605 1011577 1013887 1015463 1016186 1016365 1016570 1016995 1017333 1017412 1017583 1018175 1018816 1018797 1018043 1017295 1017228
60750 1017228 1017799 1018685 1019926 1021812 1024415 1027574 1031116 1034623 1037150 1037673 1035927 1032509 1028167 1023354 1018499
$$ packed form
60849F29154O407P984R187R961J0721J1959J3961J6596J9086K0258J9410J6965
60837G91649J4046J1501R575Q330P863Q041Q437Q722Q860Q746Q032O507M432K261
60823I07002L42r26j110l92J75l35j585k409k233j541j023r90j609k979m715o080
60807H79592o797p297p932q459q595q483q324p949p170o234n544n205m988m512
60793G82103l332j367O63J773K012K582M328O715Q772J0387J1996J3566J4733
60780H54931J5561J6290J6555J5767J4241J3012J2384J1534R833P830O409N601
60768I99948M817L840K972K310J576P23J79K05M25L38P9J71N92O41j9p54p48o7
60750A017228N71Q86J241J886K603L159L542L507K527N23j746l418m342m813m855
$$ plain form
60735 1018499 1014274 1011215 1009099 1006916 1003588 998916 993884 989944 987837 987136 986933 986759 986705 987014 987868 989336
60719 989336 991105 992306 992039 990105 986953 982950 978019 971948 964690 956307 947016 937391 928156 919563
60705 919563 911208 902623 893873 885406 877561 870431 864086 858711 854547 851819 850663 850944 852082 853116
60691 853116 853099 851589 848825 845324 841175 835786 828433 819062 808473 797720 787390 777348 767009
60678 767009 755888 744076 732322 721602 712499 704923 698389 692565 687628 684101 682359 682350 683809 686560
60664 686560 690385 694739 698934 702628 705897 708815 711323 713572 716029 718965 722136 725224 728398 732155
60650 732155 736724 741922 747542 753550 759845 766031 771620 776508 781099 785785 790327 794089 797102 800605
60636 800605 806111 814000 823341 832970 842397 851820 861876 873360 886584 900884 915273 929677 944981
$$ packed form
60735A018499m225l059k116k183l328m672n032l940k107p01k03j74n4L09Q54J468
60719I89336J769J201k67j934l152m003m931o071p258q383r291r625r235q593
60705I19563q355q585q750q467p845p130o345n375m164k728j156K81J138J034
60691H53116j7j510k764l501m149n389p353r371j0589j0753j0330j0042j0339
60678G67009j1121j1812j1754j0720r103p576o534n824m937l527j742rJ459K751
60664F86560L825M354M195L694L269K918K508K249K457K936L171L088L174L757
60650G32155M569N198N620O008O295O186N589M888M591M686M542L762L013L503
60636H00605N506P889R341R629R427R423J0056J1484J3224J4300J4389J4404J5304
$$ plain form
60623 944981 961725 979331 996732 1013078 1027545 1039278 1048130 1054906 1060270 1063859 1065033 1064085 1062057
60610 1062057 1059621 1056767 1053435 1049946 1046877 1044900 1044596 1046023 1048518 1051046 1052495 1051576 1047040 1038493
60596 1038493 1026622 1012278 995809 977702 959258 941878 926039 911667 899190 889432 882619 878227
60584 878227 875769 875114 876014 877850 879844 881230 881474 880844 880531 881637 884149 887311 890707 894408 898365
60569 898365 902428 906829 911872 917206 922075 926222 929860 932768 934182 933643 931255 927082 921055 913583
60555 913583 905531 897281 888526 879294 870515 863118 857146 852264 848758 847448 848816 852742 859062 867969
60541 867969 879823 894859 913308 935718 962996 996020 1035189 1080172 1129752 1181544 1231959
60530 1231959 1276899 1312687 1336405 1345884 1340385 1321536 1292854 1257932 1219605 1180939 1145767 1117110
$$ packed form
60623I44981J6744J7606J7401J6346J4467J1733Q852O776N364L589J174r48k028
60610A062057k436k854l332l489l069j977l04J427K495K528J449r19m536q547
60596A038493j1871j4344j6469j8107j8444j7380j5839j4372j2477r758o813m392
60584H78227k458o55R00J836J994J386K44o30l13J106K512L162L396L701L957
60569H98365M063M401N043N334M869M147L638K908J414n39k388m173o027p472
60555I13583q052q250q755r232q779p397n972m882l506j310J368L926O320Q907
60541H67969J1854J5036J8449K2410K7278L3024L9169M4983M9580N1792N0415
60530A231959M4940L5788K3718R479n499j8849k8682l4922l8327l8666l5172k8657
$$ plain form
60518 1117110 1095636 1080653 1072183 1070980 1076763 1087656 1101517 1116941 1132807 1147777 1160730 1171232
60506 1171232 1179411 1185850 1191769 1198830 1208519 1221963 1240296 1264725 1296254 1335762 1384406 1443633
60494 1443633 1514877 1599629 1699539 1815872 1948941 2098643 2265599 2451561 2659226 2892583
60484 2892583 3157403 3460605 3808673 4206084 4652719 5139138 5642269 6126575 6551488
60475 6551488 6879901 7082860 7141261 7048132 6811809 6456474 6017447 5532697 5035080 4548798
60465 4548798 4090022 3668803 3290121 2954690 2660623 2405140 2184879 1995446 1831957
60456 1831957 1690326 1567600 1461154 1368355 1287133 1216202 1154506 1100886 1054331 1013954 978596
60445 978596 946966 918305 892459 869217 847994 828158 809166 790447 771727 753517 736707
$$ packed form
60518A117110k1474j4983q470j203N783J0893J3861J5424J5866J4970J2953J0502
60506A171232Q179O439N919P061R689J3444J8333K4429L1529L9508M8644N9227
60494A443633P1244Q4752R9910J16333J33069J49702J66956J85962K07665K33357
60484B892583K64820L03202L48068L97411M46635M86419N03131M84306M24913
60475F551488L28413K02959N8401r3129k36323l55335m39027m84750m97617m86282
60465D548798m58776m21219l78682l35431k94067k55483k20261j89433j63489
60456A831957j41631j22726j06446r2799q1222p0931o1696n3620m6555m0377l5358
60445I78596l1630k8661k5846k3242k1223j9836j8992j8719j8720j8210j6810
$$ plain form
60434 736707 721613 707912 695416 684246 674200 664640 655170 645923 637187 629252 622529 617047 611892
60421 611892 606065 600074 595825 594565 595612 597418 599145 600803 602519 604322 606367 608911 612164 616202
60407 616202 620744 625022 628428 631345 634842 639391 644437 649292 653948 658908 664771 672079 680907 690388
60393 690388 699187 706701 713350 719603 725260 729834 733148 735390 737018 738615 740272 741203 740567 738576 736038
60378 736038 732930 728446 722570 716527 711367 707062 703395 700708 699195 698327 697668 697560 698312 699370 699991
60363 699991 700247 700682 701394 702119 702900 704094 705815 707781 709607 711099 712578 714975 719125 724812 731056
60348 731056 737468 744642 752989 762009 771101 780331 789772 798734 806380 812705 818233 823015 826437 827906
60334 827906 827428 825712 823888 822789 822411 822454 823442 826628 832617 840732 849966 859764 869500 877977 884114
$$ packed form
60434G36707j5094j3701j2496j1170j0046r560r470r247q736p935o723n482n155
60421F11892n827n991m249j260J047J806J727J658J716J803K045K544L253M038
60407F16202M542M278L406K917L497M549N046M855M656M960N863P308Q828R481
60393F90388Q799P514O649O253N657M574L314K242J628J597J657R31o36j991k538
60378G36038l108m484n876o043n160m305l667k687j513q68o59j08P52J058O21
60363F99991K56M35P12P25P81J194J721J966J826J492J479K397M150N687O244
60348G31056O412P174Q347R020R092R230R441Q962P646O325N528M782L422J469
60334H27906m78j716j824j099l78M3R88L186N989Q115R234R798R736Q477O137
$$ plain form
60319 884114 887591 888299 885738 879588 870450 859477 847641 835835 825158 816432 809637 804236 799873
60306 799873 796437 793849 792118 791268 790951 790575 790082 790146 791320 793473 796286 799670 803433 807218 811135 815723
60290 815723 820828 825279 828267 830393 832735 835537 838486 841661 845372 849455 853407 856919 859756 861579
60276 861579 862460 863087 863873 864420 864544 865206 867532 871388 875856 880774 886793 894092 902116 910676 920498 932433
60260 932433 946748 963313 981953 1002436 1024603 1048783 1075773 1106282 1140555 1178603 1220647
60249 1220647 1267273 1319236 1377103 1441122 1511532 1588833 1673385 1764874 1862629 1966502 2076929
60238 2076929 2193994 2316819 2443762 2572592 2700441 2824309 2941811 3050956 3149422 3235007
60228 3235007 3306855 3365044 3408723 3435925 3445872 3440362 3422079 3392516 3352505 3303938 3249820 3193099
$$ packed form
60319H84114L477P08k561o150r138j0973j1836j1806j0677q726o795n401m363
60306G99873l436k588j731q50l17l76m93O4J174K153K813L384L763L785L917M588
60290H15723N105M451K988K126K342K802K949L175L711M083L952L512K837J823
60276H61579Q81O27P86N47J24O62K326L856M468M918O019P299Q024Q560R822J1935
60260I32433J4315J6565J8640K0483K2167K4180K6990L0509L4273L8048M2044
60249A220647M6626N1963N7867O4019P0410P7301Q4552R1489R7755J03873J10427
60238B076929J17065J22825J26943J28830J27849J23868J17502J09145R8466Q5585
60228C235007P1848N8189M3679K7202R947n510j8283k9563m0011m8567n4118n6721
$$ plain form
60216 3193099 3136331 3082032 3032449 2989226 2953908 2928343 2914024 2911523 2921091 2943283 2978549 3027004
60204 3027004 3089171 3166011 3257309 3360831 3473985 3595438 3723960 3856472 3988611 4116657
60194 4116657 4237546 4347468 4442194 4518983 4576971 4615604 4633818 4630915 4607210 4563588 4501281
60183 4501281 4422402 4330066 4227863 4119652 4009678 3902109 3800363 3707288 3625702 3557980
60173 3557980 3505265 3467853 3446302 3441511 3453886 3483163 3528915 3590378 3665748 3752257 3846817
60162 3846817 3945973 4045385 4140197 4226114 4299799 4358678 4401129 4426757 4435803 4428518 4405791 4370094
60150 4370094 4324890 4273217 4217729 4161915 4110190 4066495 4033431 4012739 4005862 4013965 4038133 4079766
60138 4079766 4140236 4220270 4320261 4441119 4584265 4750981 4942538 5160705 5407121 5681919
$$ packed form
60216C193099n6768n4299m9583m3223l5318k5565j4319k501R568K2192L5266M8455
60204C027004O2167P6840R1298J03522J13154J21453J28522J32512J32139J28046
60194D116657J20889J09922R4726P6789N7988L8633J8214k903k3705m3622o2307
60183D501281p8879r2336j02203j08211j09974j07569j01746r3075q1586o7722
60173C557980n2715l7412k1551m791J2375K9277M5752O1463P5370Q6509R4560
60162C846817R9156R9412R4812Q5917P3685N8879M2451K5628R046p285k2727l5697
60150D370094m5204n1673n5488n5814n1725m3695l3064k0692o877Q103K4168M1633
60138D079766O0470Q0034R9991J20858J43146J66716J91557K18167K46416K74798
$$ plain form
60128 5681919 5983643 6310444 6660409 7030428 7415432 7809058 8204598 8595245 8974049
60119 8974049 9334016 9668087 9969312 10231671 10450759 10623234 10745767 10815096 10828957 10786418
60109 10786418 10687547 10533711 10328338 10076880 9786080 9463872 9119708 8763957 8406547
60100 8406547 8056481 7722177 7411043 7128260 6876627 6658032 6474661 6328742 6221629
60091 6221629 6153365 6122732 6127542 6165158 6232740 6326700 6442054 6572700 6712256 6854327 6992309
60080 6992309 7119608 7230097 7318281 7379610 7411452 7413616 7387320 7333899 7254967 7153265 7032172
60069 7032172 6894307 6741323 6574980 6397740 6212351 6021597 5828490 5636183 5447776
60060 5447776 5266626 5096352 4939706 4797676 4670568 4559825 4467937 4396709 4346483 4316931
$$ packed form
60128E681919L01724L26801L49965L70019L85004L93626L95540L90647L78804
60119H974049L59967L34071L01225K62359K19088J72475J22533O9329J3861m2539
60109A0786418r8871j53836k05373k51458k90800l22208l44164l55751l57410
60100H406547l50066l34304l11134k82783k51633k18595j83371j45919j07113
60091F221629o8264l0633M810L7616O7582R3960J15354J30646J39556J42071J37982
60080F992309J27299J10489Q8184O1329L1842K164k6296n3421p8932j01702j21093
60069G032172j37865j52984j66343j77240j85389j90754j93107j92307j88407
60060E447776j81150j70274j56646j42030j27108j10743r1888p1228n0226k9552
$$ plain form
60050 4316931 4307679 4318252 4348434 4398808 4470022 4561268 4670099 4793576 4928668 5071420 5216631
60039 5216631 5358659 5491990 5611189 5711348 5789011 5842196 5869418 5869330 5841353 5786070 5704956
60028 5704956 5600351 5475588 5334559 5181235 5020159 4856888 4696790 4543314 4398307
60019 4398307 4263873 4142822 4037241 3947771 3874621 3818411 3779705 3758574 3755077 3769678 3802996
60008 3802996 3855655 3928429 4021900 4135951 4270118 4424179 4597471 4787505 4989863 5199268
59998 5199268 5409834 5614481 5805425 5975975 6121591 6239479 6328028 6386565 6414694 6411628
59988 6411628 6376698 6310366 6214107 6089897 5941076 5773555 5594871 5411859 5230126 5055293
59978 5055293 4892970 4747104 4619641 4512123 4426404 4363505 4323105 4304654 4307876 4331710 4374010
$$ packed form
60050D316931r252J0573L0182N0374P1214R1246J08831J23477J35092J42752J45211
60039E216631J42028J33331J19199J00159P7663N3185K7222q8k7977n5283q1114
60028E704956j04605j24763j41029j53324j61076j63271j60098j53476j45007
60019D398307j34434j21051j05581q9470p3150n6210l8706k1131l497J4601L3318
60008C802996N2659P2774R3471J14051J34167J54061J73292J90034K02358K09405
59998E199268K10566K04647J90944J70550J45616J17888Q8549N8537K8129l066
59988F411628l4930o6332r6259j24210j48821j67521j78684j83012j81733j74833
59978E055293j62323j45866j27463j07518q5719o2899m0400j8451L222K3834M2300
$$ plain form
59967 4374010 4432900 4507493 4596747 4698522 4810190 4929203 5052620 5177005 5299114 5415755
59957 5415755 5522842 5616021 5692907 5753733 5799395 5830064 5846165 5849380 5841835 5825481 5803220
59946 5803220 5779556 5759182 5745712 5742615 5754428 5785958 5840949 5922384 6033525 6177846 6358432
59935 6358432 6578030 6838820 7141249 7483592 7863344 8278275 8724928 9196112 9680144
59926 9680144 10161934 10624150 11048113 11414955 11706863 11908310 12007955 12000906 11889459 11681835
59916 11681835 11390710 11032525 10626082 10189798 9739741 9289761 8852008 8436202 8048963
59907 8048963 7694605 7376236 7095730 6853537 6649498 6483674 6356106 6266390 6213905 6197803
59897 6197803 6216399 6267433 6349471 6462252 6604888 6774232 6965331 7172427 7388556 7604800
$$ packed form
59967D374010N8890P4593Q9254J01775J11668J19013J23417J24385J22109J16641
59957E415755J07087R3179P6886O0826M5662L0669J6101L215p545j6354k2261
59946E803220k3664k0374j3470l097J1813L1530N4991Q1435J11141J44321J80586
59935F358432K19598K60790L02429L42343L79752M14931M46653M71184M84032
59926I680144M81790M62216M23963L66842K91908K01447R9645p049j11447k07624
59916A1681835k91125l58185m06443m36284m50057m49980m37753m15806l87239
59907H048963l54358l18369k80506k42193k04039j65824j27568q9716n2485j6102
59897F197803J8596N1034Q2038J12781J42636J69344J91099K07096K16129K16244
$$ plain form
59887 7604800 7810889 7996315 8150544 8263211 8325490 8331562 8278725 8166945 7999181 7781778
59877 7781778 7523771 7235562 6927867 6610661 6292142 5978772 5676359 5390292 5124407
59868 5124407 4880481 4659358 4461842 4288089 4137032 4007101 3896721 3803527 3723885 3653992
59858 3653992 3590913 3532177 3475282 3418479 3361394 3304356 3247879 3193349 3143224 3099553 3062923
59847 3062923 3033527 3012351 3000235 2996315 2998272 3003551 3009449 3012552 3009177 2996431 2972636 2937461
59835 2937461 2892389 2840465 2784848 2727855 2671530 2618078 2569071 2525108 2486937 2455982 2433066
59824 2433066 2417717 2409820 2410798 2421701 2440757 2464227 2489415 2515883 2544456 2576578 2614492 2660676
59812 2660676 2716589 2782099 2855431 2932829 3008884 3078543 3138935 3188937 3227675 3254513 3269980
$$ packed form
59887G604800K06089J85426J54229J12667O2279O072n2837j11780j67764k17403
59877G781778k58007k88209l07695l17206l18519l13370l02413k86067k65885
59868E124407k43926k21123j97516j73753j51057j29931j10380r3194p9642o9893
59858C653992o3079n8736n6895n6803n7085n7038n6477n4530n0125m3671l6630
59847C062923k9396k1176j2116l920J957N279N898L103l375j2746k3795l5175
59835B937461m5072n1924n5617n6993n6325n3452m9007m3963l8171l0955k2916
59824B433066j5349p897R78J0903J9056K3470K5188K6468K8573L2122L7914M6184
59812B660676N5913O5510P3332P7398P6055O9659O0392N0002L8738K6838J5467
$$ plain form
59801 3269980 3275691 3273485 3265316 3253400 3239537 3224737 3210417 3199513 3195399 3200101 3214522 3239918
59789 3239918 3278047 3330220 3397496 3481773 3585792 3712150 3863160 4041517 4250345 4492903
59779 4492903 4773005 5095052 5461964 5872161 6317846 6784148 7247412 7674452 8026674
59770 8026674 8269147 8379788 8354108 8204563 7955924 7638642 7282768 6914157 6552746 6212048
59760 6212048 5900056 5621268 5377990 5170034 4994785 4849130 4731221 4639732 4572205 4525386
59750 4525386 4496957 4485917 4491549 4513147 4550617 4604287 4673984 4759021 4859140 4974941 5107612
59739 5107612 5258689 5429732 5621609 5834553 6069528 6328980 6615615 6931212 7277623
59730 7277623 7658149 8076622 8535399 9035301 9576865 10160038 10782378 11438284 12119467
$$ packed form
59801C269980N711k206q169j1916j3863j4800j4320j0904m114M702J4421K5396
59789C239918L8129N2173O7276Q4277J04019J26358J51010J78357K08828K42558
59779D492903K80102L22047L66912M10197M45685M66302M63264M27040L52222
59770H026674K42473J10641k5680j49545k48639l17282l55874l68611l61411l40698
59760F212048l11992k78788k43278k07956j75249j45655j17909r1489o7527m6819
59750D525386k8429j1040N632K1598L7470N3670O9697Q5037J00119J15801J32671
59739E107612J51077J71043J91877K12944K34975K59452K86635L15597L46411
59730G277623L80526M18473M58777M99902N41564N83173O22340O55906O81183
$$ plain form
59721 12119467 12814943 13510776 14191506 14842799 15453097 16014371 16523679 16984801 17407629
59712 17407629 17805684 18194417 18590516 19010036 19465352 19963530 20506876 21093481 21716497
59703 21716497 22363432 23016542 23653962 24251341 24784342 25231431 25575815 25806611 25919862
59694 25919862 25918957 25813915 25620360 25358726 25052509 24725238 24398424 24091957 23824593 23612393
59684 23612393 23467259 23398327 23414354 23523638 23732503 24045697 24468110 25004468 25657152 26425291
59674 26425291 27305184 28288961 29361281 30497136 31661821 32811092 33891283 34841861
59666 34841861 35601241 36113856 36337180 36248452 35848957 35162963 34232260 33110203 31856651
59657 31856651 30532205 29192160 27883002 26641838 25495784 24460043 23536477 22713606
$$ packed form
59721A2119467O95476O95833O80730O51293O10298N61274N09308M61122M22828
59712A7407629L98055L88733L96099M19520M55316M98178N43346N86605O23016
59703B1716497O46935O53110O37420N97379N33001M47089L44384K30796J13251
59694B5919862r05j05042j93555k61634l06217l27271l26814l06467k67364k12200
59684B3612393j45134o8932J6027J09284K08865L13194M22413N36358O52684P68139
59674B6425291Q79893R83777J072320J135855J164685J149271J080191R50578
59666C4841861P59380N12615K23324q8728l99495o85994r30703j122057j253552
59657C1856651j324446j340045j309158j241164j146054j035741r23566q22871
$$ plain form
59649 22713606 21967022 21261022 20554348 19809927 19003943 18129953 17197820 16229058 15250146
59640 15250146 14286159 13357246 12478031 11657792 10900755 10207405 9576459 9005664 8491424
59631 8491424 8029038 7613764 7241173 6906774 6606323 6336662 6095485 5880301 5688399
59622 5688399 5517757 5367163 5235478 5121501 5024195 4942071 4872516 4812680 4760791 4715576
59612 4715576 4674700 4634955 4593715 4548933 4497969 4438073 4368310 4289815 4204056 4111985 4014929
59601 4014929 3914892 3813712 3713103 3615643 3524311 3440636 3364367 3295211 3233759 3180511 3135259
59590 3135259 3097817 3068303 3046400 3031393 3023093 3021640 3026152 3034810 3046598 3061896 3081086 3103564
59578 3103564 3128253 3153965 3179134 3202496 3224313 3245897 3267813 3289838 3312716 3338467 3368648
$$ packed form
59649B2713606p46584p06000p06674p44421q05984q73990r32133r68762r78912
59640A5250146r63987r28913q79215q20239p57037o93350o30946n70795n14240
59631H491424m62386m15274l72591l34399l00451k69661k41177k15184j91902
59622E688399j70642j50594j31685j13977r7306q2124o9555n9836n1889m5215
59612D715576m0876l9745m1240m4782n0964n9896o9763p8495q5759r2071r7056
59601D014929j00037j01180j00609r7460r1332q3675p6269o9156o1452n3248m5252
59590C135259l7442k9514k1903j5007q300j453M512Q658J1788J5298J9190K2478
59578C103564K4689K5712K5169K3362K1817K1584K1916K2025K2878K5751L0181
$$ plain form
59567 3368648 3403729 3444479 3492507 3548939 3613920 3687783 3771349 3864785 3967821 4081714 4209407
59556 4209407 4353021 4512698 4688560 4882122 5094712 5325943 5574792 5840800 6122950
59547 6122950 6418472 6723866 7035966 7350900 7663239 7967566 8260040 8537420 8796010
59538 8796010 9033388 9250243 9448056 9624712 9774103 9890866 9974989 10031786 10068480 10091459
59528 10091459 10106304 10119310 10137993 10169624 10219612 10291573 10388116 10510027 10654363 10814114
59518 10814114 10979663 11139648 11280742 11388640 11450711 11457487 11401933 11279064 11087334 10829597
59508 10829597 10512035 10142961 9732986 9294771 8840960 8382367 7928349 7487727 7068107
59499 7068107 6674612 6310040 5976011 5673481 5402572 5162512 4951638 4767473 4607428
$$ packed form
59567C368648L5081M0750M8028N6432O4981P3863Q3566R3436J03036J13893J27693
59556D209407J43614J59677J75862J93562K12590K31231K48849K66008K82150
59547F122950K95522L05394L12100L14934L12339L04327K92474K77380K58590
59538H796010K37378K16855J97813J76656J49391J16763Q4123N6797L6694K2979
59528A0091459J4845J3006J8683L1631M9988P1961R6543J21911J44336J59751
59518A0814114J65549J59985J41094J07898O2071O776n5554j22869j91730k57737
59508A0829597l17562l69074m09975m38215m53811m58593m54018m40622m19620
59499G068107l93495l64572l34029l02530k70909k40060k10874j84165j60045
$$ plain form
59490 4607428 4469695 4353094 4256258 4177802 4117224 4074619 4049429 4040505 4047527 4071149 4111502
59479 4111502 4167810 4239824 4328468 4434626 4558554 4700913 4862991 5045202 5246496 5465869
59469 5465869 5703127 5957260 6224910 6500938 6779106 7051318 7307479 7537327 7731837
59460 7731837 7882509 7980912 8020614 7999258 7918251 7781386 7594562 7365742 7103815 6817553
59450 6817553 6515721 6206919 5898336 5595276 5302237 5023279 4760700 4514698 4285339
59441 4285339 4073832 3881046 3706075 3547369 3404206 3275933 3160943 3057770 2966263 2886358
59431 2886358 2816552 2754986 2701209 2655480 2617047 2584624 2558011 2537715 2523246 2513268 2507217 2505445
59419 2505445 2507903 2513950 2523393 2536460 2552782 2571824 2594691 2624050 2660991 2702106 2740416 2769740
$$ packed form
59490D607428j37733j16601r6836p8456o0578m2605k5190q924P022K3622M0353
59479D111502N6308P2014Q8644J06158J23928J42359J62078J82211K01294K19373
59469E465869K37258K54133K67650K76028K78168K72212K56161K29848J94510
59460G731837J50672R8403L9702k1356q1007j36865j86824k28820k61927k86262
59450F817553l01832l08802l08583l03060k93039k78958k62579k46002k29359
59441D285339k11507j92786j74971j58706j43163j28273j14990j03173r1507p9905
59431B886358o9806o1566n3777m5729l8433l2423k6613k0296j4469r978o051j772
59419B505445K458O047R443J3067J6322J9042K2867K9359L6941M1115L8310K9324
$$ plain form
59407 2769740 2788655 2800859 2812202 2827553 2849935 2881351 2923430 2977610 3045396 3127619 3222074
59396 3222074 3322491 3422189 3519780 3620383 3731147 3857095 4001430 4167420 4358259 4576296
59386 4576296 4823909 5104531 5421748 5778004 6174941 6614133 7096458 7621077 8185153
59377 8185153 8783194 9405736 10039618 10670535 11284935 11869814 12413171 12906652 13347202
59368 13347202 13735196 14072002 14360213 14604623 14810781 14982519 15121480 15227863 15300104
59359 15300104 15334207 15324751 15266620 15155701 14989313 14767590 14494585 14177703 13826609 13452533
59349 13452533 13066579 12676888 12287454 11899735 11513979 11128379 10738929 10342054 9937011
59340 9937011 9525118 9108167 8688968 8272306 7863733 7467951 7089105 6731229 6396901
$$ packed form
59407B769740J8915J2204J1343J5351K2382L1416M2079N4180O7786Q2223R4455
59396C222074J00417R9698R7591J00603J10764J25948J44335J65990J90839K18037
59386D576296K47613K80622L17217L56256L96937M39192M82325N24619N64076
59377H185153N98041O22542O33882O30917O14400N84879N43357M93481M40550
59368A3347202L87994L36806K88211K44410K06158J71738J38961J06383P2241
59359A5300104L4103r456n8131j10919j66388k21723k73005l16882l51094l74076
59349A3452533l85954l89691l89434l87719l85756l85600l89450l96875m05043
59340I937011m11893m16951m19199m16662m08573l95782l78846l57876l34328
$$ plain form
59331 6396901 6086416 5799674 5537890 5302073 5090931 4901895 4733469 4585118 4455703
59322 4455703 4343604 4247723 4166938 4099228 4042777 3997336 3963264 3940003 3926821 3924128 3932431
59311 3932431 3950622 3976769 4009996 4050263 4096978 4149154 4206141 4266735 4328309 4388238 4445467
59300 4445467 4499350 4547869 4588627 4620881 4645127 4661605 4670808 4674571 4674815 4671981 4666445 4660777 4658714
59287 4658714 4662555 4673366 4692981 4723749 4766807 4822576 4892504 4978322 5079884 5195615 5324604
59276 5324604 5466280 5618342 5777029 5939085 6101458 6259423 6407108 6539442 6651124
59267 6651124 6733947 6778426 6779657 6740395 6668161 6571081 6456570 6331423 6201403 6071346 5945945
59256 5945945 5829297 5723439 5628512 5544507 5471657 5409148 5354899 5306966 5264061 5224705 5187198
$$ packed form
59331F396901l10485k86742k61784k35817k11142j89036j68426j48351j29415
59322D455703j12099r5881q0785o7710n6451m5441l4072k3261j3182k693Q303
59311C932431J8191K6147L3227M0267M6715N2176N6987O0594O1574N9929N7229
59300D445467N3883M8519M0758L2254K4246J6478R203L763K44k834n536n668k063
59287D658714L841J0811J9615L0768M3058N5769O9928Q5818J01562J15731J28989
59276E324604J41676J52062J58687J62056J62373J57965J47685J32334J11682
59267F651124Q2823M4479J231l9262p2234r7080j14511j25147j30020j30057j25401
59256E945945j16648j05858r4927q4005p2850o2509n4249m7933m2905l9356l7507
$$ plain form
59245 5187198 5150677 5115145 5080585 5047200 5016300 4989619 4967930 4951743 4943313 4946539 4964951 5001181
59233 5001181 5058233 5139694 5248456 5386533 5556143 5759754 5999117 6275325 6589362 6940841
59223 6940841 7325962 7737479 8165914 8599051 9020811 9412837 9757839 10040664 10247297
59214 10247297 10365605 10387883 10311654 10138486 9874141 9529958 9121981 8667724 8184236 7688187
59204 7688187 7194923 6716276 6260256 5832744 5437983 5077498 4750456 4455529 4191341
59195 4191341 3955421 3744670 3557052 3391296 3245028 3114936 2998773 2895440 2803130 2719334
59185 2719334 2642828 2573820 2511959 2456051 2405831 2361914 2323737 2289539 2258833 2232910 2212418
59174 2212418 2196354 2184001 2175920 2172373 2172536 2176051 2183715 2195994 2212309 2232322 2256336 2283990
$$ packed form
59245E187198l6521l5532l4560l3385l0900k6681k1689j6187q430L226J8412L6230
59233E001181N7052Q1461J08762J38077J69610K03611K39363K76208L14037L51479
59223F940841L85121M11517M28435M33137M21760L92026L45002K82825K06633
59214A0247297J18308K2278p6229j73168k64345l44183m07977m54257m83488m96049
59204G688187m93264m78647m56020m27512l94761l60485l27042k94927k64188
59195D191341k35920k10751j87618j65756j46268j30092j16163j03333r2310q3796
59185B719334p6506o9008o1861n5908n0220m3917l8177l4198l0706k5923k0492
59174B212418j6064j2353q081l547J63L515P664J2279J6315K0013K4014K7654
$$ plain form
59162 2283990 2314211 2347006 2383725 2425017 2470065 2518286 2570167 2625986 2685319 2748273 2815535
59151 2815535 2886632 2959743 3033687 3108573 3184076 3258700 3331095 3400346 3464594 3521270 3569204
59140 3569204 3608717 3639262 3659030 3667527 3666497 3657594 3641155 3618162 3591374 3563442 3535641 3509420
59128 3509420 3487369 3471564 3462629 3461438 3470047 3489924 3520955 3563326 3618657 3688060 3770669 3865432
59116 3865432 3972934 4094194 4228963 4376537 4537126 4711255 4898814 5099653 5314036
59107 5314036 5541533 5780326 6028114 6282354 6538797 6790900 7031305 7252549 7445818
59098 7445818 7600929 7709121 7765424 7768213 7718204 7618732 7475426 7294377 7081391 6843147
59088 6843147 6587193 6319798 6045190 5767505 5491786 5222148 4960532 4708212 4466942
$$ packed form
59162B283990L0221L2795L6719M1292M5048M8221N1881N5819N9333O2954O7262
59151B815535P1097P3111P3944P4886P5503P4624P2395O9251O4248N6676M7934
59140C569204L9513L0545J9768Q497j030q903j6439k2993k6788k7932k7801k6221
59128C509420k2051j5805q935j191Q609J9877L1031M2371N5331O9403Q2609R4763
59116C865432J07502J21260J34769J47574J60589J74129J87559K00839K14383
59107E314036K27497K38793K47788K54240K56443K52103K40405K21244J93269
59098G445818J55111J08192N6303K789n0009r9472j43306j81049k12986k38244
59088F843147k55954k67395k74608k77685k75719k69638k61616k52320k41270
$$ plain form
59079 4466942 4237673 4019882 3813384 3619394 3438705 3270272 3112794 2966367 2831401
59070 2831401 2707195 2592686 2487440 2390828 2301432 2218254 2141465 2071144 2006496 1947027 1893097
59059 1893097 1844455 1799624 1757603 1718794 1683401 1650335 1618571 1588213 1559408 1531642 1504843
59048 1504843 1479592 1455481 1430945 1405541 1380756 1357724 1336035 1315649 1297935 1283561 1271284
59037 1271284 1260174 1251265 1245680 1242905 1242353 1244901 1251353 1261060 1273490 1289492 1309360 1331238 1353072
59024 1353072 1374655 1396142 1416064 1432506 1444938 1453360 1457055 1455935 1451903 1447197 1442410 1437483 1433356
59011 1433356 1431180 1431147 1433544 1439657 1450131 1463625 1478437 1494161 1510390 1525268 1536945 1545260 1550618
58998 1550618 1552565 1550835 1546395 1539987 1531141 1520048 1508883 1499669 1492273 1486024 1481636 1479823 1479660 1480208
$$ packed form
59079D466942k29269k17791k06498j93990j80689j68433j57478j46427j34966
59070B831401j24206j14509j05246r6612q9396q3178p6789p0321o4648n9469n3930
59059A893097m8642m4831m2021l8809l5393l3066l1764l0358k8805k7766k6799
59048A504843k5251k4111k4536k5404k4785k3032k1689k0386j7714j4374j2277
59037A271284j1110q909n585k775n52K548O452R707J2430J6002J9868K1878K1834
59024A353072K1583K1487J9922J6442J2432Q422L695j120m032m706m787m927m127
59011A433356k176l3K397O113J0474J3494J4812J5724J6229J4878J1677Q315N358
58998A550618J947j730m440o408q846j1093j1165r214p396o249m388j813j63N48
$$ plain form
58984 1480208 1482238 1486518 1491902 1497068 1502663 1509782 1517752 1525498 1533702 1543492 1554290 1565125 1576862
58971 1576862 1591015 1607466 1625428 1645497 1668584 1693912 1720276 1748306 1779344 1812911 1847202
58960 1847202 1881135 1914047 1944631 1972373 1999041 2026686 2055230 2084064 2114672 2149148 2187108
58949 2187108 2226672 2267831 2312450 2361595 2415201 2473760 2538016 2607432 2681187 2760269 2846588
58938 2846588 2940625 3041953 3151394 3270440 3399118 3536629 3683664 3842096 4012951 4196809
58928 4196809 4395717 4612581 4849113 5106431 5387188 5695029 6032319 6400426 6801770
58919 6801770 7239516 7715607 8231165 8788450 9390358 10038026 10730403 11465416 12239256
58910 12239256 13044361 13869209 14699076 15515061 16293157 17006565 17629161 18136345 18505290
$$ packed form
58984A480208K030M280N384N166N595P119P970P746Q204R790J0798J0835J1737
58971A576862J4153J6451J7962K0069K3087K5328K6364K8030L1038L3567L4291
58960A847202L3933L2912L0584K7742K6668K7645K8544K8834L0608L4476L7960
58949B187108L9564M1159M4619M9145N3606N8559O4256O9416P3755P9082Q6319
58938B846588R4037J01328J09441J19046J28678J37511J47035J58432J70855J83858
58928D196809J98908K16864K36532K57318K80757L07841L37290L68107M01344
58919F801770M37746M76091N15558N57285O01908O47668O92377P35013P73840
58910A2239256Q05105Q24848Q29867Q15985P78096P13408O22596N07184L68945
$$ plain form
58901 18505290 18718418 18767448 18653090 18382329 17968393 17431954 16798421 16092791 15337884
58892 15337884 14555697 13766743 12987414 12229833 11503942 10817456 10174145 9574720 9019638
58883 9019638 8509189 8041381 7612308 7218822 6858841 6529231 6225668 5944820 5684765
58874 5684765 5443380 5218262 5008146 4812503 4629930 4458869 4299618 4153547 4020382
58865 4020382 3898175 3785684 3682790 3588735 3502018 3422059 3349221 3283295 3223615 3170346 3123961
58854 3123961 3083918 3049489 3021202 2999679 2983937 2972930 2967840 2970485 2980282 2995313 3015676 3043046
58842 3043046 3077433 3117221 3162199 3213787 3272305 3336669 3406857 3484213 3569256 3661533 3761640
58831 3761640 3871019 3989837 4117489 4255212 4405908 4571460 4752464 4950393 5167531
$$ packed form
58901A8505290K13128M9030j14358k70761m13936n36439o33533p05630p54907
58892A5337884p82187p88954p79329p57581p25891o86486o43311n99425n55082
58883I019638n10449m67808m29073l93486l59981l29610l03563k80848k60055
58874E684765k41385k25118k10116j95643j82573j71061j59251j46071j33165
58865D020382j22207j12491j02894r4055q6717p9959p2838o5926n9680n3269m6385
58854C123961m0043l4429k8287k1523j5742j1007n090K645R797J5031K0363K7370
58842C043046L4387L9788M4978N1588N8518O4364P0188P7356Q5043R2277J00107
58831C761640J09379J18818J27652J37723J50696J65552J81004J97929K17138
$$ plain form
58822 5167531 5404923 5662937 5943940 6252121 6590823 6962384 7370292 7818726 8309911
58813 8309911 8844429 9423884 10050414 10723260 11438130 12189539 12970505 13769213 14568248
58804 14568248 15347101 16082988 16749646 17319151 17766751 18073087 18223386 18208984 18031265
58795 18031265 17701944 17238735 16662313 15996395 15266421 14495984 13705629 12914307 12138607
58786 12138607 11389710 10673597 9994782 9357520 8763474 8211450 7700373 7230079 6798850
58777 6798850 6402991 6039487 5706526 5401008 5118376 4855599 4611707 4384953 4172281
58768 4172281 3972204 3785351 3611449 3448505 3295655 3153928 3023301 2901826 2788609
58759 2788609 2684883 2591059 2505351 2426380 2354692 2290640 2233049 2180853 2133849 2091237 2051807
$$ packed form
58822E167531K37392K58014K81003L08181L38702L71561M07908M48434M91185
58813H309911N34518N79455O26530O72846P14870P51409P80966P98708P99035
58804A4568248P78853P35887O66658N69505M47600L06336J50299j4402j77719
58795A8031265l29321m63209n76422o65918p29974p70437p90355p91322p75700
58786A2138607p48897p16113o78815o37262n94046n52024n11077m70294m31229
58777F798850l95859l63504l32961l05518k82632k62777k43892k26754k12672
58768D172281k00077j86853j73902j62944j52850j41727j30627j21475j13217
58759B788609j03726r3824q5708p8971p1688o4052n7591n2196m7004m2612l9430
$$ plain form
58748 2051807 2016058 1985586 1959804 1935904 1912515 1890639 1870499 1850585 1830534 1811830 1794661
58737 1794661 1777047 1758062 1738915 1719836 1699078 1676240 1653497 1632100 1610542 1587650 1564657
58726 1564657 1542640 1520543 1497311 1473501 1449348 1423707 1396277 1368511 1341104 1312992 1283971
58715 1283971 1255740 1229237 1203514 1178374 1155361 1134952 1115508 1096282 1078723 1063526 1049142
58704 1049142 1034518 1020558 1007684 994829 982104 971401 962913 954133 943854 934027 925992 918124
58692 918124 909234 901211 896009 892718 889876 888099 888236 889293 890171 891156 891859 890196 885363 879406 874012
58677 874012 868259 861313 854718 849950 846286 843086 841572 842150 842519 840750 838089 836681 836768 838061 841415
58662 841415 846872 852220 855495 856892 856558 853071 846092 838053 831153 824995 819017 814652 813014 812998 813743
$$ packed form
58748B051807l5749l0472k5782k3900k3389k1876k0140j9914k0051j8704j7169
58737A794661j7614j8985j9147j9079k0758k2838k2743k1397k1558k2892k2993
58726A564657k2017k2097k3232k3810k4153k5641k7430k7766k7407k8112k9021
58715A283971k8231k6503k5723k5140k3013k0409j9444j9226j7559j5197j4384
58704A049142j4624j3960j2874j2855j2725j0703q488q780j0279r827q035p868
58692I18124q890q023n202l291k842j777J37J057Q78R85P03j663m833n957n394
58677H74012n753o946o595m768l664l200j514N78L69j769k661j408Q7J293L354
58662H41415N457N348L275J397l34l487o979q039o900o158n978m365j638j6P45
$$ plain form
58647 813743 816451 821693 827662 833353 840812 851814 864936 878416 893410 911729 932723 954948
58635 954948 978756 1004767 1032049 1060340 1091868 1128521 1169336 1213144 1261395 1315940 1376346
58624 1376346 1441997 1514633 1596291 1686858 1786306 1897194 2022475 2162788 2318298 2491001
58614 2491001 2682631 2892212 3117819 3358366 3611098 3869322 4124728 4369427 4593462
58605 4593462 4783326 4926481 5016064 5049573 5026170 4948425 4824276 4663884 4475951 4268892
58595 4268892 4052506 3835137 3621041 3412995 3215076 3030256 2857988 2697236 2549538
58586 2549538 2416276 2295595 2185173 2085628 1998111 1921074 1852599 1793338 1743779 1701068 1662023
58575 1662023 1626983 1597254 1571141 1546152 1522838 1502659 1484008 1464039 1442580 1420789 1397950
$$ packed form
58647H13743K708N242N969N691P459J1002J3122J3480J4994J8319K0994K2225
58635I54948K3808K6011K7282K8291L1528L6653M0815M3808M8251N4545O0406
58624A376346O5651P2636Q1658R0567R9448J10888J25281J40313J55510J72703
58614B491001J91630K09581K25607K40547K52732K58224K55406K44699K24035
58605D593462J89864J43155Q9583L3509k3403p7745j24149j60392j87933k07059
58595D268892k16386k17369k14096k08046j97919j84820j72268j60752j47698
58586B549538j33262j20681j10422r9545q7517p7037o8475n9261m9559m2711l9045
58575A662023l5040k9729k6113k4989k3314k0179j8651j9969k1459k1791k2839
$$ plain form
58564 1397950 1373169 1348280 1325427 1303508 1280357 1256478 1233154 1209049 1182455 1155085 1129894
58553 1129894 1106873 1084559 1063827 1046465 1031711 1017884 1005789 996946 990103 982967 975760 969784
58541 969784 964369 958557 953701 950898 948027 942880 936966 932465 927902 920871 912682 906007 900098 892685
58527 892685 884461 877156 869154 857762 844107 831211 818869 805063 790778 778558 767706 755708
58515 755708 743284 733375 726129 719373 712973 708339 704675 700051 695199 692115 690141 687505 685258 685418
58501 685418 686748 686816 686747 689269 693532 696553 698467 701574 705509 708279 710866 715778 722008 726337 728771
58486 728771 731885 735697 737982 738857 740377 742399 743437 744591 748009 752556 755694 758409 763374 769409
58472 769409 772899 773700 774545 775546 774426 771262 767925 763689 756498 747680 740322 733964 726040 717433 711219
$$ packed form
58564A397950k4781k4889k2853k1919k3151k3879k3324k4105k6594k7370k5191
58553A129894k3021k2314k0732j7362j4754j3827j2095q843o843p136p207n976
58541I69784n415n812m856k803k871n147n914m501m563p031q189o675n909p413
58527H92685q224p305q002j1392j3655j2896j2342j3806j4285j2220j0852j1998
58515G55708j2424r909p246o756o400m634l664m624m852l084j974k636k247J60
58501F85418J330O8o9K522M263L021J914L107L935K770K587M912O230M329K434
58486G28771L114L812K285Q75J520K022J038J154L418M547L138K715M965O035
58472G69409L490Q01Q45J001j120l164l337m236p191q818p358o358p924q607o214
$$ plain form
58457 711219 706965 701766 695934 692067 689443 685131 679772 676486 674846 671784 667665 665443 664548 661891
58443 661891 658392 658153 661433 664780 667924 674016 682965 690981 697139 704131 712060 717598 719891 721489
58429 721489 722941 722214 719836 718825 719204 718273 716499 717353 721200 725130 728846 734735 742251 748454 754073
58414 754073 762662 773689 783010 790331 799465 810868 820723 827999 835671 844219 850583 854334 858229 861881
58400 861881 861538 856974 852020 847523 840473 830855 822542 816475 809741 802283 797639 796116 794137 791276
58386 791276 790913 793054 793676 792256 792758 796001 798301 798792 800803 804859 807848 810336 816958 828007 838312
58371 838312 846043 854997 866521 877085 885767 896330 909664 921698 930857 940217 950449 958193 963233
58358 963233 969562 977535 982774 984653 987952 994326 1000213 1004876 1012048 1021687 1028748 1032240 1036822 1043290
$$ packed form
58457G11219m254n199n832l867k624m312n359l286j640l062m119k222q95k657
58443F61891l499k39L280L347L144O092Q949Q016O158O992P929N538K293J598
58429G21489J452p27k378j011L79r31j774Q54L847L930L716N889P516O203N619
58414G54073Q589J1027R321P321R134J1403R855P276P672Q548O364L751L895L652
58400H61881l43m564m954m497p050r618q313o067o734p458m644j523j979k861
58386G91276l63K141O22j420N02L243K300M91K011M056K989K488O622J1049J0305
58371H38312P731Q954J1524J0564Q682J0563J3334J2034R159R360J0232P744N040
58358I63233O329P973N239J879L299O374N887M663P172R639P061L492M582O468
$$ plain form
58344 1043290 1046470 1044907 1043514 1044092 1042588 1038587 1038025 1043092 1048635 1051995 1057353 1066889 1076784 1085520
58330 1085520 1097046 1112158 1125798 1136417 1148871 1164695 1178962 1190299 1204252 1222847 1240542
58319 1240542 1254480 1269014 1286065 1300959 1312038 1324561 1340768 1355880 1367899 1381280 1396830
58308 1396830 1408596 1415057 1422761 1434471 1444667 1451214 1460070 1473580 1485711 1494163 1505520 1522912
58296 1522912 1540321 1554733 1571934 1594345 1615247 1631388 1649246 1672395 1694958 1714104 1736502
58285 1736502 1765448 1794103 1818581 1845125 1877206 1908355 1935204 1964581 2000156 2035288 2066735
58274 2066735 2101868 2144475 2187287 2226536 2269480 2319088 2366210 2406010 2447241 2495812 2544365
58263 2544365 2587815 2633751 2687341 2741569 2792736 2849579 2916374 2983525 3045894 3113406 3191932
$$ packed form
58344A043290L180j563j393N78j504m001n62N067N543L360N358R536R895Q736
58330A085520J1526J5112J3640J0619J2454J5824J4267J1337J3953J8595J7695
58319A240542J3938J4534J7051J4894J1079J2523J6207J5112J2019J3381J5550
58308A396830J1766O461P704J1710J0196O547Q856J3510J2131Q452J1357J7392
58296A522912J7409J4412J7201K2411K0902J6141J7858K3149K2563J9146K2398
58285A736502K8946K8655K4478K6544L2081L1149K6849K9377L5575L5132L1447
58274B066735L5133M2607M2812L9249M2944M9608M7122L9800M1231M8571M8553
58263B544365M3450M5936N3590N4228N1167N6843O6795O7151O2369O7512P8526
$$ plain form
58252 3191932 3271290 3344575 3421524 3509723 3600590 3687553 3779814 3884068 3991100 4094911 4206212
58241 4206212 4332164 4462200 4589169 4724442 4876303 5034203 5190905 5358676 5546328
58232 5546328 5742539 5939857 6152115 6389243 6638785 6892068 7163849 7465461 7784532
58223 7784532 8113024 8468281 8863506 9285664 9726590 10206258 10740075 11314631 11922700
58214 11922700 12589115 13333888 14145337 15020060 15991881 17089562 18307379 19652775 21179279
58205 21179279 22935536 24931447 27197303 29825254 32910326 36513187 40733534 45753995
58197 45753995 51756110 58873570 67302543 77386015 89538534 104219915 122088095
58190 122088095 144048823 171045228 203942816 243561518 289982880 340678321 389074459
$$ packed form
58252C191932P9358P3285P6949Q8199R0867Q6963R2261J04254J07032J03811J11301
58241D206212J25952J30036J26969J35273J51861J57900J56702J67771J87652
58232E546328J96211J97318K12258K37128K49542K53283K71781L01612L19071
58223G784532L28492L55257L95225M22158M40926M79668N33817N74556O08069
58214A1922700O66415P44773Q11449Q74723R71821J097681J217817J345396J526504
58205B1179279J756257J995911K265856K627951L085072L602861M220347N020461
58197D5753995O002115P117460Q428973J0083472J2152519J4681381J7868180
58190A22088095K1960728K6996405L2897588L9618702M6421362N0695441M8396138
$$ plain form
58183 389074459 425984059 443820001 440306507 418692925 384988410 345087534 303538783
58176 303538783 263484167 226807922 194343283 166260759 142409167 122419985 105762942
58169 105762942 91905290 80416388 70915948 63033932 56478184 51063440 46634960 43034278
58161 43034278 40159690 37979303 36465263 35592473 35406938 36011085 37495545 39982598
58153 39982598 43650715 48426118 53518748 57478826 58988770 57666237 54094978 49219269
58145 49219269 43828607 38459720 33464842 29023509 25167472 21872112 19108467 16817678
58137 16817678 14908065 13305437 11969107 10854322 9903902 9084366 8390407 7806723 7299526
58128 7299526 6848193 6451325 6098712 5768370 5452871 5159599 4884751 4614749 4352360
$$ packed form
58183C89074459L6909600J7835942l513494k1613582l3704515l9900876m1548751
58176C03538783m0054616l6676245l2464639k8082524k3851592j9989182j6657043
58169A05762942j3857652j1488902r500440p882016o555748n414744m428480l600682
58161D3034278k874588k180387j514040q72790j85535O04147J484460K487053
58153C9982598L668117M775403N092630L960078J509944j322533l571259m875709
58145D9219269n390662n368887m994878m441333l856037l295360k763645k290789
58137A6817678j909613j602628j336330j114785r50420q19536o93959n83684n07197
58128G299526m51333l96868l52613l30342l15499k93272k74848k70002k62389
$$ plain form
58119 4352360 4113927 3901288 3702114 3516112 3354881 3217234 3090049 2972599 2875470 2795701
58109 2795701 2716406 2631055 2546336 2461901 2369328 2271179 2180191 2098995 2019513 1941773 1874321
58098 1874321 1816590 1759325 1702081 1652678 1610174 1565719 1519373 1479046 1443833 1405261 1364156
58087 1364156 1329591 1301776 1272184 1239998 1212452 1189385 1163102 1133349 1107344 1085213 1060075
58076 1060075 1032193 1008554 988805 965971 940887 921699 909085 895770 880598 869390 861851
58065 861851 851323 837977 828994 825025 819322 810860 805662 804342 800625 793149 786868 781947 772935 759813
58051 759813 748548 739942 729023 716061 707002 702220 695823 686946 681045 679124 676291 671858 670528
58038 670528 672632 673385 672634 675293 681319 685301 686751 690802 697715 701686 701253 701260 703329 703738 701819 701150
$$ packed form
58119D352360k38433k12639j99174j86002j61231j37647j27185j17450r7129p9769
58109B795701p9295q5351q4719q4435r2573r8149r0988q1196p9482p7740o7452
58098A874321n7731n7265n7244m9403m2504m4455m6346m0327l5213l8572m1105
58087A364156l4565k7815k9592l2186k7546k3067k6283k9753k6005k2131k5138
58076A060075k7882k3639j9749k2834k5084j9188j2614j3315j5172j1208p539
58065H61851j0528j3346q983l969n703q462n198j320l717p476o281m921r012j3122
58051G59813j1265q606j0919j2962r059m782o397q877n901j921k833m433j330
58038F70528K104P53p51K659O026L982J450M051O913L971m33PK069M09j919o69
$$ plain form
58022 701150 701398 698242 692393 689465 689872 688029 682585 678224 676241 672635 666819 662957 661132 656250 647405
58007 647405 639502 633943 626578 616689 609202 605893 602842 598626 596683 597451 596427 592330 589307 588836 587185
57992 587185 583057 580052 579371 577583 573834 571882 572865 573340 572467 573795 577915 580731 581125 583020 587661
57977 587661 591152 591895 593261 596544 598402 597746 598091 600552 601410 599144 597073 596528 594237 589078 584651
57962 584651 582483 579396 574412 571594 572926 574671 573779 571793 569575 564432 555686 547183 541166 535236
57948 535236 528211 523222 522050 522058 521658 523272 527963 532667 535712 539679 545911 551521 554636 557230 559931
57933 559931 559519 554651 548690 543723 536980 526338 514323 503406 492238 479780 468365 459503 451224
57920 451224 442579 436224 433614 432227 430399 430285 433248 437029 440382 445746 454324 463234 470623 478986
$$ packed form
58022G01150K48l156n849k928M07j843n444m361j983l606n816l862j825m882q845
58007F47405p903n559p365r889p487l309l051m216j943P68j024m097l023m71j651
57992E87185m128l005o81j788l749j952R83M75q73J328M120K816L94J895M641
57977E87661L491P43J366L283J858o56L45K461Q58k266k071n45k291n159m427
57962E84651k168l087m984k818J332J745q92j986k218n143q746q503o017n930
57948E35236p025m989j172Qm00J614M691M704L045L967O232N610L115K594K701
57933E59931m12m868n961m967o743j0642j2015j0917j1168j2458j1415q862q279
57920D51224q645o355k610j387j828j14K963L781L353N364Q578Q910P389Q363
$$ plain form
57906 478986 490214 501909 511739 520944 530358 537479 540852 543072 546103 547887 546819 545215 544942 543827
57892 543827 539908 535082 530993 525375 516201 505734 496769 488432 479235 470771 464746 459659 453940 449225
57878 449225 447266 446676 445827 445756 447239 448392 448277 449443 453735 458905 462618 466457 472692 480338 487733
57863 487733 495757 505095 513401 518579 522041 525616 528236 528814 529189 530847 531721 529643 526086 523123 519562
57848 519562 513492 505962 498753 491177 482424 474396 468854 464206 458382 452410 448013 444257 439830 436099
57834 436099 434508 433378 430597 427108 424430 421062 414782 406485 398507 391110 383648 377054 372051 366875
57820 366875 359723 351549 343817 335780 326810 318932 314011 310610 306630 302769 300435 298640 296132 294248
57806 294248 294419 295065 294327 293694 295522 298943 301721 304336 308838 315322 322780 331864 343567 356590 368918
$$ packed form
57906D78986J1228J1695R830R205R414P121L373K220L031J784j068j604k73j115
57892E43827l919m826m089n618r174j0467q965q337r197q464o025n087n719m715
57878D49225j959n90q49p1J483J153j15J166M292N170L713L839O235P646P395
57863D87733Q024R338Q306N178L462L575K620N78L75J658Q74k078l557k963l561
57848E19562o070p530p209p576q753q028n542m648n824n972m397l756m427l731
57834D36099j591j130k781l489k678l368o280q297p978p397p462o594n003n176
57820C66875p152q174p732q037q970p878m921l401l980l861k334j795k508j884
57806B94248J71O46p38o33J828L421K778K615M502O484P458R084J1703J3023J2328
$$ plain form
57791 368918 380486 391525 400246 405181 408154 411871 416174 419529 422406 426107 429867 432091 432896 432666
57777 432666 429890 423439 415262 407808 400463 391456 381520 372597 364574 356421 348938 343404 339074 334987
57763 334987 332485 332887 334454 334873 335085 337377 341312 344928 348363 352883 357720 361366 364717 369559 375087
57748 375087 379285 382588 386900 392061 396582 400818 406147 411905 416304 419534 422997 426522 429297 432397
57734 432397 437232 442552 446159 448637 452282 457325 462355 467474 473818 480759 486741 492170 498627 506090
57720 506090 513804 522807 534481 547579 559835 571565 584654 599095 613717 629339 647700 668101
57708 668101 688477 709181 732394 758427 785938 815217 847951 884124 922370 963092 1008268
57697 1008268 1058617 1113838 1175091 1244361 1322000 1407795 1503696 1612527 1734961 1870895 2022760
$$ packed form
57791C68918J1568J1039Q721M935K973L717M303L355K877L701L760K224Q05k30
57777D32666k776o451q177p454p345r007r936q923q023q153p483n534m330m087
57763C34987k502M02J567M19K12K292L935L616L435M520M837L646L351M842N528
57748C75087M198L303M312N161M521M236N329N758M399L230L463L525K775L100
57734D32397M835N320L607K478L645N043N030N119O344O941N982N429O457P463
57720E06090P714R003J1674J3098J2256J1730J3089J4441J4622J5622J8361K0401
57708F68101K0376K0704K3213K6033K7511K9279L2734L6173L8246M0722M5176
57697A008268N0349N5221O1253O9270P7639Q5795R5901J08831J22434J35934J51865
$$ plain form
57686 2022760 2193964 2384752 2593023 2818298 3060940 3317664 3581266 3844261 4099078
57677 4099078 4335075 4539637 4703278 4821641 4893821 4922947 4918498 4894385 4863965 4838022 4823551
57666 4823551 4817016 4797799 4734916 4605356 4406566 4153397 3867915 3572289 3284752 3016728
57656 3016728 2773470 2557736 2371112 2212154 2076641 1960933 1863138 1781051 1711825 1654106
57646 1654106 1607812 1571495 1542641 1520712 1506995 1501194 1501192 1506445 1518461 1537627 1562857 1594862
57634 1594862 1636356 1688197 1748606 1817164 1896437 1988656 2093813 2212094 2345108 2493413
57624 2493413 2655570 2830754 3019470 3220361 3428590 3638115 3842543 4032615 4195873
57615 4195873 4320965 4400757 4431078 4409650 4338009 4222307 4070681 3891356 3693433 3486469
$$ packed form
57686B022760J71204J90788K08271K25275K42642K56724K63602K62995K54817
57677D099078K35997K04562J63641J18363P2180K9126m449k4113l0420k5943j4471
57666D823551o535j9217o2883j29560j98790k53169k85482k95626k87537k68024
57656C016728k43258k15734j86624j58958j35513j15708r7795q2087o9226n7719
57646A654106m6294l6317k8854k1929j3717n801kN253J2016J9166K5230L2005
57634A594862M1494N1841O0409O8558P9273R2219J05157J18281J33014J48305
57624B493413J62157J75184J88716K00891K08229K09525K04428J90072J63258
57615D195873J25092P9792L0321k1428p1641j15702j51626j79325j97923k06964
$$ plain form
57605 3486469 3277724 3071627 2872399 2684521 2509885 2347395 2196616 2059249 1935902
57596 1935902 1824282 1722146 1629520 1546534 1471469 1402617 1339926 1283335 1231504 1183566 1140103
57585 1140103 1101152 1065323 1032078 1002689 977636 955273 934434 916146 901273 888480 876074
57574 876074 864029 852819 842100 831885 823191 816303 810198 804738 801349 800383 800006 799068 798943 801046
57560 801046 804625 808683 814077 821887 831409 841417 851968 863523 875906 889550 906062 926056
57548 926056 947961 970413 994311 1021190 1051238 1084411 1121906 1164899 1213121 1266077 1324461
57537 1324461 1389246 1460751 1539705 1627736 1725711 1833135 1950262 2079035 2220679 2373954
57527 2373954 2536791 2707681 2883812 3059319 3226674 3378310 3505846 3600086 3654127 3665830
$$ packed form
57605C486469k08745k06097j99228j87878j74636j62490j50779j37367j23347
57596A935902j11620j02136r2626q2986p5065o8852o2691n6591n1831m7938m3463
57585A140103l8951l5829l3245k9389k5053k2363k0839j8288j4873j2793j2406
57574H76074j2045j1210j0719j0215q694o888o105n460l389r66l77r38j25K103
57560H01046L579M058N394P810R522J0008J0551J1555J2383J3644J6512J9994
57548I26056K1905K2452K3898K6879L0048L3173L7495M2993M8222N2956N8384
57537A324461O4785P1505P8954Q8031R7975J07424J17127J28773J41644J53275
57527B373954J62837J70890J76131J75507J67355J51636J27536R4240N4041J1703
$$ plain form
57517 3665830 3636440 3568548 3466765 3338451 3191712 3033437 2870032 2708044 2552200 2404187
57507 2404187 2264792 2135872 2018906 1913287 1817811 1732531 1657666 1592066 1534411 1484613
57497 1484613 1442532 1406562 1375095 1348244 1326659 1309808 1296848 1287980 1283571 1283052 1285975 1292887
57485 1292887 1303962 1318121 1334797 1355142 1380252 1409740 1443448 1482906 1529491 1582719 1642128
57474 1642128 1709358 1786551 1874065 1971587 2080212 2201388 2334767 2478749 2632011 2792658
57464 2792658 2956718 3118902 3273604 3413462 3528404 3608578 3648133 3645321 3600616 3516957
57454 3516957 3400873 3260931 3104893 2939204 2769993 2602714 2441272 2288663 2147565
57445 2147565 2018985 1901529 1793631 1695654 1608455 1531111 1461762 1399632 1344533 1295379 1250977
$$ packed form
57517C665830k9390o7892j01783j28314j46739j58275j63405j61988j55844j48013
57507B404187j39395j28920j16966j05619r5476q5280p4865o5600n7655m9798
57497A484613m2081l5970l1467k6851k1585j6851j2960q868m409n19K923O912
57485A292887J1075J4159J6676K0345K5110K9488L3708L9458M6585N3228N9409
57474A642128O7230P7193Q7514R7522J08625J21176J33379J43982J53262J60647
57464B792658J64060J62184J54702J39858J14942Q0174L9555k812m4705q3659
57454C516957j16084j39942j56038j65689j69211j67279j61442j52609j41098
57445B147565j28580j17456j07898r7977q7199p7344o9349o2130n5099m9154m4402
$$ plain form
57434 1250977 1211346 1176601 1145508 1116879 1091346 1069825 1051113 1033032 1015256 999091 985095
57423 985095 972756 961964 952888 944858 937105 930212 925180 921520 917873 914039 910779 908089 905346 902757
57409 902757 901072 900192 899519 899314 900317 902376 904805 907634 911229 915191 918903 922618 926746 930748 934132
57394 934132 937822 943017 949263 955108 960169 965148 970398 975884 982065 989388 997316 1005024 1012485 1019798
57380 1019798 1026277 1031506 1036428 1042011 1047760 1052972 1058462 1065354 1073033 1080079 1086528 1093501 1101217 1109096
57366 1109096 1117192 1125842 1134424 1142134 1149470 1157407 1165691 1173520 1181164 1189293 1197455 1204987 1212726 1221878
57352 1221878 1231831 1240968 1249196 1257778 1267118 1276593 1286169 1296315 1306670 1316612 1326759 1338116 1350129
57339 1350129 1361475 1372366 1384075 1396469 1408124 1418847 1430084 1442728 1456228 1469952 1483860
$$ packed form
57434A250977l9631l4745l1093k8629k5533k1521j8712j8081j7776j6165j3996
57423I85095j2339j0792r076q030p753o893n032l660l647l834l260k690k743k589
57409I02757j685q80o73k05J003K059K429K829L595L962L712L715M128M002L384
57394I34132L690N195O246N845N061M979N250N486O181P323P928P708P461P313
57380A019798O479N229M922N583N749N212N490O892P679P046O449O973P716P879
57366A109096Q096Q650Q582P710P336P937Q284P829P644Q129Q162P532P739R152
57352A221878R953R137Q228Q582R340R475R576J0146J0355R942J0147J1357J2013
57339A350129J1346J0891J1709J2394J1655J0723J1237J2644J3500J3724J3908
$$ plain form
57328 1483860 1497733 1511229 1524613 1538202 1551453 1564031 1577189 1592364 1608933 1625212 1641236
57317 1641236 1658511 1677259 1695972 1713726 1731054 1748499 1766045 1784000 1802747 1821627 1839714
57306 1839714 1857592 1876712 1897168 1917820 1938384 1959578 1981407 2003242 2025574 2049768 2076021
57295 2076021 2103341 2131437 2160786 2190975 2221069 2251748 2284998 2321356 2359341 2397822 2436986
57284 2436986 2476644 2515550 2553049 2589726 2625812 2660346 2692279 2721098 2746107 2766355 2781409
57273 2781409 2790980 2794104 2790298 2781297 2769906 2757208 2742681 2726835 2711630 2698256 2686620 2677209
57261 2677209 2671286 2668890 2668658 2670115 2674197 2681136 2689795 2699665 2711525 2725488 2740280 2755236 2771300
57248 2771300 2789262 2808515 2828248 2848406 2868893 2889217 2909510 2930549 2952372 2974202 2996018
$$ packed form
57328A483860J3873J3496J3384J3589J3251J2578J3158J5175J6569J6279J6024
57317A641236J7275J8748J8713J7754J7328J7445J7546J7955J8747J8880J8087
57306A839714J7878J9120K0456K0652K0564K1194K1829K1835K2332K4194K6253
57295B076021K7320K8096K9349L0189L0094L0679L3250L6358L7985L8481L9164
57284B436986L9658L8906L7499L6677L6086L4534L1933K8819K5009K0248J5054
57273B781409R571L124l806r001j1391j2698j4527j5846j5205j3374j1636r411
57261B677209n923k396k32J457M082O939Q659R870J1860J3963J4792J4956J6064
57248B771300J7962J9253J9733K0158K0487K0324K0293K1039K1823K1830K1816
$$ plain form
57237 2996018 3018774 3042845 3067691 3093189 3119706 3146834 3173751 3200850 3229119 3257858 3285168
57226 3285168 3310873 3336685 3363075 3388364 3411574 3433835 3456106 3477795 3498666 3519953 3542348
57215 3542348 3564924 3587343 3611219 3637824 3666031 3693949 3721185 3748144 3774479 3799608 3823661
57204 3823661 3846731 3868190 3887769 3906251 3924227 3941301 3957374 3973527 3990675 4008371 4025725
57193 4025725 4042518 4058719 4074076 4088864 4103936 4119334 4133897 4146797 4158410 4169347 4179829
57182 4179829 4190324 4201363 4212306 4221820 4230000 4238552 4248520 4259473 4271211 4284282 4298213 4311285
57170 4311285 4323020 4335065 4348685 4363229 4377974 4393535 4410230 4426894 4442678 4458460 4475164
57159 4475164 4492213 4508778 4525015 4540841 4555054 4567058 4578041 4589099 4599538 4608315 4615738 4622343
$$ packed form
57237B996018K2756K4071K4846K5498K6517K7128K6917K7099K8269K8739K7310
57226C285168K5705K5812K6390K5289K3210K2261K2271K1689K0871K1287K2395
57215C542348K2576K2419K3876K6605K8207K7918K7236K6959K6335K5129K4053
57204C823661K3070K1459J9579J8482J7976J7074J6073J6153J7148J7696J7354
57193D025725J6793J6201J5357J4788J5072J5398J4563J2900J1613J0937J0482
57182D179829J0495J1039J0943R514Q180Q552R968J0953J1738J3071J3931J3072
57170D311285J1735J2045J3620J4544J4745J5561J6695J6664J5784J5782J6704
57159D475164J7049J6565J6237J5826J4213J2004J0983J1058J0439Q777P423O605
$$ plain form
57147 4622343 4627329 4629545 4628968 4625976 4620297 4611845 4601455 4589581 4575337 4557873 4537577 4514950 4489686
57134 4489686 4461992 4433548 4405885 4378903 4351905 4324783 4297162 4267902 4236705 4204864 4173189
57123 4173189 4140650 4106363 4071470 4037536 4004389 3971053 3937582 3904389 3870799 3835753 3798998
57112 3798998 3760310 3718663 3673696 3627198 3582024 3540664 3506034 3482254 3473008 3480116 3505319 3552763
57100 3552763 3628670 3739802 3893887 4100797 4371985 4719399 5155780 5694669 6348516 7127568
57090 7127568 8041678 9101748 10317052 11690437 13215535 14875835 16643136 18475938
57082 18475938 20320692 22117466 23809063 25349089 26701076 27826088 28671011 29175337
57074 29175337 29296535 29031906 28417861 27511533 26372645 25054505 23601805 22052933 20445598
$$ packed form
57147D622343M986K216n77k992n679q452j0390j1874j4244j7464k0296k2627k5264
57134D489686k7694k8444k7663k6982k6998k7122k7621k9260l1197l1841l1675
57123D173189l2539l4287l4893l3934l3147l3336l3471l3193l3590l5046l6755
57112C798998l8688m1647m4967m6498m5174m1360l4630k3780r246P108K5203M7444
57100C552763P5907J11132J54085K06910K71188L47414M36381N38889O53847P79052
57090G127568R14110J060070J215304J373385J525098J660300J767301J832802
57082A8475938J844754J796774J691597J540026J351987J125012Q44923N04326
57074B9175337J21198k64629o14045r06328j138888j318140j452700j548872j607335
$$ plain form
57065 20445598 18820609 17219315 15678061 14225613 12882956 11662061 10565283 9588454
57057 9588454 8724836 7965626 7299153 6712911 6196318 5740129 5334595 4970514 4641295
57048 4641295 4342125 4068182 3815541 3582472 3367512 3167225 2978010 2798865 2630111
57039 2630111 2470634 2318872 2175315 2041240 1915822 1797246 1685878 1583583 1490486 1405041
57029 1405041 1326675 1255659 1190857 1130319 1073898 1022782 976814 934713 896446 862839 833209
57018 833209 805873 780707 758798 740064 723655 710123 700611 694530 690727 690359 695803 707374 724095
57005 724095 747030 778891 821307 875852 946828 1039543 1157730 1307210 1498198 1732180 1981511
56994 1981511 2189984 2303345 2301771 2203669 2044281 1855373 1659614 1472560 1303805 1157657
$$ packed form
57065B0445598j624989j601294j541254j452448j342657j220895j096778r76829
57057I588454q63618p59210o66473n86242n16593m56189m05534l64081l29219
57048D641295k99170k73943k52641k33069k14960k00287j89215j79145j68754
57039B630111j59477j51762j43557j34075j25418j18576j11368j02295r3097q5445
57029A405041p8366p1016o4802o0538n6421n1116m5968m2101l8267l3607k9630
57018H33209k7336k5166k1909j8734j6409j3532r512o081l803l68N444J1571J6721
57005G24095K2935L1861M2416N4545P0976R2715J18187J49480J90988K33982K49331
56994A981511K08473J13361j574r8102j59388j88908j95759j87054j68755j46148
$$ plain form
56984 1157657 1035070 935122 855089 790550 736148 686504 637579 588230 540099 495409 455250
56973 455250 419884 389382 363352 341097 322619 308560 298928 292972 290505 291945 296915 304351 314363
56960 314363 328304 346610 368313 393113 421673 452632 481073 501402 510808 509357 498552 481028
56948 481028 460233 438765 417605 397546 380142 366381 355644 346958 340362 336333 335034 336914
56936 336914 342895 353176 366955 384089 405944 433787 467059 503311 538286 565647 578812 574900
56924 574900 556367 528215 494671 458953 424178 392727 365413 342284 323379 308006 294466
56913 294466 281662 270108 260512 252354 244858 238375 233684 230663 228647 227466 227250 227764 228690 230123
56899 230123 232275 235278 239600 245852 253786 262294 270810 279930 290469 302865 317746 335929 357541
$$ packed form
56984A157657j22587r9948q0033o4539n4402m9644m8925m9349m8131m4690m0159
56973D55250l5366l0502k6030k2255j8478j4059r632n956k467J440M970P436J0012
56960C14363J3941J8306K1703K4800K8560L0959K8441K0329R406j451j0805j7524
56948D81028k0795k1468k1160k0059j7404j3761j0737q686o596m029j299J880
56936C36914N981J0281J3779J7134K1855K7843L3272L6252L4975K7361J3165l912
56924E74900j8533k8152l3544l5718l4775l1451k7314k3129j8905j5373j3540
56913B94466j2804j1554r596q158p496o483m691l021k016j181k16N14R26J433
56899B30123K152L003M322O252P934Q508Q516R120J0539J2396J4881J8183K1612
$$ plain form
56886 357541 382105 409496 439212 468264 491460 504748 507428 500951 487340 469429 450674 433123
56874 433123 416580 400740 387050 377380 372029 370298 372247 378736 390393 407552 430737 460536
56862 460536 497546 543046 598867 665384 739208 812536 874488 914329 925988 910815 875602
56851 875602 827888 773745 718729 667936 624125 587576 558601 538588 528065 525791 530985 544838
56839 544838 568805 603086 648019 705557 778179 867461 973887 1094843 1220059 1330536 1405530
56828 1405530 1432405 1410740 1349462 1261938 1161970 1060615 964640 877637 801883 738549 687224
56817 687224 646775 616722 597192 588039 588783 599161 619339 650139 693366 751203 824332 910056
56805 910056 1001005 1084484 1144491 1168071 1152148 1104076 1035525 956662 875030 796317 724049
$$ packed form
56886C57541K4564K7391K9716K9052K3196J3288K680o477j3611j7911j8755j7551
56874D33123j6543j5840j3690r670n351j731J949O489J1657J7159K3185K9799
56862D60536L7010M5500N5821O6517P3824P3328O1952L9841J1659j5173l5213
56851H75602m7714n4143n5016n0793m3811l6549k8975k0013j0523k274N194J3853
56839E44838K3967L4281M4933N7538P2622Q9282J06426J20956J25216J10477P4994
56828A405530K6875k1665o1278q7524r9968j01355r5975q7003p5754o3334n1325
56817F87224m0449l0053j9530r153P44J0378K0178L0800M3227N7837P3129Q5724
56805I10056R0949Q3479O0007K3580j5923m8072o8551p8863q1632p8713p2268
$$ plain form
56794 724049 659755 604463 558968 522329 492263 468092 451545 443683 443062 448229 460134 480509
56782 480509 509578 546736 591285 640033 685349 718020 732001 725871 701477 663139 616968 568569
56770 568569 521193 476636 436586 401785 371117 343233 318325 297187 279658 265300 254346
56759 254346 246468 239725 232394 224943 218781 214065 210156 207124 205164 203455 201230 199148 198144 197771
56745 197771 197094 196307 196029 195901 195378 194935 194993 194552 192490 189357 186442 183922 181342 178997 177262 175462
56729 175462 172926 170344 168643 167444 166094 165199 165557 166504 166905 166887 167067 167034 166212 165262 164968 164713 163741 162949
56711 162949 163579 165035 165783 165630 165406 165215 164783 164688 165419 166013 165404 164367 164348 165137 165529 165503 165923 166780 167481
56692 167481 168121 168815 168642 167086 165567 165671 166725 167044 166582 166356 166208 165408 164606 164867 165466 164990 164043 164535
$$ packed form
56794G24049o4294n5292m5495l6639l0066k4171j6547p862o21N167J1905K0375
56782D80509K9069L7158M4549M8748M5316L2671J3981o130k4394l8338m6171m8399
56770E68569m7376m4557m0050l4801l0668k7884k4908k1138j7529j4358j0954
56759B54346p878o743p331p451o162m716l909l032j960j709k225k082j004l73
56745A97771o77p87k78j28n23m43N8m41k062l133k915k520k580k345j735j800
56729A75462k536k582j701j199j350q95L58R47M01j8J80l3q22r50k94k55r72p92
56711A62949O30J456P48j53k24j91m32r5P31N94o09j037j9P89L92k6M20Q57P01
56692A67481O40O94j73j556j519J04J054L19m62k26j48q00q02K61N99m76r47M92
$$ plain form
56674 164535 166657 168819 170155 170979 171167 170294 169099 168726 168827 168299 167379 167000 166685 165244 162994 161139
56658 161139 159504 157141 154575 153114 152424 151192 149702 149234 149350 148428 146635 145745 146102 146357 146224 146860
56642 146860 148321 149115 148565 147421 146042 144238 142924 143485 145301 146179 145441 144342 143372 141594 138926 136717
56626 136717 135667 135242 135398 136737 138802 140307 141184 142345 143577 143955 144182 145839 148294 149199 148337 148169
56610 148169 150004 152390 153974 155286 156812 157852 158288 159234 160924 162104 162396 163143 165039 167020 168368
56595 168368 169832 171719 172844 172363 170954 169337 167294 164857 162806 161349 159885 158491 157938 158018 157696
56580 157696 157207 158000 160309 162753 164533 165990 166902 166615 166131 167528 170850 174001 176148 178655 182127
56565 182127 185284 187529 189995 193161 196052 198685 202563 207648 211539 213050 214077 216527 219772 222594
$$ packed form
56674A64535K122K162J336Q24J88q73j195l73J01n28r20l79l15j441k250j855
56658A61139j635k363k566j461o90j232j490m68J16r22j793q90L57K55j33O36
56642A46860J461P94n50j144j379j804j314N61J816Q78p38j099r70j778k668k209
56626A36717j050m25J56J339K065J505Q77J161J232L78K27J657K455R05q62j68
56610A48169J835K386J584J312J526J040M36R46J690J180K92P47J896J981J348
56595A68368J464J887J125m81j409j617k043k437k051j457j464j394n53Q0l22
56580A57696m89P93K309K444J780J457R12k87m84J397L322L151K147K507L472
56565A82127L157K245K466L166K891K633L878N085L891J511J027K450L245K822
$$ plain form
56551 222594 225269 228140 230282 231187 231900 233030 233478 232436 230767 229180 227006 224057 221666 220481 219174
56536 219174 216692 213956 211955 210080 207691 205522 204105 202617 200671 199495 199940 200992 201582 202137 202979
56521 202979 202986 201327 198977 197095 195311 192876 190040 187141 183798 180059 176878 174535 172122 169379 167317
56506 167317 166275 165279 164128 164012 165171 166129 166286 166951 168663 169781 169156 167933 167261 166395 164662 163212
56490 163212 163101 163534 163615 164084 165779 168117 170435 173058 175837 177583 178235 179578 182508 185686 188076 190536
56474 190536 193620 196273 198276 201401 206323 210924 213570 215643 218725 221734 223263 224575 227664 232162
56460 232162 236545 240735 245192 249022 251266 252615 253870 254251 253137 251781 251342 250880 249268 247342 246176
56445 246176 245055 243208 241797 241956 242516 241798 240121 238552 236887 234879 233718 234165 234912 234776 234723 235647
$$ packed form
56551B22594K675K871K142R05P13J130M48j042j669j587k174k949k391j185j307
56536B19174k482k736k001j875k389k169j417j488j946j176M45J052N90N55Q42
56521B02979Pj659k350j882j784k435k836k899l343l739l181k343k413k743k062
56506A67317j042r96j151j16J159R58J57O65J712J118o25j223o72q66j733j450
56490A63212j11M33Q1M69J695K338K318K623K779J746O52J343K930L178K390K460
56474A90536L084K653K003L125M922M601K646K073L082L009J529J312L089M498
56460B32162M383M190M457L830K244J349J255L81j114j356m39m62j612j926j166
56445B46176j121j847j411J59N60p18j677j569j665k008j161M47P47j36n3R24
$$ plain form
56429 235647 236151 234821 232834 231972 231836 231348 231113 231809 232067 230503 228185 226585 224859 221710 218196 215938
56413 215938 214237 211715 209193 208078 207381 205251 202196 199953 198415 196470 194638 194087 194139 193487 192771 193314
56397 193314 194436 194628 194338 195013 196514 198026 200238 203965 207749 209572 209933 210673 211941 212904 214201 216907
56381 216907 220120 222313 224043 226707 229725 231653 232984 235137 237679 239268 240366 242384 245135 247691
56367 247691 250653 254980 259700 263337 266384 269844 272782 274047 274956 277331 280241 281700 282145 283155 284138
56352 284138 283642 282700 283438 285387 286579 287283 289280 292347 294845 296981 300101 303530 305508 306606 308846
56337 308846 312108 314704 316861 320372 325310 330319 335571 342290 350019 357425 365071 374225 383797 391827
56323 391827 399172 408261 418914 428929 438087 447976 458373 467450 475136 482706 489449 493345 494749
$$ packed form
56429B35647N04j330j987q62j36m88k35O96K58j564k318j600j726l149l514k258
56413B15938j701k522k522j115o97k130l055k243j538j945j832n51N2o52p16N43
56397A93314J122J92k90O75J501J512K212L727L784J823L61P40J268R63J297K706
56381B16907L213K193J730K664L018J928J331K153K542J589J098K018K751K556
56367B47691K962M327M720L637L047L460K938J265R09K375K910J459M45J010R83
56352B84138m96r42P38J949J192P04J997L067K498K136L120L429J978J098K240
56337C08846L262K596K157L511M938N009N252O719P729P406P646R154R572Q030
56323C91827P345R089J0653J0015R158R889J0397R077P686P570O743L896J404
$$ plain form
56310 494749 495922 497246 497274 496093 495078 493708 490305 485716 482666 481534 480234 478115 476553 475844 474969
56295 474969 474404 475871 479386 483643 488957 496624 505859 514714 523565 534300 546711 559204 572434
56282 572434 588507 607095 626096 645699 667969 692946 719036 746819 778455 813724 850675
56271 850675 889950 934426 984879 1040027 1100538 1168915 1245693 1329923 1423037 1527965 1644818
56260 1644818 1771940 1910812 2065076 2234685 2415837 2606791 2808785 3020712 3237607
56251 3237607 3454989 3669982 3877527 4070139 4242387 4391515 4513307 4602106 4655915 4677326
56241 4677326 4668846 4631575 4568913 4486927 4390181 4281237 4164381 4045122 3925402 3803925
56231 3803925 3681595 3561803 3444903 3327623 3208762 3090388 2972552 2852182 2728574
$$ packed form
56310D94749J173J324K8j181j015j370l403m589l050j132j300k119j562p09q75
56295D74969n65J467L515M257N314P667R235Q855Q851J0735J2411J2493J3230
56282E72434J6073J8588J9001J9603K2270K4977K6090K7783L1636L5269L6951
56271H50675L9275M4476N0453N5148O0511O8377P6778Q4230R3114J04928J16853
56260A644818J27122J38872J54264J69609J81152J90954K01994K11927K16895
56251C237607K17382K14993K07545J92612J72248J49128J21792Q8799N3809K1411
56241D677326q480l7271o2662q1986r6746j08944j16856j19259j19720j21477
56231C803925j22330j19792j16900j17280j18861j18374j17836j20370j23608
$$ plain form
56222 2728574 2604931 2483026 2361211 2239167 2119780 2004752 1892994 1784723 1682547
56213 1682547 1587076 1496052 1409174 1329225 1257201 1190960 1129786 1075434 1027509 982884 941017
56202 941017 904829 874909 847898 821975 798751 778321 757928 737284 719864 706893 695218
56191 695218 683063 672725 665602 659658 653870 650142 648860 647606 646177 647671 652719 657906 661847 667414
56177 667414 676029 685350 694714 707003 722657 737618 749889 762501 777218 790957 801425 810854
56165 810854 821065 829963 835852 840158 843164 842330 837529 832739 829916 826540 821634 818458 818640 819588 820576
56150 820576 825332 835502 847610 859775 875374 896738 921345 947919 980308 1021600 1070333 1126311
56138 1126311 1194245 1277761 1375443 1486237 1612361 1752597 1898405 2040606 2174463 2295335
$$ packed form
56222B728574j23643j21905j21815j22044j19387j15028j11758j08271j02176
56213A682547r5471r1024q6878p9949p2024o6241o1174n4352m7925m4625m1867
56202I41017l6188k9920k7011k5923k3224k0430k0393k0644j7420j2971j1675
56191F95218j2155j0338p123n944n788l728j282j254j429J494N048N187L941N567
56177F67414Q615R321R364J2289J5654J4961J2271J2612J4717J3739J0468R429
56165H10854J0211Q898N889M306L006q34m801m790k823l376m906l176J82R48R88
56150H20576M756J0170J2108J2165J5599K1364K4607K6574L2389M1292M8733N5978
56138A126311O7934Q3516R7682J10794J26124J40236J45808J42201J33857J20872
$$ plain form
56128 2295335 2396773 2477901 2546613 2610732 2671228 2727073 2779256 2825237 2856615 2868137 2863573
56117 2863573 2848563 2824294 2792591 2759317 2726210 2685425 2628073 2552777 2461338 2353235 2230711
56106 2230711 2103026 1979256 1861960 1752612 1656500 1576451 1508157 1447607 1396865 1356983
56096 1356983 1322266 1287972 1256984 1232393 1210168 1185909 1162339 1143203 1126035 1107754 1091150
56085 1091150 1079130 1068771 1057616 1049253 1046044 1043190 1036964 1031765 1031922 1033708 1032987 1033523 1039753 1048320
56071 1048320 1054780 1061804 1072743 1084073 1092359 1101604 1115495 1129625 1139732 1150202 1165747 1182333
56059 1182333 1195279 1208580 1226816 1245650 1260040 1274154 1293151 1312934 1328318 1343579 1364248
56048 1364248 1386173 1403633 1420724 1443540 1468566 1490060 1511367 1537482 1564124 1586048 1608483
$$ packed form
56128B295335J01438Q1128O8712O4119O0496N5845N2183M5981L1378J1522m564
56117B863573j5010k4269l1703l3274l3107m0785n7352p5296r1439j08103j22524
56106B230711j27685j23770j17296j09348r6112q0049o8294o0550n0742l9882
56096A356983l4717l4294l0988k4591k2225k4259k3570j9136j7168j8281j6604
56085A091150j2020j0359j1155q363l209k854o226n199J57J786p21N36O230Q567
56071A048320O460P024J0939J1330Q286R245J3891J4130J0107J0470J5545J6586
56059A182333J2946J3301J8236J8834J4390J4114J8997J9783J5384J5261K0669
56048A364248K1925J7460J7091K2816K5026K1494K1307K6115K6642K1924K2435
$$ plain form
56037 1608483 1638278 1671290 1700686 1729876 1764848 1801795 1835276 1870475 1914061 1960997 2003956
56026 2003956 2047520 2099087 2154141 2204989 2255567 2312689 2371269 2423758 2475740 2536274 2601076
56015 2601076 2661433 2721190 2788382 2858803 2924920 2992275 3069640 3151920 3230560 3311393 3403806
56004 3403806 3502120 3596915 3694589 3805614 3923995 4039375 4158754 4294218 4440087 4585168
55994 4585168 4736395 4906212 5088028 5269471 5458366 5669049 5894836 6121966 6358826
55985 6358826 6622153 6906502 7198070 7506241 7849149 8220788 8606549 9018299 9478287
55976 9478287 9982021 10515102 11092627 11741542 12458995 13231524 14080186 15040872 16117068
55967 16117068 17302581 18633882 20166441 21919195 23902820 26183899 28858250 31987039
$$ packed form
56037A608483K9795L3012K9396K9190L4972L6947L3481L5199M3586M6936M2959
56026B003956M3564N1567N5054N0848N0578N7122N8580N2489N1982O0534O4802
56015B601076O0357N9757O7192P0421O6117O7355P7365Q2280P8640Q0833R2413
56004C403806R8314R4795R7674J11025J18381J15380J19379J35464J45869J45081
55994D585168J51227J69817J81816J81443J88895K10683K25787K27130K36860
55985F358826K63327K84349K91568L08171L42908L71639L85761M11750M59988
55976I478287N03734N33081N77525O48915P17453P72529Q48662R60686J076196
55967A6117068J185513J331301J532559J752754J983625K281079K674351L128789
$$ plain form
55959 31987039 35635697 39952410 45125590 51293648 58598222 67307058 77792015 90447093
55951 90447093 105783274 124568417 147708741 176047510 210417045 251445529 298213129
55944 298213129 346341367 387868667 414282862 420762887 408109780 381163124 345779404
55937 345779404 306882529 268034786 231566522 198717409 169914840 145158121 124224781
55930 124224781 106697187 92051656 79818196 69617420 61087016 53882977 47755584
55923 47755584 42543613 38092771 34244187 30891985 27980563 25442653 23195290 21191511
55915 21191511 19419271 17849375 16433249 15149116 14002220 12979601 12047760 11193657
55907 11193657 10426455 9738947 9105769 8519344 7990951 7516231 7074118 6659718 6285217
$$ packed form
55959C1987039L648658M316713N173180O168058P304574Q708836J0484957J2655078
55951I0447093J5336181J8785143K3140324K8338769L4369535M1028484M6767600
55944B98213129M8128238M1527300K6414195O480025j2653107k6946656l5383720
55937C45779404l8896875l8847743l6468264l2849113k8802569k4756719k0933340
55930A24224781j7527594j4645531j2233460j0200776q530404p204039o127393
55923D7755584n211971m450842l848584l352202k911422k537910k247363k003779
55915B1191511j772240j569896j416126j284133j146896j022619r31841q54103
55907A1193657p67202o87508o33178n86425n28393m74720m42113m14400l74501
$$ plain form
55898 6285217 5948103 5630113 5327903 5054518 4809758 4577922 4355580 4153923 3972684
55889 3972684 3798342 3629272 3477111 3341951 3210670 3081085 2964108 2860630 2759172
55880 2759172 2657932 2567090 2487573 2408865 2329441 2258784 2197510 2135469 2071254 2014204 1965526
55869 1965526 1916296 1865671 1822322 1786053 1746291 1700908 1658998 1623190 1586560 1548993 1519355
55858 1519355 1498911 1479156 1458666 1446049 1443521 1442813 1439618 1436819 1431240 1412893 1380684 1344593
55846 1344593 1309601 1271478 1230669 1195592 1168839 1143900 1118764 1099404 1086649 1072850 1054990
55835 1054990 1038428 1024476 1006834 983772 961655 942954 922536 899135 878795 863449 847380
55824 847380 828489 812100 800194 787534 771746 756905 744103 728912 711179 696977 687768 677827
$$ packed form
55898F285217l37114l17990l02210k73385k44760k31836k22342k01657j81239
55889C972684j74342j69070j52161j35160j31281j29585j16977j03478j01458
55880B759172j01240r0842p9517p8708p9424p0657o1274o2041o4215n7050m8678
55869A965526m9230n0625m3349l6269l9762m5383m1910l5808l6630l7567k9638
55858A519355k0444j9755k0490j2617k528p08l195k799n579j8347l2209l6091
55846A344593l4992l8123m0809l5077k6753k4939k5136j9360j2755j3799j7860
55835A054990j6562j3952j7642k3062k2117j8701k0418k3401k0340j5346j6069
55824H47380j8891j6389j1906j2660j5788j4841j2802j5191j7733j4202r209r941
$$ plain form
55812 677827 665315 655640 650815 645852 639082 635798 637999 640331 639949 640893 644989 647755 647197 647629 650921
55797 650921 652516 649750 645593 640803 631106 615787 600659 588865 576875 562939 551052 542916 534295
55784 534295 523205 513818 508491 503737 497944 495248 497663 500509 499516 495678 489830 479637 465405 451780
55770 451780 440276 427051 411159 397671 389408 383023 376645 373684 375057 375064 369514 361310 353932 346030
55756 346030 336571 328749 324352 320208 314143 308578 304614 298906 290236 282916 279586 276695 271177 265485
55742 265485 261899 257871 251538 246176 244536 243983 241628 239312 239294 239841 239259 239603 242404 245199 245902 246090
55726 246090 246562 244490 238539 231975 227138 221711 214016 207093 203642 201549 198228 194949 193222 191363
55712 191363 188336 186699 188190 190559 192082 194825 200191 205803 210161 215832 224493 233318 239652 244767
$$ packed form
55812F77827j2512r675m825m963o770l284K201K332l82R44M096K766n58M32L292
55797F50921J595k766m157m790r697j5319j5128j1794j1990j3936j1887q136q621
55784E34295j1090r387n327m754n793k696K415K846r93l838n848j0193j4232j3625
55770D51780j1504j3225j5892j3488q263o385o378k961J373Pn550q204p378p902
55756C46030r459p822m397m144o065n565l964n708q670p320l330k891n518n692
55742B65485l586m028o333n362j640n53k355k316j8N47n82L44K801K795P03J88
55726B46090M72k072n951o564m837n427p695o923l451k093l321l279j727j859
55712A91363l027j637J491K369J523K743N366N612M358N671Q661Q825O334N115
$$ plain form
55698 244767 249561 251361 248784 245215 243593 242158 239089 236767 237401 238774 238556 238649 241079 243562 243418
55683 243418 242124 241862 241260 238715 236400 236815 238636 239809 241403 244586 247198 247157 246089 245983 245547 243505
55667 243505 242037 243217 245298 246131 246980 249370 251547 251810 252065 254417 257473 259518 261970 266000 269197
55652 269197 269431 268775 269748 270917 269943 267685 265439 261419 254013 245395 238002 230521 221282 212362 206146
55637 206146 201000 194524 188050 183620 179546 173461 166955 162614 159073 153630 147386 143178 140553 137202
55623 137202 133389 130630 127912 123526 118905 116585 115981 114953 113706 113466 113256 111724 110183 110174 110067 107877
55607 107877 105148 104161 103522 100696 96846 94872 94497 93561 92346 92316 92223 89933 86793 85864 86976 87587 87388
55590 87388 87961 88961 88627 87284 86593 86206 84683 82724 82014 81876 80520 78510 77590 77244 75885 74264
$$ packed form
55698B44767M794J800k577l569j622j435l069k322O34J373k18R3K430K483j44
55683B43418j294k62o02k545k315M15J821J173J594L183K612m1j068j06m36k042
55667B43505j468J180K081Q33Q49K390K177K63K55K352L056K045K452M030L197
55652B69197K34o56R73J169r74k258k246m020p406q618p393p481r239q920o216
55637B06146n146o476o474m430m074o085o506m341l541n443o244m208k625l351
55623A37202l813k759k718m386m621k320o04j028j247k40k10j532j541rj07k190
55607A07877k729r87o39k826l850j974l75r36j215l0r3k290l140r29J112O11j99
55590H7388N73J000l34j343o91l87j523j959p10j38j356k010r20l46j359j621
$$ plain form
55574 74264 74156 74753 73947 72180 71579 72217 72643 73146 75090 77897 79862 81066 82439 83115 81883 80117
55558 80117 80032 81167 81658 81670 82325 82674 81209 79097 78458 78594 77452 75633 75345 76452 77092 77251 78232 79535
55540 79535 79757 79704 81177 83620 85291 86656 89194 92018 93297 93985 96375 99926 102249 103295 104784
55525 104784 106360 106304 105450 106386 109112 111183 111795 112166 112337 111345 110129 110566 111826 111251 108576 105794 103278
55508 103278 99668 95314 92080 89916 87154 84012 82214 81337 79218 75882 73354 71703 69050 65550
55494 65550 63435 62819 61356 58615 57042 57743 58788 58601 57844 57010 55157 52008 48741 45982 43354 41315
55478 41315 40836 41084 40085 37911 36540 36453 36096 34881 33881 33374 32453 31313 31201 31908 31979 31468 31727 32490
55460 32490 32039 30382 29332 29252 28620 27075 25975 25645 24915 23766 23661 24922 26297 27318 28520 29381
$$ packed form
55574G4264j08N97q06j767o01O38M26N03J944K807J965J204J373O76j232j766
55558H0117q5J135M91J2O55L49j465k112o39J36j142j819k88J107O40J59R81J303
55540G9535K22n3J473K443J671J365K538K824J279O88K390L551K323J046J489
55525A04784J576n6q54R36K726K071O12L71J71r92j216M37J260n75k675k782k516
55508A03278l610m354l234k164k762l142j798q77k119l336k528j651k653l500
55494F5550k115o16j463k741j573P01J045j87p57q34j853l149l267k759k628k039
55478D1315m79K48r99k174j371q7l57j215j000n07r21j140j12P07P1n11K59P63
55460C2490m51j657j050q0o32j545j100l30p30j149j05J261J375J021J202Q61
$$ plain form
55444 29381 28858 27958 28877 31478 33484 34146 34741 35512 35328 34517 34780 35971 36138 35037 34430 34581 33897 32478
55426 32478 32537 34558 36331 36650 36795 37509 37693 37062 37013 37748 37521 35805 34391 34315 34415 33873 33467 33463 33033
55407 33033 32581 33809 36587 38599 38941 39166 39925 39711 38115 37197 38172 39482 39590 39079 38662 37737 36279
55390 36279 35705 36530 37502 38096 39337 41065 41163 38835 36030 34270 32626 30251 28253 27480 26841 25490
55374 25490 24400 24315 24333 23914 24023 24892 24973 23561 22207 22058 22138 21728 22055 23879 25690 26181 26498 28156
55356 28156 30510 32058 32613 32610 31929 30882 30669 31429 31501 30010 28490 28587 29781 30718 31128 31186 30690 30093 30593
55337 30593 31991 32189 30107 27333 25757 25363 25520 26465 28145 29401 29714 30068 30927 31157 30131 28991
55321 28991 28603 28252 27584 27762 29244 30509 30524 30475 31367 31954 30901 29175 28357 28178 27612 26987 27177 27983
$$ packed form
55444B9381n23r00R19K601K006O62N95P71j84q11K63J191J67j101o07J51o84j419
55426C2478N9K021J773L19J45P14J84o31m9P35k27j716j414p6J00n42m06mm30
55407C3033m52J228K778K012L42K25P59k14j596r18R75J310J08n11m17r25j458
55390C6279n74Q25R72N94J241J728R8k328k805j760j644k375j998p73o39j351
55374B5490j090q5J8m19J09Q69Q1j412j354j49Q0m10L27J824J811M91L17J658
55356B8156K354J548N55lo81j047k13P60P2j491j520R7J194R37M10N8m96n97N00
55337C0593J398J98k082k774j576l94J57R45J680J256L13L54Q59K30j026j140
55321B8991l88l51o68J78J482J265J5m9Q92N87j053j726q18j79n66o25J90Q06
$$ plain form
55303 27983 28939 30486 32763 34479 34406 32889 30716 27939 24992 23319 23452 23932 23486 22747 22548 22177 20901
55286 20901 19656 19559 20133 20498 21014 22214 23419 23931 24409 25675 27283 28472 29333 29955 29813 29088 29055 29993
55268 29993 30330 29064 27447 27004 27528 28278 29416 30790 31093 29822 28526 28520 28923 28405 27256 26181 24735
55251 24735 22657 21187 21315 22170 22781 23901 26337 29015 30535 31298 32272 33014 32722 31965 31597 31149 29967
55234 29967 28716 28071 27253 25538 23922 23539 23716 23390 23173 24100 25527 26145 26094 26373 27119 28118 29883 32566
55216 32566 34877 35726 35892 36616 37697 38490 39487 41234 42927 43656 43783 43650 42484 40266 39008 40163
55200 40163 42238 43033 42743 42720 42645 41393 39497 38298 37609 36572 35900 36935 39205 41105 42280 43252 43585
55183 43585 42685 41588 41641 42037 40941 38553 36824 36603 37184 38229 39941 41561 41724 40274 38145 35784
$$ packed form
55303B7983R56J547K277J716p3j517k173k777k947j673J33M80m46p39j99l71j276
55286B0901j245r7N74L65N16J200J205N12M78J266J608J189Q61O22j42p25l3R38
55268B9993L37j266j617m43N24P50J138J374L03j271j296oM03n18j149j075j446
55251B4735k078j470J28Q55O11J120K436K678J520P63R74P42k92p57l68m48j182
55234B9967j251o45q18j715j616l83J77l26k17R27J427O18n1K79P46R99J765K683
55216C2566K311Q49J66P24J081P93R97J747J693P29J27j33j166k218j258J155
55200D0163K075P95k90k3p5j252j896j199o89j037o72J035K270J900J175R72L33
55183D3585r00j097N3L96j096k388j729k21N81J045J712J620J63j450k129k361
$$ plain form
55167 35784 33234 31175 30248 29908 29445 29352 30119 30699 30020 29029 29197 29981 29909 29317 29618 30542 30533 29403 28245
55148 28245 27161 25479 23905 23994 25512 26604 26633 26661 27065 26905 25918 25143 25109 25095 24530 23660 22688 21630 21083
55129 21083 21776 23388 25054 26801 29190 31940 34273 36216 38160 39633 40033 40059 40844 42136 42910 43187
55113 43187 43655 44099 43966 43804 44342 44802 44074 42940 43071 44292 44995 44823 44804 45154 45172 45082 45815 47095 47884
55094 47884 48532 50271 52632 53811 53711 54303 56606 59428 61587 63288 64795 65615 65671 65735 66179 66673 67311
55077 67311 68608 70212 71125 71237 71180 70701 68877 65986 63490 62108 61512 61793 63313 65092 65359 64050
55061 64050 62972 63122 63515 62951 61363 59124 56620 54750 54322 54732 54709 54375 54929 56343 57269 57346 57708 58860
55043 58860 59913 60314 60566 60792 60312 59146 58306 58105 57724 56874 56338 56396 56213 55302 54200 53311 52441 51832
$$ packed form
55167C5784k550k059r27l40m63r3P67N80o79r91J68P84p2n92L01R24rj130j158
55148B8245j084j682j574Q9J518J092K9K8M04j60r87p75l4j4n65q70r72j058n47
55129B1083O93J612J666J747K389K750K333J943J944J473M00K6P85J292P74K77
55113D3187M68M44j33j62N38M60p28j134J31J221P03j72j9L50J8r0P33J280P89
55094D7884O48J739K361J179j00N92K303K822K159J701J507Q20N6O4M44M94O38
55077F7311J297J604R13J12n7m79j824k891k496j382n96K81J520J779K67j309
55061F4050j078J50L93n64j588k239k504j870m28M10k3l34N54J414R26P7L62J152
55043E8860J053M01K52K26m80j166q40k01l81q50n36N8j83r11j102q89q70o09
$$ plain form
55025 51832 52241 53625 55042 56127 57398 58965 60276 61227 62187 62927 63025 63178 64431 66182 66753 65993 65408
55008 65408 65600 65624 65131 65064 65709 66040 65594 65160 65061 64559 63565 63111 63483 63610 62931 62138 61515 60412 59038
54989 59038 58829 60160 61513 61895 62303 63764 65643 67083 68584 70809 73092 74413 74864 75117 75301 75262
54973 75262 75068 74561 73369 71907 71272 71653 71971 71673 71710 73073 75505 78321 81455 85100 89249 94079
54957 94079 99896 106418 113139 120509 129537 140144 151316 163066 176632 192360 208892 224786 239370
54944 239370 251585 259687 262803 261448 256107 246811 234428 220688 206373 191143 175527 161282
54932 161282 149173 138280 128115 119501 112630 106289 100074 95362 92916 91313 89043 86514 84666
54919 84666 83302 82205 82408 84795 88582 92534 96552 100970 105646 110979 118465 128847 140893 153317
$$ packed form
55025E1832M09J384J417J085J271J567J311R51R60P40R8J53J253J751N71p60n85
55008F5408J92K4m93o7O45L31m46m34r9n02r94m54L72J27o79p93o23j103j374
54989E9038k09J331J353L82M08J461J879J440J501K225K283J321M51K53J84l9
54973G5262j94n07j192j462o35L81L18k98L7J363K432K816L134L645M149M830
54957I4079N817O522O721P370R028J0607J1172J1750J3566J5728J6532J5894J4584
54944B39370J2215Q102L116j355n341r296j2383j3740j4315j5230j5616j4245
54932A61282j2109j0893j0165q614o871o341o215m712k446j603k270k529j848
54919H4666j364j097K03K387L787L952M018M418M676N333P486J0382J2046J2424
$$ plain form
54905 153317 166716 182123 198712 214379 227711 237985 244061 244864 240567 232270 220929 207360
54893 207360 192646 177657 162743 148394 135459 124224 114228 105359 98055 92050 86427 81408 78459
54880 78459 77793 77460 75947 74079 73154 72755 71897 70936 70814 71418 72082 72794 73632 73937 73254 72144 71015 69203
54862 69203 66358 63631 62257 61957 61877 62027 62562 62716 61776 60210 58647 56755 54284 52192 51355 51130 50440
54845 50440 49355 48467 47690 46898 46657 47082 47091 46163 45636 46750 48509 49148 48732 48592 49083 49680 50543 52141
54827 52141 53844 54622 54809 55596 57140 58603 59701 60853 62132 63348 64754 66446 67585 67460 66818 66911
54811 66911 67828 68999 70637 73241 76256 78780 81131 84329 88431 92847 97825 104180 111885 120424 130196
54796 130196 142120 156062 170995 186471 202488 218149 231889 242909 251063 255496 254932 249466
$$ packed form
54905A53317J3399J5407J6589J5667J3332J0274O076Q03m297q297j1341j3569
54893B07360j4714j4989j4914j4349j2935j1235r996q869p304o005n623n019k949
54880G8459o66l33j513j868r25l99q58r61j22O04O64P12Q38L05o83j110j129j812
54862F9203k845k727j374l00q0J50N35J54r40j566j563j892k471k092q37k25o90
54845E0440j085q88p77p92k41M25Rr28n27J114J759O39m16j40M91N97Q63J598
54827E2141J703P78J87P87J544J463J098J152J279J216J406J692J139j25o42R3
54811F6911R17J171J638K604L015K524K351L198M102M416M978O355P705Q539R772
54796A30196J1924J3942J4933J5476J6017J5661J3740J1020Q154M433n64n466
$$ plain form
54784 249466 240852 230832 220161 209198 198320 187616 177108 167356 159098 152351 146580 141520 137197
54771 137197 133495 130465 128622 128109 128053 127624 127242 127813 129338 131286 133787 137355 141896 147134 153613 162118
54755 162118 172485 184042 196927 211871 228976 247722 267772 288700 309182 327441 342203
54744 342203 352504 357212 355830 349261 338768 324700 307284 287928 268468 249658 231613 215049
54732 215049 200656 187834 175654 164642 155968 149098 142007 133798 125673 119128 114477 111297 109059
54719 109059 107063 104697 102056 99563 97159 94623 92366 90945 90049 88911 87498 86390 85834 85794 86493
54704 86493 87871 88994 89114 88833 89136 89863 90360 90972 92341 93723 93682 92261 90935 90516 90601 90932 91716 92574
54686 92574 92708 92273 92245 92858 93442 93903 94943 96667 98276 99341 100271 101330 102297 103253 104604 106261 107829
$$ packed form
54784B49466q614j0020j0671j0963j0878j0704j0508r752q258o747n771n060m323
54771A37197l702l030j843n13n6m29l82N71J525J948K501L568M541N238O479Q505
54755A62118J0367J1557J2885J4944J7105J8746K0050K0928K0482J8259J4762
54744C42203J0301M708j382o569j0493j4068j7416j9356j9460j8810j8045j6564
54732B15049j4393j2822j2180j1012q674o870p091q209q125o545m651l180k238
54719A09059j996k366k641k493k404k536k257j421q96j138j413j108n56m0O99
54704H6493J378J123J20k81L03P27M97O12J369J382m1j421j326m19Q5L31P84Q58
54686I2574J34m35k8O13N84M61J040J724J609J065R30J059R67R56J351J657J568
$$ plain form
54669 107829 109627 112432 116204 120126 123845 127554 130997 133605 135617 137816 140223 142306 144385 147460
54655 147460 151508 155307 158077 160167 161987 163549 165224 167749 171278 175484 180624 187309 195245 203484
54641 203484 212026 221881 233448 246168 259820 274680 290058 304101 315479 324046 329533 330920
54629 330920 327656 320358 309841 296509 281088 264832 248565 232482 217190 203902 193127 184147
54617 184147 176074 168584 161464 154580 148585 144555 142512 141245 139840 138466 137443 136615 135951 135686 135618
54602 135618 135206 134557 134244 133984 132664 129957 126774 123808 120849 117842 115404 113765 112274 110448 108466
54587 108466 106310 103466 99928 96452 93410 90364 87099 84048 81409 78955 76946 75992 75659 74606 72551
54572 72551 70748 69956 69389 68395 67748 68240 69301 70117 70998 72448 73815 74176 73910 74173 75209 76240 76680
$$ packed form
54669A07829J798K805L772L922L719L709L443K608K012K199K407K083K079L075
54655A47460M048L799K770K090J820J562J675K525L529M206N140O685P936Q239
54641B03484Q542R855J1567J2720J3652J4860J5378J4043J1378Q567N487J387
54629C30920l264p298j0517j3332j5421j6256j6267j6083j5292j3288j0775q980
54617A84147q073p490p120o884n995m030k043j267j405j374j023q28o64k65o8
54602A35618m12o49l13k60j320k707l183k966k959l007k438j639j491j826j982
54587A08466k156k844l538l476l042l046l265l051k639k454k009r54l33j053k055
54572G2551j803p92n67r94o47M92J061Q16Q81J450J367L61k66K63J036J031M40
$$ plain form
54555 76680 76568 76090 75496 75311 75912 76979 77857 78311 78601 79032 79778 80860 82069 83189 84413 86107 88150
54538 88150 90041 91864 94509 98669 104074 109929 115623 120929 126014 131419 137561 144165 150619 156750
54524 156750 162701 168168 172383 174742 174835 172236 167127 160857 154830 149030 142636 135809 129557 124067 118599
54509 118599 113111 108490 104933 101540 97899 94691 92332 90344 88513 87339 86818 86077 84849 84016 84018 83968
54493 83968 83093 81922 81268 81099 81234 82101 83945 86072 87665 88619 89049 88903 88643 89321 91288 93689 95826
54476 95826 98015 100430 102225 102711 102503 102539 102744 102551 102046 101707 101564 101413 101396 101655 101875 101694 101129 100284 99203
54457 99203 98296 98088 98286 97929 96818 95816 95364 94800 93603 92238 91130 89974 88666 87818 87586 87145 86131
54440 86131 85456 85761 86156 85598 84494 83758 83153 81833 79915 78249 77116 76233 75677 75797 76501 77416 78423
$$ packed form
54555G6680j12m78n94j85O01J067Q78M54K90M31P46J082J209J120J224J694K043
54538H8150J891J823K645M160N405N855N694N306N085N405O142O604O454O131
54524A56750N951N467M215K359R3k599n109o270o027n800o394o827o252n490n468
54509A18599n488m621l557l393l641l208k359j988j831j174n21p41j228q33Kn0
54493H3968q75j171o54j69J35Q67J844K127J593R54M30j46k60O78J967K401K137
54476I5826K189K415J795M86k08L6K05j93n05l39j43j51j7K59K20j81n65q45j081
54457I9203r07k08J98l57j111j002m52n64j197j365j108j156j308q48k32m41j014
54440H6131o75L05L95n58j104p36o05j320j918j666j133q83n56J20P04R15J007
$$ plain form
54423 78423 79375 79785 79491 79201 79696 80918 82374 83884 85409 86726 87854 89241 91017 92762 94385 96356
54407 96356 98566 100021 100367 100733 102170 104276 106296 108619 111968 115864 119146 121574 123892 126711 130211
54392 130211 134394 138660 141566 141960 140179 137517 134965 132954 131610 130478 128632 125841 123060 121088
54378 121088 119468 117425 115093 112896 110563 107787 105177 103498 102481 101388 100245 99494 98917 97943 96702
54363 96702 95893 95868 96486 97442 98159 97999 97231 97040 97876 98652 98426 97907 98263 99395 100564 101867 103720 105583
54345 105583 106699 107638 109683 112955 116416 119471 122377 125267 127905 130232 132174 133245 133259 133016 133213
54330 133213 133179 131834 129424 127064 124927 122293 119113 116141 113515 110517 106802 102742 98568 94226 90150
54315 90150 87086 85054 83343 81550 79770 77939 75891 73945 72523 71315 69759 68137 67213 66920 66475
$$ packed form
54423G8423R52M10k94k90M95J222J456J510J525J317J128J387J776J745J623J971
54407I6356K210J455L46L66J437K106K020K323L349L896L282K428K318K819L500
54392A30211M183M266K906L94j781k662k552k011j344j132j846k791k781j972
54378A21088j620k043k332k197k333k776k610j679j017j093j143p51n77r74j241
54363I6702q09k5O18R56P17j60p68j91Q36P76k26n19L56J132J169J303J853J863
54345A05583J116R39K045L272L461L055K906K890K638K327J942J071J4k43J97
54330A33213l4j345k410k360k137k634l180k972k626k998l715m060m174m342m076
54315I0150l064k032j711j793j780j831k048j946j422j208j556j622r24k93m45
$$ plain form
54300 66475 65735 65302 65282 64976 63991 62779 61871 61322 61002 60770 60388 59879 59792 60427 61096 60957 60365 60491 61717
54281 61717 63245 64114 63853 62424 60497 59541 60587 62945 64962 65878 66095 65995 65696 65757 66810 68391 69294
54264 69294 69343 69723 71333 73761 76175 78263 79949 80983 81312 81302 81250 80999 80202 78685 76653 74816 74058
54247 74058 74524 75383 75988 76762 78198 79571 79660 78463 77218 76855 77343 78326 79414 79937 79367 78064 76923
54230 76923 76385 76402 76953 77735 77760 76369 74413 73357 73412 73578 73317 72957 72568 71720 70449 69354 68624 67944
54212 67944 67378 67327 67626 67715 67729 68348 69570 70753 71857 73419 75190 76056 75627 74769 74187 73619 72787 72083
54194 72083 71783 71493 70875 70180 69641 69044 68272 67645 67418 67509 67846 68337 68439 67513 65789 64312 63782 64034 64612
54175 64612 65100 64992 64123 63226 63196 63810 64094 63934 64209 65214 66101 66193 65895 65909 66391 67190 68119 68688 68363 67388
$$ packed form
54300F6475p40m33k0l06r85j212r08n49l20k32l82n09q7O35O69j39n92J26J226
54281F1717J528Q69k61j429j927r56J046K358K017R16K17j00k99O1J053J581R03
54264F9294M9L80J610K428K414K088J686J034L29j0n2k51p97j517k032j837p58
54247G4058M66Q59O05P74J436J373Q9j197j245l63M88R83J088N23n70j303j141
54230G6923n38J7N51P82K5j391j956j056N5J66k61l60l89q48j271j095p30o80
54212F7944n66n1K99Q9J4O19J222J183J104J562J771Q66m29q58n82n68q32p04
54194G2083l00k90o18o95n39n97p72o27k27R1L37M91J02r26j724j477n30K52N78
54175F4612M88j08q69q97l0O14K84j60K75J005Q87R2k98J4M82P99R29N69l25r75
$$ plain form
54155 67388 66668 66702 67261 68090 69065 69619 69024 67426 65776 64615 63813 63459 63869 64533 64246 62692 60943 60026
54137 60026 59932 60323 61179 62323 63217 63655 63868 63668 62459 60439 58753 57968 57324 56040 54505 53583 53499 53987
54119 53987 54813 55608 55800 55273 54654 54601 55222 56342 57766 59095 59905 60227 60263 59760 58482 57222 57217 58478
54101 58478 59750 60348 60813 61475 61679 61012 60133 59622 59057 58009 57080 57060 57732 58326 58669 59176 60090 61238
54083 61238 62210 62484 61821 60774 60269 60490 60782 60740 60637 60643 60488 60161 60108 60446 60855 61476 62951 65172 66995
54064 66995 67657 67664 67808 68211 68717 69338 69847 69771 69294 69311 70158 71155 71788 72356 73000 73179 72817 72928 74334 76560
54044 76560 78721 80701 82736 84652 86244 87794 89525 91171 92638 94379 96625 99108 102092 106702
54030 106702 113324 120493 126333 130568 134421 139093 145072 152293 160122 167469 173569 178389 182081 184681
$$ packed form
54155F7388p20L4N59Q29R75N54n95j598j650j161q02l54M10O64k87j554j749r17
54137F0026r4L91Q56J144Q94M38K13k00j209k020j686p85o44j284j535r22q4M88
54119E3987Q26P95J92n27o19n3O21J120J424J329Q10L22L6n03j278j260nJ261
54101E8478J272N98M65O62K04o67q79n11n65j048r29k0O72N94L43N07R14J148
54083F1238R72K74o63j047n05K21K92m2j03Oj55l27n3L38M09O21J475K221J823
54064F6995O62PJ44M03N06O21N09p6m77J7Q47R97O33N68O44J79l62J11J406K226
54044G6560K161J980K035J916J592J550J731J646J467J741K246K483K984M610
54030A06702O622P169N840M235L853M672N979P221P829P347O100M820L692K600
$$ plain form
54016 184681 186620 188652 190789 192142 192325 192173 192533 193204 193666 193880 193696 192465 190033 187303 184958 182574
54000 182574 179730 176997 174837 172472 169039 165086 161744 159064 156366 153660 151438 149454 146928 143790
53986 143790 140717 138122 135918 134067 132508 130819 128720 126708 125527 125256 125449 125771 125939 125607 124925 124650
53970 124650 125027 125223 124586 123738 123565 123825 123766 123487 123598 124044 124358 124665 125379 126222 126603 126641 126825 127027 126896
53951 126896 126929 127959 129735 131125 131691 132054 132762 133777 135144 137218 140033 143173 146360 149621 152973
53936 152973 156571 160988 166569 172548 177515 180701 182274 182578 181811 180352 178622 176638 174288 172028 170722
53921 170722 170856 172396 175233 179172 183646 188046 192239 196334 200168 203571 206910 210771 215293 220254
53907 220254 225616 231463 237683 244241 251393 259055 266276 271960 275881 278448 279856 280070 279285 277777 275582
$$ packed form
54016A84681J939K032K137J353J83j52L60O71M62K14j84j231k432k730k345k384
54000A82574k844k733k160k365l433l953l342k680k698k706k222j984k526l138
53986A43790l073k595k204j851j559j689k099k012j181k71J93L22J68l32o82k75
53970A24650L77J96o37q48j73K60n9k79J11M46L14L07P14Q43L81L8J84K02j31
53951A26896L3J030J776J390N66L63P08J015J367K074K815L140L187L261L352
53936A52973L598M417N581N979M967L186J573L04p67j459j730j984k350k260j306
53921A70722J34J540K837L939M474M400M193M095L834L403L339L861M522M961
53907B20254N362N847O220O558P152P662P221N684L921K567J408K14p85j508k195
$$ plain form
53892 275582 272914 270453 268544 266512 263505 259684 255852 252245 248470 244301 239728 234432 228067 220958
53878 220958 213873 207258 201243 196016 191484 186935 181857 176839 172859 169874 166907 163378 159550 155793
53864 155793 152157 148683 145521 142706 140213 138041 135920 133269 129894 126309 122945 119628 116303 113569
53850 113569 111792 110419 108996 108137 108515 109514 110016 109929 109797 109422 108232 106660 105766 105611 105258 104385 103676
53833 103676 103594 103852 104172 104499 104388 103289 101582 100417 100273 100514 100427 99949 99299 98678 98385 98546 98777 98786 99095
53814 99095 100412 102507 104573 106374 108132 109539 110063 110108 110731 112230 114032 115890 118062 120369 122329
53799 122329 124324 127412 131780 136474 140831 145057 149284 153266 157283 162102 167607 172638 176608 180207
53785 180207 183986 187405 189890 191821 193642 194908 195089 194744 195028 196315 197925 198921 198811 197792 196602
$$ packed form
53892B75582k668k461j909k032l007l821l832l607l775m169m573n296o365p109
53878B20958p085o615o015n227m532m549n078n018l980k985k967l529l828l757
53864A55793l636l474l162k815k493k172k121k651l375l585l364l317l325k734
53850A13569j777j373j423q59L78R99N02q7j32l75j190j572q94j55l53q73p09
53833A03676q2K58L20L27j11j099j707j165j44K41q7m78o50o21k93J61K31RL09
53814I9095J317K095K066J801J758J407N24M5O23J499J802J858K172K307J960
53799A22329J995L088M368M694M357M226M227L982M017M819N505N031L970L599
53785A80207L779L419K485J931J821J266J81l45K84J287J610R96j10j019j190
$$ plain form
53770 196602 195826 195135 193610 190966 187957 185372 183157 180749 177794 174295 170504 166983 164406 163035 162501
53755 162501 162130 161253 159420 156742 153937 151590 149549 147479 145669 144629 144181 143687 143022 142575 142427 142271
53739 142271 141946 141324 139899 137396 134586 132603 131550 130716 129956 129780 130225 130807 131530 132757 134014 134185
53723 134185 133100 131800 130984 130331 129634 129462 130272 131848 133884 136082 137465 136925 134913 133389 133419 133956
53707 133956 133666 132910 133020 134499 136852 139592 142468 145109 147138 148495 149404 150393 152407 156205 161337
53692 161337 166424 170671 174430 178083 181310 183821 185845 187444 188232 188348 188910 190777 193556 196350 198924
53677 198924 201532 204210 206783 209100 210851 211686 211870 212235 213099 213904 214174 214110 213897 213259 212176 211290 210999
53660 210999 210848 210342 209702 209290 208914 208280 207556 206997 206513 206028 205662 205202 204078 202269 200550 199461 198752
$$ packed form
53770A96602p76o91j525k644l009k585k215k408k955l499l791l521k577j371n34
53755A62501l71q77j833k678k805k347k041k070j810j040m48m94o65m47j48j56
53739A42271l25o22j425k503k810j983j053q34p60j76M45N82P23J227J257J71
53723A34185j085j300q16o53o97j72Q10J576K036K198J383n40k012j524L0N37
53707A33956k90p56J10J479K353K740K876K641K029J357R09R89K014L798N132
53692A61337N087M247L759L653L227K511K024J599P88J16N62J867K779K794K574
53677A98924K608K678K573K317J751Q35J84L65Q64Q05K70o4k13o38j083q86k91
53660B10999j51n06o40m12l76o34p24n59m84m85l66m60j124j809j719j089p09
$$ plain form
53643 198752 198238 198342 199201 200077 200281 200043 199880 199837 199939 200641 202117 203705 204752 205427 206128 206739 207116 207680
53625 207680 208789 210065 210983 211588 212083 212299 212235 212511 213652 215445 217642 220617 224652 229100 233026 236224
53609 236224 239009 241580 244210 247490 251621 255999 260090 264176 268624 273135 277511 282398 288341 294670
53595 294670 300273 305053 309696 314499 319373 324574 330307 335915 340505 344258 348126 352257 355703 357696
53581 357696 358467 358734 359035 359614 360325 360677 360445 360158 360475 361284 361994 362490 363100 363716 363722 362905 361828 361104 360686
53562 360686 360041 358816 357283 356216 356219 357064 357821 357728 356691 355027 353245 352123 352287 353436 354584 355303 356065
53545 356065 357104 357876 358069 358302 359110 360111 360920 362077 364101 366351 367944 369325 371789 375682 380080
53530 380080 384125 387770 391312 395050 399410 404649 410410 416135 421864 428062 434838 441928 449385 457673
$$ packed form
53643A98752n14J04Q59Q76K04k38j63m3J02P02J476J588J047O75P01O11L77N64
53625B07680J109J276R18O05M95K16o4K76J141J793K197K975M035M448L926L198
53609B36224K785K571K630L280M131M378M091M086M448M511M376M887N943O329
53595B94670N603M780M643M803M874N201N733N608M590L753L868M131L446J993
53581C57696P71K67L01N79P11L52k32k87L17Q09P10M96O10O16Oq17j077p24m18
53562C60686o45j225j533j067LQ45P57r3j037j664j782j122J64J149J148P19P62
53545C56065J039P72J93K33Q08J001Q09J157K024K250J593J381K464L893M398
53530C80080M045L645L542L738M360N239N761N725N729O198O776P090P457Q288
$$ plain form
53516 457673 467134 477717 489130 500942 512826 525004 538061 552034 566212 580293 595026 611139
53504 611139 628272 645795 664060 683888 705274 727555 750520 774401 799072 824189 849986
53493 849986 876995 905039 933326 961443 989532 1017531 1045010 1071701 1097609 1122774 1147497
53482 1147497 1172505 1198179 1223856 1248630 1272640 1296837 1321775 1347376 1373577 1400258 1426664
53471 1426664 1451820 1475497 1498144 1520092 1541520 1562818 1583965 1603793 1620945 1635502 1648725
53460 1648725 1661294 1672801 1682871 1691599 1698740 1703593 1705920 1706051 1703892 1698827 1690871 1680894 1669363
53447 1669363 1655804 1639977 1622702 1604938 1586713 1567451 1546819 1524778 1501381 1476959 1452104
53436 1452104 1427095 1401714 1375843 1349762 1323670 1297456 1271307 1245974 1222072 1199507 1178043
$$ packed form
53516D57673R461J0583J1413J1812J1884J2178J3057J3973J4178J4081J4733J6113
53504F11139J7133J7523J8265J9828K1386K2281K2965K3881K4671K5117K5797
53493H49986K7009K8044K8287K8117K8089K7999K7479K6691K5908K5165K4723
53482A147497K5008K5674K5677K4774K4010K4197K4938K5601K6201K6681K6406
53471A426664K5156K3677K2647K1948K1428K1298K1147J9828J7152J4557J3223
53460A648725J2569J1507J0070Q728P141M853K327J31k159n065p956r977j1531
53447A669363j3559j5827j7275j7764j8225j9262k0632k2041k3397k4422k4855
53436A452104k5009k5381k5871k6081k6092k6214k6149k5333k3902k2565k1464
$$ plain form
53425 1178043 1158068 1140406 1125552 1113284 1102786 1092965 1082951 1072665 1062822 1054347 1047876 1043775
53413 1043775 1042243 1043221 1046326 1051004 1056730 1063347 1071326 1081484 1094084 1108488 1124063 1141177 1160725
53400 1160725 1182800 1206451 1230821 1256080 1283124 1312705 1344902 1379171 1414821 1451598 1489725
53389 1489725 1529393 1570597 1613652 1659284 1707778 1758505 1810796 1864834 1921083 1979320 2038949
53378 2038949 2099909 2162446 2226308 2290873 2355766 2420529 2484044 2545294 2604542 2662791 2720150
53367 2720150 2775619 2828245 2877430 2922245 2961747 2996183 3026742 3053805 3076502 3094306 3107903
53356 3107903 3117807 3123134 3122502 3115492 3102528 3084010 3060408 3032808 3002486 2969909 2934517 2895363
53344 2895363 2851657 2803002 2749551 2692052 2631618 2569471 2506863 2444973 2384717 2326634 2270736
$$ packed form
53425A178043j9975j7662j4854j2268j0498r821j0014j0286r843q475o471m101
53413A043775j532R78L105M678N726O617P979J0158J2600J4404J5575J7114J9548
53400A160725K2075K3651K4370K5259K7044K9581L2197L4269L5650L6777L8127
53389A489725L9668M1204M3055M5632M8494N0727N2291N4038N6249N8237N9629
53378B038949O0960O2537O3862O4565O4893O4763O3515O1250N9248N8249N7359
53367B720150N5469N2626M9185M4815L9502L4436L0559K7063K2697J7804J3597
53356C107903R904N327o32p010j2964j8518k3602k7600l0322l2577l5392l9154
53344B895363m3706m8655n3451n7499o0434o2147o2608o1890o0256n8083n5898
$$ plain form
53333 2270736 2216340 2162441 2108662 2055611 2003950 1953496 1903799 1855180 1808335 1763177 1719053
53322 1719053 1676070 1635261 1597279 1561833 1528629 1498028 1470376 1445377 1422522 1401580 1382316
53311 1382316 1364208 1346729 1329541 1312285 1294754 1277484 1261662 1248184 1237095 1227965 1220325 1213690
53299 1213690 1207731 1202606 1198690 1196031 1194562 1194682 1196856 1200619 1204849 1209222 1214607 1221823 1230847 1241526
53285 1241526 1254275 1269502 1287016 1306465 1327951 1351784 1377981 1406202 1435848 1466109 1496393
53274 1496393 1526740 1557267 1587306 1615876 1642985 1669454 1695184 1718686 1738875 1756379 1772351
53263 1772351 1786733 1798519 1807235 1813379 1817735 1820859 1822915 1823404 1821288 1815849 1807237 1795891 1781863
53250 1781863 1765153 1746299 1726014 1704371 1680833 1655022 1627133 1597660 1567005 1535348 1502828
$$ packed form
53333B270736n4396n3899n3779n3051n1661n0454m9697m8619m6845m5158m4124
53322A719053m2983m0809l7982l5446l3204l0601k7652k4999k2855k0942j9264
53311A382316j8108j7479j7188j7256j7531j7270j5822j3478j1089r130p640o635
53299A213690n959n125l916k659j469J20K174L763M230M373N385P216R024J0679
53285A241526J2749J5227J7514J9449K1486K3833K6197K8221K9646L0261L0284
53274A496393L0347L0527L0039K8570K7109K6469K5730K3502K0189J7504J5972
53263A772351J4382J1786Q716O144M356L124K056M89k116n439q612j1346j4028
53250A781863j6710j8854k0285k1643k3538k5811k7889k9473l0655l1657l2520
$$ plain form
53239 1502828 1469897 1437351 1405713 1374697 1343713 1312826 1282607 1253058 1223410 1193256 1163237
53228 1163237 1134304 1106833 1080779 1056095 1032560 1009645 987035 965009 943955 923832 904360
53217 904360 885503 867531 850816 835635 821927 809192 796977 785355 774457 763691 752134
53206 752134 739669 726912 713973 700193 685402 670526 656446 642994 629576 616119 602950
53195 602950 590342 578686 568468 559531 550841 541513 531661 521841 512217 502731 493468 484283 474473
53182 474473 463424 451286 438653 426060 414110 403477 394164 385243 375926 366551 358000 350551 343843
53169 343843 337589 331737 326212 321019 316354 312167 307900 303070 297909 293061 288870 285202 281617 277541
53155 277541 272690 267574 263099 259468 256082 252759 250209 248840 247906 246481 244625 242873 241196 239342
$$ packed form
53239A502828l2931l2546l1638l1016l0984l0887l0219k9549k9648l0154l0019
53228A163237k8933k7471k6054k4684k3535k2915k2610k2026k1054k0123j9472
53217I04360j8857j7972j6715j5181j3708j2735j2215j1622j0898j0766j1557
53206G52134j2465j2757j2939j3780j4791j4876j4080j3452j3418j3457j3169
53195F02950j2608j1656j0218q937q690r328r852r820r624r486r263r185r810
53182D74473j1049j2138j2633j2593j1950j0633r313q921r317r375q551p449o708
53169C43843o254n852n525n193m665m187m267m830n161m848m191l668l585m076
53155B77541m851n116m475l631l386l323k550j369r34j425j856j752j677j854
$$ plain form
53141 239342 237637 236534 235697 234402 232639 231029 229836 228784 227723 226745 225725 224373 222787 221401 220450
53126 220450 219870 219592 219542 219541 219641 220307 221808 223617 224910 225490 225833 226389 227234 228152 228729 228695 228536 229335 231508
53107 231508 234050 235547 235560 234499 232634 230019 227094 224529 222526 220807 219115 217179 214457 210645 206339
53092 206339 202491 199333 196394 193374 190318 187081 183425 179627 176246 173220 169883 166062 162526 160124
53078 160124 158969 158571 158268 157377 155431 152683 150080 148519 148162 148435 148513 147868 146657 145542 144967 144762 144621
53061 144621 144662 145070 145471 145232 144275 143045 141751 140157 138160 136031 133969 131932 130067 128906 128863 129775
53045 129775 131105 132305 132891 132448 130876 128585 126274 124434 123047 121751 120331 119018 118210 117943 117870 117763
53029 117763 117725 117827 117844 117544 116992 116352 115593 114598 113384 112041 110675 109453 108515 107751 106975 106356 106352 107086 108181
$$ packed form
53141B39342j705j103q37j295j763j610j193j052j061r78j020j352j586j386r51
53126B20450n80k78n0jJ00O66J501J809J293N80L43N56Q45R18N77l4j59P99K173
53107B31508K542J497J3j061j865k615k925k565k003j719j692j936k722l812m306
53092B06339l848l158k939l020l056l237l656l798l381l026l337l821l536k402
53078A60124j155l98l03q91j946k748k603j561l57K73P8o45j211j115n75k05j41
53061A44621M1M08M01k39r57j230j294j594j997k129k062k037j865j161m3R12
53045A29775J330J200N86m43j572k291k311j840j387j296j420j313q08k67p3j07
53029A17763l8J02J7l00n52o40p59r95j214j343j366j222r38p64p76o19mP34J095
$$ plain form
53010 108181 109282 110369 111433 112335 113096 113824 114260 113982 113187 112599 112355 111758 110510 109381 109136 109537 110022
52993 110022 110645 111641 112668 113347 114025 115207 116671 117934 119133 120585 121878 122358 122201 122068 121961 121466
52977 121466 121027 121790 124026 126666 128717 130336 132185 134450 136928 139570 142444 145423 148235 150745 153051
52962 153051 155417 158095 161146 164473 168048 171785 175098 177053 177310 176607 175930 175528 175049 174249 173076 171428
52946 171428 169380 167396 165873 164752 163888 163328 162781 161395 158748 155653 153250 151722 150580 149746 149474
52931 149474 149572 149620 149711 150092 150318 149759 148863 148835 149979 151305 151934 152010 152012 151993 151824 151541 151121 150414 149513 148789 148397
52910 148397 148151 147947 147937 148265 149007 150309 152158 154127 155786 157217 158648 159821 160296 160191 159990 159801 159478
52893 159478 159313 159820 160952 162247 163694 165624 167749 169135 169356 168987 168796 169037 169634 170461 171307 172033 172888
$$ packed form
53010A08181J101J087J064R02P61P28M36k78p95n88k44n97j248j129k45M01M85
52993A10022O23R96J027O79O78J182J464J263J199J452J293M80j57j33j07m95
52977A21466m39P63K236K640K051J619J849K265K478K642K874K979K812K510K306
52962A53051K366K678L051L327L575L737L313J955K57p03o77m02m79q00j173j648
52946A71428k048j984j523j121q64n60n47j386k647l095k403j528j142q34k72
52931A49474R8M8R1L81K26n59q96k8J144J326O29P6Kj9j69k83m20p07r01p24l92
52910A48397k46k04j0L28P42J302J849J969J659J431J431J173M75j05k01j89l23
52893A59478j65N07J132J295J447J930K125J386K21l69j91K41N97Q27Q46P26Q55
$$ plain form
52876 172888 174179 175674 176785 177308 177506 177584 177620 177840 178351 178817 178988 179372 180595 182280 183384 183561 183369
52859 183369 183222 182996 182680 182570 182763 183192 184089 185602 187156 188091 188834 190386 192728 194990 197203 200493
52843 200493 205182 210011 213877 217164 220675 224242 227196 229394 230962 231640 231191 229968 228441 226536 223995
52828 223995 221008 218034 215292 212812 210628 208658 206709 204811 203113 201361 199003 196015 193081 190745
52814 190745 188874 187070 185048 182525 179410 176282 173984 172563 171252 169608 167910 166336 164650 162942
52800 162942 161722 160924 159761 157968 156252 155058 153771 151783 149428 147254 145134 142867 140865 139470
52786 139470 138246 136763 135480 134991 134895 134272 132939 131430 129998 128456 126912 125898 125707 126010 126127 125487
52770 125487 124002 122171 120656 119632 118888 118493 118752 119401 119566 118810 117582 116343 114973 113356 111779 110326
$$ packed form
52876A72888J291J495J111N23J98P8L6K20N11M66J71L84J223J685J104J77j92
52859A83369j47k26l16j10J93M29Q97J513J554R35P43J552K342K262K213L290
52843B00493M689M829L866L287L511L567K954K198J568O78m49j223j527j905k541
52828B23995k987k974k742k480k184j970j949j898j698j752k358k988k934k336
52814A90745j871j804k022k523l115l128k298j421j311j644j698j574j686j708
52800A62942j220p98j163j793j716j194j287j988k355k174k120k267k002j395
52786A39470j224j483j283m89r6o23j333j509j432j542j544j014j91L03J17o40
52770A25487j485j831j515j024p44l95K59O49J65p56j228j239j370j617j577j453
$$ plain form
52754 110326 108660 106854 105601 104961 103744 100997 97461 94692 93251 92571 92166 92010 91925 91407 90109 88072
52738 88072 85706 83811 83154 83567 83968 83729 83428 83711 84056 83530 82309 81538 81931 83218 84774 86041 86516
52721 86516 86002 84930 84035 83773 84244 85240 86044 85707 84080 82167 81026 80748 80938 81535 82557 83614 84376
52704 84376 85058 85831 86386 86807 88146 91157 94965 98028 100017 101788 103843 105891 107642 108999 109655 109510
52688 109510 109352 110063 111281 111867 111636 111491 111824 111942 111264 110083 108847 107621 106523 105797 105092 103491 100728
52671 100728 97714 95515 94396 94068 94122 93890 92598 90171 87362 84816 82578 80790 80056 80493 81058 80607
52655 80607 79288 78184 77806 77614 76992 76037 75240 74866 74876 75145 75441 75376 74712 73783 73380 74013 75383 76788
52637 76788 77973 79287 80993 82763 84018 84470 84176 83301 81989 80280 78098 75649 73832 73641 74918
$$ packed form
52754A10326j666j806j253o40j217k747l536k769j441o80m05j56q5n18j298k037
52738H8072k366j895o57M13M01k39l01K83L45n26j221p71L93J287J556J267M75
52721H6516n14j072q95k62M71R96Q04l37j627j913j141k78J90N97J022J057P62
52704H4376O82P73N55M21J339L011L808L063J989J771K055K048J751J357O56j45
52688A09510j58P11J218N86k31j45L33J18o78j181j236j226j098p26p05j601k763
52671A00728l014k199j119l28N4k32j292k427k809k546k238j788p34M37N65m51
52655H0607j319j104l78j92o22r55p97l74J0K69K96o5o64r29m03O33J370J405
52637G6788J185J314J706J770J255M52k94q75j312j709k182k449j817j91J277
$$ plain form
52622 74918 76232 76493 76140 76222 76863 77416 77719 78255 79126 79737 79700 79342 79101 78960 78746 78554 78586 78814 79049 79225
52602 79225 79476 79966 80654 81232 81487 81763 82722 84489 86359 87637 88381 89019 89598 89912 90063 90402 91096 92085
52584 92085 93174 93791 93126 91132 89027 88138 88493 89196 89872 90904 92479 94328 96417 99029 101981 104524
52568 104524 106248 107428 108310 108762 108856 109200 110274 111909 113653 115202 116248 116471 116122 116244 117771 120531
52552 120531 123397 125352 126224 126475 126565 126638 126759 127227 128296 129612 130354 130242 130022 130546 131671 132509 132590 132236
52534 132236 131910 131703 131515 131346 131351 131820 132993 134659 136202 137287 138199 139190 139899 139910 139469 139028 138527 137790
52516 137790 137231 137323 137706 137736 137657 138152 138889 138707 137352 135835 134787 133666 132110 130988 131312 132830 134439
52499 134439 135438 135714 135259 134269 133419 133351 133997 134851 135678 136533 137308 137765 137980 138352 139183 140410 141680 142552
$$ packed form
52622G4918J314K61l53Q2O41N53L03N36Q71O11l7l58k41j41k14j92L2K28K35J76
52602G9225K51M90O88N78K55K76R59J767J870J278P44O38N79L14J51L39O94R89
52584I2085J089O17o65j994k105q89L55P03O76J032J575J849K089K612K952K543
52568A04524J724J180Q82M52R4L44J074J635J744J549J046K23l49J22J527K760
52552A20531K866J955Q72K51R0P3J21M68J069J316P42j12k20N24J125Q38Q1l54
52534A32236l26k07j88j69NM69J173J666J543J085R12R91P09J1m41m41n01p37
52516A37790n59R2L83L0p9M95P37j82j355j517j048j121j556j122L24J518J609
52499A34439R99K76m55r90q50o8O46Q54Q27Q55P75M57K15L72Q31J227J270Q72
$$ plain form
52481 142552 142782 142522 142135 141807 141563 141602 142215 143304 144345 144949 145182 145306 145593 146357 147639 148768 148826 147770
52463 147770 146600 146186 146450 146937 147562 148318 148812 148702 148328 148308 148713 149148 149526 150219 151399 152639 153300 153127
52445 153127 152447 151922 152031 152656 153221 153339 153189 153192 153483 153890 154297 154761 155290 155667 155617 155149 154686 154702 155129 155345
52425 155345 154933 154284 154093 154433 154745 154683 154434 154142 153554 152501 151322 150494 150093 149877 149695 149560 149509 149617 150001
52406 150001 150608 151104 151165 150815 150356 149980 149523 148610 147087 145366 144250 144223 144989 145883 146650 147550 148739 149822
52388 149822 150153 149518 148533 148372 149816 152425 154908 156491 157608 158956 160350 161101 161166 161224 161720 162577 163792
52371 163792 165552 167588 169119 169785 170152 171010 172546 174402 176186 177726 179077 180410 181754 182911 183940
52356 183940 185462 187954 190969 193701 196218 199257 202815 205901 208004 209892 212416 215245 217382 218437
$$ packed form
52481A42552K30k60l87l28k44L9O13J089J041O04K33J24K87P64J282J129N8j056
52463A47770j170m14K64M87O25P56M94j10l74k0M05M35L78O93J180J240O61j73
52445A53127o80n25J09O25N65J18j50LK91M07M07M64N29L77n0m68m63J6M27K16
52425A55345m12o49j91L40L12o2k49k92n88j053j179q28m01k16j82j35n1J08L84
52406A50001O07M96O1l50m59l76m57r13j523j721j116k7P66Q94P67R00J189J083
52388A49822L31o35r85j61J444K609K483J583J117J348J394P51O5N8M96Q57J215
52371A63792J760K036J531O66L67Q58J536J856J784J540J351J333J344J157J029
52356A83940J522K492L015K732K517L039L558L086K103J888K524K829K137J055
$$ plain form
52342 218437 218888 219485 220828 223053 225540 227390 228590 230124 232474 234726 235872 236444 237857 240463 243205
52327 243205 245203 246735 248415 250233 251835 253239 254822 256822 259245 262096 265410 269066 272739 276131
52313 276131 279196 282177 285423 289212 293686 298894 304793 311255 318120 325233 332372 339267 345881 352593
52299 352593 359953 368261 377578 388034 399891 413234 427748 442787 457611 471784 485493 499296
52287 499296 513357 527204 540603 554311 569377 585870 602894 619807 636759 653954 671028
52276 671028 687401 702768 717081 730414 743055 755326 767163 778159 788132 797286 805801 813595
52264 813595 820499 826259 830482 833067 834599 835726 836180 835157 832703 829915 827565 825319 822600 819481
52250 819481 816298 813112 810029 807485 805661 804142 802623 801531 801474 802570 804772 808392 813723 820480 828159
$$ packed form
52342B18437M51N97J343K225K487J850J200J534K350K252J146N72J413K606K742
52327B43205J998J532J680J818J602J404J583K000K423K851L314L656L673L392
52313B76131L065K981L246L789M474N208N899O462O865P113P139O895O614O712
52299C52593P360Q308R317J0456J1857J3343J4514J5039J4824J4173J3709J3803
52287D99296J4061J3847J3399J3708J5066J6493J7024J6913J6952J7195J7074
52276F71028J6373J5367J4313J3333J2641J2271J1837J0996R973R154Q515P794
52264H13595O904N760M223K585J532J127M54j023k454k788k350k246k719l119
52250H19481l183l186l083k544j824j519j519j092n7J096K202L620N331O757P679
$$ plain form
52235 828159 836679 846226 856685 867718 879179 891097 903399 915912 928486 940911 952935 964461
52223 964461 975355 985116 993323 1000476 1007585 1014624 1020221 1023409 1024934 1026149 1027312 1027778 1027272 1025973
52209 1025973 1023624 1019503 1013287 1005332 996169 986260 976053 965655 954618 942629 930292 918627
52197 918627 907917 897622 887300 876990 866798 856797 847441 839424 832889 827144 821448 815830 811002
52184 811002 807576 805356 803367 800701 797418 794314 791760 789228 786207 783058 780440 778349 776302 774114
52170 774114 771876 769430 766558 763539 760858 758415 755675 752596 749790 747689 746048 744365 742324 739756
52156 739756 736612 733079 729437 725780 722196 719091 716855 715165 713138 710268 706868 703492 700328 697268
52142 697268 694233 691243 688373 685702 683144 680311 676876 673100 669714 667132 664952 662343 658829 654666
$$ packed form
52235H28159Q520R547J0459J1033J1461J1918J2302J2513J2574J2425J2024J1526
52223I64461J0894R761Q207P153P109P039N597L188J525J215J163M66n06j299
52209A025973k349m121o216p955r163r909j0207j0398j1037j1989j2337j1665
52197I18627j0710j0295j0322j0310j0192j0001r356q017o535n745n696n618m828
52184H11002l426k220j989k666l283l104k554k532l021l149k618k091k047k188
52170G74114k238k446k872l019k681k443k740l079k806k101j641j683k041k568
52156G39756l144l533l642l657l584l105k236j690k027k870l400l376l164l060
52142F97268l035k990k870k671k558k833l435l776l386k582k180k609l514m163
$$ plain form
52128 654666 650592 647218 644552 642087 639342 636278 633184 630335 627761 625184 622174 618638 615214 612821
52114 612821 611676 611086 610392 609748 609750 610712 612641 615561 619412 623853 628553 633591 639303 645974 653849 663133
$$ packed form
52128F54666m074l374k666k465k745l064l094k849k574k577l010l536l424k393
52114F12821j145n90o94o44KR62J929K920L851M441M700N038N712O671P875R284
$$ [...]
##END NTUPLES=NMR SPECTRUM
##END=
