
##TITLE=AC1236_CNAOR12067_6610122_s1eU3v7pMX
##JCAMPDX= 6.0         $$ Bruker NMR JCAMP-DX V2.0
##DATA TYPE= NMR SPECTRUM
##DATA CLASS= NTUPLES
##ORIGIN= BRUKER
##OWNER= Administrator
$$ 1.72 TOPSPIN		Version 2.1
$$ 2012-08-02 00:35:49.875 -0500  Administrator@TOPSPIN
$$ Compression mode = diff/dup
##.OBSERVE FREQUENCY= 400.02188249412
##.OBSERVE NUCLEUS= ^1H
##.ACQUISITION MODE= SIMULTANEOUS (DQD)
##.ACQUISITION SCHEME= undefined
##.AVERAGES= 8
##.DIGITISER RES= 22
##SPECTROMETER/DATA SYSTEM= spect
##.PULSE SEQUENCE= zg30
##.SOLVENT NAME= COFFEE_meoh
##.SHIFT REFERENCE= INTERNAL, COFFEE_meoh, 1, 14.98509
##AUDIT TRAIL= $$ (NUMBER, WHEN, WHO, WHERE, PROCESS, VERSION, WHAT)
$$ ##TITLE= Audit trail, TOPSPIN		Version 2.1
$$ ##JCAMPDX= 5.01
$$ ##ORIGIN= Bruker BioSpin GmbH
$$ ##OWNER= Administrator
$$ $$ C:\Bruker\TOPSPIN/data/COFFEE/nmr/AC1236_CNAOR12067_6610122_s1eU3v7pMX/10/pdata/1/auditp.txt
$$ ##AUDIT TRAIL=  $$ (NUMBER, WHEN, WHO, WHERE, PROCESS, VERSION, WHAT)
(   1,<2012-08-02 00:35:41.203 -0500>,<Administrator>,<TOPSPIN>,<go>,<TOPSPIN 2.1>,
      <created by zg
	started at 2012-08-02 00:34:34.609 -0500,
	POWCHK enabled, PULCHK disabled,
       configuration hash MD5:
       6B 1B 68 BB D9 2E 58 E2 7F 35 AD 54 07 DF 0E 41
       data hash MD5: 64K
       F1 67 90 3E 91 D1 26 E0 3C BC 92 66 C4 94 BD 59>)
(   2,<2012-08-02 00:35:45.015 -0500>,<Administrator>,<TOPSPIN>,<proc1d>,<TOPSPIN 2.1>,
      <Start of raw data processing
       efp LB = 0 FT_mod = 6 PKNL = 1 PHC0 = 0 PHC1 = 0 SI = 32K 
       data hash MD5: 32K
       9B F7 C6 92 9E DD E5 50 0D 4B 91 EA 04 6A 65 0E>)
(   3,<2012-08-02 00:35:45.359 -0500>,<Administrator>,<TOPSPIN>,<proc1d>,<TOPSPIN 2.1>,
      <pk PHC0 = 178.2806 PHC1 = 0 
       data hash MD5: 32K
       5D DF 38 C6 A8 5F 5A D1 62 CA A4 CA D5 94 88 B7>)
(   4,<2012-08-02 00:35:45.531 -0500>,<Administrator>,<TOPSPIN>,<proc1d>,<TOPSPIN 2.1>,
      <abs ABSG = 1 
       data hash MD5: 32K
       01 C9 62 4A 18 47 E3 FC FE EB 62 37 AB 48 17 FA>)
(   5,<2012-08-02 00:35:45.671 -0500>,<Administrator>,<TOPSPIN>,<proc1d>,<TOPSPIN 2.1>,
      <abs ABSG = 2 
       data hash MD5: 32K
       76 09 97 4A AA 67 82 6A 00 E6 25 87 C0 F2 3C 0B>)
(   6,<2012-08-02 00:35:45.703 -0500>,<Administrator>,<TOPSPIN>,<proc1d>,<TOPSPIN 2.1>,
      <abs ABSG = 3 
       data hash MD5: 32K
       72 A5 68 FD 61 7B 71 53 37 9A D5 EC E7 BC B2 78>)
(   7,<2012-08-02 00:35:45.734 -0500>,<Administrator>,<TOPSPIN>,<proc1d>,<TOPSPIN 2.1>,
      <abs ABSG = 4 
       data hash MD5: 32K
       F7 7B 53 74 42 DE F3 FE 3C 63 9C A4 8F 18 5C 89>)
(   8,<2012-08-02 00:35:45.765 -0500>,<Administrator>,<TOPSPIN>,<proc1d>,<TOPSPIN 2.1>,
      <abs ABSG = 5 
       data hash MD5: 32K
       76 E2 E8 B4 F0 48 30 49 0A 66 57 25 1A D8 95 5B>)
$$ ##END=
$$ 
$$ $$ hash MD5
$$ $$ 4B 8F 80 2F 59 9A 11 8F A0 BC 1E 0C CF 15 BC EC
##$RELAX= 
##$RELAX= 
##$RELAX= 
##$RELAX= 
##$RELAX= 
##$RELAX= 
##$RELAX= 
$$ Bruker specific parameters
$$ --------------------------
$$ [...]
150 150 150 150 150 150 150 150
##$TP07= 0
##$TPNAME0= <>
##$TPNAME1= <>
##$TPNAME2= <>
##$TPNAME3= <>
##$TPNAME4= <>
##$TPNAME5= <>
##$TPNAME6= <>
##$TPNAME7= <>
##$TPOAL= (0..7)
0.5 0.5 0.5 0.5 0.5 0.5 0.5 0.5
##$TPOFFS= (0..7)
0 0 0 0 0 0 0 0
##$TUNHIN= 0
##$TUNHOUT= 0
##$TUNXOUT= 0
##$USERA1= <user>
##$USERA2= <user>
##$USERA3= <user>
##$USERA4= <user>
##$USERA5= <user>
##$V9= 5
##$VALIST= <valist>
##$VCLIST= <CCCCCCCCCCCCCCC>
##$VD= 0
##$VDLIST= <DDDDDDDDDDDDDDD>
##$VPLIST= <PPPPPPPPPPPPPPP>
##$VTLIST= <TTTTTTTTTTTTTTT>
##$WBST= 1024
##$WBSW= 4
##$XGAIN= (0..3)
0 0 0 0
##$XL= 0
##$YL= 0
##$YMAX_a= 482753
##$YMIN_a= -630522
##$ZGOPTNS= <>
##$ZL1= 120
##$ZL2= 120
##$ZL3= 120
##$ZL4= 120
##$ABSF1= 14.98509
##$ABSF2= -5.573092
##$ABSG= 5
##$ABSL= 3
##$ALPHA= 0
##$AQORDER= 0
##$ASSFAC= 0
##$ASSFACI= 0
##$ASSFACX= 0
##$ASSWID= 0
##$AUNMP= <proc_prof1d_extract_pilot.lims>
##$AXLEFT= 0
##$AXNAME= <>
##$AXNUC= <1H>
##$AXRIGHT= 0
##$AXTYPE= 0
##$AXUNIT= <>
##$AZFE= 0.1
##$AZFW= 0.1
##$BCFW= 0
##$BC_mod= 0
##$BYTORDP= 0
##$COROFFS= 0
##$CY= 15
##$DATMOD= 1
##$DC= 0
##$DFILT= <>
##$DTYPP= 0
##$F1P= 0
##$F2P= 0
##$FCOR= 0.5
##$FTSIZE= 32768
##$FT_mod= 6
##$GAMMA= 0
##$GB= 0
##$INTBC= 1
##$INTSCL= 1
##$ISEN= 128
##$LB= 0
##$LEV0= 0
##$LPBIN= 0
##$MAXI= 10000
##$MC2= 0
##$MEAN= 0
##$ME_mod= 0
##$MI= 0
##$NCOEF= 0
##$NC_proc= -8
##$NLEV= 6
##$NOISF1= 0
##$NOISF2= 0
##$NSP= 0
##$NTH_PI= 0
##$NZP= 0
##$OFFSET= 14.98509
##$PC= 1
##$PHC0= 178.2806
##$PHC1= 0
##$PH_mod= 1
##$PKNL= yes
##$PPARMOD= 0
##$PPDIAG= 0
##$PPIPTYP= 0
##$PPMPNUM= 2147483647
##$PPRESOL= 1
##$PSCAL= 4
##$PSIGN= 0
##$PYNMP= <proc.py>
##$REVERSE= no
##$SF= 400.02
##$SI= 32768
##$SIGF1= 0
##$SIGF2= 0
##$SINO= 400
##$SIOLD= 32768
##$SPECTYP= <>
##$SREGLST= <1H.CDCl3>
##$SSB= 0
##$STSI= 32768
##$STSR= 0
##$SW_p= 8223.68421052631
##$SYMM= 0
##$S_DEV= 0
##$TDeff= 65536
##$TDoff= 0
##$TI= <>
##$TILT= no
##$TM1= 0
##$TM2= 0
##$TOPLEV= 0
##$USERP1= <user>
##$USERP2= <user>
##$USERP3= <user>
##$USERP4= <user>
##$USERP5= <user>
##$WDW= 1
##$XDIM= 32768
##$YMAX_p= 460587671
##$YMIN_p= -674627
##$CURPLOT= <Network HP LaserJet P1505>
##$CURPRIN= <$Network HP LaserJet P1505>
##$DFORMAT= <normdp>
##$LAYOUT= <+/1D_H.xwp>
##$LFORMAT= <normlp>
##$PFORMAT= <normpl>
##$SURQMSG= 1
$$ End of Bruker specific parameters
$$ ---------------------------------
##NTUPLES= NMR SPECTRUM
##VAR_NAME=  FREQUENCY,     SPECTRUM/REAL,   SPECTRUM/IMAG
##SYMBOL=    X,             R,               I
##VAR_TYPE=  INDEPENDENT,   DEPENDENT,       DEPENDENT
##VAR_FORM=  AFFN,          ASDF,            ASDF
##VAR_DIM=   32768,         32768,           32768
##UNITS=     HZ,            ARBITRARY UNITS, ARBITRARY UNITS
##FACTOR=    0.250966925370066, 1,           1
##FIRST=     8223.43324360094, -117763,      -142848
##LAST=      0,             -197986,         -19069
##MIN=       0,             -674627,         0
##MAX=       8223.43324360094, 460587671,    0
$$ Real data points
##PAGE= N=1
##DATA TABLE= (X++(R..R)), XYDATA
$$ [...]
19491A66661i8526L7739B0979O8394K2650h0651m0955B5849b1816A92743b31683
19479c5863N81H5255a42764G3001k2890b73614i328l55391a74404A2930b04676
19467g8161m6253p8271G1608a34537a7415A46554C6471a23005I6329g2203l0857
19456a03060C02386b8443m95341A75240J77173m1412a97951A76034b23064G7235
19445H2853k3555b80987B00580q1055K17533A31120K9965a19391F9012b52922
19434d8861J2816r2428A48365f4275j58850k67L3566m5469B28100a18509K6336
19423i2173A3363i8428F9872L2405b69881a15263C0225a14330m40555a89435a4168
19411f3599K5943A41502a19431B8252a09436l1514O5439L3201D5523c62758i362
$$ plain form
19491 166661 -98526 -60787 20979 89373 112023 -80651 -121606 25849 -21816 192743 -231683
19479 -35863 -35282 85255 -142764 73001 50111 -273614 -9328 -364719 -174404 12930 -204676
19467 -78161 -124414 -202685 71608 -134537 -17415 146554 36471 -123005 96329 -72203 -103060
19456 -103060 302386 -28443 -523784 175240 352413 311001 -197951 176034 -223064 77235
19445 82853 59298 -280987 200580 119525 337058 131120 161085 -119391 69012 -252922
19434 -48861 -36045 -128473 148365 -64275 -223125 -223392 -189826 -235295 228100 -118509 -92173
19423 -92173 13363 -98428 69872 102277 -269881 -115263 30225 -114330 -554885 -189435 -14168
19411 -63599 -37656 141502 -119431 28252 -109436 -140950 -75511 -42310 45523 -362758 -9362
19399i0740l7288c6401A2306b31205R2598a30j42980l938H1920R7972c83039A02850
19386d8452B8526a1038B51664a5444k21647k26244A53728a22746B02436b99722
19375G1581C429f7921C18728b32329O0573H3872C4407J06822E5606a60364B29638
19363a11805j91661a48722j30052P391C2708K5054k6098J46345a78051A83208
19352b08572e6228F7374a84990B55937i3949j79985J28318o8355Q388H195J53225
19341A61420b85287A31205c5952D928e17728a2934m4038A5846a46610A05003K33730
19330C38733d39783a02864k2894L473M6795L2969j25658g1965j80164L4554N1844
19319a65731C6140b14637Q1307a7280A15329e4833B98113H9399a0482j16102A97843
$$ plain form
19399 -90740 -128028 -36401 12306 -231205 -138607 -130 -143110 -147048 81920 179892 -383039 102850
19386 -48452 28526 -11038 251664 -15444 -237091 -463335 153728 -122746 202436 -299722
19375 71581 3429 -67921 318728 -232329 -171756 83872 34407 141229 55606 -160364 229638
19363 -111805 -303466 -148722 -278774 -271383 32708 57762 31664 178009 -178051 183208
19352 -208572 -56228 67374 -184990 255937 -93949 -273934 -145616 -213971 -205583 8195 161420
19341 161420 -285287 131205 -35952 4928 -517728 -12934 -56972 15846 -146610 105003 338733
19330 338733 -439783 -102864 -125758 -122285 -75490 -42521 -168179 -71965 -252129 -217575 -165731
19319 -165731 36140 -214637 -133330 -17280 115329 -54833 298113 89399 -10482 -126584 197843
19307a31407K3185P999c4726A69558l9132q756D5287J59346a47592O9530f000
19295d7990A57387a10858F1255A067d7146B39045o4743a74479M5481k0495K0889
19284a28604D6563a96561j69928K394B6792a7617j50022A6380a21606B9435d38350
19272a5977q7261A62068F5148a84759R693M4580H3575K14764b64865e3320k08003
19261b61323h104H1917b28647a02986H6504a72617J5789a046C784R3995b933j63653
19249a66586e4049b1020j91601e4899H1484O9384G0139b73266d0125l4807r9471
19238a74403j26590D1927b47992j7687A9645b00612j54829B18353m3521F1681
19227a00609p6540A43254f9417f256k77895J33364K3024R546j26015a5618o2219
$$ plain form
19307 -131407 -108222 -100223 -34726 169558 130426 121670 45287 204633 -147592 -78062 -6000
19295 -47990 157387 -110858 61255 1067 -47146 239045 174302 -174479 -128998 -149493 -128604
19284 -128604 46563 -196561 -366489 -364095 26792 -17617 -167639 16380 -121606 29435 -438350
19272 -15977 -103238 162068 65148 -184759 -175066 -130486 83575 298339 -264865 -53320 -261323
19261 -261323 -8104 81917 -228647 -102986 86504 -172617 -156828 -1046 3784 97779 -2933 -166586
19249 -166586 -54049 -21020 -212621 -54899 81484 150868 70139 -273266 -40125 -74932 -174403
19238 -174403 -300993 41927 -247992 -265679 19645 -200612 -355441 218353 174832 61681
19227 -100609 -177149 143254 -69417 -6256 -284151 -150787 -127763 -118217 -244232 -15618 -77837
19216g7837q0887A03724b02056e4450j69182A20098A3033a47935l6627D1007a94273
19204a46214a4976j95391D81398c84906e8528j03426m5208L2344a3204e54k3150
19193b3704A0005a49007F5563b6733B27923A1793c773A48759O1961b6506R082
19182a7424B14587e0623j0407B39635a00455o2627C5990e085A46613P450k864
19171A51199k5690b5430A33529l3809f5686B23780b19706n6093B17937q8216E675
19159a49528m7336j0722I1725a5894j18921B42743b64632B10982a32461J559L8451
19148i2451j12935j22560Q8657E4175L5403a60361j28125f0588A66831a32959
19137d07794B1149b80463m4826f8888k48015B2160a07653o9180C7741b49581f8293
$$ plain form
19216 -77837 -158724 103724 -202056 -54450 -223632 120098 13033 -147935 -184562 41007 -194273
19204 -146214 -14976 -210367 481398 -384906 -58528 -161954 -207162 -174818 -13204 -554 -23704
19193 -23704 10005 -149007 65563 -26733 227923 11793 -3773 148759 210720 -26506 -17424
19182 -17424 214587 -50623 -61030 239635 -100455 -163082 35990 -5085 146613 154063 151199
19171 151199 125509 -25430 133529 99720 -65686 223780 -219706 -275799 217937 129721 5675
19159 -149528 -196864 -207586 91725 -15894 -134815 242743 -264632 210982 -132461 -130902 -92451
19148 -92451 -205386 -327946 -239289 54175 89578 -160361 -288486 -60588 166831 -132959
19137 -407794 21149 -280463 -325289 -68888 -316903 22160 -107653 -176833 37741 -249581 -68293
19125b75198c1635j5647D4514J9179i5141j4317L925b6402m8628b8277k2914j21898
19113a73089A52888h50A61745a41123b1772k02466g9053A39176a08229d1186j83519
19102b24705D9443a96774l2128k06500E8333h9577j34538E3680e3701l61299G791
19090C82406g8360G6933J97273C1244K87920a7602j42554j06638A7773A117a32264
19078b25719B19378G7513a13826k6974q666q2343l7111M9054A31924N5234K1927
19067B09085f4256B5483b90962E1676a05109m619k96805R4167B01525b06346C32897
19055b68395Q1923J2673D1954h3182F86a79539j8336N4065E4824a49708A51496
19043b62523A00688a16150N4045J2268F9088e4272I8292b28925B820a16122B2922
$$ plain form
19125 -275198 -31635 -47282 44514 63693 -95141 -109458 -105533 -26402 -75030 -28277 -51191 -173089
19113 -173089 152888 -850 161745 -141123 -21772 -224238 -79053 139176 -108229 -41186 -224705
19102 -224705 49443 -196774 -228902 -435402 58333 -89577 -224115 53680 -53701 -415000 7791
19090 382406 -78360 76933 274206 31244 319164 -17602 -160156 -266794 17773 1117 -132264
19078 -225719 219378 77513 -113826 -140800 -149466 -231809 -268920 -219866 131924 187158 209085
19067 209085 -64256 25483 -290962 51676 -105109 -109728 -406533 -312366 201525 -206346 332897
19055 -268395 -186472 -173799 41954 -83182 686 -179539 -197875 -143810 54824 -149708 151496
19043 -262523 100688 -116150 -62105 -49837 69088 -54272 98292 -228925 2820 -116122 22922
19031a76052a2634m1461j6827j52380C7192K16254G174a01811A08333H327a52322
19019f8994B44319Q7514a13528j12892F0188c14941f2930j9979j00228g4097h983
19007C588a7221j32189e9379J4223A86389b58482A06657D1411J43298b45122A4726
18995d4332B92691a55634K7248k20325j5992H6048A9594f00847E3665a99261k4756
18984b24017A74879A6584a17519r8866a7103o6726I1773a85569l9682J5911j79142
18973c88482B77432A36789O0176M10965j48611M2209a17967C8336a68353C35223
18962a37542H5944j9371h3192B17408b11375l6589d2283k75208O2169C78331a05029
18950b22701c4487k80604a8203k27254M3246B4363d84809B9268j1585K27871j8924
$$ plain form
19031 -176052 -12634 -54095 -70922 -223302 37192 253446 7174 -101811 108333 8327 -152322
19019 -68994 244319 331833 -113528 -226420 60188 -314941 -62930 -82909 -183137 -74097 -8983
19007 3588 -17221 -149410 -59379 -45156 186389 -258482 106657 41411 184709 -245122 14726
18995 -44332 292691 -155634 -128386 -348711 -364703 86048 19594 -600847 53665 -199261 -224017
18984 -224017 174879 16584 -117519 -216385 -17103 -83829 91773 -185569 -225251 -209340 -388482
18973 -388482 277432 136789 196965 607930 459319 501528 -117967 38336 -168353 335223
18962 -137542 85944 66573 -83192 217408 -211375 -247964 -42283 -317491 -255322 378331 -105029
18950 -222701 -34487 -315091 -18203 -245457 -202211 24363 -484809 29268 17683 245554 226630
18939B26630a76967d2497A55552h264o8815K3399F401g6276B8741c17664A19990
18927i3803N092q0563C01494f397F6773d75195a79399k925H9007O4027n8322K5458
18915A20170a35586B1106f7705C02765i3784a3052D99272D6511P19380j10269
18905F55622A38570i220p5592a943r2517H2637b02520j95977i6801G5552a32699
18893a08435A6290L7882a12457B41213g2943a5384G7584P6459c52728g6976j4539
18882i1515k172k9054c0465l5019p2275M1361p1864q4052B04021A7398Q3093a02698
18869g4655j6112E9786h5206L9886J2366k16404A31346d15885G9304h7585G7603
18857a09221A0627i0633A17533N3009c8108I7815k5248a43345H3572J55033f9613
$$ plain form
18939 226630 -176967 -42497 155552 -8264 -77079 -53680 6401 -76276 28741 -317664 119990
18927 -93803 -88711 -169274 301494 -6397 66773 -475195 -179399 -182324 89007 153034 94712 120170
18915 120170 -135586 21106 -67705 302765 -93784 -13052 499272 46511 765891 655622
18905 655622 138570 -9220 -84812 -1943 -94460 82637 -202520 -398497 -96801 75552 -132699
18893 -108435 16290 54172 -112457 241213 -72943 -15384 77584 154043 -352728 -76976 -91515
18882 -91515 -93687 -122741 -30465 -65484 -137759 -96398 -168262 -252314 204021 17398 100491 -102698
18869 -74655 -90767 59786 -85206 -45320 -32954 -249358 131346 -415885 79304 -87585 77603
18857 -109221 10627 -90633 117533 170542 -38108 97815 72567 -143345 83572 238605 -69613
18845F9302a16612N2908C68692a32213m8151B68995e6510l59427B64042a58946
18834b78648a2216A90684c1459l57021B89201b06214a00830A03810c76063i1310
18823h6666B1783a55429A64798e6559q0339l3560A4944J9850j6867f1010b4537
18811b11781i588i86A70327b24558B53500c5147B1733a47574A16524a35740A0999
18799I9086a20948r3503k5001i6945c9292E2586a96271F5892J78932a78444A21388
18787B24707C5971d3466A95949d946A85806g4602m774E0825b18117j17894e7032
18775a54535j11888H3795a52302a4483j47561G5303A8717a75934A74304q3298
18765I1006c58212A59587B4385P1409J9525k6416l734e7798K5969j59317I0772
$$ plain form
18845 69302 -116612 -63704 368692 -132213 -180364 268995 -56510 -415937 264042 -158946
18834 -278648 -12216 190684 -31459 -388480 289201 -206214 -100830 103810 -376063 -91310
18823 -86666 21783 -155429 164798 -56559 -136898 -170458 14944 34794 17927 -61010 -24537
18811 -211781 -9588 -986 170327 -224558 253500 -35147 21733 -147574 116524 -135740 10999
18799 99086 -120948 -214451 -239452 -96945 -39292 52586 -196271 65892 244824 -178444 121388
18787 224707 35971 -43466 195949 -4946 185806 -74602 -79376 50825 -218117 -336011 -57032
18775 -154535 -266423 83795 -152302 -14483 -162044 75303 18717 -175934 174304 91006
18765 91006 -358212 159587 24385 95794 115319 88903 85169 -57798 -31829 -191146 90772
18753c62333A3913L7121b37996C00173o2674a79912M0839j13345C4a22683I860
18741b66346O6096c2922J1408j95009R2825B06237L2567c56196a39870B1715n68
18730B1147K77154b11650D803h6635n5922A81722j8587I770J27282i375A58828
18718a95071P708j62390B9216b95940f1930F5660d9826G4823l1146a67620L7477
18707a30143k95478K07334B0698b67344B34176E9524B9192N2731C7659a49176
18696A07665b82087J03264g0072J0852j97768o0659a54005M5540r5745P4451K2809
18685a06950p255j14709A87668C4842J25841D374R3576g8858j07753D6357L5351
18674H1708J59730c7900j31662K6376L817c3386k66098i3377k02306B44973F0003
$$ plain form
18753 -362333 13913 51034 -237996 300173 237499 -179912 -139073 -252418 34 -122683 9860
18741 -266346 -200250 -32922 -21514 -216523 -123698 206237 238804 -356196 -139870 21715 21147
18730 21147 298301 -211650 4803 -86635 -142557 181722 163135 9770 137052 -9375 158828
18718 -195071 -187363 -349753 29216 -295940 -61930 65660 -49826 74823 43677 -167620 -130143
18707 -130143 -425621 -218287 20698 -267344 234176 59524 29192 81923 37659 -149176
18696 107665 -282087 -178823 -70072 -59220 -256988 -317647 -154005 -108465 -204210 -129759 -106950
18685 -106950 -114205 -228914 187668 34842 160683 4374 97950 -78858 -186611 46357 81708
18674 81708 241438 -37900 -169562 -143186 -139369 -33386 -299484 -93377 -295683 244973 60003
18662b01209p3799I7816b01201e0884j07985J0666E0913c41953b0356C15691a35032
18650a76091d3266k6503N679M963k37136i713j44310j42683g9028j79806A67002
18638C1356A060d7158j8534l13881a87205K194K3124A02369L7664a59896A96297
18626a72684A60769E4318J35433H4817i2120F3013h817H2614c02940a26154o6260
18615a92414m68484a23935B66725b57383c4990j34332k5922D3739J07309l1830
18605A19218R3297q1648F617b4403n6876A09856B6815f9727I6649b84487d6695
18593A80058K9456a18578j14204g1792j61994d9443j47232i4204J4163A21605
18582A19035L36991B08736a20181c7554J3443A29303b8856A50418F6093d716A36108
$$ plain form
18662 -201209 -275008 97816 -201201 -50884 -158869 -148203 50913 -341953 -20356 315691 -135032
18650 -176091 -43266 -69769 -64090 -59127 -296263 -9713 -154023 -296706 -79028 -258834 167002
18638 31356 1060 -47158 -65692 -379573 -187205 -185011 -161887 102369 140033 -159896 196297
18626 -172684 160769 54318 189751 84817 -92120 63013 -8817 82614 -302940 -126154 -192414
18615 -192414 -660898 -123935 266725 -257383 -34990 -169322 -195244 43739 151048 119218
18605 119218 212515 130867 6617 -24403 -81279 109856 26815 -69727 96649 -284487 -46695
18593 180058 209514 -118578 -232782 -71792 -233786 -49443 -196675 -94204 -80041 121605
18582 119035 456026 208736 -120181 -37554 -24111 129303 -28856 150418 66093 -4716 136108
18570b54740g9465b7324B0442M0557a01457C9487b58504C8366P5035a11418l70127
18559d81545b34867e8990A29795c39578P4417f0533A36764R4427m3514b2000L578
18548a8422m7869j06040a9103j55423G0272f8501j28269B25696r2541c25819a11051
18536h9289B25031C6605a22930j55113a0066D0564a64522g9364j27602l5651A62301
18524b4165B77424e6769A67986A5246a87128O1948H5465a27866L6369q791A75862
18512C28414B6452a1451A50192b62851P413g2709j90573a20244j46584C9549e4710
18500a16221q0625h9086j47589E2538d0653m1354B6546q341K19961n106a07466
18488h8868j3662O502m579A70694H1586j4866a1166p6359J048d1977k00305C10342
$$ plain form
18570 -254740 -79465 -27324 20442 60999 -101457 39487 -258504 38366 113401 -111418 -481545
18559 -481545 -234867 -58990 129795 -339578 -265161 -60533 136764 231191 187677 -22000 -18422
18548 -18422 -66291 -172331 -19103 -174526 70272 -68501 -196770 225696 133155 -325819 -111051
18536 -89289 225031 36605 -122930 -278043 -10066 40564 -164522 -79364 -206966 -242617 162301
18524 -24165 277424 -56769 167986 15246 -187128 -125180 85465 -127866 -91497 -100288 175862
18512 328414 26452 -11451 150192 -262851 -255438 -72709 -263282 -120244 -266828 39549 -54710
18500 -116221 -196846 -89086 -236675 52538 -40653 -82007 26546 18205 238166 233060 -107466
18488 -88868 -102530 -96028 -100607 170694 81586 66720 -11166 -87525 -86477 -41977 -242282 310342
18475g0701l55886B9199J41235a64686P5608c0043j60905f2884n0290j38812A02081
18463A49285C7704a58621P0499C38414h2684P487A70743Q213L4677a23811I1719
18451G3634J0931D1695j5165L5061O0737a23300D04967A54778J9996b2971j46523
18440a69494b9884n5377E8256O5399k4342c38024d572H4540B1831i153H4101c88640
18427d4106N455o7159k654I2710a95052c0314j22119e9618k47623J1094D9130
18415e7687p7421j65940B0683g8842a0113q4532n03771K81465i3171k40776d5361
18403b67736C92504H5498j4571a37597A520L2396J12582P675b7954e124A6443
18391B27883D1009Q7437L4095b08766L6605A7303K90366B1947R8436J282M6907
$$ plain form
18475 -70701 -426587 29199 170434 -164686 -89078 -30043 -190948 -62884 -113174 -251986 102081
18463 149285 37704 -158621 -88122 338414 -82684 -75197 170743 178956 213633 -123811 91719
18451 73634 84565 41695 26530 61591 122328 -123300 404967 154778 174774 -22971 -169494
18440 -169494 -29884 -85261 58256 123655 99313 -338024 -4572 84540 21831 -9153 84101 -388640
18427 -44106 -38651 -105810 -108464 92710 -195052 -30314 -152433 -59618 -307241 -296147 49130
18415 -57687 -135108 -301048 20683 -78842 -10113 -94645 -598416 -316951 -93171 -333947 -45361
18403 -267736 392504 85498 70927 -137597 1520 33916 146498 154173 -27954 -5124 16443
18391 227883 41009 128446 162541 -208766 -172161 17303 307669 21947 120383 121665 168572
18380A68572a73850B53561f2521E5291A2364a78687P4690C7422a74878M3976B8826
18368A819R379Q3977d0704C0908J4308J66639J15916A41368Q1959b73194D6016
18356a01063B98258j09778c27618a13737A04912K4071j6172m8970h0781j7974
18346i8755a8759k01951a8790B49931A24794c30262a18237l3764k72428J64720
18336b59709l51319A64283a96083h9612r5360p1255N6484C4024a00304k70413
18326c70717a64375B86176A26429B9110a0977B00316o2195b68084j0988A07135
18315D4383i1241A0870B458f3472N90k05448E35522a36398A3518a44018B00667
18303i5594H4983a11986J5464j42469O7757D44986b13190D5779K3559L66434j54713
$$ plain form
18380 168572 -173850 253561 -62521 55291 12364 -178687 -103997 37422 -174878 -130902 28826
18368 1819 11198 95175 -40704 30908 45216 211855 327771 141368 223327 -273194 46016
18356 -101063 298258 188480 -327618 -113737 104912 128983 112811 63841 -80781 -98755
18346 -98755 -18759 -220710 -18790 249931 124794 -330262 -118237 -152001 -424429 -259709
18336 -259709 -611028 164283 -196083 -89612 -184972 -256227 -199743 34024 -100304 -370717
18326 -370717 -164375 286176 126429 29110 -10977 200316 138121 -268084 -279072 107135
18315 44383 -91241 10870 2458 -63472 -62882 -268330 535522 -136398 13518 -144018 200667
18303 -95594 84983 -111986 -96522 -238991 -171234 444986 -213190 45779 69338 435772 281059
18292B81059i8878j50322o0098g6631a0541m9340H9124O6276b48261A8776a10458
18280B84475B0739a61987P6290p1512A8895J29106b59292C1960c67716a03106
18269G2368l041d8044l09077J48895a0489B8552c66592J52103C5372d4929o0523
18258a05452C8606b37934G3224c2640A34015J10687E0323i4115B0123a10240C34797
18246i4672j74341f6945A12775a49252N0469m7591a3071o3133E1397q508d031
18234f6963k886n7076n8311d4569E0684c68821p2287a33862N5390j4998o2960
18223a56430O4491A35109a95355B5361Q6191m3938J04212A3167a07651B15653
18212f7145C13967J07186i1543j25659q538j56636A33521d4044m33k91979c616
$$ plain form
18292 281059 -98878 -249200 -309298 -76631 -10541 -59881 89124 155400 -248261 18776 -110458
18280 284475 20739 -161987 -85697 -157209 18895 148001 -259292 31960 -367716 -103106
18269 72368 69327 -48044 -357121 -208226 -10489 28552 -366592 -214489 35372 -44929 -105452
18258 -105452 38606 -237934 73224 -32640 134015 244702 50323 -94115 20123 -110240 334797
18246 -94672 -269013 -66945 112775 -149252 -98783 -146374 -13071 -76204 51397 42889 -4031
18234 -66963 -69849 -126925 -185236 -44569 50684 -368821 -441108 -133862 -78472 -93470 -156430
18223 -156430 -91939 135109 -195355 25361 111552 67614 171826 13167 -107651 215653
18212 -67145 313967 421153 -91543 -217202 -225740 -382376 133521 -44044 -44477 -336456 -3616
18200A1885e9817A02283b68823g6137K2968K2141k35241c7472A57647k6546J1096
18189A42197J7656C1627c4859A37648a7734p2332j52357E0598L6644Q2686N3601
18178B23529c99370E2899B5042a10821q8119l7736a8993C10732H700Q4013k3619
18167F9094a03922K5390G8147R1399h3089C6740J06467I131J11878b15117K5548
18156a89569A69257b07985A11759b55884Q9917k3557B02705r4890J11818b67601
18145C9723q94J53847C6143a52133A89005b7128i075A04321c98493b6000B6898
18133B76535a35012d6030F7492b87737A076e543p4613a5816j47710o620A32611
18121c52797F6647a7685c141B24826m3720a34897k62346A62532E0908N68B3777
$$ plain form
18200 11885 -59817 102283 -268823 -76137 -53169 -31028 -266269 -37472 157647 131101 142197
18189 142197 159853 31627 -34859 137648 -17734 -90066 -242423 50598 87242 169928 223529
18178 223529 -399370 52899 25042 -110821 -198940 -236676 -18993 310732 8700 92713 69094
18167 69094 -103922 -78532 78147 169546 -83089 36740 143207 9131 121009 -215117 -189569
18156 -189569 169257 -207985 111759 -255884 -165967 -189524 202705 107815 219633 -267601
18145 39723 38829 192676 36143 -152133 189005 -27128 -9075 104321 -398493 -26000 26898
18133 276535 -135012 -46030 67492 -287737 1076 -5543 -80156 -15816 -163526 -170146 132611
18121 -352797 66647 -17685 -3141 224826 181106 -134897 -397243 162532 50908 51476 23777
18109a13809c5616E9330J96368c42388f1864o5622M6064D3648J19604k9160A4163
18097D5426d8606q5845c249C32907B5630J7198B0179K29302g4530G0781q436m503
18085E7842F47J92416D6946a78363J1744g4403B57935A8639J4182J13782R5482
18074B42085C8106h5230B1160R3913C2831P1118M8600h376j32977o1872e8611
18062A17149N272D7340a4525j71446O3347l55878D7728b88469C07190B9808K09029
18051B38837j10605c77759A24990e1529A89030m1465a16684B0201M7552g0622
18040a40351o2990A75287c52566b5696A56999i2548C9978J58348g7541j90555
18030b68096O4320b5126j45943A30127A8764K16290c2602E4046L72330b81899
$$ plain form
18109 -113809 -35616 59330 255698 -342388 -61864 -127486 -81422 43648 163252 134092 14163
18097 45426 -48606 -134451 -3249 332907 25630 42828 20179 249481 -74530 70781 62345 57842
18085 57842 647 193063 46946 -178363 -166619 -74403 257935 18639 32821 146603 242085
18074 242085 38106 -85230 21160 115073 32831 103949 152549 -8376 -141353 -203225 -58611
18062 117149 122421 47340 -14525 -185971 -122624 -478502 47728 -288469 307190 29808 238837
18051 238837 128232 -377759 124990 -51529 189030 147565 -116684 20201 67753 -70622
18040 -140351 -203341 175287 -352566 -25696 156999 -92548 39978 198326 -77541 -268096
18030 -268096 -203776 -25126 -171069 130127 18764 235054 -32602 54046 426376 -281899
18019B19647a208m9716A64923J5386p7740J00535O5244a85178c0492F3912P368
18008G1280b37687g8308J363C5786O3491m0127M1453J17497c6015A72578l2439
17997A40139A0200K0005K13505A19497d4826j82484B58275A09215g12j9908k20156
17986b40776O0502C7009N4645K0843M6903K7551n6047i4033j73922j421L4831
17975b34545B54874l8200q6563l3618C9936c31443I6918i6975I0427L2320K839
17964A25586J35542a38911E6629a19165F6855K40844c0506h189j40410e863F6874
17952B22912h4714b5380B86347I7103K65769g2267C3672c8837B04728b0454p3632
17941i4086C7941a67713C16845b14198b5261n3544F7915R1287a79529A9471c12328
$$ plain form
18019 219647 -1208 -50924 164923 180309 102569 203104 268348 -185178 -30492 63912 71280
18008 71280 -237687 -78308 -76945 35786 99277 59150 100603 218100 -36015 172578 140139
17997 140139 10200 30205 243710 119497 -44826 -227310 258275 109215 -712 -20620 -240776
17986 -240776 -180274 37009 91654 112497 159400 186951 130904 -94033 -267955 -269376 -234545
17975 -234545 254874 216674 130111 96493 39936 -331443 96918 -96975 90427 122747 125586
17964 125586 261128 -138911 56629 -119165 66855 307699 -30506 -8189 -148599 -5863 66874
17952 222912 -84714 -25380 286347 97103 362872 -72267 33672 -38837 204728 -20454 -94086
17941 -94086 37941 -167713 316845 -214198 -25261 -78805 67915 159202 -179529 19471 -312328
17929G4218j9468K7092L3527c42637I2744K2965O4746m1504j5353h2622B42427
17917b21325E9738P5461c63543e8602j13874d0882A76687a57240B41230g5012
17906b71346A44314J66995a81974H0558e4106p5670A67149O1919a19418B57976
17895a00991n806B31194k0397B4542J05289l3310L886J32886C7016J41029G8457
17883A16696J0996M0936F9494k4707L2132b92339C43636G4070i0828B93529a61449
17871a7138k90428J19956r0142a9409j39383a972B43057I525L34139a62162h225
17859B00144J14025I922L54419j53176h8272B54598j20963k4067K4553b12510
17848B5356b66557R3931H6114J08657C6853K87753j41509q6991c2688B43442j1223
$$ plain form
17929 74218 54750 81842 115369 -342637 92744 115709 180455 138951 123598 -82622 242427
17917 -221325 59738 135199 -363543 -58602 -172476 -40882 176687 -157240 241230 -75012
17906 -271346 144314 311309 -181974 80558 -54106 -129776 167149 229068 -119418 257976
17895 -100991 -106797 231194 210797 24542 129831 96521 100407 233293 37016 178045 78457
17883 116696 127692 168628 69494 44787 76919 -292339 343636 74070 -90828 293529 -161449
17871 -17138 -307566 -187610 -277752 -19409 -158792 -1972 243057 9525 343664 -162162 -8225
17859 200144 314169 9922 364341 211165 -88272 254598 133635 109568 134121 -212510
17848 25356 -266557 -172626 86114 194771 36853 324606 183097 96106 -32688 243442 232219
17837B32219g8090A63497R0990r9092o5543Q0806M9881l9973q1216i5464b4483
17825B60366A6388d0274A22453C834M08988a65505B47308E748b85664B20731I2435
17813I4248a44939M9350l5469d74B79214r3058D5153J06398J8717Q2678f7732
17801a46132d5163p8124B24705C1013a76925e2260K1173A38150p719o1858J93617
17790B62190a38485M3057e869j40684d4731A67523E0358g6545J5774B96422C0382
17778c7105a7625A61661a08975N0311B91324a46472A43152b93998L4550j67943
17768d27391D9185J58851g305A71809J78643a6044C83164F9284h8940a7744k11546
17757b29290B38200E4377b62836e3911C5670e9253b1107G5816K02346j26397c2984
$$ plain form
17837 232219 -78090 163497 254487 155395 89852 170658 220539 180566 99350 -95464 -24483
17825 260366 16388 -40274 122453 3834 412822 -165505 247308 5748 -285664 220731 92435
17813 94248 -144939 -95589 -131058 -474 279214 186156 45153 151551 170268 252946 -67732
17801 -146132 -45163 -123287 224705 31013 -176925 -52260 -31087 138150 130431 68573 262190
17790 262190 -138485 -95428 -5869 -146553 -44731 167523 50358 -76545 -60771 296422 30382
17778 -37105 -17625 161661 -108975 -58664 291324 -146472 143152 -293998 -259448 -427391
17768 -427391 49185 208036 -7305 171809 350452 -16044 383164 69284 -88940 -17744 -229290
17757 -229290 238200 54377 -262836 -53911 35670 -59253 -21107 75816 278162 151765 -32984
17745f8423A27653J47641a09965A19733A2769P0723J91745a04071B5110L2246
17735E7356d6557C6021J83809K2347K5328L8622j24242N0723a00692A69140d4137
17723B85841d8381B23047c2103F9000a60041A11988C3177L92608f7316A91630
17712F7613b26103A61195K67456k14102A4924L8181M7693k1437P4301L688n8452
17701I8898J95062A39806B9009J00616K02949f854I3919g8925A44562k5387a9849
17689A86758J00308a79822B86725A09150J59156A25964O0664a61608B96624A24834
17678d4986j30157G4941B4410P2597J96789A10521P1346p0138B2702e4019B53717
17666B39389n3437r2750J78581a0809n3969j62479C07440F7433a44056A00998
$$ plain form
17745 -68423 127653 275294 -109965 119733 12769 83492 275237 -104071 25110 57356
17735 57356 -46557 36021 219830 242177 267505 306127 181885 232608 -100692 169140 -44137
17723 285841 -48381 223047 -32103 69000 -160041 111988 33177 425785 -67316 191630
17712 67613 -226103 161195 428651 214549 14924 53105 100798 79361 153662 157350 98898
17701 98898 293960 139806 29009 129625 332574 -6854 93919 -78925 144562 119175 -19849
17689 186758 287066 -179822 286725 109150 268306 125964 186628 -161608 296624 124834
17678 -44986 -175143 74941 24410 97007 293796 110521 181867 111729 22702 -54019 253717
17666 239389 185952 93202 271783 -10809 -64778 -227257 307440 67433 -144056 100998
17655A98578b73117a6578D908h0156E9996L9304f296A55609K86558P1945A68220
17643A96404a25212q93C41846F9668L48819A61968o5633a83867d5470C9134P7295
17632A16429N1253o6976K09000l3857j12782k9245K03065A64743K49389A81955
17621B9266a67059F1010N9996Q4281J4496p2832k7075C3416J28077c24803B06360
17609b61502A11685J5400j7239j7639m0141a54036A19217A1982O2726L16976A86015
17597B41675K12233b04204g6599G02229D8660g2943A38392K13050k7399A33864
17586A78597K29489G5498k7759b8516k7880B5587J41766D5043L06501b7455C70607
17574E9133M35172j59299A21043L6685E4424c4665A59167O2080J12809b3853C47672
$$ plain form
17655 198578 -273117 -16578 4908 -80156 59996 99300 -6296 155609 442167 514112 168220
17643 196404 -125212 -126105 341846 69668 418487 161968 96335 -183867 -45470 39134 116429
17632 116429 167682 100706 309706 275849 163067 133822 336887 164743 414132 181955
17621 29266 -167059 61010 121006 205287 219783 146951 119876 33416 161493 -324803 206360
17609 -261502 111685 127085 109846 92207 52066 -154036 119217 11982 74708 391684 186015
17597 241675 453908 -204204 -76599 702229 48660 -72943 138392 351442 324043 133864
17586 178597 408086 75498 47739 -28516 -56396 25587 167353 45043 351544 -27455 370607
17574 59133 494305 335006 121043 157728 54424 -34665 159167 221247 334056 -23853 347672
17562G6299L00908A31060o1533J33682a29883H2507j7841a68072C42486j21012
17552B21474L93918A42290J4255M6563M2942L04714j29037h7678C9313J02649
17542A41962J16638k586Q0661J17544A17780L58394E5367K35441Q9481A01593
17531D88731f750A02333Q4854M51596m9290L57597L3325m8925J48184P4245m55309
17520F98610O3234k00842k00992J63565j01055r4681j1878K54199p0894O04920
17510A104186R6026m5585J07450o0948k08568m57537K23711l17765j50512J74127
17500D64585J35733B01630G55c6640F18099k61967E0583N57909A41082J32471
17490B73553J08095R393c9503F27971B47858m8478K27184j03144D5865N5385K22051
$$ plain form
17562 76299 377207 131060 69527 203209 -129883 82507 64666 -168072 342486 221474
17552 221474 615392 142290 156545 203108 246050 550764 421727 -87678 39313 141962
17542 141962 258600 256014 336675 454219 117780 476174 55367 290808 380289 101593
17531 488731 -6750 102333 187187 638783 589493 947090 980415 931490 1079674 1153919 698610
17520 698610 761844 561002 360010 523575 422520 327839 315961 570160 499266 1104186
17510 1104186 1200212 1154627 1262077 1201129 992561 535024 758735 440970 290458 464585
17500 464585 600318 201630 755 -36640 618099 356132 50583 608492 141082 273553
17490 273553 381648 391041 -39503 627971 247858 199380 426564 323420 45865 101250 323301
17479C23301N9044q7061o8724a482C88809A49462K82295j86062q9829O7846Q2388
17468C06100R6467K52489j46576I7397r85J05358e0548D67472k15748I0376K49942
17457C40318G9518J2485K50815A22255O4891K40983j76184J15053m3682K87224
17447F10540j9411B64706K59539l3708k4072p8873q3080J38981B02387K92434
17437D94821l6063J54948o7375j45815L12817C54202O4173p8481M2205J07645
17427D89744m843P8353j23049L94460B61589J44777J43377A88063K60147J95823
17417F44033A48753J51312l4410N49334k57194k01612M34633k36432G8140K33850
17407C11990N9537m4868o7628M1041J44593k3281A31659K0341J92842A32972L48254
$$ plain form
17479 323301 382345 295284 226560 -1482 388809 149462 431757 245695 155866 223712 306100
17468 306100 402567 655056 508480 97397 96412 201770 -50548 467472 251724 90376 340318
17457 340318 79518 92003 342818 122255 187146 428129 251945 366998 323316 610540
17447 610540 591129 264706 524245 490537 466465 387592 304512 443493 202387 494821
17437 494821 458758 613706 546331 400516 713333 354202 418375 339894 382099 489744
17427 489744 484901 563254 440205 834665 261589 406366 549743 188063 448210 644033
17417 644033 148753 300065 265655 814989 557795 356183 790816 554384 78140 311990
17407 311990 371527 326659 259031 300072 444665 421384 131659 152000 344842 132972 481226
17396D81226A61012K40427o9898J5796R8048K97059B69007P9642A60142J36954
17386B97096p7755p7558N225O1980e0855A76127J08795A38094J78004b27466A28599
17374A46073k2895J79478q0040J0394Q2815k2073O0794F3947L75690q1393M4477
17363D02721F1355K93035j74967P2043n9346J46994K17018B51268k0086m3301
17353A87881G1995k8855R9309L96557B5159c0683A18795K93196K64369k36425
17343D39935B08638Q8794d78D37951J0897j31893G6154L92716k09904M4022j45459
17332A57529J02636J56199r5510D4884M59765a56889A22192J3948J34546J56689
17322D27375j53911l1763Q8597r7073J82588K25444A68526H3111L78306B08681
$$ plain form
17396 481226 161012 401439 331541 347337 445385 742444 269007 348649 160142 297096
17386 297096 219341 141783 147008 208988 -50855 176127 284922 138094 316098 -227466 128599
17374 146073 123178 302656 222616 233010 315825 293752 354546 63947 439637 358244 402721
17363 402721 61355 354390 179423 251466 192120 339114 556132 251268 231182 187881
17353 187881 71995 43140 142449 539006 25159 -30683 118795 411991 676360 439935
17343 439935 208638 297432 -478 437951 448848 316955 76154 468870 258966 302988 157529
17332 157529 260165 416364 320854 44884 504649 -156889 122192 136140 270686 427375
17322 427375 273464 241701 330298 233225 415813 641257 168526 83111 461417 208681
17311D35095C1473M01600j53903J10477b8485D23904j93498k9959K60608A69787
17300B44600J60697A93932k2384K11169J21634k51098M7420J1227C9177a27889
17289A10218b5646B69839J87816j47305l2613f3929B37607J00629n7361J53226
17279D34101r5513D5031J67200K28021k07166K09324D0479K63011m232N4166G7539
17267D31786j02942a72693E01836B43085A04890N51555k36969r7753Q1044j75774
17257B26993J78876J01891K50795j98845o0306j6220j11030K7443A97395P44J53651
17246C51790J09241A88263L35763R0021B73708L824L3735j06268L79608K90232
17236H74839l76344m5608j24107J74249j31095k713K57588d6320A46091L99825
$$ plain form
17311 435095 31473 433073 279170 389647 -28485 423904 230406 200447 461055 169787
17300 244600 405297 193932 171548 382717 504351 253253 300673 311900 39177 -127889
17289 110218 -25646 269839 457655 310350 277737 -63929 237607 338236 280875 434101
17279 434101 338588 45031 212231 440252 233086 442410 40479 303490 299258 353424 77539
17267 431786 328844 -172693 501836 243085 104890 656445 419476 321723 402767 226993
17257 226993 405869 507760 758555 559710 499404 483184 372154 399597 197395 198139 351790
17246 351790 461031 188263 524026 614047 273708 277532 311267 204999 584607 874839
17236 874839 498495 452887 328780 503029 371934 369221 626809 -46320 146091 545916
17226E45916B2785M09766k3158L3824J14826B02445O5403K15868k12487l7469
17216B33760N04558k27228j42676A09571J88699K17112N097K2894q8174j80291
17206B74908Q1444J57644k51617J05501J56586j4028K18109j26850j33221J91052
17196F59528J18255l42936J78171j74629j2748O8482A35683R2701L77040k07249
17186C98175E9780L15723O6956J47514B57211N57182A74581J50455M93850B76275
17175D20136r2391Q7172k4748M76897l16341j88541R9992Q4066K3239Q767K02997
17164G81245k80494J07453R0487C47752L20804j06787k4174j70066K12465Q6730
17154F66724l7269j96230J27242M63390C15912K03992J15920J29935k44955P1890
$$ plain form
17226 545916 22785 432551 409393 443217 558043 202445 267848 483716 271229 233760
17216 233760 738318 511090 368414 109571 298270 515382 520479 543373 455199 274908
17206 274908 356352 513996 262379 367880 524466 510438 728547 601697 468476 659528
17196 659528 777783 434847 613018 438389 425641 494123 135683 228384 605424 398175
17186 398175 59780 375503 442459 589973 257211 814393 174581 325036 818886 276275
17175 420136 327745 414917 390169 867066 550725 362184 462176 546242 569481 578248 781245
17164 781245 500751 608204 698691 347752 668556 561769 537595 367529 579994 666724
17154 666724 629455 433225 560467 1023857 315912 519904 635824 765759 520804 592694
17144E92694o0310j50772N4064J15507j19830N26573C70389L18802o2621K69335
17134H95905k83455B46715N00774R7528m3431l30732R4190K44631k34388l1953
17124E43334k9435J00880j1178M4530K27246j83354Q107j4453J10377j67859O5808
17113F94003R9018B97929L67667n9974J09281K743j37776K33395C73069L27295
17103G00364l7678J77139k38254M40898D33776N53453j47666j99434k0173K38161
17093H58117j00145j24248L20737m1390r9564p9654n6306p1150l6061J36875K5899
17082G33110K26544k08527J87399l30573J56944L08150j59228J11765k78446j18874
17072F28264J54230K36617r152q4442J71198j2065j3300k46689J70109l33405
$$ plain form
17144 592694 532384 381612 435676 551183 431353 957926 370389 689191 626570 895905
17134 895905 612450 246715 747489 845017 801586 470854 565044 809675 575287 543334
17124 543334 513899 614779 603601 648131 875377 692023 700130 685677 796054 628195 694003
17113 694003 793021 297929 665596 605622 714903 717646 579870 813265 373069 700364
17103 700364 662686 839825 601571 1042469 433776 987229 839563 640129 619956 858117
17093 858117 757972 633724 954461 913071 813507 733853 677547 606397 570336 707211 733110
17082 733110 959654 751127 938526 607953 764897 1073047 913819 1025584 747138 628264
17072 628264 782494 1019111 1009959 925517 1096715 1084650 1071350 824661 994770 661365
17062F61365J20676J97865j42674K67842j1058k75822K51957J9434J11217k65734
17052I35068J66856l08577O5489K37340j4357l26628Q5489K10977p805j03397
17042I40455N7431n2690K09322o6595O6941l78172K88160L8165k74684Q70J92965
17031A022168O9456j10409Q888L36753n22272L63641n9191k68077K30352j4458
17021A056851L17807m18299J22056L72284k91885J93814k88047n2664L19096k86613
17011A044400M3424L4110j66416L19092p9526k06760j88593O22165j9734j24095
17001A278067l1787K2597j76228K37656J94341J70345m92858J26765R5685K76998
16991A701581m53160m4753K87652K19507l03475J26434k23140O0846K33313j50714
$$ plain form
17062 661365 782041 979906 837232 1105074 1094016 818194 1070151 1089585 1200802 935068
17052 935068 1101924 793347 858836 1096176 1081819 755191 840680 1051657 1043852 940455
17042 940455 997886 945196 1154518 1087923 1154864 776692 1064852 1103017 828333 829203 1022168
17031 1022168 1091624 981215 990103 1326856 804584 1168225 1109034 840957 1071309 1056851
17021 1056851 1374658 956359 1078415 1450699 1158814 1352628 1064581 1011917 1331013 1044400
17011 1044400 1087824 1121934 955518 1274610 1195084 988324 799731 1421896 1402162 1278067
17001 1278067 1246280 1268877 1092649 1330305 1524646 1694991 1202133 1328898 1424583 1701581
16991 1701581 1248421 1203668 1491320 1710827 1407352 1533786 1310646 1371492 1604805 1454091
16981A454091l40733M35757j30698K23788J62270j70612j24578J75602k90242
16972A394645L56570j09923k35365O369O7916k5476J65618k10493K44271k7646
16962A626486n5102K41463r460J66633m31515Q9609R0137J08074R8656q1012m4891
16951A799078j58048N8349J88440J41157j45348l2469L03356l20803J68164K45962
16941B247838l53040k49192O28961k74171K1011K36911j36772m8190n2107J7903
16931B039152K76880j82953K10806K6234k64389K2729K7306j46096p0136O14939
16921B554472j88367J09465K13852m22481M54749j33768l05648M59940k30594
16912B511620J18309j29689M18825r0800K44591n30413K39206j17811N4208K42911
$$ plain form
16981 1454091 1113358 1549115 1418417 1642205 1804475 1633863 1509285 1684887 1394645
16972 1394645 1751215 1641292 1405927 1412296 1480212 1454736 1620354 1409861 1654132 1626486
16962 1626486 1571384 1812847 1803387 1970020 1538505 1628114 1718251 1826325 1924981 1843969 1799078
16951 1799078 1641030 1699379 1887819 2028976 1883628 1851159 2154515 1833712 2001876 2247838
16941 2247838 1894798 1645606 2274567 2000396 2021407 2258318 2121546 2073356 2021249 2039152
16931 2039152 2316032 2133079 2343885 2370119 2105730 2128459 2155765 2009669 1939533 2554472
16921 2554472 2366105 2475570 2689422 2266941 2721690 2587922 2282274 2742214 2511620
16912 2511620 2629929 2500240 2919065 2828265 3072856 2542443 2781649 2663838 2718046 2960957
16902B960957J31613k43222K71412j13350L21970l90014N61421k78790Q7203j36633
16892C172567K27943j16997M94774l47259L04217m51159K14576j9330J16565j61839
16882C434058L58006Q4828k43594J90851J79797k05629K95946j30490J39567j68100
16872C935240K95254j15016j06715K30726J13387K2731N4780o1967L10444k39792
16862D439072K68466K90817k88249j37012M50577J61226l70451M93377k59065
16853E048758R4497M57709n9776K61711K1741l23483L01436O1070M81417l10926
16843F034154J52730L96809l51891K19797J60759P2852M6301J2781N47279j9284
16833G272287M4586j51924K13893J90659l47K84185K07642K19116j20827K80602
$$ plain form
16902 2960957 3092570 2849348 3120760 3007410 3329380 2939366 3500787 3221997 3309200 3172567
16892 3172567 3400510 3283513 3778287 3431028 3735245 3284086 3498662 3479332 3595897 3434058
16882 3434058 3792064 3876892 3633298 3824149 4003946 3798317 4094263 3963773 4103340 3935240
16872 3935240 4230494 4115478 4008763 4239489 4352876 4375607 4430387 4368420 4678864 4439072
16862 4439072 4707538 4998355 4710106 4573094 5023671 5184897 4814446 5307823 5048758
16853 5048758 5143255 5600964 5541188 5802899 5824640 5501157 5802593 5863663 6345080 6034154
16843 6034154 6186884 6583693 6231802 6451599 6612358 6685210 6731511 6744292 7291571 7272287
16833 7272287 7316873 7164949 7378842 7569501 7569154 7853339 8060981 8280097 8159270 8439872
16823H439872P1319J95997J20699M53595p8829J19242l8032O91946m7557L78631
16813A0306883K76119J38670M9106L23479j34067M86695N07919K7928J16328N07417
16803A2606477m1417M45677L13903K50743N26119j12494M56041K64751M94181
16794A5203981K03326M20249Q42160O4029M37055M51743K59626M86989K44694
16785A8613852N98944P58723L01634O07512R96516L29338M78282P28873P52162
16776B4165836L34252J127359N13120J156169L91622R89361Q76658J001016O97912
16767C1253305R92504J176049J324035P95522J013008J509699J140781J314947
16759D0519850J718004J110102J426024J849704J353324J448322J998057J717792
$$ plain form
16823 8439872 8511191 8707188 8827887 9281482 9202653 9321895 9283863 9975809 9928252 10306883
16813 10306883 10583002 10721672 10770778 11094257 10960190 11446885 11954804 11982732 12099060 12606477
16803 12606477 12565060 13010737 13324640 13575383 14101502 13989008 14445049 14709800 15203981
16794 15203981 15407307 15827556 16669716 16733745 17170800 17622543 17882169 18369158 18613852
16785 18613852 19212796 19971519 20273153 20880665 21877181 22206519 22684801 23413674 24165836
16776 24165836 24500088 25627447 26140567 27296736 27688358 28677719 29554377 30555393 31253305
16767 31253305 32245809 33421858 34745893 35541415 36554423 38064122 39204903 40519850
16759 40519850 42237854 43347956 44773980 46623684 47977008 49425330 51423387 53141179
16751E3141179K067591J765951J915729K430177K148384K308316K133987K202888
16743G0114202K508615K594669K427903K864052K454625K936808K488467K683793
16735I1073134K927617K751195K226729K608159J932700K998874J765647K254678
16727A10538733J637286J569035J727011J107722M91759O70741L49888j03044
16719A17989131J37058n06357j201655j614798j249051j306371j962422k313976
16711A07971559j880199k705769k312613k451617k695689k603717k923035k819189
16703H7579731k644834k927602k323726k545902l072846k761851k292753k144897
16695F6865320k362041k476536k108952k184866k250218j711930k212860j325081
$$ plain form
16751 53141179 55208770 56974721 58890450 61320627 63469011 65777327 67911314 70114202
16743 70114202 72622817 75217486 77645389 80509441 82964066 85900874 88389341 91073134
16735 91073134 94000751 96751946 98978675 101586834 103519534 106518408 108284055 110538733
16727 110538733 112176019 113745054 115472065 116579787 117071546 117742287 118092175 117989131
16719 117989131 118126189 117619832 116418177 114803379 113554328 112247957 110285535 107971559
16711 107971559 106091360 103385591 101072978 98621361 95925672 93321955 90398920 87579731
16703 87579731 84934897 82007295 79683569 77137667 74064821 71302970 69010217 66865320
16695 66865320 64503279 62026743 59917791 57732925 55482707 53770777 51557917 50232836
16687E0232836j909294j819571j745620j809720j747567j011445j520969j197864
16679C7470786q35881j383739j195756j408985q56773r85635r26017j080919q47754
16670B7949327r07146q43806l36084j119803p01234j042068l31194n80622j010228
16661B1077142j36493n52574r83282p15244m22590m15993m35385j96951p31459
16652A6487171m34801k29977n37712j64636l23423o12348l07379o3807n93218
16643A3219870n9678k03386n13339o02211j3470m15135q6695J1741l23778l41800
16633A0672119R7921l12988n37876m09169p7747O7683l84826m26510j92924L42712
16623H838395m67807n2647M733k79269j85414j78790M1017j09275k05661l30476
$$ plain form
16687 50232836 48323542 46503971 44758351 42948631 41201064 40189619 38668650 37470786
16679 37470786 36634905 35251166 34055410 32646425 31789652 30804017 29878000 28797081 27949327
16670 27949327 27042181 26198375 25862291 24742488 24041254 22999186 22667992 22087370 21077142
16661 21077142 20940649 20388075 19404793 18689549 18266959 17850966 17415581 17218630 16487171
16652 16487171 16052370 15822393 15284681 15120045 14796622 14184274 13876895 13813088 13219870
16643 13219870 13160192 12956806 12443467 11841256 11827786 11412651 11325956 11337697 11013919 10672119
16633 10672119 10770040 10457052 9919176 9510007 9432260 9499943 9115117 8688607 8495683 8838395
16623 8838395 8370588 8317941 8322674 8043405 7857991 7679201 7720218 7610943 7405282 7074806
16613G074806N471O883k09193m03509j25942Q153q8491l4250k2316j16506r1158
16602F003948k49544j51178J4001O7116k90229Q6111l28507O146l2392j03591
16592E021881J13196k76620p2327N3569M2905j74101k79161k9984l3887j02379
16582D263092K18391m10273J29490k12397o4335J55386j13482k04748J64222m59931
16572C465415P48636k44346q4811l92030M27336m49128j2174j94860p9777Q2567
16562C266828j35296Q0884M80791n95302j20168p1382q0906L26232l64799O570
16552B793452K75634m64393K60372Q2623j05413j86755q5284j46620L52693k48344
16542B527965k00046k6407O50964m58083J14659j93860l5440L7396J70213J23509
$$ plain form
16613 7074806 7080277 7087160 6877967 6474458 6348516 6356669 6268178 6233928 6211612 6095106 6003948
16602 6003948 5754404 5603226 5617227 5684343 5394114 5480225 5151718 5157864 5125472 5021881
16592 5021881 5135077 4858457 4786130 4839699 4882604 4708503 4429342 4399358 4365471 4263092
16582 4263092 4481483 4071210 4200700 3988303 3923968 4079354 3965872 3761124 3925346 3465415
16572 3465415 4214051 3969705 3884894 3492864 3920200 3471072 3458898 3264038 3184261 3266828
16562 3266828 3131532 3212416 3693207 3097905 2977737 2906355 2825449 3151681 2786882 2793452
16552 2793452 3069086 2604693 2865065 2947688 2842275 2655520 2570236 2423616 2776309 2527965
16542 2527965 2327919 2301512 2952476 2494393 2609052 2415192 2379752 2417148 2587361 2710870
16532B710870m26224J84912J16531l61219k81101L02271J5152j70837N24427j002575
16522A612207L50078l2316J23564N978j98863R5739k46338k0693J89556R3532
16512A972444j58288j84259L95684k26972J76781l31830K38513m34654K04905
16503A652324k41479K52145l5052J70375L55312j52970l91242l35160N11076l83645
16493A401684K11639n8980O4486j01874k40898K17537Q765k45571M84593n52499
16483A188882K02103J27124K1726l02314L53690m99605J27837m3645K59668k73691
16473A161775J46946J38030j38203P6346j60676K10613R9700m11911m573k68545
16463H49502M74919K39841l83316J45232m46358K03440R7285l51703J42889J36778
$$ plain form
16532 2710870 2284646 2469558 2586089 2224870 1943769 2246040 2261192 2090355 2614782 1612207
16522 1612207 1962285 1929969 2053533 2059511 1860648 1956387 1710049 1689356 1878912 1972444
16512 1972444 1814156 1629897 2025581 1798609 1975390 1643560 1882073 1447419 1652324
16503 1652324 1410845 1662990 1627938 1798313 2153625 2000655 1609413 1274253 1785329 1401684
16493 1401684 1613323 1554343 1618829 1516955 1276057 1493594 1502359 1256788 1741381 1188882
16483 1188882 1390985 1518109 1539835 1237521 1591211 1091606 1219443 1175798 1435466 1161775
16473 1161775 1308721 1446751 1308548 1384894 1224218 1434831 1534531 1122620 1118047 849502
16463 849502 1324421 1564262 1180946 1326178 879820 1083260 1180545 828842 971731 1108509
16453A108509J387L1338r3329K75238l53562J04997N9546m14478J73267R6181
16443I89094j34645J93898j75546L5269M97009o63112m5777L15110j94047p8371
16433G38882j57816L9313N40109R6424l99940j30210K02445j95393M72663l32716
16423H73761l6655J3227j43701K04418j5206R469j65690o9107J55299K20572j54458
16412H91929k70574j11804L6715N11973J8532l39261Q6775J3519o9574K42814
16402A011044r3480j64720J19170n2464o5969j68937J90177j34766o3341Q3840
16392F60554K3488k19340M26016m1264r4584l23747O38595j41645l25224J41285
16382G44134J97658B84412J60869B05828N47831K81173m94059J41098l6536j83617
$$ plain form
16453 1108509 1109896 1141234 1047905 1323143 969581 1074578 1134124 719646 892913 989094
16443 989094 854449 1048347 872801 908070 1405079 741967 696190 1011300 817253 738882
16433 738882 581066 620379 1160488 1256912 856972 726762 929207 733814 1206477 873761
16423 873761 837106 850333 706632 911050 895844 905313 739623 670516 825815 1046387 891929
16412 891929 621355 509551 546266 1058239 1076771 737510 824285 837804 768230 1011044
16402 1011044 917564 752844 872014 819550 753581 584644 774821 640055 576714 660554
16392 660554 684042 464702 890718 849454 754870 431123 1069718 928073 602849 744134
16382 744134 941792 284412 445281 205828 753659 1034832 540773 681871 645335 461718
16372D61718K6739n1128N4825J45864j650q1598J17228k10234J18661l3433M6896
16361E93888B67678L14732j50322P7977j63410J48170k5522H0958N44929k14606
16351D11281q126j8128o3182J74710J08392l9541j48111J72457j85640K94862
16341F98974E4472M36643l2990J15300n0263j08411J79651j25514o9996J12175
16331E11067j6360q973J71056k28709r0430J47905j72488O3349j75302J21833
16321C22948K31756B71587M05015B68751L30281B78452M00391B39134K10131J37079
16311E86344J07060r1641B87288M42433A19137J56287n7447q0056L35862r5040
16301C78743o2602K83621j40724M8083A78045K40012o7205A4212P60118C18625
$$ plain form
16372 461718 488457 437329 492154 638018 636368 554770 671998 461764 580425 546992 593888
16361 593888 267678 582410 432088 510065 346655 494825 469303 80958 625887 411281
16351 411281 403155 385027 321845 496555 604947 565406 417295 589752 404112 698974
16341 698974 54472 491115 458125 573425 523162 414751 594402 468888 398892 511067
16331 511067 494707 485734 656790 428081 337651 485556 313068 376417 201115 322948
16321 322948 554704 271587 676602 268751 599032 278452 678843 239134 449265 586344
16311 586344 693404 601763 287288 729721 119137 275424 217977 137921 473783 378743
16301 378743 316141 599762 459038 507121 178045 418057 350852 14212 774330 318625
16290B45742O4947R5845J62820B17144M73761l24008J31371m5424M3736k37158
16280B59422q0981J37218L29040B78254a43380D42046A46461M5132a02568B59064
16269B36831M3751q4087j2836K5426k1207k2156J87408p6975O6810A38805K86410
16258D25215F6749O8774K83812I3017J81809j07332L48780B25385L64923B53118
16247F7819J42110m4255G3556M62887j27854j79020K11248j87593L74L9655k3030
16236B70223A02569J53106q7552m4950j0279l2582J65417M2577R3481A46632l2764
16225A13868K36415D6575K6192L24540a09743D38633I4728Q0352a9533C05422
16214B87151J2075Q2576A29181M60432A23041J11586J56178I5450J94662m6348
$$ plain form
16290 245742 310689 406534 569354 217144 690905 366897 498268 452844 496580 259422
16280 259422 178441 315659 644699 278254 -143380 442046 146461 191593 -102568 259064
16269 236831 280582 196495 183659 209085 187878 165722 353130 276155 342965 138805 425215
16258 425215 66749 135523 419335 93017 274826 167494 516274 225385 590308 253118
16247 67819 209929 165674 73556 536443 408589 229569 440817 253224 253598 293253 270223
16236 270223 102569 255675 168123 123173 112894 80312 245729 288306 381787 146632 113868
16225 113868 350283 46575 72767 397307 -109743 438633 94728 175080 -19533 305422
16214 287151 299226 381802 129181 589613 123041 234627 390805 95450 290112 243764
16204B43764A042L95170j58600I2564Q0862r14N5724F7765K76523j34476K77089
16193D86901H3979c0008C84145r9697A00601J01068L44551B67339j28989E829
16182h8513b3697A45861f552C08476l8388i6284H3930L19866B443J12573K30778
16171C45794d6802p4061B08047J63741A64034J44986c2571A91995J56888A56542
16160a53749B27872J31236C1388K47786j17709q0608M5552E9338J72469c606r3860
16149i7466A82683C1615O8750a62877A69525K73636i5858L3588J8249C16274j52738
16138A63536N6513L18419a33440C61635A4560L35350j53760a76397H5481m2356
16128D3125J38542H3480b45239D43633c2548A62149Q0722i5848C65666D6345M3244
$$ plain form
16204 243764 1042 396212 237612 92564 173426 172512 228236 67765 344288 209812 486901
16193 486901 83979 -30008 384145 284448 100601 201669 546220 267339 138350 5829
16182 -88513 -23697 145861 -6552 308476 270088 -96284 83930 403796 2443 115016 345794
16171 345794 -46802 -120863 208047 371788 164034 309020 -32571 191995 348883 156542
16160 -153749 227872 359108 31388 279174 161465 80857 126409 59338 231807 -3606 -97466
16149 -97466 182683 31615 100365 -162877 169525 443161 -95858 -62270 -44021 316274 163536
16138 163536 220049 538468 -133440 361635 14560 349910 196150 -176397 85481 43125
16128 43125 181667 83480 -245239 443633 -32548 162149 242871 -95848 365666 46345 89589
16117H9589J45469d5050B8840a75279A3490K92942j52913g0756F8961j1255a34919
16105A16083N2262E437K45028K8707b4396B85673A786K62742A01639J41020b04372
16093a92179A47222L79465A90384m5530F0965K46805I4872R4206l702a00929c4029
16081G8106b3199E4791i2490A32156o5000d6192D992b8570A89760E6985a34080
16069e9538A51411K03389j59553a9232I2808D5164a25888A75756n1534e6429H6937
16057b69524C07036a58448A04129O4239G457K135a16160C18180a84089c5224r6034
16046a31258j86328A88550A199J14520j5642B7905a23359A55671G2823a29596
16035A41031g4712B61318A09337Q786O4464J67374a90796m6180I008K7793e3056
$$ plain form
16117 89589 235058 -45050 28840 -175279 13490 306432 153519 -70756 68961 57706 -134919
16105 116083 168345 5437 250465 279172 -24396 285673 1786 264528 101639 242659 -204372
16093 -192179 147222 526687 190384 144854 60965 307770 94872 189078 185376 -100929 -34029
16081 78106 -23199 54791 -92490 132156 67156 -46192 4992 -28570 189760 56985 -134080
16069 -59538 151411 354800 195247 -19232 92808 45164 -125888 175756 124222 -56429 86937
16057 -269524 307036 -158448 104129 168368 7457 9592 -116160 318180 -184089 -35224 -131258
16046 -131258 -317586 188550 1199 115719 100077 27905 -123359 155671 72823 -129596
16035 141031 -74712 261318 109337 118123 182587 349961 -190796 -236976 9008 36801 -53056
16023a29280K7939B11134q4879p313l1401J51185A06677l2875m170g9229d380
16011B81697e727D1928a7692A17623i6392C4181A1586J64878F7863K35209H3424
15999h6149j25115A00089m1321L35394A26888m3457b83450A03246a4629j04084
15989a18713B80806r3116K91387L61443J75765J59555j20797D40946J71155k14579
15979C97522Q9769k1322A71096E1333J63877E7484M6844h1268F3915a00277j6791
15968a17068L8977j8518k05155g2676l94848A92726d1126l9832j71208N5839C0659
15956b03205P4433k21207A40494E0506g5641E4320K56558f2086K7779H530K47825
15945B56355a12019f591j20623b3391C42386d9748p0486A55190n5468c08599C2996
$$ plain form
16023 -129280 -101341 211134 126255 118942 87541 238726 106677 73802 69632 -79229 -4380
16011 281697 -5727 41928 -17692 117623 -96392 34181 11586 176464 67863 303072 83424
15999 -86149 -211264 100089 58768 394162 126888 83431 -283450 103246 -14629 -118713
15989 -118713 280806 187690 479077 840520 1016285 1175840 1055043 440946 612101 397522
15979 397522 487291 465969 171096 51333 215210 57484 104328 -81268 63915 -100277 -117068
15968 -117068 -78091 -96609 -301764 -72676 -467524 192726 -41126 -80958 -252166 -196327 30659
15956 -203205 -128772 -349979 140494 50506 -75641 54320 310878 -62086 -34307 8530 256355
15945 256355 -112019 -6591 -127214 -23391 342386 -49748 -120234 155190 99722 -308599 32996
15933B77772n3618a3961B10635b24615a8807H2600c7697G4625j1317K9023a33944
15921A02948O7170a73224I9121c12845I4656k4065a61423O0011B8771J42543a3653
15909A9109b75178a08641D4817a67482d195k15522g9105j10700C9144J64995a98108
15897A91623C5188e3659j37232p363L7509I5355A9194K49773A19161Q2905r5476
15886A06590a82812c9065C29061f0507m3411F1926a26060A09281m2171a62361
15875a43169B09555H0072c2410A16859i2107A51468N555c652B4208n254L8050
15864E7004A970J24797a54316J1513J6316h774j31610C11118b41772A8605d2011
15852A70539a8476B20835P7394a45056a2884B07890b07022D3935J04898K77071
$$ plain form
15933 277772 224154 -13961 210635 -224615 -18807 82600 -37697 74625 63308 92331 -133944
15921 102948 170118 -173224 99121 -312845 94656 70591 -161423 -101412 28771 171314 -13653
15909 19109 -275178 -108641 44817 -167482 -4195 -219717 -79105 -189805 39144 204139 -198108
15897 191623 35188 -53659 -190891 -198254 -160745 95355 19194 268967 119161 202066 106590
15886 106590 -182812 -39065 329061 -60507 -103918 61926 -126060 109281 67110 -162361
15875 -143169 209555 80072 -32410 116859 -92107 151468 157023 -3652 24208 18954 57004
15864 57004 1970 126767 -154316 -142803 -126487 -8774 -140384 311118 -241772 18605 -42011
15852 170539 -18476 220835 298229 -145056 -12884 207890 -207022 43935 148833 425904
15842D25904h7869o3597G5592J58964i2121j71750A63229E8041b3157D3165Q380
15831E1545a96994C38082e8852j64108a6695A69198A9237i3537B35839g894m1242
15820d9136j20380j03056h2433A58662b43321h7446j09430F1503J48129b08392
15809b13870B3034K09824a98890H2772L0472j5275a39195C54695A48390i8823
15798C03131b03306e4403k83552b2049A92669p4736J55523A21163M6308c4094
15787F2312J79115a82369A65791m3331N3406e2673C06640i172j47962B32354I4004
15775i4797I4549D0345a56570A0742M7304K6513N4761l6936i6160p6101a2593
15763I4079C9948A6182i9944d8786A40763a79643d1615B76013E4460K30483j32846
$$ plain form
15842 425904 -87869 -151466 75592 234556 -92121 -263871 163229 58041 -23157 43165 51545
15831 51545 -196994 338082 -58852 -222960 -16695 169198 19237 -93537 235839 -7894 -49136
15820 -49136 -169516 -272572 -82433 158662 -243321 -87446 -196876 61503 209632 -208392
15809 -213870 23034 232858 -198890 82772 113244 97969 -139195 354695 148390 -98823
15798 303131 -203306 -54403 -337955 -22049 192669 117933 273456 121163 167471 -34094
15787 62312 241427 -182369 165791 122460 175866 -52673 306640 -9172 -157134 232354 94004
15775 -94797 94549 40345 -156570 10742 58046 84559 139320 102384 -96160 -172261 -12593
15763 94079 39948 16182 -99944 -48786 140763 -179643 -41615 276013 54460 284943 152097
15752A52097E2294a33687A22201J14205a78273G1147f7588A99651h1357D3169
15741d1470r7482A37781j4859a03138d0362A04979M784a14112n81o9030A19381
15729F634a76609B1204a72748D559g9673A91326a31492j26977D7016b75304B13255
15717A95006d35534f7244h296A08518b09435M7531j19553F4897M1234J64700A27082
15705a94372F3101g9991o061A99292b04007m2039h4694A40281i3782j43220e4322
15693a49372l6485j15157J18759A10209R4250a98912E7932c31951H2689a64658
15682G6747N4598a71072O7674o1909B26351b80306i9004a0120B98930i5977A12588
15670C8027L8680a14589N6341q9423N0136k23575A20805C7423J13082b62357k11796
$$ plain form
15752 152097 52294 -133687 122201 236406 -178273 71147 -67588 199651 -81357 43169
15741 -41470 -138952 137781 122922 -103138 -40362 104979 109763 -114112 -114693 -183723 119381
15729 6634 -176609 21204 -172748 4559 -79673 191326 -131492 -258469 47016 -275304 213255
15717 195006 -435534 -67244 -8296 108518 -209435 -161904 -281457 64897 106131 270831 127082
15705 -194372 63101 -79991 -86052 199292 -204007 -246046 -84694 140281 -93782 -237002 -54322
15693 -149372 -185857 -301014 -182255 110209 204459 -198912 57932 -331951 82689 -164658
15682 76747 131345 -171072 -103398 -165307 226351 -280306 -99004 -10120 298930 -95977 112588
15670 38027 76707 -114589 -58248 -147671 -97535 -321110 120805 37423 150505 -262357 -474153
15659d74153A88882o5256o187a95784D6060a60245b8199G0132K6484a63460C0823
15647b39972h7712A92061k9828J39424F5287C1938f9490B99709j42248L211m7364
15636A13308E824a32430j03671D4642d8718E3969e6925j0568b1138B21206g3922
15624A46029m4353h4611A16665a96808A1611J20104o3390c11247N4457M6263A16728
15612c35565e5289p2368A74923E7684b04432B7864b08595A63702d0089n252m8040
15601i3381f137l2607B59628d4969A22637e3953i590n9607K1084D3653J09667
15590A53320o1724b0558B18530j09124k6855P1862D762d9001k24745A23606b07912
15578F2436J06151D6327M4751d12086A79066a35850M4054A46911a68598A63627
$$ plain form
15659 -474153 188882 123626 117439 -195784 46060 -160245 -28199 70132 96616 -163460 30823
15647 -239972 -87712 192061 162233 301657 65287 31938 -69490 299709 157461 160672 113308
15636 113308 5824 -132430 -236101 44642 -48718 53969 -56925 -67493 -21138 221206 -73922
15624 146029 101676 -84611 116665 -196808 11611 131715 68325 -311247 -256790 -210527 116728
15612 -335565 -55289 -127657 174923 57684 -204432 27864 -208595 163702 -40089 -45341 -93381
15601 -93381 -6137 -38744 259628 -44969 122637 -53953 -9590 -69197 -48113 43653 153320
15590 153320 91596 -20558 218530 109406 82551 154413 4762 -49001 -273746 123606 -207912
15578 62436 168587 46327 91078 -412086 179066 -135850 -91796 146911 -168598 163627
15567a39682m9196B2954R4555h1185B34691j16373c76152g3493h716l03248d6630
15555b06131C36951D0542O0677c9031B09895A1873Q7080a07901D9885c4571F0670
15543F5886M9898m8158B3932O350J9484h2187G7949M4572J09901b3888A23282
15531b3606j14536j06423f7442G1264i2950B41010r0269f865j87368o2733B32296
15519a46554f9770C01805A18223K35857A1432K87543G4899J50015A2738L61927
15509C74665K1825e9205A4432K23842J21452A06928K62329L7621a30355A14522
15498C07445j40954M0377E4030K28249c9622B90464R3897A36345m5631o453d08852
15486A12480b1565D05952j78000b45188A34400h6552G200K99288a1251C33795
$$ plain form
15567 -139682 -188878 22954 117509 -81185 234691 118318 -376152 -73493 -8716 -311964 -46630
15555 -206131 336951 40542 101219 -39031 209895 11873 98953 -107901 49885 -34571 60670
15543 65886 115784 67626 23932 30282 49766 -82187 77949 122521 232422 -23888 123282
15531 -23606 -138142 -244565 -67442 71264 -92950 241010 150741 -6865 -194233 -256966 232296
15519 -146554 -69770 301805 118223 354080 11432 298975 74899 224914 12738 374665
15509 374665 396490 -59205 14432 238274 359726 106928 369257 406878 -130355 114522
15498 307445 166491 206868 54030 282279 -39622 290464 384361 136345 90714 84261 -408852
15486 112480 -21565 405952 227952 -245188 134400 -86552 7200 306488 -11251 333795
15475B14988L81815N4072N18046l51655C79424A89193i2847A43994M8506K3631
15465B16131b63148A39810A9606P7858D4364b02023A37852k1731K7269l1635J87222
15454B98977j17106K88770B0217P2707J75994A02656J31664j01448R3588R9012
15444C25472L05522L17266J31323L31708R6594j90115m05764l15387B09128M7100
15434B56228J84j25837B8079f8971a7486C4061a6088l95797a83178G7620J55639
15423B33259J67041a9038B00451C3028K01092a19186A68265a65424A73852k5813
15413A48039C166K42325b0045C03116a50444n1298E3756d3496j19655F3140L1218
15402I4358f6514H4381i5790j35919a00841o9385E5155i1116A00420B8829b6319
$$ plain form
15475 214988 596803 650875 1168921 817266 379424 189193 -92847 143994 192500 216131
15465 216131 -263148 139810 19606 97464 44364 -202023 137852 116121 143390 111755 298977
15454 298977 181871 470641 20217 92924 268918 102656 234320 132872 226460 325472
15444 325472 630994 948260 1079583 1411291 1507885 1317770 912006 596619 209128 256228
15434 256228 256412 130575 28079 -68971 -17486 34061 -16088 -411885 -183178 77620 233259
15423 233259 400300 -19038 200451 33028 234120 -119186 168265 -165424 173852 148039
15413 148039 3166 245491 -20045 303116 -150444 -201742 53756 -43496 -163151 63140 94358
15402 94358 -66514 84381 -95790 -231709 -100841 -170226 55155 -91116 100420 28829 -26319
15390B09554l4313P4615a96826A55177A5694h4808I9725a37204I7040B4989J79782
15379B04771m2655e7169H6750g0243B85449K22753e6161C84524H3829J38120o1042
15368A60907M12662k16840k2243B9143J51244F8691J56466l9757q82L43119j94580
15357C33057l9184E1613L85224A33753j0213J04880L3798o3604b23480a4992A11423
15345A64028N6644M6931p4271M57843O4199A87228J15201L369E4116O042a4864
15333D11810j43325g3407D2035J3755L8380b9338B07309q6024K00452C1366e0970
15321d023H0265K6519J10417D4969R3814K94355A40886C0234K11771K1042j12499
15310A50548n6593J15012L7371a35856A62373h1120I8868K5698J81175h1840K8053
$$ plain form
15390 209554 175241 249856 -196826 155177 15694 -84808 99725 -137204 97040 24989 204771
15379 204771 162116 -57169 86750 -70243 285449 508202 -56161 384524 83829 221949 160907
15368 160907 573569 356729 334486 29143 180387 68691 225157 185400 184518 527637 333057
15357 333057 293873 51613 436837 133753 123540 228420 262218 198614 -223480 -14992 111423
15345 164028 220672 267603 193332 651175 715374 187228 302429 305798 54116 60158 -14864
15333 411810 268485 -73407 42035 55790 94170 -29338 207309 121285 321737 31366 -50970
15321 -4023 80265 106784 217201 44969 138783 433138 140886 30234 242005 263047 150548
15310 150548 93955 208967 246338 -135856 162373 -81120 98868 124566 305741 -81840 -53787
15299e3787B36119H4344B4604Q3193b18518f1600J1796F3425J43260o7086a41615
15287F0465R0414l7499P2495p1938f0028G767O3847a18371j49186A5529R9848
15276A15377n0347J33665b37093J14440d7980D5260K852h6699A31810E7717B1597
15264A8398G685a88611C3599K93784j17364A5564a65948d0779h545B57198A21910
15252B242c14922I0840L06318a67899A61308J174J85740j14787J47894P52J33959
15241E16040J156865K25957j46045K58445p34333E97748k39208A48446d1499C61638
15230C36450b15678B60702A20097C3008D740J3801b12417A63351i9742b792A79554
15218a78410A04566J10714q0584O3862F3078R4286b3390A2251J24263M9209K63958
$$ plain form
15299 -53787 236119 84344 24604 107797 -218518 -61600 -49804 63425 206685 139599 -141615
15287 60465 150879 113380 185875 113937 -60028 7767 71614 -118371 -267557 15529 115377
15276 115377 65030 198695 -237093 -122653 -47980 45260 48112 -86699 131810 57717 21597
15264 18398 7685 -188611 33599 327383 210019 15564 -165948 -40779 -8545 257198 121910
15252 2242 -314922 90840 397158 -167899 161308 162482 348222 233435 381329 382081 516040
15241 516040 1672905 1898862 1752817 2011262 1276929 597748 358540 148446 -41499 361638
15230 336450 -215678 260702 120097 33008 4740 18541 -212417 163351 -99742 -2792 179554
15218 -178410 104566 215280 134696 198558 63078 157364 -23390 12251 136514 185723 449681
15207D49681q7835a34674C54020m1468a47007B11759K18406A27102g2088C795
15196D5586J94621Q9268d6090E2176M57009A09394O7492l8267J18717C6240J06478
15185A42718N8496F2804a34263j7655D19055A25178J70924p6008f8532A70217
15174d506l781C93291q80G278K38132j4552a16589r4283b3405B18934l7474c47346
15161a8584j83131B35382b43393F5500e7305A84539F9024J96171e4633k3239j86233
15150b64105B12615i6348B08051B4688J09105J80857f8978j20546A62557b67041
15139B38657G4996R7875L9545n8714D9223b32640C24097L379R7142A22048m0145
15128H1903D352N26711k10806e0877D82851A89449O5955J8961J45949j84438K69224
$$ plain form
15207 449681 361846 -134674 354020 312552 -147007 211759 430165 127102 -72088 3795
15196 45586 240207 329475 -46090 52176 509185 109394 176886 138619 257336 36240 142718
15185 142718 201214 62804 -134263 -151918 419055 125178 296102 220094 -68532 170217
15174 -4506 -8287 393291 392411 7278 245410 230858 -116589 -210872 -23405 218934 181460 -347346
15161 -18584 -201715 235382 -243393 65500 -57305 184539 69024 265195 -54633 -77872 -264105
15150 -264105 212615 -96348 208051 24688 133793 314650 -68978 -189524 162557 -267041
15139 238657 74996 172871 212416 153702 49223 -232640 324097 327476 424618 122048 81903
15128 81903 4352 531063 320257 -50877 482851 189449 255404 274365 420314 235876 505100
15117E05100o7318j13572r7785o276a193A83275q3596O2711B4510O1614d0278
15105F7727K3336J19501b7B90783j07632C1763K5009Q724d3073A38113F1014J77314
15093B38328G7691J14362C7311M7431J86224j33931B3408J12490o4798c6646D01559
15081f4127B19950k1359N4299E8487K60913F9904k5645K28551N002J78656p4788
15070C81680A80278L8919K77904A3542N7726K12296j23100p8831O1892M90489
15060F34014c315C8141a16513A1702h2780C7717M95311B00812P8711n4981M74123
15049F98665k31621k31052I6289M68399G2353d8754B44355J81990k0302m9933
15039C56110Q0364J38750A32028J24400K55504J03925O8805j38842j58126L53050
$$ plain form
15117 505100 437782 324210 226425 220149 -1193 183275 99679 162390 24510 86124 -40278
15105 67727 91063 210564 -27 290783 183151 31763 56772 65496 -43073 138113 61014 238328
15093 238328 77691 192053 37311 84742 270966 137035 23408 135898 71100 -36646 401559
15081 -64127 219950 198591 252890 58487 319400 69904 44259 272810 277812 456468 381680
15070 381680 180278 219197 497101 13542 71268 283564 160464 81633 143525 634014
15060 634014 -3315 38141 -116513 11702 -82780 37717 533028 200812 279523 224542 698665
15049 698665 467044 235992 96289 564688 72353 -48754 244355 426345 406043 356110
15039 356110 436474 575224 132028 256428 511932 615857 684662 545820 387694 740744
15029G40744K62064l34000L28889m74934J87568K22929D35949O1022K04738A35738
15018E22961P5094J47017I7149J03048L24433j49029j27328J09529K49242B19893
15007F33759n5899k2083j95110n0769M12745q3239r1434j74896J86884K3084k58781
14996C24261L24076A93680K21444J20623j75002J39555o6491J42744Q7271r5697
14986E68127M7211p6869L2763J91726L43759l20318j14841n9396K23021l72955
14976D62228r1129N6261M8073K31682o0997K35131l13691K00655l22492q8851
14966C56870j43586J62766J3544A78143f332C10575Q2641L17900k88460j53326
14956B69330p9375K43855l4151j05500L62190C25343K09889j90897n0596M01677
$$ plain form
15029 740744 1002808 668808 997697 522763 710331 933260 435949 496971 701709 135738
15018 522961 598055 745072 97149 200197 524630 375601 248273 357802 607044 219893
15007 633759 577860 555777 360667 309898 722643 639404 547970 373074 559958 583042 324261
14996 324261 648337 193680 415124 535747 360745 500300 433809 576553 663824 568127
14986 568127 615338 538469 571232 762958 1106717 786399 671558 612162 835183 462228
14976 462228 371099 427360 475433 707115 646118 881249 567558 768213 445721 356870
14966 356870 213284 376050 389594 178143 -6332 310575 393216 711116 422656 269330
14956 269330 189955 433810 399659 294159 656349 325343 535232 344335 293739 695416
14946F95416j72887K39887j35066M32753D54441R154k7001q2350K11659J488J49337
14935G16728B39069N57650k69097Q8645J07449M55849L24612l0217L18721l07095
14925A485586J66845M95075k24637q5116k03934J38659L0078K57936O19799o9753
14915B610538k64915j55694m69943k24826j64067k04126o7477E19915K70769C22667
14904B45306K44685j35650J28150n2137P521A86368q1596J28105R5148M769M42550
14893G75344C32755K63142o2795k12396L22662j49856J24723L0335O7628J57591
14883H73789K3129j21635L74052j49555M2862p574l61797N1976j81062j29317
14873D14868Q5202k1324J66744O711k5274J23882o0390k5362k3344l9253N06612
$$ plain form
14946 695416 522529 762416 627350 1060103 454441 463595 436594 354244 565903 567391 716728
14935 716728 239069 796719 527622 616267 723716 1179565 1504177 1473960 1792681 1485586
14925 1485586 1652431 2147506 1922869 1837753 1633819 1772478 1802556 2060492 2680291 2610538
14915 2610538 2345623 2189929 1719986 1495160 1331093 1126967 1059490 519915 790684 322667
14904 245306 489991 354341 482491 430354 437875 186368 104772 232877 328025 332794 775344
14893 775344 332755 595897 533102 320706 643368 493512 618235 648570 716198 873789
14883 873789 896918 775283 1149335 999780 1042642 1035068 673271 725247 544185 414868
14873 414868 500070 478746 645490 652201 626927 750809 690419 665057 641713 602460 1109072
14862A109072n20874K49301n5281C17455K60515l4997j77190J20234N3186J4348
14852E53551j32232K74987k96742K54117o7865M42753k42112l04973N87599J28791
14842A197874j82255L9901O8507J49403l04130J19339j66001J59921k36326l65904
14832D80329L23461k89078j64765N63948C73059M51772o1657j60662K20692J55948
14822I79152D67424K64217k6400K9679R4188M3219J72346D27962N71730j23271
14812H76421C57032O27513k70587L3311J66994j45115L46977k0739j29419j08657
14802H57310j17878j3390k39732n6364M376j81166J04061K0724K91223M6411C20706
14790F32703J27652L8185l317J92657j28009j74859n0308J7755K51961p0244r08
$$ plain form
14862 1109072 588198 837499 782218 317455 577970 542973 365783 486017 539203 553551
14852 553551 421319 696306 399564 653681 585816 1028569 786457 481484 1069083 1197874
14842 1197874 1015619 1055520 1124027 1273430 969300 1088639 922638 1082559 846233 480329
14832 480329 803790 514712 349947 913895 373059 824831 763174 602512 823204 979152
14822 979152 467424 731641 705241 734920 829108 872327 1044673 427962 999692 876421
14812 876421 357032 984545 713958 747269 914263 769148 1116125 1095386 965967 857310
14802 857310 739432 726042 486310 429946 434322 253156 357217 377941 669164 715575 320706
14790 632703 760355 798540 795223 987880 859871 685012 634704 652459 904420 834176 833268
14779H33268l46619M92614k76820K83060Q0330N4141l52843p928K62755m95012
14769E26946K11664j52476K83872o9351B75983M1197M02986k8796j11193p2381
14759E07796N8649L89621j00788j50265P7459j54749O8681j62886L517r3241L30056
14748G73850j3948k69236M24465o5063M1235k54453j18636J11385L90600P820
14738A028019l29245j04362J93608k5100Q1160Q1754k30269J51816L86314J59507
14728A393202O6513M58848M5788j34371k77440m03121L63357n99309L14216l77625
14718H50058j28611K20162J16154r3115j22932J89781k67303j31115M39577j83073
14708H89583J65474k79865L82895K06060L13022N3949K60778J82487k33561l0902
$$ plain form
14779 833268 486649 979263 702443 985503 1065833 1119974 767131 759203 1021958 526946
14769 526946 738610 586134 870006 800655 275983 317180 720166 691370 580177 507796
14759 507796 566445 956066 855278 705013 782472 627723 696404 533518 537035 443794 773850
14748 773850 759902 490666 915131 850068 891303 636850 518214 629599 1020199 1028019
14738 1028019 698774 594412 788020 762920 844080 925834 695565 847381 1233695 1393202
14728 1393202 1459715 1918563 1964351 1829980 1552540 1149419 1512776 913467 1227683 850058
14718 850058 721447 941609 1057763 964648 841716 1031497 764194 633079 1072656 889583
14708 889583 1055057 775192 1158087 1364147 1677169 1731118 1991896 2174383 1940822 1909920
14698A909920R8174q01599m6603k6905l25432n9394K16711p190R1751l23809K7944
14687G53568J09615R2557m945N0629j71964j71111N23660M3734K54657p34567
14677G45833Q9726J27385Q7226l76816M28015M17058n41957K45767j60921j7379
14667A043937l060J2252j5809l8099J28639Q1572q6643J8986k7345J63139k08584
14656A068985o446J93452J62338p9579J05438q5874Q4138k6961r8913L575n77468
14645G42685K78475Q3130J84729J5858k83265K41826o8338O7974K24390m07732
14635A079732L4237k83649O06667j663l63459m4677L55429Q2794k79054l8152
14625A148205p3497K63747j18436J19903J44972k6155l61209K80543R8646J86458
$$ plain form
14698 1909920 2008094 1206495 1159892 1132987 807555 748161 964872 957682 1049433 725624 753568
14687 753568 863183 955740 950795 1001424 829460 658349 1182009 1225743 1480400 745833
14677 745833 835559 962944 1050170 673354 1101369 1518427 976470 1222237 1061316 1043937
14667 1043937 1040877 1053129 1037320 999221 1127860 1209432 1122789 1141775 1114430 1277569 1068985
14656 1068985 1062539 1255991 1418329 1338750 1444188 1358314 1442452 1415491 1316578 1320153 742685
14645 742685 1021160 1104290 1289019 1304877 1021612 1263438 1195100 1263074 1487464 1079732
14635 1079732 1113969 830320 1436987 1435324 1071865 1027188 1382617 1465411 1186357 1148205
14625 1148205 1074708 1338455 1220019 1339922 1484894 1458739 1097530 1378073 1476719 1663177
14615A663177m07225k63452K04155M11552P8868m12597L05147O6439l04682K85489
14605A626871L26990m12138j86687J06329q5841J15668k59169K72263j40573N27359
14595A891072k38223j26184O1172N8989k20971l228K76283Q3749P681j51730l9172
14584A599438K11409L09166m18020K11389j0286k53315j15003L89746J86557M9304
14574B160385j50282J70369j99214m586M51418l73748L42795j69866J78059m44775
14564A960555M06409J56534O6577j40339L00309P0114j12188J60925M92430R3799
14554C455125j61267N03686L36587N23520J233849J978954L881245P757899J7215758
14545C6725356Q381618A9386722H380696l561066j537909l14847m25460K42196
$$ plain form
14615 1663177 1255952 992500 1196655 1608207 1687075 1274478 1579625 1646064 1341382 1626871
14605 1626871 1953861 1541723 1355036 1461365 1375524 1491192 1232023 1504286 1363713 1891072
14595 1891072 1652849 1526665 1587837 1646826 1425855 1422627 1698910 1782659 1790340 1638610 1599438
14584 1599438 1810847 2120013 1701993 1913382 1903096 1649781 1534778 1924524 2111081 2160385
14574 2160385 2010103 2180472 1981258 1976672 2428090 2054342 2397137 2227271 2405330 1960555
14564 1960555 2366964 2523498 2590075 2449736 2750045 2820159 2707971 2868896 3361326 3455125
14554 3455125 3293858 3797544 4134131 4657651 5891500 7870454 11751699 19509598 36725356
14545 36725356 45106974 19386722 8380696 4819630 3281721 2966874 2541414 2783610
14537B783610Q03806K037673j471408j546135o32614L5744J46683k629J32283
14528B287013k91535L2384j43344K38740l3726L15174j03937K35653o0301L12783
14518B788904l18115K4009j76033N92768n7027m6566L6725J04899n6132L42724
14508C236156m42094J24147j74464J07648k00446M54839m2106j5228M7103r6190
14498B999365J13455J43304j31071j8394N2408J46971K46589O9459K2582N0431
14488C695099N5465k23277j79368K24399M5797J02645l3867J95783j68392Q0462
14478C794746N96422k49438m42984K12496N0761M1471M48253l57147K05872l26310
14468C974142O62879k15158j32508M46175j65731J13470j15424R5793N5044K27149
$$ plain form
14537 2783610 3587416 5625089 4153681 2607546 1974932 2010676 2157359 2154730 2287013
14528 2287013 1995478 2027862 1884518 2123258 2089532 2404706 2300769 2536422 2476121 2788904
14518 2788904 2470789 2494798 2318765 2911533 2854506 2807940 2844665 2949564 2893432 3236156
14508 3236156 2794062 2918209 2743745 2851393 2650947 3105786 3063680 3048452 3095555 2999365
14498 2999365 3112820 3256124 3125053 3106659 3159067 3306038 3552627 3622086 3644668 3695099
14488 3695099 3750564 3527287 3347919 3572318 3618115 3720760 3686893 3882676 3714284 3794746
14478 3794746 4391168 4141730 3698746 3911242 3962003 4003474 4451727 4094580 4300452 3974142
14468 3974142 4637021 4421863 4289355 4735530 4569799 4683269 4567845 4663638 4718682 4945831
14458D945831m22462N35190j63669K3637J96814m8674K6507J77703p4782M15307
14448E611402l20951L11517j31188K17794j8373k48225N01958J15364l3849J39287
14438F144736n8943O6132N25672j04825j91480L96896l92130N54376j78284M1349
14428F803499J18521M19112j08456J24686M48655J28131N6555K11028L00649K29458
14418H731838J0105k03605j18701L3322J42425M56012n512j86617J74054L88668
14408I421989L09906J28772J29425K75711J38425J00652k14434K4208l1799M59824
14398A0742679J83589N6291L91343l85160O89088J51882L78889j5346K99813L3270
14388A2526338n0289Q62451j35650N68381J3400M55815P47003l8595J53388K14485
$$ plain form
14458 4945831 4523369 5058559 4894890 4918527 5115341 5066667 5093174 5270877 5196095 5611402
14448 5611402 5290451 5601968 5470780 5688574 5670201 5421976 5923934 6039298 6005449 6144736
14438 6144736 6085793 6151925 6677597 6572772 6381292 6778188 6386058 6940434 6762150 6803499
14428 6803499 6922020 7341132 7232676 7357362 7806017 7934148 7990703 8201731 8502380 8731838
14418 8731838 8741943 8538338 8419637 8452959 8595384 9051396 9045884 8859267 9033321 9421989
14408 9421989 9731895 9860667 9990092 10265803 10404228 10504880 10290446 10314654 10282855 10742679
14398 10742679 10926268 10982559 11373902 10988742 11677830 11829712 12208601 12193255 12493068 12526338
14388 12526338 12476049 13338500 13202850 13771231 13784631 14240446 14987449 14948854 15102242 15316727
14378A5316727o7436O62976J74854L10445J37138M36387K05877L13377L64530
14369A7854875M85963N46915O89783O7640N48754K38431K30546L27036O35600
14360B1625543K1181J048750M4354P39013R6414R51561R93606M10309K53794N16849
14350B6701374J160386O51650M69749O68157J024620P88735O42495J062461Q62474
14341C4032101N49902J011781J140999R05130J303205J183144P55318J650699
14333D2532279P59371J504761J249903J654778J694436J296889J156595K283565
14325E4132577J901622K037478K137046J925766K242513K609038J931054K480648
14317G1397742K706085K638114K936537K870244L244382L509805L396191L635804
$$ plain form
14378 15316727 15249291 15912267 16087121 16397566 16534704 16971091 17176968 17490345 17854875
14369 17854875 18340838 18887753 19577536 19645176 20193930 20432361 20662907 20989943 21625543
14360 21625543 21646724 22695474 22739828 23478841 23575255 24526816 25520422 25930731 26184525 26701374
14350 26701374 27861760 28513410 28983159 29651316 30675936 31464671 32107166 33169627 34032101
14341 34032101 34582003 35593784 36734783 37639913 38943118 40126262 40881580 42532279
14333 42532279 43291650 44796411 46046314 47701092 49395528 50692417 51849012 54132577
14325 54132577 56034199 58071677 60208723 62134489 64377002 66986040 68917094 71397742
14317 71397742 74103827 76741941 79678478 82548722 85793104 89302909 92699100 96334904
14309I6334904M368602M476691M442978M858356M939230N486055N572034N745257
14301A36224107O721088O546675P657078P247766Q076413Q664880Q977689R505509
14293A99621205J0096935J0312498J1517548J1788850J2072717J3446336J3075883
14286B81931972J3738564J4459632J4547799J4892533J5321926J5017653J5281569
14279C85191648J4298016J4788767J2923253J1850761J0350036O023531K103259
14272D57529271J063689O78426R92497L23788n212741p008623q045623r491212
14264D30829472j0960072j2028781j3030455j3964381j4795308j5045696j5349840
14257C35654939j5449427j5249728j5073028j4826088j4021886j3263646j2624774
$$ plain form
14309 96334904 100703506 105180197 109623175 114481531 119420761 124906816 130478850 136224107
14301 136224107 142945195 149491870 157148948 164396714 172473127 181138007 190115696 199621205
14293 199621205 209718140 220030638 231548186 243337036 255409753 268856089 281931972
14286 281931972 295670536 310130168 324677967 339570500 354892426 369910079 385191648
14279 385191648 399489664 414278431 427201684 439052445 449402481 455426012 457529271
14272 457529271 458592960 459271386 460263883 460587671 455374930 448366307 440320684 430829472
14264 430829472 419869400 407840619 394810164 380845783 366050475 351004779 335654939
14257 335654939 320205512 304955784 289882756 275056668 261034782 247771136 235146362
14250B35146362j1784843j1767427j0856111q820588q643367r293498q059206
14243A65921322p994760p480257p054027o863660o309119n631871n116668n425080
14235A14045880n125744m363666m516571m069352l474152l624017l606371l632862
14227H1633145l076499k930975k564502k690251k650871k225446k314267k272410
14219F0907924j897478j891505j976107k004353j484146j539244j257238j582819
14211D7275034j838762j364890j190942r31751r87892j084049j121261j586126
14203C7169361o06543j191076q22978m28640j277459q24880j169652n67102p60591
14194B9520440n82500o88771p37492q01784r90932m61576m70816n54166o60988
$$ plain form
14250 235146362 223361519 211594092 200737981 191917393 183274026 173980528 165921322
14243 165921322 157926562 150446305 143392278 136528618 130219499 124587628 119470960 114045880
14235 114045880 108920136 104556470 100039899 95970547 92496395 88872378 85266007 81633145
14227 81633145 78556646 75625671 73061169 70370918 67720047 65494601 63180334 60907924
14219 60907924 59010446 57118941 55142834 53138481 51654335 50115091 48857853 47275034
14211 47275034 45436272 44071382 42880440 41948689 40960797 39876748 38755487 37169361
14203 37169361 36562818 35371742 34548764 34120124 32842665 32017785 30848133 30281031 29520440
14194 29520440 28937940 28249169 27511677 26709893 25718961 25257385 24786569 24232403 23571415
14185B3571415l49508p33123m64726m49088m84259m45278k21089m86900k91741
14176A9645703m81154o05715n52562O7350n48556q117o05646o12313R1861k57851
14166A6133000m58785m01701k48743j61202q0762m27949m91971P8518m53741j27397
14156A3359267k06441j95754j87214l37868m3990o06409K88235j56968l31666
14147A1581192n40368J2700q437k08478j97376K18728o15759l25595L86348k38179
14137A0064776n5008m74837L0484l79949j55282L57522n79332J46071j13413l11382
14127H529650j12380L15772l44522j40367k15799j57651k17670N5100k57440J97971
14117G652664l05908R1485k84292K35818k89969j37011j80000K66025m02385J27033
$$ plain form
14185 23571415 23221907 22488784 22024058 21574970 21090711 20645433 20424344 19937444 19645703
14176 19645703 19164549 18558834 18006272 18073622 17525066 17516949 16911303 16298990 16390851 16133000
14166 16133000 15674215 15272514 15023771 14862569 14781807 14353858 13861887 13940405 13486664 13359267
14156 13359267 13152826 12957072 12769858 12431990 12388000 11781591 12069826 11912858 11581192
14147 11581192 11040824 11053524 11045087 10836609 10639233 10857961 10242202 9916607 10302955 10064776
14137 10064776 10009768 9534931 9565415 9185466 9030184 9387706 8808374 8954445 8841032 8529650
14127 8529650 8417270 8733042 8388520 8248153 8032354 7874703 7657033 7712133 7454693 7652664
14117 7652664 7346756 7438241 7153949 7389767 7099798 6962787 6782787 7048812 6646427 6773460
14107F773460n52884K10754J42659j54863l14708k22966k60011K84493R5481m18978
14097E582437p4988J59618N1120k15023k21741J44253l4451j41442j72675J31317
14087E208425j57558m5634L85339k47726k17538O9768l08503k9365J55026l70688
14077D441546L67799m45149K85455l81390p8522J54811L1720k51656J09979p9161
14067D155432P2194k02736R0885j72417L19478p0411K95675m90481Q0735R2951
14057D171305Q7460m36189n0854j95680L83121j83140l10468O1502O8665q1170
14047C514552N4131k87088R3448J7641j98144O7764O9864l3180r7346n15378N14697
14036C200961O3696j64528j36252K20643k96955L01365k68343K81199P5121k7825
$$ plain form
14107 6773460 6220576 6431330 6573989 6419126 6104418 5881452 5621441 5905934 6001415 5582437
14097 5582437 5507449 5667067 5718187 5503164 5281423 5425676 5391225 5249783 5077108 5208425
14087 5208425 5050867 5005233 5390572 5142846 4925308 4995076 4686573 4657208 4812234 4441546
14077 4441546 4809345 4364196 4649651 4268261 4189739 4344550 4376270 4124614 4234593 4155432
14067 4155432 4227626 4024890 4115775 3943358 4262836 4192425 4488100 3997619 4078354 4171305
14057 4171305 4258765 3822576 3771722 3576042 3959163 3776023 3465555 3527057 3595722 3514552
14047 3514552 3568683 3281595 3375043 3392684 3194540 3262304 3332168 3298988 3201642 2686264 3200961
14036 3200961 3264657 3100129 2963877 3184520 2887565 3188930 2920587 3201786 3276907 3249082
14026C249082j68679k23212K04029k15608J37588l75315k1275P4082L5510J28858
14016B825060l60734L5959M0895k52794J58686p6037J13329j64695Q8871J80556
14006B589096k48435k98455J81002N3554q0032K02984l50641J16015K39402j29086
13996B275404l23249L30963q5869m11692N35647j20320Q49286J159974K638869
13987F849013N856668J5677130J8979630k1115263j2134017n719977j800734j828606
13979D763844m07156m01021n06965l48035J15120n00150p1264n79803M36199j05028
13969B395741j16221j729k23049J23997j10530K3175O7659j41577r338N3350o6768
13958A994710J16131q9887k75174O2910J89797Q5412L7943k98581J23337r4265
$$ plain form
14026 3249082 3080403 2857191 3061220 2845612 2983200 2607885 2586610 2660692 2696202 2825060
14016 2825060 2464326 2500285 2541180 2288386 2447072 2371035 2484364 2319669 2408540 2589096
14006 2589096 2340661 2042206 2223208 2276762 2196730 2399714 2049073 2165088 2404490 2275404
13996 2275404 1952155 2283118 2197249 1785557 2321204 2200884 3050170 4210144 6849013
13987 6849013 12705681 28382811 47362441 26247178 14113161 8393184 6592450 4763844
13979 4763844 4356688 3955667 3448702 3100667 3215787 2715637 2644373 2064570 2500769 2395741
13969 2395741 2279520 2277791 2054742 2178739 2068209 2091384 2159043 2017466 2008128 2061478 1994710
13958 1994710 2110841 2020954 1745780 1808690 1998487 2083899 2121842 1823261 1946598 1852333
13948A852333k36487p1058K32453M7113o2588o5074J15390l53374K13921J78648
13938A851277n5773j46356O6617j70516k7910K62526j89614m486n2926O5931n0199
13927A548571J77498l97263J81301K53324k94671k13579M00309j25450M0998K21549
13917A792587k09088k17634m6442L51904m47756L81947j79368j44653p1421J10112
13907A320188L0543J4832q8007J6604K41060k26419k8519J24648l1188o1323o697
13896A305722k87035K3692M24450k28196j44850K13105r5746J25462o2755o7145
13886A206704J00981J07396k80407O5754J66562k57435J10068l3452j06028n7449
13876A022694k245K98255J50008l88399R6218m3796K08080j95281J95180j43361
$$ plain form
13948 1852333 1615846 1544788 1777241 1824354 1761766 1696692 1812082 1458708 1672629 1851277
13938 1851277 1795504 1649148 1715765 1545249 1517339 1779865 1590251 1585765 1532839 1598770 1548571
13927 1548571 1726069 1328806 1510107 1763431 1468760 1255181 1655490 1530040 1571038 1792587
13917 1792587 1583499 1365865 1319423 1671327 1223571 1605518 1426150 1281497 1210076 1320188
13907 1320188 1350731 1365563 1277556 1294160 1535220 1308801 1280282 1404930 1373742 1312419 1305722
13896 1305722 1018687 1042379 1466829 1238633 1093783 1306888 1211142 1336604 1273849 1206704
13886 1206704 1307685 1415081 1134674 1200428 1366990 1109555 1219623 1186171 1080143 1022694
13876 1022694 1020449 1318704 1468712 1080313 1176531 1132735 1340815 1145534 1340714 1197353
13866A197353L5084l78689L17097j23871J19993Q908m92962M24744q1106o0726
13856I65825j08016J25608k1990l623P4390L0275l18195K53876j26197L01706
13846A173659p4934k52281K2851K05323n3596O4693j30401j47671P5699J42812
13836A026154J81894l13318K67868l50443k46652M14824P1697k94249K1359R7751
13826H76885N5595J7625Q5002k85432j0830J27715J03755n4759j45504M20645
13816A190697n76399M94021n6508r5628k88694J42663K62211k42367j73950K90795
13806I46841j29091l91441O85217n27233j2645r6655M94952j18107l77174J85994
13796F60658K50936J22001D66229M24436q6722j68654O2715n8903J3327J90831
$$ plain form
13866 1197353 1232437 853748 1170845 1046974 1166967 1175875 682913 1107657 1026551 965825
13856 965825 857809 983417 961427 957804 1032194 1062469 744274 998150 871953 1173659
13846 1173659 1098725 846444 869295 1074618 1021022 1085715 955314 807643 883342 1026154
13836 1026154 1208048 894730 1162598 812155 565503 980327 1052024 757775 779134 876885
13826 876885 932480 950105 1035107 749675 738845 866560 970315 915556 770052 1190697
13816 1190697 614298 1108319 1051811 956183 667489 810152 1072363 829996 656046 946841
13806 946841 817750 426309 1111526 584293 571648 474993 969945 851838 474664 660658
13796 660658 911594 1033595 466229 890665 803943 635289 698004 639101 652428 843259
13786H43259q3215j07298K58937D46990L91964O7580m28594K67857r8210j00889
13776E46698o5263K62078L367j35492K00139j23799J4615O2767O9036D01981J96899
13765E98880k02066J01655M01491j25852n2932l29860L81320C18135L53366j19788
13755E51713q700L65618m32382L14371l44590J97523O033n6589R0913k93611m268
13744C86031K65413j80473M7993J32951k49657K84805P6133j97058j17639Q6853
13734E35352L49244J9392l19021B01273L89596M0332J44196k0192k09672o2766
13724D82767N18632l49223j24173L7441q5137m3504k0259J81493j03506l5088
13714D59443j42041L73922M8275k92795p7656j30201J98513L96001C39898K89844
$$ plain form
13786 843259 760044 652746 911683 446990 838954 906534 477940 745797 647587 546698
13776 546698 481435 743513 746880 611388 811527 687728 702343 765110 834146 401981 598880
13765 598880 396814 498469 899960 774108 721176 391316 772636 318135 671501 551713
13755 551713 543013 908631 476249 790620 446030 643553 649586 592997 683910 390299 386031
13744 386031 651444 470971 518964 651915 402258 687063 763196 566138 448499 535352
13734 535352 884596 903988 584967 201273 590869 631201 775397 755205 545533 482767
13724 482767 1001399 652176 528003 565444 480307 436803 416544 598037 494531 459443
13714 459443 317402 691324 739599 446804 369148 238947 437460 833461 339898 629742
13704F29742O9573j89913o8048P3595r3169j59413L12973r1688j08070J19271
13694D94853B35052L26813j76769L1377A37363N30943l17614L78773j80629N8395
13684F07231r157n3628P5700B98130O1839J05065j5447J64259j42733q7226r3093
13673B90794j9718K18720m5738j84921M38225o4233j00405j80324J15653k33730
13663B34323J24386R3810J05824d0002E55273n3225n9124K75339k99253Q4544
13653E03554j13841M2011M4217n260J4285p5817A99832I1350M02074r7137r4735
13642C01552j26526L13490O3136j62380L0709A93145M67832l24793K07316j24734
13632D18766q8528J23553B18884J43667L3481A39493L39456K3971B19752K02745
$$ plain form
13704 629742 699315 509402 441354 514949 421780 262367 575340 483652 375582 494853
13694 494853 235052 561865 385096 416473 137363 668306 350692 729465 548836 607231
13684 607231 598074 544446 620146 298130 359969 465034 449587 613846 471113 383887 290794
13673 290794 271076 489796 444058 259137 697362 633129 532724 352400 468053 234323
13663 234323 358709 452519 558343 -40002 555273 502048 442924 718263 419010 503554
13653 503554 389713 431724 475941 470681 484966 409149 199832 91350 493424 396287 301552
13642 301552 175026 488516 551652 389272 419981 193145 660977 336184 543500 418766
13632 418766 330238 453791 218884 362551 396032 139493 478949 502920 219752 422497
13622D22497j57015R2017Q1280B08812J66507J26870l5787O9926M4633A03184
13611C42995M3123R2428j06639J59570j75913j19259J07052J51895J29606A03813
13600D87363B34208L8491k0049d7932C29642Q2298a57492B67142k0771L1165K40951
13589E18487k46429j24377K9112n9985L39110D4161L79657R5526k52167J42017
13579D09194p7164n7595J97406j57144O4778k9201j05099J51541j00320J70334
13569D66730J03661k10416j52812J61798J40033p6617r9431j08216J44071n5681
13559C13120A27874J45434L35721B53975L44165A46527J13903A22535J01545K48077
13549D72157j07219K8517Q039r6935P4568j62234J53015k9663m2705R9983A86992
$$ plain form
13622 422497 265482 357499 438779 208812 375319 502189 466402 536328 580961 103184
13611 342995 386118 478546 371907 531477 355564 236305 343357 495252 624858 103813
13600 487363 234208 272699 252650 -47932 329642 411940 -157492 267142 246371 277536 518487
13589 518487 272058 147681 176793 116808 455918 44161 423818 519344 267177 409194
13579 409194 332030 274435 471841 314697 379475 350274 245175 396716 296396 466730
13569 466730 570391 359975 207163 368961 508994 432377 332946 224730 368801 313120
13559 313120 127874 273308 609029 253975 598140 146527 260430 122535 224080 472157
13549 472157 364938 393455 401494 304559 379127 216893 369908 340245 297540 397523 186992
13537B06050K84513A93286K85481j03214r7431J60533j17085O996J04675A49968
13526i60B54178q0515F8965L87319j37209b1217C87811A89222J0607a04814B46959
13514B85960J46992j89943J26247Q3057A18296d5900A34887R2621L99293A91480
13503B43139M3694J42293j48613j9727J86099r7362M9932A45745D1512K88948
13493C30460N4432K0115j06160H2093M5591J15479M8249n2700q9260L40788B29015
13481C88497C6254O7623L07167o1336a0387j85076A11445J06108J58200j80345
13471A95408M0917H5348a7225B18073H7694L29041A29921K16213q4192F8035a64638
13459f1947B85141k5859K26223j02796j71673r1224K16947P3070j76981L70826
$$ plain form
13537 206050 490563 193286 478767 375553 278122 438655 321570 328566 433241 149968
13526 -960 254178 173663 68965 456284 319075 -21217 387811 189222 199829 -104814 246959
13514 285960 432952 243009 369256 452313 118296 -45900 134887 227508 626801 191480
13503 243139 286833 429126 280513 260786 446885 349523 399455 145745 41512 330460
13493 330460 384892 405007 298847 82093 127684 243163 291412 238712 149452 490240 229015
13481 388497 36254 103877 411044 349708 -10387 -195463 111445 217553 375753 195408
13471 195408 236325 85348 -17225 218073 87694 416735 129921 346134 261942 68035 -164638
13459 -61947 285141 259282 485505 382709 211036 119812 336759 409829 232848 603674
13449F03674B61816L3079c9885F5805B4217J72111Q938G1003J99481j9067n0227
13438B01190a2699B31051O0693q1117J69325j44916p125A8427J62133J71813g5366
13426F0282K13866a77215A23837a91934D49081j02550A72122F6729k5731J56495
13416A97493K05441g5941B68864L9692M6805M5124r9928j0520m5962A17573J99602
13405C17175A23894L80083a20374Q397H382M79852j91928K0995j12887N4677K1242
13394B80333A0149K05415l2473J27097I3179J18051H4151J29761K19222h143n0120
13383e8263D10358A00469k3054L90112A24366M27614C3071L78371j75021K13222
13373D49643A56229k3558K5211N7105O2537E9748J13109c2662D4318K86653Q4861
$$ plain form
13449 603674 261816 294895 -39885 65805 24217 196328 205266 71003 270484 251417 201190
13438 201190 -12699 231051 291744 210627 379952 235036 227911 18427 180560 352373 -75366
13426 60282 274148 -177215 123837 -191934 449081 346531 172122 66729 40998 197493
13416 197493 402934 -75941 268864 308556 355361 400485 300557 290037 244075 117573 317175
13405 317175 123894 503977 -120374 -111977 8382 488234 296306 317301 204414 259091 280333
13394 280333 10149 215564 183091 310188 93179 211230 84151 213912 433134 -8143 -58263
13383 -58263 410358 100469 77415 467527 124366 551980 33071 411442 236421 449643
13373 449643 156229 132671 157882 214987 277524 59748 172857 -32662 44318 330971 415832
13362D15832q103j58135o8454K2112A8464K24166p0885M5861o7120h2917I4222
13350B8258L26805j47389P486N6142A07532K96967e5280D31324o3362R6182j71490
13339B92654r1338J67198A59264L23662p7139A55025N1619I4688q564J3906K47765
13328C47795j12881k1622m6959H39a89663A38721M8858J14810N0562j46319A050
13316E65087B0328J66986J76263A00987i310C91082A63321q0479J36370d2738
13305b6241E721K6116M17168A47297J39248j4826E0903J60582J66137d26694c129
13293c7075k36271F6646K16917H5070J91849A07368a5023E10649h4524A64041
13282I4185K1673J7783J11647L67784H0285A0242O2668i0780B3494a5625l1000
$$ plain form
13362 415832 407729 249594 181140 203252 18464 242630 171745 217606 150486 -82917 94222
13350 28258 355063 207674 215160 271302 107532 404499 -55280 431324 367962 464144 292654
13339 292654 201316 368514 159264 482926 405787 155025 206644 94688 86124 100030 347795
13328 347795 234914 213292 166333 839 -189663 138721 187579 302389 352951 206632 1050
13316 565087 20328 187314 363577 100987 -9310 391082 163321 82842 219212 -42738
13305 -26241 5721 31837 449005 147297 286545 271719 50903 211485 377622 -426694 -3129
13293 -37075 -273346 66646 283563 85070 276919 107368 -15023 510649 -84524 164041
13282 94185 115858 133641 245288 613072 80285 10242 72910 -90780 23494 -15625 -46625
13271d6625C23973a0937j10874J4286A25795P1638e5573j01350I2618f409A42241
13259a55857A25924J31924j01764O6952N0178a26833A50120G3138L0758b69240
13248B05963e5438A02077b31728E8320a0733B68743b93927B14487B8154b7581
13237A29270R1633M5545b67629F1552L8334l9551K35227a08137c8954B71191F6012
13225A92275Q1658E6131h5197J0931l7200A16620d5876A40875J9905c3450j16783
13214a50233a6241n6176C59773a83742A90806p6670J61233a11764d687A97272
13203A7498J26226o8956e980A33252M0058n7516a65041B0126K1148L77666c3625
13191B36548b5526B23631e2798j1782F6006J37888p9012a93452A54781E246L2475
$$ plain form
13271 -46625 323973 -10937 -121811 -107525 125795 197433 -55573 -156923 92618 -6409 142241
13259 -155857 125924 257848 156084 223036 273214 -126833 150120 73138 103896 -269240
13248 205963 -55438 102077 -231728 58320 -10733 268743 -293927 214487 28154 -27581
13237 129270 220903 266448 -267629 61552 99886 60335 295562 -108137 -38954 271191 66012
13225 192275 273933 56131 -85197 -74266 -111466 116620 -45876 140875 160780 -33450 -150233
13214 -150233 -16241 -72417 359773 -183742 190806 114136 275369 -111764 -4687 197272
13203 17498 143724 74768 -5980 133252 173310 115794 -165041 20126 41274 418940 -33625
13191 236548 -25526 223631 -52798 -64580 66006 203894 124882 -193452 154781 5246 37721
13180C7721a4479j93230B69872I5085N5869K2343m7982K6J38068j29415e7006
13168b52355B78101j02347a41893D0717J25456p1292c86D6340n394K09121J30131
13157C80198a86517L9577B18628a9876j38858L0618A49257a83270B47310F1493
13146D37924A39494m2535K31100G3716K77808b68574A0794L49713j55513J5144
13136B20138h0056j02762B53682B4420l327M5840J4583L56150A91368E2080j6000
13125C6080N1014o936N4976A724J33736L20070A47725i5377D02158E6395K9257
13114H5652a1081B60478L27490F6746l1644J66716l3536c04206D07998A85228
13103h6058d738D9141L27087c23535C14179A5779g2027k31878f2094q6855j9275
$$ plain form
13180 37721 -14479 -207709 269872 95085 150954 173297 125315 125341 263409 133994 -57006
13168 -252355 278101 175754 -141893 40717 166173 94881 -386 46340 40946 250067 380198
13157 380198 -186517 -146940 218628 -19876 -158734 -128116 149257 -183270 247310 61493
13146 437924 139494 96959 328059 73716 351524 -268574 10794 360507 204994 220138
13136 220138 -80056 -182818 253682 24420 21093 66933 81516 437666 191368 52080 36080
13125 36080 87094 80158 135134 1724 135460 455530 147725 -95377 402158 56395 85652
13114 85652 -11081 260478 587968 66746 35102 201818 168282 -304206 407998 185228
13103 -86058 -4738 49141 376228 -323535 314179 15779 -72027 -303905 -62094 -148949 -168224
13092a68224A63302i8385A99279C6627K37755D9890p056A9856J85805a9634j61487
13081a81121A9293P6828J66368j124M4471a52796D51329k10269o1406n5864m3852
13070G9938J24395b26484A3717g001k06944j056D58920e9371n5462e697B3691
13058a39962G910J27626k308K21326a62316L0707H902h0529A08244a853n8524
13047f0377A58675J87568c7181l91720A37240K64949j95424b59688B24091p0749
13037A53342a51247o3480e9214R361n1541A09236K3515r677a21616o5809C06366
13025D7989a8000j7318C63895g0765G1008a63645k3313B41920a59043E9376J06241
13014A65617l2557k825L3638K17803I7053a32141E607J25747J0040n5785e9525
$$ plain form
13092 -168224 163302 -98385 199279 36627 274382 49890 42834 19856 205661 -19634 -181121
13081 -181121 19293 96121 262489 261365 305836 -152796 451329 241060 179654 123790 79938
13070 79938 204333 -226484 13717 -7001 -213945 -215001 458920 -59371 -114833 -5697 23691
13058 -139962 7910 135536 133228 354554 -162316 -131609 8902 -80529 108244 -1853 -60377
13047 -60377 158675 346243 -37181 -428901 137240 402189 206765 -259688 224091 153342
13037 153342 -151247 -214727 -59214 -49853 -101394 109236 132751 123074 -121616 -187425 306366
13025 47989 -18000 -35318 363895 -70765 71008 -163645 -186958 241920 -159043 59376 165617
13014 165617 133060 130235 163873 381676 97053 -132141 5607 131354 141394 85609 -59525
13002B51395j23426L4261J66765E7982j9833a64153j39993e9373C82874D2585
12991A90299a99698m9104D98818A1039b15348A1668b1833j25432f3957A49998
12980d20791N7474A2868D451Q5065a30584j26693G732d435n6375j40714b7474
12968e125A63643E1452K06251f5564A71539a71794E2653M093K43159J8925h201
12956c7209j55851L0621j50774A37679a65361H2375a51258m1087a3516j58256
12946a71772b5481j19695F7811a81277B18135P0287e7715A1272f2808F3573c990
12934c52462A76912h1868K2473A61852Q1423e4561o946A56776N9711a7240A60951
12922a6759A98757a72015B5639L8419j44b95105J42805I2588i3757o241A25214
$$ plain form
13002 251395 127969 162230 328995 57982 38149 -164153 -304146 -59373 382874 42585
12991 190299 -199698 -248802 498818 11039 -215348 11668 -21833 -147265 -63957 149998
12980 -420791 -363317 12868 4451 89516 -130584 -257277 7732 -4435 -60810 -201524 -27474
12968 -5125 163643 51452 257703 -65564 171539 -171794 52653 56746 299905 318830 -8201
12956 -37209 -193060 -162439 -313213 137679 -165361 82375 -151258 -192345 -13516 -171772
12946 -171772 -25481 -145176 67811 -181277 218135 288422 -57715 11272 -62808 63573 -3990
12934 -352462 176912 -81868 -59395 161852 243275 -54561 -61507 156776 216487 -17240 160951
12922 -16759 198757 -172015 25639 64058 63914 -295105 -152300 92588 -93757 -99998 125214
12910F0837m756c1531p3891E1503b67521b2277j546B3723K1381d2211j31569O3802
12898a09978B02967D5045L996b2097C1467h4521j9213D11616A27804a34697N9177
12887g5520a2743j56288c3146p9968G3213h8333l8781l6217e8476n9733C20662
12875a03326J564j71629c6372H7769f7366r1113I4730J27636o2961b29762A45993
12863C72543A31813D7405O0565h349B472a87315N3956p3A37707B6248L66040c31942
12850c00497O4829A37009n609B5054b62029B06023q2585J42102h5622C33902a80915
12838A79490o76q0117a21622b9736A99207M6577g1280a5339j10343A6217a69066
12826a19955L964c2728F8798L7326g0641B16869e2914j05755A8439a01623k8378
$$ plain form
12910 60837 56081 -31531 -105422 51503 -267521 -22277 -23823 23723 45104 -42211 -173780 -109978
12898 -109978 202967 45045 49041 -22097 31467 -84521 -103734 411616 127804 -134697 -75520
12887 -75520 -12743 -169031 -33146 -113114 73213 -88333 -127114 -163331 -58476 -118209 320662
12875 -103326 -101762 -273391 -36372 87769 -67366 -158479 94730 222366 159405 -229762 145993
12863 372543 131813 47405 107970 -8349 2472 -187315 -133359 -133432 137707 26248 392288 -331942
12850 -300497 -235668 137009 131400 25054 -262029 206023 123438 265540 -85622 333902 -180915
12838 179490 178814 98697 -121622 -29736 199207 245784 -71280 -15339 -125682 16217 -169066
12826 -119955 -115991 -32728 68798 106124 -70641 216869 -52914 -158669 18439 -101623 -130001
12815a30001j41752A61822d1079A75128a94683B0255N0891c82536G0951a51484
12804H9401k134e1266B6176b78855A01893j5472R6164A8375L81479C3049J28470
12793A61519m9969b92377d5955I6088a93174i4131A22144k3613j3991c9158H116
12781A21942i4636B1927L4125h246o4988I9927O0907e7445b5166j71184O9711
12770a26639e0628A98608c4926B636J43661n0226P285R80b903B25894C355Q4752
12758H8107a89247D1625M6354K3889D5770c979r5613A15913E7254d379A61431
12746f9692G814a48257H2733L8498Q4547D3926L3399A9757M55065B33834K78533
12735E12367B812J85988j8178q1901a15070B9100J25556A1841a30629n1590B49281
$$ plain form
12815 -130001 -271753 161822 -41079 175128 -194683 20255 71146 -382536 70951 -151484
12804 89401 87267 -51266 26176 -278855 101893 86421 182585 18375 399854 33049 161519
12793 161519 111550 -292377 -45955 96088 -193174 -94131 122144 98531 84540 -39158 8116
12781 121942 -94636 21927 56052 -8246 -73234 99927 160834 -57445 -25166 -196350 -126639
12770 -126639 -50628 198608 -34926 2636 146297 96071 103356 104336 -2903 225894 3355 88107
12758 88107 -189247 41625 87979 111868 45770 -3979 -99592 115913 57254 -4379 161431
12746 -69692 7814 -148257 82733 121231 205778 43926 77325 19757 474822 233834 512367
12735 512367 2812 188800 170622 88721 -115070 29100 154656 11841 -130629 -182219 249281
12723a31264F3053b96698a9317j96195A45273D0370f8203K9468k56270a24475
12712d5875j40229B83439E9787L80025d5887h633A06036i1758G8522K67889L0656
12701C77067a52497B61965j0657H7909L9362A4641P042k964a3632j09160C11910
12689A39451A2344c82794a20442F7038d03129J97954A60425C0195J04871a98378
12678E5554d7057B21170M0634J31535A29042b31783a6618p7310A18385B28P9080
12667G9308i592A15916J75719F6582b06589d2400A3477c8516c884j02016n9126
12656a65026G6466h8963I8647R8513I4957K8527g8794F6910a86282C365O2445
12645F5810c9657J706o7708F2649a63539B21086c5651G0667a47148e9636A38726
$$ plain form
12723 -131264 63053 -296698 -19317 -215512 145273 40370 -68203 -38735 -295005 -124475
12712 -45875 -186104 283439 59787 439812 -45887 -8633 106036 -91758 78522 346411 377067
12701 377067 -152497 261965 251308 87909 127271 14641 21683 18719 -13632 -122792 311910
12689 139451 12344 -382794 -120442 67038 -403129 -205175 160425 30195 135066 -198378
12678 55554 -47057 221170 261804 393339 129042 -231783 -16618 -93928 118385 228 79308
12667 79308 -9592 115916 291635 66582 -206589 -42400 13477 -38516 -3884 -105900 -165026
12656 -165026 76466 -88963 98647 197160 94957 123484 -78794 66910 -186282 3365 65810
12645 65810 -39657 -37951 -105659 62649 -163539 221086 -35651 70667 -147148 -59636 138726
12633C41496G2010J4313K8139J57251r831Q4954J91009j10982j87063i2121B22363
12621A82030a19383b3344n8308q6735d7001p01J2678j18458c3224N15a3905B89159
12608A67723c02907f9074A42057F9096a05497G0062i5699c8445B37421p8074p9468
12597G9879K16434a67501E6666a86117B52882K93867g2739a9375a196n2667g871
12585a0311A63302K47046A37568J31881o9241g793k33470G5770A9863J80390K599
12574B02852a04153A12401d00213J76904C44895a08626j71275J20531F5070a39793
12563e392j27609L2399j12108G5198a57848k7306I623c81398e3369l6053B1552
12551a98551b0369M820c066A6040c98792Q1278B79336b874B09590q8363P1154
$$ plain form
12633 341496 72010 86323 114462 271713 261882 346836 537845 426863 239800 -92121 222363
12621 182030 -119383 -23344 -81652 -168387 -47001 -47702 -35024 -153482 -33224 -32709 -13905 289159
12608 167723 -302907 -69074 142057 69096 -105497 70062 -95699 -38445 237421 159347 79879
12597 79879 296313 -167501 56666 -186117 252882 546749 -72739 -19375 -1196 -53863 -7871
12585 -10311 163302 410348 137568 269449 200208 -7793 -241263 75770 19863 200253 202852
12574 202852 -104153 112401 -400213 -223309 344895 -108626 -279901 -159370 65070 -139793
12563 -5392 -133001 -100602 -212710 75198 -157848 -185154 9623 -381398 -53369 -89422 21552
12551 -198551 -20369 -15549 -3066 16040 -398792 -317514 279336 -2874 209590 121227 192381
12540A92381n4852a30213A47203o4710L4514E0125c39477c8286D7219J49970D6995
12528c4633k36978A56907F0847P3b68663A93489J35384a88475m4737F6370J82720
12517B49090a99658a6962E5261b38453e8480B00156i5983b8555H7901K08205b38315
12505C40969h571o8181C33775J13905a99686c5153k04381n9978A28030K1148K3086
12494A72264k9128b40658b4598A14824J6578D9004J31817Q8038a69310C08248
12483I982f0553C66170c3819j37470j6981B75531b64111Q3746B61536G790K41741
12472B49531L8384H5989J135a93358B23280h897m1038G7365d4414j63322R9484
12461a08252B36031c45057g0976a0382n33A95749a55861I4931a62990h426k0109
$$ plain form
12540 192381 137529 -130213 147203 82493 117007 50125 -339477 -38286 47219 197189 46995
12528 -34633 -271611 156907 60847 60920 -268663 193489 328873 -188475 -233212 66370 249090
12517 249090 -199658 -16962 55261 -238453 -58480 200156 -95983 -28555 87901 296106 -238315
12505 340969 -8571 -76752 333775 447680 -199686 -35153 -239534 -299512 128030 149178 172264
12494 172264 143136 -240658 -24598 114824 131402 49004 180821 268859 -169310 308248
12483 9982 -60553 366170 -33819 -171289 -188270 275531 -264111 -180365 261536 7790 249531
12472 249531 287915 85989 87124 -193358 223280 -8897 -49935 77365 -44414 -207736 -108252
12461 -108252 236031 -345057 -70976 -10382 -10915 195749 -155861 94931 -162990 -8426 -28535
12450b8535B47339C6968a26029G2860L9730b95212B12591C3950J76723F2269d7359
12438a08404A27559J44711a79281E6626a0612e24m4209j93253i1035k9131a1456
12426a10147j37279F8638h2363j12408A69767C6014J51585a2117l03228E7367
12415g7131A51324a61916b0323k1665j90593D2839b50825G986J96460b58147D5319
12403E3419a38662L6456k47112a62476j21821a35090r2065A26354n3912c0040
12392A38920B1053J34620Q2387a47946A5692J61829G8225J58633b72952C6932
12381A72787a41167A81442a89863B47261r945A17273J26084a20826J9520B10224
12370F3189K43443g5406b4235l45049c0683k1280G5270E746a29098e4911A32429
$$ plain form
12450 -28535 247339 36968 -126029 72860 112590 -295212 212591 33950 210673 62269 -47359
12438 -108404 127559 272270 -179281 56626 -10612 -524 -44733 -237986 -91035 -120166 -11456
12426 -110147 -247426 68638 -82363 -194771 169767 36014 187599 -12117 -315345 57367
12415 -77131 151324 -161916 -20323 -41988 -232581 42839 -250825 7986 204446 -258147 45319
12403 53419 -138662 -102206 -349318 -162476 -284297 -135090 -227155 126354 72442 -30040
12392 138920 21053 155673 238060 -147946 15692 177521 78225 236858 -272952 36932
12381 172787 -141167 181442 -189863 247261 237316 117273 243357 -120826 -101306 210224
12370 63189 306632 -75406 -24235 -369284 -30683 -51963 75270 5746 -129098 -54911 132429
12358B1325J9290K74876I1163k5069K0171C7872e4233o1482d9244o6837b6417
12346a98811B4868L26990A20705j100a66662A94306m9625E1241a16050B23922
12335c88491B76111H8185l7121A8810L31761r6897o1244M6771J15457A40857P2604
12324B13461m9861m5679L44646q0267A80567M1946K97959A37902j9462a5157A62057
12312H8408J1954K49557a19486G9696a19733L1095A69769G9798J40296d21647
12301D5038J2818Q2532d19034A54010N4803G3076Q272K0148P3273h5161C94251
12289B41542f2966H6666R8753b47805A31591e3230A33830J96769r4244R7718A05907
12277A98530J8995G5099j5575K13617H9402J87316g117D44136F5785K70473J15216
$$ plain form
12358 21325 40615 315491 91163 66094 86265 37872 -54233 -115715 -49244 -116081 -26417
12346 -198811 24868 351858 120705 119605 -166662 194306 144681 51241 -116050 223922
12335 -388491 276111 88185 51064 18810 350571 253674 192430 239201 354658 140857 213461
12324 213461 163600 117921 462567 382300 180567 222513 520472 137902 118440 -15157 162057
12312 88408 100362 349919 -119486 79696 -119733 -88638 169769 79798 220094 -421647
12301 45038 57856 140388 -419034 154010 208813 73076 81348 101496 174769 -85161 394251
12289 241542 -62966 86666 185419 -247805 131591 -53230 133830 330599 236355 334073 105907
12277 198530 217525 75099 59524 273141 89402 276718 -7117 444136 65785 336258 451474
12266D51474A99439I9342L23844a13511j5271B96960I5733K99663n7243p1557
12256B66596b12834e482j7767A45536a56097B28524a21384A90018E7551a22227
12245B60775E6579k1963K03371H9874b73619D40001A10056C4175P5408L75795
12235D85378A60694C8021K59214e8341J3378B91512A39446C2385c7707B247M14864
12224D17111j13788n8391p7894j4878m8369J39800N1768B6557J55658a41783C19218
12212A34402J0622K3249K30327a77232D3421b8451B64812K17597A45693K05398
12202C51091c69089a74358B63148H1159a88186C86517j13841J72769j31323A14906
12191C47674p3953j17266K60678a24597B42963p5179a17230A60849Q8505o9601
$$ plain form
12266 451474 199439 99342 423186 -113511 -128782 296960 95733 395396 338153 266596
12256 266596 -212834 -5482 -23249 145536 -156097 228524 -121384 190018 57551 -122227
12245 260775 56579 34616 237987 89874 -273619 440001 110056 34175 109583 485378
12235 485378 160694 38021 297235 -58341 -44963 291512 139446 32385 -37707 2247 417111
12224 417111 303323 244932 167038 152160 103791 243591 295359 26557 182215 -141783 319218
12212 134402 145024 168273 398600 -177232 43421 -28451 264812 482409 145693 351091
12202 351091 -369089 -174358 263148 81159 -188186 386517 272676 445445 314122 114906
12191 347674 273721 156455 417133 -124597 242963 167784 -117230 160849 249354 179753
12181A79753K64544A10472m6631b36352A31230N2915h3868E982a19336E8037K47960
12170C05997E3470K8694B7506O5212L37018j65552R3421l4056P1415N3327j41627
12159C06664B0927P2950l1266K03371J44101k00425c00048b4491F2815a39163
12148C72825j61380J08291a34369A59710a46416C2309N16644B59424J05489A09872
12137A26398K03095J0609a0547m5684B20203p8459d5403J5254I4063c0471B15457
12125C25606b82392B20383m9672L23076A0620a7882A76474l5301n7224L2454D178
12113A81140a4875C85012A86418K03513A7116K01434q1965b1270H1690K7516a8851
12101A67537c9963I6860j5323B4827J47242o7583D5213O5526B6105L41623b39734
$$ plain form
12181 179753 444297 110472 63841 -236352 131230 184145 -83868 5982 -119336 58037 305997
12170 305997 53470 82164 27506 92718 429736 264184 357605 323549 394964 448291 306664
12159 306664 20927 93877 62611 265982 410083 209658 -300048 -24491 62815 -139163
12148 372825 211445 319736 -134369 159710 -146416 32309 548953 259424 364913 109872
12137 126398 329493 340102 -10547 -56231 220203 141744 -45403 -30149 94063 -30471 215457
12125 325606 -282392 220383 170711 493787 10620 -17882 176474 141173 83949 116403 4178
12113 181140 -14875 385012 186418 389931 17116 218550 136585 -21270 81690 109206 -18851
12101 167537 -39963 96860 81537 24827 172069 104486 45213 110739 26105 367728 -239734
12089C704L03902n841A22427J28334j09281g607k88333A21384R6848q4520c53
12077A51759N4866e7525B74416h3175A06874J4500J01215O8117d0815O418H0233
12065b2801E5638O2681j4532g3011C07927A45054J55878C3417K110c00211C6093
12053A67764Q2178D4017M07766A67147A6300J652J85864M6446r2274G8464L56536
12042D35000D6719b37546f9773b013B71125f545C52118a49426e1810r7817E7498
12030g8919m6450G1089e6338k7831B81244G6431N5720d3192A06576a18212C3295
12018A00761K85892m1536A15364B8588f9249A07052a78317A97242a80954b2267
12007A28645J8044K519b23245B70282i0249L0338C21054d5712E3266c606E3458
$$ plain form
12089 3704 307606 301765 122427 250761 141480 -7607 -295940 121384 218232 133712 -353
12077 151759 206625 -57525 274416 -83175 106874 121374 222589 290706 -40815 -34397 80233
12065 -22801 55638 118319 103787 -73011 307927 145054 300932 33417 35527 -300211 36093
12053 167764 249942 44017 451783 167147 16300 17952 203816 250262 157988 78464 435000
12042 435000 46719 -237546 -69773 -2013 271125 -6545 352118 -149426 -51810 -149627 57498
12030 -78919 -125369 71089 -56338 -84169 281244 76431 132151 -43192 106576 -118212 33295
12018 100761 386653 345117 115364 28588 -69249 107052 -178317 197242 -180954 -22267
12007 128645 146689 149208 -223245 270282 -90249 -59911 321054 -45712 53266 -3606 53458
11995A597f9627J7579a529m4083J5823j26233d832I5099J35112d5300J6551l0976
11983e9725r4777K553A50959i1404A03221f5761k8911F348L2987b60345N0786
11972b09559k63443A31947a30628A13151J22542c48175c2335r1199d9076E1069
11961c4691l0608j40535g986E45784B00961b76602B59939l2899B4106J31944b50310
11949H2740M6639K320E7822A6905N0067K28502D0686K05484l1713h9843D3656
11937H7088l2676J25057p4161b66428H0967a20762B02366b99411a8556j97815
11927b16371j34470N7961C50896G0158M5948j528b30219B18004D2925J59850G5086
11915a27510A30827b00972K7619C2705a60623L1621D3496a55703O5840A8899d119
$$ plain form
11995 1597 -69627 -52048 -1529 -45612 -29789 -156022 -4832 95099 230211 -45300 -28749 -59725
11983 -59725 -154502 -151949 150959 -91404 103221 -65761 -94672 6348 39335 -260345 -209559
11972 -209559 -473002 131947 -130628 113151 235693 -348175 -32335 -123534 -49076 51069
11961 -34691 -65299 -205834 -7986 545784 200961 -276602 259939 227040 24106 156050 -250310
11949 82740 129379 131699 57822 16905 66972 295474 40686 246170 214457 -89843 43656
11937 87088 54412 179469 105308 -266428 80967 -120762 202366 -299411 -18556 -216371
11927 -216371 -350841 -292880 350896 70158 116106 114578 -230219 218004 42925 202775 75086
11915 -127510 130827 -200972 -173353 32705 -160623 -129002 43496 -155703 -89863 18899 -4119
11903c32289H763a38693j28095j95n2238N1569g8276A1194J79085e7045k12742
11892b69787E45924c71732A64399o6682m7788a72289B72478C5897j0396b47337
11881a66614g8228A25928j1413B5321a01418J816r9299l0588B44402A6110b8715
11869a84881A75100F6609b07896B46815q1996a47206b4367j19690M3159j74413
11859b75311f3696j14617C67356c030D97727B2623g3259A8073a21001k60268J32515
11848b48754M8929A12005b23728N5532L4468c3843C3840a705p6879j07410A16932
11836F6636d6882k93299A2114h8714P687j53644B90614a97266B15334J2382a01335
11824c34779R5982g5254j06556k33197a42837l25352B09624H5775c2300E4936
$$ plain form
11903 -332289 8763 -138693 -266788 -266983 -319221 -267652 -78276 11194 190279 -57045 -269787
11892 -269787 545924 -371732 164399 97717 49929 -172289 272478 35897 25501 -247337
11881 -166614 -78228 125928 114515 25321 -101418 -99602 -198901 -229489 244402 16110 -28715
11869 -184881 175100 66609 -207896 246815 164819 -147206 -24367 -144057 -100898 -275311
11859 -275311 -63696 -178313 367356 -3030 497727 22623 -73259 18073 -121001 -381269 -248754
11848 -248754 -199825 112005 -223728 -168196 -133728 -33843 33840 -1705 -78584 -185994 116932
11836 66636 -46882 -340181 12114 -88714 -81027 -234671 290614 -197266 215334 227716 -101335
11824 -334779 -238797 -75254 -181810 -415007 -142837 -468189 209624 85775 -32300 54936
11813a83237a2000e087B07333J84926b50882G9575a58064A72115c1173A1824K69031
11802B80855c41808f6158A51633c56730G0098f0380C6890K55640k5344r2075a92285
11790a1161j17760a1588m60307D4100J10347F7017i024B46355G1664b03121d9185
11778B6329a97619g8119k1704D3855b8024I8056l9087a38853B91448e7814k08792
11767b66606F3710R1752a47498j8876j04643A01245a97501K7156k11380A91885
11756b60920a0247k47845g6855A46954C242a46647A94891d21489A78325m5616
11746A32709J25219A1011K45092A07294a35494C05544b46260B42286A5062a509
11735c110j08644B20585f9570a433C378J79198b16260j41928a16262B99211a00114
$$ plain form
11813 -183237 -12000 -5087 207333 392259 -250882 79575 -158064 172115 -31173 11824 280855
11802 280855 -341808 -66158 151633 -356730 70098 -60380 36890 292530 267186 175111 -192285
11790 -11161 -128921 -11588 -471895 44100 154447 67017 -9024 246355 71664 -203121 -49185
11778 26329 -197619 -78119 -99823 43855 -28024 98056 58969 -138853 291448 -57814 -266606
11767 -266606 63710 155462 -147498 -166374 -271017 101245 -197501 -170345 -381725 191885
11756 -260920 -10247 -258092 -76855 146954 3242 -146647 194891 -421489 178325 132709
11746 132709 257928 11011 256103 107294 -135494 305544 -246260 242286 15062 -1509
11735 -3110 -111754 220585 -69570 -1433 3378 182576 -216260 -358188 -116262 299211 -100114
11723E9170a75886A95150N2835b78009B7387c3967j29755A5618b36871J10259
11713a26612A2413h4624A14031e1326A10190a51508B48653c14141g3203B34251
11702d8078a0900k50365I0313k8315L81974G8070P7816b21012C29341g7127n1917
11691a29044j09152j44480E8078b423C39935j33181a47535D4100L0561a11517
11680f375l37479A70665C7455a87163g465C23767A4192K66792p4353R5272b72935
11668g1836j256o7162m6770j05510I0854D4567J16703a34623j84613A82708L94907
11657E77615h327A41812A115a54144B60150l9983j01625J68458j14926d765H1796
11645B69019A8138K04625h1209K6644F7640J22089d28295a33173n5081A72126
$$ plain form
11723 59170 -175886 195150 247985 -278009 27387 -33967 -163722 15618 -236871 -126612
11713 -126612 12413 -84624 114031 -51326 110190 -151508 248653 -314141 -73203 234251
11702 -48078 -10900 -261265 90313 61998 443972 78070 155886 -221012 329341 -77127 -129044
11691 -129044 -238196 -382676 58078 -2423 339935 206754 -147535 44100 74661 -111517
11680 -6375 -343854 170665 37455 -187163 -7465 323767 14192 280984 206631 301903 -272935
11668 -71836 -73092 -140254 -187024 -292534 90854 44567 161270 -134623 -319236 182708 577615
11657 577615 -8327 141812 1115 -154144 260150 220167 118542 287000 172074 -4765 81796
11645 269019 18138 222763 -81209 -54565 67640 189729 -428295 -133173 -188254 172126
11634a21955K5802K3729C78988h874k18144c9733A94179E6196a17502A27315F0096
11622H9860L7553K30119A63683b55566J14692d5044A84071a67559d5910m0965
11612h6875A0977K42429a1314A48612J07805d1956o7679H1355B8560d70836a6552
11600h6354k4833A67975a59996G1197b1840B57418a16441I3510N3903o7865b5329
11588a66143O3395E108a53708j38589B5414L16006h8759B8998L5366d206j162
11577e368o0379E0009J34284a80601B4492K7535E701A463L0568a25014G4062b03654
11564D43138i3248C6687J87212j09314J93193e1515A68105a67670E2953d4265
11553A67895l5388N4372H0889a3514j63357A3160a56r7323A30929M7626a09612
$$ plain form
11634 -121955 -96153 -72424 378988 -8874 -227018 -39733 194179 56196 -117502 127315 60096
11622 89860 127413 357532 163683 -255566 -140874 -45044 184071 -167559 -45910 -86875
11612 -86875 10977 253406 -11314 148612 256417 -41956 -109635 81355 28560 -470836 -16552
11600 -86354 -111187 167975 -159996 71197 -21840 257418 -116441 93510 147413 79548 -25329
11588 -166143 -102748 5108 -153708 -292297 25414 341420 -88759 28998 64364 -4206 -5368
11577 -5368 -65747 50009 184293 -180601 24492 52027 5701 1463 32031 -125014 74062 -203654
11564 443138 -93248 36687 223899 114585 307778 -51515 168105 -167670 52953 -44265
11553 167895 132507 186879 80889 -13514 -176871 13160 -156 -97479 130929 178555 -109612
11541a08514b2242A58337D4172r556R504K29986k8408e6832A08888J25650J56538
11530C91076c0379B76365a70740h4380A19925l6018a87522D51179c34094a2399
11519a30229A75658a70788D8680c40522h5944B55701j21389J82383a1005m174
11509a5179C91617A80987c00274B2342J62803C4418L38678j13072G8837o300K687
11498G5224a24338n9588Q910B5008J10948K46867h4149j11508d4647m9661b5224
11486b01961B24334a43041p1404D88002j97506D7960c65488C74672F3715K54749
11476C18464j08457F2269K50425p282j37610L234J04702L4472J75920E8515L60308
11465D18823A63832a0351I4271R0408J35150i818o0810j6482I0486K73472D3180
$$ plain form
11541 -108514 -22242 158337 44172 34616 44120 274106 245698 -56832 108888 234538 391076
11530 391076 -30379 276365 -170740 -84380 119925 83907 -187522 451179 -334094 -12399
11519 -130229 175658 -170788 48680 -340522 -85944 255701 134312 316695 -11005 -15179
11509 -15179 391617 180987 -300274 22342 185145 34418 373096 260024 78837 72537 75224
11498 75224 -124338 -183926 -175016 25008 135956 382823 -84149 -195657 -44647 -94308 -25224
11486 -201961 224334 -143041 -214445 488002 290496 47960 -365488 374672 63715 318464
11476 318464 210007 62269 312694 305412 167802 171036 275738 310210 486130 58515 418823
11465 418823 163832 -10351 94271 184679 319829 -9818 -70628 -87110 90486 363958 43180
11453h1066B1522R1132i6868A10598K33437i1553B07000F1169K91388A30613k4505
11442A06108b66866A85901a47013b0539C33011A1562a28137e7347A66720O7457
11432B34177f580A61915J2982C2885K38401p7284G8213a3826F5408J41123k4001
11421A82530p1399a09102B3191a74899K5670D9299c41429B15522R2346R7037A39280
11409B05716h9045j3298A12147J44199K5018c02234F7358A1282b4401B15053h5899
11397b04808A41978J71040q1557a1843B73094r2555H2398a78173G8344b06378
11386c3339B8939b04286A65528e4198B17812p533h6417A9043a94682A61407e3691
11374b00483B43064b43743j28725J23466B291P5616a85721f2235j10688A47853
$$ plain form
11453 -81066 21522 112654 -96868 110598 344035 -91553 207000 61169 352557 130613 106108
11442 106108 -266866 185901 -147013 -20539 333011 11562 -128137 -57347 166720 234177
11432 234177 -6580 161915 174897 32885 271286 194002 78213 -13826 65408 206531 182530
11421 182530 111131 -109102 23191 -174899 -149229 49299 -341429 215522 307868 404905 139280
11409 205716 -89045 -102343 112147 256346 281364 -302234 67358 11282 -24401 215053 -85899
11397 -204808 141978 313018 231461 -11843 273094 180539 82398 -178173 78344 -206378
11386 -33339 28939 -204286 165528 -54198 217812 210279 -86417 19043 -194682 161407 -53691
11374 -200483 243064 -243743 -372468 -249002 2291 77907 -185721 -62235 -172923 147853
11363I2323m2988b28142M8111M1987D5440b746B7207Q8350l3069b1694E9423J7068
11351G6491C7923J9469b14067f4451D9295c6841a4945H2597h5852A85034a28555
11339D22109a27935A82413b12509Q4524f0726C8615j944a26636n7084F9030Q9770
11328A58800J58459H4266J64624c35900A25615e9569j28755o0064f8411j29429
11318a97840D1005b7100j86121A36495b83370J38786A87327A1245b06134A09778
11307a27689A7165a83438I2148a44515d9211k87028J60725J4377d0358B89899
11296a9037A9815i3072j34440j32241e2748A71235E1576c6091M197B78637N6266
11285C34903a34403q0905J01748g432A51000a77356F679a24313j07326B01928
$$ plain form
11363 92323 49335 -228142 -180031 -138044 45440 -2746 27207 115557 82488 -21694 59423 76491
11351 76491 37923 57392 -214067 -64451 49295 -36841 -14945 82597 -85852 185034 -128555
11339 422109 -127935 182413 -212509 -127985 -60726 38615 36671 -126636 -183720 69030 158800
11328 158800 317259 84266 248890 -335900 125615 -59569 -188324 -248388 -68411 -197840
11318 -197840 41005 -27100 -213221 136495 -283370 -144584 187327 11245 -206134 109778
11307 -127689 17165 -183438 92148 -144515 -49211 -336239 -175514 -161137 -40358 289899
11296 -19037 19815 -93072 -227512 -359753 -52748 171235 51576 -36091 -31894 278637 334903
11285 334903 -134403 -215308 -113560 -7432 151000 -177356 6679 -124313 -231639 201928
11274b39039A58872a01270d1430j00902G0297J49801p6490k433g0605A99701I8750
11262C40780a03402j79029J02831o627k1955A73623c9964k3732L981m3784C4905
11250A73620c30404h3465A56474a8051k23285J02635j22336A02656I953J63996
11240A73949a02900E6566K3601J41761a84189A14013a26690A99036J1237j6014
11230A94259a16836E62375c13144d1264j40978M6878a0719r8794n7568g4246j15039
11219a89285B17773C6879b77217j14566a69360D4419c00972J13340K8435H0321
11208B24805a45267B1638P230b7522k68094a37086L6206B21449b27281R2149A16529
11196A2421M9933c6582F7224K03946b6050F0911J68216p5547e5334q1758C3603
$$ plain form
11274 -239039 158872 -101270 -41430 -142332 70297 220098 143608 141175 -70605 199701 98750
11262 340780 -103402 -282431 -179600 -186227 -208182 173623 -39964 -63696 -59715 -103499 34905
11250 173620 -330404 -83465 156474 -18051 -241336 -138701 -261037 102656 9953 173949
11240 173949 -102900 56566 80167 221928 -184189 114013 -126690 199036 210273 194259
11230 194259 -116836 562375 -313144 -41264 -182242 -135364 -10719 -109513 -167081 -74246 -189285
11219 -189285 217773 36879 -277217 -391783 -169360 44419 -300972 -187632 -159197 80321
11208 224805 -145267 21638 28868 -27522 -295616 -137086 -100880 221449 -227281 -135132 116529
11196 12421 62354 -36582 67224 271170 -26050 60911 229127 153580 -55334 -137092 33603
11184F80b1358k21539h489H6411b61743i6181G0644g7228q6899d9212n4954J567
11172a02599k25358J38021k56020a4808j16321l7282e8864a0088m70195K03978
11162b76305b2550j71204E1482j3047A1480J27854N6404H0419h8168A08479c07021
11150a48517E4974f2018f314G4904a37104G349R781a34327d2465j56702P6867
11139a22300e2945j97834F6710K44535b00416l6197Q2426F5866L32964c18173
11128I6794J66459G1807g2575r1139N6526d6231J7185o7071n4100I2304c1169
11116b57381E67950I0252C1543R3610A6722J18740m9542J28564l9753j4070l1425
11105A29236M0850a30163I0122K02031a48758A27974c1843H2480c69559B66046
$$ plain form
11184 680 -21358 -242897 -8489 86411 -261743 -96181 70644 -77228 -164127 -49212 -104166 -102599
11172 -102599 -327957 -189936 -445956 -14808 -131129 -168411 -58864 -10088 -480283 -276305
11162 -276305 -22550 -193754 51482 38435 11480 139334 195738 80419 -88168 108479 -307021
11150 -148517 54974 -62018 -6314 74904 -137104 7349 17130 -134327 -42465 -199167 -122300
11139 -122300 -52945 -250779 66710 311245 -200416 -236613 -154187 65866 398830 -318173
11128 96794 263253 71807 -72575 -163714 -107188 -46231 -29046 -96117 -150217 92304 -31169
11116 -257381 567950 90252 31543 125153 16722 135462 85920 214484 174731 160661 129236
11105 129236 170086 -130163 90122 292153 -148758 127974 -31843 82480 -369559 266046
11094A07928f8840R771I2048M9821K0854a37384A67869J92865F059K17564J77474
11083D01097j9332l2333J24214o6242r0059g4827C72471G1243j9052L36202A57503
11071a322D16779J27778A73399k2657C031L43311J17441L8210A09915L60688l2044
11060D38559j3110q1722L02130j29221k29867M18497j8755J2800O5563k65157
11050D99717L04653k53608J75630J68764k52310K23441l33232K29218o6349K62853
11040I58777q7309k04927L01220k26359p8785N9281L11204r7416k04410K49601
11030I80877J13646m30046K73739p3746l31391K99051p7566J89673l8569K02178
11020A107846n18965P6420k90805R5579K65622j15705J99990C05224K98135j33991
$$ plain form
11094 107928 -68840 -59069 92048 141869 162723 -137384 167869 360734 6059 223623 401097
11083 401097 381765 349432 473646 407404 317345 -74827 372471 71243 52191 388393 157503
11071 -1322 416779 544557 173399 150742 3031 346342 463783 501993 109915 470603 438559
11060 438559 425449 343727 645857 516636 286769 705266 686511 699311 764874 499717
11050 499717 804370 550762 726392 895156 642846 866287 533055 762273 695924 958777
11040 958777 871468 666541 967761 741402 662617 721898 1033102 935686 731276 980877
11030 980877 1094523 664477 938216 864470 533079 832130 754564 944237 905668 1107846
11020 1107846 588881 665301 374496 470075 735697 619992 819982 305224 603359 469368
11010D69368M80182l67729N869q8843O34634n47517J54840N9476l9725J01117
11000H61672k29419M290j17246n8497Q6331J53724l2182K73566k10771j71989
10990E59479M11010j84026L79687m17132O2220J03174l66794J98536J87395J47594
10980A081143j77132j38318L05147J02124J8664K89396q8640J76715M91974L50483
10970B411556R1133M54085m49583J9585L97377l67126L71038k08519k99568l09144
10960B110834j51197m43648N9023r4878J45215J00499k86004J96621l04712J37095
10950A468848L5113k83392J10383m02567j34250j47882K0737o7836A33055K50087
10940C83142j45566J29263j62680K63547A68714a21894E9124a51359C0724G839
$$ plain form
11010 469368 949550 581821 587690 498847 1133481 585964 740804 800280 760555 861672
11000 861672 632253 636543 519297 460800 547131 700855 668673 942239 731468 559479
10990 559479 970489 786463 1166150 749018 811238 914412 547618 746154 933549 1081143
10980 1081143 904011 765693 1070840 1172964 1191628 1481024 1392384 1569099 2061073 2411556
10970 2411556 2502689 2956774 2507191 2526776 2924153 2557027 2928065 2719546 2419978 2110834
10960 2110834 1959637 1515989 1575012 1480134 1625349 1725848 1439844 1636465 1331753 1468848
10950 1468848 1503961 1220569 1330952 928385 794135 646253 666990 599154 133055 383142
10940 383142 237576 366839 204159 467706 168714 -121894 59124 -151359 30724 7839
10929A03124b41406C21757a56405A27402C6539L954c2426k7156j44282g7747L965
10918g3782J2314l0095J111M3443I9403J91612a36638G1289a39633j16871J17300
10907a39204J4587j7422A18329k1701i5n8751I8889Q7795e2382E2892b62943A5919
10894A04982d6217o5242b8684l1208P659A25502c09163A06275i6200k1571o3106
10883a80877B09060d0535k7345m7720j92518e2722j27280C25841A41435E7810
10872b34077O7542A47905a26764k68207d2704B22612k4717h2291A72922D4075
10861a12314g619l40817a02420j36676P1410r2949A51797f2654A71725n0655b0286
10849e379E348c0436G5437L30300A78372a42851e6976r9405F9081R1327L99254
$$ plain form
10929 103124 -241406 321757 -156405 127402 36539 40493 -32426 -59582 -203864 -77747 -73782
10918 -73782 -61468 -91563 -90452 -47009 99403 291015 -136638 71289 -139633 -256504 -139204
10907 -139204 -124617 -142039 118329 96628 -95 -58846 98889 186684 -52382 52892 -262943 15919
10894 104982 -46217 -111459 -28684 -59892 -52233 125502 -309163 106275 -96200 -117771 -180877
10883 -180877 209060 -40535 -67880 -115600 -308118 -52722 -180002 325841 141435 57810
10872 -234077 -166535 147905 -126764 -394971 -42704 222612 197895 -82291 172922 44075
10861 -112314 -7619 -348436 -102420 -239096 -167686 -260635 151797 -62654 171725 121070 -20286
10849 -5379 5348 -30436 75437 405737 178372 -142851 -56976 -156381 69081 160408 559662
10838E59662A18837a43058K6297j70243H3501b36759C43497d86504g8103j35109
10828b13212j75450a55224P077n8578e4331A05324g4980L6123n5540K5062A93852
10816A30450a0946m18641e5341B77070e7491B31354j03277A0332a25233e9338
10805A64J07460R9836p1013a93034D3964b19054d5360l21091J06749c1531k789
10794c4320I9721P7971c42773A59724c01031G0306A8922d35236J16604A76835
10783D6880h0261o4440P1941j86026g4719E8641L1680c09905J33495F8329b33804
10771a16294A70888a28550D9692A0948b92346i6213j11884B29427I0462a73480
10760a94434A8507J1961c2346n2614A35191K4815a97891e2657B17081h1748d240
$$ plain form
10838 559662 118837 -143058 -116761 -287004 83501 -236759 343497 -486504 -78103 -213212
10828 -213212 -388662 -155224 -148147 -206725 -54331 105324 -74980 -38857 -94397 -69335 193852
10816 130450 -10946 -429587 -55341 277070 -57491 231354 128077 10332 -125233 -59338
10805 164 107624 207460 136447 -193034 43964 -219054 -45360 -366451 -259702 -31531 -34320
10794 -34320 99721 177692 -342773 159724 -301031 70306 18922 -435236 -318632 176835
10783 46880 -80261 -144701 -72760 -258786 -74719 58641 90321 -309905 -176410 68329 -233804
10771 -116294 170888 -128550 49692 10948 -292346 -96213 -208097 229427 90462 -173480
10760 -194434 18507 30468 -32346 -84960 135191 160006 -197891 -52657 217081 -81748 -4240
10748e1706B49956C9913h8520J6953E1524a46995i706k78643A29120a93355R4898
10737i8457d6278A26256f0676l9076j12675g0557j19507B99763d99328b48230
10726C9202J55622a36033D5476K36116I7010a64166k28612F2027n835c09076J15828
10715a93248L7596d6586I9435a65971O2643I5708o87J97170c09835G8318e760
10703b32929H7208c36820H7723c83634J37801A38221a87522A62663a92385e8449
10692c93644h0605H0656a34920H591a6534G5545K49951a52317N1408d2151A37155
10680a63406e2946A15345a41458A51047b52227D90382a50850C6174N8600b16165
10669G7944c16764h6657I7106G564c60087e8977k9044H8744J93954b28342B02890
$$ plain form
10748 -51706 249956 39913 -88520 -71567 51524 -146995 -9706 -288349 129120 -193355 -98457
10737 -98457 -46278 126256 -60676 -99752 -212427 -70557 -190064 299763 -499328 -248230
10726 39202 194824 -136033 45476 281592 97010 -164166 -392778 62027 56192 -309076 -193248
10715 -193248 -155652 -46586 99435 -165971 -103328 95708 95021 292191 -309835 78318 -5760
10703 -232929 87208 -336820 87723 -383634 -245833 138221 -187522 162663 -192385 -58449
10692 -393644 -80605 80656 -134920 8591 -16534 75545 325496 -152317 -100909 -42151 137155
10680 -163406 -52946 115345 -141458 151047 -252227 490382 -150850 36174 94774 -216165
10669 77944 -316764 -86657 97106 7564 -360087 -58977 -88021 88744 282698 -228342 202890
10657b07958N7246j942j23347J23847e1346p863D9738h5582k57456J39225g7625
10645A04337a42331A07379a70291H0739J05290F6138j3831b65946c59I8527c48263
10633a84758B197J38080c12700B08308Q8703H8188a40607J2062j93314L7657e537
10621b03249A4360c2553l46752g9497o6996r8319f3138A10317b4281l11116J56901
10610a78496J2754N5623B26401f2324b0328n5272q9915m2517h9229K8716k61902
10599c22415C81878j75499a87469A63215a58203B75071b4692I865O7023C6981
10588a1886k10763f7038j55228J06145A17412j8544B5544a59896e9821B05084
10577A1916b85457J23565e3152a6804A94329e08029b18996i5144k26547B6843
$$ plain form
10657 -207958 -150712 -152654 -276001 -152154 -51346 -59209 49738 -85582 -343038 -203813 -77625
10645 104337 -142331 107379 -170291 80739 186029 66138 52307 -265946 -359 98527 -348263
10633 -184758 2197 140277 -312700 208308 297011 88188 -140607 -128545 -321859 -284202 -5537
10621 -203249 14360 -32553 -379305 -79497 -146493 -244812 -63138 110317 -24281 -335397 -178496
10610 -178496 -165742 -110119 226401 -62324 -20328 -75600 -165515 -208032 -89229 -60513 -322415
10599 -322415 381878 206379 -187469 163215 -158203 275071 -24692 9865 76888 36981
10588 -11886 -222649 -67038 -222266 -116121 117412 98868 25544 -159896 -59821 205084
10577 11916 -285457 -161892 -53152 -16804 194329 -508029 -218996 -95144 -321691 26843
10566I5592h9363A22275J4730c391B59187j19357J16863h4283o1323K3977a9593
10554h0292A36957c4150k14160g6448B26883d3247H4717J1382b07497L5710A67268
10542d3274q3470k9236A12377f9428j08303c1924k20745l5629a12300o5502J4572
10531a63230e6827H2480a79155L341e6288G7476b02677f5581J4947j90190a02809
10519a23861o2933D764i9372l7363e1119B64762n4177a28381E0778J49791G1473
10507A29431d7702j46657d3202C6184O4589d6230o2532c9323B6108J82044b0324
10495A42794J02337a90813e891A37926g4659A51720K9678b283E0158K8848J42929
10484B21935e4142j20148B50087a79334d0833B69032D6646N8671L57221j07301
$$ plain form
10566 95592 -89363 122275 137005 -3391 259187 139830 256693 -84283 -145606 -121629 -19593
10554 -80292 136957 -34150 -248310 -76448 226883 -43247 84717 96099 -207497 -171787 167268
10542 -43274 -126744 -155980 112377 -69428 -177731 -31924 -252669 -288298 -112300 -177802 -163230
10531 -163230 -56827 82480 -179155 -175814 -56288 77476 -202677 -65581 -50634 -240824 -102809
10519 -123861 -186794 4764 -99372 -136735 -51119 264762 210585 -128381 50778 200569 71473
10507 129431 -47702 -194359 -43202 36184 100773 -46230 -108762 -39323 26108 208152 -20324
10495 142794 245131 -190813 -5891 137926 -74659 151720 181398 -2283 50158 79006 221935
10484 221935 -54142 -174290 250087 -179334 -40833 269032 46646 105317 462538 355237
10474C55237J61308L0697k30453A36174a05484D80267A3717Q7999D3158J7774
10464F0932K3550G846J65034c84976A84652e8160m52251c0327j52427K9830D3197
10452g8376j36413H2487a37567R508M0336j32400j63413P9038H798a37077i186
10440b02115K5283B00041a62872n2630P3643o4988K6517b1154A12498b27909R1528
10429a36381k02793f1258b7819j4763B84327a08641l9409D7612b40604J00269
10419a40335N5719B41639b0269B3472b45946a22405k8959Q379e8404B46138a91004
10407A50313B2704K2512a16622L2221A18548F77c20455B17529d10018a74578A79548
10395A043M4128J69456a47557A08317L9046C7638K31056A08796f5751B18140F1446
$$ plain form
10474 355237 516545 547242 316789 136174 -105484 480267 13717 101716 43158 60932
10464 60932 84482 7846 172880 -384976 184652 -58160 -510411 -30327 -182754 -152924 43197
10452 -78376 -214789 82487 -137567 -128059 -87723 -220123 -383536 -304498 8798 -137077 -9186
10440 -202115 -176832 200041 -162872 -215502 -141859 -206847 -180330 -21154 112498 -227909 -136381
10429 -136381 -339174 -61258 -27819 -42582 284327 -108641 -148050 47612 -240604 -140335
10419 -140335 -84616 241639 -20269 23472 -245946 -122405 -151364 -142985 -58404 246138 -191004
10407 150313 22704 45216 -116622 -84401 118548 677 -320455 217529 -410018 -174578 179548
10395 1043 45171 214627 -147557 108317 147363 37638 268694 108796 -65751 218140 61446
10383B49067a8761H1592Q9568b05305I6633L41251A18865B9825K13882M1665q7705
10372A97667L01661k49658F0829C0175J04137o1554a8511C07430J81242k160J55751
10361F42263C10358j45760o6500b71102F21086k09806A70740e7477k7972C65449
10350b9149F42325C15259J69512j10213m2467j16203M13434B58745K7568j9716
10340B66597j7240q0977J61732j17068o4509L04595h3598B29220H9432J38882
10330B28314q7952E9558R8637N5970D56M33394A14725J09815a4525B36342a5379
10318B87758j40659R3787F1220J38269k1205g157A57206a90634Q6289A33461K84982
10307D18443b73072F8416l2681N8661b0826A9669d7671A74719A3226c01914f9406
$$ plain form
10383 249067 -18761 81592 171160 -205305 96633 437884 118865 29825 243707 285372 197667
10372 197667 499328 249670 60829 30175 134312 72758 -18511 307430 488672 486512 642263
10361 642263 310358 164598 98098 -271102 621086 411280 170740 -57477 -85449 365449
10350 -29149 642325 315259 484771 374558 332091 215888 629322 258745 286313 266597
10340 266597 249357 168380 330112 213044 148535 453130 -83598 229220 89432 228314
10330 228314 140362 59558 158195 214165 456 433850 114725 224540 -14525 236342 -15379
10318 287758 147099 240886 61220 199489 178284 -7157 157206 -190634 -104345 133461 418443
10307 418443 -273072 68416 35735 94396 -20826 19669 -47671 174719 13226 -301914 -69406
10295b94412M8326F9761L45959c12168j49072e2729j8298D26638i6594d2253J7530
10284b4723j71709B5981g6574R830J9864G204a26969m9927j26662J20314A11499
10272a698D16163a12272B6338e2248R175A51657o3411d6036A7426J27250a76512
10260b14955a2029A20861b32372C1050a04127A50060D9867O4790m289R4199J14234
10249C18801q9604D6226a69384A0583L09210a75597E889b64874N791A6837J17785
10238A34622J30095c3257j11229d5382m3157q8997b0509I3996a56837k9084D874
10226a97675L873C4229Q1204b52611j99643H4591H879a27356B7783a80590P0393
10215a10197m4499L4655F6138b01483F8155J4598g7038E7084a31408A6292a71855
$$ plain form
10295 -294412 -246086 69761 415720 -312168 -461240 -52729 -71027 426638 -96594 -42253 -24723
10284 -24723 -196432 25981 -76574 -66744 -46880 7204 -126969 -176896 -303558 -183244 111499
10272 -1698 416163 -112272 26338 -52248 -43073 151657 88246 -46036 17426 144676 -176512
10260 -214955 -12029 120861 -232372 31050 -104127 150060 49867 114657 110368 204567 318801
10249 318801 229197 46226 -169384 10583 319793 -175597 5889 -264874 -259083 16837 134622
10238 134622 264717 -33257 -144486 -45382 -88539 -177536 -20509 93996 -156837 -185921 4874
10226 -197675 -193802 34229 115433 -252611 -452254 84591 8879 -127356 27783 -180590 -110197
10215 -110197 -154696 -120041 66138 -201483 68155 82753 -77038 57084 -131408 16292 -171855
10203a38608a8671C1113a54945d5543j25340C05621b92018d9382G0626N8496a34602
10191A23843C8906c1025m30817A34455J03341b6549F9459a187A08479a11540J6518
10180i5022F0592a76105O7971A05383b86606h6395j45441a08241l3330p5550l256
10169b20377f2505K2752B01656G39g2351k00186J1597J07211d5546D7031Q8059
10158A35090a57854A18981i2460c8217A23254a08074k41477Q7047H9146a4432
10147b79143J10099I7999a52457b1688a203p8292j5401a9316k53726F0584c23111
10135G638b60209H915a88104j47457G7915a46514o8192j1626E6619K27411I1108
10123a22225j54363A55894b38067O5595e8654E3716c3834j02404k37813a02963
$$ plain form
10203 -138608 -18671 31113 -154945 -45543 -170883 305621 -292018 -49382 70626 129122 -134602
10191 123843 38906 -31025 -461842 134455 237796 -26549 69459 -1187 108479 -111540 -95022
10180 -95022 60592 -176105 -108134 105383 -286606 -86395 -231836 -108241 -141571 -217121 -220377
10169 -220377 -62505 -39753 201656 739 -72351 -272537 -260940 -153729 -45546 47031 135090
10158 135090 -157854 118981 -92460 -38217 123254 -108074 -349551 -262504 89146 -14432
10147 -279143 -169044 97999 -152457 -21688 -1203 -79495 -94896 -19316 -273042 60584 -323111
10135 7638 -260209 8915 -188104 -335561 77915 -146514 -214706 -226332 56619 284030 91108
10123 -122225 -276588 155894 -238067 -172472 -58654 53716 -33834 -136238 -374051 -102963
10112a11995J3577j36044f2844j00543H3315N8485h3945k96319A4405i0734q0538
10101a71272j71036a38498k03997a2293B34935a62964N1918B14432D8091O5726
10091A13817b36249I0957C5495a72588r3080A6427e8377n5410m43585E263h2191
10079A65126f6023b4265j24641n664a4792n78874C09425a63048k0577j98922k7992
10068d10539A08022b4435H4970C5767a1136n94901a15538q7250a131j43315j05085
10057b49531C29579D4028a73362F727K11807b76516I4577m2443e0845k99506N2770
10046b97581F8866c634C09660d3713j23768N5366r235l21104f8555k7096a7788
10034a57998e8954r2150N4265n1681O6413o7254e5892C22084B1433g7876A01592
$$ plain form
10112 -111995 -98418 -234462 -62844 -163387 83315 141800 -83945 -380264 14405 -90734 -171272
10101 -171272 -342308 -138498 -342495 -12293 234935 -162964 -111046 214432 48091 113817
10091 113817 -236249 90957 35495 -172588 -265668 16427 -58377 -113787 -557372 5263 -82191
10079 165126 -66023 -24265 -148906 -154570 -14792 -593666 309425 -163048 -183625 -382547 -410539
10068 -410539 108022 -24435 84970 35767 -11136 -606037 -115538 -202788 -1131 -144446 -249531
10057 -249531 329579 44028 -173362 6727 218534 -276516 94577 52134 -50845 -350351 -297581
10046 -297581 68866 -3634 309660 -43713 -167481 -112115 -121350 -442454 -68555 -95651 -17788
10034 -157998 -58954 -151104 -96839 -148520 -82107 -149361 -55892 322084 21433 -77876 101592
10022b65625d0180k02958a08744A45517a52919j73840a9756A25643f3830A36568
10011a01032L4533B4371b26748B49354a01571b3998k62752a11252j5041B70910
10000d2534j51580j63676b6161n1365b8326k02249J7578N4667n02646b55591A27321
9988h4023c2701k28480J14402j24289A2774b65813f4794A66183m7008C9171g8438
9976E6638P7365i609j06238G7365c95672i8536c2709A47826M930c48694H3694
9964a64816H8263a42174F383a34691e0886j34073F8716b29847J11686e0650J6832
9953c3818j24603M4754C08179j8285m5678d9472J683k05286A2284J17116a52958
9941a0244m9365I7885a91222E1207N4078a14354m7340O259N5185o4911l8083j91293
$$ plain form
10022 -265625 -40180 -243138 -108744 145517 -152919 -326759 -19756 125643 -63830 136568
10011 -101032 -66499 24371 -226748 249354 -101571 -23998 -286750 -111252 -126293 270910
10000 -42534 -194114 -357790 -26161 -77526 -28326 -230575 -212997 -158330 -660976 -255591 127321
9988 -84023 -32701 -261181 -146779 -271068 12774 -265813 -64794 166183 119175 39171 -78438
9976 56638 134003 -9609 -115847 77365 -395672 -98536 -32709 147826 152756 -348694 83694
9964 -164816 88263 -142174 6383 -134691 -50886 -184959 68716 -229847 -118161 -50650 -33818
9953 -33818 -158421 -113667 308179 289894 244216 -49472 -47789 -253075 12284 129400 -152958
9941 -10244 -59609 97885 -191222 51207 105285 -114354 -161694 -155435 -100250 -165161 -203244 -394537
9929c94537f5583j05960d1751j61063j34587C23574E8251i9461j87837B92902
9918d9608j67317g901C0454a38857j7944k04j36789J26982o5928E8746P892a70389
9905b77701f9957k54582B2607g3853j38703D1791E200b50503P9187I7298d0812
9893h6585d1950r6682j21193a9005o917k34518F2433a41422c9448k08788C2065
9881d301m9926A22038J4621c732k2694A52441a45661j57157H8498c11056e3512
9869a68464K7580c5685j50846b7203j23974A78733q7276L4370K30839A73633C8466
9857A7922a19006M9747k78555c1071j73532h8009k40483B0806J88226K3692a44512
9845a17209b548D9906K21734e6462j76212A95650d7929A38288a52287B05039b12318
$$ plain form
9929 -394537 -65583 -171543 -41751 -202814 -337401 323574 58251 -99461 -287298 292902
9918 -49608 -216925 -7901 30454 -138857 -156801 -157005 -293794 -166812 -232740 58746 66638 -170389
9905 -277701 -69957 -324539 22607 -73853 -212556 41791 5200 -250503 -171316 97298 -40812
9893 -86585 -41950 -138632 -259825 -19005 -25922 -260440 62433 -141422 -39448 -248236 32065
9881 -4301 -54227 122038 136659 -3732 -26426 152441 -145661 -302818 88498 -311056 -53512
9869 -168464 -140884 -35685 -186531 -27203 -151177 178733 91457 125827 356666 173633 38466
9857 17922 -119006 -69259 -347814 -31071 -204603 -88009 -328492 20806 209032 232724 -144512
9845 -117209 -2548 49906 271640 -56462 -232674 195650 -47929 138288 -152287 205039 -212318
9833d16218a09392F6904g0719K9615E5167K51386b38003L2573B5457a58442n7518
9822b15960o3333C62937c10221f1565B23392o2676J9390A4736g8230K0226j95972
9811b53976e408k53620D5127i0729A69225A0356a95979F806a22172a5219C32233
9799b61313a09730j35330E8804a83776m7940f0449A52226f6239j36041i4054b9263
9787A72742h5380k93600H8356a45696F5517b34544A05210c3576q4458c9362r4035
9776a33397j9467f1992I7919a20013j07789A3053R5878a52575r8835r7719g5285
9764A10692J8380a2484I1923d8128q239l31041a33407G0929J46201h2287r2425
9753a74712I7842K5274a4573B08873d8879k75097H3482g894B00584a85488O7605
$$ plain form
9833 -416218 -109392 66904 -70719 -41104 55167 306553 -238003 -205430 25457 -158442 -215960
9822 -215960 -279293 362937 -310221 -61565 223392 160716 180106 14736 -78230 -58004 -253976
9811 -253976 -5408 -259028 45127 -90729 169225 10356 -195979 6806 -122172 -15219 332233
9799 -261313 -109730 -245060 58804 -183776 -231716 -60449 152226 -66239 -202280 -94054 -29263
9787 172742 -85380 -378980 88356 -145696 65517 -234544 105210 -33576 -118034 -39362 -133397
9776 -133397 -152864 -61992 97919 -120013 -227802 13053 108931 -152575 -251410 -349129 -75285
9764 110692 129072 -12484 91923 -48128 -56367 -387408 -133407 70929 217130 -82287 -174712
9753 -174712 97842 123116 -14573 208873 -48879 -323976 83482 -7894 200584 -185488 -117883
9742a17883J1143g406j84934j76519A31956b68865i9059B6414Q3429b08738A80028
9730d3728p1509l8281r4747f1302k04110A66275d26027a83424j55814H9053f4829
9718a9941o4517k94191J67156D0332a60187k3050b6974k88228a23397j17616F2312
9706b05221A168O2940P2308Q4882a85152F2372a20659B99187n6901o2144a12116
9694g7948b3550k6035C7504a07100A10281c26756g8394k34192I56c29884H725
9682A13537a80220A95514d05478a98417D5706J35514b03173j35692a37699j12985
9672b50684c0224j46289B29804b2303p2042d5173j761j68115B6625K9970c40551
9660A84627a85140e3183q7612L5187K9233G6348l3875j296a30629L9815A14389
$$ plain form
9742 -117883 -106740 -7406 -192340 -368859 131956 -268865 -99059 26414 109843 -208738 180028
9730 -43728 -115237 -153518 -248265 -61302 -265412 166275 -426027 -183424 -339238 89053 -64829
9718 -19941 -84458 -378649 -211493 40332 -160187 -183237 -26974 -315202 -123397 -241013 62312
9706 -205221 1168 64108 136416 221298 -185152 62372 -120659 299187 242286 180142 -112116
9694 -77948 -23550 -49585 37504 -107100 110281 -326756 -78394 -312586 956 -329884 8725
9682 113537 -180220 195514 -405478 -198417 45706 181220 -203173 -338865 -137699 -250684
9672 -250684 -30224 -176513 229804 -22303 -94345 -45173 -46934 -215049 26625 56595 -340551
9660 184627 -185140 -53183 -140795 -105608 -76375 76348 42473 41177 -130629 -90814 114389
9648G9685a30995E6173n614a06659J4229r4178M1969k57818e0213I4353i032j776
9636a0808C9489L47391a22434e6379B4881a7722k01927P8641e4540C63845j74799
9625A89046a08134e4007b2566j9327C5917i1641C8396b76192A39789a9256j37807
9614a57063M9261L6221D976J6746b3387q9888p856K3335c9629B50358p362e6648
9601e0287l998r3782j1213J8376l4633f1902J6641l1121A47520g8084L2195K1134
9589b4755k16820j2715j14642f7822o2146D6027f1133A62622b45786J11285p476
9578a41977A01551J42811c94432b6717l08965H9531a04558G8508c4881r7228B24321
9566h924j42111F4948O3854a34724A25373a43410c1465k70802i2228C2463J72589
$$ plain form
9648 79685 -130995 56173 50559 -106659 -92430 -186608 -144639 -402457 -50213 94353 -9032 -10808
9636 -10808 39489 386880 -122434 -56379 24881 -17722 -219649 -141008 -54540 363845 189046
9625 189046 -108134 -54007 -22566 -41893 35917 -91641 38396 -276192 139789 -19256 -157063
9614 -157063 -107802 -71581 4976 21722 -23387 -113275 -121131 -97796 -39629 250358 242996 -56648
9601 -50287 -54285 -148067 -159280 -140904 -175537 -61902 -45261 -76382 147520 -78084 -45889 -24755
9589 -24755 -241575 -254290 -368932 -67822 -129968 46027 -61133 162622 -245786 -134501 -141977
9578 -141977 101551 244362 -394432 -26717 -335682 89531 -104558 78508 -34881 -132109 224321
9566 -8924 -151035 64948 128802 -134724 125373 -143410 -31465 -302267 -92228 32463 205052
9555B05052b26836n7547J07522A66800a06153E8627a16522k93044a17856j351
9545a19207a9157j50601G5598a62111F1728L8639a91442h3394F8424b34088A52041
9533B433a88921E8306Q0296a16805A42302F2227b55870E53L5380e7140A06212
9521a47862j28147B6675L1429e1843D6523J88431l0262E9178a8081B4935e2828
9509a74628P6365c3305F9555c68162E4795c26319H1714b99111L6070O546J4302
9498b42193d019n4697a1035j16900A5795b70941J20871e2696B4157b6407D1252
9486d9696j2819q3797e7987J350B49991b33145j15239g9319G4513b19257a8939
9474h3930A50868b6194A88753a13710A68805c24344A34231d88004b37726G5914
$$ plain form
9555 205052 -226836 -284383 -176861 166800 -106153 58627 -116522 -409566 -117856 -119207
9545 -119207 -19157 -169758 75598 -162111 61728 100367 -191442 -83394 68424 -234088 152041
9533 2433 -188921 58306 138602 -116805 142302 62227 -255870 553 35933 -57140 106212
9521 -147862 -276009 26675 58104 -51843 46523 234954 204692 59178 -18081 24935 -52828
9509 -174628 -98263 -33305 69555 -368162 54795 -326319 81714 -299111 -263041 -256495 -242193
9498 -242193 -4019 -58716 -11035 -127935 15795 -270941 -150070 -52696 24157 -26407 41252
9486 -49696 -62515 -146312 -57987 -56637 249991 -233145 -348384 -79319 74513 -219257 -18939
9474 -83930 150868 -26194 188753 -113710 168805 -324344 134231 -488004 -237726 75914
9463A29314J16287A03898c22238a48280j6438o2998D8666b01841q1561a10352
9452C2271J16131d6100j38489B54417a46048k04325r229J57781h6535A34872b07857
9440a210A0820a00977l079k38169c8551j51500M6283C7398b8332I7660a63795
9428i3730B97849a68851g0573K0157B39558I5285a99594m6598B12424g1018k60213
9417c31231D2414b0675q7432G9523b9891m6941B98216C4880b69069c3058l85497
9406d18555B78977b9806q3053o5760C38109m7725a72923j40658e8979j89048F0150
9394a876I54M53331a35322j175A34289a77828n1674a2204j28117A15475J48556
9383B64031b02521M0056B39312I4713d08662B15659R179J1978m8302c54950a36299
$$ plain form
9463 129314 245601 103898 -322238 -148280 -164718 -227716 48666 -201841 -283402 -110352
9452 32271 148402 -46100 -184589 254417 -146048 -350373 -359602 -201821 -86535 134872 -207857
9440 -1210 10820 -100977 -104056 -342225 -38551 -190051 -143768 37398 -28332 97660 -163795
9428 -93730 297849 -168851 -70573 -50416 239558 95285 -199594 -246192 212424 -71018 -331231
9417 -331231 42414 -20675 -108107 79523 -29891 -76832 298216 34880 -269069 -33058 -418555
9406 -418555 278977 -29806 -112859 -178619 338109 290384 -172923 -313581 -58979 -248027 60150
9394 -1876 954 454285 -135322 -136497 134289 -177828 -229502 -12204 -140321 115475 264031
9383 264031 -202521 -162465 239312 94713 -408662 215659 224838 236816 188514 -354950 -136299
9371E8647A5384b6374H5176b13236B88256A36074a13677k2338a729j43350c5042
9359B18346a17097G3416a8993I2518l247b50621I2363f7704m6105C5650M5941
9348H1591b9808m0929k17747b9205j99845A76489g1088L2107B30660b11127c8720
9336a05981C3582b7892A84481E090b4609A46694a38520N0864B44604a90446M7420
9325a43026k950B4280g6657k19739A1878J63960Q613a2103A82921a21802A60167
9313a97171f7591j64269A63491b4987F9706i6978j70550a0267j23738b1856k93978
9302c15834k3957b3332j97181H8642a35003k4106N1134m15335b03880j7688A17947
9290b07119g7801q2293k08130J13674j39177B58795a47884a6208B80278D5028
$$ plain form
9371 58647 15384 -26374 85176 -213236 288256 136074 -113677 -136015 -1729 -145079 -35042
9359 218346 -117097 73416 -18993 92518 89271 -250621 92363 -67704 -113809 35650 81591
9348 81591 -29808 -70737 -288484 -29205 -229050 176489 -71088 -38981 230660 -211127 -38720
9336 -105981 33582 -27892 184481 5090 -24609 146694 -138520 -87656 244604 -190446 -143026
9325 -143026 -145976 24280 -76657 -296396 11878 175838 184451 -12103 182921 -121802 160167
9313 -197171 -67591 -231860 163491 -24987 69706 -96978 -267528 -10267 -134005 -21856 -315834
9302 -315834 -339791 -23332 -220513 88642 -135003 -159109 -107975 -523310 -203880 -221568 117947
9290 -207119 -77801 -160094 -368224 -254550 -393727 258795 -147884 -16208 280278 45028
9279a05268K9176A38965d21257J86082G7918a08595j31968h4529k66396a36193
9268C7622A895i725q3789c7330j40845f6871j47198j39754J23382A07808a10198
9256b54382H5833Q8982a63858l9740b3808l3621k9200A80529b82114e4544a463
9244b24819j49419B25934l8319a4392l61928C2097J69483d17574B0700b49085
9233i3890b2093B00994A8777c0063q9367K7746M1962D15215b58467B06662b45707
9221H4037c79563R6449a13371B75869a34990a1399n326A63792k3384E7900a32024
9209c92431J36899Q5673C848K07410A03822a15573B28578a25682N131n9407j9662
9198a99620B57476g3581g62E610a02731j65189A13058b52654a15940M6163D511
$$ plain form
9279 -105268 -76092 138965 -421257 -235175 77918 -108595 -240563 -84529 -350925 -136193
9268 37622 1895 -9725 -93514 -37330 -178175 -66871 -214069 -353823 -230441 107808 -110198
9256 -254382 85833 174815 -163858 -203598 -23808 -57429 -86629 180529 -282114 -54544 -1463
9244 -224819 -374238 225934 187615 -14392 -376320 32097 201580 -417574 20700 -249085
9233 -93890 -22093 200994 18777 -30063 -119430 -91684 -49722 415215 -258467 206662 -245707
9221 84037 -379563 -283114 -113371 275869 -134990 -11399 -16725 163792 140408 57900 -132024
9209 -392431 -255532 -169859 3848 211258 103822 -115573 228578 -125682 -120551 -179958 -199620
9198 -199620 257476 -73581 -762 5610 -102731 -267920 113058 -252654 -115940 -69777 4511
9186a38692r8731K2709A15760c984k34346k8663J24488b3369C19259b38776B49180
9174B42925a12705H5710a70969O9954A1972R8081b17413K6438D4346J35721g3740
9162a14886I919b90930B68666g6901j62829k8879a03958k26314L5207a36653f0733
9150A07304e9224o6588f716A68253H2591b80569a39158J5326j33153q2012a19756
9138D0471F609a76353l2972d8263r1850B22597g8104a8798F4328g6976f901p8179
9126h5080m4180A52442A1150K56179f2927o1347A3085a4531j77157g9856q386
9115h8242j08591A2911N2855J46584j02682a2716I9968f5610C66301a42773j19390
9104b62163n0190b789r084A296h6070A49744l9790J54356A5577a84988C47995
$$ plain form
9186 -138692 -237423 -214714 115760 -3984 -238330 -266993 -142505 -23369 319259 -238776 249180
9174 242925 -112705 85710 -170969 -101015 11972 110053 -217413 -190975 44346 180067 -73740
9162 -114886 9919 -290930 268666 -76901 -239730 -268609 -103958 -330272 -295065 -136653 -60733
9150 107304 -59224 -125812 -6716 168253 82591 -280569 -139158 -123832 -256985 -338997 -119756
9138 40471 6609 -176353 -209325 -48263 -140113 222597 -78104 -18798 64328 -76976 -6901 -85080
9126 -85080 -129260 152442 11150 267329 -62927 -124274 13085 -14531 -191688 -79856 -88242
9115 -88242 -196833 12911 65766 212350 109668 -12716 99968 -65610 366301 -142773 -262163
9104 -262163 -312353 -2789 -11873 1296 -86070 149744 109954 264310 15577 -184988 347995
9092f60o3964A17753b12844i5969p4695k66315A47989c04160C7339a21270N8108
9081f3162j59951j98288b413A4341a84637f5539d071m0515j57753j07287A48478
9069b19583f3280B55935E4201R9801m0251f2017J3608p8350A28676a51959j35309
9058b87268j5363I3878d67754g2456m49728K20959J02593a4852G7480E784d7347
9046g709m8937H2624a72070K7112A883a40341j2684b4655j47219d0728j37748
9035a78476G5902b33239h3506B30053c73680e8617p6539k6291o6553D3940a693
9023a34730M1478A56550a22224G4583c428j71206C02739i9018A57859O3984e8397
9011a97039K9678e0463k51084K2978d5949p5852A92809b08166A411b71028b3768
$$ plain form
9092 -660 -64624 117753 -212844 -95969 -170664 -436979 147989 -304160 37339 -121270 -63162
9081 -63162 -223113 -421401 -2413 14341 -184637 -65539 -4071 -44586 -202339 -309626 148478
9069 -219583 -63280 255935 54201 154002 113751 -62017 -48409 -126759 128676 -151959 -287268
9058 -287268 -302631 93878 -467754 -72456 -522184 -301225 -198632 -14852 77480 5784 -47347
9046 -7709 -56646 82624 -172070 -144958 1883 -140341 -153025 -24655 -171874 -40728 -178476
9035 -178476 75902 -233239 -83506 230053 -373680 -58617 -135156 -161447 -228000 43940 -1693
9023 -134730 -93252 156550 -122224 74583 -3428 -174634 302739 -99018 157859 221843 -58397
9011 -197039 -167361 -50463 -301547 -278569 -45949 -121801 192809 -208166 1411 -271028 -23768
8999a97206e0831k18846J28923M8905p0646j81957a0389l8014k95011J34570A05736
8987d7683A125Q7541Q4067a50412A8154c03597r4580D3174c62960A32550k8093
8976A04457J79700d8582n1129B62701A11092a60585l5157h2992k26847D20683
8965g8936l37825A60673J31075j24656a63201O5982d4078k54121g7545q0663A48578
8953C81975A57894h9458D8197a62324j85579C11949B066J96304c70859J33429
8943b37430B1509Q1938a55712P0946D70875i1916B33334i4711j04848B32154A08702
8931E37768A86781r1201J68701c3910B2015K73618g1406K2270H33680J18325J003333
8920A955338K110588Q387837D954283A447631E83390A38805L47500c4548k4774
$$ plain form
8999 -197206 -50831 -269677 -140754 -91849 -162495 -344452 -10389 -48403 -343414 -208844 105736
8987 -47683 1125 88666 172733 -150412 18154 -303597 -398177 43174 -362960 132550 104457
8976 104457 284157 -48582 -99711 262701 111092 -160585 -195742 -82992 -309839 420683
8965 -78936 -416761 160673 291748 167092 -163201 -97219 -44078 -298199 -77545 -158208 148578
8953 381975 157894 -89458 48197 -162324 -347903 311949 2066 198370 -370859 -237430
8943 -237430 21509 103447 -155712 -84766 470875 -91916 233334 -94711 -199559 232154 108702
8931 537768 186781 95580 264281 -33910 22015 295633 -71406 -49136 833680 952005 1955338
8920 1955338 4065926 12453763 4954283 1447631 583390 138805 486305 -34548 -59322
8911e9322l09213D572f1000j4211A51736k4574j7837J4143m1119c31642H8338
8899f8951k37887J36487A94437J23356b40748G8481l0048b49438H2514c14574
8888h3263r703K5365j49272Q4961c3408B9958i8283p6043O2782B60789b4219A02791
8875A98760c31114G2841e06653C99690f8120H1541k5015M2667c39579a17676j39232
$$ plain form
8911 -59322 -368535 4572 -61000 -75211 151736 127162 109325 123468 82349 -331642 88338
8899 -68951 -306838 -170351 194437 317793 -240748 78481 48433 -249438 82514 -314574
8888 -83263 -92966 -67601 -216873 -131912 -33408 29958 -98283 -174326 -111544 260789 -24219 102791
8875 198760 -331114 72841 -506653 399690 -68120 81541 56526 99193 -339579 -117676 -256908
$$ [...]
##END NTUPLES=NMR SPECTRUM
##END=
