
##TITLE=AC1236_CNAOR12067_6610122_s1eU3v7pMX
##JCAMPDX= 6.0         $$ Bruker NMR JCAMP-DX V2.0
##DATA TYPE= NMR SPECTRUM
##DATA CLASS= NTUPLES
##ORIGIN= BRUKER
##OWNER= Administrator
$$ 1.72 TOPSPIN		Version 2.1
$$ 2012-08-02 00:49:02.328 -0500  Administrator@TOPSPIN
$$ Compression mode = diff/dup
##.OBSERVE FREQUENCY= 400.02188249412
##.OBSERVE NUCLEUS= ^1H
##.ACQUISITION MODE= SIMULTANEOUS (DQD)
##.ACQUISITION SCHEME= undefined
##.AVERAGES= 64
##.DIGITISER RES= 22
##SPECTROMETER/DATA SYSTEM= spect
##.PULSE SEQUENCE= noesygpps1d.comp
##.SOLVENT NAME= COFFEE_meoh
##.SHIFT REFERENCE= INTERNAL, COFFEE_meoh, 1, 14.96253
##AUDIT TRAIL= $$ (NUMBER, WHEN, WHO, WHERE, PROCESS, VERSION, WHAT)
$$ ##TITLE= Audit trail, TOPSPIN		Version 2.1
$$ ##JCAMPDX= 5.01
$$ ##ORIGIN= Bruker BioSpin GmbH
$$ ##OWNER= Administrator
$$ $$ C:\Bruker\TOPSPIN/data/COFFEE/nmr/AC1236_CNAOR12067_6610122_s1eU3v7pMX/12/pdata/1/auditp.txt
$$ ##AUDIT TRAIL=  $$ (NUMBER, WHEN, WHO, WHERE, PROCESS, VERSION, WHAT)
(   1,<2012-08-02 00:48:57.046 -0500>,<Administrator>,<TOPSPIN>,<go>,<TOPSPIN 2.1>,
      <created by zg
	started at 2012-08-02 00:37:17.937 -0500,
	POWCHK enabled, PULCHK disabled,
       configuration hash MD5:
       6B 1B 68 BB D9 2E 58 E2 7F 35 AD 54 07 DF 0E 41
       data hash MD5: 64K
       1B C4 7A EA 5C A0 68 80 35 03 E0 AD 1B 7C 76 6C>)
(   2,<2012-08-02 00:49:00.015 -0500>,<Administrator>,<TOPSPIN>,<proc1d>,<TOPSPIN 2.1>,
      <Start of raw data processing
       efp LB = 0.3 FT_mod = 6 PKNL = 1 PHC0 = 0 PHC1 = 0 SI = 128K 
       data hash MD5: 128K
       B8 5A 53 27 47 99 9E EC 0F 70 BB 99 DC 77 8F 1A>)
(   3,<2012-08-02 00:49:01.171 -0500>,<Administrator>,<TOPSPIN>,<proc1d>,<TOPSPIN 2.1>,
      <pk PHC0 = 0.3405762 PHC1 = 0 
       data hash MD5: 128K
       E6 17 A0 CC 12 0E 15 81 74 36 A9 23 03 06 53 5C>)
(   4,<2012-08-02 00:49:01.953 -0500>,<Administrator>,<TOPSPIN>,<proc1d>,<TOPSPIN 2.1>,
      <abs ABSG = 1 
       data hash MD5: 128K
       19 B5 CD B7 8D 4A AC E4 A2 9D 70 D3 38 4A 78 77>)
(   5,<2012-08-02 00:49:02.062 -0500>,<Administrator>,<TOPSPIN>,<proc1d>,<TOPSPIN 2.1>,
      <abs ABSG = 2 
       data hash MD5: 128K
       D8 A4 83 17 2F B8 91 71 D0 5A 4F 05 4B 95 48 B5>)
(   6,<2012-08-02 00:49:02.125 -0500>,<Administrator>,<TOPSPIN>,<proc1d>,<TOPSPIN 2.1>,
      <abs ABSG = 3 
       data hash MD5: 128K
       BF 4B 9A 4A 5F EB BF B8 5B F1 E4 8D F4 1C CC C6>)
(   7,<2012-08-02 00:49:02.203 -0500>,<Administrator>,<TOPSPIN>,<proc1d>,<TOPSPIN 2.1>,
      <abs ABSG = 4 
       data hash MD5: 128K
       32 D8 99 E4 59 C6 00 2D 57 5F 8F EC E0 16 65 00>)
(   8,<2012-08-02 00:49:02.250 -0500>,<Administrator>,<TOPSPIN>,<proc1d>,<TOPSPIN 2.1>,
      <abs ABSG = 5 
       data hash MD5: 128K
       1A 64 69 DE F3 03 73 63 54 C8 D4 1B BE DC 78 82>)
$$ ##END=
$$ 
$$ $$ hash MD5
$$ $$ 4D D6 81 91 D2 AD 2E 52 35 80 78 C7 E4 F6 B2 3A
##$RELAX= 
##$RELAX= 
##$RELAX= 
##$RELAX= 
##$RELAX= 
##$RELAX= 
##$RELAX= 
##$RELAX= 
$$ Bruker specific parameters
$$ [...]
##$TP07= 0
##$TPNAME0= <>
##$TPNAME1= <>
##$TPNAME2= <>
##$TPNAME3= <>
##$TPNAME4= <>
##$TPNAME5= <>
##$TPNAME6= <>
##$TPNAME7= <>
##$TPOAL= (0..7)
0.5 0.5 0.5 0.5 0.5 0.5 0.5 0.5
##$TPOFFS= (0..7)
0 0 0 0 0 0 0 0
##$TUNHIN= 0
##$TUNHOUT= 0
##$TUNXOUT= 0
##$USERA1= <user>
##$USERA2= <user>
##$USERA3= <user>
##$USERA4= <user>
##$USERA5= <user>
##$V9= 5
##$VALIST= <valist>
##$VCLIST= <CCCCCCCCCCCCCCC>
##$VD= 0
##$VDLIST= <DDDDDDDDDDDDDDD>
##$VPLIST= <PPPPPPPPPPPPPPP>
##$VTLIST= <TTTTTTTTTTTTTTT>
##$WBST= 1024
##$WBSW= 4
##$XGAIN= (0..3)
0 0 0 0
##$XL= 0
##$YL= 0
##$YMAX_a= 17573722
##$YMIN_a= -10352863
##$ZGOPTNS= <>
##$ZL1= 120
##$ZL2= 120
##$ZL3= 120
##$ZL4= 120
##$ABSF1= 14.96253
##$ABSF2= -5.595652
##$ABSG= 5
##$ABSL= 3
##$ALPHA= 0
##$AQORDER= 0
##$ASSFAC= 0
##$ASSFACI= 0
##$ASSFACX= 0
##$ASSWID= 0
##$AUNMP= <proc_prof1d_extract.lims>
##$AXLEFT= 0
##$AXNAME= <>
##$AXNUC= <1H>
##$AXRIGHT= 0
##$AXTYPE= 0
##$AXUNIT= <>
##$AZFE= 0.1
##$AZFW= 0.1
##$BCFW= 0
##$BC_mod= 0
##$BYTORDP= 0
##$COROFFS= 0
##$CY= 15
##$DATMOD= 1
##$DC= 0
##$DFILT= <>
##$DTYPP= 0
##$F1P= 0
##$F2P= 0
##$FCOR= 0.5
##$FTSIZE= 131072
##$FT_mod= 6
##$GAMMA= 0
##$GB= 0
##$INTBC= 1
##$INTSCL= 1
##$ISEN= 128
##$LB= 0.3
##$LEV0= 0
##$LPBIN= 0
##$MAXI= 10000
##$MC2= 0
##$MEAN= 0
##$ME_mod= 0
##$MI= 0
##$NCOEF= 0
##$NC_proc= -2
##$NLEV= 6
##$NOISF1= 0
##$NOISF2= 0
##$NSP= 0
##$NTH_PI= 0
##$NZP= 0
##$OFFSET= 14.96253
##$PC= 1
##$PHC0= 0.3405762
##$PHC1= 0
##$PH_mod= 1
##$PKNL= yes
##$PPARMOD= 0
##$PPDIAG= 0
##$PPIPTYP= 0
##$PPMPNUM= 2147483647
##$PPRESOL= 1
##$PSCAL= 4
##$PSIGN= 0
##$PYNMP= <proc.py>
##$REVERSE= no
##$SF= 400.020009024022
##$SI= 131072
##$SIGF1= 0
##$SIGF2= 0
##$SINO= 400
##$SIOLD= 131072
##$SPECTYP= <>
##$SREGLST= <1H.CDCl3>
##$SSB= 0
##$STSI= 131072
##$STSR= 0
##$SW_p= 8223.68421052631
##$SYMM= 0
##$S_DEV= 0
##$TDeff= 65536
##$TDoff= 0
##$TI= <>
##$TILT= no
##$TM1= 0
##$TM2= 0
##$TOPLEV= 0
##$USERP1= <user>
##$USERP2= <user>
##$USERP3= <user>
##$USERP4= <user>
##$USERP5= <user>
##$WDW= 1
##$XDIM= 131072
##$YMAX_p= 415694272
##$YMIN_p= -11235
##$CURPLOT= <Network HP LaserJet P1505>
##$CURPRIN= <$Network HP LaserJet P1505>
##$DFORMAT= <normdp>
##$LAYOUT= <+/1D_H.xwp>
##$LFORMAT= <normlp>
##$PFORMAT= <normpl>
##$SURQMSG= 1
$$ End of Bruker specific parameters
$$ ---------------------------------
##NTUPLES= NMR SPECTRUM
##VAR_NAME=  FREQUENCY,     SPECTRUM/REAL,   SPECTRUM/IMAG
##SYMBOL=    X,             R,               I
##VAR_TYPE=  INDEPENDENT,   DEPENDENT,       DEPENDENT
##VAR_FORM=  AFFN,          ASDF,            ASDF
##VAR_DIM=   131072,        131072,          131072
##UNITS=     HZ,            ARBITRARY UNITS, ARBITRARY UNITS
##FACTOR=    0.0627417313425164, 1,          1
##FIRST=     8223.62146879497, -627,         -63655
##LAST=      0,             1832,            -64464
##MIN=       0,             -11235,          0
##MAX=       8223.62146879497, 415694272,    0
$$ Real data points
##PAGE= N=1
##DATA TABLE= (X++(R..R)), XYDATA
$$ [...]
67370 106104 106377 106722 106752 106167 105265 104786 105245 106447 107612 108035 107718 107308 107317 107545 107486 107170 107233 108160 109828
67351 109828 111871 114123 116486 118651 120255 121248 121875 122309 122471 122203 121502 120542 119517 118514 117591 116967
67335 116967 117020 118005 119794 121956 123965 125311 125607 124896 123826 123293 123752 124892 125954 126327 125947 125237 124641
67318 124641 124177 123579 122881 122558 122900 123565 124125 124803 126139 127969 129311 129438 128652 127789 127262 126883 126453 126161
67300 126161 126383 127216 128348 129427 130496 131842 133380 134491 134778 134709 135008 135574 135587 134740 133750 133405 133649
67283 133649 133961 134157 134379 134620 134870 135541 137101 139242 140951 141666 141975 142833 144328 145633 146109 146035 146082 146383
67265 146383 146447 145947 145214 144841 145054 145650 146392 147198 148020 148778 149489 150309 151374 152593 153590 153969 153799 153827 154844
67246 154844 156766 158627 159672 160049 160171 159917 159073 158207 158298 159520 161098 162389 163418 164195 164297 163549 162612
67229 162612 162384 163141 164624 166559 168714 170701 172205 173269 174106 174794 175346 175815 176108 176026 175735 175804 176460
67212 176460 177222 177711 178379 179778 181436 182241 181914 181434 181900 183491 185634 187570 188662 188718 188353 188571 189684
67195 189684 190966 191649 191879 192360 193364 194517 195405 196033 196746 198018 200227 203316 206656 209476 211451 212691
67179 212691 213246 212902 211583 209753 208330 208230 209895 212973 216413 219121 220687 221455 221941 222425 223074 223982
67163 223982 224887 225229 224903 224619 225102 226140 227053 227926 229596 232260 234933 236712 237934 239495 241554 243637
67147 243637 245585 247553 249217 249912 249682 249456 249970 251117 252573 254386 256595 258815 260681 262299 263910
67132 263910 265448 266813 268247 270036 272076 274105 276087 278037 279771 281272 283045 285576 288566 291208
67118 291208 293111 294581 296070 297813 299927 302381 304873 307122 309285 311669 314035 315739 316653 317499 319045
67103 319045 321354 324010 326681 329229 331604 333946 336494 339118 341242 342592 343794 345775 348659 351698
67089 351698 354262 356403 358328 359884 360962 362105 364168 367403 371239 375014 378530 381808 384762 387457
67075 387457 390402 394086 398341 402482 406021 408857 410886 412035 412845 414463 417595 421686 425486 428288
67061 428288 430398 432632 435584 439217 442844 445703 447815 450135 453567 457909 462073 465313 467963 470941
67047 470941 474822 479384 483895 487815 491270 494777 498501 502082 505366 508913 513394 518702 524097 529144
67033 529144 534033 539023 544026 548836 553429 557954 562639 567645 572752 577348 581160 584962 589998 596589
67019 596589 603714 610128 615528 620483 625640 631216 636992 642616 648100 654018 660911 668473 675801 682518
67005 682518 689134 696064 702943 709364 715757 722913 730916 739156 747253 755332 763435 771289 778788 786217
66991 786217 793754 801137 808099 814873 821952 829467 837106 844673 852522 861196 870675 880180 888892 896846
66977 896846 904900 913859 923815 934315 944841 954980 964499 973549 982608 992022 1001737 1011722 1022285
66964 1022285 1033617 1045260 1056540 1067423 1078444 1089843 1101329 1112742 1124284 1135884 1147017
66953 1147017 1157590 1168557 1180988 1194781 1208817 1222307 1235411 1248577 1261829 1274903 1287694
66942 1287694 1300365 1313245 1326695 1340729 1354718 1367854 1380148 1392554 1405767 1419272 1431987
66931 1431987 1443613 1454812 1466249 1478074 1490364 1503419 1517257 1531229 1544507 1556818 1568523
66920 1568523 1580158 1592045 1604138 1616106 1627773 1639574 1652246 1665833 1679351 1691817 1703297
66909 1703297 1714549 1725927 1737202 1748280 1759402 1770526 1781161 1791083 1800721 1810476 1819988 1828535
66897 1828535 1835949 1842761 1849530 1856329 1862894 1868999 1874584 1879678 1884274 1888307 1891736 1894699 1897503 1900459
66883 1900459 1903767 1907500 1911467 1915031 1917301 1917787 1916845 1915325 1913754 1911944 1909356 1905785 1901642 1897607
66869 1897607 1893962 1890357 1886324 1881905 1877485 1872909 1867161 1859287 1849541 1839280 1829719 1821014 1812598 1804009
66855 1804009 1795171 1786086 1776629 1766784 1756807 1746938 1736983 1726374 1714733 1702229 1689290 1676099 1662592
66842 1662592 1648906 1635579 1623111 1611430 1599890 1587757 1574643 1560560 1545769 1530648 1515624
66831 1515624 1501090 1487261 1474012 1460916 1447526 1433728 1419806 1406110 1392647 1379013 1364801
66820 1364801 1350104 1335531 1321611 1308255 1294971 1281566 1268332 1255494 1242803 1229882 1216699
66809 1216699 1203382 1189830 1175989 1162412 1149996 1138979 1128572 1117807 1106437 1094812 1083179
66798 1083179 1071482 1059715 1048137 1037018 1026272 1015422 1003952 991806 979508 967656 956369
66787 956369 945375 934588 924278 914571 905126 895472 885438 875122 864726 854642 845396 837101
66775 837101 829108 820586 811404 802167 793374 784851 776098 766933 757677 748832 740684 733159 725965 718844
66761 718844 711682 704437 697102 689817 682881 676517 670704 665298 660124 654837 648842 641695 633604 625390
66747 625390 617867 611283 605257 599177 592757 586345 580586 575649 570853 565240 558538 551427 544951 539752
66733 539752 535746 532314 528716 524549 519882 515035 510260 505661 501246 496936 492664 488607 485117 482218
66719 482218 479280 475440 470335 464371 458440 453510 450104 447751 445091 441024 435798 430644 426408 423016
66705 423016 420146 417758 415728 413521 410680 407290 403641 399768 395689 391769 388383 385377 382309 379140
66691 379140 376208 373625 371123 368569 366204 364255 362537 360548 357811 354202 350221 346810 344504 342767
66677 342767 340610 337843 335183 333000 330668 327549 324045 321039 318662 316302 313636 310927 308325 305616
66663 305616 302851 300540 298913 297469 295708 293870 292472 291359 289793 287393 284542 281797 279323 277049
66649 277049 275058 273550 272474 271377 269694 267195 264197 261340 259215 258144 258089 258474 258259 256638 253883
66634 253883 251159 249254 247845 246247 244536 243411 243112 243032 242410 241058 239330 237687 236306 234814 232492
66619 232492 229082 225375 222612 221296 220961 221057 221480 222106 222396 221877 220648 219054 217159 214867 212351 210006
66603 210006 208142 206945 206534 206787 207262 207506 207350 206779 205833 204875 204526 204902 205098 203933 201155 197592 194279
66586 194279 191796 190295 189541 188865 187646 186075 185049 185090 185697 186049 186051 186308 187203 188414 189350 189756 189743 189417
66568 189417 188690 187420 185612 183458 181276 179394 177975 176895 175898 174928 174199 173814 173455 172650 171300 169821
66552 169821 168848 168919 170170 171972 173016 172306 170195 168039 166729 165964 165130 164251 163693 163346 162674 161422 159826
66535 159826 158192 156635 155157 153715 152309 151169 150665 150759 150788 150129 148880 147548 146342 145217 144345 143977
66519 143977 143889 143569 142953 142445 142153 141694 140910 140280 140325 140933 141504 141509 140761 139411 137824 136227 134476 132407
66501 132407 130416 129256 129155 129583 130019 130452 130882 130864 130040 128788 127841 127448 127337 127319 127439 127603 127522 127118 126569
66482 126569 125902 124924 123732 122916 122902 123363 123641 123691 124180 125527 127161 127988 127437 125808 123739 121697 119985
66465 119985 118871 118476 118697 119340 120136 120596 120181 118862 117269 116053 115290 114731 114359 114405 114997 116060 117334
66448 117334 118253 118174 117178 116277 116271 116687 116500 115699 115270 115664 116157 116001 115443 115203 115497 116009 116398 116474 116215 115887
66428 115887 115818 115844 115444 114593 113970 113983 114135 113768 112968 112298 112054 112232 112801 113503 113761 113326 112673 112213 111536 110035
66408 110035 107962 106118 104753 103507 102316 101536 101192 100850 100316 99837 99503 99092 98604 98309 98123 97626 96867
66391 96867 96445 96473 96190 95090 93826 93396 93840 94383 94608 94872 95644 96918 98208 98796 98162 96599 95245
66374 95245 94999 95431 95267 94001 92516 91912 92155 92197 91175 89187 87025 85467 84819 84958 85688 86991 88798
66357 88798 90575 91470 91151 90335 90089 90647 91240 91192 90759 90620 90876 91047 90902 90718 90621 90198 89141 87920 87354
66338 87354 87611 87980 87616 86249 84251 82362 81326 81401 82053 82409 82175 81837 81856 81968 81558 80497 79314 78674
66320 78674 78999 80423 82690 85041 86586 86983 86543 85653 84363 82713 81110 80045 79633 79722 80299 81401
66304 81401 82661 83400 83299 82697 82135 81849 81798 81812 81511 80451 78750 77349 77208 78252 79403 79638 78805 77542
66286 77542 76704 76761 77410 77815 77521 77035 77068 77377 77045 75961 75229 75682 76664 76954 76438 76073 76404 76941 77148
66267 77148 77286 77915 78960 79724 79638 78728 77401 76067 74940 74048 73348 72857 72642 72684 72818 72841 72652 72251 71643
66248 71643 70781 69688 68666 68348 69297 71411 73777 75318 75644 75248 74872 74785 74616 73869 72536 71194 70432
66231 70432 70231 70067 69577 68950 68576 68537 68647 68835 69243 69970 70907 71830 72540 72900 72822 72235 71145 69801 68746
66212 68746 68434 68724 69007 68941 68821 69012 69323 69320 69095 69319 70447 72148 73586 74121 73745 73020 72616 72738 72921
66193 72921 72508 71364 70098 69532 69949 70793 71200 70943 70749 71394 72571 73137 72624 71907 72072 73161 74546
66176 74546 76048 77883 79733 80733 80540 79805 79408 79708 80607 81850 83046 83812 84133 84243 84127 83520 82489
66159 82489 81529 80923 80405 79573 78236 76300 73912 71835 70984 71212 71239 70262 69014 68613 68912 68842 68027 67118
66141 67118 66614 66233 65608 64917 64515 64463 64627 64892 65035 64762 64119 63580 63570 64074 64812 65475 65731 65347 64499 63703
66121 63703 63228 62890 62568 62553 63048 63617 63633 63156 62943 63529 64652 65684 66345 66784 67144 67303 67043 66335 65446
66102 65446 64792 64661 65027 65593 66012 66086 65834 65474 65288 65310 65157 64388 63180 62435 62872 64093 64922 64746 64153
66083 64153 64058 64592 65225 65667 66041 66249 65876 64951 64244 64406 65203 66005 66686 67523 68435 69012 69244 69541 69882
66064 69882 69546 68077 66023 64343 63385 62915 62840 63298 64163 65027 65785 66745 68039 69321 70226 70750 70910 70482
66046 70482 69459 68476 68319 69127 70453 71958 73547 74916 75608 75698 75906 76695 77600 77789 77085 76055 75214
66029 75214 74518 73583 72184 70565 69357 69116 69798 70839 71867 73068 74624 76102 76857 76850 76575 76292 75927
66012 75927 75723 76289 77651 78834 78874 78007 77396 77835 79068 80261 80790 80626 80231 80100 80191 79894 78778 77270
65994 77270 76292 76229 76578 76656 76342 76011 75995 76309 76746 77065 77163 77187 77370 77689 77858 77798 77917 78613 79636 80295 80356
65973 80356 80324 80639 80959 80610 79529 78337 77494 76902 76402 76188 76457 77000 77556 78290 79526 81183 82853 84355
65955 84355 85781 87033 87774 87886 87591 87017 86070 84857 83824 83186 82612 81769 80914 80601 81013 81899 82990
65938 82990 84152 85184 85826 85969 85677 85038 84204 83458 83096 83290 84168 85808 87905 89652 90315 89875 88846
65921 88846 87646 86468 85574 85182 85076 84844 84593 84904 85892 86798 86851 86156 85363 84802 84333 83799 83153 82318 81410
65902 81410 81019 81771 83467 85080 85721 85368 84537 83671 83054 82965 83480 84235 84690 84593 83995 82924 81410 79858
65884 79858 79030 79387 80529 81466 81510 80854 80263 80282 80830 81549 82367 83463 84713 85549 85587 85128 84753 84623 84596
65865 84596 84812 85570 86599 87115 86851 86482 86610 86815 86269 84982 83775 83223 83254 83734 84693 85752 85978 84765
65847 84765 82576 80537 79562 79987 81595 83639 85161 85725 85703 85536 85013 83704 81909 80585 80281 80583 80814
65830 80814 80921 81426 82725 84637 86517 87626 87532 86371 84788 83501 82854 82766 83056 83702 84755 86112 87492
65813 87492 88659 89524 89925 89521 88199 86556 85622 85900 86906 87850 88541 89312 90214 90703 90238 88946 87554
65796 87554 86812 86991 87770 88482 88611 88159 87506 86911 86281 85466 84553 83730 83011 82322 81794 81706 82097 82689 83244
65777 83244 83785 84306 84568 84437 84263 84457 84678 83968 81952 79532 78032 77838 78259 78549 78566 78406 77887 76668
65759 76668 74700 72381 70323 68944 68175 67577 66884 66302 66046 65831 65268 64656 64781 65851 67221 68373 69497
65742 69497 70749 71537 71211 70101 69200 68988 69103 69054 68714 68165 67605 67406 67780 68364 68580 68427 68473 69057 70026
65723 70026 71257 72767 74123 74434 73425 72011 71240 70988 70339 69038 67910 67718 68226 68659 68744 68877 69377
65706 69377 69939 69942 69146 67874 66529 65117 63394 61425 59777 59063 59390 60301 61145 61490 61331 61054 61130 61701
65688 61701 62486 63157 63703 64318 65023 65642 66137 66721 67472 68037 68004 67573 67552 68529 70230 71883 73018 73612 73575
65669 73575 72610 70790 68825 67373 66294 65022 63564 62675 62915 63921 64844 65312 65657 66246 66868 66898 66008
65652 66008 64562 63223 62299 61652 61251 61477 62711 64785 67117 69235 70895 71840 71918 71480 71289 71770 72619
65635 72619 73293 73657 73929 74231 74461 74483 74131 73108 71237 68955 67251 66878 67620 68480 68531 67529 65819 63905
65617 63905 62221 61074 60515 60312 60247 60410 60979 61696 61935 61416 60583 60035 59873 59850 59947 60359 60999 61440 61425 61141
65597 61141 60913 60893 61151 61795 62839 64024 64863 64901 64042 62809 62089 62356 63186 63797 63914 63805 63631 63337 63152
65578 63152 63494 64145 64107 62793 60914 59680 59417 59500 59441 59394 59597 59935 60308 60973 62164 63520 64272 64052 63336
65559 63336 62997 63449 64340 65073 65419 65422 64922 63659 61929 60672 60559 61297 62185 63023 64001 64863 64903 63909 62602
65540 62602 61851 61788 61971 62143 62466 63139 64068 64893 65216 64816 63827 62656 61700 61212 61456 62669 64644 66574
65522 66574 67678 67953 68058 68522 69355 70373 71478 72512 73262 73866 74881 76614 78611 80175 81269 82457
65506 82457 84007 85475 86239 86097 85225 83912 82549 81588 81238 81307 81512 81789 82201 82761 83530 84612 85810
65489 85810 86548 86481 86011 85843 86166 86669 87224 88031 89048 89840 90219 90678 91827 93735 96075 98699 101689
65472 101689 104952 108212 111449 114986 118986 123054 126469 128702 129581 129149 127653 125693 124046 123021 122049
65457 122049 120152 116877 112696 108470 104779 101731 99141 96649 93882 90739 87473 84374 81519 79000
65443 79000 77121 76029 75280 74172 72552 71023 70274 70375 70711 70468 69245 67448 66067 65829 66546 67464
65427 67464 68118 68557 68860 68888 68599 68213 67915 67701 67618 67824 68238 68422 68065 67395 66969 67188 68092 69392 70537
65408 70537 70973 70531 69512 68394 67594 67427 67968 68892 69800 70733 72005 73468 74426 74517 74171 73913 73657 73142
65390 73142 72721 73142 74724 77163 79976 82664 84607 85397 85371 85356 85793 86455 87049 87720 88805 90466 92739
65373 92739 95629 98903 102064 104878 107844 111805 117019 122878 128640 134265 140327 147207 154703 162485
65359 162485 170587 179094 187467 194483 198915 200156 198326 194146 188725 183084 177687 172559 167847 163989
65345 163989 161203 159141 157186 154899 152075 148692 145052 141761 139285 137547 136088 134506 132735 130996
65331 130996 129487 127961 125701 122225 117900 113475 109139 104627 100193 96632 94048 91412 87917 84123
65317 84123 81125 79133 77577 76165 74998 73937 72732 71690 71455 72099 73061 73907 74461 74280 72870 70613
65301 70613 68665 67632 66985 66152 65482 65563 66118 66320 66016 65976 66818 68145 68976 68810 68030 67311 66863 66427 65849
65282 65849 65317 64942 64489 63773 63074 62827 63035 63335 63431 63143 62254 60852 59759 60016 61763 64007 65573 66056
65264 66056 65818 65515 65666 66347 67102 67388 67168 66838 66675 66747 67327 68902 71555 74697 77552 79711 81195
65247 81195 82269 83270 84316 85170 85640 86021 86746 87696 88311 88357 88027 87312 85950 84135 82567 81522 80438
65230 80438 78815 76949 75386 74143 72888 71468 69805 67712 65358 63524 62792 62696 62282 61369 60729 61079
65214 61079 62357 64016 65550 66666 67268 67451 67337 66925 66233 65438 64702 63889 62722 61186 59642 58609
65198 58609 58502 59390 60780 61784 61694 60402 58245 55727 53571 52661 53462 55531 57884 59789 60984 61331
65182 61331 60711 59341 57921 57226 57537 58424 59083 59025 58506 58190 58336 58557 58446 58141 58056 58291 58636 58957 59278
65163 59278 59539 59585 59409 59226 59329 59916 60963 62147 62999 63263 63035 62578 62202 62295 63075 64130 64605 64144 63417
65144 63417 63402 64378 65883 67403 68756 69957 70978 71617 71521 70573 69300 68556 68560 68710 68559 68454 68806 69305
65126 69305 69459 69486 69987 70967 71856 72294 72275 71776 70912 70297 70459 71000 71088 70680 70407 70386 70165 69975 70850 73060
65106 73060 75431 76898 77886 79362 81196 82468 83034 83829 85668 88483 91742 95029 98093 100861 103588
65091 103588 106691 110341 114432 118878 123639 128523 133309 138076 143029 147936 152069 154878 156471 157311
65077 157311 157590 157127 155747 153608 151099 148467 145587 142111 137863 133040 128017 123048 118189 113402 108644
65062 108644 103923 99327 94947 90735 86570 82565 79169 76771 75235 73965 72466 70787 69394 68674
65048 68674 68553 68542 68120 67110 65745 64503 63833 63836 64054 63766 62760 61694 61372 61770 62178 62298 62626 63521
65030 63521 64428 64525 63831 63125 62857 62708 62228 61465 60729 60105 59544 59200 59372 60024 60628 60627 60023 59367 59102 59042
65010 59042 58673 57905 57228 57052 57183 57185 57101 57479 58684 60420 61965 62761 62754 62298 61743 61079 60053 58696 57531
64991 57531 57065 57201 57470 57740 58363 59563 61002 62069 62362 61788 60508 58971 57818 57501 58026 59098 60367
64974 60367 61520 62384 63070 63779 64372 64445 64038 63872 64536 65651 66282 65969 64940 63513 61865 60336 59363
64957 59363 58949 58696 58422 58220 57841 56757 55199 54426 55332 57286 58940 59760 60015 59714 58563 56964 56043
64940 56043 56371 57325 58036 58299 58256 57873 57244 56950 57484 58565 59451 59737 59471 58826 58118 57891 58411 59172 59421
64921 59421 59115 58898 59165 59618 59812 59723 59621 59777 60409 61558 62775 63244 62464 60768 59047 58104 58282 59372
64903 59372 60637 61134 60408 58963 57852 57716 58255 58656 58450 57881 57520 57697 58353 59237 60048 60507 60581 60608 60914
64884 60914 61305 61248 60669 60157 60217 60672 61096 61449 61887 62251 62241 61941 61746 61845 62181 62741 63415 63717 63206 62136
64864 62136 61111 60146 58749 57045 56025 56332 57393 58227 58646 59112 59805 60432 60790 61007 61225 61433 61598
64847 61598 61677 61519 60987 60151 59185 58187 57331 56999 57427 58286 58879 58768 58030 57006 56113 55827 56414 57530 58322
64828 58322 58172 57316 56659 56989 58264 59583 59919 59039 57719 57004 57324 58405 59779 61104 62133 62771 63190
64811 63190 63595 63805 63435 62607 62100 62491 63378 63823 63425 62579 61783 61140 60686 60713 61397 62341 62851 62670 62178
64792 62178 61917 62135 62728 63308 63342 62529 61174 59897 58928 58029 57210 57052 57929 59302 60241 60470 60402 60309 60048
64773 60048 59643 59645 60613 62524 64792 66642 67448 67056 65963 64940 64370 64158 64246 64803 65794 66797 67518 68188
64755 68188 69131 70152 70657 70309 69393 68606 68574 69355 70320 70679 70210 69315 68368 67360 66256 65222 64316 63415
64737 63415 62745 63039 64644 66797 68313 68832 68906 69008 69033 68792 68482 68487 69026 70075 71356 72318 72397 71437 69774
64718 69774 67951 66421 65376 64630 63801 62919 62642 63499 65032 66180 66505 66542 66892 67526 68186 68918 69761 70269
64700 70269 69873 68623 67190 66169 65674 65541 65579 65531 65103 64286 63563 63582 64570 66160 67755 69001 69860 70417
64682 70417 70788 71113 71421 71509 71238 70947 71260 72300 73439 74069 74333 74720 75189 75224 74654 73910 73377 72969 72505
64663 72505 72120 72077 72446 73154 74080 74878 75017 74290 73151 72248 71734 71242 70454 69477 68690 68431 68781 69498 70145
64644 70145 70475 70641 70894 71127 70929 70135 69121 68445 68368 68850 69802 71077 72245 72719 72312 71443 70556 69497
64626 69497 67860 65932 64834 65427 67308 69174 70055 69923 69279 68552 67965 67657 67699 68082 68747 69590 70436 71117
64608 71117 71531 71566 71089 70220 69483 69393 69858 70306 70474 70788 71792 73369 74752 75241 74815 74115 73874 74299 74925
64589 74925 75116 74695 73994 73377 72937 72704 72902 73774 75156 76335 76448 75170 73148 71617 71372 72136 73052
64572 73052 73648 74008 74182 73950 73301 72699 72582 72894 73401 74195 75520 77200 78619 79329 79438 79363 79322 79178 78761
64553 78761 78256 78111 78413 78497 77522 75525 73634 73025 73857 75321 76512 77048 77039 76771 76430 76004 75449 74974 74966
64534 74966 75476 76009 75999 75393 74574 73885 73447 73310 73463 73651 73432 72532 71112 69653 68603 68063 67826 67769 68087
64515 68087 68881 69640 69667 69107 69013 69987 71279 71762 71426 71240 71783 72714 73511 73969 73888 73043 71744 70806 70585
64496 70585 70603 70485 70677 71693 73116 74057 74364 74632 75063 75045 74069 72532 71281 70700 70598 70754 71210 72018
64478 72018 72968 73693 73999 74056 74290 75032 76215 77384 78066 78212 78316 79016 80426 81899 82599 82314 81515 80586
64460 80586 79350 77649 76083 75680 76779 78623 80145 80854 80855 80430 79929 79776 80170 80772 81031 80842 80615 80656
64442 80656 80757 80528 79951 79437 79373 79697 79914 79535 78556 77501 76885 76684 76503 76258 76415 77468 79378 81667
64424 81667 83827 85499 86481 86910 87332 88259 89671 91136 92341 93211 93607 93324 92508 91737 91491 91770 92273
64407 92273 92676 92648 91993 91014 90359 90224 90014 89187 88128 87673 87971 88373 88394 88196 87986 87554 86670 85564 84672
64388 84672 84157 83954 84030 84317 84609 84752 84726 84350 83219 81360 79671 79211 80068 81370 82406 83215 84018 84585
64370 84585 84534 83927 83165 82499 82008 81895 82372 83261 84105 84807 85796 87309 88829 89631 89752 89917 90451 90789 90373
64351 90373 89630 89451 89841 89797 88770 87619 87626 88901 90346 91035 90962 90481 89712 88847 88404 88664 89171 89363 89438
64332 89438 90029 91141 92076 92498 92902 93754 94715 95198 95307 95684 96629 97929 99437 101210 103050 104506 105546
64315 105546 106705 108188 109306 109283 108338 107445 107121 106996 106531 105679 104740 104008 103745 104110 104888 105589 106051 106683
64297 106683 107850 109278 110410 111115 111713 112469 113445 114758 116526 118544 120364 121811 123155 124737 126762
64282 126762 129445 132883 136575 139505 141134 142127 143657 146038 148438 150025 151055 152541 154991 157768
64268 157768 159749 160422 160078 159095 157380 154722 151404 148123 145392 143274 141609 140146 138535 136615 134823
64253 134823 133915 134051 134459 134197 132976 131123 129108 127409 126498 126586 127501 129019 131080 133428 135377 136380
64237 136380 136694 137151 138350 140372 143034 146054 149094 152029 155080 158437 161959 165561 169519 173911 178096
64222 178096 181345 183673 185291 185593 183727 180195 176789 174647 173248 171610 169514 167110 164307 161285
64208 161285 158830 157317 155992 154071 152022 150837 150535 150449 150676 152089 154814 157708 159607 160362 160518 160691
64192 160691 161515 163435 166101 168402 169471 169380 168721 168003 167649 168087 169342 170776 171573 171402 170499 169353 168487
64175 168487 168222 168411 168541 168246 167644 167167 167270 168311 170338 172859 175164 177109 179307 182301 185738 188700
64159 188700 190808 192819 196037 201144 207599 214269 220635 227199 234602 242723 250988 259258 267784 276407
64145 276407 284435 291410 297406 302407 305950 307702 307873 306712 303992 299415 293261 286291 279160 272141
64131 272141 265208 258208 251230 244922 240080 236700 233840 230667 227265 224113 221276 218608 216417 215277
64117 215277 215225 215607 215701 215264 214547 214057 214182 214815 215474 215920 216392 217127 218089 219399 221513 224556 227964 231313
64099 231313 235062 239834 245385 251090 257087 264034 271837 279630 287133 295142 304396 314686 325374 336111
64085 336111 346682 356717 365976 374424 381747 387256 390614 392175 392253 390589 386943 381735 375566 368512
64071 368512 360469 351909 343721 336467 330295 325351 321630 318511 315129 311319 307712 304826 302567 300855
64057 300855 300148 300935 303000 305680 308749 312603 317536 323215 329089 335102 341711 349279 357668 366474 375487
64042 375487 384870 395079 406645 419782 434053 448668 463263 478118 493387 508451 522482 535364
64030 535364 547461 558589 567985 575399 581481 586814 591229 594569 597455 600570 603527 605189 605062 603785
64016 603785 602270 600919 599701 598397 596589 593843 590249 586595 583861 582660 583157 585228 588607 593151
64002 593151 599133 607035 616889 628008 639556 651333 663883 677914 693703 710977 729297 748556
63990 748556 769124 791485 815808 842033 870276 900874 933978 969412 1007107 1047466 1091047
63979 1091047 1137984 1188000 1241014 1297531 1358355 1424123 1495290 1572524 1656864 1749345 1850674
63968 1850674 1961597 2083648 2219308 2371330 2542153 2734215 2950691 3195735 3474266
63959 3474266 3791920 4155052 4570230 5043445 5579961 6184654 6861573 7612271 8434360
63950 8434360 9321724 10266036 11258106 12288308 13346144 14418914 15489740 16536273 17531594
63941 17531594 18447323 19257242 19939892 20479824 20867570 21098326 21169729 21080119 20828478 20416074
63931 20416074 19848756 19138780 18305370 17373426 16370482 15323112 14254470 13183742 12126894
63922 12126894 11097620 10108023 9169072 8290628 7480679 6744028 6081531 5490658 4966897
63913 4966897 4504883 4098774 3742386 3429578 3154759 2913112 2700452 2512944 2346877
63904 2346877 2198756 2065746 1946050 1838587 1742073 1654502 1573652 1498040 1427231 1361321
63894 1361321 1300293 1243752 1190996 1141172 1093503 1047424 1002588 958876 916535 876098 837886
63883 837886 801593 766620 732809 700602 670435 642242 615658 590490 566837 544975 525211
63872 525211 507648 491869 477031 462528 448525 435672 424359 414314 404882 395586 386527 378327
63860 378327 371547 366101 361360 356924 353051 350218 348485 347540 347154 347316 348063 349458 351556 354147 356718
63845 356718 358994 361350 364204 367125 369020 369208 367832 365216 361352 356165 349748 342134 333336 323861
63831 323861 314623 305927 297015 287194 277016 267715 259675 252220 244924 238315 232925 228224 223063 217010
63817 217010 210778 205323 200848 196869 192995 189351 186208 183495 180867 178157 175483 172983 170738 168973
63803 168973 167949 167468 166811 165479 163762 162295 161245 160282 159207 158245 157706 157668 157948 158127 157649 156224 154169
63786 154169 152104 150345 148859 147694 147007 146613 145981 144928 143924 143458 143348 143012 142215 141195 140122 138832
63770 138832 137188 135461 134137 133361 132704 131589 129984 128549 128047 128674 130084 131894 133897 135869 137500
63755 137500 138663 139516 140216 140701 140840 140651 140312 140109 140404 141324 142421 142938 142698 142536 143580 146201 149832
63738 149832 153642 157169 160483 164070 168505 173968 180083 186457 193305 201258 210637 221200 232579 244538
63724 244538 256667 268248 278719 288013 296116 302505 306390 307515 306320 303308 298640 292514 285567
63711 285567 278535 271617 264486 256868 248831 240570 232275 224271 216916 210199 203755 197512 191995 187661
63697 187661 184185 180816 177295 173964 171044 168395 166077 164574 164171 164453 164822 165237 166141 167908 170681
63682 170681 174600 179761 185964 192801 200006 207537 215401 223651 232527 242223 252513 262799 272589 281689
63668 281689 289928 296976 302483 306113 307401 305894 301645 295243 287185 277491 266311 254590 243616
63655 243616 233877 224888 216292 208649 202723 198322 194390 190289 186482 183754 182164 181118 180293 179987 180507
63640 180507 181620 182910 184445 186735 189972 193630 197010 200092 203639 208442 214589 221460 228290 234699
63626 234699 240925 247779 256243 266816 279182 292706 307210 323019 340314 358852 378472 399389
63614 399389 421699 444980 468799 493206 518082 542215 563759 581633 595778 606036 611651 612339
63602 612339 609206 604031 598112 592242 587209 583446 580453 577365 573960 570356 565793 558639 547952 534383
63588 534383 519256 503368 487108 471056 455740 441048 426471 411890 397693 384281 371890
63577 371890 360801 351169 342689 334924 328068 322884 319707 317979 317054 317049 318528 321671 326257 332288 340058
63562 340058 349582 360490 372667 386541 402463 420128 438997 459088 480917 504696 529992 556149
63550 556149 582693 609153 634822 658907 680681 699288 713697 723321 728730 731492 733206 734828
63538 734828 736835 739635 743533 748435 753775 758643 761868 762159 758497 750427 737781 720199 697305 669531
63524 669531 638399 605727 572736 540268 509490 481664 457056 434650 413323 392972 374242
63513 374242 357548 342897 330338 319865 310922 302619 294693 287745 282327 278231 274986 272601 271337
63500 271337 271035 271199 271756 273247 276120 280100 284418 288580 292862 298088 304967 313586 323608 334862
63486 334862 347491 361364 375678 389439 402214 414135 425316 435633 444959 453123 459544 463332
63474 463332 463963 461541 456226 447821 436315 422578 408067 393829 380140 367098 355161 344880
63462 344880 336281 328779 321677 314697 308097 302330 297604 293764 290642 288458 287669 288276 289454 290127 290008
63447 290008 289928 291052 293809 297673 301939 306574 312255 319625 328644 338755 349647 361731 375725 391813
63433 391813 409343 427400 445621 464402 484420 506027 529054 553097 577993 604099 632105
63422 632105 662494 695119 729200 763563 796754 827002 852326 870939 881778 884875 881352 872964
63410 872964 861509 848492 835154 822501 811097 800933 791574 782311 772035 759275 742840 722509
63398 722509 698958 673070 645619 617561 590133 564312 540376 518172 497657 479003 462330
63387 462330 447638 434997 424611 416642 411017 407406 405419 404884 405973 409020 414218 421539 430790 441571
63373 441571 453308 465684 479090 494346 511891 531485 552770 575772 600665 627381 655711
63362 655711 685536 716643 748466 780214 811082 840011 865455 885762 899822 907240 908153 903321
63350 903321 894294 882932 870527 857595 844567 832276 821434 811818 802268 791499 778749 763722
63338 763722 746206 725989 703114 678066 651708 625102 599238 574575 550798 527373 504602
63327 504602 483805 466085 451190 438028 426043 415441 406201 397770 389936 383200 377870 373471 369545
63314 369545 366469 364828 364409 364403 364270 363805 362757 361083 359322 358018 356925 355485 353803 352367 350984 348944
63298 348944 346271 343876 342278 341010 339560 338049 336652 335209 333946 333822 335400 337874 339915 341173
63284 341173 342352 344073 346230 348321 349903 350881 351708 353093 355135 356952 357590 357035 355952 354802 353824
63269 353824 353527 354336 355734 356582 356534 356518 357515 359407 361386 363049 364633 366425 368437 370569 372776 375076
63253 375076 377667 380957 385236 390268 395397 400093 404365 408664 413561 419522 426810 435435 445190 455803
63239 455803 467098 479039 491654 505012 519340 535137 552971 573028 594895 617900 641686
63228 641686 666352 692050 718579 745460 772197 798292 823111 846027 866878 886179 904733
63217 904733 923105 941490 959965 978679 997778 1017237 1036748 1055587 1072614 1086600 1096649
63206 1096649 1102174 1102500 1096798 1084675 1066696 1044040 1017667 988045 955733 921967 888387 856159
63194 856159 825517 796352 769221 745462 726124 711017 699173 690039 683701 680040 678381 678316 680256
63181 680256 684695 691391 699791 709806 721501 734299 747291 760225 773526 787344 801378 815609
63169 815609 830348 845331 859619 872858 885883 899425 912686 923817 931484 935459 936035 933561
63157 933561 928432 920900 910803 897888 882366 864818 845651 825114 803783 782555 762015 742223
63145 742223 723266 705681 690142 676945 665941 656739 648768 641383 634263 627700 622321 618418 615688
63132 615688 613629 612035 610984 610498 610467 610967 612368 614877 618146 621557 624844 628178 631706 635350 639074
63117 639074 643053 647481 652487 658266 664948 672139 678985 684908 690056 694833 699301 703382 707358 711753
63103 711753 716756 722066 727184 731580 734707 736322 736873 737199 737680 737893 737246 735741 733925 732206 730479
63088 730479 728555 726746 725715 725624 725747 725338 724821 725621 728663 733395 738587 743715 749202 755548 762777 770686
63072 770686 779170 788130 797401 806983 817179 828382 840825 854615 869829 886447 904281 923096
63060 923096 942851 963778 986275 1010677 1037071 1065314 1095323 1127404 1162176 1200046 1240685
63049 1240685 1283161 1326747 1371573 1418272 1466999 1517035 1567482 1617999 1668575 1718858 1768208
63038 1768208 1816374 1863658 1910380 1956542 2002121 2047331 2092463 2137747 2183386 2229281 2274513
63027 2274513 2317390 2356085 2388929 2414017 2429198 2432887 2424665 2404812 2373601 2331441 2279504 2219813
63015 2219813 2154710 2086289 2016055 1945025 1874465 1806628 1744188 1688570 1639256 1595153 1556209
63004 1556209 1523274 1496827 1476553 1461935 1452564 1447881 1447145 1449783 1455481 1464058 1475467 1489642 1506007
62991 1506007 1523434 1541123 1559165 1577682 1595922 1612978 1629051 1644905 1660125 1673024 1682590
62980 1682590 1689432 1694272 1696312 1693784 1685524 1671277 1650931 1624327 1591769 1554082 1512091 1466552
62968 1466552 1418589 1369730 1321209 1273523 1226824 1181565 1138504 1098180 1060690 1026102 994796
62957 994796 967080 942541 920279 899970 882313 868061 856845 847327 838296 829218 819929 810456
62945 810456 801151 792435 784143 775575 766462 757508 749659 742978 736559 729417 721289 712623 704037 695853
62931 695853 688075 680658 673647 667078 660964 655511 651049 647485 644015 639721 634443 628866 623955 620457
62917 620457 618603 617741 616460 613706 609855 606284 603853 602217 600554 598439 595898 593102 590261 587574
62903 587574 585178 583359 582680 583397 584801 585660 585465 584804 584454 584543 584646 584063 581925 577706 572029 566425 561935
62886 561935 558323 554886 551479 548333 545466 542834 540655 538991 537269 534902 532244 530359 529834 530230 530763
62871 530763 531128 531515 532092 532671 532962 533062 533543 534782 536345 537392 537715 537904 538382 538869 539082 539404 540289 541377
62853 541377 541797 541247 540271 539558 539357 539538 539828 539942 539795 539664 539975 540927 542365 543912 545156 545956 546687 547890
62835 547890 549511 550816 551332 551490 551952 552626 552832 552169 550723 548620 546052 543664 542207 541641 541155 540336
62819 540336 539788 540212 541307 542063 541927 541155 540056 538485 536350 534200 532780 532117 531559 530852 530701 531975
62803 531975 534707 538319 542506 547325 552602 557992 563681 570323 578122 586616 595652 605832 617575 630453
62789 630453 644103 659220 676799 696782 718382 741590 767380 796333 827951 861722 898136
62778 898136 938144 982117 1029997 1082203 1139700 1203075 1271984 1345700 1423857 1506276 1592163
62767 1592163 1679866 1767536 1853687 1936871 2015075 2085851 2146987 2196674 2233104 2254494 2259842
62756 2259842 2249416 2224291 2185667 2134668 2072507 2000699 1921395 1837496 1751863 1666115 1580591
62745 1580591 1495692 1412743 1333237 1257879 1186911 1120835 1060050 1004142 952321 904443 860938
62734 860938 821822 786487 754424 725453 699145 674675 651544 630000 610529 593288 578170
62723 578170 565039 553659 543657 534715 526656 519324 512654 506882 502418 499442 497804 497244 497557 498645
62709 498645 500701 504191 509350 515851 523307 531933 542198 554068 567245 582117 599703 620454 643781
62696 643781 668959 695909 724758 755370 787893 823297 862624 905799 951690 999173 1047588
62685 1047588 1096218 1143939 1189640 1232569 1271962 1306488 1334401 1354249 1365279 1367244 1360134 1344273
62673 1344273 1320463 1289723 1252938 1210989 1165171 1117071 1067895 1018222 968603 920065 873717
62662 873717 830143 789440 751630 716677 684391 654735 628133 605008 585096 567521 551401
62651 551401 536053 520900 505810 491442 478647 467400 456810 446240 435882 426151 417036 408309
62639 408309 399941 392076 384862 378463 372909 367845 362819 357892 353566 350023 346906 344005 341621 339961
62625 339961 338652 337235 335741 334389 333073 331638 330425 330077 330894 332659 334938 337248 339173 340777 342832
62610 342832 346208 351049 356805 363000 369582 376562 383813 391424 399881 409650 420768 433094 446802
62597 446802 462245 479402 497897 517737 539624 564172 591063 619533 649657 682592 719356
62586 719356 759871 803377 849196 896550 944137 990522 1034702 1075678 1111792 1141317 1163641
62575 1163641 1179114 1187632 1188185 1180089 1164032 1141556 1114032 1082427 1047540 1009948 970076 928704
62563 928704 887229 847122 809333 774297 742084 712274 684083 657020 631249 607087 584470
62552 584470 563169 543199 524653 507412 491329 476442 462700 449766 437410 425838 415230
62541 415230 405174 395021 384734 375038 366759 360253 355375 351753 349112 347503 347144 347948 349419 351140
62527 351140 353097 355323 357572 359703 362133 365539 370157 375666 381659 388008 394882 402603 411431 421374
62513 421374 432392 444857 459371 475980 493962 512858 533280 556195 581591 608463 635984
62502 635984 664070 692719 721284 748632 773660 795446 813157 826088 833801 836133 833139 825058
62490 825058 812341 795723 776171 754567 731454 707246 682627 658411 634988 612357 590794
62479 590794 571086 553870 539215 527001 517163 509161 501869 494672 488247 483577 480527 478154 476195
62466 476195 475392 476299 478584 481615 485035 488558 491863 495048 498708 503244 508424 513836 519377 525093 530938
62451 530938 536981 543531 550763 558460 566271 573912 580859 586212 589230 589906 588747 586143 582167 576846
62437 576846 570290 562505 553302 542472 530144 516946 503751 491150 479238 468005 457720 448622
62425 448622 440428 432653 425488 419818 416166 414037 412611 411718 411785 413126 415759 419695 424883 430872 436991
62410 436991 442997 449217 455970 463159 470579 478257 486193 493918 500697 506174 510566 514170 516894 518423
62396 518423 518677 517905 516355 514049 510876 506823 502041 496721 490924 484562 477696 470926 465304 461618 459795
62381 459795 459157 459229 460119 462248 466065 471976 480148 490230 501629 514231 528639 545627 565624 588784
62367 588784 615140 644537 676769 711958 750373 791709 835109 880237 927737 978098 1030528
62356 1030528 1083510 1135941 1186928 1234820 1277437 1313187 1341196 1360510 1370283 1370959 1364279 1351653
62344 1351653 1333378 1309811 1282350 1252318 1219532 1183052 1143251 1102283 1062362 1024170 987131
62333 987131 950811 915747 883154 854023 828460 805770 785093 765882 747853 730827 714767
62322 714767 699759 685773 672706 660851 650984 643558 637969 633049 628264 623998 620678 618072 615564
62309 615564 612725 609303 605000 599625 593468 587204 581392 576156 571329 566677 561945 556961 551852 547119
62295 547119 543314 540617 538776 537462 536680 536818 538302 541081 544425 547451 550017 553052 557716 564279 571981
62280 571981 579950 587950 596200 604896 614111 623978 634688 646374 659089 672685 686710 700808 715403
62267 715403 731698 750688 772411 796364 822296 850257 880311 912759 948430 988146 1031954
62256 1031954 1079373 1130191 1184297 1240623 1296845 1350269 1398595 1439859 1472440 1495503 1508967
62245 1508967 1512755 1506594 1490918 1467438 1438261 1404735 1367557 1327622 1286122 1243942 1201628 1160007
62233 1160007 1120365 1083765 1050428 1019993 992272 967691 947035 930754 918413 908793 900585 892960
62221 892960 885592 878408 871486 864974 858853 852848 846757 840779 835345 830642 826514 822817 819693 817441
62207 817441 816242 816098 817020 819192 822915 828298 835084 842844 851348 860661 870949 882404 895412 910583
62193 910583 928438 949082 972193 997250 1023785 1051585 1080715 1111237 1142825 1174641 1205533
62182 1205533 1234172 1259136 1279288 1294374 1305224 1313195 1319419 1324492 1328733 1332635 1337105 1343273 1352022
62169 1352022 1363812 1379061 1398441 1422529 1451195 1483575 1518429 1554182 1588832 1620501 1648206
62158 1648206 1671653 1690290 1703288 1710670 1713783 1714152 1712282 1708019 1701443 1692814 1682017 1668983 1654517
62145 1654517 1640027 1626353 1613520 1601670 1591585 1583996 1578871 1575755 1574460 1575084 1577570 1581594 1586799
62132 1586799 1592914 1599778 1607500 1616530 1627365 1640138 1654586 1670326 1686956 1704028 1721300 1739250
62120 1739250 1759084 1781790 1807106 1833750 1860780 1888427 1917338 1947319 1977373 2006903 2036307
62109 2036307 2066185 2096446 2126583 2156481 2186530 2217039 2247935 2279064 2310479 2342388 2374999
62098 2374999 2408525 2443217 2479310 2516915 2555990 2596490 2638660 2683110 2730377 2780394 2832653
62087 2832653 2886962 2943677 3002869 3063462 3123615 3182065 3239086 3296207 3355092 3416501 3480052
62076 3480052 3544747 3609511 3673069 3733576 3789097 3838871 3884013 3926793 3969415 4013379 4059335
62065 4059335 4106898 4154829 4201914 4247639 4291711 4333057 4369746 4399900 4422488 4437457 4445566
62054 4445566 4448065 4446076 4439980 4429474 4414087 4393542 4367911 4337852 4304553 4269041 4231580 4192193
62042 4192193 4151662 4111504 4072901 4036184 4001430 3969006 3939265 3912209 3887858 3866581 3848614
62031 3848614 3833509 3820471 3809162 3799778 3792412 3786669 3782007 3778135 3774972 3772420 3770371 3768852 3767945
62018 3767945 3767473 3766896 3765672 3763739 3761525 3759510 3757892 3756643 3755602 3754399 3752551 3749858 3746534 3742712
62004 3742712 3738071 3732286 3725713 3719183 3713022 3706598 3698916 3689396 3677952 3664447 3648092 3627263 3600022
61991 3600022 3565182 3522992 3474712 3421674 3365009 3306051 3246411 3187471 3130129 3075070 3022902
61980 3022902 2973839 2927634 2884101 2843453 2805878 2771021 2738154 2706773 2676887 2648779 2622609
61969 2622609 2598183 2575104 2553275 2533065 2514625 2497131 2479275 2460684 2442365 2425424 2409824
61958 2409824 2394779 2379966 2365720 2352216 2339141 2326279 2313975 2302796 2292952 2284230 2276451 2269906
61946 2269906 2265331 2263435 2264443 2268197 2274615 2283760 2295463 2309251 2324872 2342505 2362221 2383587
61934 2383587 2406220 2430551 2457630 2488319 2522946 2561448 2603430 2648308 2695988 2747357 2803686
61923 2803686 2865739 2934038 3009917 3095627 3193372 3304972 3432648 3579336 3747728 3939599
61913 3939599 4156613 4401416 4677475 4988264 5337158 5727835 6164177 6649922 7188856
61904 7188856 7785002 8441574 9159157 9934427 10759315 11619199 12490060 13336722 14114044
61895 14114044 14771209 15258476 15535504 15579188 15387984 14981059 14393470 13669619 12856452
61886 12856452 11997337 11128019 10275502 9458997 8691256 7979576 7326874 6733042 6196098
61877 6196098 5712900 5279587 4891939 4545609 4236301 3959997 3713100 3492381 3294863
61868 3294863 3117863 2959066 2816491 2688488 2573889 2471970 2382004 2302841 2233073 2171615
61858 2171615 2118002 2072178 2034082 2003285 1978841 1959606 1944949 1935081 1930447 1930758 1934760 1940844
61846 1940844 1947629 1954068 1959371 1963021 1964711 1964283 1961900 1958166 1953775 1949089 1944377 1940394 1938197 1938214 1939979
61831 1939979 1943024 1947638 1954423 1963497 1974496 1986965 2000203 2012838 2023194 2030252 2034015 2035022 2033914
61818 2033914 2031456 2028545 2025905 2023967 2023166 2024194 2027887 2035044 2046412 2062701 2084446 2111890 2145030
61805 2145030 2183750 2228018 2278140 2334789 2398573 2469591 2547670 2633110 2726933 2830325 2944115
61794 2944115 3069002 3206048 3356620 3521994 3703437 3902835 4123016 4367260 4638653
61785 4638653 4940151 5275277 5648545 6065151 6530360 7049334 7627484 8270869 8986288
61776 8986288 9781217 10663676 11641870 12723300 13913285 15212960 16616796 18109679 19663681
61767 19663681 21234864 22761249 24163973 25353696 26242399 26757974 26857389 26534601 25820915
61758 25820915 24777716 23484056 22023399 20473442 18900422 17356789 15880737 14497026
61750 14497026 13219104 12052059 10995389 10044854 9193622 8433213 7754512 7148551 6606960
61741 6606960 6122306 5688372 5300011 4952524 4641210 4361597 4109860 3882760 3677400
61732 3677400 3491441 3323439 3172414 3036979 2915209 2805356 2706138 2616119 2533298 2455640
61722 2455640 2381713 2310623 2241806 2175257 2111538 2051007 1993261 1937749 1884688 1834877 1788802
61711 1788802 1746383 1707429 1671765 1638910 1608141 1578996 1551365 1525124 1500057 1476151 1453534
61700 1453534 1432068 1411350 1391191 1371790 1353399 1336063 1319676 1304030 1288894 1274340 1260847
61689 1260847 1248626 1237003 1225018 1212573 1200416 1189015 1178164 1167786 1158264 1149577 1140839 1131281
61677 1131281 1121212 1111466 1102339 1093628 1085336 1077601 1070083 1062127 1053617 1045178 1037439 1030478 1024012 1017760
61663 1017760 1011446 1004720 997346 989482 981787 975180 970255 966789 964049 961727 960305 960246 961190 962352 963477
61648 963477 964903 966801 968910 971019 973220 975594 978144 981184 985266 990447 996009 1001253 1006295 1011684
61634 1011684 1017508 1023304 1028834 1034560 1041255 1049321 1058442 1067645 1075683 1081610 1085151 1086433 1085321 1081260
61620 1081260 1073875 1063589 1051484 1038582 1025381 1011992 998532 985282 972631 960900 950237
61609 950237 940597 931794 923536 915464 907316 899152 891373 884309 877846 871577 865313 859274 853851 849406
61595 849406 846320 844937 845263 846867 849208 851957 855003 858462 862842 868892 876940 886531 896997 908232
61581 908232 920629 934393 949342 965368 982678 1001477 1021691 1043225 1066300 1091369 1118666
61570 1118666 1147868 1178216 1209114 1240667 1273477 1307775 1343001 1378420 1413779 1448955 1483263
61559 1483263 1515750 1546137 1574907 1602403 1628382 1652607 1675308 1696778 1716818 1734854 1750364
61548 1750364 1763059 1772926 1780199 1784962 1786718 1784689 1778606 1768800 1755525 1738916 1719802 1699856 1680364
61535 1680364 1661360 1642472 1624160 1607479 1592976 1580573 1570394 1563050 1559110 1558855 1562523 1570341
61523 1570341 1582340 1598655 1619943 1647005 1680037 1718859 1763953 1816616 1877876 1947895 2026866
61512 2026866 2116015 2217199 2331800 2460602 2604551 2764995 2943006 3138993 3353331 3587032
61502 3587032 3841195 4115547 4407580 4712859 5025412 5337229 5637615 5913791 6152726
61493 6152726 6342802 6474900 6543670 6548886 6495317 6390611 6243179 6061897 5856613 5637320
61483 5637320 5412381 5187905 4968677 4758922 4562048 4380374 4215483 4068411 3939338
61474 3939338 3827717 3733142 3655697 3595112 3550099 3519040 3500978 3495436 3501592 3518365 3545197
61463 3545197 3581940 3627723 3680403 3737477 3797210 3858636 3920781 3982337 4042018 4098943 4152623
61452 4152623 4202863 4249919 4294782 4339100 4384640 4432577 4483256 4536520 4592210 4650297 4710704
61441 4710704 4773124 4836913 4900936 4963508 5022771 5077196 5125611 5166690 5198751 5220316 5230821
61430 5230821 5230576 5220105 5199658 5169289 5129289 5080638 5025291 4965908 4904946 4843928 4783796 4725871
61418 4725871 4672067 4624064 4582645 4548001 4520237 4499287 4484699 4475921 4472581 4474169 4479682 4487934
61406 4487934 4497889 4508140 4516358 4520093 4518271 4511456 4500705 4486837 4470910 4454591 4439653 4427631
61394 4427631 4420385 4420526 4430835 4453627 4491047 4545487 4619073 4713004 4827995 4965207 5126201
61383 5126201 5312114 5523379 5760120 6022084 6307956 6615027 6939360 7275507 7615657
61374 7615657 7949355 8264374 8547939 8787638 8972539 9095005 9152315 9146689 9083605 8969723
61364 8969723 8811609 8615406 8386822 8131119 7853343 7558889 7253754 6943897 6634315
61355 6634315 6329038 6031916 5746781 5476556 5222626 4985429 4765270 4562185 4375574
61346 4375574 4204743 4049695 3910810 3787943 3680459 3588057 3510720 3447762 3397706 3359508
61336 3359508 3333227 3319099 3316445 3323976 3340715 3366089 3399325 3439309 3484845 3534609 3587039 3640806
61324 3640806 3695341 3750369 3804763 3856412 3903525 3945788 3983959 4018581 4049464 4076345 4099655
61313 4099655 4120455 4139797 4158241 4175794 4192135 4206872 4219611 4229680 4235810 4236292 4229682 4215295
61301 4215295 4192992 4162787 4124952 4080263 4029662 3973649 3912450 3846818 3778234 3708202 3637786
61290 3637786 3568035 3500328 3435952 3375685 3320141 3270122 3226306 3188925 3158138 3134253 3117022
61279 3117022 3105065 3096652 3090785 3086911 3083896 3080185 3074979 3068412 3060440 3050399 3037952 3023867 3009504
61266 3009504 2996118 2984881 2976923 2972851 2972646 2976446 2985056 2999327 3019529 3045842 3079165 3120975
61254 3120975 3172650 3235360 3310324 3398551 3500265 3614906 3741511 3878655 4023918 4173579
61244 4173579 4322570 4464346 4590895 4693488 4763876 4795280 4783131 4725980 4626155 4489374
61234 4489374 4323515 4137480 3940364 3740431 3543952 3354835 3175314 3006856 2850535
61225 2850535 2707044 2576737 2459562 2354881 2261524 2178280 2104286 2038855 1981159 1930414
61215 1930414 1886346 1849035 1818061 1792145 1769993 1751387 1736984 1727039 1720882 1717825 1718064 1722182
61203 1722182 1730052 1740822 1753832 1768942 1785895 1803922 1822141 1839911 1856556 1871152 1882874
61192 1882874 1891291 1896131 1897166 1894613 1889314 1882120 1873200 1862206 1848863 1833120 1814973 1794553 1772289
61179 1772289 1748620 1723627 1697257 1669776 1641647 1612996 1583568 1553280 1522507 1491691 1460949
61168 1460949 1430163 1399276 1368332 1337336 1306189 1274795 1243235 1211833 1180993 1150961 1121895
61157 1121895 1094256 1068858 1046284 1026364 1008498 992363 977916 964627 951092 935671 917524
61146 917524 897012 875301 853738 833432 815047 798775 784490 772012 761291 752362 745238 739936
61134 739936 736558 735137 735321 736440 738169 740960 745556 752101 760039 768819 778290 788345 798682 809209
61120 809209 820353 832607 845934 859867 873979 888004 901668 914814 927619 940461 953615
61109 953615 967182 980993 994176 1005028 1011848 1014039 1012213 1007255 999650 989674 977768 964486 950283
61096 950283 935555 920805 906671 893791 882533 872650 863235 853248 842238 830492 818579 806905
61084 806905 795673 784980 774825 765097 755617 746214 736946 728329 721152 715781 711801 708626 706345
61071 706345 705580 706496 708327 709996 710918 711097 710748 710036 709026 707684 705894 703527 700579 697411 694864 693727
61055 693727 693794 693792 692755 691238 690612 691319 692645 694177 696553 700364 705187 710372 716164 723245 731496 740076
61039 740076 748655 757841 768241 779692 791598 803691 816184 829332 842927 856172 868192 878899
61027 878899 889163 899874 910953 921533 930897 938898 945721 951808 957972 965096 973534 983088 993496
61014 993496 1004607 1016191 1028167 1041054 1055713 1072512 1091115 1111202 1133024 1157179 1184260
61003 1184260 1214760 1248988 1287114 1329750 1378299 1434054 1496924 1565642 1639129 1716878 1798272
60992 1798272 1883003 1972672 2070800 2180576 2303484 2440597 2593902 2765440 2956375 3168177
60982 3168177 3403882 3667242 3962048 4293950 4672140 5107888 5612904 6201328 6892316
60973 6892316 7708481 8673614 9816008 11174403 12797920 14739359 17042799 19711551
60965 19711551 22644817 25579856 28120903 29891809 30728429 30762223 30332214 29813487 29495596
60956 29495596 29544845 29983394 30646507 31180898 31162207 30295861 28559288 26180301 23488591
60947 23488591 20768063 18197001 15864096 13803256 12016062 10485362 9186516 8093269
60939 8093269 7177833 6411474 5768086 5226116 4766785 4372700 4029346 3726283 3455728
60930 3455728 3211138 2987856 2783684 2597474 2427796 2273564 2134797 2011508 1902326
60921 1902326 1804973 1717562 1638611 1566306 1498577 1433766 1370872 1309595 1250635 1195442 1145094
60910 1145094 1099655 1058844 1022694 991072 963187 938186 915803 895901 877922 861382 846496
60899 846496 833695 822936 814038 807245 802738 799932 797969 796667 796377 797190 798996 802021 806508 811838
60885 811838 816681 820072 821804 821832 819953 816181 810865 804161 795795 785600 774048 762000 750038 738192
60871 738192 726318 714693 704115 695256 687976 681493 675197 669098 663634 659500 657536 658118 660539 663689
60857 663689 667493 672918 680266 688395 696253 704386 714073 725591 738275 751899 766926 783533 801229
60844 801229 819492 838117 856992 876101 895652 915566 934943 952594 968048 981459 992711
60833 992711 1001307 1007096 1010410 1011498 1010553 1008394 1006468 1005825 1006359 1007066 1006647 1004013 998790 991501 982931
60818 982931 973368 962799 951531 939964 927803 914281 899323 883894 869027 854992 841526 828414
60806 828414 815648 803430 792180 782243 773564 765894 759234 753750 749421 746253 744637 744873 746473 748616
60792 748616 751312 755453 761654 769697 779153 789781 801182 812848 824918 838235 853236 869261
60780 869261 885262 900702 915422 929214 942035 954294 966395 978139 988893 998316 1006750 1015026
60768 1015026 1023896 1033386 1042703 1051024 1058321 1065024 1071107 1076090 1079912 1082995 1085286 1086016 1084787 1082233
60754 1082233 1079140 1075487 1070891 1065519 1059975 1054634 1049597 1045086 1041384 1038512 1036308 1034642 1033203 1031296
60740 1031296 1028240 1023848 1018232 1011353 1003159 994062 984908 976453 969020 962540 956724 951283 946211 941805
60726 941805 938371 936016 934763 934543 934958 935315 935201 934840 934728 935048 935609 936134 936344 935941 934768 932971 930851
60709 930851 928558 926099 923591 921391 919858 918951 918112 916726 914723 912513 910236 907516 904197 900807 897671
60694 897671 893854 887759 878776 867686 855454 842380 828616 814696 801063 787524 773677 759573
60682 759573 745726 732720 721091 711282 703447 697423 692952 689693 687080 684652 682694 682166 683858 687878
60668 687878 693857 701101 708520 715146 721007 726992 733607 740378 746603 752045 756621 760083 762441 764151
60654 764151 765458 766054 765858 765667 766603 769293 773929 780594 788988 798246 807494 816299 824311 831050 836516
60639 836516 841586 847218 853657 860771 868679 877516 887086 897373 908924 922090 936218 950246 963746
60626 963746 976755 989017 1000121 1010050 1018724 1025233 1028387 1028012 1024942 1019790 1012527 1003280 992733
60613 992733 981407 969168 955773 941615 927753 915442 905547 898032 892038 886854 882857 881164 882432
60600 882432 886258 891613 897348 902350 905766 907288 907075 905420 902724 899577 896498 893715 891509 890520 891243
60585 891243 893366 896133 899183 902441 905296 906678 906195 904710 903465 902899 902546 901865 900967 900516 900959 901905
60569 901905 902519 902512 902319 902134 901305 899114 895687 891559 886720 880772 873823 866504 859251 852204 845664 840001
60553 840001 835186 831102 828170 826967 827317 828570 830800 834810 840841 848187 856406 866034 877644 891064
60539 891064 906155 923741 945014 970357 999512 1032700 1070879 1114747 1163766 1216055 1268766
60528 1268766 1318471 1361511 1394371 1414126 1419077 1409443 1387502 1356884 1321489 1284754 1249417 1217547
60516 1217547 1190583 1169273 1153647 1143241 1137502 1135954 1138010 1142909 1150039 1159040 1169416 1180377
60504 1180377 1191452 1202927 1215248 1228395 1242509 1259021 1280398 1308619 1344362 1387676 1438789
60493 1438789 1498130 1566235 1644035 1732849 1833699 1946814 2071874 2208469 2356297 2515521
60483 2515521 2687410 2874658 3081138 3311678 3571905 3867177 4200069 4567370 4958000
60474 4958000 5352485 5724406 6044031 6283178 6419508 6439272 6339083 6126982 5821728 5449413
60464 5449413 5038406 4614705 4199050 3805884 3443799 3116862 2826087 2570500 2347744
60455 2347744 2154432 1986567 1840182 1711961 1599361 1500253 1412774 1335588 1267860 1208649
60445 1208649 1156560 1110274 1068995 1032029 998367 967259 938811 913277 889985 867753 846197
60434 846197 825863 807134 789884 774220 760592 748894 738266 728154 718852 710710 703559 697315
60422 697315 692371 688877 686243 683947 682289 681747 682094 682750 683557 684603 685652 686482 687471 689166 691376 693302
60406 693302 694564 695587 697068 699509 703170 707901 712937 717345 720872 724115 727819 732236 737138 742163
60392 742163 747101 752055 757388 763280 769293 774540 778315 780512 781384 781101 779640 777066 773769 770263 766778
60377 766778 763285 759979 757361 755498 753557 750647 747089 744214 742852 742570 742523 742458 742575 743007 743834 745191
60361 745191 746913 748397 749290 750087 751627 754207 757527 761306 765537 770277 775583 781613 788464 795944 803746
60346 803746 811779 820111 828693 837323 845871 854343 862842 871530 880528 889674 898459 906232 912381 916405
60332 916405 918187 918260 917489 916395 915099 913937 913668 914824 917288 920682 924739 929070 933012 936088 938266
60317 938266 939452 939132 936893 932919 927641 921334 914525 908347 903837 901076 899477 898626 898325 898157 897736
60302 897736 897321 897535 898498 899761 901050 902562 904583 907347 911220 916427 922523 928731 934963 941959 950159
60287 950159 958812 966504 972266 976046 978392 979909 980854 981065 980420 979446 979261 980754 983906 987935 992032
60272 992032 996021 1000544 1006622 1014926 1025402 1037660 1051572 1067383 1085451 1106098 1129528 1155569
60260 1155569 1183650 1213443 1245456 1280689 1319788 1362915 1410387 1462927 1521192 1585456 1655936
60249 1655936 1733154 1817822 1910586 2011935 2122063 2240715 2367388 2501688 2643150 2790628
60239 2790628 2942179 3095633 3248811 3398967 3542465 3675533 3795276 3899807 3987694 4057735
60229 4057735 4109179 4141808 4155811 4151949 4131908 4098101 4052904 3998319 3936519 3870493 3803831
60218 3803831 3739933 3681630 3631422 3591547 3563624 3548481 3546687 3559107 3586751 3630200 3689557
60207 3689557 3764845 3856010 3962452 4082959 4216263 4361115 4515267 4674580 4833700 4987704
60197 4987704 5132757 5265317 5381493 5477782 5552200 5604164 5633231 5638409 5618913 5575246 5509283
60186 5509283 5423602 5321203 5205792 5081731 4953377 4824730 4699819 4582959 4478065 4387773
60176 4387773 4313518 4256293 4216956 4195957 4193345 4209243 4243992 4297571 4368981 4456082 4555708
60165 4555708 4663754 4775419 4885659 4989752 5083890 5165626 5233645 5286843 5323806 5343513
60155 5343513 5346342 5333943 5308432 5272324 5229156 5183314 5139064 5100303 5071267 5056540 5059838 5083208
60143 5083208 5127653 5193907 5282244 5392293 5523884 5677884 5855820 6059002 6288510 6545654
60133 6545654 6831893 7148274 7495094 7871597 8275514 8703138 9150172 9612046 10082869
60124 10082869 10554381 11016596 11459494 11873986 12251911 12586014 12869998 13098222 13265631
60115 13265631 13368614 13405811 13377430 13283815 13125330 12903876 12624232 12294002 11922829 11521749
60105 11521749 11102721 10678036 10259542 9857754 9481134 9136186 8828254 8561897 8340174
60096 8340174 8164023 8032938 7946167 7902940 7901835 7940475 8015612 8122787 8255862 8407389
60086 8407389 8569542 8734433 8893817 9039268 9163013 9258536 9320829 9346886 9336227 9290462
60076 9290462 9212109 9103985 8969447 8812321 8636046 8443055 8235241 8014909 7785304 7550528
60066 7550528 7315062 7083132 6858322 6643703 6442106 6256012 6087331 5937552 5807997
60057 5807997 5699686 5613164 5548810 5507243 5489170 5495009 5524960 5579079 5656742 5756155 5874835
60046 5874835 6010332 6159828 6319069 6482332 6643539 6797033 6937477 7059781 7159440 7232603
60036 7232603 7275925 7287062 7265587 7212861 7130715 7020590 6884221 6724768 6547105 6357293
60026 6357293 6161851 5966979 5777807 5598174 5431062 5279095 5144672 5029863 4936169 4864210
60016 4864210 4813784 4784559 4776700 4790695 4826884 4885597 4967494 5073176 5202501 5354719 5529055
60005 5529055 5724380 5938196 6166440 6404094 6645206 6882264 7106597 7310177 7486973
59996 7486973 7632774 7744520 7820218 7858852 7859905 7823356 7750451 7644113 7508328 7347629
59986 7347629 7167530 6974926 6777440 6582327 6395897 6223307 6068311 5933430 5820633
59977 5820633 5731637 5667473 5628352 5614384 5625917 5662619 5722580 5802916 5901075 6014873 6141304
59966 6141304 6275953 6413923 6551222 6685225 6814047 6935592 7047147 7145910 7229893 7298282
59956 7298282 7350977 7388161 7410510 7419636 7418001 7408452 7394013 7378178 7365331 7360748 7369989 7398044
59944 7398044 7449101 7527183 7636691 7781905 7966049 8191244 8459338 8772197 9130992 9535521
59934 9535521 9984281 10474454 11001050 11555743 12126375 12697275 13249948 13763958 14217924
59925 14217924 14590740 14863373 15021400 15057302 14971285 14770545 14467941 14080473 13627444 13128702
59915 13128702 12603605 12070249 11544180 11037305 10558387 10114526 9711553 9353175 9040881
59906 9040881 8775293 8557136 8386691 8263087 8184771 8150293 8158282 8207152 8295275 8421024
59896 8421024 8582068 8774761 8994240 9234390 9487136 9742152 9987698 10211457 10400437
59887 10400437 10541237 10621876 10633932 10573111 10438742 10233854 9965650 9644824 9283663 8894434
59877 8894434 8488834 8077825 7671324 7277827 6903976 6554176 6230815 5935171 5668021
59868 5668021 5429326 5217911 5032087 4870422 4731480 4613045 4512111 4425506 4350013 4282065
59858 4282065 4217996 4154814 4090655 4024705 3957230 3889607 3823889 3762157 3706261 3657752 3617517
59847 3617517 3585563 3561546 3545246 3535967 3531557 3528646 3523804 3514052 3496531 3468801 3430076 3381799
59835 3381799 3326639 3267226 3205966 3145432 3088180 3036109 2990259 2951227 2919570 2895839 2880437
59824 2880437 2873538 2875155 2885310 2904151 2931898 2968772 3015016 3070832 3135958 3209261 3288850 3372634
59812 3372634 3458694 3545304 3630920 3714294 3794335 3869653 3938227 3997573 4045266 4079468 4099312
59801 4099312 4105213 4099054 4084127 4064688 4045241 4029938 4022398 4025720 4042295 4073575 4120391 4183761
59789 4183761 4265369 4367284 4491538 4640151 4815333 5019408 5254826 5524620 5832706 6183241
59779 6183241 6579241 7021330 7506497 8026017 8562707 9089444 9570827 9968234 10247013
59770 10247013 10383911 10372550 10224634 9965883 9628585 9244558 8841201 8440240 8057331
59761 8057331 7702079 7379299 7091239 6839015 6622443 6439733 6288375 6166332 6072069 6003879
59751 6003879 5959986 5939212 5940771 5963422 6005642 6066939 6148355 6251248 6376085 6522827 6692077
59740 6692077 6885298 7104056 7349518 7622738 7925213 8259192 8627501 9032987 9478041
59731 9478041 9964707 10495096 11071290 11694595 12364848 13080009 13835580 14623877 15433980
59722 15433980 16252648 17065347 17856966 18612862 19320870 19973679 20570487 21117412 21626607
59713 21626607 22114269 22598245 23096036 23623334 24192755 24812850 25487524 26215324 26988289
59704 26988289 27791497 28604405 29402966 30160691 30849245 31440757 31911813 32246560 32437684
59695 32437684 32486738 32404677 32211098 31931321 31593185 31225228 30855474 30509705 30210097 29975325
59685 29975325 29821213 29760727 29803946 29958917 30232525 30630251 31155621 31810612 32596199 33511462
59675 33511462 34551456 35705250 36954356 38270787 39615129 40936025 42171858 43254452
59667 43254452 44114675 44689711 44930915 44810624 44326517 43502417 42384889 41036502 39527834
59658 39527834 37929936 36308017 34717067 33199992 31787180 30495661 29327759 28270918
59650 28270918 27299335 26376785 25461349 24513616 23506527 22431427 21297266 20125423 18943736
59641 18943736 17780506 16658905 15594355 14596144 13670167 12819374 12042993 11337357 10697896
59632 10697896 10119898 9598225 9127781 8704341 8324141 7983002 7676816 7402695 7158676
59623 7158676 6942431 6751198 6582777 6435547 6307530 6196315 6099873 6016498 5943845 5878803
59613 5878803 5818329 5759655 5699731 5635368 5564109 5484358 5394790 5294591 5184537 5067108 4945308
59602 4945308 4821768 4698840 4578730 4463299 4354117 4252663 4159954 4076175 4001314 3935992
59592 3935992 3881019 3836336 3801228 3775376 3758751 3750592 3749475 3754506 3765580 3782388 3804079 3829946
59580 3829946 3859367 3890810 3921949 3951324 3979215 4006583 4033930 4061671 4090840 4122849 4158970
59569 4158970 4200515 4249100 4306299 4373362 4451403 4541442 4644058 4759550 4888739 5033172
59559 5033172 5194277 5372752 5569071 5784231 6019679 6276728 6556143 6857974 7181487
59550 7181487 7525298 7887446 8265167 8654786 9052160 9453001 9852453 10244847 10624659
59541 10624659 10987766 11331428 11653620 11953328 12231340 12489737 12730417 12954511 13162725
59532 13162725 13355165 13531130 13690817 13837950 13979806 14123698 14273425 14428495 14585015
59523 14585015 14736106 14871908 14980233 15047847 15061986 15012034 14890769 14694266 14421226 14073351
59513 14073351 13656568 13181138 12660112 12107705 11538260 10964968 10398530 9847070 9317075
59504 9317075 8813541 8339420 7896253 7485769 7109959 6769374 6462556 6187663 5943651
59495 5943651 5729350 5542541 5380847 5242792 5127243 5032571 4957238 4900672 4862814 4843269
59485 4843269 4841577 4857800 4892074 4943960 5012940 5099353 5204283 5328779 5473634 5639660 5827645
59474 5827645 6038169 6271620 6527987 6806273 7104329 7419270 7747402 8083286 8419195
59465 8419195 8745624 9051884 9326257 9556723 9732498 9845064 9888269 9858757 9757086 9587855
59455 9587855 9358260 9077034 8754604 8402782 8032974 7654871 7276944 6906935 6550779
59446 6550779 6211772 5891746 5592587 5315749 5060991 4826949 4612887 4418976 4244929
59437 4244929 4089232 3949913 3825453 3714875 3617441 3532459 3459165 3396807 3344820 3302660
59427 3302660 3269420 3244051 3226099 3215666 3212377 3215016 3222470 3234452 3250921 3271437 3295511 3322975
59415 3322975 3353528 3386546 3421899 3460418 3503169 3550824 3603911 3662413 3724306 3785698 3844039
59404 3844039 3901101 3962010 4031835 4113973 4211139 4326320 4462575 4622690 4808849 5021499
59394 5021499 5258504 5516700 5795211 6097330 6429415 6798511 7210778 7670975 8182337
59385 8182337 8746428 9362755 10028226 10736804 11479380 12243430 13012816 13769132 14494624
59376 14494624 15174656 15798324 16358286 16851021 17276769 17638368 17940026 18186943 18384648
59367 18384648 18537118 18645254 18707318 18720187 18679691 18580724 18418526 18190373 17896277 17539455
59357 17539455 17127596 16673556 16193662 15704824 15222735 14760880 14328742 13929921 13562297
59348 13562297 13219955 12894795 12577429 12258529 11930356 11587273 11225656 10844479 10446002
59339 10446002 10035098 9617755 9200484 8790385 8394303 8017492 7663502 7335042 7034070
59330 7034070 6761074 6515176 6295267 6100608 5930452 5783650 5658661 5553582 5466471 5396114
59320 5396114 5342197 5304156 5280301 5268770 5268794 5280077 5301187 5329604 5363192 5400609 5440353 5480349
59308 5480349 5518515 5552833 5580862 5600194 5609544 5608714 5597491 5575518 5543366 5502913 5456514 5406560
59296 5406560 5355947 5308065 5265887 5231530 5206696 5192904 5191260 5202743 5228844 5271268 5330891
59285 5330891 5407639 5501405 5612441 5740799 5886138 6048186 6226571 6419937 6625688 6840636
59275 6840636 7061224 7283001 7500482 7707746 7898848 8067939 8209910 8321290 8400362 8446767
59265 8446767 8461582 8447251 8406225 8339605 8248072 8134223 8003040 7859967 7709429 7555222
59255 7555222 7401012 7249710 7102926 6961462 6825825 6696205 6572781 6456465 6348875
59246 6348875 6251594 6166183 6094990 6041084 6007176 5995346 6007936 6047743 6117120 6217763 6351653
59235 6351653 6521296 6728831 6975906 7264626 7597291 7974306 8393051 8849082 9336885
59226 9336885 9848075 10369372 10883311 11370515 11810859 12183925 12470758 12656402 12730987 12689257
59216 12689257 12530504 12259494 11886980 11428813 10904153 10333527 9737078 9133310 8538321
59207 8538321 7965115 7423000 6917687 6452174 6027514 5643129 5297248 4987720 4712354
59198 4712354 4468569 4253197 4062942 3894742 3745762 3613614 3496731 3393896 3303181 3221953
59188 3221953 3148266 3081609 3021868 2968144 2919139 2874299 2833948 2798585 2768522 2743996 2725184
59177 2725184 2712186 2705166 2704215 2708818 2717863 2730575 2747263 2768868 2796046 2828956 2867566 2911734
59165 2911734 2961148 3015658 3075638 3141720 3214143 3292444 3375666 3462758 3552876 3645385 3739458
59154 3739458 3833671 3926089 4014679 4097440 4172331 4237467 4291370 4332766 4360432 4373793 4373585 4361343
59142 4361343 4338214 4304905 4262831 4214551 4162831 4109899 4057832 4008966 3965406 3928647 3900153
59131 3900153 3881884 3875637 3882055 3900837 3931968 3976486 4035999 4111671 4203797 4312362 4437840
59120 4437840 4581166 4742917 4923027 5121581 5339397 5577248 5834923 6111727 6407507
59111 6407507 6722146 7053869 7398557 7750388 8101947 8443363 8762153 9044514 9276851
59102 9276851 9446867 9545006 9566237 9510750 9383231 9191883 8947586 8662302 8347064 8011264
59092 8011264 7663315 7310837 6959735 6613788 6275525 5947068 5630168 5326298 5037123
59083 5037123 4764349 4508890 4270786 4049937 3846146 3658409 3485168 3325551 3179495
59074 3179495 3046448 2925010 2814218 2714056 2624117 2542793 2468571 2401310 2341496 2288971
59064 2288971 2243097 2203493 2169833 2141540 2118381 2100735 2088533 2080459 2074847 2070690 2067049 2062134
59052 2062134 2053876 2040963 2022494 1997255 1964532 1925482 1882705 1838414 1793696 1749372 1706670
59041 1706670 1666887 1630990 1599662 1573298 1551845 1534967 1522305 1513351 1507292 1503502 1502264 1504660
59029 1504660 1511581 1522855 1537333 1553837 1572032 1592027 1612942 1632412 1648278 1660383 1669707 1676073
59017 1676073 1678180 1676094 1672126 1668474 1665381 1662623 1661517 1663960 1670173 1678977 1689979 1704006 1721209
59004 1721209 1739976 1758169 1774749 1789799 1803401 1814857 1822904 1826665 1826463 1823570 1819110 1813488 1806956
58991 1806956 1800301 1794657 1790963 1789733 1790880 1793614 1797103 1801483 1807636 1815819 1825332 1835868 1848270
58978 1848270 1863320 1880620 1899424 1919855 1942464 1967235 1993988 2023335 2056248 2092937 2132934
58967 2132934 2176052 2222451 2271870 2323562 2376914 2431608 2487241 2543172 2598502 2651860 2701647
58956 2701647 2747117 2789112 2829535 2870505 2914243 2962886 3017643 3078568 3145742 3220198 3303104
58945 3303104 3394756 3495259 3605664 3727528 3861646 4008058 4167020 4339178 4525160 4725876
58935 4725876 4943042 5178643 5434129 5710889 6011226 6338021 6693700 7080378 7500877
58926 7500877 7958672 8456877 8998005 9584614 10219311 10904035 11639946 12427774 13267157
58917 13267157 14155178 15085871 16050869 17039285 18036121 19020805 19967342 20845791 21624265
58908 21624265 22271296 22758566 23063628 23172383 23080908 22795858 22333106 21715436 20970270
58899 20970270 20127429 19216816 18266517 17301591 16343176 15407877 14508107 13653030 12848822
58890 12848822 12098376 11402116 10759958 10172055 9637356 9152437 8712432 8312492 7947717
58881 7947717 7612608 7301717 7010617 6735752 6474082 6223719 5984329 5756065 5538652
58872 5538652 5332326 5138883 4960429 4797271 4647943 4510971 4385566 4270891 4165992
58863 4165992 4070599 3984993 3908831 3840869 3780057 3726369 3680386 3642503 3612583 3590067 3574392
58852 3574392 3565496 3563804 3569698 3583407 3605430 3636282 3675534 3721965 3775135 3835952 3905167 3982348
58840 3982348 4067148 4160649 4264456 4379344 4505894 4645562 4799756 4968480 5151313 5349371
58830 5349371 5565051 5800174 6055738 6333302 6635356 6964344 7322416 7712156 8136644
58821 8136644 8598860 9101764 9648707 10242899 10886679 11581932 12330384 13132079 13983630
58812 13983630 14878627 15808805 16763054 17725178 18673679 19583354 20426033 21170725 21785884
58803 21785884 22243611 22522662 22609569 22499879 22199522 21724069 21095940 20342054 19492336
58794 19492336 18577210 17624396 16657529 15696746 14758690 13855322 12993809 12178153 11410592
58785 11410592 10691843 10021369 9398066 8820309 8285593 7791082 7334560 6914262 6528054
58776 6528054 6173529 5848476 5550214 5274963 5019091 4780705 4558794 4351250 4155293
58767 4155293 3969775 3795496 3633019 3481482 3339728 3207312 3084182 2970502 2866855
58758 2866855 2773404 2688692 2610494 2538025 2472180 2413548 2361454 2315018 2273765 2236928 2203475
58747 2203475 2173174 2146465 2123037 2101783 2082403 2065722 2051927 2039674 2027456 2014834 2001893
58736 2001893 1988443 1974204 1958895 1941831 1922204 1899970 1875803 1850204 1823449 1796085 1768342
58725 1768342 1739234 1707521 1673451 1638285 1602342 1565083 1527011 1489754 1454094 1419584 1386335
58714 1386335 1355370 1326794 1299428 1272924 1248543 1227060 1207491 1188846 1171717 1157095 1144831
58703 1144831 1134321 1125695 1119294 1114667 1110923 1107552 1104445 1101680 1099440 1097314 1093620 1086504 1075873
58690 1075873 1063110 1048892 1032697 1014588 995876 977585 959774 942915 928380 916866 907716
58679 907716 900415 895343 892403 890432 888825 888410 889857 892488 895405 898555 901895 904868 907543 910963
58665 910963 915508 920218 924638 929991 937390 946059 954375 961600 967573 971822 974220 975717 977453 979858
58651 979858 983326 988721 996337 1005360 1015294 1027037 1041648 1058986 1078429 1100031 1124004 1149909
58639 1149909 1177304 1206627 1238785 1274520 1314676 1360182 1411244 1467478 1529324 1598309 1675505
58628 1675505 1760946 1855062 1959354 2075009 2202289 2342100 2496806 2668566 2858168 3066369
58618 3066369 3294914 3544952 3815362 4103482 4406023 4717916 5031071 5335252 5619145
58609 5619145 5869844 6073018 6215711 6289328 6290065 6218466 6080111 5885680 5648489 5381616
58599 5381616 5097161 4806307 4518331 4239840 3975495 3728626 3500659 3291304 3100330
58590 3100330 2928237 2774631 2637431 2514713 2406172 2311896 2230986 2162228 2104683 2056559
58580 2056559 2014880 1977367 1943354 1911875 1880429 1846917 1811407 1774759 1736950 1698132 1659880
58569 1659880 1623866 1590408 1559625 1532627 1510143 1491240 1474804 1460823 1448679 1435704 1419340
58558 1419340 1399654 1378119 1355180 1330832 1306390 1283542 1262334 1241831 1222036 1203502 1185789
58547 1185789 1167862 1149400 1130434 1110622 1090193 1070523 1052379 1034674 1016390 998443 982108
58536 982108 966916 951913 937734 925435 914376 903270 892371 882611 873481 863833 853988 845016
58524 845016 836582 827444 817510 807564 797608 787252 777151 768326 760669 753674 747821 743620 740321 737350
58510 737350 735925 737250 740139 742565 744660 747931 752379 756794 761275 766972 773735 780361 786951 794779
58496 794779 804008 813622 823520 834659 847165 860133 873115 886073 898062 907699 914722 919510 921547
58483 921547 920083 915860 910335 903560 894595 883645 872037 860527 849284 839036 830387 822432 813805
58470 813805 804672 796072 787919 779407 770718 762520 754419 745788 737446 730559 724560 718110 711449 705799
58456 705799 701168 696806 693128 691026 689878 688421 687049 687156 688825 691242 694683 699846 705939 711790
58442 711790 718261 727220 738659 751138 764471 779590 796251 813223 830153 846853 861365 871283
58430 871283 876516 878443 877105 871759 863505 854528 845212 834668 823570 813696 805163 796881 789317 783938
58416 783938 780415 777266 774906 775056 777499 780462 783915 789439 797014 805093 813742 824537 837220 849436
58402 849436 859794 868306 874010 875341 873028 869598 865909 861029 855307 850390 846274 841641 837157 835119
58388 835119 835667 836572 836977 838091 840027 841363 842158 844075 847114 849457 850850 852974 856194 859249 862377
58373 862377 867386 874346 881611 889311 899187 910681 920938 929193 937448 946258 953690 959252 965083 972310
58359 972310 979722 986874 994896 1003394 1010202 1015269 1021339 1029815 1039254 1048613 1058426 1067917 1074612 1077895
58345 1077895 1079697 1080956 1080753 1079450 1078950 1079303 1078787 1077960 1079681 1084429 1089651 1094444 1100780 1109335 1118380
58330 1118380 1127703 1139328 1153306 1167012 1179687 1193429 1208680 1223045 1235566 1247897 1260416
58319 1260416 1271689 1282603 1296187 1312438 1328255 1343382 1361077 1381679 1401087 1417092 1431669
58308 1431669 1445401 1455485 1461324 1466382 1472215 1476318 1478231 1482056 1490174 1500020 1509809 1521885 1537528
58295 1537528 1553992 1569828 1587791 1609350 1631567 1652509 1674488 1698919 1723319 1746538 1771529
58284 1771529 1799693 1827880 1854347 1882324 1914312 1948144 1981960 2017706 2056459 2095796 2134991
58273 2134991 2177218 2223385 2269534 2313409 2357591 2403113 2446585 2486948 2528335 2572610 2616043
58262 2616043 2657158 2700654 2749469 2800314 2851398 2907018 2969717 3035430 3101375 3171195 3247288
58251 3247288 3325840 3404767 3488631 3580074 3674414 3768474 3866720 3972686 4082627 4193793 4310581
58240 4310581 4436242 4567153 4701697 4845822 5003154 5168936 5340519 5524049 5723707
58231 5723707 5934768 6155010 6392239 6652223 6930195 7222802 7536969 7877835 8240031
58222 8240031 8620773 9029495 9474578 9953445 10466159 11024945 11639112 12305382 13025512
58213 13025512 13818323 14701758 15679988 16762702 17979856 19362747 20930553 22713991
58205 22713991 24773647 27177383 29980744 33247887 37065611 41512595 46641364 52519860
58197 52519860 59270218 67049631 76038255 86490312 98768792 113297956 130534254
58190 130534254 151046671 175582173 204938507 239629835 279342377 322100533 363470805
58183 363470805 396832975 415485550 415694272 398446873 368530892 331884892 293370750
58176 293370750 256088738 221733901 191088146 164349660 141393122 121949060 105649721
58169 105649721 92044498 80682525 71187620 63244991 56569914 50932454 46178775 42190752
58161 42190752 38848080 36051509 33747922 31902211 30471112 29428439 28786573 28567838
58153 28567838 28782356 29458665 30670767 32512908 35061163 38329931 42147261 45981059
58145 45981059 48951966 50186274 49285543 46506443 42525812 38053527 33597705 29440176
58137 29440176 25705572 22429990 19606565 17207102 15187002 13491468 12067801 10870549
58129 10870549 9857979 8993690 8252964 7619601 7075865 6602103 6184468 5814604 5482461
58120 5482461 5177091 4893308 4629864 4382296 4145018 3918938 3709377 3517578 3341026
58111 3341026 3180172 3037435 2911056 2796985 2695243 2607399 2529190 2452608 2374198 2295217
58101 2295217 2215424 2133425 2051717 1974832 1903367 1835445 1772376 1716805 1666825 1617985 1569849
58090 1569849 1524893 1482498 1439943 1398041 1359919 1325296 1291378 1258250 1227971 1199590 1170508
58079 1170508 1141686 1116223 1093736 1071208 1048426 1027686 1009152 991224 974422 960242 947285
58068 947285 933097 918638 906486 896042 885034 874179 865599 858097 848914 838863 830759 823932
58056 823932 815209 804334 793598 783073 770994 758053 746614 736375 725319 714133 705209 698159
58044 698159 690824 683851 679618 677435 674484 670826 668790 668076 666304 664029 664311 667393 670416 672402 674994
58029 674994 678185 679854 679935 680814 683097 684861 685425 686057 686737 685970 684103 683216 683565 683637 683653 685190 687278
58012 687278 686754 682931 678267 674100 669330 663672 658526 653989 648442 641749 635669 630561 624823 618067
57998 618067 611735 606062 599484 591646 584087 577467 570880 564285 558843 554564 550436 547113 546577 548813
57984 548813 551611 553992 557093 561472 566308 571497 577712 584078 588591 591179 593696 596662 598737 599591
57970 599591 600460 601510 601412 599933 598313 596820 594454 591281 588480 585954 582565 578814 576491 575529 573920
57955 573920 570919 567574 564071 559561 554739 551531 549868 547768 544966 543392 543642 544101 544147 545107 547337
57940 547337 549407 550892 552962 555331 555646 552897 548633 543884 537799 530304 523153 516970 509940 500805
57926 500805 490733 481060 471593 462365 454697 449269 445254 442322 441295 441963 442672 443047 444673 448039 451348
57911 451348 453587 456304 460968 466890 473185 480510 489326 498469 506970 515441 524283 532368 538815 544351
57897 544351 549655 554067 557088 559447 561530 562483 561876 560579 558962 556033 551270 545537 539308 531991 523933
57882 523933 517009 512064 507729 502916 498452 495068 491751 487522 483039 479201 475945 473624 473674 476627 481148
57867 481148 486176 492178 499239 506055 512133 518813 526534 533203 537042 539135 541317 543358 544188 544201 544225
57852 544225 543541 540981 536981 532803 528750 524692 521203 518540 515605 511494 507079 503628 500955 498316
57838 498316 495960 494253 492411 489630 486497 483792 480936 477082 472634 468173 462921 455868 447566 439289
57824 439289 431218 422860 414391 406130 397468 387770 377675 368297 359870 352314 346145 341502 337210 332198
57810 332198 327074 323012 319903 316915 313992 311452 308982 306507 305266 306496 309535 312685 315485 318845
57796 318845 323356 328807 335128 342761 352261 364150 378589 394434 409336 421587 431280 439125 445107
57783 445107 449063 451388 452250 451161 448318 445211 442773 440002 435571 429745 423556 417244 410809 404993
57769 404993 400236 395693 390741 386455 384068 382957 381788 380802 381223 383079 385324 387616 390279 392987 395118
57754 395118 397060 399661 402656 405114 407141 409704 413001 416342 419474 422697 425852 428414 430496 432675
57740 432675 435044 437431 440288 444305 449428 455235 461898 469781 478440 487034 495425 504008 512960 522518
57726 522518 533377 545810 559012 572393 586859 603666 622648 642760 663686 685626 708193
57715 708193 731035 755054 781448 809874 839025 868805 900558 935297 973098 1014112 1058890
57704 1058890 1107766 1161154 1220376 1287091 1361977 1445111 1537492 1641058 1757212 1886377 2028990
57693 2028990 2186073 2358903 2548942 2757821 2986528 3234800 3501767 3786300 4085436
57684 4085436 4392747 4698928 4993056 5262168 5491057 5665239 5775221 5817865 5795077 5713248
57674 5713248 5583461 5419831 5236538 5046752 4863269 4697597 4557151 4443290 4350754 4267272
57664 4267272 4174921 4056024 3901103 3712337 3500497 3279680 3063512 2862379 2681504 2521653
57654 2521653 2382133 2262640 2162573 2080217 2013385 1960174 1918871 1888106 1867431 1856899 1855863
57643 1855863 1863098 1878323 1902601 1936958 1981470 2036029 2101166 2177791 2266819 2369339 2486598
57632 2486598 2619654 2769428 2936893 3122556 3325988 3546355 3782724 4032605 4290442
57623 4290442 4548461 4798368 5030722 5233191 5391826 5495194 5536886 5514826 5430544 5289946
57613 5289946 5103045 4881351 4635660 4376059 4112158 3851820 3600117 3360160 3134402
57604 3134402 2924621 2731338 2554020 2391732 2243548 2108841 1987353 1878505 1780709 1692008
57594 1692008 1611347 1538470 1472747 1413029 1358623 1309324 1264406 1222719 1183923 1148566 1116658
57583 1116658 1087379 1060516 1036917 1016885 999145 982145 965635 950321 936725 925029 915386
57572 915386 907693 901492 896557 893216 891759 892043 893946 897672 903305 910547 919185 929248 940478 952282
57558 952282 964536 977957 993333 1010833 1030278 1051643 1075081 1100940 1129985 1163235 1201413
57547 1201413 1244860 1293909 1348865 1409708 1476470 1549943 1631443 1721935 1821983 1932554 2055146
57536 2055146 2191020 2340801 2504665 2682211 2872126 3072566 3281547 3495980 3710110
57527 3710110 3915537 4102612 4261299 4381507 4454619 4475849 4445006 4365341 4242620 4085046
57517 4085046 3902469 3704627 3500044 3295897 3097562 2908183 2729719 2564420 2414238
57508 2414238 2279012 2156823 2046462 1948209 1861927 1785987 1718778 1659982 1609573 1566706 1530434
57497 1530434 1500585 1477061 1459117 1446006 1437587 1433685 1433704 1437543 1446090 1460188 1479886 1505295 1537297
57484 1537297 1576624 1623013 1676136 1736815 1806593 1886618 1977532 2079872 2193985 2320070 2458822
57473 2458822 2611347 2777846 2956859 3146161 3343402 3544972 3744676 3934127 4103905
57464 4103905 4243944 4344006 4395643 4394484 4340802 4238542 4094350 3916965 3716323 3502438
57454 3502438 3284363 3069194 2861528 2664177 2479459 2309292 2154181 2013173 1885273
57445 1885273 1770130 1667087 1574572 1491044 1415775 1348165 1287111 1231704 1181790 1137094 1096401
57434 1096401 1058393 1022832 990321 961348 936019 914171 895145 877880 861718 846716 832900
57423 832900 819824 807269 795655 785295 775909 767277 759653 752983 746446 739352 731892 724515 717344
57410 717344 710701 705402 701818 699377 697615 696974 697877 699771 701839 703944 706129 707972 709283 710798 713325
57395 713325 716794 720836 725590 731080 736558 741456 746324 751846 757555 762608 767218 772189 777458 782325
57381 782325 786777 791430 796326 800924 805148 809468 813983 818317 822317 825987 828921 830768 832186 834447
57367 834447 837988 842154 846369 850789 855738 861202 867024 873070 879171 885306 891808 898927 906358 913596
57353 913596 920584 927559 934577 941635 948932 956485 963902 971118 978869 987748 997209 1006357 1015360 1025133
57339 1025133 1035866 1046874 1057882 1069484 1082073 1095064 1107452 1118721 1129046 1138931 1148777 1158623
57327 1158623 1168413 1178546 1189722 1202054 1214954 1228322 1243060 1259693 1277129 1293731 1309199
57316 1309199 1324505 1340310 1356451 1372823 1389749 1407441 1425905 1445389 1466208 1488109 1510520
57305 1510520 1533415 1557338 1582533 1608655 1635398 1662931 1691732 1722345 1755147 1790007 1826382
57294 1826382 1864143 1903914 1946152 1990405 2036121 2083741 2134172 2187431 2242581 2298757 2355535
57283 2355535 2412454 2468887 2524312 2578201 2629899 2678970 2725157 2767371 2803350 2831235 2851051
57272 2851051 2863855 2870066 2869760 2864100 2855087 2844031 2831395 2817992 2805050 2793082 2781951 2772203
57260 2772203 2765231 2761799 2761386 2763169 2766720 2771589 2777217 2783702 2791821 2801946 2813618 2826386 2840369
57247 2840369 2855802 2872780 2891683 2913151 2937335 2963747 2991931 3021625 3052171 3082534 3112142
57236 3112142 3141146 3169754 3197912 3225699 3253338 3280853 3308394 3336855 3367253 3399421 3432268
57225 3432268 3465519 3500218 3537204 3575977 3615551 3655552 3695851 3735812 3774633 3812180 3849029
57214 3849029 3885883 3923175 3960996 3999282 4038309 4078971 4122133 4167709 4214723 4262189 4309477
57203 4309477 4356048 4401562 4446264 4490652 4534800 4578616 4622576 4667355 4712796 4758132 4803317
57192 4803317 4849181 4896009 4942826 4988490 5032874 5076617 5120206 5163599 5206307 5247732 5287702
57181 5287702 5326592 5364547 5400938 5435302 5468339 5501009 5532946 5563026 5591415 5619645 5648452
57170 5648452 5676850 5703781 5729463 5754549 5779076 5802939 5826501 5850068 5873488 5896804 5920476
57159 5920476 5944400 5967526 5989015 6009051 6027898 6044993 6059628 6071851 6082042 6090275 6096817 6102559
57147 6102559 6108166 6113260 6117044 6119222 6119667 6117819 6113188 6106035 6096776 6085083 6070253 6052200 6031377
57134 6031377 6007863 5981071 5950162 5914361 5873246 5827369 5778543 5729195 5681693 5638556 5602828
57123 5602828 5577433 5564030 5562547 5571387 5587695 5607763 5627817 5644690 5656124 5661310 5661697 5660909 5663286
57110 5663286 5672483 5691482 5723290 5771046 5837822 5927175 6044205 6196017 6391371 6640253 6953668
57099 6953668 7343410 7821683 8400826 9093431 9913128 10875879 12000846 13309586 14823212
57090 14823212 16558720 18526328 20728453 23158449 25796159 28601260 31510823 34445428
57082 34445428 37317393 40029778 42467676 44499428 45999652 46880805 47108359 46692946
57074 46692946 45676172 44124826 42129068 39793516 37222177 34507488 31728427 28953716
57066 28953716 26244853 23656664 21234663 19010656 17000631 15207358 13625075 12242264
57058 12242264 11042679 10006963 9114808 8346051 7681097 7102032 6593831 6144272 5743230
57049 5743230 5382555 5055994 4758345 4484821 4231543 3995899 3775781 3569045 3374207
57040 3374207 3190817 3018352 2855418 2700724 2553912 2414512 2280907 2151431 2025809
57031 2025809 1904452 1786967 1672577 1561540 1454912 1353268 1256750 1166106 1082460 1006133
57021 1006133 936588 873458 816756 766288 721676 682847 649716 621574 597447 576825 559433
57010 559433 544776 532745 524225 520222 520647 524752 532461 544520 561835 585539 617401 659423 713476
56997 713476 782075 868972 978400 1114363 1280164 1474447 1682818 1873437 2006132 2051614
56987 2051614 2005567 1887284 1727087 1553454 1385965 1234056 1099568 980635 874403 778004
56977 778004 689265 607659 534149 469717 414456 368112 330716 302247 282216 269819 263962 262946
56965 262946 264777 268225 273302 280613 290576 303250 318461 336104 356642 380780 407626 433122
56953 433122 451384 458256 453463 439662 420309 398522 376732 356390 337979 321583 307308 295237
56941 295237 285410 277999 273252 271304 272284 276500 284189 295363 310311 329929 354894 384541 416649
56928 416649 447709 472829 486405 484684 468220 441291 408908 374816 341584 310944 283522 259115
56916 259115 237684 219567 204675 192210 181379 171774 163003 154589 146419 138768 131913 126118 121754
56903 121754 118739 116129 113109 110265 108983 109649 111338 113236 115454 118485 122901 129695 139907 153644
56889 153644 170339 190111 213986 242478 274667 308639 341805 370665 391596 402756 404827 399807
56877 399807 389850 377367 364981 354458 346098 339598 335121 333331 334971 340617 350383 363805 380702
56864 380702 402204 430288 466252 510398 562971 623986 691232 758813 818007 859665 877080
56853 877080 868742 839276 796887 749128 700982 655926 616799 585092 560856 544123 535549 535275
56841 535275 542479 556829 579410 611592 654138 708189 775993 859315 957281 1065641 1176322
56830 1176322 1276459 1349805 1382690 1370743 1320301 1243814 1154099 1061369 972810 892860 823441
56819 823441 764411 714551 673020 640276 617546 605488 603763 611806 629429 656767 694452 743858
56807 743858 805989 879047 956897 1029626 1085386 1113217 1107101 1069218 1008839 937075 862337 789791
56795 789791 722805 663449 612365 569346 533964 505458 482976 466529 456958 454470 458157 467540
56783 467540 483572 507211 537856 573798 612884 651310 682590 699591 698161 678674 644898 602243
56771 602243 556225 510910 468256 429096 394211 363954 337645 314432 294345 277668 263760
56760 263760 251486 240472 231029 223090 216172 210178 205401 201824 199095 197004 195331 193510 191114 188462
56746 188462 186093 183954 181700 179451 177508 175646 173462 171179 169414 168317 167534 166736 165674 164075 162105
56731 162105 160585 160045 159910 159177 157545 155326 152824 150527 149356 149767 150953 151826 152398 153320 154362 154333
56715 154333 152361 148472 143144 137134 131512 126940 123036 119215 115929 114167 113967 114353 114674 115040 115512
56700 115512 115861 116207 116983 118071 118817 119090 119615 120929 122606 123845 124360 124496 124782 125554 126799 128295 129910
56683 129910 131572 132905 133465 133592 134398 136344 138431 139484 139755 140484 142299 144851 147656 150329 152174
56668 152174 152482 151349 149542 147631 145756 144000 142329 140396 138086 135999 134686 133722 132360 130898 130378
56653 130378 130930 131342 130513 128671 126905 125962 125664 125203 123974 122293 121089 120701 120396 119426 118055 117077 116752
56636 116752 116772 116829 116726 116401 116316 117146 118616 119414 118941 118253 118435 118994 118940 118565 118785 119418 119639 119593 120070 120944
56616 120944 121435 121728 122800 124745 126748 128663 131136 134119 136667 138411 139898 141315 142190 142533 142994
56601 142994 143616 143655 142915 142046 141266 140054 138449 137425 137509 138126 138742 139550 140606 141344 141528 141794 142699 144051
56583 144051 145518 147130 148827 150399 152112 154514 157322 159460 160593 161748 163995 167306 171089 175008
56569 175008 178935 182803 186848 191386 196262 201246 206887 213942 221881 229172 235284 241296 248128 255301
56555 255301 261900 267682 272737 277057 280937 284886 288638 291171 292191 292653 293322 293762 293212 291584 289052
56540 289052 285566 281358 277041 272678 267654 261992 256863 253111 250108 246698 242551 237979 233198 228453
56526 228453 224160 220341 216469 212319 208271 204402 200155 195387 190901 187352 184458 181833 179754 178482
56512 178482 177651 177017 177003 177782 178534 178394 177495 176404 175212 173863 172755 172199 171805 171087 170234 169709 169563 169697
56494 169697 170280 171389 172618 173512 173996 174128 173977 173965 174618 175728 176528 176918 177609 178803 179856 180667 182206
56477 182206 184983 188183 191135 194477 198776 202950 205399 206167 206825 208550 211251 214234 216886 218940 220749
56462 220749 223053 226037 229074 231798 234757 238397 242126 245117 247399 249418 251113 252248 253099 253989 254629
56447 254629 254756 255064 256615 259482 262691 265404 267682 270162 273255 276472 278531 278605 277426 276415 275715
56432 275715 274118 271130 267779 264837 261569 257174 252343 248257 244845 241185 236990 232606 228098 223327
56418 223327 218613 214427 210754 207445 204768 202960 201781 201108 201349 202535 203668 203820 203302 202913 202621 201946
56402 201946 201157 201057 201813 202834 203655 204292 204916 205731 206978 208655 210525 212617 215228 218202 220891 223120
56386 223120 225388 227759 229492 230262 230776 231604 232371 232804 233635 235573 238224 240827 243270 245632 247573 249011
56370 249011 250625 252856 255199 257219 259401 262157 264879 266874 268448 270157 271762 272763 273225 273304 272783
56355 272783 271798 271154 271218 271519 272069 273815 276897 279830 281550 282951 285180 287677 289348 290471 291973 293900
56339 293900 296167 299825 305831 313333 320736 327822 335458 343993 353320 363679 374909 385743 395315
56326 395315 404534 414522 424715 434108 443291 453296 463342 471739 478383 484330 489436 492471 493179 492321
56312 492321 490042 486107 481444 477469 474029 469845 464798 460093 456307 453039 450270 448355 446832 444993
56298 444993 443567 444120 446880 450713 455081 460411 466710 473514 481061 489918 499591 509090 518703 529643
56284 529643 542150 555575 570025 586223 603978 622556 642367 664558 689183 715534 743993
56273 743993 775718 810748 848343 889007 934175 984135 1038355 1097777 1164578 1239593 1322162
56262 1322162 1412652 1512921 1623885 1744788 1875292 2016260 2167830 2328530 2496771 2671483
56252 2671483 2850652 3030839 3208617 3381043 3544495 3694674 3828128 3942377 4034653 4102360
56242 4102360 4145075 4164528 4162676 4141529 4104600 4056238 3999209 3934858 3865633 3794975 3724270
56231 3724270 3652163 3577452 3500426 3420785 3336604 3246541 3151161 3051146 2945954 2835225 2719965
56220 2719965 2601493 2480695 2358925 2238108 2119265 2002459 1888666 1780087 1678007
56211 1678007 1581969 1491622 1407775 1331043 1260999 1197248 1139836 1088167 1041084 998460 961138
56200 961138 928939 900307 874203 850701 829473 809524 790802 774317 760359 748244 737950
56189 737950 730060 724032 718712 714759 714219 717240 721499 725443 729827 735497 741975 749081 757715 768095
56175 768095 779103 790108 801514 812978 823069 831190 837808 842466 843891 842513 840417 838285 834887
56162 834887 830128 825869 822996 820371 817574 815967 816122 816940 818391 822399 829818 839225 849942 863454
56148 863454 880452 899264 918878 941023 967674 998951 1035013 1077610 1128083 1186110 1252126
56137 1252126 1328849 1418961 1523172 1641620 1774545 1919950 2072627 2226626 2376579 2516159
56127 2516159 2638901 2742744 2831572 2910835 2983850 3052802 3119178 3180694 3230569 3262470 3274528
56116 3274528 3267747 3243880 3206677 3161717 3111939 3055119 2987284 2906015 2809279 2695029 2564944
56105 2564944 2425937 2285470 2147707 2015873 1894662 1787228 1692430 1607878 1533317 1468743
56095 1468743 1412032 1361177 1316452 1277969 1243791 1212837 1186766 1166392 1149094 1132440 1117492
56084 1117492 1105835 1096344 1087790 1081618 1078991 1077836 1075986 1074634 1075675 1078300 1081185 1085246 1091207 1097331
56070 1097331 1102604 1109285 1119096 1129884 1139243 1148353 1158915 1169507 1178664 1188485 1201374 1216063 1230515
56057 1230515 1245772 1263167 1280775 1296581 1312244 1329860 1348013 1365016 1382826 1403557 1425253
56046 1425253 1445487 1465990 1489237 1513550 1536332 1559231 1585335 1614030 1643285 1674186 1708466
56035 1708466 1744350 1779652 1816241 1856751 1899719 1942566 1986369 2033012 2080849 2127932 2176152
56024 2176152 2227307 2278735 2327976 2377873 2431652 2486916 2540237 2593677 2650790 2710270 2769838
56013 2769838 2832250 2900844 2973216 3046097 3122328 3205982 3294795 3384688 3477431 3576374 3679203
56002 3679203 3782994 3891786 4010650 4136820 4265545 4400108 4546749 4704243 4868288
55993 4868288 5041715 5230059 5431247 5640154 5859324 6094600 6344457 6604679 6879209
55984 6879209 7175013 7490847 7822886 8176669 8561315 8977265 9422810 9907075 10442487
55975 10442487 11030326 11668810 12369717 13151348 14021793 14986855 16068505 17297399 18694510
55966 18694510 20281372 22103233 24221975 26693715 29575824 32946354 36888669 41464117
55958 41464117 46730120 52782319 59756672 67811168 77152628 88079892 100966045 116218716
55950 116218716 134322784 155926783 181812084 212666338 248645380 288642852 329410968
55943 329410968 365318851 389694936 397550814 387927571 364063877 331397562 295129285
55936 295129285 258927733 224913552 194137043 166984122 143452635 123346300 106360774
55929 106360774 92104128 80149371 70111316 61667472 54531237 48452110 43241258
55922 43241258 38762100 34893290 31522937 28570077 25980619 23700776 21675328 19867475
55914 19867475 18256534 16816538 15516210 14337325 13273592 12312515 11435621 10634436
55906 10634436 9909089 9252232 8649934 8096943 7595721 7141467 6722476 6334370 5980077
55897 5980077 5656439 5354016 5069593 4806449 4562844 4332251 4114382 3914204 3730357
55888 3730357 3555763 3389482 3237017 3098882 2969297 2846226 2732682 2627985 2527447
55879 2527447 2430936 2342523 2261534 2182961 2106699 2037442 1975365 1915671 1857511 1804686 1757249
55868 1757249 1710974 1665552 1624898 1588720 1552006 1513691 1477864 1445487 1412809 1379220 1349060
55857 1349060 1324163 1301741 1281141 1265858 1257259 1252835 1252189 1258321 1271129 1285241 1295800 1301158
55845 1301158 1299208 1287051 1265738 1240004 1212085 1180707 1146666 1113689 1082786 1051237 1018308
55834 1018308 986669 957120 927213 896362 867266 841002 815624 790830 769209 751594 735697
55823 735697 720376 706739 694211 680200 664631 650234 637546 624347 610791 600034 592705 585801
55811 585801 578383 573336 571883 571245 569625 568813 569823 570358 568878 567095 566219 564450 560364 555322 550460
55796 550460 544528 536555 527593 518108 506695 492950 478731 465278 451970 438951 427799 418504
55784 418504 409084 399283 391328 385864 380653 374635 369862 367900 367574 367749 368973 370658 369772 364320 355578
55769 355578 345479 334444 323070 313073 305013 297627 290603 285488 282858 281319 280161 280042 280109 277738
55755 277738 272404 266714 262272 257560 251200 244194 237483 230342 222775 216583 212521 209136 205736 203509
55741 203509 202403 200137 195969 192284 190710 189742 188055 186999 187667 188557 188461 188872 191099 193525 194113 193255
55725 193255 191857 188999 183913 178178 173526 169383 164789 160826 158919 158466 158279 158625 159897 161000 161123
55710 161123 161475 163329 165988 168509 171794 177080 183997 191833 201021 211475 221144 228146 232954 236826
55696 236826 239686 241233 242432 244033 245012 244204 242028 239143 235011 229422 223689 218713 213577 207774 202952
55681 202952 200597 199745 198968 198876 200523 202976 204649 205719 206988 207661 206468 203932 201511 199411 197061
55666 197061 194760 193048 191465 189536 188001 187502 187285 186732 186784 188142 189471 189288 188308 187984 187981 187107 185600
55649 185600 184396 183136 180851 177625 173675 167939 159726 150801 143626 138193 132715 126727 121365 117047
55635 117047 113029 109070 105671 102812 100008 97412 95460 93821 92003 90408 89489 88533 86733 84734 83608
55620 83608 82977 81710 79842 78212 76790 75060 73580 73456 74463 75127 74532 72870 70583 68165 66435
55605 66435 65812 65608 64979 64089 63458 62856 61840 60696 59903 59425 59404 60474 62407 63596 63100 62113 62181 63145
55587 63145 64111 65119 66277 66564 65332 63951 64124 65487 66624 67456 68681 69792 69800 69309 69789 71258 72608
55570 72608 73815 75847 78721 81580 84508 88511 93834 99848 106363 113406 119910 124222 125826 125339 123201
55555 123201 119742 115930 112441 108462 102973 96745 91431 87253 83355 79915 77904 76978 75642 73572
55541 73572 72043 71979 73086 74849 76854 78266 78543 78511 79287 80409 80621 80175 80493 81772 82762 82878 82713
55524 82713 82428 81459 79977 78869 78034 76375 73675 70892 68383 65484 62091 59024 56521 53885 50969
55509 50969 48441 46297 43601 40126 36757 33926 31085 28113 25743 24124 22418 20419 19202 19465 20388
55494 20388 20747 20134 18602 16208 13463 11268 9947 9122 8733 9135 9978 10204 9594 9247 10016 11370 12265
55477 12265 12309 11745 11084 11080 12250 14038 15167 14990 13865 12272 10446 8904 8327 8661 9161 9403 9509 9530
55459 9530 9522 10171 12154 14801 16441 16266 14986 13576 12366 11431 10844 10348 9597 8809 8448 8366 8098 7754
55441 7754 7679 7562 7030 6799 7891 9842 11114 11193 10938 10849 10566 10220 10713 12238 13770 14431 14250 13451 12206
55422 12206 11285 11646 13058 14315 14962 15595 16393 16757 16664 16890 17573 17944 17874 18246 19375 20440 21039 21932
55404 21932 23612 25413 26660 27556 28389 28989 29412 29994 30302 29346 27363 26018 26194 26862 26798 26155 25576 25003
55386 25003 24196 23341 22369 20744 18675 17458 17830 18996 20012 21041 22433 23668 24139 24162 24325 24598 24738
55369 24738 24759 24452 23365 21836 20970 20963 20520 18692 16202 14236 13014 12358 12470 13160 13415 12807 12349 12892
55351 12892 13638 13405 12459 11805 11464 10767 9860 9601 10261 11326 12279 12726 12133 10377 8260 6800 6260 6364
55333 6364 6908 7575 7794 7497 7362 7750 8088 7954 7908 8469 9159 9413 9566 9964 9991 9173 8453 9028 10500 11498
55313 11498 11652 11624 11571 11065 10408 10633 12026 13738 14955 15490 15161 13710 11640 10244 10346 11546 12907
55296 12907 13908 14545 14977 15301 15480 15425 15243 15212 15314 15136 14471 13680 13158 12883 12851 13415 14696 16097 16959
55277 16959 17294 17395 17194 16687 16495 17263 18720 20007 20729 21114 21359 21434 21349 21089 20504 19707 19285 19576 20090
55258 20090 20143 19778 19455 19178 18594 17768 17213 17232 17677 18257 18704 18851 18892 19304 20153 20798 20708 20225 20099 20604
55238 20604 21501 22433 22931 22467 21129 19861 19491 19848 20303 20741 21341 21853 21866 21581 21628 22226 23094 24058 25237
55219 25237 26689 28279 29753 30735 30953 30794 31127 32219 33335 33860 34203 34949 35715 35682 34842 33880 33065 32106
55201 32106 30921 29792 28823 27979 27566 28002 29088 30132 30786 31258 31717 31989 31921 31657 31565 32106 33613 35893
55183 35893 38237 40055 41318 42136 42351 41922 41323 41035 40875 40179 38409 35347 31109 26371 22153 19006
55167 19006 16701 14971 13972 13694 13585 13251 12936 12820 12529 11939 11679 12092 12416 11929 11284 11638 12934 14133
55149 14133 14805 15418 16228 16967 17620 18563 19829 20958 21586 21604 20917 19716 18784 18765 19290 19527 19431 19711 20809
55130 20809 22698 25417 28871 32230 34536 35962 37567 39716 41591 42412 42347 41990 41584 41000 39950 38159
55114 38159 35735 33364 31642 30383 29161 28256 28258 28919 29331 29258 29399 30186 31254 32302 33661 35541 37407
55097 37407 38496 38617 38178 37824 38124 39181 40460 41384 42105 43173 44539 45527 45803 45707 45542 45255 44989 45247
55079 45247 46170 47257 48133 49077 50383 51702 52485 52792 53169 53912 54813 55625 56475 57687 59327 61024 62304
55062 62304 63017 63341 63469 63536 63739 64104 64128 63216 61618 60323 59731 59137 57925 56579 55841 55557 55129 54607
55044 54607 54404 54299 53670 52545 51559 51034 50920 51488 53120 55345 56864 56784 55357 53515 52184 51933 52672
55027 52672 53695 54453 55083 55779 56110 55689 55079 55145 55739 55988 55664 55235 54717 53592 52020 51018 51168 51991
55009 51991 52844 53584 54095 54016 53316 52484 51790 50978 49953 49176 49046 49373 49751 50043 50394 51085 52370 54078
54991 54078 55507 56212 56635 57346 58001 57964 57701 58353 59901 61002 60980 60861 61863 63727 65147 65303 64452 63537
54973 63537 63592 65013 67102 68690 69427 70006 71144 72989 75598 79103 83156 86953 90266 93846 98453
54958 98453 103975 109795 115485 120961 126481 132695 140147 148597 157358 166303 175801 185588 194494 201431
54944 201431 205796 206846 203776 196975 188186 178802 168629 156935 144052 131351 120138 111075 104155
54931 104155 98727 93886 89274 85140 81558 78171 74883 72136 70192 68829 68078 68491 70263 72734 75185
54916 75185 77537 79927 82351 85069 88697 93470 99158 106005 114855 125731 137232 148031 158199
54903 158199 168215 177364 184006 187052 186430 182584 176233 168257 159207 149237 138896 129325 121108 113595
54889 113595 106091 99053 93287 88533 83813 78755 73715 69011 64927 62144 61128 61306 61666 61968 62495
54874 62495 62921 62518 61518 61143 62023 63353 63922 63366 62127 60705 59313 57918 56390 54734 53224 52103
54858 52103 51255 50393 49466 48608 47905 47484 47612 48359 49397 50428 51505 52508 52713 51491 49285 47292 46225
54841 46225 45860 45659 45313 44727 44016 43569 43711 44264 44737 44931 45099 45624 46786 48663 50891 52693 53540 53636
54823 53636 53454 53043 52272 51514 51487 52452 54097 56151 58577 61092 63060 64182 65016 66533 69198 72564
54807 72564 75753 78362 80936 84408 89106 94563 100321 106517 113470 121216 129784 139542 150708 162723
54793 162723 174561 185550 195500 204167 210970 215133 215869 212743 206271 197994 189492 181362 173396 165422
54779 165422 157568 150011 143118 137683 134323 132638 131491 130244 129228 128934 129250 129776 130500 131801 133955
54764 133955 136864 140226 143790 147506 151602 156647 163513 173029 185377 199828 215317 231272 247735
54751 247735 264705 281733 298061 312694 324214 331081 332488 328670 320278 307907 292452 275373
54739 275373 258107 241408 225463 210269 195635 181296 167455 154922 144357 135749 128871 123708
54727 123708 120002 116954 113956 111268 109376 108069 106738 105247 103830 102472 101064 99902 99287 98797 97737
54712 97737 96172 94783 93795 92838 91880 91464 91804 92342 92501 92333 92151 92054 92137 92729 94024 95662 96992 97655
54694 97655 97772 97721 97807 98037 98123 97836 97362 97180 97607 98516 99466 100062 100337 100844 102146 104124 106050 107467 108697
54675 108697 110341 112642 115613 119294 123494 127638 131348 134875 138532 142037 144993 147718 151027 155318
54661 155318 160404 166029 171988 177881 183415 188857 194652 200644 206315 211713 217483 223889 230501 237067
54647 237067 244127 252432 262180 273158 285322 298852 313698 329238 344286 357345 366950 371938
54635 371938 371621 366017 355967 342669 326867 308775 289038 269284 251232 235468 221529 208963
54623 208963 197782 188027 179529 172135 165795 160438 156097 153024 151299 150468 149989 149921 150649 152073 153598
54608 153598 154906 156175 157465 158434 158810 158747 158520 158125 157293 155699 153206 150111 147026 144254 141449 138156
54592 138156 134470 130733 126833 122379 117476 112729 108452 104424 100536 97148 94593 92659 90824 88847
54578 88847 86983 85697 85088 84538 83152 80745 78113 76084 74659 73453 72526 72194 72317 72467 72670 73318
54562 73318 74396 75416 76156 76897 77898 79161 80700 82478 84043 84851 85069 85564 86854 88565 90067 91275
54546 91275 92556 94161 95939 97531 98835 100367 102985 107061 112187 117952 124614 132546 141351 150189
54532 150189 158652 166663 173762 179292 183222 185932 187217 186333 183192 178672 173473 167447 160419 153068
54518 153068 146411 140778 135645 130270 124288 117904 111707 106160 101266 96907 93303 90732 88957 87429
54504 87429 85975 84805 83904 83003 82135 81649 81617 81711 81714 81667 81560 81391 81458 82007 82682 82998 83303 84509 86789 89256
54484 89256 91085 92273 93160 93967 95038 96856 99435 102186 104549 106349 107522 108132 108708 109801 111098
54469 111098 111701 111459 111199 111414 111624 111401 111129 111182 111178 110646 109812 109055 108184 106904 105514 104450 103514 102246
54451 102246 100783 99717 99237 98931 98363 97446 96319 95130 93888 92456 90873 89646 89310 89593 89509 88511
54435 88511 87084 86060 85800 86270 87294 88410 89006 89008 88982 89229 89300 88844 88409 88833 90153 91678 92924 94009
54417 94009 95264 96822 98547 100133 101376 102401 103421 104361 105107 106093 108040 110944 113963 116540 119053
54402 119053 122021 125304 128469 131473 134446 137236 139704 142180 145192 148882 152885 156575 159287 160614
54388 160614 160645 159701 157895 155420 153064 151636 150794 149305 146641 143446 140179 136367 131710 126915 122696
54373 122696 118808 114886 111485 109320 108055 106739 105059 103343 101719 100109 98720 97800 97163 96619 96536
54358 96536 97254 98222 98451 97635 96306 95175 94842 95719 97605 99687 101590 103948 107309 111063 114318 117283
54342 117283 120671 124154 126733 128515 130868 134625 139148 143382 146849 149323 150469 150330 149525 148544 147277
54327 147277 145473 143108 140089 136131 131285 126166 121363 116895 112478 108051 103851 100193 97235 94759
54313 94759 92244 89372 86413 83805 81519 79174 76654 74181 71977 70294 69543 69739 69943 69000 66906
54298 66906 64831 63647 63110 62633 62098 61545 60696 59408 58214 57802 58114 58474 58558 58819 59828 61494 63091
54281 63091 63894 63655 62622 61346 60485 60448 61030 61608 61963 62688 64329 66354 67619 67884 68099 68979 70088
54264 70088 70784 71323 72306 73581 74478 74807 74810 74387 73280 71985 71577 72388 73526 73987 73720 73286 72904 72292
54246 72292 71249 70059 69301 69354 70134 71270 72453 73450 73890 73406 72112 70613 69376 68430 67863 68087 69205
54229 69205 70488 70935 70172 68561 66797 65725 66018 67428 68654 68614 67670 67087 67499 68451 69204 69346 68727
54212 68727 67526 66428 66202 66949 68115 69180 69961 70315 70053 69189 68006 66874 66237 66532 67734 69099
54196 69099 69688 69114 67646 65872 64490 64010 64194 64133 63291 62136 61385 61071 60905 61041 61761 62737 63353 63558
54178 63558 63752 64007 64022 63670 63030 62150 61258 60791 60668 60064 58675 57588 57894 58948 59222 58531 58081 58444
54160 58444 58870 58797 58724 59196 60000 60802 61652 62455 62827 62854 63252 64369 65676 66478 66461 65472 63658 62043 61962
54141 61962 63516 65343 66289 66458 66347 65965 65410 65348 66094 66835 66579 65414 64165 63202 62236 61042 59818
54124 59818 58953 58738 59130 59623 59650 59218 58767 58417 57939 57535 57847 58927 59893 59971 59272 58222 56941 55597
54106 55597 54640 54224 53993 53872 54390 55710 57056 57685 57815 57910 57705 56747 55413 54441 53782 52813 51582 51008
54088 51008 51759 53498 55322 56527 56871 56495 55715 54786 53873 53205 52913 52654 51802 50283 48857 48295 48580
54071 48580 49134 49455 49288 48634 48002 48237 49692 51808 53721 54970 55418 55052 54283 53989 54749 56306 58097
54054 58097 59894 61591 62823 63313 63258 62964 62441 61807 61669 62593 64474 66863 69568 72453 75047 76954
54038 76954 78436 80105 82249 84909 88263 92334 96521 100004 102634 105032 107938 111789 116701 122400
54024 122400 128308 134046 139728 145491 151047 156036 160510 164643 168244 171014 173094 174958 176953 179270
54010 179270 181972 184645 186345 186469 185438 184052 182455 180264 177431 174367 171364 168437 165613 162830
53996 162830 159743 156193 152712 149959 147726 145161 141996 138960 136795 135289 133520 130838 127507 124488
53982 124488 122533 121409 120215 118551 116989 116193 116051 116074 116141 116302 116271 115790 115190 114938 114922 114871 115189 116486
53964 116486 118415 119857 120318 120380 120693 121304 122149 123418 125082 126650 127738 128495 129193 129899 130743 132036 133779
53947 133779 135466 136707 137824 139513 142074 145191 148347 151333 154437 158219 162933 168179 173142 177047
53933 177047 179298 179591 178279 176352 174530 172559 169886 166799 164188 162341 160782 159415 158977 160052 162326
53918 162326 165176 168380 171805 175030 177929 181222 185767 191431 197228 202509 207555 213035 219250 225975
53904 225975 232720 239064 244875 250225 254991 258643 260653 261106 260750 260373 260222 260024 259467 258526 257302 255579
53888 255579 252800 248678 243767 239119 235261 231687 227480 222187 215963 209090 201777 194437 187791 182376
53874 182376 178013 173947 169543 164779 160053 155743 152038 149020 146634 144557 142355 139848 137234 134782
53860 134782 132554 130421 128195 125653 122630 119208 115753 112697 110330 108768 107879 107235 106314 104844 102896
53845 102896 100707 98575 96829 95536 94333 92876 91432 90556 90198 89708 88861 88257 88427 89088 89696 90173
53829 90173 90584 90603 90016 89400 89565 90477 91368 91905 92602 93960 95723 97154 97745 97579 97233 97392 98298 99539
53811 99539 100503 100974 101159 101338 101716 102440 103490 104739 106346 108751 111940 115071 117390 119305 121909 125523
53795 125523 129339 132592 135510 138895 143230 148358 153723 158715 163009 166683 169905 172518 174244 175253
53781 175253 176194 177556 179270 180956 182306 183152 183455 183386 183289 183393 183597 183574 183021 181942 180690 179630 178647
53764 178647 177191 174878 171846 168439 164843 161256 158084 155599 153609 151745 149877 148024 146158 144417
53750 144417 143150 142348 141315 139430 137024 135041 133973 133566 133441 133513 133854 134551 135612 136752 137470 137643
53734 137643 137707 137873 137566 136236 134371 133047 132709 133046 133729 134452 134494 133238 131235 129889 129917 130810 131870
53717 131870 132931 133881 134286 133953 133270 132646 132139 131892 132373 133781 135659 137425 138955 140444 142092 144151
53701 144151 146823 149844 152508 154371 155628 156729 158057 160053 163149 167288 171920 176694 181681 186737
53687 186737 191140 194286 196404 198250 200384 203036 206318 210172 214269 218247 221970 225425 228500 230972
53673 230972 232628 233373 233403 233183 233025 232791 232316 231910 231970 232241 232024 231125 229959 228681 226886 224391 221736
53656 221736 219594 218082 216840 215444 213609 211389 209255 207560 205958 203927 201862 200911 201576 203112 204540
53641 204540 205496 205828 205207 203716 202247 201666 201913 202286 202271 201782 201073 200691 201086 201903 202232 201905 201970 203401
53623 203401 205893 208492 210938 213725 217143 220871 224376 227321 229725 232085 235072 238811 242745 246441
53609 246441 250072 253854 257629 261455 265979 271534 277305 282124 285872 289454 293581 298227 303131 308235
53595 308235 313595 319302 325416 331672 337488 342607 347436 352350 356977 360761 363939 367385 371603 376411
53581 376411 381431 386309 390551 393728 395927 397601 399026 400294 401708 403634 405944 408042 409536 410540
53567 410540 411345 412126 412991 413980 414910 415424 415309 414745 414330 414749 416055 417297 417417 416646 416328 417030 417622 416890
53549 416890 415308 414295 414263 414472 414533 414865 415626 416331 416758 417370 418481 419797 421144 422881 425165 427448 429203
53532 429203 430690 432554 435054 438129 441815 446114 450688 455212 459919 465387 471845 479014 486623 494802
53518 494802 503896 514013 524768 535463 545620 555531 566256 578930 593990 610969 628991 647470
53506 647470 666360 685768 705439 724956 744529 765226 787972 812459 837504 862517 888185
53495 888185 915516 944612 974652 1004861 1035122 1065661 1096494 1127319 1157792 1187690 1216839
53484 1216839 1245030 1272146 1298341 1324095 1350091 1376963 1404894 1433362 1461550 1489147 1516529
53473 1516529 1543882 1570569 1595888 1620187 1644440 1668695 1691690 1712312 1730755 1747875 1763963
53462 1763963 1778620 1791414 1802174 1810971 1818224 1824510 1829882 1833695 1835424 1835229 1833258 1828909 1821426
53449 1821426 1810956 1798357 1784172 1768377 1750995 1732302 1712446 1691337 1668871 1644923 1619275
53438 1619275 1592053 1564060 1536190 1508580 1480768 1452467 1423695 1394402 1364676 1335260 1307273
53427 1307273 1281332 1257381 1235216 1214658 1195385 1177272 1160814 1146537 1134032 1122270 1110893
53416 1110893 1100504 1091684 1084577 1079540 1077303 1078078 1081242 1086306 1093551 1103246 1114877 1127726 1141780
53403 1141780 1157547 1175380 1195429 1217852 1242545 1268949 1296628 1325809 1356898 1389740 1423879
53392 1423879 1459386 1496853 1536620 1578521 1622439 1668636 1717332 1768259 1820917 1875113 1931106
53381 1931106 1989193 2049366 2111431 2175420 2241629 2309978 2379427 2448375 2515850 2582103 2647888
53370 2647888 2713281 2777438 2839435 2899071 2956643 3011963 3063812 3110572 3151374 3186454 3216406
53359 3216406 3241535 3262131 3278901 3292435 3302302 3307161 3305955 3298703 3286160 3269124 3248170 3223668
53347 3223668 3195724 3164231 3128977 3089491 3044788 2993762 2936164 2873192 2806962 2739510 2672145
53336 2672145 2605389 2539268 2473791 2409275 2346143 2284534 2224345 2165649 2108720 2053584 1999893
53325 1999893 1947446 1896579 1847816 1801260 1756528 1713245 1671545 1632184 1596126 1563892 1535213
53314 1535213 1509350 1485600 1463356 1441956 1420935 1400429 1380966 1362913 1346451 1332083 1320545
53303 1320545 1311972 1305530 1300220 1295740 1292394 1290439 1289893 1290726 1292913 1296318 1300792 1306317 1312891 1320383
53289 1320383 1328689 1338031 1348882 1361554 1375946 1391762 1409012 1428274 1450345 1475529 1503283 1532607
53277 1532607 1562701 1593161 1623815 1654648 1685757 1716985 1747613 1776757 1804150 1830258 1855503
53266 1855503 1879553 1901515 1920684 1937042 1951127 1963457 1974014 1982313 1988018 1991308 1992544 1991824
53254 1991824 1989110 1984441 1977676 1968295 1955975 1941205 1924774 1906750 1886525 1863780 1838710 1811292
53242 1811292 1781142 1748450 1714345 1679833 1644879 1609000 1572382 1535902 1500283 1465739 1432243
53231 1432243 1399688 1367907 1336928 1307175 1279034 1252254 1226107 1200264 1175154 1151312 1128561
53220 1128561 1106083 1083319 1060572 1038569 1017589 997353 977827 959620 943180 927905 912612
53209 912612 896811 881007 865713 850803 836004 821474 807430 793533 779037 763484 747073
53198 747073 730531 714814 700685 688202 676576 664654 651704 637850 623860 610433 597536
53187 597536 584531 571046 557490 544361 531307 517381 502219 486551 471504 457751 445235
53176 445235 433268 420954 408073 395603 384792 375632 366875 357707 348696 340741 333782 327084 320270
53163 320270 313460 306688 299857 293163 287062 281795 277164 272747 268192 263471 259002 255296 252345 249555
53149 249555 246435 243069 239823 236917 234563 233120 232768 233200 233879 234483 234960 235338 235661 235939 236103 236202 236594
53132 236594 237617 239095 240588 242092 243994 246388 249057 252119 255840 259678 262468 263959 265224 266948
53118 266948 268194 267685 265528 262716 259503 255390 250380 245202 240329 235698 231307 227356 223747 220215
53104 220215 216881 213958 210953 206961 201800 196234 191024 186427 182571 179551 176997 174305 171490 169194
53090 169194 167648 166339 164944 163867 163435 163165 162352 160945 159329 157588 155509 153135 150877 149107 147908
53075 147908 147121 146431 145535 144479 143741 143790 144599 145673 146482 146763 146527 145908 145012 143911 142807 142069 141911 142127
53057 142127 142352 142485 142558 142299 141282 139607 138008 137097 136790 136690 136667 136733 136568 135613 133637 131062 128691 127201
53039 127201 126728 126712 126216 124699 122524 120571 119326 118537 117817 117258 117169 117410 117430 117065 116852 117295 118208 119109
53021 119109 119935 120751 121036 120090 118273 117006 117123 117853 117953 117272 116518 115988 115369 114642 114312 114641 115328 116114
53003 116114 117122 118371 119483 120204 120869 122042 123849 125860 127519 128549 129181 130038 131599 133687 135738
52988 135738 137578 139685 142582 146280 150440 154766 159000 162853 166267 169593 173172 176782 179820 182066
52974 182066 184001 186183 188513 190341 191284 191602 191615 190987 188980 185453 181290 177670 175062 173066 170971
52959 170971 168278 164879 161157 157944 156055 155655 156008 155951 154732 152597 150549 149345 148708 147728 146025 144145
52943 144145 142734 141734 140686 139453 138267 137374 137002 137387 138384 139253 139364 138985 138890 139261 139512 139156 138323
52926 138323 137398 136731 136855 138360 141148 144176 146337 147387 147795 147969 148022 148058 148213 148394 148339 148073 148037 148597
52908 148597 149613 150717 151880 153372 155115 156438 156802 156511 156358 156674 157240 158031 159408 161292 162797 163197
52892 163197 162884 162884 163629 164724 165714 166577 167495 168590 169895 171247 172251 172739 173174 174209 175831 177344 178224
52875 178224 178588 178838 179274 180215 182051 184868 188134 190953 192659 193232 193371 194087 195985 198876 202126 205330
52859 205330 208519 211972 216099 221220 227006 232230 235555 236749 236832 237039 237891 239160 240312 240854 240632 239955
52843 239955 239281 238808 238498 238324 238168 237597 236151 233807 230838 227329 223270 219067 215357 212246 209216 205948
52827 205948 202789 200224 198279 196677 195167 193491 191364 188834 186479 184958 184410 184368 184100 183013 180995
52812 180995 178508 176211 174457 173214 172385 171886 171475 170901 170206 169590 168933 167873 166369 164808 163462 162245
52796 162245 161074 160023 158995 157706 156236 155115 154597 154333 154040 153972 154180 153795 151858 148772 146127 144924
52780 144924 144565 143925 142863 142087 141782 141137 139456 137175 135318 134231 133412 132484 131715 131422 131411 131341 131207 131067
52762 131067 130655 129711 128392 126916 125036 122441 119504 117134 115818 115209 114580 113385 111584 109790 108922
52747 108922 109189 109641 109244 108167 107345 106929 106012 103964 101283 98902 97366 96835 97244 98087 98603 98535 98300
52730 98300 98292 98507 98992 99986 101310 102177 102135 101773 102041 103217 104872 106546 108054 109384 110665 112110 113838
52713 113838 115831 118121 120727 123362 125626 127559 129597 131803 133616 134564 134825 134867 134916 134924 134637 133551 131262
52696 131262 128118 125035 122459 119956 117082 114093 111387 108768 105783 102506 99518 97211 95406 93561
52682 93561 91236 88618 86583 85932 86506 87459 88292 88986 89216 88350 86486 84604 83238 81854 80066 78555
52666 78555 78015 77881 77083 75582 74242 73517 73114 72770 72536 72344 72022 71723 71833 72435 73288 74185 74963 75321
52648 75321 75073 74415 73610 72714 72003 72188 73563 75179 75625 74570 73039 72254 72620 73703 74715 75167 75464
52631 75464 76625 79019 81704 83509 84387 85003 85391 84923 83523 81981 80863 79828 78306 76355 74598
52616 74598 73626 73574 74030 74381 74489 74903 76030 77366 78012 77836 77543 77675 78137 78702 79480 80686 82285 83962
52598 83962 85310 86138 86783 87840 89289 90266 90136 89388 88941 88944 88924 88785 88850 89165 89580 90393 92010 94002 95389
52579 95389 95922 96230 96593 96543 95933 95506 95905 96874 97923 99202 101138 103629 106124 108204 109747 110737 111261
52562 111261 111506 111626 111753 112180 113138 114414 115558 116518 117570 118593 119014 118700 118300 118434 119067 119956 121144
52545 121144 122577 123704 124033 123822 123765 124145 124602 124648 124149 123428 123073 123403 123964 123760 122272 120131 118668 118829
52527 118829 120521 122780 124505 125287 125580 125974 126412 126456 126128 126004 126423 127083 127508 127462 126810 125491 123848 122543
52509 122543 121906 121717 121753 122119 122835 123592 124214 124989 126271 128031 130019 131948 133349 133691 133054 132371 132638
52492 132638 134058 136105 138103 139544 140261 140593 141082 141800 142315 142513 142939 143968 145114 145652 145591 145516 145773
52475 145773 146290 146933 147577 148007 148300 149094 150898 153194 154777 155048 154587 154362 154822 155827 157044 158198 159190
52458 159190 160204 161603 163571 165901 168126 169796 170715 171037 171146 171315 171485 171434 171055 170373 169403 168174 166832
52441 166832 165523 164207 162738 161112 159503 158084 156918 156034 155446 155050 154584 153825 152887 152248 152297 152792 152931
52424 152931 152169 150867 149951 149982 150740 151609 152100 152023 151524 151036 150923 151073 151011 150478 149695 149054 148820 149222 150445
52405 150445 152333 154301 155808 156877 158008 159585 161398 162771 163211 162964 162738 162808 162769 162380 162217 162908 164070
52388 164070 164826 165269 166474 168827 171250 172640 173409 174841 177265 179657 181051 181704 182601 184182 185886
52373 185886 186977 187569 188563 190571 193238 195805 197921 199525 200363 200407 200557 202013 204780 207532 209236 210208
52357 210208 211257 212527 213716 214844 216163 217653 219136 220683 222552 224876 227656 230758 233749 236151
52343 236151 238051 239946 241818 243025 243436 243965 245418 247438 249257 250880 252739 254708 256338 257762 259476
52328 259476 261369 262803 263567 264089 264788 265877 267672 270323 273325 276041 278716 282196 286577 290861 294128
52313 294128 296425 298364 300506 303317 307111 311732 316745 322136 328385 335684 343630 351830 360301 369057
52299 369057 377898 386951 396852 407963 419743 431394 442834 454599 467007 479858 492865 505989
52287 505989 519321 532892 546656 560496 574273 587938 601617 615576 630143 645604 661938
52276 661938 678610 694798 710004 724380 738348 751947 764589 775539 784753 793142 801796 810833
52264 810833 819267 826056 830926 834042 835446 835355 834555 833760 832721 830655 827485 823993 820760 817684 814649
52249 814649 811867 809268 806298 802749 799193 796230 793909 792369 792361 794338 797510 800705 803973 808474 814813
52234 814813 822392 830621 839939 851037 863583 876343 888442 900022 911664 923511 935101 945831
52222 945831 955517 964550 973538 982645 991248 998366 1003481 1006859 1009057 1010288 1010405 1009312 1007101 1003790
52208 1003790 999208 993240 985991 977639 968286 958063 947168 935693 923610 911064 898358 885466
52196 885466 871861 857330 842792 829817 819269 810744 803298 796282 789391 782417 775345 768452 762012
52183 762012 756024 750421 745356 741071 737506 734308 731191 728156 725330 722705 720075 717232 714185 711167
52169 711167 708343 705564 702486 698905 694871 690586 686364 682625 679635 677218 674922 672570 670428 668737
52155 668737 667290 665676 663799 661933 660332 658915 657320 655159 652257 648813 645328 642241 639527 636649
52141 636649 633063 628831 624704 621413 618848 616176 612890 609522 606951 605115 602893 599439 595267 591687
52127 591687 589370 587814 586156 584114 581992 580054 578218 576308 574335 572394 570466 568544 566941 566191
52113 566191 566492 567420 568345 569079 569941 571279 573141 575391 577931 580771 584077 588256 593793 600820 608916
52098 608916 617482 626361 636046 647289 660454 675170 690579 706056 721763 738506 756950 777012
52086 777012 798058 819572 841442 863625 885841 907734 929140 949924 969668 987869 1004489
52075 1004489 1019963 1034611 1048340 1061048 1072861 1083615 1092457 1098481 1101687 1102884 1102743 1101407 1098931
52062 1098931 1095556 1091432 1086474 1080589 1073699 1065573 1056130 1045887 1035534 1025039 1013904 1002413 991822
52049 991822 982943 975316 968230 961737 956041 950725 945490 941049 938265 936870 936123 936333 938482 942409 946716
52034 946716 950718 955350 961686 969468 977586 985291 992498 999592 1007336 1016255 1025710 1034255 1041371 1048004
52020 1048004 1054842 1060941 1065008 1067364 1069401 1071364 1071949 1070212 1066796 1062802 1058242 1052209 1044097 1034063
52006 1034063 1022459 1009382 994821 978920 961904 943878 924878 905129 885045 864787 843938
51995 843938 821924 798752 775056 751368 727837 704794 682985 662656 642804 622121 600633
51984 600633 579706 560290 541812 523156 504185 485748 468499 452317 436878 422244 408651
51973 408651 395997 383857 371984 360582 350029 340425 331505 323052 315245 308469 302783 297761 292948
51960 292948 288308 284088 280375 276996 273743 270459 266938 263088 259229 255864 253010 250085 246754 243550
51946 243550 241264 239920 238791 237356 235753 234291 233011 231852 230825 229837 228717 227582 226763 226172 225188
51931 225188 223466 221460 219787 218423 216962 215342 213787 212287 210684 209135 207905 206694 204746 201789
51917 201789 198500 195856 194274 193483 192964 192376 191692 190983 190138 188903 187358 186085 185647 186019 186749 187412 187642
51900 187642 187079 185791 184564 184203 184580 184748 183911 181896 178933 175611 172899 171443 170757 169792 168412 167584
51884 167584 167901 168651 168825 168439 168312 168826 169398 169091 167422 164744 161975 159860 158440 157464 157087 157618 158591
51867 158591 158933 158410 158205 159477 161801 163697 164351 164177 163892 163794 164036 164956 166812 169417 172282 175031 177589
51850 177589 180057 182488 184787 186806 188498 189967 191437 193202 195344 197320 198100 197144 195159 193472 192682
51835 192682 192318 191655 190381 188510 186376 184828 184738 186056 187883 189612 191322 192850 193407 192701 191722 191674
51819 191674 192646 193988 195494 197305 199028 199923 199967 199932 200320 200834 201024 200904 200756 200717 200651 200199 199003 197214
51801 197214 195608 194784 194322 193267 191466 189877 189414 189943 190694 191265 191893 192879 194125 195332 196457 197660
51785 197660 198804 199299 198850 198134 198215 199243 200403 201260 202396 204268 206162 207032 206951 206931 207565 208601 209670
51768 209670 210655 211363 211635 211925 213129 215604 218778 221847 224434 226560 228443 230456 232899 235746 238931
51753 238931 242817 247850 253794 259917 266006 272556 279751 286852 292917 297704 301543 304707 307225 309017
51739 309017 309915 309763 308694 307081 305200 303227 301589 300787 300689 300556 300078 299889 300650 302046 303221 303904 304487
51722 304487 305157 305527 305206 304291 303194 302245 301574 301164 300927 300824 300854 300794 300051 298091 295045 291718 288903 286801
51704 286801 285064 283183 280766 277691 274268 271190 269069 267918 267175 266308 265303 264495 264062 263933 264077 264610
51688 264610 265500 266395 266952 267218 267618 268685 270893 274526 279477 285213 290996 296042 299505 300722 299830 297961
51672 297961 296529 296349 297512 299737 302466 304882 306436 307365 308250 309075 309098 307763 305326 302507 299828 297382
51656 297382 294905 291904 287987 283248 278151 272990 267606 261756 255550 249485 244140 239803 236217 232730
51642 232730 228926 225075 221727 219013 216739 215003 214131 213877 213282 211693 209538 207721 206542 205595 204483
51627 204483 203216 201943 200668 199371 198216 197515 197463 197891 198303 198259 197742 197055 196362 195538 194529 193670 193420
51610 193420 193783 194125 193672 192246 190517 189421 189324 189917 190931 192572 194972 197495 199113 199446 199138 199235 200472
51593 200472 203009 206404 209785 212518 214814 217427 220760 224616 228772 233335 238388 243742 249183 254628
51579 254628 259917 264821 269396 273917 278328 282111 284860 286577 287272 286735 284949 282309 279178 275701 272257
51564 272257 269552 267800 266316 264451 262581 261566 261580 262109 262938 264416 266734 269524 272373 275333 278723
51549 278723 282695 287175 292085 297486 303404 309389 314326 317177 318136 318690 320149 322421 324567 326095 327072
51534 327072 327345 326601 325293 324643 325328 326750 327949 328766 329711 331077 332693 334295 335579 335919 334559 331329
51518 331329 327021 322869 319678 317401 315452 313255 310486 306970 302698 298112 294134 291460 289709 287559
51504 287559 283950 279095 274184 270181 267080 264253 261299 258451 256254 255032 254695 254929 255381 255735 255810 255678
51488 255678 255558 255522 255526 255789 256855 258991 261682 264023 265674 267135 269081 271673 274598 277627 280975 285141
51472 285141 290382 296326 302192 307587 312903 318747 325011 330905 335911 340354 344942 350115 356072 363013
51458 363013 370838 378737 385596 390970 395341 399280 402604 404586 404872 403999 403003 402645 402938 403324 403301 402970
51442 402970 402968 403756 404924 405310 403889 400602 396290 391882 387705 383547 379183 374596 369681 364016 357220
51427 357220 349524 341741 334556 328044 321932 316101 310604 305429 300647 296692 294069 292674 291772 290845 290182
51412 290182 290360 291401 292776 294059 295257 296563 298186 300432 303630 307763 312318 316589 319972 321900
51398 321900 321753 319191 314684 309454 304581 300062 294945 288551 281355 274380 267863 261062 253468 245595
51384 245595 238189 231169 223972 216753 210482 205727 201855 197732 192943 188115 184187 181544 179755 178097
51370 178097 176247 174386 172600 170524 167758 164427 160957 157579 154440 151955 150501 149824 149286 148687 148301
51355 148301 148080 147487 146295 145001 144158 143769 143628 143795 144442 145466 146563 147396 147659 147374 147214 147976 149486
51338 149486 150673 151025 151342 152471 153947 154638 154394 154240 155082 156894 159200 161751 164657 168234 172774 178149
51322 178149 183734 189031 194144 199271 204072 208095 211582 215092 218370 220437 220887 220410 219717 218642 216626
51307 216626 213584 209811 205448 200469 194982 189220 183420 177998 173485 169939 166621 162733 158393 154543
51293 154543 151894 150252 148927 147508 146144 145204 144787 144561 144118 143438 142860 142525 142061 141010 139403 137695
51277 137695 136196 134830 133444 132067 130809 129755 129085 129034 129561 130215 130599 130833 131260 131813 132046 131872 131841
51260 131841 132418 133327 133957 134245 134714 135676 136829 137661 137862 137299 135943 134070 132188 130548 128942 127172
51244 127172 125454 124132 123275 122792 122702 122916 122968 122384 121289 120320 119926 120044 120403 120821 121176 121461 121948 122940
51226 122940 124179 124789 124094 122399 120722 119777 119466 119323 119269 119700 120890 122572 124200 125506 126626 127756
51210 127756 128948 130206 131548 132910 134212 135575 137212 139004 140487 141453 142266 143339 144562 145539 146154
51195 146154 146525 146612 146329 145955 145949 146301 146507 146259 145768 145270 144615 143625 142561 141843 141453 140967 140202 139532 139435 139963
51175 139963 140875 142112 143808 145699 146964 146987 146159 145453 145223 144906 144046 143072 142641 142557 141905 140165 137753
51158 137753 135473 133806 132721 131805 130477 128409 125879 123611 122161 121642 121954 122970 124326 125298 125169
51143 125169 123852 122179 121490 122707 125576 128835 131286 132695 133619 134612 135827 137182 138546 139681 140320
51128 140320 140367 139915 139084 137972 136672 135163 133303 131128 128998 127215 125639 124071 122863 122646 123445 124499
51112 124499 125059 124981 124455 123589 122558 121788 121676 122179 122833 123123 122829 122261 122163 123107 124865 126616 127766 128281
51094 128281 128237 127613 126744 126497 127512 129521 131760 133888 136093 138497 140848 142798 144139 144832 145030 145099
51078 145099 145307 145551 145587 145497 145635 146142 146802 147375 147803 148061 148161 148379 149080 150122 150784 150662 150350 150805 152133
51059 152133 153494 154241 154677 155503 156849 158217 159133 159650 160334 161980 165028 168921 172246 173947 174295 174276
51043 174276 174226 173631 172267 170766 169830 169477 169452 169810 170557 171186 171222 171001 171234 171955 172445 172221 171535 170880 170538
51024 170538 170679 171354 172181 172499 172144 171781 172201 173529 175308 177069 178553 179571 180023 180077 180125 180570 181689
51007 181689 183585 186079 188703 191001 192937 194935 197438 200444 203517 206291 208869 211656 214923 218769
50993 218769 223425 229160 235760 242470 248829 255314 262721 271058 279501 287500 295511 304531 315200 327536
50979 327536 341281 356243 372356 389592 407958 427654 449220 473422 500908 531993 566690
50968 566690 604768 645887 689999 737669 789532 845276 903608 963510 1025080 1088761 1154083
50957 1154083 1219667 1284030 1345806 1403463 1455531 1501092 1539603 1570452 1593216 1608199 1616053
50946 1616053 1616986 1610980 1598626 1581035 1559046 1533377 1505555 1477755 1451406 1426660 1403343 1381534
50934 1381534 1360948 1340690 1320192 1299620 1278850 1256825 1232620 1206514 1179153 1150123 1118221
50923 1118221 1082884 1044636 1004259 962296 919359 876306 833996 793229 754854 719494 687091
50912 687091 657059 628953 602850 579206 558562 541252 527074 515270 505006 495767 487272 479385
50900 479385 472429 467200 464219 463081 462885 463115 463779 464959 466665 469001 471962 475120 477898 480139 482087
50885 482087 483918 485696 487747 490572 494260 498302 502129 505623 509100 513010 517733 523408 529878 536986
50871 536986 544932 554212 565143 577604 591230 605709 620936 637125 654913 675229 698905 726317
50859 726317 757369 791906 830215 873101 921434 975756 1036484 1104299 1179966 1263816 1355808
50848 1355808 1456126 1565215 1683043 1808774 1941322 2079808 2223176 2369779 2517617
50839 2517617 2664492 2807457 2942500 3065325 3172385 3261027 3329180 3375608 3400245 3403780
50829 3403780 3387180 3352161 3301892 3240441 3171481 3098033 3023330 2951035 2884238 2824567 2772386
50818 2772386 2727341 2688429 2653934 2621663 2589244 2554273 2514599 2468707 2415703 2354992 2286299
50807 2286299 2210046 2127366 2039618 1948146 1854501 1760483 1667713 1577471 1491107 1410257 1336291
50796 1336291 1269642 1209940 1156772 1110185 1070541 1038080 1012620 993542 980092 971741 968275 969540
50784 969540 975157 984462 996610 1010719 1026002 1041772 1057343 1071944 1084835 1095495 1103640 1109068
50772 1109068 1111598 1111153 1107886 1102213 1094711 1085873 1075860 1064545 1051821 1037815 1022789 1006999 990729
50759 990729 974380 958453 943539 930341 919555 911587 906426 903709 902866 903335 905022 908536 914693
50746 914693 923659 934866 947742 962191 978314 996187 1016167 1039101 1065994 1097727 1135115 1178713
50734 1178713 1228370 1283551 1344524 1412613 1488741 1572126 1660933 1753746 1849639 1947149 2044057
50723 2044057 2138202 2227825 2311021 2385395 2448448 2497974 2532176 2549911 2550930 2535629 2504725
50712 2504725 2459602 2402842 2337922 2268386 2197551 2128583 2064005 2005053 1952085 1905583 1866136
50701 1866136 1833421 1805991 1782251 1761040 1741051 1720361 1696937 1669181 1635793 1595819 1549406
50690 1549406 1498148 1444134 1388819 1333098 1278140 1225525 1176621 1132156 1092458 1057757 1028215
50679 1028215 1003858 984705 970922 962741 960098 962450 969216 980481 996980 1019227 1047019 1080033
50667 1080033 1118416 1162156 1210170 1260735 1312616 1364990 1416311 1464335 1507705 1546849 1582867
50656 1582867 1616139 1646485 1674052 1699309 1722368 1742952 1760982 1776797 1790883 1803662 1815398
50645 1815398 1826016 1835180 1842848 1849645 1856505 1864128 1873103 1884310 1898782 1917160 1939570 1965922
50633 1965922 1995945 2028875 2063335 2097620 2130067 2159307 2184476 2205257 2221603 2233364 2240323
50622 2240323 2242543 2240578 2235364 2228049 2219907 2212226 2206243 2203190 2204299 2210433 2221560 2236736 2254864
50609 2254864 2275349 2297756 2320827 2342327 2360230 2373887 2383609 2389246 2389630 2383355 2369425 2346929
50597 2346929 2314743 2272207 2219848 2159049 2091220 2017631 1939762 1859296 1777861 1697080 1618560
50586 1618560 1543370 1471660 1403248 1338412 1277734 1221502 1169792 1122870 1080816 1042936 1008289
50575 1008289 976801 949183 925806 906363 890666 878903 870901 865828 862958 862211 863766 867787 874679
50562 874679 884870 897992 912957 929239 947569 968986 993815 1021949 1053480 1088441 1126439
50551 1126439 1167178 1211051 1258689 1310226 1365344 1423589 1484036 1545074 1605236 1664207 1722436
50540 1722436 1779893 1835702 1888885 1939023 1986268 2031244 2074990 2118578 2162635 2207376 2253001
50529 2253001 2299777 2347834 2397294 2448737 2503307 2562214 2626119 2694988 2768456 2846248 2928132
50518 2928132 3013371 3100415 3187364 3272549 3354238 3429986 3496909 3552761 3596262 3626330 3641606
50507 3641606 3641066 3624494 3592038 3543812 3480567 3404482 3318850 3227138 3132595 3038363 2947459 2862714
50495 2862714 2786916 2722733 2672158 2636116 2614649 2607124 2612125 2627686 2651947 2683157 2718707 2754633
50483 2754633 2786524 2810570 2823498 2822096 2803572 2766229 2709601 2634470 2543310 2440211 2329575
50472 2329575 2214866 2098788 1983956 1872616 1766032 1664928 1570343 1483341 1404089 1331962
50462 1331962 1266476 1207480 1154606 1107310 1065554 1029740 999848 975138 954769 938225 925094
50451 925094 914948 907599 903098 901460 902652 906693 913392 922182 932712 945449 961080 979400 999408
50438 999408 1020513 1043032 1067446 1093744 1121590 1150615 1180426 1210871 1242424 1275819 1311133
50427 1311133 1347568 1384207 1420594 1456593 1492222 1527745 1563410 1598997 1633978 1668168 1701684
50416 1701684 1734267 1765337 1795006 1824482 1855185 1887832 1922620 1959762 1999413 2041320 2084855
50405 2084855 2129237 2173558 2216860 2258361 2297474 2333533 2365733 2393326 2415559 2431428 2439889
50394 2439889 2440334 2432506 2415970 2390094 2354531 2309218 2253979 2188926 2115504 2036462 1954409 1870941
50382 1870941 1787546 1706589 1630735 1561800 1500712 1448241 1405015 1371027 1345861 1329427 1321923
50371 1321923 1322952 1331131 1344637 1361819 1381114 1400717 1418538 1432440 1440484 1441173 1433574 1417283
50359 1417283 1392404 1359750 1320966 1278176 1233329 1187848 1142780 1098961 1056886 1016554 977753
50348 977753 940633 905900 874254 845744 819850 796140 774494 754691 736307 719371 704723
50337 704723 693229 684825 678742 674464 671946 671050 671482 673320 676983 682457 689068 696291 704355 713783
50323 713783 724778 737297 751310 766601 782663 799188 816410 834641 853740 873391 893683
50312 893683 914972 937286 960259 983617 1007346 1031300 1054931 1077530 1098581 1117854 1135244
50301 1135244 1150640 1163984 1175422 1185244 1193500 1199726 1203262 1203887 1201907 1197675 1191331 1183034 1173083
50288 1173083 1161613 1148561 1134084 1118649 1102305 1084169 1063123 1038991 1012751 985658 958553
50277 958553 931936 906209 881589 858008 835297 813384 792205 771613 751595 732493 714789
50266 714789 698615 683633 669488 656212 644054 633062 623148 614543 607821 603234 600259 597997 595895
50253 595895 593907 592210 591040 590649 591043 591826 592672 593900 596193 599671 603520 606638 608472 609216 609483 609793
50237 609793 610141 609984 608833 606871 604827 603287 602258 601258 599559 596577 592398 587811 583394 578770 573311
50222 573311 567374 562110 558029 554648 551761 550057 549935 550516 550701 550679 551457 553173 554903 556198 557938 561227
50206 561227 565971 571034 575505 579354 582919 586186 588814 590708 592338 594318 596823 599525 602035 604218
50192 604218 606087 607614 608753 609536 610050 610368 610464 610162 609214 607504 604988 601361 596153 589511 582514 576121
50176 576121 569983 563014 555092 547410 540970 535528 530442 525863 522549 520935 520933 522312 524774 527931 531523
50161 531523 535346 538666 540243 539451 536945 533609 529317 523519 516649 509965 504018 498303 492547 487413
50147 487413 483474 480258 476988 473736 471152 469315 467584 465604 463845 462942 462958 463563 464659 466415 468813
50132 468813 471563 474506 477715 481070 484123 486694 489335 492762 496980 501390 505686 510151 515076 520391
50118 520391 525966 531732 537271 541796 544852 546726 547955 548776 549290 549666 549846 549517 548743 548166 548063 547685
50102 547685 546177 543873 542019 541373 541738 542732 544283 546312 548561 550927 553510 556209 558809 561572 565245
50087 565245 570265 576372 583209 590855 599473 608828 618598 628904 640182 652568 665740 679328 693232
50074 693232 707449 721758 735778 749398 763068 777524 793124 809522 825991 841824 856377
50063 856377 869121 880004 889590 898440 906483 913323 919044 924264 929458 934749 940391 946832 954002 961052
50049 961052 967264 972967 979132 986235 993956 1001965 1010540 1020312 1031695 1044890 1060275 1078480 1099994
50036 1099994 1124829 1152760 1183840 1218540 1257301 1300050 1346204 1394965 1445389 1496108 1545079
50025 1545079 1589706 1627386 1656265 1675875 1687295 1692740 1694861 1696088 1698253 1702457 1709081 1717651 1726514
50012 1726514 1732870 1733614 1726442 1710142 1684095 1648061 1602651 1549558 1490963 1428930 1365542 1303096
50000 1303096 1243502 1187615 1135607 1087807 1044649 1005899 970622 938072 908110 880610 855029
49989 855029 830935 808532 788143 769403 751424 733769 716869 701358 687237 673885 660795
49978 660795 648138 636522 626254 616994 608207 599927 592844 587557 583798 580558 576992 573084 569434
49965 569434 566522 564355 562705 561399 560271 559110 557929 557127 557024 557344 557493 557344 557367 557910 558791 559740 560879
49948 560879 562475 564577 567160 570324 574007 577726 581049 584194 587893 592768 599106 607020 616376 626648
49934 626648 637294 648359 660423 673946 688943 705369 723522 743980 767344 794119 824639
49923 824639 858973 896935 938304 983092 1031762 1085310 1145027 1211988 1286657 1368825 1457511
49912 1457511 1550637 1644998 1736946 1823336 1902045 1972011 2033160 2086198 2132211 2172510 2208887
49901 2208887 2243720 2279274 2316588 2354811 2391279 2422139 2443406 2452072 2446482 2425850 2389873 2339164
49889 2339164 2275764 2202700 2122903 2038580 1951286 1862295 1772930 1684710 1599018 1516483 1437039
49878 1437039 1360794 1288472 1220743 1157559 1098629 1044068 993997 947866 904865 864919 828608
49867 828608 796259 767684 742730 721357 703115 687127 672646 659222 646398 633860 621828
49856 621828 610691 600203 589681 579027 568949 559997 551955 544268 536501 528283 519509 510804 503211
49843 503211 497079 491766 486579 481473 476623 471950 467470 463558 460517 458239 456563 455432 454461 452948
49829 452948 450751 448720 447814 448177 449369 450972 452596 453841 454849 456516 459542 463575 467776 471919 476344
49814 476344 481136 485995 490862 496140 502365 510071 519815 531752 545244 559402 574100 590062 608015
49801 608015 628241 651025 677032 706893 740709 778291 819789 865885 917217 973690 1034422
49790 1034422 1098316 1164380 1231074 1295485 1353727 1402618 1440933 1469170 1488746 1501734 1510803
49779 1510803 1518590 1526977 1537096 1549611 1564332 1579568 1592363 1599498 1598037 1585194 1558629 1517521
49767 1517521 1463330 1399170 1328431 1253987 1178421 1104389 1034305 969556 910313 856288 807619
49756 807619 764770 727732 695770 667988 643743 622431 603362 586222 571313 558948 548869
49745 548869 540516 533557 527680 522172 516385 510600 505791 502427 500002 497951 496435 495804 495701 495356 494694
49730 494694 494481 495130 495838 495392 493656 491753 490724 490537 490605 490699 490865 490776 489922 488400 486876 485603 484076
49713 484076 481943 479747 478298 477656 477196 476503 475747 475185 474720 474142 473633 473827 475311 478030 481233 484051
49697 484051 486098 487470 488398 489108 489840 490644 491252 491494 491731 492465 493629 494789 495941 497435 499081 500136
49681 500136 500474 500999 502439 504319 505614 505882 505249 503861 502003 500334 499319 498739 498309 498406 499518 501271
49665 501271 502794 503917 505259 507227 509584 511963 514125 515667 516168 515789 515220 514943 514986 515372 516202 517216
49649 517216 517898 518186 518537 519095 519377 519097 518739 518920 519539 520000 520027 519869 519911 520399 521444 522945 524550 525931
49631 525931 527129 528471 530158 532018 533651 534798 535556 536235 536983 537659 538203 538989 540573 543135 546439 550333
49615 550333 554972 560388 566056 571134 575179 578555 582135 586627 592209 598721 605977 613692 621325 628440
49601 628440 635307 642742 651208 660489 670396 681257 693347 706300 719578 733150 747218 761660
49589 761660 776433 792207 809780 828977 848891 869224 890620 913566 937777 962914 989200
49578 989200 1016929 1045930 1075947 1107136 1139757 1173750 1209004 1245714 1284116 1324117 1365533
49567 1365533 1408402 1452699 1497925 1543434 1589059 1635138 1681936 1729331 1777049 1825002 1873307
49556 1873307 1921939 1970281 2017048 2060941 2101491 2139139 2174405 2207209 2236981 2263077 2284838
49545 2284838 2301552 2312749 2318545 2319538 2316447 2309881 2300265 2287754 2272415 2254704 2235714 2216713
49533 2216713 2198443 2181002 2164389 2149014 2135630 2124829 2116674 2110867 2107278 2106179 2107980 2112884
49521 2112884 2120891 2131896 2145602 2161593 2179815 2200727 2224604 2250851 2278464 2306943 2336128
49510 2336128 2365269 2393091 2419014 2443551 2467099 2488916 2507738 2522950 2534631 2542737 2546763 2545923
49498 2545923 2539275 2525988 2506014 2480355 2450187 2415865 2377105 2333881 2286591 2235567 2181142
49487 2181142 2124236 2066284 2008348 1950743 1893635 1837552 1783055 1730325 1679312 1629978 1582148
49476 1582148 1535470 1489928 1446153 1404851 1366005 1329024 1293596 1259978 1228407 1198655 1170424
49465 1170424 1143884 1119401 1096873 1075735 1055690 1037060 1020239 1005106 991306 978879 968146
49454 968146 958948 950451 941978 933770 926653 921024 916464 912297 908277 904535 901016 897253 892871 888196
49440 888196 884134 881386 879929 879338 879371 880024 881234 882942 885435 889209 894329 900157 905940 911523 917418
49425 917418 924374 933035 943825 956924 972375 990251 1010442 1031948 1052480 1069191 1080249 1085949
49413 1085949 1088400 1090173 1093006 1097433 1103295 1110432 1118953 1129067 1140854 1154115 1168359 1183002 1197818
49400 1197818 1213125 1229311 1246144 1262826 1278817 1294356 1310026 1325997 1341930 1357483 1372678
49389 1372678 1387688 1402455 1416636 1429942 1442485 1454707 1466940 1479162 1491312 1503697 1516782
49378 1516782 1530600 1544696 1558852 1573595 1589748 1607492 1626090 1644524 1662341 1679895 1697914
49367 1697914 1716837 1736520 1756529 1776636 1797070 1818365 1841024 1865228 1890707 1916931 1943527
49356 1943527 1970507 1998059 2026280 2055295 2085489 2117383 2151237 2186932 2224181 2262733 2302470
49345 2302470 2343583 2386603 2432066 2480197 2531075 2584950 2642069 2702298 2765266 2830724 2898421
49334 2898421 2967779 3038256 3110030 3183703 3259230 3335670 3412222 3488942 3566224 3644011 3721828
49323 3721828 3799038 3874671 3947444 4016474 4081759 4143540 4201418 4254397 4301526 4342149 4375835
49312 4375835 4402469 4422240 4435207 4441123 4439987 4432437 4419221 4400698 4377389 4350693 4322327 4293202
49300 4293202 4263460 4233476 4204129 4176082 4149462 4124378 4101227 4080403 4062236 4047321 4036250
49289 4036250 4028870 4024381 4022464 4023808 4029187 4038552 4051400 4067563 4087107 4109736 4134825 4161830
49277 4161830 4190242 4219282 4248075 4276053 4302782 4327481 4349131 4367047 4380902 4390106 4393578 4390321
49265 4390321 4380000 4362796 4338966 4308746 4272588 4231268 4185712 4136705 4084576 4029097 3969830
49254 3969830 3906828 3841047 3774092 3707530 3642334 3578681 3516167 3454364 3393460 3334330 3277863
49243 3277863 3224197 3172734 3122819 3074232 3027098 2981592 2937817 2895726 2854985 2815048 2775518
49232 2775518 2736346 2697623 2659426 2622087 2586329 2552750 2521178 2490889 2461496 2433352 2407051
49221 2407051 2382895 2360946 2341217 2323511 2307309 2292214 2278453 2266590 2256680 2247990 2239722 2231817
49209 2231817 2224875 2219373 2215186 2211883 2209298 2207623 2206989 2207148 2207680 2208442 2209747 2212103 2215772 2220515 2225784
49194 2225784 2231346 2237723 2245785 2255805 2267146 2279053 2291489 2304933 2319674 2335669 2352933 2371484
49182 2371484 2390931 2410654 2430560 2451226 2473131 2496097 2519683 2543738 2568361 2593606 2619547
49171 2619547 2646294 2673647 2700955 2727599 2753434 2778533 2802774 2826024 2848530 2870716 2892715
49160 2892715 2914483 2936272 2958556 2981355 3003988 3025713 3046469 3066943 3087991 3109990 3132641
49149 3132641 3155345 3177833 3200407 3223626 3247925 3273621 3301019 3330152 3360403 3390532 3419161
49138 3419161 3445322 3468815 3490210 3510396 3529925 3548885 3567454 3586248 3605811 3625946 3645917
49127 3645917 3665233 3683958 3702284 3720188 3737498 3753980 3769261 3782926 3794783 3804888 3813323
49116 3813323 3820273 3826365 3832544 3839252 3845842 3851073 3854214 3855549 3855894 3855841 3855596 3855362 3855587 3856668 3858511
49101 3858511 3860606 3862591 3864627 3867170 3870503 3874586 3879232 3884248 3889480 3894875 3900552 3906740 3913642 3921343
49087 3921343 3929787 3938749 3947867 3956792 3965338 3973501 3981406 3989180 3996853 4004384 4011807 4019205 4026397 4032778
49073 4032778 4037677 4040784 4042039 4041301 4038545 4034321 4029478 4024247 4018003 4010113 4000688 3990243 3979025 3967014
49059 3967014 3954352 3941331 3928023 3914072 3898846 3881780 3862901 3843071 3823358 3803969 3784151
49048 3784151 3763325 3741930 3720814 3700266 3680046 3660013 3640210 3620551 3600890 3581297 3561941
49037 3561941 3542893 3524402 3507032 3491108 3476307 3462193 3448819 3436289 3424122 3411797 3399684
49026 3399684 3388651 3378864 3369747 3361088 3353297 3346490 3340191 3334269 3329392 3326113 3324102 3322749 3322025 3322254
49012 3322254 3323420 3325196 3327463 3330314 3333730 3337553 3341666 3345925 3349975 3353358 3355777 3357221 3358003 3358698
48998 3358698 3359738 3360874 3361179 3359712 3356124 3350686 3343999 3336676 3328995 3320843 3312197 3303506 3295163 3286688
48984 3286688 3277087 3266140 3254687 3243402 3231874 3219244 3205173 3189707 3172770 3154474 3135596
48973 3135596 3117024 3098839 3080539 3062057 3043961 3026612 3009687 2992710 2975621 2958663 2942004
48962 2942004 2925690 2909761 2894275 2879399 2865546 2853196 2842401 2832628 2823218 2813992 2805319 2797731
48950 2797731 2791638 2787324 2784924 2784260 2784829 2786227 2788593 2792414 2797843 2804460 2811915 2820545 2831032 2843628
48936 2843628 2858088 2874252 2892197 2911830 2932788 2954929 2978504 3003703 3030419 3058645 3088685
48925 3088685 3120653 3154140 3188736 3224516 3261636 3299721 3338133 3376754 3416092 3456666 3498663
48914 3498663 3542104 3586919 3632804 3679371 3726585 3774867 3824678 3876124 3928953 3982814 4037516
48903 4037516 4093167 4150031 4208148 4267206 4326940 4387490 4449205 4512275 4576777 4642832 4710270
48892 4710270 4778210 4845472 4911500 4976599 5041145 5104934 5167312 5227634 5285447 5340534 5392972
48881 5392972 5442851 5489722 5532635 5570947 5604786 5634396 5659385 5679074 5693420 5702957 5707768 5707041
48869 5707041 5699946 5686631 5668060 5645080 5617927 5586516 5550888 5511353 5468369 5422296 5373211
48858 5373211 5321025 5265831 5208029 5148080 5086294 5023052 4958930 4894322 4829078 4762927 4696297
48847 4696297 4630369 4566211 4504082 4443623 4384491 4326714 4270688 4216950 4165784 4117019 4070358
48836 4070358 4025890 3983998 3944857 3908452 3875097 3845413 3819567 3797016 3777265 3760384 3746425
48825 3746425 3734882 3725291 3718044 3713999 3713492 3716265 3722193 3731442 3743904 3759028 3776271 3795392 3816338
48812 3816338 3839249 3864525 3892449 3922718 3954688 3988052 4022950 4059446 4097279 4136089 4175492
48801 4175492 4215034 4254467 4293994 4333894 4374026 4414188 4454693 4495967 4537712 4579193 4620344
48790 4620344 4661796 4703740 4745574 4786899 4828139 4869859 4912150 4955018 4998742 5043345 5088225
48779 5088225 5132751 5176881 5220907 5264988 5309112 5353007 5395808 5436367 5474178 5509489 5542304
48768 5542304 5572018 5598307 5621396 5640787 5654598 5661158 5660784 5655028 5644562 5628745 5607036 5579831
48756 5579831 5547873 5511676 5471632 5428036 5381009 5330982 5279136 5226608 5173147 5117363 5058549
48745 5058549 4997645 4936100 4874367 4811946 4748550 4684779 4621771 4560580 4501898 4446139 4393612
48734 4393612 4344479 4298636 4255896 4216442 4180815 4149211 4121069 4095643 4072799 4052908 4036117
48723 4036117 4022093 4010378 4000663 3992849 3987176 3984121 3983839 3985804 3989332 3994262 4000868 4009335 4019780
48710 4019780 4032504 4047639 4064668 4082862 4102144 4122987 4145508 4169205 4193660 4218960 4245407
48699 4245407 4273314 4303139 4335294 4369697 4405997 4444360 4485669 4530818 4580241 4634106 4692440
48688 4692440 4754785 4820230 4888063 4958205 5030865 5106049 5183430 5262420 5342318 5422681 5503442
48677 5503442 5584182 5663374 5738936 5809649 5875500 5936524 5991986 6040870 6082523 6116480 6142244
48666 6142244 6159742 6169572 6172383 6168351 6157596 6140623 6117846 6089032 6053753 6012170 5964885 5912222
48654 5912222 5854183 5791110 5723989 5654053 5582271 5509105 5434555 5358573 5281516 5204017 5126311
48643 5126311 5048130 4969509 4891191 4813783 4736909 4659873 4582901 4507030 4432860 4360090 4288354
48632 4288354 4217828 4148816 4081324 4015440 3951716 3890682 3832147 3775275 3719305 3664016 3609559
$$ [...]
##END NTUPLES=NMR SPECTRUM
##END=
