
##TITLE=AC1237_CNAOR12066_6610228_mVCA3ImiEX
##JCAMPDX= 6.0         $$ Bruker NMR JCAMP-DX V2.0
##DATA TYPE= NMR SPECTRUM
##DATA CLASS= NTUPLES
##ORIGIN= BRUKER
##OWNER= Administrator
$$ 1.72 TOPSPIN		Version 2.1
$$ 2012-08-02 01:12:18.015 -0500  Administrator@TOPSPIN
$$ Compression mode = diff/dup
##.OBSERVE FREQUENCY= 400.02188249412
##.OBSERVE NUCLEUS= ^1H
##.ACQUISITION MODE= SIMULTANEOUS (DQD)
##.ACQUISITION SCHEME= undefined
##.AVERAGES= 8
##.DIGITISER RES= 22
##SPECTROMETER/DATA SYSTEM= spect
##.PULSE SEQUENCE= zg30
##.SOLVENT NAME= COFFEE_meoh
##.SHIFT REFERENCE= INTERNAL, COFFEE_meoh, 1, 14.98509
##AUDIT TRAIL= $$ (NUMBER, WHEN, WHO, WHERE, PROCESS, VERSION, WHAT)
$$ ##TITLE= Audit trail, TOPSPIN		Version 2.1
$$ ##JCAMPDX= 5.01
$$ ##ORIGIN= Bruker BioSpin GmbH
$$ ##OWNER= Administrator
$$ $$ C:\Bruker\TOPSPIN/data/COFFEE/nmr/AC1237_CNAOR12066_6610228_mVCA3ImiEX/10/pdata/1/auditp.txt
$$ ##AUDIT TRAIL=  $$ (NUMBER, WHEN, WHO, WHERE, PROCESS, VERSION, WHAT)
(   1,<2012-08-02 01:12:09.859 -0500>,<Administrator>,<TOPSPIN>,<go>,<TOPSPIN 2.1>,
      <created by zg
	started at 2012-08-02 01:11:02.984 -0500,
	POWCHK enabled, PULCHK disabled,
       configuration hash MD5:
       6B 1B 68 BB D9 2E 58 E2 7F 35 AD 54 07 DF 0E 41
       data hash MD5: 64K
       D5 75 34 BB 0D B5 57 EF 41 03 F3 AF 2F F3 78 2D>)
(   2,<2012-08-02 01:12:13.828 -0500>,<Administrator>,<TOPSPIN>,<proc1d>,<TOPSPIN 2.1>,
      <Start of raw data processing
       efp LB = 0 FT_mod = 6 PKNL = 1 PHC0 = 0 PHC1 = 0 SI = 32K 
       data hash MD5: 32K
       31 EA C1 9A FE 1E D3 D5 42 B5 9E 8A 40 4B 98 27>)
(   3,<2012-08-02 01:12:14.109 -0500>,<Administrator>,<TOPSPIN>,<proc1d>,<TOPSPIN 2.1>,
      <pk PHC0 = 174.8749 PHC1 = 0 
       data hash MD5: 32K
       58 82 5E 71 CB BB F8 5C 16 A1 11 A9 F2 AA 00 50>)
(   4,<2012-08-02 01:12:14.171 -0500>,<Administrator>,<TOPSPIN>,<proc1d>,<TOPSPIN 2.1>,
      <abs ABSG = 1 
       data hash MD5: 32K
       58 48 3B F1 CB 2B 33 2F 6F 48 32 C8 66 57 B6 A2>)
(   5,<2012-08-02 01:12:14.203 -0500>,<Administrator>,<TOPSPIN>,<proc1d>,<TOPSPIN 2.1>,
      <abs ABSG = 2 
       data hash MD5: 32K
       CD 59 A1 BA 54 58 1D CB 8F D2 28 E6 4B 3D C4 0B>)
(   6,<2012-08-02 01:12:14.234 -0500>,<Administrator>,<TOPSPIN>,<proc1d>,<TOPSPIN 2.1>,
      <abs ABSG = 3 
       data hash MD5: 32K
       95 A3 0D C8 D8 F0 A0 F6 63 A4 9B 61 13 3F 99 8A>)
(   7,<2012-08-02 01:12:14.265 -0500>,<Administrator>,<TOPSPIN>,<proc1d>,<TOPSPIN 2.1>,
      <abs ABSG = 4 
       data hash MD5: 32K
       66 82 FC 6A C9 73 39 68 7E 53 A4 68 0D 3A 06 F6>)
(   8,<2012-08-02 01:12:14.296 -0500>,<Administrator>,<TOPSPIN>,<proc1d>,<TOPSPIN 2.1>,
      <abs ABSG = 5 
       data hash MD5: 32K
       80 3C 95 B1 50 E1 40 29 E6 28 23 53 6F 7A E8 09>)
$$ ##END=
$$ 
$$ $$ hash MD5
$$ $$ 8B 94 EF 9E 33 45 BC 40 51 EE EF 3D C3 57 7E AC
##$RELAX= 
##$RELAX= 
##$RELAX= 
##$RELAX= 
##$RELAX= 
##$RELAX= 
##$RELAX= 
$$ Bruker specific parameters
$$ --------------------------
$$ [...]
150 150 150 150 150 150 150 150
##$TP07= 0
##$TPNAME0= <>
##$TPNAME1= <>
##$TPNAME2= <>
##$TPNAME3= <>
##$TPNAME4= <>
##$TPNAME5= <>
##$TPNAME6= <>
##$TPNAME7= <>
##$TPOAL= (0..7)
0.5 0.5 0.5 0.5 0.5 0.5 0.5 0.5
##$TPOFFS= (0..7)
0 0 0 0 0 0 0 0
##$TUNHIN= 0
##$TUNHOUT= 0
##$TUNXOUT= 0
##$USERA1= <user>
##$USERA2= <user>
##$USERA3= <user>
##$USERA4= <user>
##$USERA5= <user>
##$V9= 5
##$VALIST= <valist>
##$VCLIST= <CCCCCCCCCCCCCCC>
##$VD= 0
##$VDLIST= <DDDDDDDDDDDDDDD>
##$VPLIST= <PPPPPPPPPPPPPPP>
##$VTLIST= <TTTTTTTTTTTTTTT>
##$WBST= 1024
##$WBSW= 4
##$XGAIN= (0..3)
0 0 0 0
##$XL= 0
##$YL= 0
##$YMAX_a= 465208
##$YMIN_a= -607874
##$ZGOPTNS= <>
##$ZL1= 120
##$ZL2= 120
##$ZL3= 120
##$ZL4= 120
##$ABSF1= 14.98509
##$ABSF2= -5.573092
##$ABSG= 5
##$ABSL= 3
##$ALPHA= 0
##$AQORDER= 0
##$ASSFAC= 0
##$ASSFACI= 0
##$ASSFACX= 0
##$ASSWID= 0
##$AUNMP= <proc_prof1d_extract_pilot.lims>
##$AXLEFT= 0
##$AXNAME= <>
##$AXNUC= <1H>
##$AXRIGHT= 0
##$AXTYPE= 0
##$AXUNIT= <>
##$AZFE= 0.1
##$AZFW= 0.1
##$BCFW= 0
##$BC_mod= 0
##$BYTORDP= 0
##$COROFFS= 0
##$CY= 15
##$DATMOD= 1
##$DC= 0
##$DFILT= <>
##$DTYPP= 0
##$F1P= 0
##$F2P= 0
##$FCOR= 0.5
##$FTSIZE= 32768
##$FT_mod= 6
##$GAMMA= 0
##$GB= 0
##$INTBC= 1
##$INTSCL= 1
##$ISEN= 128
##$LB= 0
##$LEV0= 0
##$LPBIN= 0
##$MAXI= 10000
##$MC2= 0
##$MEAN= 0
##$ME_mod= 0
##$MI= 0
##$NCOEF= 0
##$NC_proc= -8
##$NLEV= 6
##$NOISF1= 0
##$NOISF2= 0
##$NSP= 0
##$NTH_PI= 0
##$NZP= 0
##$OFFSET= 14.98509
##$PC= 1
##$PHC0= 174.8749
##$PHC1= 0
##$PH_mod= 1
##$PKNL= yes
##$PPARMOD= 0
##$PPDIAG= 0
##$PPIPTYP= 0
##$PPMPNUM= 2147483647
##$PPRESOL= 1
##$PSCAL= 4
##$PSIGN= 0
##$PYNMP= <proc.py>
##$REVERSE= no
##$SF= 400.02
##$SI= 32768
##$SIGF1= 0
##$SIGF2= 0
##$SINO= 400
##$SIOLD= 32768
##$SPECTYP= <>
##$SREGLST= <1H.CDCl3>
##$SSB= 0
##$STSI= 32768
##$STSR= 0
##$SW_p= 8223.68421052631
##$SYMM= 0
##$S_DEV= 0
##$TDeff= 65536
##$TDoff= 0
##$TI= <>
##$TILT= no
##$TM1= 0
##$TM2= 0
##$TOPLEV= 0
##$USERP1= <user>
##$USERP2= <user>
##$USERP3= <user>
##$USERP4= <user>
##$USERP5= <user>
##$WDW= 1
##$XDIM= 32768
##$YMAX_p= 458839256
##$YMIN_p= -767757
##$CURPLOT= <Network HP LaserJet P1505>
##$CURPRIN= <$Network HP LaserJet P1505>
##$DFORMAT= <normdp>
##$LAYOUT= <+/1D_H.xwp>
##$LFORMAT= <normlp>
##$PFORMAT= <normpl>
##$SURQMSG= 1
$$ End of Bruker specific parameters
$$ ---------------------------------
##NTUPLES= NMR SPECTRUM
##VAR_NAME=  FREQUENCY,     SPECTRUM/REAL,   SPECTRUM/IMAG
##SYMBOL=    X,             R,               I
##VAR_TYPE=  INDEPENDENT,   DEPENDENT,       DEPENDENT
##VAR_FORM=  AFFN,          ASDF,            ASDF
##VAR_DIM=   32768,         32768,           32768
##UNITS=     HZ,            ARBITRARY UNITS, ARBITRARY UNITS
##FACTOR=    0.250966925370066, 1,           1
##FIRST=     8223.43324360094, 87654,        -221419
##LAST=      0,             85773,           121341
##MIN=       0,             -767757,         0
##MAX=       8223.43324360094, 458839256,    0
$$ Real data points
##PAGE= N=1
##DATA TABLE= (X++(R..R)), XYDATA
$$ [...]
19486G5049h3480f16C65790j54556k9351l474b05655O4921k8556A0909a63763
19474c45417c9303o2057B59846a80552I1472a30062H1394l3049J12887c14479
19463C13033a21311f0276D8100J2515d39520R9432M2243j16568n2719A10Q8272
19452H8382c27370c3345j70475h3507A92521C7429N4412m2562b6805B89918B4871
19440A38168a18314j22452b4574I6249m111L8148c5820B61354b6562j84214P9063
19429a31713K7648A49417K170a72840B2845a31107A45550h1148C0595h1338J6957
19418f4381D8846a40944m7912L786A2616b88828J12664B12079f8859A40278h5738
19406f0306D9268b78605d4559A09373N0379N0449G0782e0173j5487B76705G161
$$ y = [75049, -83480, -616, 365790, 211234, 181883, 178409, -205655, -140734, -169290, 10909, -163763, -345417, -39303, -101360, 259846, -180552, 91472, -130062, 81394, 48345, 161232, -314479, 313033, -121311, -60276, 48100, 60615, -439520, -340088, -297845, -414413, -467132, 110, 88382, -327370, -33345, -203820, -83507, 192521, 37429, 91841, 49279, -26805, 289918, 24871, 138168, -118314, -240766, -24574, 96249, 92138, 130286, -35820, 261354, -26562, -210776, -131713, -104065, 149417, 151587, -172840, 22845, -131107, 145550, -81148, 30595, -81338, -64381, 48846, -140944, -188856, -185070, 12616, -288828, -176164, 212079, -68859, 140278, -85738, -60306, 49268, -278605, -44559, 109373, 159752, 210201, 70782, -50173, -65660, 276705, 7161]
19394a89725J3490L6452j47297A88152H4130f6347B72660a5982j57916q2112J06727
19383a49283B1977a69507K725f7767m2685d5371m8199D4838K54340B7495b71476
19371a30237j48741B5824b70109M5475M8903F5227d8596B6788J07997O7342b5342
19359g3112E6057J81164b58699A01747h0141r4836d0021A89717b54497Q7998k10906
19348c77405R6516R9690B27936c24902a11359n5722K2482N9033c5124p741k16039
19337b58904j17613A19272b78925A94121g1876a0206l3765A35708d09618A99002
19326I2952N5958H228c4254j09037k03498a58982A12144d06272O2804a41801A59123
19314i6796m8794L1213A36063a7790n1018B4051b35139A75223a15938A62501k9273
$$ y = [-189725, -176235, -139783, -287080, 188152, 84130, -66347, 272660, -15982, -173898, -256010, -149283, 21977, -169507, -166782, -67767, -110452, -45371, -93570, 44838, 299178, 27495, -271476, -130237, -278978, 25824, -270109, -224634, -175731, 65227, -48596, 26788, 134785, 202127, -25342, -73112, 56057, 237221, -258699, 101747, -80141, -174977, -40021, 189717, -254497, -166499, -377405, -280889, -181199, 227936, -324902, -111359, -167081, -144599, -85566, -35124, -42865, -258904, -376517, 119272, -278925, 194121, -71876, -10206, -43971, 135708, -409618, 199002, 92952, 148910, 8228, -34254, -143291, -346789, -158982, 112144, -406272, -343468, -141801, 159123, -96796, -145590, -114377, 136063, -17790, -68808, 24051, -235139, 175223, -115938, 162501, 133228]
19303A33228c99551F9699A4852J62851a01688A02859a92709B54345B9020a58670
19292C1466h4289q6723M3513L0958E1724i5034m5751k76494e8997k53710c6734
19280b043k74953n2946R6315N5054O4043F6166A710b97565l0807J41203N6722
19269a30447C9218f7781j0251j16859M2718A12808E1638d33020D0258a02906i554
19257E9325a43356A29916k3448g5723b2990C9877N4865e3778E1009c1489j50782
19246a82271j16533D3656c01472f7792B50519D1274a08356k4387F7245b51470
19235a09950A56564e6569k09881C65767A52140b90193A1645c25786a22379A87429
19224F1046J69630A2227a14355A3759e6196A39745a46716B8008L138a72335B1505
$$ y = [133228, -399551, 69699, 14852, 177703, -101688, 102859, -192709, 254345, 29020, -158670, 31466, -84289, -171012, -127499, -96541, 51724, -95034, -140785, -417279, -58997, -312707, -36734, -2043, -276996, -329942, -233627, -178573, -114530, 66166, 1710, -297565, -328372, -187169, -130447, 39218, -67781, -78032, -194891, -152173, 112808, 51638, -433020, 40258, -102906, -9554, 59325, -143356, 129916, 106468, -75723, -22990, 39877, 94742, -53778, 51009, -31489, -182271, -298804, 43656, -301472, -67792, 250519, 41274, -108356, -132743, 67245, -251470, -109950, 156564, -56569, -266450, 365767, 152140, -290193, 11645, -325786, -122379, 187429, 61046, 230676, 12227, -114355, 13759, -56196, 139745, -146716, 28008, 31146, -172335, 21505]
19212D6529b14401j4775j95644a23166I2583a33636k7901A62081i6281F3965e1036
19200A03481i1359L183j19179f6128j66595P317F6768b91606C01630b16889a05485
19188h0824B09343h3936B29198K968b79067a09221j28489J17973J5591C3827E379
19176C9327a79285j60053A52944k626m3850b29614M779J2805f6055j18719B48303
19164d3286j15604c4330B30921c32540B42041C5936c58254A73558h9306j66003
19154b55309B06529L1087f9844l4359B20441b75893C4151L8076c01171c2078q192
19143d0270A16495a03197r830l09979B5548M3569f8072C67521j66740a59397A441
19131a10063j9881B9817b12811A60863b95016f399j53915p7000B19962n3988J66989
$$ y = [46529, -214401, -229176, -424820, -123166, 92583, -133636, -161537, 162081, -96281, 63965, -51036, 103481, -91359, -88176, -207355, -66128, -232723, -225406, 66768, -291606, 301630, -216889, -105485, -80824, 209343, -83936, 229198, 232166, -279067, -109221, -237710, -119737, -104146, 33827, 5379, 39327, -179285, -339338, 152944, 150318, 106468, -229614, -224835, -212030, -66055, -184774, 248303, -43286, -158890, -34330, 230921, -332540, 242041, 35936, -358254, 173558, -89306, -255309, 206529, 237616, -69844, -104203, 220441, -275893, 34151, 72227, -301171, -32078, -40270, 116495, -103197, -113027, -423006, 25548, 69117, -68072, 367521, 200781, -159397, 1441, -110063, -129944, 29817, -212811, 160863, -295016, -6399, -160314, -237314, 219962, 165974, 332963]
19120C32963a51766e3779k30802i0265G0925c93517J76004P3783A51217C3732
19109D9310J09578b02281g7885k9267j16180N1375f7131l1476M1071B56983o0594
19098A96389d1982A13331e14342i4451n2132k9905A69912G1099c51570J02639
19088b48931A30138b82448D317b41905a09670B4504c38117B45307D9376a36078
19077b10759B28235b91163G8196M5868J29601a00497q3449d3609k34562A2006
19066a36817A07887c94529E8958K32098A03048c0863j92037d0918j0706A7281
19055E2679K35967b73233h8555c3931p3997l8535D9228k1743j3460d41556a38293
19043d20841G6936l7535J9205f220A05726a6371B33195B2063K32402h4905D8106
$$ y = [332963, -151766, -53779, -284581, -90265, 70925, -393517, -217513, -143730, 151217, 33732, 49310, 158888, -202281, -77885, -107152, -223332, -171957, -67131, -98607, -57536, 256983, 196389, -41982, 113331, -514342, -94451, -146583, -176488, 169912, 71099, -351570, -248931, 130138, -282448, 4317, -241905, -109670, 24504, -338117, 245307, 49376, -136078, -210759, 228235, -291163, 78196, 124064, 253665, -100497, -183946, -43609, -278171, 12006, -136817, 107887, -394529, 58958, 291056, 103048, -30863, -222900, -40918, -51624, 17281, 52679, 288646, -273233, -88555, -33931, -107928, -146463, 49228, 27485, 14025, -441556, -138293, -420841, 76936, 39401, 58606, -6220, 105726, -16371, 233195, 22063, 254465, -84905, 48106]
19031D2747J75306C4435d81202d7558k6184B12883b74999F2460K5854C2151a52618
19019i0024a1101j28172H4529b04485L1711E8518a75931K7364B26203b67209E4926
19007A27337C5687J48677a49634A47937b11850L6157F2102R7772N9996J58079
18997C77949G9291e8427M237C4372b21327B30376b0535b085j69030B6345e0587
18985D2669c8727l0900k81666h712A34847d1544k67364f551A47913L5343F6764
18973f1038K8559E48129j31227K08657B75291G3332h4145M821g595A29309i9587
18961A32168n1138J08684J10247D0796g0239l7717B7851J16431B004i480I6880
18949H695a24133c1211F2699E290N9875N909k6001c8720k21721E0408a21820A33887
$$ y = [42747, 218053, 34435, -481202, -47558, -73742, 212883, -274999, 62460, 88314, 32151, -152618, -90024, -11101, -139273, 84529, -204485, -172774, 58518, -175931, -148567, 226203, -267209, 54926, 127337, 35687, 184364, -149634, 147937, -211850, -175693, 62102, 159874, 219870, 377949, 79291, -58427, -54190, 34372, -221327, 230376, -20535, -2085, -171115, 26345, -50587, 42669, -38727, -69627, -351293, -8712, 134847, -41544, -308908, -6551, 147913, 183256, 66764, -61038, -32479, 548129, 416902, 625559, 275291, 73332, -84145, -79324, -7595, 129309, -99587, 132168, 81030, 189714, 299961, 40796, -70239, -107956, 27851, 144282, 2004, -9480, 96880, 8695, -124133, -31211, 62699, 5290, 65165, 71074, 45073, -38720, -260441, 50408, -121820, 133887]
18936A51189J56906I1298e04351A57788a54223A95508A8900b40517R8750M7020
18926i4747j18085k7377f2023B40582d9417k13228A66629b00662H3933g2873n207
18915g8080A82824B5380c6139o0806B4774C622d3135C65169M51851k50258c2630
18903a54679O3225d2369J6282l2700j34820L7564l11140d9849k28428R3742H5218
18891b33633g2459j46275g7208J9346j09190F2085a20460d3095A67347Q354a04274
18879a15881N4559f603E4929Q740J73315c54843a39045K1813A7009Q3368b62193
18867f4838G0537a25384k9996L8744j6020p3671j49601i7739j78630p5465j749
18856c53583I8a82129g2612j57879Q1156l2200E7935a89360j639A29834c37933
$$ y = [151189, 308095, 91298, -504351, 157788, -154223, 195508, 18900, -240517, -141767, -94747, -212832, -240209, -62023, 240582, -49417, -262645, 166629, -200662, 83933, -72873, -78080, 182824, 25380, -36139, -96945, 24774, 3622, -43135, 365169, 817020, 566762, -32630, -154679, -91454, -42369, -26087, -58787, -193607, -156043, -467183, -49849, -278277, -184535, 85218, -233633, -72459, -218734, -77208, -57862, -167052, 62085, -120460, -43095, 167347, 175701, -104274, -115881, -61322, -6603, 54929, 63669, 236984, -354843, -139045, -117232, 17009, 100377, -262193, -64838, 70537, -125384, -155380, -116636, -132656, -206327, -355928, -97739, -276369, -351834, -353583, 98, -182129, -72612, -230491, -149335, -181535, 57935, -189360, -190999, 129834, -337933]
18844b17055D0783g2075A5186f4261k38676B37272J16953a13338I1173b18705
18833G1155f9660l48308A74683j7515J31967a16344F221f0912E7738a29124j11843
18822b40967A35306j989b53796k7967i1821j45394A63404a29119C09576b22793
18811a35466j40533i947j4634B926J26702K16319a55563A91302e7667j78480C1564
18799A62378A9040K05884A01060J1927a77471p108G7619J39609A4019b12297j05376
18788c17673A99717A9199a18224j4962A29195K2612a48916E469a76846d4184A47497
18776B99746A01959g3795k71822A1533E651b93646B9361a07170k9141Q508A79168
18764e5575A7381F569J0563K21095b28237Q66a03141k55750r3765e7496G3259
$$ y = [-217055, 40783, -72075, 15186, -64261, -302937, 237272, 354225, -113338, 91173, -218705, 71155, -69660, -417968, 174683, 157168, 289135, -116344, 6221, -60912, 57738, -129124, -240967, 135306, 133317, -253796, -281763, -91821, -237215, 163404, -129119, 309576, -222793, -135466, -275999, -9947, -24581, 2926, 129628, 345947, -155563, 191302, -57667, -236147, 31564, 162378, 19040, 224924, 101060, 112987, -177471, -184579, 77619, 217228, 14019, -212297, -317673, 199717, 19199, -118224, -133186, 129195, 151807, -148916, 5469, -176846, -44184, 147497, 299746, 101959, -73795, -345617, 11533, 5651, -293646, 29361, -107170, -136311, -127803, 179168, -55575, 17381, 6569, 17132, 238227, -228237, -227371, -103141, -358891, -452656, -57496, 73259]
18752b9822p013A64356a00502j78565A06856a35586B48204b13472B26898H5389
18741B3657R7324h0463q7381b5757l48381J12692D3618e5739B8014a56921H5185
18729e15612F3685a53560A19098b44513A92892C3859c75551B04309q6378J94320
18719C12251C7289m48b38966P8297M6403j08397B04819g2077m1292n0538H089
18707B45099a92271K264I3508c62633a50808B21348a22324J3588l9343m06555
18697e54634B5387b12818F8993c64227C5899J2940A4375c61026K3013B48733J9276
18686B68009A4895b384r4733j79833P9596O0096B47513D6908P8604b55249J11002
18675a44247N9482K6007A72587j9344a19628J136j41800I4769a43064l3454j52496
$$ y = [-29822, -36835, 164356, -100502, -279067, 106856, -135586, 248204, -213472, 226898, 85389, 23657, 120981, -80463, -167844, -25757, -374138, -261446, 43618, -55739, 28014, -156921, 85185, -515612, 63685, -153560, 119098, -244513, 192892, 33859, -375551, 204309, 117931, 312251, 37289, 36841, -238966, -160669, -114266, -222663, 204819, -72077, -113369, -163907, 8089, 245099, -192271, -190007, 93508, -362633, -150808, 221348, -122324, -108736, -148079, -554634, 25387, -212818, 68993, -364227, 35899, 48839, 14375, -361026, -338013, 248733, 268009, 14895, -2384, -97117, -276950, -197354, -137258, 247513, 46908, 125512, -255249, -144247, -84765, -58758, 172587, 153243, -119628, -118492, -260292, 94769, -143064, -176518, -329014]
18664c29014a60771A7341a45946A13645b74307e4386G5902d91191a73416A84044
18653a84066J3552A21257a31158f269A61990b40795k7358b9303f927B2648h8524
18641A18246J11099e388q9627j14998A6186b85537a33246C6922c42252J01346
18631b40906H5815a8710A47700K2054e6151o3944M4950H6632c5839p5807A63968
18619d39799A7097f778l4154k08028b7223k522j34620c1391D7828J00120Q8375
18608B36323a69025A45818a89951H9547c254B79487a20059p2186f9967l5676A08639
18596f621B95005c03880g5669I2418b20634J6882E7068A1909P5155J1174c37289
18584c622j8001j04357G2093c64365h299A01897J32228b00531d7407A28013a69325
$$ y = [-329014, -160771, 17341, -145946, 113645, -274307, -54386, 75902, -491191, -173416, 184044, -184066, -170514, 121257, -131158, -6269, 161990, -240795, -268153, -29303, -6927, 22648, -88524, 118246, 229345, -5388, -95015, -210013, 16186, -285537, -133246, 36922, -342252, -240906, 85815, -18710, 147700, 169754, -56151, -120095, -75145, 86632, -35839, -111646, 163968, -439799, 17097, -6778, -40932, -248960, -27223, -29745, -164365, -31391, 47828, 147948, 236323, -169025, 145818, -189951, 89547, -3254, 279487, -120059, -192245, -69967, -105643, 108639, -6621, 295005, -303880, -75669, 92418, -220634, -203752, 57068, 11909, 87064, 98238, -337289, -3622, -21623, -125980, 72093, -364365, -8299, 101897, 234125, -200531, -47407, 128013, -169325]
18572A05171b7566I0545a01379j43646L9173j93645A13151a77885H1193N788C6126
18560b93591f195j11765d274l0851j31237P019g5992k02275C47481A6601J66961
18549A83562b32629k1993a08375A02715e8252q5770c8143k67957k0656i7566E9828
18537C2863b55536f4631k14500A41727J8184N3558e1284o0887A02811e6135b7365
18525h9303o6436P6630c1380D11437a53742k9358I6229a93788E0136Q1356h1836
18513h0507B60203j12120a72074Q4530k63717A14252b14374e2919p6732k4274
18503a53925a5748p3148k57025a65264O2296g891A92124c49243h1938D8413a5218
18491D1097a17312j56151Q4784Q4209G5179a48483p1740i0896n051A91975e9634
$$ y = [105171, -27566, 90545, -101379, -245025, -205852, -399497, 113151, -177885, 81193, 86981, 36126, -293591, -6195, -117960, -4274, -35125, -166362, -159343, -75992, -278267, 347481, 16601, 183562, -232629, -254622, -108375, 102715, -58252, -144022, -38143, -306100, -326756, -97566, 59828, 32863, -255536, -64631, -279131, 141727, 159911, 213469, -51284, -112171, 102811, -56135, -27365, -89303, -155739, -79109, -31380, 411437, -153742, -183100, 96229, -193788, 50136, 131492, -81836, -80507, 260203, 148083, -172074, -87544, -351261, 114252, -214374, -52919, -129651, -153925, -15748, -88896, -345921, -165264, -102968, -7891, 192124, -349243, -81938, 48413, -15218, 41097, -117312, -273463, -188679, -104470, 75179, -148483, -220223, -90896, -95947, 191975, -59634]
18479a26085k3500A73959c9041k40348F138J13102i9652j27259E6519b7397n3879
18468h1276j03682j17073n9730a7304k9639F8264a68214b652A90372i7708K7604
18457g0104k12909a21352H7365a51546a4399k48062O5191C59465B9437A4475a78773
18445e706q9798m09750a63566J9714e0594l2803n3407a5275L65C9845a16070A30725
18432e11245f6994k74117G755P3487C8028J08764J07864m2848k3327I2091J0611
18421A02702j5520d8591k31549A21350c08643J12573k46231h6593j7072B01064
18410a65105A15132k0888a2579E6241a33868B26317c7827R878C41561E0348a12124
18398A44096J3567A4039R1824Q2013a37112c715A07063Q2477m1473o4828j0515
$$ y = [-126085, -149585, 173959, -39041, -279389, 6138, 119240, -99652, -226911, 56519, -27397, -81276, -184958, -302031, -361761, -17304, -46943, 68264, -168214, -2652, 190372, -97708, -70104, -283013, -121352, 87365, -151546, -14399, -262461, -197270, 359465, 29437, 14475, -178773, -5706, -95504, -505254, -163566, -143852, -50594, -83397, -136804, -15275, -14910, 39845, -116070, 130725, -511245, -66994, -341111, 7755, 81242, 38028, 146792, 254656, 211808, 188481, 92091, 102702, 87182, -48591, -280140, 121350, -308643, -196070, -442301, -86593, -103665, 201064, -165105, 115132, 94244, -12579, 56241, -133868, 226317, -37827, -27949, 341561, 50348, -112124, 144096, 157663, 14039, 105863, 187876, -137112, -3715, 107063, 189540, 148067, 83239, 72724]
18387G2724Q6350n5862c56916A56689F0834a70808B15365I4081a24328k8067C3678
18375c4380j53876q4503d4975A28758E925a74929f5875d164l65617B54875a24631
18363a17110A59115a62549C36919a8825l0719A0992J08120o617J03059N7495I7040
18351c0951E6369K4512A7535g8776a589l33025A99590m3119f8756A14404c00731
18339A77643k1182M0650a79817N4005j59310c1913r487p7895b6097m9230G0913
18327B49745b06581B9956J04256a08263l08537A36086m9087f406k05457j5640
18317b27503b0226A72495a60679k6716B7096c01475i5552A14913O2893p0737b03904
18305A00220p255b03554g4586C752a13301C28417b14148i1157a3626k38032B27020
$$ y = [72724, 159074, 103212, -356916, 156689, 60834, -170808, 215365, 94081, -124328, -152395, 33678, -34380, -188256, -272759, -44975, 128758, 5925, -174929, -65875, -4164, -369781, 254875, -124631, -117110, 159115, -162549, 336919, -18825, -49544, 10992, 119112, 112495, 215554, 273049, 97040, -30951, 56369, 80881, 17535, -78776, -1589, -334614, 199590, 156471, -68756, 114404, -300731, 177643, 156461, 197111, -179817, -125812, -285122, -31913, -41400, -119295, -26097, -75327, 70913, 249745, -206581, 29956, 134212, -108263, -416800, 136086, 86999, -6406, -211863, -227503, -20226, 172495, -160679, -187395, 27096, -301475, -95552, 114913, 177806, 107069, -203904, 100220, 92965, -203554, -74586, 3752, -113301, 328417, -214148, -91157, -13626, -251658, 227020]
18293A80788b31897C9745a56194k4695j02739I8365f5385K6283G4041J53771j6715
18282B11097a80234q4682a24696A28462J26269c9063D20077D8725M4295A3555
18271d8115k44810D465i2342p8384R804B42869H5217R8233n0938E1371k1807a94058
18258G8984J57800L55922A36596h4039k11018A88094a23208G6694K9395a83293
18247A60670B4707K6206K1128a71840d2871B31448l8400a81002L8942I5146e9248
18235b03100O0271C66581a9610r1982B75219d30732b6210r6531o0720A34248h741
18223C56881f7100F8288a288A78449n3531g1769a0867q0288q7305D0152c45256
18211a54336D5591a19150l11743j30431f3578A66117M6581c36829A30076l8635
$$ y = [180788, -231897, 39745, -156194, -180889, -283628, 98365, -65385, -39102, 74041, 227812, 211097, -180234, -264916, -124696, 128462, 254731, -39063, 420077, 48725, 93020, 13555, -48115, -292925, 4465, -92342, -170726, -160922, 242869, 85217, 183450, 132512, 51371, 29564, -194058, 78984, 236784, 592706, 136596, -84039, -295057, 188094, -123208, 76694, 106089, -183293, 160670, 24707, 50913, 72041, -171840, -42871, 231448, 193048, -181002, -142060, 95146, -59248, -203100, -142829, 366581, -19610, -111592, 275219, -430732, -26210, -122741, -183461, 134248, -8741, 356881, -67100, 68288, -1288, 178449, 124918, -71769, -10867, -91155, -178460, 40152, -345256, -154336, 45591, -119150, -430893, -561324, -63578, 166117, 212698, -336829, 130076, 91441]
18201I1441a03293A22411a98907r1161a5558l1484A56859h2334H7967p719d552
18189f5893r4089j2725A15751j7799b21622C234a11371j17815O6981J8244G4797
18177d1082k43772r198J38870C36440a92045g1908B1764a31600C46837a5770E8719
18165a26406N3093D7390i3026A24969E5292K587L1640b3579D4030a13539B06420
18153A3769L2289K62034M738a43568f3428B07763G9533L7766e6497E51404A18627
18141a57342G912g4129A33005g1047j18912l1268A5525f7058G6235P438K4429
18130A08102b6036j03409A85100a66433g2852C7220c19493F3145c2178C866L22234
18119C26100b53960A12085B781i3754k7746H1127B0623J35270j905j2651d07625
$$ y = [91441, -103293, 122411, -198907, -290068, -15558, -47042, 156859, -82334, 87967, 80248, -4552, -65893, -159982, -172707, 115751, 97952, -221622, 3234, -111371, -229186, -162205, -143961, 74797, -41082, -284854, -294052, -155182, 336440, -192045, -71908, 21764, -131600, 346837, -15770, 58719, -126406, -73313, 47390, -93026, 124969, 55292, 57879, 89519, -23579, 44030, -113539, 206420, 13769, 46058, 308092, 312830, -143568, -63428, 207763, 79533, 117299, -56497, 551404, 118627, -157342, 7912, -74129, 133005, -71047, -189959, -221227, 15525, -67058, 76235, 83673, 108102, -26036, -129445, 185100, -166433, -72852, 37220, -319493, 63145, -32178, 3866, 326100, -253960, 112085, 2781, -93754, -121500, 81127, 20623, 155893, 153988, 141337, -407625]
18107F0638L19976b95276R1268B9996a26602A42406J49266f4897j4731A59095
18096a35420m540j74368J47338B17178q5092L33a77034f7029l600B391b43946
18084d05630a72821q6199i748k79349D8972F85h7557C86954h7212n8894F427Q8209
18072I4636h3328B31896B3669J16531P041n1547Q7940a40428B71438c1743E9519
18060B78636c95489A86894J5735n3374P6666a67687K5329A78428G3506Q755K95018
18049C77279b93353B3961a75169C2328L30134a48559K9307N203A35988h2639B5800
18037f6784n8404O1721B19817a4676j03265A71989B806M11901A57088J06914b04997
18025a71128C0924a92819R5871B38948C7752O3231f4679A91199l3973p3445P4148
$$ y = [60638, 380614, -295276, -204008, 29996, -126602, 142406, 291672, -64897, -79628, 159095, -135420, -139960, -314328, -166990, 217178, 132086, 132419, -177034, -67029, -70629, 2391, -243946, -405630, -172821, -259020, -9748, -289097, 48972, 685, -87557, 386954, -87212, -146106, 6427, 94636, -83328, 231896, 23669, 140200, 147241, 95694, 183634, -140428, 271438, -31743, 59519, 278636, -395489, 186894, 202629, 149255, 225921, -167687, -142358, 178428, 73506, 82261, 377279, -293353, 23961, -175169, 32328, 362462, -148559, -119252, -114049, 135988, -82639, 25800, -66784, -125188, -63467, 219817, -14676, -117941, 171989, 2806, 414707, 157088, 264002, -204997, -171128, 30924, -192819, -96948, 238948, 37752, 100983, -64679, 191199, 157226, 83781, 157929]
18014A57929J45292a7555A13181a90534f2757j4077l6447j2412D4380K87109d00205
18002d05893B18338b44960h1740B6165a50270o1750i6913A21241d0181A59772
17991A7807K09704R9315j53109A229a06628n663o6348a8939B80593a14941A32787
17979h0682j26215C0148M3849B0620a15478A65643f6296j13926D25935j74679
17969B51256F4515K21373C9446J298Q0074b80680A36797b06138A24174b74655
17958g9201j8132k94468b1656M168B00215i6743C7649a62199j91106A65804a005
17946I718f6788l55460a76655B68272C8178b54387A86154b08032B52541a34495
17935A28842D5319J65467r5619Q7721h9470b3143B15841J60502d821l67008A11414
$$ y = [157929, 303221, -17555, 113181, -190534, -62757, -76834, -113281, -125693, 44380, 331489, -400205, -405893, 218338, -244960, -81740, 26165, -150270, -212020, -96913, 121241, -40181, 159772, 17807, 227511, 326826, 173717, 1229, -106628, -112291, -178639, -18939, 280593, -114941, 132787, -80682, -206897, 30148, 73997, 20620, -115478, 165643, -66296, -180222, 425935, 251256, 64515, 285888, 39446, 40744, 120818, -280680, 136797, -206138, 124174, -274655, -79201, -97333, -391801, -21656, -17488, 200215, -96743, 37649, -162199, -353305, 165804, -1005, 9718, -66788, -422248, -176655, 268272, 38178, -254387, 186154, -208032, 252541, -134495, 128842, 45319, 210786, 115167, 202888, -89470, -23143, 215841, 376343, -4821, -371829, 111414]
17923b28553A13380J0713b0030B2075b6127j63285c3615D866P5755l1053J53811
17912B03379a59268P1224B31932g871A48044F5510I319h5094B93165a06755A2181
17900b3254C83834A41321n7180J72411a35985Q262F7635c4998J3756o1253A7439
17888A37985R1294f9562a282A88242f1672D573K8672h9559A17922j7857Q9337
17877A89402a32769q8822i90j04958H5682j1832b49467A02409M254K97994j49546
17866B55111g3790k96422B50602D7056c95992B03665G2648K20244a87494Q8277
17856i9217k9287O098c4989A76834q7735b58895b588B0924e1269A76976o1587
17845A15389a05617A70782a9914C33859A05093a6218l0855A2054L08223G9523
$$ y = [-228553, 113380, 124093, -20030, 22075, -26127, -189412, -33615, 4866, 80621, 49568, 203379, -159268, -88044, 231932, -7871, 148044, 65510, 9319, -85094, 293165, -106755, 12181, -23254, 383834, 141321, 84141, 256552, -135985, -127723, 67635, -34998, -21242, -82495, 17439, 137985, 229279, -69562, -1282, 188242, -61672, 4573, 33245, -89559, 117922, 100065, 189402, -132769, -221591, -990, -105948, 85682, 73850, -249467, 102409, 106663, 404657, 255111, -73790, -370212, 250602, 47056, -395992, 203665, 72648, 292892, -187494, -99217, -128504, -122406, -34989, 176834, 89099, -258895, -2588, 20924, -51269, 176976, 115389, -105617, 170782, -19914, 333859, 105093, -16218, -47073, 12054, 320277, 79523]
17834h4351A1526J72793a80597A2417K09503b05446l7526h9308B83056O1320G1868
17822A43523D3574N6539O2154g5075D4712K0971L38854B8726g6616l2382j11555
17811b20553A88849k861Q0952K4371A7335a45968A36349n7469O4344a30864b0758
17799h928n2296E09175h3147A98791k5661E2800K1592a21041o7709F1722a08674
17787H9527b9838G7646L0541L51680A38699N130E8930J11085L32828A31380J96535
17776C27915C2421a32362D0248b49474b6921A1082Q6635J72133L6904c3690B22244
17764C28511K6402a70903k71220B01252H9988a2427A43239J38657j02049F8240
17753e41731A26894a0146B99243q2657n8696c7487D0939c2952J4299D8791B1897
$$ y = [-84351, 11526, 184319, -180597, 12417, 221920, -205446, -242972, -89308, 283056, 344376, 71868, 143523, 43574, 100113, 162267, -75075, 44712, 65683, 404537, 28726, -76616, -108998, -220553, 188849, 185988, 266940, 291311, 17335, -145968, 136349, 78880, 143224, -130864, -20758, -8928, -61224, 509175, -83147, 198791, 173130, 52800, 74392, -121041, -188750, 61722, -108674, 89527, -29838, 77646, 108187, 459867, 138699, 143829, 58930, 170015, 502843, 131380, 327915, 32421, -132362, 40248, -249474, -26921, 11082, 97717, 269850, 306754, -33690, 222244, 328511, 354913, -170903, -442123, 201252, 89988, -12427, 143239, 281896, 179847, 68240, -541731, 126894, -10146, 299243, 216586, 157890, -37487, 40939, -32952, -18653, 48791, 21897]
17741A19413k838K05982A41182a57645f6245A18725J62461a13429I0472M01057
17731D91529B0312J76574H9871J44891D0148J35897f2038D08749A64317E6587
17720A41230Q139e42876A09953a19620H0064e7137A72222K16482j93314k2543
17710A72847c90351a5315C3327P2889C8160P7057J24858q5068E6116M51387a30745
17698C50135A68681B3128J63503B4474K40516L687B6890J74454J55060A36906
17687c52356B90619B9224h1542q7350G2738L5602f7491E8174k3414J77736a61224
17675C20275O456j28266a06126j21565k8368H9999k350a01627C52519j67708J68582
17664C53393A10562L47141i9365D61701g9446E27344e198B73471b6317F6051e0414
$$ y = [119413, 116575, 322557, 141182, -157645, -66245, 118725, 281186, -113429, 90472, 491529, 20312, 196886, 89871, 234762, 40148, 176045, -62038, 408749, 164317, 56587, 141230, 149369, -542876, 109953, -119620, 80064, -57137, 172222, 388704, 195390, 172847, -390351, -15315, 33327, 106216, 38160, 115217, 240075, 155007, 56116, 507503, -130745, 350135, 168681, 23128, 186631, 24474, 264990, 268677, 26890, 201344, 356404, 136906, -352356, 290619, 29224, -81542, -168892, 72738, 108340, -67491, 58174, 34760, 212496, -161224, 320275, 326731, 198465, -106126, -227691, -256059, 89999, 87649, -101627, 352519, 184811, 353393, 110562, 457703, -99365, 461701, -79446, 527344, -5198, 273471, -26317, 66051, -50414]
17652B686L40507F1507g5386B25254C1650J96428f075A37647b68480O469B67718
17640g7206E3985R5907J45113e5482e778B70740B3807b9062A11029b57969H5135
17628C8596K65979b428D56635F133g5584B54977R1860I7285D0155J75832J82952
17617C98939n8355A0928a03518B62307C6862K09484K55741j26998A23a39638A27954
17605C25032A36139a00669B39264A04943h9896A69293A120K16093L75492A30193
17594a43389D64075a1131j11655C22118G6132a36138E67123E2377a12826A82199
17583C43016a056F220L97704a40647j00198F1357J07588F9454K63218F6513e1672
17571C73378J4284j51142A15548c0028E485J2487M84123A86255J43622A6403J06645
$$ y = [2686, 343193, 61507, -75386, 225254, 31650, 228078, -6075, 137647, -268480, -262011, 267718, -77206, 53985, 149892, 295005, -55482, -5778, 270740, 23807, -29062, 111029, -257969, 85135, 38596, 304575, -2428, 456635, 6133, -75584, 254977, 346837, 97285, 40155, 215987, 398939, 340584, 10928, -103518, 262307, 36862, 246346, 502087, 375089, 123, -139638, 127954, 325032, 136139, -100669, 239264, 104943, -89896, 169293, 1120, 217213, 592705, 130193, -143389, 464075, -11131, -122786, 322118, 76132, -136138, 567123, 52377, -112826, 182199, 343016, -1056, 6220, 403924, -140647, -240845, 61357, 168945, 69454, 332672, 66513, -51672, 373378, 387662, 236520, 115548, -30028, 5485, 17972, 502095, 186255, 329877, 16403, 123048]
17560A23048L99778c418m8132I5379K8020k3951q083a36314B30472b0016C33997
17548A74988a86558A27826C9220K2798J38368P5932J01515A72460P6103r6935
17538A51628L32358K67757l61177o3945j8498K131L8770q1989K1802K94245k27399
17527C55683L71771Q1399K75030J8740K41067p6690n62595K4003L1075j49551
17517F09932j98591j08098r2952N56105j54860M3347M09061L84609j74042j23643
17507A150868j76318j59604O0279A61837N210M15542j77093J94410k38928j18419
17497B42559K07201k16333m341M12515B38991P0453A54087e5470C69958E8043
17486C91250j33302o4829K81881J06938B77857J19726M9810A87167M1593l8778
$$ y = [123048, 522826, -3418, -51550, 95379, 123399, 99448, 91365, -136314, 230472, -20016, 333997, 174988, -186558, 127826, 39220, 62018, 200386, 276318, 377833, 172460, 248563, 151628, 483986, 751743, 390566, 326621, 308123, 310254, 349024, 267035, 288837, 583082, 355683, 727454, 808853, 1083883, 1102623, 1343690, 1267000, 704405, 728408, 759483, 609932, 411341, 303243, 210291, 766396, 611536, 654883, 1063944, 1448553, 1274511, 1150868, 974550, 814946, 875225, 161837, 167047, 582589, 405496, 599906, 360978, 242559, 449760, 233427, 229086, 641601, 238991, 309444, 154087, -55470, 369958, 58043, 391250, 257948, 193119, 475000, 581938, 277857, 397583, 447393, 187167, 228760, 189982]
17476A89982o5013P0031m275J38180p5787j15339n6428K64197E6183i929B20586
17464C59672A7532K34495r0388K43216A34097K96599r0196K07276k52717B1338
17453E41555D2692O10879C20174O5359J50023J76142B96782j00540L29199p5986
17443D49455m9954j02623J90404O0569j89009j1354j6663j19272J06361C0270
17432B57611K42469j11269Q6776J18804k02090j53712N5561J50867K60053O4665
17422G69735A74271R3850N6794J27596j95400o7339m5218J86056A13846L38128
17412D51974J94100k57525j59825M72722l34156k31P805j59996B0730L01374j5278
17401C06826h0297D61072A70443J98305D6537K70435o4864j03541L2835R6222
$$ y = [189982, 124969, 195000, 190725, 328905, 253118, 137779, 81351, 345548, 56183, -9929, 220586, 359672, 17532, 252027, 161639, 404855, 134097, 430696, 340500, 547776, 295059, 21338, 541555, 42692, 653571, 320174, 385533, 535556, 711698, 296782, 196242, 525441, 449455, 399501, 296878, 487282, 547851, 358842, 347488, 330825, 211553, 317914, 30270, 257611, 500080, 388811, 475587, 594391, 392301, 238589, 294150, 445017, 705070, 769735, 174271, 268121, 324915, 452511, 257111, 189772, 144554, 330610, 113846, 451974, 646074, 388549, 228724, 701446, 367290, 367059, 374864, 214868, 20730, 322104, 306826, -80297, 461072, 170443, 368748, 46537, 316972, 252108, 148567, 181402, 277624]
17391B77624A6129L03529H5365K48801m6917J26464b850D7190M57080B16744J04622
17380C21366F4644L47217j71524K1803N4574m1215O0686p937D1484J99970Q2379
17369C23833j43696K75158E4714M22353f450B41668J19883j13880P7040A13627
17358B18102r5513L91116k41949k4675K19336n4913j43465C6500M57479B09979
17347C40774j52486O9279L0676J67686i555D43836a26786C85625j86450K15802
17337D14977d3230B58614L08828G8429K23990n3721a7267E65964C4487L74615
17327D09102D1355L39215M4741A82265K58223j92132K01657J6601F6886K34922
17317C01808A34766O6752q0752J08667J55791j65543J97237K42935n1381B35787
$$ y = [277624, 16129, 319658, 85365, 334166, 287249, 413713, -2850, 47190, 504270, 216744, 321366, 64644, 411861, 240337, 262140, 316714, 275499, 336185, 328248, 41484, 241454, 323833, 180137, 455295, 54714, 477067, -6450, 241668, 361551, 247671, 324711, 113627, 218102, 122589, 513705, 271756, 247081, 466417, 411504, 268039, 36500, 493979, 209979, 340774, 188288, 257567, 288243, 455929, -9555, 443836, -126786, 385625, 199175, 414977, -43230, 258614, 567442, 78429, 302419, 248698, -17267, 565964, 34487, 409102, 41355, 380570, 425311, 182265, 440488, 248356, 450013, 466614, 66886, 301808, 134766, 201518, 120766, 229433, 385224, 219681, 416918, 659853, 608472, 235787]
17306B88614l3123B7772K51667P5012n9223K96560A09351L26516A81736l8541
17296A43195J28898L63989k42732j05515J80085q0222R1927q3250A22354o0696
17286F1658K96441J46621K02610l38472J6828j887M2623j55348A13394C6927M22979
17275D59906N5876k24841J08004j64895Q1204A00681L04526J24592J70406k26402
17265D73803B07535L52223j68993k5812j19700k1670C7038R9625K90165H2747
17254D70813k4855K76502A76593P1874K9239A3451K24747H9742K03794L1605n3825
17243B71316N2534m2146J09883K1398j27596D3636P33164C26498j41713M16379
17233F01164l4941B31577M41214B98716q4330M61739k04819K29530C29500R1517
$$ y = [288614, 255491, 27772, 279439, 354451, 295228, 591788, 109351, 435867, 181736, 143195, 272093, 636082, 393350, 287835, 467920, 387698, 479625, 396375, 122354, 61658, 358099, 504720, 707330, 368858, 385686, 383799, 426422, 271074, 113394, 36927, 459906, 515782, 290941, 398945, 234050, 315254, 100681, 405207, 529799, 700205, 473803, 207535, 559758, 390765, 364953, 245253, 223583, 37038, 136663, 426828, 82747, 470813, 445958, 722460, 176593, 248467, 277706, 13451, 238198, 89742, 293536, 325141, 271316, 323850, 281704, 391587, 412985, 285389, 43636, 776800, 326498, 184785, 601164, 566223, 231577, 672791, 298716, 214386, 676125, 471306, 700836, 329500, 421017]
17223D21017j34567m3143K84660k6710q7164j06535K78725j89613K41825k30822
17213D07673K41400A40271J69786q7622L23121k25601K09467f2552C65965J56850
17203E22815m7963j8276m8925j98901K62839k05701J42953P8554n5798R5409O3033
17192E90039r6113K90621l48198K298R167J54877k6892B50466L20921K84463C97458
17180B51881K16941K81988k76753Q9250R8536j47984l1395L4918j4626J44662
17170F47418j54154j10780K7870J3520L46608j46780k9518B64142K65773K750
17160E32665j04917K46882p8694j15936l6342O5689J24464N4614B48694q6176
17150A62518N26780r2919q7243J82386j00807j22890J10210L18905k87567B57296
$$ y = [421017, 286450, 243307, 527967, 501257, 414093, 307558, 586283, 396670, 638495, 407673, 649073, 140271, 310057, 222435, 545556, 319955, 529422, -62552, 365965, 522815, 474852, 456576, 407651, 208750, 471589, 265888, 408841, 487395, 431597, 527006, 590039, 493926, 784547, 436349, 438647, 447814, 602691, 575799, 250466, 571387, 855850, 397458, 251881, 468822, 750810, 474057, 563307, 661843, 513859, 482464, 517382, 502756, 647418, 493264, 382484, 410354, 423874, 770482, 623702, 594184, 264142, 529915, 532665, 427748, 674630, 595936, 480000, 443658, 509347, 633811, 688425, 248694, 162518, 689298, 596379, 509136, 691522, 590715, 467825, 578035, 896940, 609373, 257296]
17139I09146C50240K28746P8552j26127j26741M44534l97223j53721K33275j01531
17129D30004M48590j26263j96229K14709C82652M24340p7505B03106L05178m0577
17119D67707K5958J66245J78413j50796p0154q8774R2824J29357j32165J51623
17109G70238J01453l61336j29836J81781j99714N49089k0185j34487k52800M69659
17099I73862C51528N9641K03338r949o7814K27853O0413k61953L84558l89443
17089E58172J86251j64592J82607J11661m2536K3973k19310k20292L13036M03019
17079A131989o4265j03767j22581j67974K13790Q3144r4731k5230J81524k53459
17069G78440L20036j61174o9429j95233J12547K16151D68771Q59688n96875J71530
$$ y = [909146, 350240, 578986, 657538, 531411, 404670, 849204, 451981, 298260, 531535, 430004, 878594, 752331, 556102, 770811, 382652, 806992, 729487, 203106, 508284, 467707, 493665, 659910, 838323, 687527, 617373, 528599, 621423, 750780, 618615, 770238, 871691, 510355, 380519, 562300, 362586, 911675, 891490, 757003, 504203, 973862, 351528, 411169, 614507, 604558, 536744, 764597, 825010, 563057, 947615, 558172, 744423, 579831, 762438, 874099, 831563, 855536, 636226, 415934, 728970, 1131989, 1067724, 963957, 841376, 673402, 887192, 970336, 875605, 850375, 1031899, 778440, 1098476, 937302, 867873, 672640, 785187, 1001338, 468771, 1328459, 731584, 903114]
17059I03114q0846J75154j98079Q2115M8240o4743p5444J60661L38737m75690
17049H13219M73404k05736m4146j12850K20824m0475k48910J71675J85396k34745
17039I77656J0822J8183J7973J3889J78160j92246j2766j85578K17971J7420J1665
17028A073149J52351j50230j7355j07761J33478Q798k31192j49279K62750M0417
17018A015126J97304l17875N10220k10816K2756j45251J12294l7155J80247k37552
17008A089298k21414J79731P7182K42166k633n96267N25435o7927L6308r4274
16998A167605L17425k46504J08774L7428J40329k01312P0177J83363j71845P4165
16988A479605l22158L89457r9329L80687n85391K31744j55981m25687O10212k82392
$$ y = [903114, 822268, 997422, 799343, 881458, 929698, 864955, 789511, 950172, 1288909, 813219, 1286623, 1080887, 1036741, 923891, 1144715, 1104240, 855330, 1027005, 1212401, 977656, 988478, 1006661, 1024634, 1038523, 1216683, 1024437, 1011671, 826093, 1044064, 1061484, 1073149, 1225500, 1075270, 1057915, 950154, 1083632, 1092430, 861238, 711959, 974709, 1015126, 1212430, 894555, 1404775, 1193959, 1216715, 1071464, 1183758, 1146603, 1326850, 1089298, 867884, 1047615, 1124797, 1366963, 1364330, 768063, 1293498, 1225571, 1261879, 1167605, 1485030, 1238526, 1347300, 1384728, 1525057, 1323745, 1393922, 1577285, 1405440, 1479605, 1157447, 1546904, 1447575, 1828262, 1242871, 1474615, 1318634, 892947, 1503159, 1220767]
16978A220767j0464L23031j44606m4811L13970o6623l2139l6341K9931J44826
16968A697541l9886J80736J77532m40494l31369M85527p1204M6019O5631L17307
16958B087340j53022j27597O5894l10786J88219l5768J84222l97485L65656K76936
16948B143609k14885r8282K59985M1570k9047l18817K21335J4148j03479L9464
16938A955601Q1407k5865J09063O0457K32462m46906K24118J93614j95817n3618
16928B134516L42292j25067k52325L44640l5901o9091J37827K05542j64564J9802
16918B537671k17619K37522k73364M86864l66862K20446j51344K88866k6577r8633
16908B636970j67316M70583o1756j27714J83861n4322K75956J47329m52912j25726
$$ y = [1220767, 1210303, 1533334, 1388728, 1343917, 1657887, 1591264, 1559125, 1522784, 1552715, 1697541, 1657655, 1838391, 2015923, 1575429, 1244060, 1729587, 1658383, 1704402, 1770033, 2087340, 1934318, 1806721, 1872615, 1561829, 1750048, 1714280, 1898502, 1501017, 1866673, 2143609, 1928724, 1830442, 2090427, 2131997, 2102950, 1784133, 2005468, 2019616, 1916137, 1955601, 2037008, 2011143, 2120206, 2180663, 2413125, 1966219, 2190337, 2383951, 2188134, 2134516, 2476808, 2351741, 2099416, 2444056, 2408155, 2339064, 2476891, 2682433, 2517869, 2537671, 2320052, 2557574, 2284210, 2771074, 2404212, 2624658, 2473314, 2762180, 2735603, 2636970, 2469654, 2940237, 2878481, 2750767, 2934628, 2880306, 3156262, 3303591, 2850679, 2724953]
16898B724953m0194L15716K16852r5586j07304L21439n78376N05080j3952J19817
16888C368445L84891m4369j70100k72982L82810j28623L17548j8696J76519j22680
16878C872763j10898Q2184j01829N7621K81131j44093j41665O84466j19041p0642
16868D289997j77918L91981r9854J77831k9930p1398Q2074R7685j58773M77380
16858D979075J0545j46708J88342L08621k22234L08382J88294k35834R399o5717
16848E322165M63794n1672J33793K88077J31486l75660K31259J4664J74725M2774
16838F375405M36770k3083j64960J68154N77680k91588m8538O6779N00730k26776
16828G370573K09154j08953M09677J0287K46557L07137N3667K99964O7090K10244
$$ y = [2724953, 2684759, 3000475, 3217327, 3121741, 3014437, 3335876, 2757500, 3262580, 3248628, 3368445, 3753336, 3708967, 3538867, 3265885, 3648695, 3520072, 3837620, 3818924, 3995443, 3872763, 3761865, 3844049, 3742220, 3799841, 4080972, 3936879, 3795214, 4479680, 4360639, 4289997, 4112079, 4504060, 4404206, 4582037, 4552107, 4480709, 4562783, 4660468, 4501695, 4979075, 4989620, 4842912, 5031254, 5339875, 5117641, 5426023, 5614317, 5378483, 5387882, 5322165, 5785959, 5734287, 5868080, 6156157, 6287643, 5911983, 6143242, 6157906, 6332631, 6375405, 6812175, 6789092, 6624132, 6792286, 7369966, 7078378, 7029840, 7096619, 7597349, 7370573, 7579727, 7470774, 7880451, 7890738, 8137295, 8444432, 8498099, 8798063, 8865153, 9075397]
16818I075397L51119l62224O01029L36197K2275l14694N99423M93576P7489r0858
16808A0788729N23845L84185K8697J14225K76647M1477J44657O67995L41915k203
16798A3310169L71046N77784J07554L29625O32531J28923K32480M72279J34407
16789A6296798O11423O38327L27734J91937P26371L92026K14621R34421N39695
16780B0873353M57574O75884L63388L74873J207455Q03649M04204Q96012N47751
16771B6604143J156078O43978P33943J270473N39137J016906R76082J010059J098825
16762C5049624J174551J225890J445313J066127J256846J448195J657781J519022
16754D5843349J528515J466483J581199J978562K206495J894754J784971J984433
$$ y = [9075397, 9426516, 9064292, 9665321, 10001518, 10023793, 9709099, 10308522, 10802098, 10879587, 10788729, 11312574, 11696759, 11725456, 11839681, 12116328, 12157805, 12302462, 12970457, 13312372, 13310169, 13681215, 14258999, 14366553, 14696178, 15328709, 15457632, 15690112, 16162391, 16296798, 16908221, 17546548, 17874282, 18066219, 18792590, 19184616, 19399237, 20333658, 20873353, 21330927, 22006811, 22370199, 22745072, 23952527, 24756176, 25160380, 26056392, 26604143, 27760221, 28404199, 29138142, 30408615, 30947752, 31964658, 32940740, 33950799, 35049624, 36224175, 37450065, 38895378, 39961505, 41218351, 42666546, 44324327, 45843349, 47371864, 48838347, 50419546, 52398108, 54604603, 56499357, 58284328, 60268761]
16746F0268761K084591K473212K441318J776269K565546K307351K866473K691464
16738G9474985K586776K508661K769017K913337K553662K610927K511728K735775
16730A00664868K011885K247529K419399J628254K084184J642949J405167J026102
16722A15130337R72859J90709M02758k00972n99148n43973o99655j388448j619332
16713A11645135j538244j888145k129299k149962k409954k528821k491878k526166
16705I3982666k889866k845252k564364k950279k618686k797549k427252k687391
16697G2202027k128272k524389k747389j991406k427502k384639k011720k095823
16689E3890887k019519j909487j488449k093981j124119j579995j460175j881639
$$ y = [60268761, 62353352, 64826564, 67267882, 69044151, 71609697, 73917048, 76783521, 79474985, 82061761, 84570422, 87339439, 90252776, 92806438, 95417365, 97929093, 100664868, 102676753, 104924282, 107343681, 108971935, 111056119, 112699068, 114104235, 115130337, 116103196, 116293905, 116696663, 116495691, 115896543, 115352570, 114652915, 113264467, 111645135, 110106891, 108218746, 106089447, 103939485, 101529531, 99000710, 96508832, 93982666, 91092800, 88247548, 85683184, 82732905, 80114219, 77316670, 74889418, 72202027, 70073755, 67549366, 64801977, 62810571, 60383069, 57998430, 55986710, 53890887, 51871368, 49961881, 48473432, 46379451, 45255332, 43675337, 42215162, 40333523]
16681D0333523j377918j179856j647398j157413p82571j082816j591362q17390
16673C0696799p58332j080032o51477p89271j267085r49956o76745p48735q19861
16664B2955305m93019n27255n32052r45710m05288o44526n06774n05906m2002
16655A8352773r11685j88346n72348n54225j64315o24971j65667q76461o8864
16646A4225891j65644j94050o16063p14791R4746j24422n59717J58797q16057
16637A1288690j78635j25862j11245j95420n03262o9917l02556r1287o90289J80897
16627I201114q2504L6768k07177n04245J04843j24997k55094k91617J74002n69528
16617G481565K27158m37703K569J67587n23962l78130O4157K86532m19520l81453
$$ y = [40333523, 38955605, 37775749, 36128351, 34970938, 34188367, 33105551, 31514189, 30696799, 29938467, 28858435, 28206958, 27417687, 26150602, 25200646, 24523901, 23775166, 22955305, 22462286, 21935031, 21402979, 20457269, 20051981, 19407455, 18900681, 18394775, 18352773, 17441088, 17252742, 16680394, 16126169, 15961854, 15336883, 15171216, 14294755, 14225891, 14060247, 13866197, 13250134, 12535343, 12630089, 12505667, 11945950, 12104747, 11288690, 11110055, 10984193, 10872948, 10677528, 10174266, 10104349, 9801793, 9710506, 9020217, 9201114, 9118610, 9155378, 8948201, 8443956, 8548799, 8423802, 8168708, 7877091, 8051093, 7481565, 7708723, 7271020, 7273589, 7441176, 6917214, 6539084, 6603241, 6889773, 6470253, 6088800]
16607F088800L69786m24656k8830J69163l17257J15559j64200k90461l72295L51284
16597E496893k65925N0022K07792m41895m0135l615o3340k86417j39350k03389
16587D310641O59898n58738k1909k4757L25214m44728j91921j03133Q8655p3830
16577C965392j5377k25649j1869K67755j94826k26912j5467M42457l88830r6125
16567C500549J91388m36165L6734J46386m31010L51715j87105j17279J65503P176
16557C227892j05414o5857N3032n2601j07765k7958P9698k71157n6089q4207j3501
16546B576073K33728j71557j29556l27342N44444n34605K90248L8121J69767j31559
16536B557762M9550m17066J40102j57435j32863K59583J1949J42515j06350k46490
$$ y = [6088800, 6458586, 6033930, 6005100, 6174263, 5857006, 5972565, 5808365, 5517904, 5145609, 5496893, 5230968, 5280990, 5488782, 5046887, 5006752, 5003137, 4939797, 4653380, 4514030, 4310641, 4970539, 4411801, 4389892, 4365135, 4690349, 4245621, 4053700, 3950567, 4039222, 3965392, 3950015, 3724366, 3712497, 3980252, 3785426, 3558514, 3543047, 3985504, 3596674, 3500549, 3691937, 3255772, 3292506, 3438892, 3007882, 3359597, 3172492, 3055213, 3220716, 3227892, 3122478, 3056621, 3109653, 3057052, 2949287, 2921329, 3001027, 2729870, 2673781, 2589574, 2576073, 2809801, 2638244, 2508688, 2181346, 2725790, 2191185, 2481433, 2519554, 2689321, 2557762, 2607312, 2190246, 2330348, 2172913, 2040050, 2299633, 2311582, 2454097, 2347747, 2101257]
16526B101257l0119K39728j49539k89105K55316k10485k25362N56649k54102j31354
16516A862884l83057L92166J40928k77351p7656K98468r2298k98776M4855J71443
16506A781606k59441J40619p0308k9261N9786J37179j36787R1214l12278L15300
16496A717629N66P9071k98153Q6986m0119K7085q7649k18008R7795P9249l58829
16485A085623M09753l02433q474L35381l4943k23631j44625j26583K91310N0492
16475A331870K63758o8307k75541p1614K78982j02985j35021p4509J08330J03861
16465A358824j47136K01497j07053k82882J84330n2092M8377J05456n01414M70816
16455A278723r2165K13501k95069J50438l30009L1587K00257Q046l4860j66711
$$ y = [2101257, 2071138, 2310866, 2161327, 1872222, 2127538, 1917053, 1691691, 2248340, 1994238, 1862884, 1479827, 1871993, 2012921, 1735570, 1657914, 1956382, 1864084, 1565308, 1610163, 1781606, 1522165, 1662784, 1592476, 1563215, 1623001, 1760180, 1623393, 1714607, 1402329, 1717629, 1718195, 1797266, 1499113, 1586099, 1545980, 1573065, 1485416, 1267408, 1365203, 1444452, 1085623, 1495376, 1192943, 1184469, 1519850, 1484907, 1261276, 1116651, 990068, 1281378, 1331870, 1595628, 1527321, 1251780, 1180166, 1459148, 1356163, 1221142, 1146633, 1254963, 1358824, 1211688, 1413185, 1306132, 1023250, 1207580, 1155488, 1203865, 1309321, 807907, 1278723, 1186558, 1400059, 1104990, 1255428, 925419, 957006, 1157263, 1165309, 1130449, 963738]
16445I63738p6478P1274J96872l46193j476L96908k44210q6223J24067K35745
16435A234024l18675P2615J63339k19223k2485K48594l56134Q2933k93110K10580
16425H02458K36074l59547m1577K56828o3912J53822j59229q9775Q4188l86450
16415D32880L47243K28018K92173l33057k38338m6576J32174J01257k41806p9716
16405E94252K79883k12747J47522j08385J67356j12386l5816K23973j05590q5754
16395G52308K13242D76955l040K41451p2489L48150n3602k83704L6639k09868
16385D80492l8918L1481L7662N18972m76095K96929j56641C46842J58074J56856
16375F61772J03230C33299L88045B97691M55853k25720p904K22886k87136j48820
$$ y = [963738, 887260, 958534, 1155406, 809213, 807737, 1204645, 960435, 874212, 998279, 1234024, 915349, 987964, 1151303, 932080, 909595, 1158189, 802055, 884988, 591878, 802458, 1038532, 678985, 637408, 894236, 830324, 984146, 824917, 735142, 819330, 432880, 780123, 1008141, 1300314, 967257, 728919, 682343, 814517, 915774, 673968, 594252, 874135, 661388, 808910, 700525, 867881, 755495, 719679, 943652, 838062, 752308, 965550, 476955, 473915, 715366, 642877, 991027, 937425, 653721, 690360, 480492, 441574, 473055, 510717, 1029689, 553594, 850523, 693882, 346842, 504916, 661772, 765002, 333299, 721344, 297691, 753544, 527824, 519920, 742806, 455670, 306850]
16365C06850M06333o0850n9885j63559N64277k46927k25811J33291k24457L32057
16355G61319L0039j35077B58254M16020j72405o7725P0899k05174L47010l5670
16345F11209j72875j18254K52361L4018j83179J7946j24762K06816p6197K31202
16335F78285l20264j73238M32626B59826J38512I5151N96567k25108O2810m4634
16325D84786m7980o193J23824k44900J72759K0674Q382B25748K08570K86954l41328
16314C79944K8588j04889J67683q0746j54050m4624K0408Q6572Q3465A22844M95474
16303F18318o1473J09701B71923J98127j70942c3594D20417j29193A04797M56715
16293E61512j66791K2611A69056o5485K40989K89948k28710q8434K0644K61266
$$ y = [306850, 713183, 652333, 592448, 428889, 993166, 746239, 520428, 653719, 429262, 761319, 791358, 656281, 258254, 674274, 501869, 434144, 505043, 299869, 646879, 611209, 438334, 320080, 572441, 606459, 423280, 441226, 316464, 523280, 447083, 678285, 358021, 184783, 617409, 259826, 398338, 95151, 691718, 466610, 529420, 484786, 436806, 430613, 554437, 309537, 482296, 502970, 511352, 225748, 434318, 721272, 379944, 408532, 303643, 471326, 390580, 236530, 191906, 212314, 298886, 382351, 122844, 618318, 556845, 666546, 271923, 470050, 299108, -33594, 420417, 291224, 104797, 561512, 394721, 417332, 169056, 103571, 344560, 634508, 405798, 317364, 338008, 599274]
16283E99274n1321j40725j3677j81442K64684B09231N0067N8882M4921j4075L13122
16272F62148A21369L4617J58584R9244J48667r9639o7660O7339A95067J72837
16262C67904H7844K2700J8977K75511j0650j69159R146M2485N12469C79841o5762
16251C14079g98C77738p7904O9808o1746K07435A38021R4974L624J99128j91469
16240B44278J45285j4081j55378a475D04751G231L54963J73681A98655p260K40414
16229D31809A63319j4737O5825N4045L6794q004H0138l7895c6560B56128q0919
16218A75209k473J92685A46971b14386A79561p4051L15568a27679B84498q6804
16208A97694I212L79360A84515c3442I0323J58671J03614f9814C77542I6753J73020
$$ y = [599274, 547953, 407228, 393551, 212109, 476793, 209231, 259298, 318180, 363101, 349026, 662148, 121369, 155986, 314570, 413814, 562481, 462842, 395182, 462521, 195067, 367904, 87844, 110544, 129521, 405032, 394382, 225223, 234369, 276854, 789323, 379841, 314079, -798, 377738, 299834, 369642, 307896, 515331, 138021, 232995, 236619, 435747, 244278, 389563, 375482, 220104, -1475, 404751, 7231, 362194, 535875, 198655, 191395, 431809, 163319, 148582, 214407, 268452, 305246, 297242, 80138, 42243, -36560, 256128, 175209, 172736, 365421, 146971, -214386, 179561, 105510, 421078, -127679, 284498, 197694, 9212, 388572, 184515, -33442, 90323, 248994, 352608, -69814, 377542, 96753, 269773]
16197B69773h4776B31231I5944K55726P6065E4663a8123A28046d6425A30303g8675
16185I2225K18910l6080L0131j50683J86470l7869K32933e8598A80638a75879
16174C13405A16065a27642E1876K03135K43733B28361o5231G6358d0063m0693
16164h0756F3104L86153A52542c4144C0740J70362l2367F8685L68400A23601J71354
16153B94955A31340j4374J41363j07562J01074C4142K53622h4061B24775R2989
16143C17764A305d2326B20980B1060L39721A68425h318r7971A7100M4565N52815
16132F14480a08366B41322k835a14778F036R9125K56225j13280a21179o8555l506
16121a93240j96356C44420A05611a89466j23640Q9458C53419c04370B37832q369
$$ y = [269773, -84776, 231231, 95944, 351670, 427735, 54663, -18123, 128046, -46425, 130303, -78675, 92225, 311135, 275055, 305186, 154503, 340973, 303104, 536037, -58598, 180638, -175879, 313405, 116065, -127642, 51876, 255011, 498744, 228361, 163130, 76358, -40063, -80756, 63104, 449257, 152542, -34144, 30740, 201102, 168735, 68685, 437085, 123601, 294955, 131340, 116966, 258329, 150767, 251841, 34142, 287764, -84061, 224775, 317764, 1305, -42326, 220980, 21060, 360781, 168425, -8318, -106289, 17100, 61665, 614480, -108366, 241322, 238487, -114778, 6036, 105161, 361386, 248106, -121179, -189734, -193240, -389596, 344420, 105611, -189466, -313106, -223648, 353419, -304370, 237832, 229463]
16111B29463H5813b08650A85791j1696a16052A27106J30010G7344L4117J24773
16101B36234E5433K36583d3236A54024E8075L12551a40988A76719E7699M26865
16091D84564B26528N7710a02730A49897E231L4531J58435R9913c8118C5232K2752
16080E7984J86096d668B81240B2536Q1304e6131A99838j0654p011K26813a9950
16068A56806L84814k56743b4817B66450A06492M38301G2621J69658b00643D7771
16057A03031K25434b25630A46431P0729a11443B11748q6113o2669a73360C0866
16046A15737m5900a78290G2760a55313R100D01628A13013K5662g6337K5823l2759
16035h3273E926c05752l2105E9933a72913e9125C5555c7542j1691k29591E9339
$$ y = [229463, 85813, -208650, 185791, 174095, -116052, 127106, 257116, 77344, 111461, 236234, 55433, 292016, -43236, 154024, 58075, 370626, -140988, 176719, 57699, 484564, 226528, 284238, -102730, 149897, 5231, 39762, 198197, 298110, -38118, 35232, 57984, 244080, -4668, 281240, 22536, 103840, -56131, 199838, 189184, 182173, 408986, -19950, 156806, 541620, 284877, -24817, 266450, 106492, 544793, 72621, 242279, -200643, 47771, 103031, 328465, -225630, 146431, 217160, -111443, 211748, 125635, 62966, -173360, 30866, 115737, 69837, -178290, 72760, -155313, -146213, 401628, 113013, 138675, -76337, -50514, -83273, 5926, -305752, -337857, 59933, -172913, -59125, 35555, -37542, -49233, -278824, 59339]
16023b03466h6838D2702J28083b45207N8918H3370c07449B45585b2383a08A84970
16011a40272E7137g8370j18370O9979L0603j0354C21287b35703A6117J42795K81966
16000D40878G7461O4171a58005b0251I1829B3376J1943b67527A24358O691O9288
15989B00337m0828h220D62824M89808K79358l12372M45415m21394l67919k34161
15979C41559A12854k8651O5157I593L0527K13196b50851H5151d0266B68148b33608
15967A83290a66367A25412D2210c14842B34607a01345H7568J21029O0610e0703
15956c3994r518p0453j98263J53281A6061Q2930D5266P4052J30096a03124M7453
15945e5671B7881M16383A72549a8782k3559k79540a6277F2685a84143l28255K24470
$$ y = [-203466, -86838, 42702, 170785, -245207, -186289, 83370, -307449, 245585, -22383, -108, 184970, -140272, 57137, -78370, -196740, -126761, -96158, -106512, 321287, -235703, 16117, 158912, 440878, 77461, 141632, -158005, -20251, 91829, 23376, 35319, -267527, 124358, 131049, 200337, 159509, -8220, 462824, 952632, 1231990, 919618, 1365033, 943639, 575720, 341559, 112854, 84203, 149360, 9593, 40120, 253316, -250851, 85151, -40266, 268148, -233608, 183290, -166367, 125412, 42210, -314842, 234607, -101345, 87568, 208597, 269207, -50703, -33994, -43512, -113965, -312228, -158947, 16061, 98991, 45266, 119318, 249414, -103124, -55671, 27881, 444264, 172549, -18782, -42341, -321881, -16277, 62685, -184143, -512398, -287928]
15934b87928A17593d0465M577n7033b3821C37423a0106j42311A1592c03353d5315
15922a88654d4375K0379l31756i5880j1618F7945a42414d2430k10524j05201a72795
15910A25962E259f6724b9910B45445n1727d75834K04815J33253A01006a65798
15899d9132E6499J24039a97266E9697J53421b80568A67229f7990F4525e1601J3591
15888c8010E2348L2071A5412b24089a1022A07544b03851R8424j42460C3219c061
15876I2808f7528j1710C0231J86758b14279R8976K2462q245H5266a7851r9053
15865a16904C9695b88029a35800A13836b15223D6450K0549J15008d13904J76860
15855b37044D7413O4602b8436l9115I2483K5366b24527C01158P822i1805C66161
$$ y = [-287928, 117593, -40465, -35888, -92921, -23821, 337423, -10106, -152417, 11592, -303353, -45315, -188654, -44375, -23996, -355752, -95880, -107498, 67945, -142414, -42430, -252954, -358155, -172795, 125962, 5259, -66724, -29910, 245445, 193718, -475834, -271019, -137766, 101006, -165798, -49132, 56499, 180538, -197266, 59697, 213118, -280568, 167229, -67990, 64525, -51601, -38010, 52348, 84419, 15412, -224089, -11022, 107544, -203851, -105427, -247887, 33219, -3061, 92808, -67528, -79238, 30231, 216989, -214279, -115303, -92841, -101086, 85266, -17851, -116904, 39695, -288029, -135800, 113836, -215223, 46450, 66999, 182007, -413904, -237044, 47413, 112015, -28436, -67551, 92483, 117849, -224527, 301158, 308980, -91805, 366161]
15843B26626F1054Q5510i6189C71327k5534E8840R10a26520E4278K49334g4763
15831g3002I527l627b85357b383l81341a84878C28871a42324N9548m7505I8710
15819a89339I7838J86178C2816b27535a12538B12548j374N8518d67850h3133n5332
15808a38465e9098r2857d9529E3813J45315G552a12692A86751p8778R8021a27378
15796A52502A1066K49468q8235a57498D05537c0784H1042J44460b3661l23061
15786c46722J24151M344f6543k38441j26108a59138C41818D1372b04988i3322
15775a06343q2628b9680j93718D4701a05926I794b36540H9138a60255M4214A67962
15763a463j77158J6640b1760k01627A35488k6087i8657b3287E7040a98124f2760
$$ y = [226626, 61054, 146564, -96189, 371327, 345793, 58840, 59750, -126520, 54278, 303612, -74763, -73002, 9527, 5900, -285357, -2383, -383724, -184878, 328871, -142324, -82776, -130281, 98710, -189339, 97838, 284016, 32816, -227535, -112538, 212548, 211174, 269692, -467850, -83133, -138465, -59098, -151955, -49529, 53813, 199128, 7552, -112692, 186751, 107973, 205994, -127378, 152502, 11066, 260534, 172299, -157498, 405537, -30784, 81042, 225502, -23661, -346722, -222571, -218227, -66543, -304984, -431092, -159138, 341818, 41372, -204988, -93322, -106343, -188971, -29680, -223398, 44701, -105926, 9794, -236540, 89138, -160255, -116041, 167962, -1463, -178621, -161981, -21760, -223387, 135488, 109401, -98657, -23287, 57040, -198124, -62760]
15751B03861k92f3817A30955K21026a52524E1815a52312L5918k2293k677A25917
15739B38570b08979C52893a71894j63578d9124p507j6372D6094a13062A23856
15728B7678Q4042B9027g88j56950q7806i2368M1125k23136A89997k1427a36014
15716B50236G4695j772a45596f5631A75788a17776j03577F6527a36280G2364j7105
15705E5259K86496a6988o7871m785l57034F4733a06748K9253A34526B8311K85436
15694C13747a8481n4767A97926a94004i1181A83336P686g2540D01562a02090J5335
15683h6755J8347l8755D6584c36028g6p0417B70461q6074J02103a34215A23685
15671D1844K1427j6222O1906K8665j2207N7897J437a06805B55314a1841l7382
$$ y = [203861, 203569, -63817, 130955, 351981, -152524, 51815, -152312, -116394, -138687, -141364, 125917, 238570, -208979, 352893, -171894, -335472, -49124, -56631, -73003, 46094, -113062, 123856, 27678, 111720, 29027, -788, -157738, -245544, -92368, -51243, -274379, 189997, 168570, -136014, 250236, 74695, 72923, -145596, -65631, 175788, -117776, -221353, 66527, -136280, 72364, 55259, 341755, -16988, -84859, -89644, -446678, 64733, -106748, -77495, 134526, 28311, 313747, -18481, -73248, 197926, -194004, -91181, 183336, 191022, -72540, 401562, -102090, -86755, -68408, -107163, 46584, -336028, -76, -70493, 270461, 184387, 286490, -134215, 123685, 41844, 63271, 47049, 108955, 137620, 125413, 183310, 184747, -106805, 255314, -11841, -49223]
15660d9223G7448f8148J5452j51326H1855a61022d1362J8949l72986C92018c9329
15648g1826k22257c5873o354C4738q956a0665A12942m2052b62127A74922G8408
15636a865k50395b2848C6787P6135m6879a7538A50748c35716B77723A9535a61142
15624f5428k67310J22743I2461a18123E0456O5381b38262A56950G0299i8116B03385
15612d99097L9246a84809j33857a12344E9789B0914e74239d3981k45611J1372
15602b78220D3269a65465p1167A52316q83m1112a83895A81756H3129b88080d4868
15590b33341A14864r34m4250B6778O0692c0664n7507K5581B31907a09276e2069
15578B91351A21258J82164a00227C79138c8991A36422b78942k518J20037l5594
$$ y = [-49223, 77448, -68148, -52696, -204022, 81855, -161022, -41362, -22413, -395399, 392018, -39329, -71826, -294083, -35873, -42227, 34738, 25782, -10665, 112942, 70890, -262127, 174922, 78408, -1865, -252260, -22848, 36787, 112922, 66043, -17538, 150748, -335716, 277723, 19535, -161142, -65428, -332738, -209995, 92461, -118123, 50456, 115837, -238262, 156950, 70299, -98116, 203385, -499097, -459851, -184809, -318666, -112344, 59789, 20914, -574239, -43981, -289592, -278220, 43269, -165465, -236632, 152316, 151433, 110321, -183895, 181756, 83129, -288080, -44868, -233341, 114864, 113930, 69680, 26778, 87470, -30664, -88171, -62590, 231907, -109276, -52069, 291351, 121258, 303422, -100227, 379138, -38991, 136422, -278942, -281460, -161423, -197017]
15568a97017a2521D8816d41073J62786B30649g9805A7422b05330B8719P0635h0753
15556A2790a985B50412L6482c0129B9410J08669g1422J9346b0161G3218K87782
15545C61000n5240i217I2432E860K75457c67804B2331J27309O3763a97834A72837
15533a30578D148K18816i2802A00069b14507A82134q2183k3828C6558a46880A8251
15521i9511A66611p165E5401a47072B43052n097j10961r871J43497B9350a4157
15509B09726a18151E09520q8714j0526G5185B3371K15519b3187C83215J81773
15499E64988e9286B12606A05953C1316a3575D44984B00969A3866a21558A50114
15488I1772M6342a33333j41557g4620j2959P621A9531K993M5658d4467C86386
$$ y = [-197017, -12521, 48816, -441073, -278287, 230649, -79805, 17422, -205330, 28719, 99354, -80753, 12790, -1985, 250412, 286894, -30129, 29410, 138079, -71422, -52076, -20161, 73218, 361000, 305760, -9217, 92432, 5860, 281317, -367804, 22331, 149640, 213403, -197834, 172837, -130578, 4148, 222964, -92802, 100069, -214507, 182134, 99951, 76123, 36558, -146880, 18251, -99511, 166611, 159446, 55401, -147072, 243052, 237955, 126994, 117123, 260620, 29350, -14157, 209726, -118151, 509520, 420806, 410280, 75185, 23371, 238890, -23187, 383215, 564988, -59286, 212606, 105953, 31316, -13575, 444984, 200969, 13866, -121558, 150114, 91772, 138114, -133333, -274890, -74620, -87579, -79958, 19531, 22524, 68182, -44467, 386386]
15476B36108A15910K34256M86236J40608l32133j79741A74912J04975G8891b27385
15465A78124F9557b5399A16806E423R9844P0694q893K29790E7198N0484M9475
15454A57157b7511A3432M9906A1995c06016J37425A03329K79153j88411C4883
15443B13287K92991N63945J59825J9642J40976n42608k09819A25578g432H057
15432h9682F9082J58834b49206e5740A66012b46185a2111E2600J07742G027a49277
15420A44145o6963b49126A76845c04712A19788J47322a61274P498A33761a97687
15409c1571E3968M3474R4920b33625C0211b17310G8708d0639A02014m4015c21611
15397E1826b84252R9406K6246B56563a52220M1023e2424I8402L9159P8065b4540
$$ y = [236108, 115910, 350166, 836402, 977010, 644877, 465136, 174912, 279887, 78891, -227385, 178124, 69557, -25399, 116806, 5423, 105267, 175961, 167068, 396858, 57198, 107682, 157157, -27511, 13432, 63338, 11995, -306016, -168591, 103329, 382482, 194071, 34883, 213287, 506278, 1070223, 1230048, 1249690, 1390666, 848058, 638239, 125578, -7432, 8057, -89682, 69082, 227916, -249206, -55740, 166012, -246185, -12111, 52600, 160342, 7027, -149277, 144145, 77182, -249126, 176845, -304712, 119788, 267110, -161274, -153776, 133761, -197687, -31571, 53968, 97442, 192362, -233625, 30211, -217310, 78708, -40639, 102014, 57999, -321611, 51826, -284252, -184846, -158600, 256563, -152220, -111197, -52424, 98402, 137561, 215626, -24540]
15385B34994b8835B9256R7459h5238E5609i4795B0959b36983A15967c3929D5650
15373A7847L14528j17850B7075J10913D4654K15100r7030J91244A17601J34869
15363B52470m1147O1844G5148L37662A75786a56236A59894D2099K56204J764j49748
15352A50319n6717J86315M98B5027K34012F1898M24250k07069o0751d4602E26297
15340E84895j97946j16762J74093k00566C485J8873o141a40511A79740O728K01487
15329C87955a06408B73440K58016q6950j44580q6205H1115R9978J9387o5567D39
15317B52863c0211A7537F733L8357K7280b9970C12941A02286J34818H6045K22198
15306C08243j10748R7405p2030a38254A73837o7522J63611n5682J13472A58923
$$ y = [234994, -28835, 29256, 126715, -85238, 55609, -94795, 20959, -236983, 115967, -33929, 45650, 17847, 332375, 214525, 27075, 137988, 44654, 259754, 162724, 353968, 117601, 252470, 211323, 273167, 75148, 412810, 175786, -156236, 159894, 42099, 298303, 300067, 150319, 93602, 279917, 280415, 25027, 259039, 61898, 486148, 279079, 218328, -44602, 526297, 584895, 386949, 270187, 444280, 243714, 3485, 22358, 16217, -140511, 179740, 186468, 387955, -106408, 273440, 531456, 444506, 299926, 213721, 81115, 181093, 200480, 134913, 439, 252863, -30211, 17537, 6733, 45090, 72370, -29970, 312941, 102286, 237104, 86045, 308243, 197495, 294900, 222870, -138254, 173837, 106315, 269926, 214244, 327716, 158923]
15295h5995B03613D7584J36162d0912q1477C81326i2053j4280k48280c7881E1132
15283g880I312e29469e715B39419a3228G5984J14817N2787b37680O5097H8924
15271c0719B6227J49855K06346C4581K25914D0757J79181a55488c798D61096j98884
15260B62212j03641J26987b57138A00469J67675j13931K33448A0056K10879i1059
15249A14313K40112j57226O0515a99965A78776d133B29313O60407Q06473K6718
15239A722911l27551O72746H79845l21314G6563L8408O4916j8204J70326J01269
15229D33278J1952j18100a03823I2938K24469G0223J4138L73095j60981A22423
15218C44964a4758A00922A4495a14551K4674G6333P5339C2925J3068J46496k7697
$$ y = [-85995, 203613, 47584, 183746, -40912, -122389, 381326, -92053, -106333, -354613, -37881, 51132, -7880, 9312, -529469, -5715, 239419, -13228, 75984, 190801, 243588, -237680, -172583, 88924, -30719, 26227, 176082, 382428, 34581, 260495, 40757, 219938, -155488, -3798, 461096, 262212, 158571, 285558, -257138, 100469, 268144, 154213, 387661, 10056, 220935, -91059, 114313, 354425, 197199, 257714, -199965, 178776, -4133, 229313, 889720, 1696193, 1722911, 1395360, 2068106, 879845, 558531, 76563, 114971, 179887, 161683, 332009, 433278, 445230, 327130, -103823, 92938, 317407, 70223, 84361, 457456, 296475, 122423, 344964, -14758, 100922, 14495, -114551, -89877, 76333, 151672, 32925, 45993, 192489, 164792]
15207A64792a42085G149a9439j6114j0810C07417a42107L5877K1623r3536A06268
15195B39634o8061J13890b78689B04673H9296K95085b09039a4820B81084j17247
15185A63837N4901F2500A7964L5343a29267F2385M4838J7465L8946q1657P3172
15174A55149E0303L145a23336d5318E1848J95305d6721H3113j1476M5898l9791
15163G7744M7685j0048k6024a05219A50287A4031m550M7635L2692L2439K03030
15152C25277a61735I8407a61530A39382a31057C56998A75687d030j32122B45245
15141C91300n3383N4687F2587J91480a35947A09041J84376B3994J26428K50644
15131D01066G0653O1462i1881A12234J55346e9279B350a5546B76925P0432A06260
$$ y = [164792, -142085, 7149, -19439, -35553, -46363, 307417, -142107, -106230, -84607, -178143, 106268, 239634, 171573, 285463, -278689, 204673, 89296, 384381, -209039, -14820, 281084, 163837, 218738, 62500, 17964, 53307, -129267, 62385, 107223, 124688, 163634, 81977, 155149, 50303, 53448, -123336, -45318, 51848, 247153, -46721, 83113, 71637, 117535, 77744, 125429, 115381, 89357, -105219, 150287, 14031, 9481, 57116, 89808, 122247, 325277, -161735, 98407, -161530, 139382, -131057, 356998, 175687, -4030, -136152, 245245, 391300, 337917, 392604, 62587, 254067, -135947, 109041, 293417, 23994, 150422, 401066, 70653, 132115, -91881, 112234, 267580, -59279, 2350, -15546, 276925, 347357, 106260]
15119B23050J37814J54119P3204J39383C24091C856K79832f3256D18409e2972
15108B15240J20516L4531D8287H966e9288a386A78984k0827O3868K6261E4339
15096A2316J28516F8876J76638j0632n426K39179I2156J37302D5527J1506O5464
15085A22497J08708O7092o7206m4747Q9336m7265F0092J11423P4024r6560L02519
15074D51498m1585j67083q4663i953C72849C9875J01267k9130C6555O2969K72882
15063C72406A13026K62016p5107G8743K22887I8619m6071M94504k46388J43233
15053D43897A44856L61429k34461J55681M09270B10611O9500J29495j77422J81898
15043D14082B265M34841k402K323j10646n9135R3129L6501D6418K13135K85806
$$ y = [223050, 360864, 514983, 588187, 727570, 324091, 3856, 283688, -63256, 418409, -52972, 215240, 335756, 370287, 48287, 8966, -59288, -1386, 178984, 158157, 222025, 248286, 54339, 12316, 140832, 68876, 245514, 234882, 229456, 468635, 92156, 229458, 45527, 57033, 122497, 231205, 298297, 231091, 186344, 275680, 228415, 60092, 171515, 245539, 148979, 451498, 409913, 242830, 158167, -9953, 372849, 39875, 141142, 112012, 36555, 99524, 372406, 113026, 375042, 299935, 78743, 301630, 98619, 52548, 547052, 300664, 443897, 144856, 506285, 271824, 427505, 836775, 210611, 280111, 409606, 232184, 414082, 2265, 437106, 434704, 437027, 326381, 267246, 360375, 396876, 46418, 259553, 545359]
15032E45359j96303L33135J00884q8932N73997E77798K76503C19944k975q2084
15022B34885L15809j4412K80611j6080C29223Q7048Q1719j03047K36450j43729
15012D87664K00626k972l09633K55661K45493D15501J83780k60293q2805K67667
15002E23850k56374K44849B41357N44247k73978N3523Q6083j91155J73775o0733
14992E73119j52610L40539K676N7836C22406M70637r2790j2295p6403J65164L28654
14981A105373j59187K5384J18790D57600J22234K11953K1929C94979J38071O22186
14971A155236k74692l69597J52412j88440L2344B00701J06668J05564M1830A89043
14960C58378A77479R3231m2196l6302P0349J35896K60536i7429E85336B51279
$$ y = [545359, 349056, 682191, 783075, 694143, 1268140, 577798, 854301, 319944, 316969, 234885, 550694, 536282, 816893, 800813, 329223, 416271, 497990, 394943, 631393, 487664, 688290, 685318, 375685, 631346, 876839, 415501, 599281, 338988, 256183, 523850, 267476, 512325, 241357, 785604, 511626, 565149, 651232, 460077, 633852, 573119, 420509, 761048, 763724, 821560, 322406, 793043, 700253, 687958, 611555, 776719, 1105373, 946186, 971570, 1090360, 457600, 579834, 791787, 813716, 394979, 533050, 1155236, 880544, 510947, 663359, 474919, 507263, 200701, 307369, 412933, 454763, 189043, 358378, 177479, 270710, 228514, 192212, 262561, 398457, 658993, -97429, 585336, 251279]
14949D61374p4532k6079A48097J47452K97113M2076N31391l45123K7471r2187
14939G56290j57607B66486L06676n3630J33967J20044k12244L30409M78022k74232
14929A095498J44365M17970K09556j90084K64434O7518j44963k32457j23552J94849
14919A703134M51749j94216O31738K49191m06439k08105m03769l19561r9716k6873
14909A377133E65655K3258N4558n5128J8773P8372j08452A91140N76781B89346
14898H30576k75684l9194j76545K12006p086B52447J79903K37196j9371J00686
14888G50861B09879K55887K4492J63371P0662J22483J10513j78941J65453J10799
14878A054598J04712E54177q1666L40519j47243L7436o8656j99648J53374B76528
$$ y = [461374, 386842, 360763, 148097, 295549, 592662, 634738, 1166129, 821006, 848477, 756290, 598683, 266486, 573162, 519532, 653499, 773543, 561299, 891708, 1369730, 1095498, 1239863, 1657833, 1867389, 1677305, 1941739, 2009257, 1864294, 1631837, 1508285, 1703134, 2154883, 1960667, 2592405, 2841596, 2435157, 2227052, 1823283, 1503722, 1404006, 1377133, 565655, 588913, 643471, 588343, 607116, 685488, 577036, 191140, 767921, 289346, 830576, 554892, 515698, 339153, 551159, 544073, 252447, 432350, 669546, 650175, 750861, 209879, 465766, 490258, 653629, 724291, 846774, 957287, 778346, 943799, 1054598, 1159310, 554177, 472511, 813030, 665787, 703223, 634567, 434919, 588293, 276528]
14867E89634J28826J49989j54680J66006j0096m21641J28007J56959j09428q3239
14857E40337J3751q2260J55442j23676J53859j98446j49726L17368J25222j99818
14847E52053L21876k61160J5860L56194K11668J64379k65203M6737m8623j7121
14837A076660K09266l22475J74807E21198J28642k23831K57683k15928L37305
14828H05069O9799j51344j25300K20962j60573Q6723C46869M27369j95965L87045
14818I65318m16769O8536J90746J15453J5017K61928C72960K55931j05486L80000
14808I03405k98898J16408M20279J43565k51635l14237J47062j31090l0536k04627
14798D99696j82361N49035m14660K41223k40611R1882N6092J47867j08393J32186
$$ y = [589634, 718460, 868449, 713769, 879775, 869679, 448038, 576045, 733004, 623576, 540337, 554088, 471828, 627270, 503594, 657453, 459007, 309281, 626649, 751871, 552053, 873929, 612769, 628629, 984823, 1196491, 1360870, 1095667, 1142404, 1093781, 1076660, 1285926, 963451, 1138258, 521198, 649840, 426009, 683692, 467764, 805069, 874868, 723524, 598224, 819186, 658613, 745336, 346869, 774238, 578273, 965318, 548549, 617085, 807831, 923284, 938301, 1200229, 372960, 628891, 523405, 903405, 604507, 720915, 1141194, 1284759, 1033124, 718887, 865949, 734859, 704323, 499696, 317335, 866370, 451710, 692933, 452322, 544204, 600296, 748163, 639770, 771956]
14788G71956L27516m18784J90356m05646J00478k57267M29221k17174K49138L75788
14778A145582k60719j46296L03727J3849J57648j71444k58529J55038j51525l46511
14768D40820J22433J38030j36283m8454R2392K66856j76431J7042J18057l33724
14758E00738K05153R0284j98469K26492j11757Q5504k76902L56079k0905j11918
14748G44299j24010J45848j9532J14568j16296P7928k92468K98653j64793L18034
14738I82231j25272L23427l98349J69714k0525N5124K01678K42401o3111R675
14728A376993M53870J10477O47569o76256r6255m72051k02486m326J83958l78103
14718I43390m29948N64557j1033k10556O4629k47047M14573k02574O3950J48956
$$ y = [771956, 1099472, 680688, 871044, 465398, 565876, 308609, 737830, 520656, 769794, 1145582, 884863, 738567, 1042294, 1056143, 1213791, 1042347, 783818, 938856, 787331, 440820, 563253, 701283, 565000, 516546, 608938, 875794, 699363, 716405, 834462, 500738, 705891, 796175, 597706, 824198, 712441, 797945, 521043, 877122, 856217, 744299, 620289, 766137, 746605, 861173, 744877, 822805, 530337, 828990, 664197, 982231, 856959, 1180386, 782037, 951751, 931226, 986350, 1188028, 1430429, 1367318, 1376993, 1830863, 1941340, 2588909, 1912653, 1816398, 1344347, 1141861, 1137535, 1321493, 943390, 513442, 1077999, 1066966, 856410, 921039, 673992, 1088565, 885991, 949941, 1098897]
14708A098897j86948L3313L28497k8433K42890N2814M09704J89212K363j17913
14698B024396l80402k86495J37909n07755j21875L15663Q6130m31645L08281l16801
14688H27406P5515K73911j95359K23558m65351L90754K99413l87402j19598J02272
14678A025119r8701o0846O166K09859j81492n9011J05011K9588j4397J20178k68463
14667H13011K33453k18970R8082q3946J85185n229j30817J20929j34985J09760
14657I86473J40300N174J50333J16568M05911j37323n2151j90629j40848K81929
14647A565737k72717p9763J40492m19354K63866j31147L03662j37896K6528q3313
14637A176095L16312l18822K78120m5608n0524L292Q2224J86945j69118O3985
$$ y = [1098897, 911949, 945262, 1273759, 1245326, 1488216, 1541030, 1950734, 2139946, 2142309, 2024396, 1643994, 1357499, 1495408, 987653, 865778, 1181441, 1267571, 835926, 1144207, 827406, 902921, 1176832, 981473, 1205031, 739680, 1130434, 1429847, 1042445, 922847, 1025119, 926418, 865572, 871738, 1081597, 900105, 841094, 946105, 975693, 961296, 1081474, 813011, 1046464, 827494, 925576, 841630, 1026815, 1021586, 890769, 1011698, 876713, 986473, 1126773, 1131947, 1282280, 1398848, 1804759, 1667436, 1615285, 1424656, 1283808, 1565737, 1293020, 1213257, 1353749, 934395, 1198261, 1067114, 1370776, 1232880, 1259408, 1176095, 1492407, 1173585, 1451705, 1406097, 1355573, 1358865, 1441089, 1628034, 1458916, 1522901]
14627A522901k65317j3220K9173O8550M5844P2430k39723q8257K69799L91949
14617A794129m14310L80337l20550r8700L01116k09141J49151l26049L89513l74794
14607A270702J25054Q1301K54616j05689J22314J14042k58101K50756j41764L4728
14597A747959j22922P4368J65838r6603N6665Q8314j07054k7138k085r6219r3099
14586A588024P9320J33039J96424l82455J96358k44602M23812k50262N51565r7298
14576B193925j35045k17798K01812K6457J76557k93874K04734M03384k11949J49327
14566B497530k09643n9822q0798M27919j1871l14500M32745K33312R1784k5304
14556B981352O1058L24414q2060M85076L65976M50975R78205J442827L490975
$$ y = [1522901, 1257584, 1244364, 1273537, 1342087, 1387931, 1460361, 1220638, 1132381, 1402180, 1794129, 1379819, 1760156, 1439606, 1340906, 1642022, 1432881, 1582032, 1255983, 1645496, 1270702, 1395756, 1477057, 1731673, 1625984, 1748298, 1862340, 1604239, 1854995, 1713231, 1747959, 1625037, 1699405, 1865243, 1768640, 1825305, 1913619, 1806565, 1779427, 1777342, 1681123, 1588024, 1667344, 1800383, 1996807, 1614352, 1810710, 1566108, 1989920, 1739658, 2291223, 2193925, 2058880, 1841082, 2042894, 2069351, 2245908, 1952034, 2156768, 2560152, 2348203, 2497530, 2287887, 2228065, 2147267, 2575186, 2563315, 2248815, 2681560, 2914872, 3006656, 2981352, 3042410, 3366824, 3284764, 3769840, 4135816, 4586791, 5564996, 7007823, 10498798]
14547A0498798Q082055J9659528K205802A9382730I373019m279609j270672o76101
14539C146637k9932K33480J414321R52905j968738q20334l50921k4674n7521n0874
14529B444349J5972J07504j73850l57402J42876L18930J3243j11892K61844m11468
14519B250106K35057K40045l4911Q0769j08316k9503J73507l41038L09491M33379
14509C208586l50303J4221p1053K49395K3655J71469J7270R9677k22613J25510
14499C265814J55625J71317n12488K95827j6686m0070L18640j34382K93218j95792
14489C601023n6177O3473R4195K80361l37767K34191j98097J67182L13926j61621
14479D000689J55524R3910m31076M29944L7002r1409L81983l21953K68904J62709
$$ y = [10498798, 18580853, 38240381, 40446183, 19382730, 9373019, 5093410, 3822738, 3146637, 3116705, 3350185, 4764506, 5717411, 3748673, 2928339, 2577418, 2552744, 2495223, 2444349, 2460321, 2567825, 2393975, 2036573, 2179449, 2498379, 2511622, 2399730, 2661574, 2250106, 2485163, 2725208, 2690297, 2771066, 2662750, 2633247, 2806754, 2465716, 2775207, 3208586, 2858283, 2872504, 2801451, 3050846, 3074501, 3245970, 3263240, 3362917, 3140304, 3265814, 3421439, 3592756, 3080268, 3376095, 3359409, 3319339, 3637979, 3503597, 3796815, 3601023, 3544846, 3608319, 3702514, 3982875, 3645108, 3879299, 3681202, 3848384, 4162310, 4000689, 4156213, 4250123, 3819047, 4248991, 4285993, 4194584, 4576567, 4254614, 4523518, 4686227]
14469D686227j45321J95951J39132q9687J02673k59146j25202J64704J6227M15446
14459E101004O5942j26367j78806K81780L57437L550n37k22575N3960M53958M8720
14448E838066R6216R508j75567j5736N22844m10556L68958j33015J15769K58734
14438F475221N2486j76854J43623L95451P3992k94026K67918L22559N2469j65738
14428G147101R1840l7958q8594O52300M2425J86609L23722J58899K63357n4531
14418H685170K19773l60367J69463L46965k80537K25212n3632K58484K01631K98327
14408I710489j57230K31455N80880K42249J20243m55667M71940k86444K39541
14399A0697456M69620j01538M74620j42201N30546j47070J36398L18250N51078
$$ y = [4686227, 4540906, 4736857, 4875989, 4786302, 4888975, 4629829, 4504627, 4669331, 4685558, 5101004, 5166946, 5040579, 4861773, 5143553, 5500990, 5504540, 5504003, 5281428, 5335388, 5789346, 5838066, 5934282, 5943790, 5768223, 5752487, 6275331, 5864775, 6233733, 6100718, 6216487, 6475221, 6527707, 6350853, 6494476, 6889927, 6963919, 6669893, 6937811, 7260370, 7312839, 7147101, 7238941, 7200983, 7112389, 7764689, 7807114, 7993723, 8317445, 8476344, 8739701, 8685170, 8904943, 8544576, 8714039, 9061004, 8780467, 9005679, 8952047, 9210531, 9412162, 9710489, 9553259, 9784714, 10365594, 10607843, 10728086, 10272419, 10744359, 10457915, 10697456, 11167076, 11065538, 11540158, 11397957, 11928503, 11781433, 11917831, 12236081, 12787159]
14390A2787159n7660J13496R690O12621L30951J60849L42676M4661M97919K48360
14380A5090722K26565M2422L27154M99101o4736M17377J27719M23792M64233J26528
14370A7680877K40715R69693K01403M87371M35735L35603M39501K89899M33901
14361B1514698K57947J96558Q73248L32320P48851N19437L17846N03584P27125
14352B5991614O15694M72423L61537J352174K80726J045147N90152Q16098N75599
14343C2101164J046031Q33126J003350Q85248O74711J214576J080904J037198
14335C9876308J267761J518512P24966J164673J493660J752196J277332J722322
14327E0797730J526497J518987J775141J995638K003646J967136K164271K530928
$$ y = [12787159, 12729499, 12842995, 12852685, 13465306, 13796257, 13957106, 14299782, 14344443, 14842362, 15090722, 15317287, 15359709, 15686863, 16185964, 16121228, 16538605, 16666324, 17090116, 17554349, 17680877, 17921592, 18891285, 19092688, 19580059, 20015794, 20351397, 20790898, 21080797, 21514698, 21772645, 21969203, 22842451, 23174771, 23923622, 24443059, 24760905, 25264489, 25991614, 26607308, 27079731, 27441268, 28793442, 29074168, 30119315, 30709467, 31525565, 32101164, 33147195, 33980321, 34983671, 35868919, 36543630, 37758206, 38839110, 39876308, 41144069, 42662581, 43387547, 44552220, 46045880, 47798076, 49075408, 50797730, 52324227, 53843214, 55618355, 57613993, 59617639, 61584775, 63749046, 66279974]
14319F6279974K479358J934197K896209K472571K642557K758997L202041L750944
14311H8416848L348789L716611L841212M266283M340811M899966M693009N228163
14303A22751692N737279N716032N890413O725138P128556P214038Q004515Q285782
14295A77453445Q619302R391912R637936J0427308J1328253J1404848J1935966
14288B50198970J2867588J3074293J3696569J4292526J4760099J4619582J5437182
14281C48946809J5212146J5125292J4870801J4297449J3758684J2387773J0754090
14274D45353044Q303530M507061O75621j34677q68074n707441p275696n427011
14266D39426357r808531j1707116j2231285j2832201j2257968j1727757j3782822
$$ y = [66279974, 68759332, 70693529, 73589738, 76062309, 78704866, 81463863, 84665904, 88416848, 91765637, 95482248, 99323460, 103589743, 107930554, 112830520, 117523529, 122751692, 128488971, 134205003, 140095416, 146820554, 153949110, 161163148, 169167663, 177453445, 186072747, 195464659, 205102595, 215529903, 226858156, 238263004, 250198970, 263066558, 276140851, 289837420, 304129946, 318890045, 333509627, 348946809, 364158955, 379284247, 394155048, 408452497, 422211181, 434598954, 445353044, 453656574, 458163635, 458839256, 458704579, 457836505, 452129064, 444853368, 439426357, 429617826, 417910710, 405679425, 392847224, 380589256, 368861499, 355078677]
14259C55078677j3377476j3950694j4268005j4213790j4212316j4007536j3368064
14252B57680796j3839450j2936761j1845904j1920035j0607010q559054r305633
14245A78666949r019593q083926p949435p299713o923275o608260o017827n517910
14237A21247010n226873n216955m986342m240183m582844l852338l324977l872270
14229H5944228l415092l250099l068033k698742k897010k470210k582302k166295
14221F3396445k059721k169487j981723j731254k125042j579556j753570r88221
14213D9007871j787068j518857j411828j453618j358948r10485m15834j166787
14205C8984446j496936j176822r32413r50476p77872o58885r25146r39997j053563
$$ y = [355078677, 341701201, 327750507, 313482502, 299268712, 285056396, 271048860, 257680796, 243841346, 230904585, 219058681, 207138646, 196531636, 187972582, 178666949, 169647356, 161563430, 153613995, 146314282, 139391007, 132782747, 126764920, 121247010, 116020137, 110803182, 105816840, 101576657, 96993813, 93141475, 89816498, 85944228, 82529136, 79279037, 76211004, 73512262, 70615252, 68145042, 65562740, 63396445, 61336724, 59167237, 57185514, 55454260, 53329218, 51749662, 49996092, 49007871, 47220803, 45701946, 44290118, 42836500, 41477552, 40567067, 40151233, 38984446, 37487510, 36310688, 35378275, 34427799, 33649927, 32991042, 32065896, 31125899, 30072336]
14196C0072336m94576r79954n16571q04082o12596m70917p51176n26290n32662
14187B4383512q80381l15419o63275n99291k12520j009405j68513k15355o18623
14178A9700730n87131j85178m79326l87986k14646m42072m51485j37644k68233
14169A6547029n35497N799j91954l54218l86968k83022l05607r08444M03483l72516
14159A3618085m9437j79278p52864K30856q1970o46526L4198K3316m04754k79651
14149A1511975j11351k68394m3326J18425o70599K06141l39327m25132K54939
14140A0233351j59448l38219m6485j30345m62294K08996n26665M04519n35151
14131H648259l7101j9321o08233O09765n30205j91331n683J22304k85226k05048
$$ y = [30072336, 29577760, 28597806, 28081235, 27277153, 26664557, 26193640, 25442464, 24916174, 24383512, 23503131, 23187712, 22524437, 21925146, 21712626, 20703221, 20534708, 20319353, 19700730, 19113599, 18928421, 18449095, 18061109, 17846463, 17404391, 16952906, 16815262, 16547029, 16011532, 16017331, 15825377, 15471159, 15084191, 14801169, 14495562, 13587118, 13990601, 13618085, 13568648, 13389370, 12636506, 12867362, 12785392, 12138866, 12173064, 12196380, 11791626, 11511975, 11400624, 11132230, 11088904, 11207329, 10536730, 10742871, 10403544, 9978412, 10233351, 10073903, 9735684, 9689199, 9558854, 9096560, 9305556, 8778891, 9183410, 8648259, 8611158, 8591837, 7983604, 8593369, 8063164, 7871833, 7866150, 7988454, 7703228, 7498180]
14121G498180M6440J88580o19525J49477j78912L8141n9852j54121l10004K12935
14111F811339k82939M6573p8889j34921p9314J00717j07455l27389j11036N5213
14101E891899l41998L91789m55996L09528J20895o04767Q7716k42689J67232p068
14091E316541m29488K22647L4499j60646j51565j05356J03553l10068K85713p7506
14081D728324j08818k5333J24431l80233o9550L01446k67295P3420J43036k50377
14071D269051r1616M6626m6167l65404K70269j47108K65556l8379k86913K78615
14061D154530l60054L0655j72910K76462k3882j72214J55975k06314l61604K49076
14051C569720o7351k26597Q7831l42761L04729N1367M9242k58962N3823J47505
$$ y = [7498180, 7544620, 7733200, 7113675, 7263152, 7084240, 7122381, 7062529, 6908408, 6598404, 6811339, 6528400, 6574973, 6496084, 6361163, 6281849, 6382566, 6275111, 5947722, 5836686, 5891899, 5549901, 5941690, 5485694, 5795222, 5916117, 5311350, 5399066, 5156377, 5323609, 5316541, 4887053, 5109700, 5144199, 4983553, 4831988, 4726632, 4830185, 4520117, 4805830, 4728324, 4619506, 4594173, 4718604, 4338371, 4268821, 4570267, 4302972, 4376392, 4519428, 4269051, 4177435, 4224061, 4177894, 3812490, 4082759, 3935651, 4201207, 4162828, 3875915, 4154530, 3794476, 3825131, 3652221, 3928683, 3904801, 3732587, 3888562, 3682248, 3320644, 3569720, 3502369, 3275772, 3363603, 3020842, 3325571, 3376938, 3426180, 3167218, 3221041, 3368546]
14041C368546l29834j19833K56860o19461J22296K39413j02107J77683l6376M05530
14031C362717j60034k54840P8288k02506K10345j30036k83937J5830K32852l29393
14021B539286O64886n52560k14426K26923m39706L16887m6851J15796m87798M20121
14011B542558j38434r7295m9420J67897k78568M37236k94166m65329J23135J76932
14001B124546L5195r5379k7868L21760o2755j67166n924L2215K17734n44685M66775
13990B294448L62322P06566K225741N576405J7537057J4656712j7999596j1326523
13982A4033132n650871k131503j172452o48181l80896m13757l52459Q0289n90396
13973B772906j7020K7057j17438j22009o9182l86221J22466k16276R4912K49240
$$ y = [3368546, 3038712, 2918879, 3175739, 2556278, 2678574, 2917987, 2815880, 2993563, 2957187, 3362717, 3202683, 2947843, 3026131, 2823625, 3033970, 2903934, 2619997, 2635827, 2868679, 2539286, 3204172, 2651612, 2437186, 2664109, 2224403, 2541290, 2494439, 2610235, 2122437, 2542558, 2404124, 2306829, 2257409, 2425306, 2146738, 2583974, 2289808, 1824479, 1947614, 2124546, 2159741, 2064362, 2036494, 2358254, 2295499, 2128333, 2122409, 2154624, 2372358, 1827673, 2294448, 2656770, 3363336, 5589077, 11165482, 28702539, 43359251, 25359655, 14033132, 8382261, 6250758, 5078306, 4430125, 4049229, 3635472, 3283013, 3363302, 2772906, 2755886, 2782943, 2665505, 2543496, 2474314, 2088093, 2210559, 1994283, 2089195, 2338435]
13963B338435k29354J33286k86706J6029j64388K00849j68013J58258P7623O0235
13953B136254P176k85628K31126j59141J05925k10211j91290J54963j60308J30518
13943A759384J27980k13256l7600j66306L45747K6545J42272m20261K22870P949
13933A795324k36943m6126L78827k74287o4161J41161k7718l17213J40631k44756
13923A244739J2737L55411k85469L1506Q4487j65383L501J57618O2649k30570
13913A271226J28905j67059L4531J2221J01631l0924J53698l3032l27204P5875
13903A219868K05751p8102j7162M24559n62694K46475k47411M44690j74876j84639
13893A276459m03558p3730L22131q6363J98426j57543J17856k07419j81858K97446
$$ y = [2338435, 2109081, 2242367, 1955661, 1971690, 1807302, 2008151, 1840138, 1998396, 2076019, 2136254, 2143430, 1857802, 2088928, 1929787, 2035712, 1825501, 1634211, 1789174, 1628866, 1759384, 1887364, 1674108, 1636508, 1470202, 1815949, 1842494, 1984766, 1564505, 1787375, 1795324, 1558381, 1512255, 1891082, 1616795, 1552634, 1693795, 1666077, 1348864, 1489495, 1244739, 1257476, 1612887, 1327418, 1358924, 1443411, 1278028, 1281529, 1439147, 1501796, 1271226, 1400131, 1233072, 1267603, 1279824, 1381455, 1350531, 1504229, 1471197, 1143993, 1219868, 1425619, 1347517, 1330355, 1754914, 1192220, 1438695, 1191284, 1635974, 1461098, 1276459, 872901, 799171, 1121302, 1034939, 1233365, 1075822, 1193678, 986259, 804401, 1101847]
13883A101847J5402J38087j29013j79115J92413Q916k90499k05K14394O0805P9563
13872A212595K66516k36988l53940M320K91113k57029M79167k08788k91077L39828
13862A245717P5440q2238p6339n8822q421k5919k0038J34785k85476M9579R8379
13851A046647k66853L57792m41477K8722L45340l34237K2996l9543K9358J58979
13841I07724K9862j99516L2944K79496l80063q6287K58038J16066j17681J68835
13831A009418j66049n2297r6893J58290K28631k48761r775J42467q2990J0854
13821H92895q5026J5877J03106J13974E13854M36540j49380k6449J60723m0143
13811H95145N8822l56348J94306R7938j92152J35364j67118K73649k49020J68097
$$ y = [1101847, 1117249, 1255336, 1126323, 947208, 1139621, 1148537, 858038, 857833, 1072227, 1133032, 1212595, 1479111, 1242123, 888183, 892503, 1183616, 926587, 1405754, 1196966, 905889, 1245717, 1321157, 1238919, 1162580, 1103758, 1095337, 1069418, 1049380, 1184165, 898689, 948268, 1046647, 779794, 1137586, 696109, 724831, 1070171, 735934, 758930, 719387, 748745, 907724, 937586, 738070, 771014, 1050510, 670447, 584160, 842198, 958264, 840583, 1009418, 843369, 791072, 694179, 852469, 1081100, 832339, 822564, 965031, 882041, 892895, 807869, 823746, 926852, 1040826, 513854, 950394, 801014, 774565, 935288, 895145, 953967, 597619, 791925, 889863, 697711, 833075, 665957, 939606, 690586, 858683]
13801H58683k10250Q4338N0997j96592K10514r3167K04335j15688j21958J29308
13791H00520P2991k60466J28749J07400k34483J07203j75820j40353M85385r0386
13781H00740k46069O9927M78920l30665n3842j03388B18541O09033j97190M5604
13771F75988j38370L20871k33667q1124J36299k65443J11823n7716Q1659L908
13761E54228Q4155j03631O1614J50634Q5656r4783C57519o383N47767m26206L42495
13750H15192k27361L17492l30595j89973L14424A93317N08164J77054j29172Q4240
13740H33603l28589p9057J70730l8793j40507K95292l52780J03647Q4673n3154
13730D95065M675l0836L93608p5447R5382A61706O54288m03994R8337B51437Q9805
$$ y = [858683, 648433, 732771, 783768, 587176, 797690, 704523, 908858, 793170, 671212, 800520, 873511, 613045, 741794, 849194, 614711, 721914, 546094, 405741, 891126, 800740, 554671, 624598, 1103518, 772853, 719011, 615623, 218541, 827574, 630384, 675988, 537618, 858489, 624822, 543698, 679997, 414554, 526377, 468661, 550320, 554228, 638383, 534752, 596366, 747000, 832656, 737873, 357519, 351136, 898903, 472697, 815192, 587831, 905323, 574728, 384755, 699179, 193317, 701481, 878535, 749363, 833603, 505014, 425957, 596687, 557894, 417387, 712679, 359899, 463546, 548219, 495065, 499740, 468904, 862512, 787065, 882447, 161706, 815994, 412000, 510337, 251437, 341242]
13719C41242J08544J6030j21342J89643n362M1730k79650K17879J05817p3971
13709E40560K6009j22757K44125l08552J93974B26749k578L88907j11497j10928
13699C90653J68937k12240j08370L92360j42196j30021L46223B04788O00856B80364
13688D94169P7599A59707N33422j87408O7807B57201M94471k24278j85572N60666
13678I02488C29827P3586J50100k32062M4239J40209o2867q2890K28286j11956
13668D76472J60955B37824O6640o346J51682M216n7516K16655k97280Q4982k1386
13657C79471k2287J84835j98350M4998J59827O9989k81064n144J2225m2788J24082
13646D25794N7502o0538j49522A06339J24547M65062k99559J5489p7452O2210
$$ y = [341242, 449786, 465816, 344474, 534117, 528755, 570485, 290835, 508714, 614531, 540560, 566569, 443812, 687937, 379385, 573359, 226749, 224171, 613078, 501581, 390653, 559590, 347350, 238980, 631340, 489144, 359123, 705346, 204788, 805644, 280364, 494169, 571768, 159707, 693129, 505721, 573528, 257201, 751672, 527394, 341822, 902488, 329827, 403413, 553513, 321451, 365690, 505899, 443032, 360142, 588428, 476472, 637427, 237824, 304464, 298118, 449800, 454016, 396500, 613155, 315875, 400857, 379471, 357184, 542019, 343669, 388667, 548494, 618483, 337419, 332275, 344500, 301712, 425794, 483296, 422758, 273236, 106339, 230886, 695948, 396389, 411878, 334426, 396636]
13636C96636K65213k71628A85822K57013P4589k12705O9971r53J88297B34348
13625F05881j06817B03150K47440l6968C0286O28758A50322L02528l5534r0056
13615C27260K08132A15858K71189J24148j0391j24394A62300K75084N8527n3773
13605D42138j03962K5189J30307k23164j0482K07456j63983a8225D28445R2982
13595E21427k60227L04736H3434L60925K28279A92262r5128D4888J42079K94560
13585D81527J03812A05169J91268M3353H4758R8003L84024B51353D5649K45838
13575B91487L5755J9483j9624M7307F6764M82134k56998j36563J84783J5829K04808
13564E60757k63683j03041M08248P9241A70998N3616L49564A96622l0385N9273
$$ y = [396636, 661849, 390221, 185822, 442835, 517424, 304719, 374690, 373737, 562034, 234348, 605881, 499064, 203150, 450590, 413622, 30286, 659044, 150322, 452850, 417316, 327260, 535392, 115858, 387047, 511195, 500804, 376410, 162300, 437384, 495911, 442138, 338176, 363365, 493672, 270508, 260026, 467482, 303499, -18225, 428445, 521427, 261200, 565936, 83434, 444359, 672638, 192262, 97134, 44888, 186967, 481527, 585339, 105169, 296437, 339790, 84758, 182761, 566785, 251353, 45649, 291487, 327242, 346725, 327101, 374408, 66764, 548898, 291900, 155337, 340120, 355949, 560757, 297074, 194033, 602281, 681522, 170998, 224614, 574178, 196622, 166237, 225510]
13554B25510r3398L13681k22174j0174J02313H2911O3954I277K38555K42416e7187
13542C01784j34317M94526C4537M19892B16647K95662B37434J5484A20839K55212
13532C76051b0909I0657K31125D5498J19274L10029B34210J58894c8321A00775
13521C86334P4808n9595i0683B15017E399L40061A41424L11699B19521o3235p6590
13510G9696M2077J16405J49104j85821J48051A55746G5771J24502A1080R205K2636
13499D2921J31258K55250e3455p3317D22739H9389L03543Q2228A98508K10183
13489D08691r8563D0716a14216B67876j29609K00537k3752L10073j80434h6672
13478A82039L81613j56127j43666I5145J16161r0307K87409j29424b17112A47187
$$ y = [225510, 132112, 445793, 223619, 213445, 315758, 82911, 146865, 9277, 247832, 490248, -57187, 301784, 167467, 661993, 34537, 454429, 216647, 512309, 237434, 252918, 120839, 376051, -20909, 90657, 321782, 45498, 164772, 474801, 234210, 393104, -38321, 100775, 386334, 461142, 401547, -90683, 215017, 5399, 345460, 141424, 453123, 219521, 156286, 79696, 121773, 238178, 387282, 201461, 349512, 155746, 75771, 200273, 11080, 20285, 42921, 174179, 429429, -53455, -126772, 422739, 89389, 392932, 475160, 198508, 408691, 310128, 40716, -114216, 267876, 138267, 338804, 315052, 625125, 444691, -86672, 182039, 563652, 407525, 263859, 95145, 211306, 120999, 408408, 278984, -217112, 147187]
13467H2895P8713l2406J28019j05612B1284M401g9631A12206L76513j30324l2914
13456C25481m3574j01865N6763c6666A58122K05898j05975O0629c813G95K61415
13445B62210L67782G3026L7349K35333o043I78J91568m6695P3404a03830A41542
13433B43726a90396D13338j55098m7776G7458P5683B3953R4962J05681j6541o8473
13422A39582F1735J05963d951C64929A48637p0423A8292a90146B08910J3486N6247
13411B78643A16599k3172Q2078I38J13559B6223P038J75404q0859K11469A13994
13399A46312R3312d6568E8768a4449k11933D0378J15598J48268m1575F7330r932
13388E7398Q4070P6967a137k18411A53864L8228k1109l0153J65626K4978J7488
$$ y = [82895, 161608, 129202, 257221, 151609, 21284, 25685, -79631, 112206, 488719, 358395, 325481, 281907, 180042, 236805, -36666, 158122, 364020, 258045, 318674, -3813, 795, 262210, 629992, 73026, 110375, 345708, 339665, 978, 192546, 145851, 219255, -103830, 141542, 243726, -190396, 413338, 258240, 210464, 77458, 153141, 23953, 118915, 224596, 208055, 139582, 61735, 167698, -4951, 364929, 148637, 78214, 18292, -190146, 208910, 222396, 278643, 116599, 93427, 175505, 938, 114497, 26223, 33261, 208665, 127806, 339275, 113994, 146312, 239624, -46568, 58768, -14449, -226382, 40378, 155976, 304244, 262669, 67330, 57398, 141468, 218435, -1137, -219548, 153864, 192092, 170983, 140830, 306456, 331434, 348922]
13377C48922o2078N5606I1668J11118K13939j64762j01119O8691a5928K076C65637
13365C60312n2393e5111B0077R3519K06138l6488n9210P7921q7840J16423c5809
13353E2611K43865I9561Q470L66826A51202f2361q6506B87558q4616p9970R8636
13342B21608I4519M55579j78772n2028C0327O4031L37304A58816O8370r4842k1998
13331A10346N3027B5974a23505B15684L6267q1585P6653J53100M2069a18826r7358
13320b16184C66389a96979A15234N8962j2809K4505J15425j47581m649Q5194C756
13308A95653o6912a5941C05580G5749L61144j3957n9394D5156k1133a32504D11905
13296C22955c9605B32771j169b09544A65442J58953J04521a86419A48925K14577
$$ y = [348922, 286844, 342450, 91668, 202786, 416725, 251963, 150844, 219535, -15928, -13852, 365637, 360312, 307919, -55111, 20077, 113596, 319734, 283246, 224036, 301957, 214117, 330540, -35809, 52611, 296476, 99561, 108031, 474857, 151202, -62361, -148867, 287558, 202942, 122972, 221608, 94519, 550098, 371326, 319298, 30327, 94358, 431662, 158816, 227186, 132344, 110346, 163373, 25974, -123505, 215684, 251951, 170366, 247019, 400119, 442188, -118826, -216184, 366389, -196979, 115234, 174196, 161387, 185892, 301317, 153736, 149087, 234281, 3756, 195653, 128741, -15941, 305580, 75749, 436893, 422936, 363542, 45156, 24023, -132504, 411905, 322955, -39605, 232771, 231602, -209544, 165442, 324395, 428916, -186419, 148925, 363502]
13286C63502k7685j39547r2441D8998J10604K01513A40700N318b38194f6820A14520
13274C83262I1675a11858A50014j7350R4916a37586A83905P105K06770A51960
13263A42175J2406K25918c2775B36091J35114D9750K17330d9743A69091i4869
13252A16466c5656A48170J01485q9932B4249g8876A84538Q4034E7453O77L6630
13241I4760k503c6222A61804g1923A54947a90923D6596e4319a5070A8015b4925
13229C85735C9590b7709A64543G5547Q5431O3630r251c03257A45320l2349N9039
13218A72010J26886d3618B64079c9209o8220H748M09729B4163J5383e8904K5713
13207c3191m0563A91168e5988k9973J3613D6770J26842h1505c0565B7186p178
$$ y = [363502, 335817, 196270, 103829, 48998, 159602, 361115, 140700, 146018, -238194, -66820, 114520, 383262, 91675, -111858, 150014, 132664, 227580, -137586, 183905, 191010, 397780, 151960, 142175, 154581, 380499, -32775, 236091, 371205, 49750, 267080, -49743, 169091, -94869, 116466, -35656, 148170, 249655, 159723, 24249, -78876, 184538, 268572, 57453, 58130, 94760, 92257, -36222, 161804, -71923, 154947, -190923, 46596, -54319, -15070, 18015, -24925, 385735, 39590, -27709, 164543, 75547, 160978, 224608, 215357, -303257, 145320, 112971, 172010, 298896, -43618, 264079, -39209, -107429, 8748, 418477, 24163, 39546, -58904, -33191, -73754, 191168, -55988, -85961, -72348, 46770, 173612, -81505, -30565, 27186, 20008]
13196B0008K9450b54300d5813C10295A14233R1275d1512B38734e824k21121B48374
13184A7120b55088c4750H2247K26890j48488b31509a14888I277h3958A83445E6623
13172B79851j03430I182h4031q850B83273D5072J28559m1665M311d0388A82335
13160A09667K79584A36998h7421L4062p0550A5758J78225P4264k3028j05361Q9270
13149B29128I8552A0393a4293e142j16166A47713F1549L83557j97855c4242p1837
13138a06079B49533b01054A1106L23498C7421b86089M7168F6421J67350a96202
13127E757L8538J09546M13068A49226k0004k2597L7942N1927B4792M65074E6703
13115F771K5443J78990a1013I9200a8680p9028A16641d3543A51700J06927I7347
$$ y = [20008, 49458, -254300, -45813, 310295, 114233, 205508, -41512, 238734, -5824, -226945, 248374, 17120, -255088, -34750, 82247, 309137, 160649, -231509, -114888, 9277, -83958, 183445, 56623, 279851, 176421, 9182, -84031, -92881, 283273, 45072, 173631, 131966, 136277, -40388, 182335, 109667, 389251, 136998, -87421, -53359, -123909, 15758, 193983, 268247, 245219, 139858, 229128, 98552, 10393, -14293, -5142, -121308, 147713, 61549, 445106, 247251, -34242, -106079, 249533, -201054, 11106, 334604, 37421, -286089, -238921, 66421, 233771, -196202, 5757, 44295, 153841, 566909, 149226, 129222, 106625, 144567, 196494, 24792, 489866, 56703, 6771, 32214, 211204, -11013, 99200, -18680, -97708, 116641, -43543, 151700, 258627, 97347]
13103a01110A95958H9602b8843F9432M19678f0876B40268I4092K17243i4121b0791
13091a72178B92628j36071F0045c1951l3084j65192C2328i9645c9820B9122J41697
13080A70819b5221k04665A33356b574B69781G3540R6031a21944A45544J44829
13070B90373H8317k1818K01743j31427a71536Q2551p5536A85027k3479a50745
13059a2062B3151K4275b9732G2680l4192e9093B48921q2376J7230e4231C04540
13047a99I8885j0193K5364B2097d3104l6553B59008a47630I8241a25947A00901
13035e6150A09462f7621A98775J2658P4906G6041C3236P1805a7270B12834K0677
13024B33511a72792C97599D5285J2675a17093D89596B05728B1119P190J6771J99250
$$ y = [-101110, 195958, 89602, -28843, 69432, 489110, -60876, 240268, 94092, 311335, -94121, -20791, -172178, 292628, 156557, 60045, -31951, -65035, -230227, 32328, -99645, -39820, 29122, 170819, -25221, -229886, 133356, -2574, 269781, 73540, 169571, -121944, 145544, 290373, 88317, 66499, 268242, 136815, -171536, -88985, -164521, 185027, 161548, -150745, -12062, 23151, 47426, -29732, 72680, 38488, -59093, 248921, 166545, 183775, -54231, 304540, -199, 98885, 88692, 114056, 22097, -43104, -79657, 259008, -147630, 98241, -125947, 100901, -56150, 109462, -67621, 198775, 211433, 286339, 76041, 33236, 105041, -17270, 212834, 233511, -172792, 397599, 45285, 57960, -117093, 489596, 205728, 21119, 28309, 45080, 244330]
13013B44330k3312F6727b37482R4036F9985g0356I4509m2148e303H9623J05236
13002A94859b64044I3141f7822A21557l1942a30741A92811a4313n7512J6636D6865
12990d5720A55715b25161A40365F6838K7286P3039C3962J65112l0968i1780c2984
12978a37296B04350c57257k9817J63889i171H826a24112A83882p7495c29857J18037
12967b11820B0494a7904p3058B32047B286J82550b7542p159H4882j8397a41694
12955E29416C2445Q2968K7755E1828J30299I965i98j0922j11590H7060j3033R2191
12943A66218a01262l8825A21970g9885B06386H258a65813A90372o4082Q5682K3673
12932B35645g6763A81338B4585L5017c8081j9596A43115K82171A65857O3258d4883
$$ y = [244330, 221018, 66727, -237482, -143446, 69985, -70356, 94509, 52361, -5303, 89623, 194859, -264044, 93141, -67822, 121557, 89615, -130741, 192811, -14313, -71825, -55189, 46865, -45720, 155715, -225161, 140365, 66838, 94124, 167163, 33962, 199074, 168106, -91780, -32984, -137296, 204350, -357257, -387074, -223185, -9171, 8826, -124112, 183882, 106387, -329857, -211820, 20494, -17904, -90962, 232047, 2286, 184836, -27542, -34701, 84882, 66485, -141694, 529416, 32445, 115413, 143168, 51828, 182127, 9965, -998, -11920, -123510, 87060, 74027, 166218, -101262, -140087, 121970, -79885, 206386, 8258, -165813, 190372, 126290, 211972, 235645, -76763, 181338, 24585, 59602, -38081, -57677, 143115, 425286, 165857, 229115, -44883]
12920f8964o3038o3414a7075k62386a02428C2782J60724D2959M8175j8619d9877
12908i917A48311D9393K54142E0067N9707a4130B30352p7458a59137J7707B4572
12896a42326C48890i0240B53764a58966C60664a74190d9276j48033B53468r1900
12886A61568i6504c2522l1980B31414j08363K8063A3393e070p194p7768F3957
12874f6067j76083B14124I1840P899m0951a05952F7124k1738a02727j37006j4046
12863b53779E0135a32195B83536a44678C9331a1304o5066A42543j0459i7664a1400
12851H002L60198A44155F550R8084g3168B15007p7076a65406B946d36802C2587
12839B92943h4150A042h4407B68073e2172k53827Q6444e5778K5974k22752B14204
$$ y = [-68964, -132002, -195416, -17075, -279461, -102428, 32782, 193506, 42959, 91134, 72515, -49877, -9917, 148311, 49393, 303535, 50067, 109774, -14130, 230352, 152894, -159137, -141430, 24572, -142326, 348890, -90240, 253764, -158966, 360664, -174190, -49276, -197309, 253468, 161568, -96504, -32522, -64502, 231414, 123051, 151114, 13393, -5070, -12264, -90032, 63957, -66067, -242150, 214124, 91840, 99739, 58788, -105952, 67124, 45386, -102727, -239733, -253779, 50135, -132195, 283536, -144678, 39331, -11304, -76370, 142543, 132084, -97664, -11400, 8002, 368200, 144155, 6550, 104634, -73168, 215007, 137931, -165406, 2946, -436802, 32587, 292943, -84150, 1042, -84407, 268073, -52172, -305999, -219555, -55778, -29804, -252556, 214204]
12827a52924J6344a7092k08246D66468c0419A38624J18898r8531f4190C1101J54908
12816A86009b9609k86101A5420a43737d237j30137A31793b86347d1478j41419
12806a82897C49591a70470A9790k304K31339a61359B33394a07967e731j02076
12796a07807l492A83677J75465a17601C83148B2373N9741a8690k35137Q253a07306
12784A07874B1572J73303a33622a3501j37384A95910g9790D85610A34054M51875
12774E85929b66133R9092q8892d6734j4264D6352a2718l81410F3220a85340C620
12762D0812K02555q8204j6747b04792j24080d9576b692l57643D8731J64013E4317
12750a82430j51445f1616m3593e0032l2745G5274J8070J7045b78857c4208B76054
$$ y = [-152924, -136580, -17092, -225338, 466468, -30419, 138624, 257522, 158991, -64190, 31101, 186009, -29609, -315710, 15420, -143737, -4237, -134374, 131793, -286347, -41478, -182897, 349591, -170470, 19790, 17486, 248825, -161359, 233394, -107967, -5731, -107807, -111299, 183677, 359142, -117601, 383148, 22373, 82114, -18690, -253827, -245574, -107306, 107874, 21572, 194875, -133622, -13501, -150885, 195910, -79790, 485610, 134054, 585929, -266133, -167041, -255933, -46734, -60998, 46352, -12718, -394128, 63220, -185340, 3620, 40812, 243367, 155163, 138416, -204792, -328872, -49576, -2692, -360335, 48731, 212744, 54317, -182430, -333875, -61616, -105209, -50032, -82777, 75274, 93344, 110389, -278857, -34208, 276054]
12738F4843e3210E5531d7777j52212C27292f6984I1754f7667D5895a1698I4915
12726A82203a59458j09983i4742E0134c18794a38659A77730D1952Q8768a06678
12715C3434c2382k10114A26056N8428O9763Q5918Q61p0602B7080J92225F7568
12703I0466P1879F6327b03221A29261I697N7955K75768e1869A44833b17065J01015
12692a16050b1737n7078C27165b66768F703b97505A50451a66577C00866a96399
12681c0458A65265a00651A60508a13947C80547a83166I1875a32598D8961j0429
12671C8532K85229c7894A10902a55431r2520A904M4515A4120P6117g691m9386
12660e7077I574J70959b57993B37332a7449C13340l4164j10265b49798B51583
$$ y = [64843, -53210, 55531, -47777, -199989, 327292, -66984, 91754, -67667, 45895, -11698, 94915, 182203, -159458, -269441, -94742, 50134, -318794, -138659, 177730, 41952, 130720, -106678, 33434, -32382, -242496, 126056, 184484, 254247, 340165, 341026, 270424, 27080, 219305, 67568, 90466, 162345, 66327, -203221, 129261, 9697, 67652, 343420, -51869, 144833, -217065, -116050, -21737, -78815, 327165, -266768, 6703, -297505, 150451, -166577, 300866, -196399, -30458, 165265, -100651, 160508, -113947, 380547, -183166, 91875, -132598, 48961, 38532, 323761, -37894, 110902, -155431, -247951, 1904, 46419, 14120, 90237, -7691, -57077, 9574, 180533, -257993, 237332, -17449, 313340, 279176, 168911, -249798, 251583]
12649B10035l7284b07278K3167A64774F879a09970B67815i8950L2575k36652A44002
12637c6625j44068B5343J24873b597k01604B27904A13140L0526o0874e7856F44
12625H169a4600B07734a8585I4537J16871a25706A00650f57j07011E5048K08034
12614B63082c3151P081A1625c7172j83403F66b4721B34431a55240D7622i40r9472
12602a00412A88915e6040j9553B28709F0420i1601F0347K73573a28403B56946
12591B30475o8990g3793B68693h4464j19183f8337j06904E2925N7955e1387A06072
12579E4348B4732a58375A44715E1003N241a21805A97634J44264A34871b69936
12568c4481p0187j08626a00926B83866A27480m5401L5227b96060B2622h9843C8291
$$ y = [210035, 172751, -207278, -184111, 164774, 6879, -109970, 267815, -98950, -66375, -303027, 144002, -36625, -180693, 25343, 150216, -2597, -204201, 227904, 113140, 143666, 82792, -57856, 644, 8169, -14600, 207734, -18585, 94537, 211408, -125706, 100650, -657, -107668, 55048, 263082, -33151, -26070, 11625, -37172, -220575, 666, -24721, 234431, -155240, 47622, -940, -100412, 188915, -56040, -75593, 228709, 60420, -91601, 60347, 333920, -128403, 256946, 230475, 161485, -73793, 268693, -84464, -203647, -68337, -175241, 52925, 110880, -51387, 106072, 54348, 24732, -158375, 144715, 51003, 56244, -121805, 197634, 341898, 134871, -269936, -34481, -104668, -213294, -100926, 283866, 127480, 82079, 117306, -296060, 22622, -89843, 38291]
12556a89189r5649I7252c32166a18203b1716G2382a2071A22334d7987j12040A81952
12544a78012b6682C2243d6043A05364b73339L1550b8904A81334H1835b56622Q5489
12533a71133A16677J8355a17595l556B0967a51072d8526k4461j45387a1262j77730
12522a88992P7840B27257A09674c6794j0822i698C2325K01678C3792Q9417O0340
12511A83549m7885J7005M7832e2526q052j25657e722C96894j96286J37888A67244
12499A09521D8835f4634B51191a58016f2331j0309j80905E899b08512B13094H256
12487a97062A64031e8615C16668A06211Q1176a89840C0380h3225C91057c14460
12476D89307I9635b20925K5040e906D74726A49142E6867b96408B5933R5733K72172
$$ y = [-189189, -284838, 97252, -332166, -118203, -21716, 72382, -12071, 122334, -47987, -160027, 181952, -178012, -26682, 32243, -46043, 105364, -273339, -241789, -28904, 181334, 81835, -256622, -171133, 116677, 135032, -117595, -121151, 20967, -151072, -48526, -72987, -218374, -11262, -188992, -111152, 227257, 109674, -36794, -47616, -9698, 32325, 234003, 33792, 123209, 183549, 135664, 152669, 200501, -52526, -60578, -186235, -5722, 396894, 200608, 338496, 167244, 109521, 48835, -64634, 251191, -158016, -62331, -72640, -253545, 5899, -208512, 213094, 8256, -197062, 164031, -58615, 316668, 106211, 187387, -189840, 30380, -83225, 391057, -314460, 489307, 99635, -220925, -195885, -5906, 474726, 149142, 56867, -296408, 25933, 121666, 393838]
12465C93838A11023c92900B36756f4118A30076J21672F473a12615A72414b10774
12454E3605i6072D6274h2933I2529d03971a371A0394a00221j48855A98555i6806
12442f426r8017c4802A1703N878h668A7601b38561L0789B5211g0087A49306a9554
12429a50556j58055r6365a88427l3997r5684a44977K4049m703B16791f17089b90979
12417b8368j58320M3082q1973d8526k32784a4841j43386L1358o1897B38983a51944
12405A21923b67316J15816i263j02763C3744J55544g4366l47248A43827i5575
12394i1823j04190B21138q7405M1921B8512h5597j01912l0087E4366r085a11251
12382B10688o4317i0055C90479j39754h7768M0549A70836Q2524a24717A06769
$$ y = [393838, 111023, -392900, 236756, -64118, 130076, 251748, 6473, -112615, 172414, -210774, 53605, -96072, 46274, -82933, 92529, -403971, -1371, 10394, -100221, -249076, 198555, -96806, -6426, -104443, -34802, 11703, 17581, -8668, 17601, -238561, -207772, 25211, -70087, 149306, -19554, -150556, -308611, -404976, -188427, -222424, -318108, -144977, -120928, -125631, 216791, -617089, -290979, -28368, -186688, -143606, -225579, -48526, -281310, -14841, -158227, -126869, -188766, 238983, -151944, 121923, -267316, -151500, -9263, -112026, 33744, 189288, -74366, -421614, 143827, -95575, -91823, -196013, 221138, 133733, 175654, 28512, -85597, -187509, -217596, 54366, 45281, -111251, 210688, 146371, -90055, 390479, 250725, -87768, -47219, 170836, 253360, -124717, 106769]
12371F7539J8405L20473A13426E0073K2193e2714j25346A09355K71314a86932
12360a17135k5998A3137J47587a80761P8546B5067h1383c6889A75710a1997A88191
12348i2365a9625E388a24165H0960A491J27745a65822m1539b1693C05448a9212
12336A60348N8838L25380h5649k13169c0990I6851M08734k01428L9707h1985A85970
12324A42913J4838b9723I1947a96285A37929M2734j8046J55048C9957J46551k2477
12313A64031j8399L404M63626C1941J04729J94943A23021J85082A27004a7067
12302C94489B150L1854d6277J6055F5604Q822J34765n9943o0677H103L76157J12541
12290D96801A75487b74312g9214k7328C46636B4801Q3954L2068K84754G7928A2163
$$ y = [67539, 85944, 406417, 113426, 50073, 72266, -52714, -178060, 109355, 380669, -186932, -117135, -143133, 13137, 160724, -180761, -102215, 25067, -81383, -36889, 175710, -11997, 188191, -92365, -19625, 5388, -124165, 80960, 1491, 129236, -165822, -207361, -21693, 305448, -19212, 160348, 219186, 544566, -85649, -298818, -30990, 96851, 505585, 304157, 343864, -81985, 185970, 142913, 157751, -29723, 91947, -196285, 137929, 180663, 162617, 317665, 39957, 186508, 164031, 145632, 149036, 612662, 31941, 136670, 331613, 123021, 308103, 127004, -17067, 394489, 2150, 34004, -46277, -30222, 65604, 74426, 209191, 149248, 88571, 8103, 384260, 496801, 175487, -274312, -79214, -106542, 346636, 24801, 108755, 140823, 425577, 77928, 12163]
12278C45056R1791H0833K20701o4932A06813n393L49067j83918p2478k6876K23049
12267C90264D8036k2237J44097b8346l9944E6364L83403A03628N1547o4493j8598
12256G2084A9998a45306B77850k5371e3761B10190A8505K10113g5244G8580a85277
12244C12407j26142p0992L36708A92082j1746O6715c88478A46456a61794A37088
12233f1421b9399A84467a01209A10711d9917j2179m9620n0313b5780C84220j81511
12222B02709l9841M60969B58411r1623K43251B01167P7050p8263a21299e6417
12211D4553J17711L80754A60556b99499M6521F75988A20240d8776A82968N5164
12201B38132K477q6523C7537M34041C7304K95565H9741J44705Q4705j22729A6884
$$ y = [345056, 436847, 80833, 301534, 236602, 106813, 101420, 450487, 266569, 194091, 167215, 390264, 48036, 25799, 169896, -28346, -68290, 56364, 439767, 103628, 155175, 90682, 72084, 19998, -145306, 277850, 252479, -53761, 210190, 18505, 228618, -75244, 78580, -185277, 312407, 186265, 115273, 451981, 192082, 180336, 247051, -388478, 146456, -161794, 137088, -61421, -29399, 184467, -101209, 110711, -49917, -62096, -111716, -162029, -25780, 384220, 202709, 162868, 623837, 258411, 166788, 410039, 201167, 278217, 199954, -121299, -56417, 44553, 162264, 543018, 160556, -299499, -252978, 675988, 120240, -48776, 182968, 238132, 240609, 154086, 37537, 471578, 37304, 332869, 89741, 234446, 319151, 196422, 16884]
12189C04248m7698K1338A18268J18006r2138J24948m0505E8456R3776p131Q5490
12178B30591K10386j74964f766A78062a65617D10779a56568I3272b5316B16679
12167B75898m2665G4492K59828A64479M9891r1567N346m1588L3820J1270Q2258
12156B13909P9374n8697K6931o0039c9874C29830l0947A45851b36141F6571b5015
12144A50309c6309F5826a6946A31867J18304a5428B37564j10380D4757b89819
12133B22304m0445a67196q9169a5653E8543P5764C7622J36770L5802K26139j94118
12122B42215j9643H9957J80997l8301f1942j61015E96399j79394A67599p1433
12112I6166B5617K79304b6669j2854m9950H9409K41651b45026Q6909A48171K6122
$$ y = [304248, 256550, 277888, 118268, 236274, 144136, 269084, 228579, 58456, 152232, 145101, 230591, 440977, 266013, -6766, 178062, -165617, 410779, -156568, 93272, -25316, 216679, 275898, 233233, 74492, 334320, 164479, 214370, 122803, 128149, 86561, 120381, 131651, 213909, 293283, 234586, 261517, 201478, -39874, 329830, 298883, 145851, -236141, 66571, -25015, 150309, -36309, 65826, -16946, 131867, 250171, -15428, 237564, 127184, 44757, -289819, 222304, 181859, -167196, -256365, -15653, 58543, 134307, 37622, 174392, 210194, 436333, 242215, 222572, 89957, 270954, 232653, -61942, -222957, 596399, 417005, 167599, 96166, 25617, 304921, -26669, -39523, -89473, 89409, 331060, -245026, -158117, 148171, 174293]
12101A74293f187A77557e5247I6918M36746a49348G0825C3383K36427h3045B3238
12089a32138A61062J27990l0777G2786B4023J14622q02B1398a74883C18635a79563
12077I946b0892C9042L43555j74355a54995B75523c0988A0264R7889b76413a8594
12065c2693C5792a52262p1068P9707G7129a6393j17650h366C3343J15896l1640
12054A17599b53822F1820c0451H208f719C09498I194b39103J0580B44476b4176
12042F3236a11799J4720A50015d8931j33605e4041g304j16298C20590r7570J75803
12031C98823n0398k6536p6026a55012A55346m5292e9259a3442j4186j70075B2100
12019a17650j56764d3786A63956o3124a28968A79595E7268a7396I540g7977A34842
$$ y = [174293, -6187, 177557, -55247, 96918, 533664, -149348, 70825, 33383, 269810, -83045, 23238, -132138, 161062, 289052, 258275, 72786, 24023, 138645, 137843, 21398, -174883, 318635, -179563, 9946, -20892, 39042, 382597, 208242, -154995, 275523, -30988, 10264, 108153, -276413, -18594, -32693, 35792, -152262, -223330, -143623, 77129, -16393, -134043, -8366, 33343, 149239, 117599, -253822, 61820, -30451, 8208, -6719, 309498, 9194, -239103, -228523, 244476, -24176, 63236, -111799, -97079, 150015, -48931, -182536, -54041, -7304, -123602, 320590, 223020, 398823, 348425, 321889, 245863, -155012, 155346, 110054, -59259, -13442, -27628, -197703, 22100, -117650, -274414, -43786, 163956, 100832, -128968, 179595, 57268, -17396, 9540, -77977, 134842]
12007e5648A95973d1792A82520a13628L1460E7608g2018A49195a05625C39685
11996a53607A4650M7268J12614f2372o8847M3481B00574M1109b260q1278i15j17194
11984a18109B29876c9999j27973Q3693A02827r487i6615l4160e9128G1667a2719
11972i0532k12349B2025a79431j90259a34669j34591J23233B05068a60939c0291
11961a04548l3522E4822J1831M7428C6115J26082K9141i6657j4365N1166j09065
11950a68921I3030f5663K0692B96357A42953B5733J74837B9424c71335A59360
11939b64091L5271o2002J25127f0017C9487J02628a96427D7255a05974a4293r4469
11928a08762I4773B5232b3750D00218A55373L7400h2343a8328E8529N0437d4052
$$ y = [-55648, 195973, -41792, 182520, -113628, -82168, 57608, -72018, 149195, -105625, 339685, -153607, 14650, 61918, 174532, -62372, -131219, -87738, 200574, 241683, -2260, -83538, -915, -118109, 229876, -39999, -167972, -84279, 102827, 93340, -96615, -130775, -59128, 71667, -12719, -90532, -302881, 22025, -179431, -369690, -134669, -269260, -146027, 205068, -160939, -30291, -104548, -138070, 54822, 66653, 114081, 36115, 162197, 191338, -96657, -111022, -59856, -168921, 93030, -65663, -44971, 296357, 142953, 25733, 200570, 29424, -371335, 159360, -264091, -228820, -290822, -165695, -60017, 39487, 142115, -196427, 47255, -105974, -14293, -108762, 94773, 25232, -23750, 400218, 155373, 192773, -82343, -18328, 58529, 108966, -44052]
11916A43138Q0561A01416J79087c8101k86027I2848p395d6232A77217c84128i9143
11904A16505n4238j7331a88597L6322B9345J71579G6811a66605A08485D9755b35997
11892A58796a56433A819b2469j39223B4374M8126F57b57013J07930J1201g5G8423
11879A61591C3656k391c5827j51695g200E0898A8098a83380D3368b64313A36316
11867E9556a26571j92205F4428A82a0443A44186b85581H5287k5764k6430b48467
11855a73482f9518J5878j08577D28545B03504q8880a08427j05104B58282b38713
11844C9280a31624H4276i5782j11471m0341E15938A26341d681B07305K51760h3878
11832b68211p7117B94410A0066J46764A4691a82228E3612J3177g5530A36208J79886
$$ y = [143138, 223699, 101416, 280503, -38101, -324128, 92848, 85453, -46232, 177217, -384128, -99143, 116505, 62267, 44936, -188597, -152275, 29345, 200924, 76811, -166605, 108485, 49755, -235997, 158796, -156433, 1819, -22469, -161692, 24374, 72500, 657, -257013, -149083, -137882, -75, 78423, 161591, 33656, 31265, -35827, -187522, -7200, 50898, 18098, -183380, 43368, -264313, 136316, 59556, -126571, -318776, 64428, 182, -10443, 144186, -285581, 85287, 59523, 33093, -248467, -173482, -69518, -53640, -162217, 428545, 203504, 114624, -108427, -213531, 258282, -238713, 39280, -131624, 84276, -95782, -207253, -247594, 515938, 126341, -4681, 207305, 459065, -83878, -268211, -345328, 294410, 10066, 156830, 14691, -182228, 53612, 66789, -75530, 136208, 316094]
11821C16094d99288a48750A24681J8124a90455j63111e90A29458K10157A59705
11810d38052b9247B5372I092c14968C1020c12490j02219a13113c9831k0843r0750
11799a51424e7931k17541B10164b9327l02231a58732c9632D3048c58073J47442
11789b10631A27924C4205c57441C2152g9710B8879b88093q2795C82313b80356
11778b06539A9665J69455g8108I3156b88007I1425a78536e1601C1813J79954L4919
11767B46686a59474B77310b4095C9369K2372c07634A20686b26734C10931d6510
11756h6438L5563c951A258K4437K60606i6414A09682b02842I3895Q9988J40228
11745C24111E4753J96733C0473b10186e4851k09621j9120R4674A49470a28082
$$ y = [316094, -499288, -148750, 124681, 142805, -190455, -353566, -590, 129458, 339615, 159705, -438052, -29247, 25372, 9092, -314968, 31020, -312490, -414709, -113113, -39831, -60674, -151424, -57931, -275472, 210164, -29327, -331558, -158732, -39632, 43048, -358073, -210631, 127924, 34205, -357441, 32152, -79710, 28879, -288093, -370888, 382313, -280356, -206539, 19665, 189120, -78108, 93156, -288007, 91425, -178536, -51601, 31813, 211767, 246686, -159474, 277310, -24095, 39369, 61741, -307634, 120686, -226734, 310931, -46510, -86438, -50875, -3951, 1258, 25695, 286301, -96414, 109682, -202842, 93895, 183883, 324111, 54753, 251486, 30473, -210186, -54851, -264472, -283592, -188918, 149470, -128082]
11734B118R9463Q6563b40683A78445a25056n3549D35845F4401J59830I1704h8577
11722C54968d3909B02601r8838a31614F9283J43917q2032h8093b109n2935k03802
11711b58846f4259j87241B6141b31269E5493i5360B75241q8513P6917f035k2716
11700b8751A16804J59418d17003B85496q3388a08812k9520L1507A20073M1410
11690A61483a05333B66777F1996b49309c2306J757D2303K37615b8212A06022g3590
11678A99482l9855a05339B28650n9967l926l8345D8145b49201H4597l6059B0440
11666D7815d6485A07620b6094A15784f6946c793m2161B21937r1897K85886I3972
11654a10492d6657j27280A4443a560A10903g6512A61598a46588e7374I4611a1793
$$ y = [2118, 101581, 188144, -240683, 178445, -125056, -178605, 435845, 64401, 224231, 91704, -88577, 354968, -43909, 202601, 103763, -131614, 69283, 213200, 131168, -88093, -2109, -55044, -258846, -64259, -251500, 26141, -231269, 55493, -95360, 275241, 186728, 263645, -6035, -28751, 116804, 276222, -417003, 285496, 202108, -108812, -138332, -106825, 120073, 161483, -105333, 266777, 61996, -249309, -32306, -30549, 42303, 279918, -28212, 106022, -73590, 199482, 159627, -105339, 228650, 168683, 164757, 126412, 48145, -249201, 84597, 48538, 20440, 47815, -46485, 107620, -26094, 115784, -66946, -3793, -45954, 221937, 130040, 415926, 93972, -110492, -46657, -173937, 14443, -1560, 110903, -76512, 161598, -146588, -57374, 94611, -11793]
11642b23976A31063a08577A78985k6527K8297b43180a17525j27804O4723A10704
11631B0966b0715B84021m4936F1175C015b43976E5442J51672a80440d1602B24964
11619C15304A52810K24176b49995D3661c99590a6979m2156A64634a81096a4823
11608c54754B00852J1727j7113l8044c1499B59205C0617J03946o4368b05063A8059
11596B75628b5280j84571F3271e4618k00765B01079r5786b06711N1096F1770J24813
11585A86583f3702J3643j97059C07126a15141B43174B2341b8389A32692A5227
11574A88896b03258P0640A00107b7663j7559C9985c1381F3498M3600J75120H1698
11562H8346L0124M6229p4797J58658n4106F2566a79064a4228j33183A04644c5843
$$ y = [-223976, 131063, -108577, 178985, 152458, 180755, -243180, -117525, -245329, -180606, 110704, 20966, -20715, 284021, 239085, 61175, 3015, -243976, 55442, 207114, -180440, -41602, 224964, 315304, 152810, 376986, -249995, 43661, -399590, -16979, -59135, 164634, -181096, -14823, -354754, 200852, 212579, 195466, 157422, -31499, 259205, 30617, 134563, 70195, -205063, 18059, 275628, -25280, -209851, 63271, -54618, -255383, 201079, 105293, -206711, -155615, 61770, 186583, -63702, -50059, -247118, 307126, -115141, 243174, 22341, -28389, 132692, 15227, 188896, -203258, -132618, 100107, -27663, -45222, 39985, -31381, 63498, 107098, 282218, 81698, 88346, 118470, 164699, 89902, 248560, 194454, 62566, -179064, -14228, -147411, 104644, -35843]
11550C3874O1565J24163a48893L6394p10A12449m2909P1922G0653b28035r5563
11539c23598A43840K07550a02429C89743J6976d7555o1414A0999N7622L99793
11529D68414A34889J49286a95890C71636a92567B53299F9174J67700i5417b828
11518B88148l3200D5947N6714K5455f2451k8243D12054i9859F9430a63574A17495
11506D56522B26939K05440D6026O2499K5455b51061B64358c74093H0091e5176
11495B26378e3461A49640k5201J71722a31404e8813C25890A30372a25810b0334
11484a83544G2646J63027k5204J31072i5144j635C9087a2117E9775L74946A43701
11472D24343j37440J13920A5477a86904A17388l0146i226G4573J61725p4207C6820
$$ y = [33874, 95439, 219602, -148893, -112499, -113209, 112449, 69540, 141462, 70653, -228035, -323598, 143840, 351390, -102429, 389743, 406719, -47555, -108969, 10999, 68621, 468414, 134889, 284175, -195890, 371636, -192567, 253299, 69174, 236874, -95417, -2828, 288148, 254948, 45947, 102661, 128116, -62451, -90694, 412054, -99859, 69430, -163574, 117495, 456522, 226939, 432379, 46026, 108525, 133980, -251061, 264358, -374093, 80091, -55176, 226378, -53461, 149640, 124439, 296161, -131404, -58813, 325890, 130372, -125810, -20334, -183544, 72646, 235673, 210469, 341541, -95144, -96779, 39087, -12117, 59775, 434721, 143701, 424343, 286903, 400823, 15477, -186904, 117388, 87242, -9226, 74573, 236298, 162091, 36820]
11460a25550A99773d8281j36537A40587N2924R7538K3123a44058f4595r3453D27170
11448A1334J66260A6446b4873A19947l3626Q8K60651q2884k7354F9939B2933b10934
11435E8661R3376a64261B6841c33122f1873k28796B75743a72447G958a01997A08069
11423g6741n3771B46459A5538D736c64739e5070j41326i7552A6508J17560j6623
11412A17445h7791m1621B35765a64776O0522C6226P6662c4129B18894a11396B34767
11400A68757D2687j0289c4206j31949C56566b02150B34037a63889E2356b98981
11389A75872E8057A9949P9159b53695a08404F2141b39480A87383O8505a84448
11378A49298o4648a38842C36978A17038K4454i7736K9173k46594C9901b69155
$$ y = [-125550, 199773, -48281, -184818, 140587, 193511, 291049, 314172, -144058, -64595, -158048, 427170, 11334, 177594, 16446, -24873, 119947, 86321, 86409, 347060, 264176, 236822, 69939, 22933, -210934, 58661, 152037, -164261, 26841, -333122, -61873, -290669, 275743, -172447, 7958, -101997, 108069, -76741, -130512, 246459, 15538, 4736, -364739, -55070, -196396, -97552, 16508, 134068, 117445, -87791, -129412, 235765, -164776, -104254, 36226, 112888, -34129, 218894, -111396, 234767, 168757, 42687, 32398, -34206, -166155, 356566, -202150, 234037, -163889, 52356, -298981, 175872, 58057, 19949, 99108, -253695, -108404, 62141, -239480, 187383, 255888, -184448, 149298, 84650, -138842, 336978, 117038, 141492, -97736, -68563, -315157, 39901, -269155]
11367c05693a25130f1044n2318A33579n2980b35304i4775j64920D7957J48629
11357A96586E4102a82423h4784j25763j71296h0543a8980n9192B42730a15487
11346A55621F2163J68624M3699D6883a13390F9180i1964d714k69608A79686a08751
11334B0607G260a10686j5640I049g2163r8830C2035d10535G2355a50388k1458
11323a71846k3385e3281B26199a10734l28320C02599G1739J56316J74195c65474
11312b85159n7440F9402a33733A82339D0994h5686o4441j12560F0682d3277A82307
11300A34010P2330c07937F8718a91152N9555k78138M2553O5676c5935A43118c55655
11288A69252b37445B12711b74422B10049b32401R7584o0243m0111a7206o7634
$$ y = [-305693, -125130, -61044, -113362, 133579, 80599, -235304, -94775, -259695, 47957, 196586, 54102, -182423, -84784, -210547, -381843, -80543, -18980, -78172, 242730, -115487, 155621, 62163, 230787, 274486, 46883, -113390, 69180, -91964, -4714, -274322, 179686, -108751, 20607, 7260, -110686, -126326, 9049, -72163, -170993, 32035, -410535, 72355, -150388, -171846, -195231, -53281, 226199, -110734, -439054, 302599, 71739, 228055, 402250, -365474, -285159, -342599, 69402, -133733, 182339, 40994, -85686, -150127, -262687, 60682, -43277, 182307, 134010, 206340, -307937, 68718, -191152, -131597, -409735, -367182, -301506, -35935, 143118, -355655, 169252, -237445, 212711, -274422, 210049, -232401, -134817, -195060, -235171, -17206, -84840]
11278h4840r0969B89715f9229J1869k45906D2018J96378d69020c358r6566b6020
11266e50704a8761A17034f6772D9222a14997F5661a22345A12059a96247A10907
11255A10693O2944K262c4063B09625f3514A54325J11268F9214F56a05023J5254
11244h9769a8977F3005c20195a03004j06545h5412G71K23452b61969g3326J2992
11233f0334j86049m327h5169c8728l47693a08861B1499b75517g3649B3532a83730
11221B4623a99270G6637a65351f4011I2696e9096B60105a16592k5433j23932P5861
11210a90096G7323a42635j2899D1558a78988a9625I1186a73700D2219j037a25370
11198b0073B52292a84116j44324B62362F0387M6664m7561K58866C6235h0478P676
$$ y = [-84840, -175809, 289715, -69229, -57360, -303266, 42018, 238396, -469020, -3358, -99924, -26020, -550704, -18761, 117034, -66772, 49222, -114997, 65661, -122345, 112059, -196247, 110907, 110693, 173637, 175899, -34063, 209625, -63514, 154325, 265593, 69214, 656, -105023, -89769, -18977, 63005, -320195, -103004, -209549, -85412, 771, 224223, -261969, -73326, -60334, -246383, -250710, -85169, -38728, -386421, -108861, 21499, -275517, -73649, 23532, -183730, 24623, -199270, 76637, -165351, -64011, 92696, -59096, 260105, -116592, -142025, -265957, -190096, 77323, -142635, -155534, 41558, -178988, -19625, 91186, -173700, 42219, 41182, -125370, -20073, 252292, -184116, -328440, 262362, 60387, 107051, 59490, 318356, 36235, -80478, -72802]
11187g2802a4447H614J08515E3053b09809R544O6921A87471a60063L151q075j81517
11175c46504G6939a6821A01197i3598b9540j21835H4801f3851p1501K7969r5962
11164b03345e30D5883a79410o9086B43291m558e6296k2024j34491g202B9125J71486
11152B00611b20638h4038j5709J1118p1284f0371A29b3899A26437b11272F349
11140f4599B10326k0758P7134a77051p757d4408l30678a45289P0079q5246c406
11128b5n9038j89175A88356m4122c2877j17593r292B78366h4490C1703a3042m6683
11116e9725j2226H7111b34A08398N8957M4457P9002A36183m4559J67661A23200
11104F019a04146C13971J13502j03799A47472B6171O0404M7067J11976A07821
$$ y = [-72802, -14447, 8614, 117129, 53053, -209809, -200265, -133344, 187471, -160063, -156912, -164987, -346504, 76939, -16821, 101197, -93598, -29540, -151375, 84801, -63851, -135352, -107383, -203345, -530, 45883, -179410, -248496, 243291, 238733, -56296, -78320, -212811, -7202, 29125, 200611, -220638, -84038, -99747, -88629, -159913, -60371, 129, -23899, 126437, -211272, 6349, -64599, 210326, 189568, 266702, -177051, -184808, -44408, -375086, -145289, -75210, -160456, -3406, -25, -59063, -248238, 188356, 144234, -32877, -150470, -159762, 278366, -84490, 31703, -13042, -59725, -71951, 87111, -234, 108398, 167355, 211812, 290814, 136183, 91624, 259285, 123200, 6019, -104146, 313971, 427473, 323674, 147472, 26171, 86575, 133642, 245618, 107821]
11093a71723P4844A63474D989N06761k16277H9629J21785o6824E9237J83122A10117
11081F1604J77002a079F5062L28936A71652J82207N0366A26797J80375k1339j21293
11070A64540K13136E9990L16209l3883m9897J17379A06820J97409K01689A76618
11059D31807J60387j53152A15909K66010K73067k25922R3813o3391L52207k44194
11049E67499j84255O4744K72157O9227k07737r1368K25944p5644j0404N2374R3491
11038G76028N069j7378k581j04023j50087K72190K6952r579J8881K78140D85968
11026H03870j88888L49150D67134K09302p1255J8460K01911J18052k54991N52
11016F89165J31776l68104r5918M55471C79848K05490o0580J86996k56680L0305
$$ y = [-171723, -96879, 163474, 4989, 511750, 295473, 89629, 211414, 144590, 59237, 242359, 110117, 61604, 238606, -1079, 65062, 393998, 171652, 353859, 404225, 126797, 307172, 285833, 164540, 377676, 59990, 376199, 342316, 292419, 409798, 106820, 304229, 505918, 176618, 431807, 592194, 439042, 115909, 381919, 654986, 429064, 522877, 459486, 811693, 567499, 383244, 447988, 720145, 789372, 581635, 490267, 716211, 640567, 630163, 682537, 776028, 781097, 763719, 761138, 657115, 507028, 779218, 806170, 796591, 815472, 1093612, 485968, 803870, 614982, 964132, 467134, 676436, 605181, 623641, 825552, 943604, 688613, 689165, 820941, 452837, 356919, 812390, 379848, 585338, 524758, 711754, 455074, 485379]
11006D85379L98298k85642j58839K57644j28609J21241k30457j64115M65783J54164
10996I14847l78605k45602K36362L64847D06044k6243K73346L75161k93838k82333
10986D52137J43359M17384j67091O2912j03989J12433K39088k58689J81364l6602
10976A042306M48939m12152J05585L24988J69173O32002k23890M31834j51846
10967B366939n6175K34934k64758J66402k80725j89155j90231l36841j00157O344
10957A356577J74142k01996J51613p3422J367K8158n1855l89484L32849l80484
10947I47465N7758k05451j4419j73900j94587M0560L7794k46771P3098q0471A17635
10935G722h624k80397B25663J37528b1945A6062i5921C97277D7262A7900P4150
$$ y = [485379, 883677, 598035, 439196, 696840, 568231, 689472, 459015, 294900, 760683, 914847, 536242, 290640, 527002, 891849, 406044, 379801, 653147, 1028308, 734470, 452137, 595496, 1012880, 845789, 908701, 804712, 917145, 1156233, 897544, 1078908, 1042306, 1491245, 1079093, 1184678, 1509666, 1678839, 2310841, 2086951, 2518785, 2366939, 2310764, 2545698, 2280940, 2447342, 2166617, 1977462, 1787231, 1450390, 1350233, 1356577, 1530719, 1328723, 1480336, 1406914, 1408281, 1436439, 1384584, 995100, 1327949, 947465, 1005223, 799772, 785353, 611453, 416866, 457426, 495220, 248449, 321547, 241076, 117635, 7722, -8624, -289021, 225663, 363191, -21945, 16062, -95921, 397277, 47262, 17900, 92050]
10924I2050j6606J9089c1047j51763F8680b03467C8492N1844B882c5188n8964
10913i4152M2271B9912o876b14363m0442a06854N2643C491J13767B4965a0109
10901h6708I51c06031A94164c0218A99627A6571a26656b5847k56690Q9231n4839
10890b48145J09980b4774F0698j4595b29848d1733r4332G7438e5536p6840B63729
10878d6289l84904C49979C5002f9310F3442d2490m24295F9899e6319j07799B72572
10866A61182D9163J89742a75076O8936B55019C1116N715g9273j33391A77579G0804
10854b0870A10882a96737b4401k5772F1685J1636J3631J3147a13876A30131i9689
10842f415j32143B31131E124c13825F0299b26995h0983a6281r7499B9618M7421
$$ y = [92050, 75444, 94533, -31047, -182810, 68680, -203467, 38492, 90336, 2882, -35188, -94152, -51881, 29912, 23036, -214363, -254805, -106854, -54211, 3491, 117258, 24965, -10109, -86708, 951, -306031, 194164, -30218, 199627, 16571, -126656, -25847, -282537, -193306, -248145, -138165, -24774, 60698, 46103, -229848, -41733, -136065, 77438, -55536, -132376, 263729, -46289, -431193, 349979, 35002, -69310, 63442, -42490, -466785, 69899, -56319, -164118, 272572, 161182, 49163, 238905, -175076, -106140, 255019, 31116, 36831, -79273, -212664, 177579, 70804, -20870, 110882, -196737, -24401, -50173, 61685, 73321, 86952, 100099, -113876, 130131, -99689, -6415, -138558, 231131, 5124, -313825, 60299, -226995, -80983, -16281, -113780, 29618, 77039]
10831G7039a84966a3688l87844B2134d62181I6825m6120g434j05938D07907H2212
10819b94904a30952j64108A18205J26019F7434b23501C8022b51089F0589g5375
10808H4008J8201c69j85673f0661o7818k0907M3091j12230L1888G9708f8490D2848
10795a56608O9935d3288H9826A0709M8897f8390k52789N4422B5624a74244q8122
10784b62366Q9076e8442q450F4427i5740b8697B5604b91351J25366j9196D7679
10772g5847j72203A55752a60133G7270b56200P4465Q2147j12805J9289a7061k36489
10761b53550A14184b8341k47840a07717e2935k08629J12947F9893A1835J60348
10751A72183f3506A54345J69281A35057J5564L229h2408B078e0297m7916K2559
$$ y = [77039, -184966, -13688, -401532, 22134, -462181, 96825, 50705, -7434, -113372, 407907, 82212, -294904, -130952, -295060, 118205, 244224, 67434, -223501, 38022, -251089, 60589, -75375, 84008, 102209, -369, -186042, -60661, -128479, -149386, -106295, -218525, -186637, 79708, -68490, 42848, -156608, -86673, -43288, 89826, 10709, 59606, -68390, -321179, -266757, 25624, -174244, -262366, -173290, -58442, -66892, 64427, -95740, -28697, 25604, -291351, -165985, -185181, 47679, -75847, -248050, 155752, -160133, 77270, -256200, -181735, -99588, -212393, -193104, -17061, -253550, 114184, -28341, -276181, -107717, -52935, -261564, -148617, 69893, 11835, 172183, -63506, 154345, 323626, 135057, 150621, 153850, -82408, 2078, -50297, -98213, -75654]
10740g5654k50278A59807f3844m033M168k24562d3083A65461a34806A10910a27960
10728A40088a50750j06198A86325p5419a47152M507j39261J08199f4574A9732
10717a60718l33023a25566A37909Q4418m0874B7024N89769i3993j26271D26689
10706H4990c77025G132a54371j90455C3758a254r0540k7049A64777p8822R7296
10695A83251c9526A61110b44956b1909B20367a84907c6550k65786a1954e103j73694
10684a78797l1123A54782h8304l01051F3458a17764G2569O0646L7078a73862d1979
10672a35945j73854E8971g2722j8768I440L3370J7420b72911a33603d7613G7286
10660a24152k30686d732A76380O1139B7142L13983g860I9059g1221A03468b18106
$$ y = [-75654, -325932, 159807, -63844, -67877, -63709, -288271, -43083, 165461, -134806, 110910, -127960, 140088, -150750, -256948, 186325, 110906, -147152, -142645, -281906, -173707, -64574, 19732, -160718, -493741, -125566, 137909, 222327, 181453, 27024, 616793, -93993, -220264, 426689, 84990, -377025, 7132, -154371, -344826, 33758, -1254, -91794, -118843, 164777, 85955, 183251, -39526, 161110, -244956, -21909, 220367, -184907, -36550, -302336, -11954, -5103, -178797, -209920, 154782, -88304, -389355, 63458, -117764, 72569, 133215, 170293, -173862, -41979, -135945, -309799, 58971, -72722, -91490, 9440, 42810, 60230, -272911, -133603, -47613, 77286, -124152, -354838, -4732, 176380, 237519, 27142, 341125, -7860, 99059, -71221, 103468, -218106]
10648G4727D106J8662O9526b22088A73833o8339b45380E6549f6696k87494A52416
10636A22169B5087b31138g5745q0235L5322d9592k12797e5008q1523d0649o2954
10625a03603L6322A00049O8255D4079j4969g7995p2466G9609E999a60246O4912
10614i5334o6323A09216c9835A10221a14218j28426M2368A6116c3266j00497C28252
10602b24318A29062B8543n163a72047j57300C05386i7857G8364a84558B14931
10591d6734j65418L0771a2122e707p5323l07785d0340k39583A58893j3255c6428
10579c3930A16646D2416a49412K8196j64558A38606f895j7699m57372J71755j67023
10568d77234A5745K10787F7836J67501a99281k22052a65004B56514a93513j7045
$$ y = [74727, 4106, 22768, 92294, -222088, 173833, 105494, -245380, 56549, -66696, -354190, 152416, 122169, 25087, -231138, -75745, -155980, -120658, -49592, -262389, -55008, -136531, -40649, -103603, -67281, 100049, 168304, 44079, 29110, -77995, -150461, 79609, 5999, -160246, -95334, -161657, 109216, -39835, 110221, -114218, -242644, -200276, 16116, -33266, -133763, 328252, -224318, 129062, 28543, 23380, -172047, -329347, 305386, -97857, 78364, -184558, 214931, -46734, -212152, -181381, -12122, -5707, -81030, -388815, -40340, -279923, 158893, 145638, -36428, -33930, 116646, 42416, -149412, -121216, -285774, 138606, -6895, -24594, -481966, -310211, -477234, 15745, 226532, 67836, 235337, -199281, -421333, -165004, 256514, -193513, -210558]
10558b10558B9274b49105i5983A11880E816J52446E0689a33094q9291l17B2843
10546B17153b24577c5993A97953A6875b34718i9315B32515B1688b07189f6703
10535A43983a79230f7610k7291l7135F0145b0032A51504l7921a83281C3376Q1916
10524A15292M3441p3069g1498A17538b60153B10421c27509d6110j51567B5532
10513A02444N645a02759o7383l8662D2669c29167a07556B2676c184k32589G1372
10501b35737O8143p901E5268a31315M5711C19638c74555H8506K38144b8415A85650
10489h5496e206k36566j51266a93646F7253h9691E5733l377i2706j15780H5118
10477a29830B4310L29815a26183F72239j26472j11689a5118B21940a4781j254
$$ y = [-210558, 29274, -249105, -95983, 111880, 5816, 158262, 50689, -133094, -222385, -222702, 22843, 217153, -224577, -35993, 197953, 16875, -234718, -99315, 232515, 21688, -207189, -66703, 143983, -179230, -67610, -94901, -132036, 60145, -20032, 151504, 113583, -183281, 33376, 115292, 158733, 85664, -71498, 117538, -260153, 210421, -327509, -46110, -197677, 25532, 102444, 108089, -102759, -170142, -208804, 42669, -329167, -107556, 22676, -3184, -235773, 71372, -235737, -167594, -175495, 55268, -131315, -85604, 319638, -374555, 88506, 326650, -28415, 185650, -85496, -5206, -241772, -393038, -193646, 67253, -89691, 55733, 52356, -92706, -208486, 85118, -129830, 24310, 354125, -126183, 672239, 545767, 434078, -15118, 221940, -14781, -16035]
10467a6035H5773k9985A2214J65652o8182e2665A35360e3721g53k13113c1112
10455A1264a5277j49235j36985B27178F9704j311a7607E1102a45905j44825A85082
10443c467j80609A71747a1113C8309a19236l6819n0672n220A02981L6145Q7766
10432B26892h2443k64946J43707D03900g4837k4231j72945q5811C34660b98518
10421c32619P7705B7744K3660N6745A0995a30785j88776a38581B79256M164G557
10409b60348M255M0857i8361j97764c1126C37607r4320a47706E7376k5433m800
10398B7143J29181j1763f5411j57491A24477l933c32640b7505J2720j20517H5130
10386b16059C13120A32721f0313r1253B24247J85619j60206b38196B01022C1006
$$ y = [-16035, 85773, 55788, 12214, 177866, 109684, -52665, 135360, -53721, -753, -213866, -31112, 11264, -15277, -164512, -301497, 227178, 69704, 68393, -17607, 51102, -145905, -290730, 185082, -3467, -184076, 171747, -11113, 38309, -119236, -156055, -206727, -211947, 102981, 139126, 226892, -82443, -347389, -203682, 403900, -74837, -99068, -272013, -357824, 334660, -298518, -332619, -254914, 27744, 51404, 108149, 10995, -130785, -319561, -138581, 279256, 283420, 7557, -260348, -256093, -215236, -98361, -296125, -31126, 337607, 243287, -147706, 57376, 31943, 27143, 156324, 144561, -65411, -222902, 124477, 120544, -332640, -27505, -14785, -135302, 85130, -216059, 313120, 132721, -60313, -151566, 224247, 409866, 249660, -238196, 201022, 31006]
10375b4967G2924m492a9389C5687K18763p8795J34634b7227A93283L62511r3119
10364D62675A41812J18289M10593k52775j38492F3975b185B95305d8632A65499
10353A27525J04074p5749n8184a00302A41452J96577J06392L00154C01562j25421
10343A76141J02161J32187K32303B62603G130J33529O1154J10139M912E7677g7333
10331E01309j62661A38386M69185g1075A70133k6210D7027a68437d6124A44579
10320C09436A22245L4132D7323J13665J80681d0130B87960E1897l3L7538k4010
10309F5392a11159J5555C86928E5799J38364a60698d8396a509B6748c35712d460
10297a37575A046d3437i861j29166K8649j52608R5321A7196f49132a7272C0818
$$ y = [-24967, 72924, 68432, -19389, 35687, 254450, 175655, 310289, -27227, 193283, 555794, 462675, 141812, 260101, 670694, 417919, 279427, 63975, -2185, 295305, -48632, 165499, 127525, 231599, 155850, 97666, -100302, 141452, 338029, 444421, 744575, 301562, 176141, 278302, 410489, 642792, 262603, 7130, 140659, 201813, 311952, 316864, 57677, -77333, 501309, 338648, 138386, 607571, -71075, 170133, 143923, 47027, -168437, -46124, 144579, 309436, 122245, 156377, 47323, 160988, 341669, -40130, 287960, 51897, 51864, 89402, 65392, -111159, -95604, 386928, 55799, 194163, -160698, -48396, -1509, 26748, -335712, -4460, -137575, 1046, -43437, -9861, -139027, -110378, -262986, -167665, 17196, -649132, -17272, 30818]
10285B11880C2662J9920a06716k3000D06124C2284L74112h1954A37583d20018
10274A46323P6293g3860q0647D5326c28396h7530a6329o2280b0375A06684h4484
10262F3014R670a54101D3812a76033B23345R3426a18035B0617o781K39779A12170
10250C53329j10262k6172r8961a8140o5972A94742M2104c61445i3940I2573b13550
10238a08800c7801J2621C10761I1321a87607k1917a2038k22374a05230j03098
10228b08328A24449L4006d0220j26323B9870P9076J9359c06123J26929j5203n7809
10217b52206J11718C12399a70904B29282m3010a06035B1473e6012K843A54661
10206A46100o594A3697a10786M3983k62618h7141k16703J16719A2786E716b06572
$$ y = [211880, 32662, 52582, -106716, -129716, 406124, 32284, 406396, -81954, 137583, -420018, 146323, 222616, -73860, -154507, 45326, -328396, -87530, -16329, -78609, -20375, 106684, -84484, 63014, 72684, -154101, 43812, -176033, 223345, 316771, -118035, 20617, 13836, 253615, 112170, 353329, 243067, 216895, 117934, -18140, -84112, 194742, 236846, -361445, -93940, 92573, -213550, -108800, -37801, -25180, 310761, 91321, -187607, -209524, -12038, -234412, -105230, -208328, 124449, 158455, -40220, -166543, 29870, 108946, 128305, -306123, -179194, -194397, -252206, -140488, 312399, -170904, 229282, 186272, -106035, 21473, -56012, -53169, 154661, 146100, 139506, 13697, -110786, -66803, -329421, -87141, -303844, -187125, 12786, 5716, -206572]
10194a54237F0495P4980c8638l94633b09339j9791g7172j59421A92530b74558
10183d49851N7978h9804j36475o4545D1342a53504C7735b6571k0488a0528l75562
10172c86090G3561d3901N839j97931j53802e472j58151C17661a76772B74559j12841
10161A61718B9368a21035M241m33284e5090F4665e430j43771m2591g7235A03646
10149a39751C7946Q4860b21855j0843H7645a22317k16203A26353a14142O247c2393
10137e66017b06610D8502a77798d8785j74000C4132A2458Q7615k5565a68843A69545
10125i9840o303L3414b1946j12054l2300F9803a33793j77668a37461c5446d851
10113A07508e21619K45138A10155a41805I0075a22074C553h3384G4494b27032
$$ y = [-154237, 60495, 135475, -38638, -433271, -209339, -229130, -77172, -236593, 192530, -274558, -449851, -391873, -89804, -226279, -290824, 41342, -153504, 37735, -26571, -47059, -10528, -386090, 73561, -43901, -38062, -235993, -389795, -5472, -163623, 317661, -176772, 274559, 161718, 29368, -121035, -116794, -550078, -55090, 64665, -5430, -149201, -191792, -77235, 103646, -139751, 37946, 122806, -221855, -232698, 87645, -122317, -338520, 126353, -114142, -107895, -32393, -566017, -206610, 48502, -177798, -48785, -222785, 34132, 12458, 100073, 74508, -168843, 169545, -99840, -106143, -72729, -21946, -134000, -166300, 69803, -133793, -311461, -137461, -35446, -4851, 107508, -521619, -276481, 110155, -141805, 90075, -122074, 3553, -83384, 74494, -227032]
10102b39434i8198q9583b3392B2710c79325J63941R1233K6222b9018m3825o9530
10091a42373A56096h3827k35650E685f6779B56588I8714a67890m00224a27351
10080a38384l1486l235m0755I2859M7638A8253e57898i8598D195L83307a22723
10068b81718R9979L1985N7236n6734L4178o241H7605b82156E4949a45710B81226
10056f2782K1940A02720a25835D6248a59815l34444a01110k09128A83351l3738
10046A49613J1441d8846l38501J52912a1671k50578i8243h669j75431K7495O0831
10035i5774B77517a77698D2859J30423b02377g8405G8675c84838H3305B8490c31136
10023b81861a02348j78003a20147E561O4283h3097j10692c493A34015D6105K36735
$$ y = [-239434, -98198, -187781, -23392, 22710, -379325, -215384, -124151, -97929, -29018, -72843, -142373, 156096, -83827, -319477, 5685, -66779, 256588, 98714, -167890, -568114, -127351, -138384, -169870, -173105, -213860, 92859, 140497, 18253, -557898, -98598, 4195, 387502, -122723, -281718, -181739, -149754, -92518, -149252, -115074, -121315, 87605, -282156, 54949, -145710, 281226, -62782, -40842, 102720, -125835, 46248, -159815, -494259, -101110, -310238, 183351, 149613, 161054, -48846, -387347, -234435, -11671, -262249, -98243, -8669, -184100, -156605, -95774, 277517, -177698, 42859, 173282, -202377, -78405, 78675, -384838, 83305, 28490, -331136, -281861, -102348, -280351, -120147, 5561, 69844, -83097, -193789, -3493, 134015, 46105, 282840]
10012B82840A3415J11430a30j75955B73237i2601k0623d6937I302c48894h1314
10000i2780B83661d3075A57353A344M7111b05042k03435J50968J08457l04696
9990d53748c8086m9560j30831i598C4399A4235a19595E1924j9869c614j78736
9979a82350c4151j74292P3257j49729O5450c0238C6500g7400A31152d4970H3470
9967h2846k15694B90689a34878K9291j03817K0902B9441f9359l02678a23687d7459
9955a14742j3848r5167K2160A35750a75237C2638R7974b78590B06204b60223j32346
9944c92569J30193M5893E2502c0890A62171i1367m7812A29179b70843B41848d21337
9932a4048r542k39212f3672A01663a25320C2486a79500B11665a21816D8480g0573
$$ y = [282840, 13415, 124845, -130, -176085, 273237, -92601, -113224, -46937, 9302, -348894, -81314, -92780, 283661, -43075, 157353, 1344, 48455, -205042, -408477, -257509, -149052, -453748, -38086, -87646, -218477, -9598, 34399, 14235, -119595, 51924, 32055, -3614, -182350, -34151, -208443, -135186, -284915, -219465, -30238, 36500, -77400, 131152, -44970, 83470, -82846, -298540, 290689, -134878, -105587, -209404, -188502, 29441, -69359, -372037, -123687, -47459, -114742, -128590, -223757, -201597, 135750, -175237, 32638, 130612, -278590, 206204, -260223, -392569, -262376, -216483, 52502, -30890, 162171, -91367, -139179, 129179, -270843, 241848, -421337, -14048, -23590, -262802, -63672, 101663, -125320, 32486, -179500, 211665, -121816, 48480, -70573]
9920a48823F4113l135a64426O8147k73864d6678H0881d77392B6079g2726j45981
9909b18707N3906F5796A7743P9058a83769d5404k13958J13831r2514R7999I8600
9897A02669i4990l8886L7481a1453A99893a51665B9310d9306j74058J01333j59767
9886b81798J21514C6870a50562K2596N9782D0745c50158a04146j17472r2357A61131
9874B20857E7738J03290a5042l58855f9818A63786J00595J10737d0241k18906
9864b59147Q0068Q9009c3320o9694K0113l80305b23340f5421b0949q3972I4133
9852b43644d5285K1419k00501q1691G0461a23623A8633N5396c49771a55041A79467
9840a15968B44945a99430b2363A0166K447f8541k18915E3447K4883i545l04515
$$ y = [-148823, 64113, 60978, -164426, -96279, -370143, -46678, 80881, -477392, 26079, -72726, -218707, -164801, 65796, 17743, 96801, -183769, -45404, -259362, -145531, -238045, -140046, 98600, 102669, -94990, -133876, -96395, -11453, 199893, -151665, 29310, -49306, -223364, -122031, -281798, -160284, 36870, -150562, -127966, -68184, 40745, -350158, -104146, -221618, -313975, 161131, 220857, 57738, 161028, -15042, -373897, -69818, 163786, 264381, 375118, -40241, -259147, -179079, -90070, -33320, -103014, -82901, -463206, -223340, -65421, -20949, -104921, 94133, -243644, -45285, -23866, -224367, -306058, 70461, -123623, 18633, 74029, -349771, -155041, 179467, -115968, 244945, -199430, -22363, 10166, 12613, -68541, -287456, 53447, 78330, -9545, -314060]
9829c14060j05443E7454M9947c7390l08698A45255M456E0138f3322a333j14690
9818a16023D380b46418J02145F4695a56244C06404c3358D1198a45274O1241k28950
9807c12983o9809h4285c7154A86555c04635l1224l05858B07713k7318E2699J77489
9796B30188A13041K31915a43731B05141a75925a7558j04092l1534B8025J98598
9786B26623e6773k05784J17918E6005a14333j43542e9188r865C30760A24068c67892
9774a93500I133J12137D4629f1546F7293K6805i6723B40524G9695a54165d6225
9762D5999N0935D4156J5485N247b2374l25189a5438j18770f4687m8355n7100n2101
9750b22243f8362j14392j49896h3001A02393E1117O6473b63415a18785m3497E9654
$$ y = [-314060, -419503, 57454, 107401, -37390, -346088, 145255, 149711, 50138, -63322, -1333, -116023, 4380, -246418, -144273, 64695, -156244, 306404, -33358, 41198, -145274, -84033, -312983, -382792, -84285, -37154, 186555, -304635, -335859, -641717, 207713, 180395, 52699, 230188, 113041, 344956, -143731, 205141, -175925, -17558, -121650, -153184, 28025, 226623, -56773, -262557, -144639, 56005, -114333, -257875, -59188, -69053, 330760, 124068, -367892, -193500, 9133, 121270, 44629, -61546, 67293, 94098, -96723, 240524, 79695, -154165, -46225, 45999, 96934, 44156, 59641, 64888, -22374, -347563, -15438, -134208, -64687, -113042, -170142, -222243, -68362, -182754, -332650, -83001, 102393, 51117, 117590, -263415, -118785, -162282, 59654]
9738D4306b90777E9884a00586k6903A03557f3895q6260f2328n3984K834A61017
9726b30006A86476a22249m3784K0051c0571I9796f6160A10712a50505k12870H4661
9714c6487F6670b41227k48444E5577a14869k35729B57957O6409H4551B3951M4690
9703F8641L0912Q0309a06766L0531p3775R755d9782b4112B19764i1500E7705A4735
9690G47M4637b54013A3950c9023k44901c0087j23893j9663L6279G142a02247c4895
9677e9613B3496f5811A92896a40428h972C2219a36893F1190a33920N0613j57422
9666b40729J12172N2399j09160o3691O9960A287a27516k15254H2703c03695A49330
9654b34681J5312D3333a06516k99711a24883A99421H1943a21984j652l64673A14308
$$ y = [44306, -290777, 59884, -100586, -127489, 103557, -63895, -150155, -62328, -116312, -113478, 161017, -230006, 186476, -122249, -166033, -145982, -30571, 99796, -66160, 110712, -150505, -363375, 84661, -36487, 66670, -241227, -489671, 55577, -114869, -350598, 257957, 324366, 84551, 23951, 68641, 99553, 179862, -106766, -76235, -150010, -140255, -49782, -24112, 219764, -91500, 57705, 14735, 747, 45384, -254013, 13950, -39023, -283924, -30087, -153980, -173643, -137364, 7142, -102247, -34895, -59613, 23496, -65811, 192896, -140428, -8972, 32219, -136893, 61190, -133920, -83307, -240729, -128557, -76158, -185318, -249009, -179049, 1287, -127516, -342770, 82703, -303695, 149330, -234681, -219369, 43333, -106516, -406227, -124883, 199421, 81943, -121984, -123636, -488309, 114308]
9642A4737a83941h1273n0225A76525c03446a49966e2402k8513I4849i2707G7586
9630f0786j28360h6830j73165R1315j81370J50890K2047j3010E9959b50644j46922
9619c97566J45632L1709M5434q2063Q3249d2934j60592Q7863j51690P0677J8343
9608a78333e7565H2757a94928e1241b3772D8160K6687a35784K6842F9875g762
9596b83601d2895r4153C05153a26527A50980b17523d3707k86261O8134k3248a25380
9584C00372G6610P749b57434E432J07030a79541q3798A40725d38528B3903i9809
9572G3623M3917a72773A21029g8850C45037h7372F0122a58320M4930O011B28389
9560A5506b1272j59862H8661b79648D5029O4272A216J29810E759h2360C6925a01909
$$ y = [14737, -183941, -81273, -131498, 176525, -303446, -149966, -52402, -80915, 94849, -92707, 77586, -60786, -189146, -86830, -259995, -168680, -350050, -199160, -177113, -190123, 59959, -250644, -397566, -251934, -220225, -174791, -256854, -173605, -42934, -203526, -115663, -267353, -196676, -178333, -57565, 82757, -194928, -51241, -23772, 48160, 74847, -135784, -108942, 69875, -7762, -283601, -42895, -137048, 305153, -126527, 150980, -217523, -43707, -329968, -261834, -285082, -125380, 300372, 76610, 84359, -257434, 5432, 112462, -179541, -263339, 140725, -438528, 23903, -99809, 73623, 117540, -172773, 121029, -78850, 345037, -87372, 60122, -158320, -113390, -107379, 228389, 15506, -21272, -181134, 88661, -279648, 45029, 109301, 1216, 131026, 5759, -82360, 36925, -101909]
9547e8083G4064c31692B67267D3933M6505h8550j60269f5474o0575D9233C896
9535A1299a83543D1371a90089o8880A52672d0236m64116N5661C615J49057J97484
9524C50156i7698A45626b45819O0347O8084b6080A09708a93193b6379l32724A07202
9512B4430J21661a28158H8240a8771l1937r8241I658g2453B11430g4638A00688
9500B4381M7649g6086n2238A39760B3203b15502A97500b0318j53735B19376F0238
9488A37370D7376J1243K9768c22654D1202i1283k45495i8355j2968l4839j23179
9477b69341j39872J06431A05044P2536a31576e8588b0338l5436r5687q0610A8491
9465E5989J9057a76575H7047R4921A0136N8446c32980R0755k21644B13617H838
$$ y = [-58083, 74064, -331692, 267267, 43933, 90438, -88550, -248819, -65474, -126049, 49233, 3896, 11299, -183543, 41371, -190089, -258969, 152672, -40236, -504352, -448691, 3615, 152672, 350156, -97698, 145626, -245819, -185472, -117388, -26080, 109708, -193193, -26379, -359103, 107202, 24430, 146091, -128158, 88240, -18771, -50708, -148949, 9658, -72453, 211430, -74638, 100688, 24381, 72030, -76086, -128324, 139760, 23203, -215502, 197500, -20318, -174053, 219376, 60238, 137370, 47376, 58619, 88387, -322654, 41202, -91283, -336778, -98355, -111323, -146162, -269341, -409213, -302782, 105044, 177580, -131576, -58588, -20338, -55774, -151461, -232071, 18491, 55989, 75046, -176575, 87047, 181968, 10136, 68582, -332980, -242225, -463869, 213617, 8838]
9453B15259e8978j95722D4948b06273B03419E8113a56034A42779b06117q4285
9443b90402A37717a85918i1074j92258f6200C2129J43252D1928A0436Q9160f91380
9431a50948N1850I8506a17996e6367j19533M6544m14467b3164F5576f7436A87071
9419A07468b2691H9646b4510p3653A30476K56474A86548a64559B6854J85137A5479
9407a84619k05244d7415H9978q841b05718M5550C0265d8914A8044b29246c9872
9395b22574f4901r7871k4108o310E654i0294j37038E3493b77386A29249b02634
9383a71719E363a97464i6916n876r6048d4411j71080C682a6714k53513C1651c40072
9370f1833B4123b74635c5112m4514k99526B82081a10035a1998q6943o3442j07586
$$ y = [215259, -58978, -254700, 44948, -206273, 203419, 58113, -156034, 142779, -206117, -290402, 137717, -185918, -91074, -283332, -66200, 32129, 175381, 41928, 10436, 99596, -691380, -150948, -99098, 98506, -117996, -56367, -175900, -129356, -543823, -23164, 65576, -67436, 187071, 107468, -22691, 89646, -24510, -98163, 130476, 386950, 186548, -164559, 26854, 211991, 15479, -184619, -389863, -47415, 89978, 81137, -205718, -160168, 30265, -48914, 18044, -229246, -39872, -222574, -64901, -162772, -186880, -193190, 5654, -90294, -227332, 53493, -277386, 129249, -202634, -171719, 5363, -197464, -96916, -102792, -198840, -44411, -215491, 3682, -16714, -270227, 31651, -340072, -61833, 24123, -274635, -35112, -79626, -379152, 282081, -110035, -11998, -98941, -162383, -269969]
9359b69969e0937j62503c3860n0015F4498K20193j23176a63803c2371j01452d6570
9347C7315i453D4525J91705a53428j67821i6170L3515D8135c80084h5726E1277
9335c12835A15805c85164H861O1559N1840a65212q4761D3538b52473H8799R0579
9324A79378b55671a11557A14852J41850f8561B09789o5102K42939a24587j89901
9314c14488D8352h9343K2590D6324b3530E21672a09622J5346c349o7605C0717
9302a19611j09074n6247c2016B86006I8336a50575m350f1820l11508a18305d7074
9290E1100J0627N9511b55356B4398a55321f5364j4310k42945P2825A39080F8279
9278d6025J2019k02421G3645a98793B59169C330J07905I421a10735G0502a04985
$$ y = [-269969, -50937, -213440, -33860, -83875, 64498, 284691, 161515, -163803, -32371, -133823, -46570, 37315, -9453, 44525, 236230, -153428, -321249, -96170, -62655, 48135, -380084, -85726, 51277, -312835, 115805, -385164, 8861, 70420, 122260, -165212, -249973, 43538, -252473, 88799, 179378, -255671, -111557, 114852, 256702, -68561, 209789, 144687, 387626, -124587, -314488, 48352, -89343, -66753, 46324, -23530, 521672, -109622, -94276, -3349, -70954, 30717, -119611, -228685, -284932, -32016, 286006, 98336, -150575, -154925, -61820, -373328, -118305, -47074, 51100, 61727, 121238, -255356, 24398, -155321, -65364, -79674, -322619, -249794, 139080, 68279, -46025, -34006, -236427, 73645, -198793, 259169, 3330, 111235, 9421, -110735, 70502, -104985]
9266a21282A40121b52014A85560c25838L2537J35030C974a75104N7895a4842j26570
9255a41412r6958N6869G6111a16811q6845C73521g1791J0838j5664m4983A30179
9243b35754J14321A31697g3781q0389p5273g2648A74738E9670j781a28916A15293
9231b85411H1999a38337j88059G1778b18199E2642B4105Q4686b89269A46618h1120
9219b66056b3929k04446N3908L6330B41678m1908b56063D9425J42247D4625a70225
9207A09111e8983B9673b91720j0887L0194d1400j8331O2l31420J56540j1505j26655
9195c72709a01322L726j5138a2080j6326j9923b2038j08972k171M3759j6752E6630
9182b87759B84774a51112P3694D8673b04184r160b7893A55410a99170p0806A30840
$$ y = [-121282, 140121, -252014, 185560, -325838, -293301, -158271, 3974, -175104, -117209, -14842, -141412, -238370, -181501, 76111, -116811, -203656, 373521, -71791, -60953, -76617, -121600, 130179, -235754, -121433, 131697, -73781, -154170, -229443, -72648, 174738, 59670, 57889, -128916, 115293, -285411, 81999, -138337, -326396, 71778, -218199, 52642, 24105, 108791, -289269, 146618, -81120, -266056, -23929, -228375, -174467, -138137, 241678, 199770, -256063, 49425, 191672, 44625, -170225, 109111, -58983, 29673, -291720, -302607, -272413, -41400, -59731, -59669, -391089, -234549, -246054, -372709, -101322, -97596, -112734, -12080, -28406, -48329, -22038, -131010, -133181, -89422, -106174, 56630, -287759, 284774, -151112, -77418, 48673, -204184, -213344, -27893, 155410, -199170, -269976, 130840]
9170D18373p8930A7396d5506p9530K7962j59082B7752a85225g7598c7462A17014
9158a19942A96387g6468n7234A17104c8958k18279a08854G6727a55942P5547B34401
9146b22020k3709B33881C8116a18806p7257N0369f1933E0785J36120C4410a60124
9134b18057f0502G2763f4148o5120E0456b84652r2644J43153J16791J1428B37628
9122a96745A36068b0419j39967k32266d3298A41002b07519j14854k4958A05266
9111E1903b35372Q7551A58480a91566P3863C127d0039C31557b26586A3985a5241
9099A36511n4356e9244j40802J4484P9444p556A01841D721d192B98395a4111k05002
9087b19113e1864C71249a90160e1084B16918M6940a22361k03038h9369l1166A11974
$$ y = [418373, 339443, 17396, -45506, -125036, -97074, -256156, 27752, -185225, -77598, -37462, 117014, -119942, 196387, -76468, -133702, 117104, -38958, -257237, -108854, 76727, -155942, -80395, 234401, -222020, -245729, 233881, 38116, -118806, -196063, -145694, -61933, 50785, 186905, 34410, -160124, -218057, -60502, 72763, -64148, -129268, 50456, -284652, -377296, -234143, -117352, -105924, 237628, -196745, 136068, -20419, -160386, -392652, -43298, 141002, -207519, -322373, -347331, 105266, 51903, -235372, -147821, 158480, -191566, -117703, 3127, -40039, 331557, -226586, 13985, -15241, 136511, 82155, -59244, -200046, -185562, -106118, -113674, 101841, 4721, -4192, 298395, -14111, -219113, -51864, 371249, -190160, -51084, 216918, 263858, -122361, -325399, -89369, -120535, 111974]
9075A0521K0178h4994q5546B00722F453a01297C5504J46862d2444A76607b99897
9063b06790A38113e878k80327a41979B37026D1649J47132g4504B15580H3808J0890
9052I4698c40263B0877a97566G0067K56593b01913b4934j23531d0608j01649N4081
9041h8176l80324C35688f1712j98160a01835j12798p0901F1670J73992r0137b56581
9029c1392C83885c0637C7225J34114a87662B11962e9686A28179b8405n4262A39162
9017G1797a19074B06078A9877i6177D2088a08836k59318a20483k60426J34863
9007b46046A6746a72158j51302k50107F8588a9658m5276j3503H0282a22297m235
8996a26532e5574k37764k1729F0666b07314R8112B04337K18177D864a1069k39993
$$ y = [10521, 30699, -84994, -170540, 200722, 6453, -101297, 35504, 182366, -42444, 176607, -299897, -206790, 138113, -5878, -286205, -141979, 237026, 41649, 188781, -74504, 215580, 83808, 94698, -340263, 20877, -197566, 70067, 326660, -201913, -24934, -148465, -40608, -142257, -88176, -468500, 335688, -61712, -259872, -101835, -214633, -285534, 61670, 235662, 145525, -256581, -31392, 383885, -30637, 37225, 171339, -187662, 211962, -59686, 128179, -28405, -82667, 139162, 71797, -119074, 206078, 19877, -96177, 42088, -108836, -368154, -120483, -380909, -246046, 16746, -172158, -323460, -573567, 68588, -19658, -64934, -78437, 80282, -122297, -126532, -55574, -293338, -315067, 60666, -207314, -109202, 204337, 422514, 4864, -11069, -251062]
8985b51062M2482A92489a10738j13573K4497D0928F030a15065M9579j49205A53740
8973c75711C9931a84329A20499g8410B33875F7448a05466M9780A00997k0305h9221
8961A00112M20905j82633b94273a1824j55862M7675j05053i3942m33J7188j88951
8950b66138C7866C972b37280A57989b85202N5833e9547K4952k5374j30710j72587
8939c63266a4878A22135h759G0362a47481k30550B23667H5280P9885b16641H3797
8927B13482D6438n375a34198B47400k770J94778L49539L324493Q165150D464245
8916A869781F42600J94789p4647C19288A58899P4750j13613J29798Q3612j08436
8906B25010J61216L8082c7079I6097b7165n6299j8093A24070h769P34j1678A46953
$$ y = [-251062, -208580, 192489, -110738, -224311, -199814, 40928, 6030, -115065, -65486, -214691, 153740, -375711, 39931, -184329, 120499, -78410, 233875, 67448, -105466, -55686, 100997, 80692, -89221, 100112, 521017, 338384, -294273, -11824, -167686, -120011, -225064, -93942, -94375, -77187, -266138, 37866, 3972, -237280, 157989, -285202, -229369, -59547, -34595, -59969, -190679, -363266, -14878, 122135, -8759, 70362, -147481, -378031, 223667, 85280, 165165, -216641, 83797, 213482, 46438, 41063, -134198, 247400, 244630, 439408, 788947, 4113440, 12278590, 4464245, 1869781, 642600, 837389, 762742, 319288, 158899, 233649, 120036, 249834, 333446, 225010, 386226, 424308, -37079, 96097, -27165, -83464, -101557, 124070, -8769, -8035, -19713, 146953]
8893A09965b58294l0375i0962K9423D2883M6193e8877l437F1256B0877L2495J02188
8881A55560a07254L6590c1467j05790J4519N6297D9558a36560q1808o7418A57218
8869a27508F3309R0595o8797b28556e5560j1928k9725B08113a19463d6938h27
8857B53337f9501B23798P2068A28431Q8886d1163n7812A531a10753A09267b03868
8845a11783F6368J88283a36229A7007c12173g0840E0660O2447a09661j67226G740
$$ y = [109965, -258294, -288669, -90962, -61539, 42883, 89076, -58877, -62314, 61256, 20877, 53372, 155560, -107254, -70664, -31467, -137257, -122738, -66441, 49558, -136560, -218368, -285786, 157218, -127508, 63309, 153904, 85107, -228556, -55560, -67488, -97213, 208113, -119463, -46938, -827, 253337, -69501, 223798, 295866, 128431, 217317, -41163, -98975, 1531, -110753, 109267, -203868, -111783, 66368, 254651, -136229, 17007, -312173, -70840, 50660, 113107, -109661, -276887, 7740]
$$ [...]
##END NTUPLES=NMR SPECTRUM
##END=
