
##TITLE=AC1237_CNAOR12066_6610228_mVCA3ImiEX
##JCAMPDX= 6.0         $$ Bruker NMR JCAMP-DX V2.0
##DATA TYPE= NMR SPECTRUM
##DATA CLASS= NTUPLES
##ORIGIN= BRUKER
##OWNER= Administrator
$$ 1.72 TOPSPIN		Version 2.1
$$ 2012-08-02 01:25:22.062 -0500  Administrator@TOPSPIN
$$ Compression mode = diff/dup
##.OBSERVE FREQUENCY= 400.02188249412
##.OBSERVE NUCLEUS= ^1H
##.ACQUISITION MODE= SIMULTANEOUS (DQD)
##.ACQUISITION SCHEME= undefined
##.AVERAGES= 64
##.DIGITISER RES= 22
##SPECTROMETER/DATA SYSTEM= spect
##.PULSE SEQUENCE= noesygpps1d.comp
##.SOLVENT NAME= COFFEE_meoh
##.SHIFT REFERENCE= INTERNAL, COFFEE_meoh, 1, 14.96243
##AUDIT TRAIL= $$ (NUMBER, WHEN, WHO, WHERE, PROCESS, VERSION, WHAT)
$$ ##TITLE= Audit trail, TOPSPIN		Version 2.1
$$ ##JCAMPDX= 5.01
$$ ##ORIGIN= Bruker BioSpin GmbH
$$ ##OWNER= Administrator
$$ $$ C:\Bruker\TOPSPIN/data/COFFEE/nmr/AC1237_CNAOR12066_6610228_mVCA3ImiEX/12/pdata/1/auditp.txt
$$ ##AUDIT TRAIL=  $$ (NUMBER, WHEN, WHO, WHERE, PROCESS, VERSION, WHAT)
(   1,<2012-08-02 01:25:16.328 -0500>,<Administrator>,<TOPSPIN>,<go>,<TOPSPIN 2.1>,
      <created by zg
	started at 2012-08-02 01:13:46.171 -0500,
	POWCHK enabled, PULCHK disabled,
       configuration hash MD5:
       6B 1B 68 BB D9 2E 58 E2 7F 35 AD 54 07 DF 0E 41
       data hash MD5: 64K
       08 C6 11 54 6B A6 05 8E CF A8 F9 66 15 23 55 BB>)
(   2,<2012-08-02 01:25:19.703 -0500>,<Administrator>,<TOPSPIN>,<proc1d>,<TOPSPIN 2.1>,
      <Start of raw data processing
       efp LB = 0.3 FT_mod = 6 PKNL = 1 PHC0 = 0 PHC1 = 0 SI = 128K 
       data hash MD5: 128K
       AE 36 B2 F1 B3 79 80 86 F1 66 0E 54 02 11 0A C6>)
(   3,<2012-08-02 01:25:20.890 -0500>,<Administrator>,<TOPSPIN>,<proc1d>,<TOPSPIN 2.1>,
      <pk PHC0 = -1.560059 PHC1 = 0 
       data hash MD5: 128K
       42 86 36 68 27 22 DA 9F EE 7A A1 99 F1 AC 54 71>)
(   4,<2012-08-02 01:25:21.687 -0500>,<Administrator>,<TOPSPIN>,<proc1d>,<TOPSPIN 2.1>,
      <abs ABSG = 1 
       data hash MD5: 128K
       6D FA 69 D9 13 E5 D5 A8 12 CE 1A 6A 53 41 92 FA>)
(   5,<2012-08-02 01:25:21.781 -0500>,<Administrator>,<TOPSPIN>,<proc1d>,<TOPSPIN 2.1>,
      <abs ABSG = 2 
       data hash MD5: 128K
       46 36 3B 8D C1 DA 7A 86 61 0F F3 E7 99 0A D6 C5>)
(   6,<2012-08-02 01:25:21.859 -0500>,<Administrator>,<TOPSPIN>,<proc1d>,<TOPSPIN 2.1>,
      <abs ABSG = 3 
       data hash MD5: 128K
       02 D5 33 24 AD 89 1F F1 10 A3 41 F9 F9 7E 9E 35>)
(   7,<2012-08-02 01:25:21.921 -0500>,<Administrator>,<TOPSPIN>,<proc1d>,<TOPSPIN 2.1>,
      <abs ABSG = 4 
       data hash MD5: 128K
       18 44 89 08 3F 0D 7F 53 68 A3 A2 F9 22 9B A1 DF>)
(   8,<2012-08-02 01:25:21.968 -0500>,<Administrator>,<TOPSPIN>,<proc1d>,<TOPSPIN 2.1>,
      <abs ABSG = 5 
       data hash MD5: 128K
       80 DF FD 97 0F C3 C5 30 F9 FD E4 24 59 16 AA 47>)
$$ ##END=
$$ 
$$ $$ hash MD5
$$ $$ AC 80 C7 F8 65 0E E2 48 63 6D 8C 2C 58 3F F1 F1
##$RELAX= 
##$RELAX= 
##$RELAX= 
##$RELAX= 
##$RELAX= 
##$RELAX= 
##$RELAX= 
##$RELAX= 
$$ Bruker specific parameters
$$ [...]
##$TP07= 0
##$TPNAME0= <>
##$TPNAME1= <>
##$TPNAME2= <>
##$TPNAME3= <>
##$TPNAME4= <>
##$TPNAME5= <>
##$TPNAME6= <>
##$TPNAME7= <>
##$TPOAL= (0..7)
0.5 0.5 0.5 0.5 0.5 0.5 0.5 0.5
##$TPOFFS= (0..7)
0 0 0 0 0 0 0 0
##$TUNHIN= 0
##$TUNHOUT= 0
##$TUNXOUT= 0
##$USERA1= <user>
##$USERA2= <user>
##$USERA3= <user>
##$USERA4= <user>
##$USERA5= <user>
##$V9= 5
##$VALIST= <valist>
##$VCLIST= <CCCCCCCCCCCCCCC>
##$VD= 0
##$VDLIST= <DDDDDDDDDDDDDDD>
##$VPLIST= <PPPPPPPPPPPPPPP>
##$VTLIST= <TTTTTTTTTTTTTTT>
##$WBST= 1024
##$WBSW= 4
##$XGAIN= (0..3)
0 0 0 0
##$XL= 0
##$YL= 0
##$YMAX_a= 17587974
##$YMIN_a= -10558116
##$ZGOPTNS= <>
##$ZL1= 120
##$ZL2= 120
##$ZL3= 120
##$ZL4= 120
##$ABSF1= 14.96243
##$ABSF2= -5.595752
##$ABSG= 5
##$ABSL= 3
##$ALPHA= 0
##$AQORDER= 0
##$ASSFAC= 0
##$ASSFACI= 0
##$ASSFACX= 0
##$ASSWID= 0
##$AUNMP= <proc_prof1d_extract.lims>
##$AXLEFT= 0
##$AXNAME= <>
##$AXNUC= <1H>
##$AXRIGHT= 0
##$AXTYPE= 0
##$AXUNIT= <>
##$AZFE= 0.1
##$AZFW= 0.1
##$BCFW= 0
##$BC_mod= 0
##$BYTORDP= 0
##$COROFFS= 0
##$CY= 15
##$DATMOD= 1
##$DC= 0
##$DFILT= <>
##$DTYPP= 0
##$F1P= 0
##$F2P= 0
##$FCOR= 0.5
##$FTSIZE= 131072
##$FT_mod= 6
##$GAMMA= 0
##$GB= 0
##$INTBC= 1
##$INTSCL= 1
##$ISEN= 128
##$LB= 0.3
##$LEV0= 0
##$LPBIN= 0
##$MAXI= 10000
##$MC2= 0
##$MEAN= 0
##$ME_mod= 0
##$MI= 0
##$NCOEF= 0
##$NC_proc= -2
##$NLEV= 6
##$NOISF1= 0
##$NOISF2= 0
##$NSP= 0
##$NTH_PI= 0
##$NZP= 0
##$OFFSET= 14.96243
##$PC= 1
##$PHC0= -1.560059
##$PHC1= 0
##$PH_mod= 1
##$PKNL= yes
##$PPARMOD= 0
##$PPDIAG= 0
##$PPIPTYP= 0
##$PPMPNUM= 2147483647
##$PPRESOL= 1
##$PSCAL= 4
##$PSIGN= 0
##$PYNMP= <proc.py>
##$REVERSE= no
##$SF= 400.020009063726
##$SI= 131072
##$SIGF1= 0
##$SIGF2= 0
##$SINO= 400
##$SIOLD= 131072
##$SPECTYP= <>
##$SREGLST= <1H.CDCl3>
##$SSB= 0
##$STSI= 131072
##$STSR= 0
##$SW_p= 8223.68421052631
##$SYMM= 0
##$S_DEV= 0
##$TDeff= 65536
##$TDoff= 0
##$TI= <>
##$TILT= no
##$TM1= 0
##$TM2= 0
##$TOPLEV= 0
##$USERP1= <user>
##$USERP2= <user>
##$USERP3= <user>
##$USERP4= <user>
##$USERP5= <user>
##$WDW= 1
##$XDIM= 131072
##$YMAX_p= 402005793
##$YMIN_p= -11154
##$CURPLOT= <Network HP LaserJet P1505>
##$CURPRIN= <$Network HP LaserJet P1505>
##$DFORMAT= <normdp>
##$LAYOUT= <+/1D_H.xwp>
##$LFORMAT= <normlp>
##$PFORMAT= <normpl>
##$SURQMSG= 1
$$ End of Bruker specific parameters
$$ ---------------------------------
##NTUPLES= NMR SPECTRUM
##VAR_NAME=  FREQUENCY,     SPECTRUM/REAL,   SPECTRUM/IMAG
##SYMBOL=    X,             R,               I
##VAR_TYPE=  INDEPENDENT,   DEPENDENT,       DEPENDENT
##VAR_FORM=  AFFN,          ASDF,            ASDF
##VAR_DIM=   131072,        131072,          131072
##UNITS=     HZ,            ARBITRARY UNITS, ARBITRARY UNITS
##FACTOR=    0.0627417313425164, 1,          1
##FIRST=     8223.62146879497, 2984,         -64001
##LAST=      0,             3930,            -63849
##MIN=       0,             -11154,          0
##MAX=       8223.62146879497, 402005793,    0
$$ Real data points
##PAGE= N=1
##DATA TABLE= (X++(R..R)), XYDATA
$$ [...]
$$ plain form
60880 796365 791223 784046 774984 764693 753713 742093 729867 717534 705725 694663 684244 674459
60868 674459 665508 657719 651468 646901 643687 641324 639713 639045 639164 639653 640634 642860 646807 652266 659121
60853 659121 667868 678882 691701 705443 719555 733783 748004 762641 778798 797312 817830 839221
60841 839221 860574 881347 900891 918476 933778 946907 957970 966859 973344 977201 978482 977868 976498
60828 976498 975196 974158 973460 973321 973468 972768 970020 964820 957304 947591 936082 923746 911356 898638
60814 898638 884916 870369 855910 841936 827996 813752 799559 785993 773394 762043 752253 744040
60802 744040 737119 731371 726953 723797 721404 719329 717591 716502 716412 717687 720621 725154 730882 737496 745060
60787 745060 753756 763596 774487 786461 799672 814127 829481 845146 860703 876215 891988 908032
$$ packed form
60880G96365n142p177r062j0291j0980j1620j2226j2333j1809j1062j0419r785
60868F74459q951p789o251m567l214k363j611o68J19M89R81K226L947N459O855
60853F59121Q747J1014J2819J3742J4112J4228J4221J4637J6157J8514K0518K1391
60841H39221K1353K0773J9544J7585J5302J3129J1063Q889O485L857J281o14j370
60828I76498j302j038o98j39J47p00k748n200p516r713j1509j2336j2390j2718
60814H98638j3722j4547j4459j3974j3940j4244j4193j3566j2599j1351r790q213
60802G44040o921n748m418l156k393k075j738j089r0J275K934M533N728O614P564
60787G45060Q696R840J0891J1974J3211J4455J5354J5665J5557J5512J5773J6044
$$ plain form
60775 908032 923948 939336 954029 967852 980512 991926 1002314 1011818 1020321 1027873 1034864 1041420
60763 1041420 1047046 1051221 1054048 1055885 1056702 1056318 1054953 1052936 1050094 1046036 1040882 1035137 1028990 1022389
60749 1022389 1015785 1010072 1005659 1002153 999103 996464 994103 991286 987127 981359 974432 966941 959067 950543
60735 950543 941170 931400 922170 914026 906746 900094 894572 890907 889048 888278 888166 888758 889941 891349 893051
60720 893051 895637 899312 903396 907020 909919 912300 914262 915656 916237 915743 914144 911986 910143 908963 907902
60705 907902 906262 904059 901838 899777 897321 893765 888985 883472 877681 871430 864034 855050 844708 833545
60691 833545 821845 809624 796966 784053 770937 757641 744414 731632 719496 708057 697521
60680 697521 688161 679956 672620 666097 660790 657223 655613 655784 657402 660292 664526 670051 676229 682133
$$ packed form
60775I08032J5916J5388J4693J3823J2660J1414J0388R504Q503P552O991O556
60763A041420N626M175K827J837Q17l84j365k017k842m058n154n745o147o601
60749A022389o604n713m413l506l050k639k361k817m159n768o927p491p874q524
60735I50543r373r770r230q144p280o652n522l665j859p70j12N92J183J408J702
60720H93051K586L675M084L624K899K381J962J394N81m94j599k158j843j180j061
60705I07902j640k203k221k061k456l556m780n513n791o251p396q984j0342j1163
60691H33545j1700j2221j2658j2913j3116j3296j3227j2782j2136j1439j0536
60680F97521r360q205p336o523n307l567j610J71J618K890M234N525O178N904
$$ plain form
60666 682133 687464 692760 698333 703481 707362 710289 713375 716979 720292 722610 724285 726114 728356 730774
60652 730774 733308 736260 739917 744290 749220 754585 760439 766935 774029 781288 788094 794051 799239 804257
60638 804257 810039 817240 825586 834177 842711 851990 862801 874710 886576 897938 909192 920596 931913
60625 931913 943002 953933 964263 972854 978718 981653 981860 979402 974294 966835 957609 947338 936677
60612 936677 925914 914914 903688 892846 883131 874773 867839 862946 860802 861065 862470 864258 866678
60599 866678 869905 873221 875631 876637 876079 873871 870411 866694 863514 860910 858823 857865 858892 861968 866170
60584 866170 870309 873634 876032 877794 879111 879760 879465 878473 877345 876201 874688 872769 870971 869703 868877
60569 868877 868430 868586 869246 869688 869341 868476 867686 867016 865938 863892 860533 855798 850045 843850 837435 830693
$$ packed form
60666F82133N331N296N573N148L881K927L086L604L313K318J675J829K242K418
60652G30774K534K952L657M373M930N365N854O496P094P259O806N957N188N018
60638H04257N782P201Q346Q591Q534R279J0811J1909J1866J1362J1254J1404J1317
60625I31913J1089J0931J0330Q591N864K935K07k458n108p459r226j0271j0661
60612I36677j0763j1000j1226j0842r715q358o934m893k144K63J405J788K420
60599H66678L227L316K410J006n58k208l460l717l180k604k087r58J027L076M202
60584H66170M139L325K398J762J317O49k95r92j128j144j513j919j798j268q26
60569H68877m47J56O60M42l47q65p90o70j078k046l359m735n753o195o415o742
$$ plain form
60553 830693 823961 818228 814210 811703 810307 810275 812123 815811 820926 827388 835352 844640 854946 866565
60539 866565 880395 897193 917253 940852 968640 1001605 1040791 1086699 1138259 1192341 1244673
60528 1244673 1291501 1330278 1359042 1375834 1379171 1369014 1347220 1317134 1282683 1247416 1213850
60517 1213850 1183385 1156764 1134718 1118189 1107836 1103267 1102979 1105350 1109575 1115435 1122441 1129717 1136753
60504 1136753 1143742 1151092 1159115 1168374 1179905 1194720 1213340 1236005 1263172 1295777 1335275 1383368
60492 1383368 1441253 1508947 1585697 1671008 1764793 1866627 1975798 2092544 2218692 2356817
60482 2356817 2509688 2681227 2877412 3105256 3370657 3676782 4022451 4399403 4790003
60473 4790003 5168355 5504908 5771578 5945278 6010411 5961226 5803215 5552303 5231777 4867979
$$ packed form
60553H30693o732n733m018k507j396l2J848L688N115O462P964R288J0306J1619
60539H66565J3830J6798K0060K3599K7788L2965L9186M5908N1560N4082N2332
60528A244673M6828L8777K8764J6792L337j0157k1794l0086l4451l5267l3566
60517A213850l0465k6621k2046j6529j0353m569k88K371M225N860P006P276P036
60504A136753O989P350Q023R259J1531J4815J8620K2665K7167L2605L9498M8093
60492A383368N7885O7694P6750Q5311R3785J01834J09171J16746J26148J38125
60482B356817J52871J71539J96185K27844K65401L06125L45669L76952L90600
60473D790003L78352L36553K66670J73700O5133m9185j58011k50912l20526l63798
$$ plain form
60463 4867979 4485945 4106073 3742637 3404125 3094663 2815741 2567589 2349697 2160422
60454 2160422 1996620 1854186 1729285 1619234 1522416 1437621 1363474 1298276 1240304 1188323
60444 1188323 1141842 1100793 1064835 1032913 1003587 975844 949527 924859 901739 879817 859175
60433 859175 840322 823332 807553 792563 778833 766884 756275 746214 736802 728771 722196 716383
60421 716383 711013 706450 702812 699684 696944 695009 694007 693525 693481 694283 695752 696792 696670 695849 695055 694431
60405 694431 694269 695603 699058 703700 708043 711830 715886 720483 724853 728310 731144 734253 738383 743606
60391 743606 749189 754061 757753 760689 763387 765801 767800 769687 771553 772556 771640 768816 765121 761481
60377 761481 758186 755317 753035 751388 750227 749324 748344 746985 745432 744315 743887 743655 743285 743323 744428 746378
$$ packed form
60463D867979l82034l79872l63436l38512l09462k78922k48152k17892j89275
60454B160422j63802j42434j24901j10051r6818q4795p4147o5198n7972n1981
60444A188323m6481m1049l5958l1922k9326k7743k6317k4668k3120k1922k0642
60433H59175j8853j6990j5779j4990j3730j1949j0609j0061r412q031o575n813
60421G16383n370m563l638l128k740j935j002m82m4Q02J469J040j22q21p94o24
60405F94431j62J334L455M642M343L787M056M597M370L457K834L109M130N223
60391G43606N583M872L692K936K698K414J999J887J866J003r16k824l695l640
60377G61481l295k869k282j647j161r03r80j359j553j117m28k32l70L8J105J950
$$ plain form
60361 746378 748533 750929 754059 757777 761303 764265 767055 770147 773652 777548 781787 786203 790800 796037
60347 796037 802398 809828 818074 827281 837631 848579 859190 869144 878753 888034 896457 903679 909885
60334 909885 915329 920034 924016 927326 929869 931612 932948 934461 936442 939036 942621 947406 952789 957703
60320 957703 961478 963845 964348 962581 958908 954160 948616 942052 934835 928078 922568 918308 915359 914220
60306 914220 914856 916049 916427 915881 915518 916450 918887 922179 925364 927774 929404 930772 932486 935038 938812
60291 938812 943945 950172 956984 963878 970303 975711 980085 984093 988192 991777 993871 994586 995242 996978 999809
60276 999809 1003128 1006555 1010170 1014438 1020077 1027535 1036463 1046094 1056197 1067265 1079789 1093923 1109906
60263 1109906 1128163 1148772 1171376 1195923 1223011 1253290 1286930 1323967 1364763 1409849 1459671
$$ packed form
60361G46378K155K396L130L718L526K962K790L092L505L896M239M416M597N237
60347G96037O361P430Q246R207J0350J0948J0611R954R609R281Q423P222O206
60334I09885N444M705L982L310K543J743J336J513J981K594L585M785N383M914
60320I57703L775K367N03j767l673m748n544o564p217o757n510m260k949j139
60306I14220O36J193L78n46l63R32K437L292L185K410J630J368J714K552L774
60291I38812N133O227O812O894O425N408M374M008M099L585K094P15O56J736K831
60276I99809L319L427L615M268N639P458Q928R631J0103J1068J2524J4134J5983
60263A109906J8257K0609K2604K4547K7088L0279L3640L7037M0796M5086M9822
$$ plain form
60252 1459671 1514763 1575910 1643893 1719274 1802593 1894442 1995205 2104946 2223767 2351926
60242 2351926 2489271 2634654 2786035 2941103 3097633 3253298 3405322 3550475 3685573
60233 3685573 3808013 3915754 4006954 4080140 4134750 4171019 4189053 4188660 4170595 4137419 4092459
60222 4092459 4038294 3977008 3911521 3845651 3782839 3725547 3675896 3636018 3607585 3591639 3589099
60211 3589099 3600897 3627569 3669349 3726780 3800695 3891402 3998381 4120741 4257222 4405500
60201 4405500 4562122 4723371 4885677 5044937 5196137 5334237 5455291 5556545 5635883 5691554
60191 5691554 5722321 5727638 5707765 5663686 5596877 5509401 5404527 5286876 5161376 5032146 4902815
60180 4902815 4777526 4660711 4555793 4464849 4389565 4331761 4292770 4273043 4272631 4291522 4329368
$$ packed form
60252A459671N5092O1147O7983P5381Q3319R1849J00763J09741J18821J28159
60242B351926J37345J45383J51381J55068J56530J55665J52024J45153J35098
60233C685573J22440J07741R1200P3186N4610L6269J8034l93j8065l3176m4960
60222D092459n4165o1286o5487o5870o2812n7292m9651l9878k8433j5946k540
60211C589099J1798K6672M1780N7431P3915R0707J06979J22360J36481J48278
60201D405500J56622J61249J62306J59260J51200J38100J21054J01254P9338N5671
60191E691554L0767N317j9873m4079o6809q7476j04874j17651j25500j29230j29331
60180D902815j25289j16815j04918r0944p5284n7804l8991j9727m12J8891L7846
$$ plain form
60169 4329368 4385494 4459186 4549077 4651880 4762423 4875354 4986325 5091448 5186694 5268655
60159 5268655 5335424 5386121 5419923 5436162 5435159 5418532 5388904 5349578 5304223 5256491 5210150
60148 5210150 5169658 5140049 5125702 5129384 5152586 5196332 5261245 5347230 5453791 5580774 5728719
60137 5728719 5898746 6092465 6311930 6559332 6836545 7144842 7484736 7855829 8256643
60128 8256643 8684327 9134288 9600212 10074693 10549866 11017401 11468357 11893552 12284105
60119 12284105 12631577 12928321 13168526 13348784 13466914 13520379 13506553 13424508 13275841 13063959
60109 13063959 12793622 12471544 12106808 11710386 11294488 10871909 10454706 10052796 9674058
60100 9674058 9325482 9013280 8741803 8513392 8329695 8192315 8101920 8057602 8057583 8099621 8180090
$$ packed form
60169D329368N6126P3692Q9891J02803J10543J12931J10971J05123R5246Q1961
60159E268655O6769N0697L3802J6239j003j6627k9628l9326m5355m7732m6341
60148E210150m0492k9609j4347L682K3202M3746O4913Q5985J06561J26983J47945
60137E728719J70027J93719K19465K47402K77213L08297L39894L71093M00814
60128H256643M27684M49961M65924M74481M75173M67535M50956M25195L90553
60119A2284105L47472K96744K40205J80258J18130N3465j3826q2045j48667k11882
60109A3063959k70337l22078l64736l96422m15898m22579m17203m01910l78738
60100I674058l48576l12202k71477k28411j83697j37380r0395m4318j9M2038Q0469
$$ plain form
60089 8180090 8293352 8432623 8590940 8760788 8933529 9099998 9251525 9380281 9479625 9545066
60079 9545066 9574753 9568608 9527318 9452507 9347161 9214967 9059116 8881948 8685462 8471883
60069 8471883 8244126 8006138 7762579 7517985 7276412 7041809 6818035 6608173 6414252
60060 6414252 6237846 6080434 5943073 5826447 5731643 5660278 5613558 5591815 5595201 5624068 5678193
60049 5678193 5756321 5856919 5978606 6119110 6274305 6438892 6607488 6774487 6933546 7078287
60039 7078287 7203500 7305186 7379839 7424424 7436982 7416791 7364070 7279987 7166813 7027639
60029 7027639 6866073 6686494 6494416 6296143 6097925 5905160 5721959 5551205 5395287
60020 5395287 5256698 5137566 5038768 4960316 4902683 4866985 4853826 4862926 4894332 4949130 5028466
$$ packed form
60089H180090J13262J39271J58317J69848J72741J66469J51527J28756R9344O5441
60079I545066K9687o145m1290p4811j05346j32194j55851j77168j96486k13579
60069H471883k27757k37988k43559k44594k41573k34603k23774k09862j93921
60060F414252j76406j57412j37361j16626r4804p1365m6720k1743L386K8867N4125
60049E678193P8128J00598J21687J40504J55195J64587J68596J66999J59059J44741
60039G078287J25213J01686P4653M4585J2558k0191n2721q4083j13174j39174
60029G027639j61566j79579j92078j98273j98218j92765j83201j70754j55918
60020E395287j38589j19132r8798p8452n7633l5698j3159R100L1406N4798P9336
$$ plain form
60009 5028466 5132615 5261487 5415159 5593140 5793565 6013488 6249152 6495207 6744213
60000 6744213 6987660 7217336 7425766 7606550 7755313 7869864 7948725 7989968 7992094 7955411
59990 7955411 7881774 7773541 7633843 7467774 7282618 7086707 6887981 6692946 6506445 6332646
59980 6332646 6176177 6041476 5930853 5844284 5781713 5744611 5734632 5751838 5795021 5862686 5952462
59969 5952462 6060382 6182000 6313765 6452332 6593397 6732600 6867160 6995314 7114559
59960 7114559 7221763 7314787 7392733 7454744 7499907 7528436 7541837 7541731 7529547 7507618 7479776
59949 7479776 7450613 7424765 7406940 7402072 7415189 7451369 7515443 7611380 7742354 7911871 8124197
59938 8124197 8382918 8689628 9044742 9448795 9901655 10400631 10940083 11512036 12105448
$$ packed form
60009E028466J04149J28872J53672J77981K00425K19923K35664K46055K49006
60000F744213K43447K29676K08430J80784J48763J14551P8861M1243K126l6683
59990G955411p3637j08233j39698j66069j85156j95911j98726j95035j86501j73799
59980F332646j56469j34701j10623q6569o2571l7102r979J7206M3183O7665Q9776
59969E952462J07920J21618J31765J38567J41065J39203J34560J28154J19245
59960G114559J07204R3024P7946O2011M5163K8529J3401j06j2184k1929k7842
59949G479776k9163k5848j7825m868J3117L6180O4074R5937J30974J69517K12326
59938H124197K58721L06710L55114M04053M52860M98976N39452N71953N93412
$$ plain form
59929 12105448 12704686 13289773 13838363 14327314 14733902 15038257 15226273 15290615 15230283 15050992
59919 15050992 14765797 14393241 13953456 13465707 12948386 12418989 11892908 11382726 10898615
59910 10898615 10448320 10036608 9665977 9338537 9056617 8821682 8633936 8493324 8399872
59901 8399872 8352664 8349645 8389062 8470145 8591767 8751173 8944536 9167680 9415207 9679139
59891 9679139 9948895 10212160 10455308 10663716 10822897 10920176 10946180 10895968 10769637 10571715
59881 10571715 10309690 9993006 9632914 9242034 8833061 8417573 8005581 7605298 7222876
59872 7222876 6862674 6528070 6221761 5945254 5698489 5480234 5288773 5122393 4979484
59863 4979484 4858046 4754844 4665347 4585041 4510613 4439541 4369229 4297671 4224770 4151973 4080465
$$ packed form
59929A2105448N99238N85087N48590M88951M06588L04355J88016O4342o0332j79291
59919A5050992k85195l72556m39785m87749n17321n29397n26081n10182m84111
59910A0898615m50295m11712l70631l27440k81920k34935j87746j40612r3452
59901H399872m7208l019L9417Q1083J21622J59406J93363K23144K47527K63932
59891I679139K69756K63265K43148K08408J59181R7279K6004n0212j26331j97922
59881A0571715k62025l16684l60092l90880m08973m15488m11992m00283l82422
59872G222876l60202l34604l06309k76507k46765k18255j91461j66380j42909
59863D979484j21438j03202q9497q0306p4428p1072p0312p1558p2901p2797p1508
$$ plain form
59852 4080465 4010631 3943392 3881040 3826305 3781116 3746444 3722440 3708133 3701253 3698631 3696602 3691255
59840 3691255 3679110 3657931 3626774 3585475 3534646 3476064 3412318 3346010 3279713 3216351 3158666
59829 3158666 3108146 3065136 3029999 3003393 2985440 2975574 2973530 2979836 2995226 3020296 3055821 3102460
59817 3102460 3159689 3225519 3297632 3374403 3454827 3538181 3623921 3711227 3798311 3882539 3961290
59806 3961290 4032141 4092306 4138772 4169545 4184583 4185662 4175918 4159441 4140389 4122021 4106748 4096917
59794 4096917 4095002 4103270 4123947 4159535 4212201 4283067 4373139 4484895 4622098 4788109 4985519
59783 4985519 5217572 5488872 5804311 6168017 6583185 7051207 7569267 8127448 8706133
59774 8706133 9274054 9789600 10208321 10494383 10629134 10612826 10461650 10203130 9870077 9493776
$$ packed form
59852D080465o9834o7239o2352n4735m5189l4672k4004j4307o880k622k029n347
59840C691255j2145k1179l1157m1299n0829n8582o3746o6308o6297o3362n7685
59829C158666n0520m3010l5137k6606j7953r866k044O306J5390K5070L5525M6639
59817C102460N7229O5830P2113P6771Q0424Q3354Q5740Q7306Q7084Q4228P8751
59806C961290P0851O0165M6466L0773J5038J079r744j6477j9052j8368j5273r831
59794D096917j915Q268K0677L5588N2666P0866R0072J11756J37203J66011J97410
59783D985519K32053K71300L15439L63706M15168M68022N18060N58181N78685
59774H706133N67921N15546M18721K86062J34751j6308j51176k58520l33053l76301
$$ plain form
59764 9493776 9099586 8706718 8329573 7977965 7657169 7369406 7115652 6896003 6709365
59755 6709365 6553859 6427480 6328092 6253438 6201736 6171905 6162918 6173566 6203229 6252249 6321030
59744 6321030 6409358 6517007 6644472 6792783 6963255 7157822 7378882 7628335 7907438 8218094
59734 8218094 8563599 8947604 9372993 9842276 10358261 10923392 11538614 12203212 12914957
59725 12914957 13669395 14458782 15271796 16093942 16908364 17697523 18445688 19141082 19777319
59716 19777319 20354820 20881679 21372316 21844279 22315815 22805135 23329341 23902099 24532005
59707 24532005 25222673 25972610 26773721 27610428 28460952 29299201 30095871 30820201 31443552
59698 31443552 31942852 32302136 32513433 32578305 32508385 32323214 32047090 31707244 31332620 30951643
$$ packed form
59764I493776l94190l92868l77145l51608l20796k87763k53754k19649j86638
59755F709365j55506j26379r9388p4654n1702k9831q987J0648K9663M9020O8781
59744F321030Q8328J07649J27465J48311J70472J94567K21060K49453K79103L10656
59734H218094L45505L84005M25389M69283N15985N65131O15222O64598P11745
59725A2914957P54438P89387Q13014Q22146Q14422P89159P48165O95394O36237
59716A9777319N77501N26859M90637M71963M71536M89320N24206N72758O29906
59707B4532005O90668P49937Q01111Q36707Q50524Q38249P96670P24330O23351
59698C1443552M99300L59284K11297O4872o9920j85171k76124l39846l74624l80977
$$ plain form
59688 30951643 30589979 30270070 30011656 29831567 29743339 29757960 29884996 30132706 30507800 31016132
59678 31016132 31663318 32453695 33388161 34462455 35665745 36978623 38370934 39800437
59670 39800437 41212367 42540297 43709958 44646634 45284086 45572775 45486685 45027604 44224406
59661 44224406 43126994 41798548 40309211 38730426 37128531 35559482 34066927 32682054
59653 32682054 31422224 30288703 29265958 28323366 27419096 26507269 25548464 24519583 23417728
59644 23417728 22257197 21062906 19863379 18684850 17547877 16467142 15452676 14510303
59636 14510303 13641604 12844963 12117314 11455001 10853699 10308604 9814897 9367806 8962689
59627 8962689 8595684 8264081 7965613 7697720 7457917 7244307 7055137 6888328 6742013
$$ packed form
59688C0951643l61664l19909k58414j80089q8228J4621J27036K47710L75094N08332
59678C1016132O47186P90377R34466J074294J203290J312878J392311J429503
59670C9800437J411930J327930J169661R36676O37452K88689q6090m59081q03198
59661D4224406j097412j328446j489337j578785j601895j569049j492555j384873
59653C2682054j259830j133521j022745r42592r04270r11827r58805j028881j101855
59644B3417728j160531j194291j199527j178529j136973j080735j014466r42373
59636A4510303q68699p96641p27649o62313o01302n45095m93707m47091m05117
59627H962689l67005l31603k98468k67893k39803k13610j89170j66809j46315
$$ plain form
59618 6742013 6614880 6505128 6409546 6324403 6246827 6174508 6104555 6033571 5958554 5876962 5786446
59607 5786446 5685682 5575305 5457100 5332468 5202552 5069504 4936482 4806302 4680922
59598 4680922 4562069 4451279 4349239 4256043 4172335 4099341 4037512 3985977 3943712 3910605 3886903
59587 3886903 3872083 3864837 3864065 3869517 3881311 3898840 3920352 3943820 3968129 3993055 4018227 4042835
59575 4042835 4066537 4090015 4114311 4140280 4168960 4201763 4239834 4283946 4335485 4396645 4468997
59564 4468997 4552618 4647409 4754525 4875666 5011767 5163440 5332177 5519973 5728080 5957109
59554 5957109 6208017 6481970 6779328 7099487 7441379 7803226 8181929 8573398 8973260
59545 8973260 9376712 9778242 10172476 10555121 10922510 11270798 11596687 11898930 12178555
$$ packed form
59618F742013j27133j09752r5582q5143p7576p2319o9953p0984p5017q1592r0516
59607E786446j00764j10377j18205j24632j29916j33048j33022j30180j25380
59598D680922j18853j10790j02040r3196q3708p2994o1829n1535m2265l3107k3702
59587C886903j4820p246p72N452J1794J7529K1512K3468K4309K4926K5172K4608
59575D042835K3702K3478K4296K5969K8680L2803L8071M4112N1539O1160P2352
59564D468997Q3621R4791J07116J21141J36101J51673J68737J87796K08107K29029
59554E957109K50908K73953K97358L20159L41892L61847L78703L91469L99862
59545H973260M03452M01530L94234L82645L67389L48288L25889L02243K79625
$$ plain form
59536 12178555 12437874 12679442 12904814 13113294 13302747 13473184 13629419 13779326 13929975
59527 13929975 14086093 14250723 14424652 14604419 14781915 14946067 15084159 15182268 15226671 15206065
59517 15206065 15112438 14940604 14688625 14359142 13959396 13499686 12992263 12450949 11889858
59508 11889858 11321574 10756718 10204582 9672693 9165725 8686258 8236869 7820413 7438206
59499 7438206 7089474 6773140 6489003 6236576 6013877 5818135 5646981 5498458 5370729
59490 5370729 5262545 5173563 5103682 5052347 5018728 5002146 5002165 5018775 5052672 5104982 5176562 5267887
59478 5267887 5379548 5512409 5667396 5845610 6048387 6276597 6530006 6807688 7108460
59469 7108460 7429884 7767099 8113453 8461760 8803606 9127583 9419847 9667112 9858653
$$ packed form
59536A2178555K59319K41568K25372K08480J89453J70437J56235J49907J50649
59527A3929975J56118J64630J73929J79767J77496J64152J38092R8109M4403k0606
59517A5206065r3627j71834k51979l29483l99746m59710n07423n41314n61091
59508A1889858n68284n64856n52136n31889n06968m79467m49389m16456l82207
59499G438206l48732l16334k84137k52427k22699j95742j71154j48523j27729
59490E370729j08184q8982o9881n1335l3619j6582J9J6610L3897N2310P1580R1325
59478E267887J11661J32861J54987J78214K02777K28210K53409K77682L00772
59469G108460L21424L37215L46354L48307L41846L23977K92264K47265J91541
$$ plain form
59460 9858653 9985965 10042505 10024957 9934216 9774689 9553265 9279138 8963465 8617963 8253498
59450 8253498 7879671 7504976 7136807 6781275 6442778 6123544 5824050 5544522 5285818
59441 5285818 5048515 4831897 4634754 4456584 4296955 4154209 4026129 3911638 3810628
59432 3810628 3722350 3645339 3578834 3522898 3477077 3440225 3411664 3391215 3377976 3370479 3368278 3372030
59420 3372030 3381639 3395542 3412221 3431395 3453451 3478765 3507742 3540528 3576701 3616384 3661220
59409 3661220 3712276 3766800 3819127 3865789 3908469 3951772 4000078 4057262 4127175 4212600 4315049
59398 4315049 4436802 4581606 4751561 4944400 5155846 5384499 5633519 5908553 6215829
59389 6215829 6561896 6953207 7395003 7890767 8442365 9049774 9710344 10418321 11164368
$$ packed form
59460I858653J27312N6540j7548r0741j59527k21424k74127l15673l45502l64465
59450H253498l73827l74695l68169l55532l38497l19234k99494k79528k58704
59441E285818k37303k16618j97143j78170j59629j42746j28080j14491j01010
59432C810628q8278p7011o6505n5936m5821l6852k8561k0449j3239p497k201L752
59420C372030R609J3903J6679J9174K2056K5314K8977L2786L6173L9683M4836
59409C661220N1056N4524N2327M6662M2680M3303M8306N7184O9913Q5425J02449
59398D315049J21753J44804J69955J92839K11446K28653K49020K75034L07276
59389F215829L46067L91311M41796M95764N51598O07409O60570P07977P46047
$$ plain form
59380 11164368 11934894 12712619 13479041 14217127 14912412 15553291 16131825 16644438 17091418
59371 17091418 17475897 17803097 18079044 18308411 18493197 18633432 18728156 18774889 18768713 18703042
59361 18703042 18571799 18371241 18101028 17765113 17372171 16935175 16470457 15996243 15529867
59352 15529867 15084371 14666973 14280157 13922984 13590880 13275532 12966763 12655048 12332447
59343 12332447 11992616 11631711 11249734 10850352 10439228 10022566 9606659 9197769 8801844
59334 8801844 8424165 8068886 7738618 7434586 7157235 6906522 6681824 6482285 6307419
59325 6307419 6156835 6029235 5922375 5834257 5763697 5709405 5669260 5641095 5623681 5616417 5618283
59314 5618283 5627415 5641384 5657643 5674090 5689343 5702103 5710261 5711201 5703091 5685350 5657902 5620859
$$ packed form
59380A1164368P70526P77725P66422P38086O95285O40879N78534N12613M46980
59371A7091418L84479L27200K75947K29367J84786J40235R4724M6733o176o5671
59361A8703042j31243k00558k70213l35915l92942m36996m64718m74214m66376
59352A5529867m45496m17398l86816l57173l32104l15348l08769l11715l22601
59343A2332447l39831l60905l81977l99382m11124m16662m15907m08890l95925
59334H801844l77679l55279l30268l04032k77351k50713k24698j99539j74866
59325F307419j50584j27600j06860q8118p0560n4292m0145k8165j7414p264J866
59314E618283R132J3969J6259J6447J5253J2760Q158R40q110j7741k7448l7043
$$ plain form
59302 5620859 5575100 5522386 5464553 5403261 5340675 5279552 5222364 5171008 5127518 5094115 5072265
59291 5072265 5062554 5065812 5083511 5116758 5165885 5231437 5314525 5415605 5533904 5668746 5820627
59280 5820627 5990259 6177242 6380229 6597535 6826643 7063495 7302821 7538785 7765035
59271 7765035 7974925 8162402 8322496 8451122 8545409 8604507 8629014 8619091 8574154 8494968 8385231
59260 8385231 8250615 8097224 7931310 7758938 7584512 7410133 7237058 7067021 6901582
59251 6901582 6741395 6587332 6441585 6306612 6183630 6073152 5976536 5896114 5834260 5793117
59241 5793117 5774801 5781120 5813571 5874255 5966294 6092747 6255739 6457205 6699800 6986317
59231 6986317 7318777 7698443 8125482 8597167 9106425 9642372 10191269 10736145 11256719
$$ packed form
59302E620859m5759n2714n7833o1292o2586o1123n7188n1356m3490l3403k1850
59291E072265r711L258J7699L3247M9127O5552Q3088J01080J18299J34842J51881
59280E820627J69632J86983K02987K17306K29108K36852K39326K35964K26250
59271G765035K09890J87477J60094J28626R4287N9098K4507r923m4937p9186j09737
59260H385231j34616j53391j65914j72372j74426j74379j73075j70037j65439
59251F901582j60187j54063j45747j34973j22982j10478r6616q0422o1854m1143
59241E793117j8316O319L2451O0684R2039J26453J62992K01466K42595K86517
59231F986317L32460L79666M27039M71685N09258N35947N48897N44876N20574
$$ plain form
59222 11256719 11731434 12139966 12463905 12686740 12795482 12783095 12649345 12399993 12045931
59213 12045931 11602538 11088640 10525329 9934592 9336844 8748004 8178953 7637877 7131986
59204 7131986 6666313 6242226 5858544 5513593 5205378 4930857 4686546 4469613 4277567
59195 4277567 4107574 3957019 3824089 3706801 3602175 3507486 3421678 3344454 3274606 3210443
59185 3210443 3151318 3097483 3048874 3005225 2966964 2934775 2908446 2887195 2870816 2859546 2853181
59174 2853181 2851446 2854933 2864606 2880565 2902183 2929253 2962090 3000767 3045057 3094891 3150220 3210829
59162 3210829 3276952 3349403 3428116 3511114 3595903 3681389 3767452 3853229 3936847 4016355 4089741
59151 4089741 4154376 4207688 4248343 4276091 4290900 4293103 4283852 4264399 4235309 4197227 4151912 4101689
$$ packed form
59222A1256719M74715M08532L23939K22835J08742j2387j33750k49352l54062
59213A2045931m43393n13898n63311n90737n97748n88840n69051n41076n05891
59204G131986m65673m24087l83682l44951l08215k74521k44311k16933j92046
59195D277567j69993j50555j32930j17288j04626r4689q5808p7224o9848o4163
59185C210443n9125n3835m8609m3649l8261l2189k6329k1251j6379j1270o365
59174B853181j735L487R673J5959K1618K7070L2837L8677M4290M9834N5329O0609
59162C210829O6123P2451P8713Q2998Q4789Q5486Q6063Q5777Q3618P9508P3386
59151D089741O4635N3312M0655K7748J4809K203r251j9453k9090l8082m5315n0223
$$ plain form
59139 4101689 4048546 3994640 3942801 3895257 3852565 3815037 3784512 3763361 3752443 3751584 3761443 3783275
59127 3783275 3817320 3863259 3922074 3995687 4084811 4188808 4307855 4443669 4597878 4771130
59117 4771130 4964143 5178216 5414185 5671818 5950630 6250370 6570344 6908731 7262276
59108 7262276 7625424 7989397 8342572 8671686 8962484 9200413 9372665 9470367 9488919 9427604
59098 9427604 9290418 9086698 8828950 8529477 8199378 7849524 7490201 7129401 6772604
59089 6772604 6424098 6087266 5763897 5454925 5161915 4886492 4628455 4386203 4159271
59080 4159271 3948870 3755682 3578675 3416459 3268298 3133118 3009002 2894560 2789835
59071 2789835 2695174 2609944 2532856 2462879 2399467 2342566 2292607 2249900 2213955 2183996 2159980
$$ packed form
59139D101689n3143n3906n1839m7544m2692l7528l0525k1151j0918q59R859K1832
59127C783275L4045M5939N8815P3613Q9124J03997J19047J35814J54209J73252
59117D771130J93013K14073K35969K57633K78812K99740L19974L38387L53545
59108G262276L63148L63973L53175L29114K90798K37929J72252R7702J8552o1315
59098I427604j37186k03720k57748k99473l30099l49854l59323l60800l56797
59089F772604l48506l36832l23369l08972k93010k75423k58037k42252k26932
59080D159271k10401j93188j77007j62216j48161j35180j24116j14442j04725
59071B789835r4661q5230p7088o9977o3412n6901m9959m2707l5945k9959k4016
$$ plain form
59060 2159980 2142277 2130509 2123713 2121450 2123561 2128792 2134708 2138992 2139812 2135039 2122446 2101007 2071039
59047 2071039 2033142 1988108 1937890 1885366 1832846 1781750 1733658 1690347 1652415 1618994 1589220
59036 1589220 1563148 1541140 1523316 1509858 1500965 1496397 1495774 1499143 1506412 1516514 1528267 1541681
59024 1541681 1557085 1573194 1587541 1598816 1607307 1613125 1615701 1615324 1613509 1611301 1608602 1605667 1603881
59011 1603881 1604431 1607330 1612339 1619815 1630140 1643155 1658481 1675542 1693105 1709820 1725352 1740023
58999 1740023 1753291 1763765 1770810 1774962 1776718 1776287 1774649 1773427 1773330 1773929 1775180 1777801 1781911 1786708
58985 1786708 1791923 1798340 1806541 1816373 1827871 1841326 1856208 1871490 1887349 1905071 1925064 1946644
58973 1946644 1970149 1997340 2028945 2063649 2100523 2140829 2186219 2236477 2290182 2346363 2404300
$$ packed form
59060B159980j7703j1768o796k263K111N231N916M284Q20m773j2593k1439k9968
59047B071039l7897m5034n0218n2524n2520n1096m8092m3311l7932l3421k9774
59036A589220k6072k2008j7824j3458q893m568o23L369P269J0102J1753J3414
59024A541681J5404J6109J4347J1275Q491N818K576l77j815k208k699k935j786
59011A603881N50K899N009P476J0325J3015J5326J7061J7563J6715J5532J4671
58999A740023J3268J0474P045M152J756m31j638j222r7N99J251K621M110M797
58985A786708N215O417Q201R832J1498J3455J4882J5282J5859J7722J9993K1580
58973A946644K3505K7191L1605L4704L6874M0306M5390N0258N3705N6181N7937
$$ plain form
58962 2404300 2462713 2520409 2577036 2632280 2685126 2734767 2781598 2826606 2870519 2914166 2958880
58951 2958880 3005948 3056363 3111517 3173154 3242040 3317649 3399796 3489791 3589523 3700310 3823033
58940 3823033 3958282 4105797 4264899 4436182 4621945 4824349 5044100 5281563 5538283
58931 5538283 5816874 6120262 6451593 6814026 7210113 7642217 8113782 8629185 9191960
58922 9191960 9804232 10468222 11186921 11962561 12795229 13683148 14622626 15606445 16622640
58913 16622640 17654730 18681627 19676744 20608699 21444350 22151562 22700756 23067589 23237054
58904 23237054 23205486 22978990 22571547 22004713 21306263 20506179 19633168 18714205 17774652
58895 17774652 16836500 15916716 15028024 14180318 13380525 12632276 11937132 11295897 10708287
$$ packed form
58962B404300N8413N7696N6627N5244N2846M9641M6831M5008M3913M3647M4714
58951B958880M7068N0415N5154O1637O8886P5609Q2147Q9995R9732J10787J22723
58940C823033J35249J47515J59102J71283J85763K02404K19751K37463K56720
58931E538283K78591L03388L31331L62433L96087M32104M71565N15403N62775
58922I191960O12272O63990P18699P75640Q32668Q87919R39478R83819J016195
58913A6622640J032090J026897R95117R31955Q35651P07212N49194L66833J69465
58904B3237054l1568k26496m07443n66834o98450q00084q73011r18963r39553
58895A7774652r38152r19784q88692q47706p99793p48249o95144o41235n87610
$$ plain form
58886 10708287 10172315 9684850 9242202 8839808 8472347 8134738 7822181 7529079 7249509
58877 7249509 6979659 6718799 6467320 6225119 5992502 5771074 5562473 5367152 5185183
58868 5185183 5017121 4863066 4721837 4591984 4472798 4363805 4264324 4174209 4093895 4023023
58858 4023023 3960125 3904273 3855888 3815344 3782157 3756185 3738203 3728439 3725933 3730152 3741837 3761432
58846 3761432 3788188 3821786 3863267 3913278 3970945 4035721 4108933 4192149 4285275 4387693 4500183
58835 4500183 4624439 4761605 4912425 5077930 5258934 5455810 5669668 5902801 6157252
58826 6157252 6434164 6735288 7063804 7422959 7815496 8245280 8717678 9237172 9806110
58817 9806110 10426787 11102780 11836755 12628583 13476630 14378326 15326970 16309154 17306790
$$ packed form
58886A0708287n35972m87465m42648m02394l67461l37609l12557k93102k79570
58877G249509k69850k60860k51479k42201k32617k21428k08601j95321j81969
58868E185183j68062j54055j41229j29853j19186j08993r9481r0115q0314p0872
58858D023023o2898n5852m8385m0544l3187k5972j7982r764k506M219J1685J9595
58846C761432K6756L3598M1481N0011N7667O4776P3212Q3216R3126J02418J12490
58835D500183J24256J37166J50820J65505J81004J96876K13858K33133K54451
58826F157252K76912L01124L28516L59155L92537M29784M72398N19494N68938
58817I806110O20677O75993P33975P91828Q48047R01696R48644R82184R97636
$$ plain form
58808 17306790 18299674 19263854 20169300 20982405 21671050 22206876 22565846 22731174 22697105
58799 22697105 22469029 22060789 21493128 20792877 19990099 19114385 18193341 17252211 16312196
58790 16312196 15389072 14494525 13637936 12825617 12059648 11339490 10664385 10033306 9444264
58781 9444264 8895682 8387434 7918727 7486041 7085044 6713551 6370701 6054332 5761250
58772 5761250 5489160 5236114 4998923 4774464 4562138 4362923 4176413 4000712 3834775
58763 3834775 3678824 3532782 3396112 3268960 3151725 3043864 2944541 2853906 2772208 2698364
58753 2698364 2630885 2569326 2513203 2460649 2410258 2363284 2321808 2285443 2252067 2221067 2193422
58742 2193422 2169136 2147059 2126972 2109491 2093988 2078810 2063432 2048248 2032409 2014107 1993167
$$ packed form
58808A7306790R92884R64180R05446Q13105O88645N35826L58970J65328l4069
58799B2697105k28076m08240n67661p00251q02778q75714r21044r41130r40015
58790A6312196r23124q94547q56589q12319p65969p20158o75105o31079n89042
58781I444264n48582n08248m68707m32686m00997l71493l42850l16369k93082
58772E761250k72090k53046k37191k24459k12326j99215j86510j75701j65937
58763C834775j55951j46042j36670j27152j17235j07861r9323r0635q1698p3844
58753B698364o7479o1559n6123n2554n0391m6974m1476l6365l3376l1000k7645
58742B193422k4286k2077k0087j7481j5503j5178j5378j5184j5839j8302k0940
$$ plain form
58731 1993167 1971297 1949585 1927510 1904369 1879820 1853003 1823019 1790392 1756438 1721272 1684105
58720 1684105 1645388 1606825 1569291 1532477 1496581 1462649 1431089 1401373 1373263 1347044 1322747
58709 1322747 1300414 1280685 1263762 1248444 1233755 1220737 1210759 1202819 1194705 1186272 1179303 1174447
58697 1174447 1170620 1167217 1164541 1161866 1157332 1150064 1140522 1128653 1113737 1096290 1078169 1060420 1042665
58684 1042665 1024904 1008258 993642 981111 970641 962223 955280 949337 945019 942995 942402 941926 941943 943783
58670 943783 947250 950755 953564 956117 958490 960537 963294 968245 975291 983093 990969 998618 1004642 1007629
58656 1007629 1008408 1009120 1010383 1011560 1013380 1017713 1024775 1032942 1041450 1051211 1062944 1076628 1092695 1111631
58642 1111631 1132512 1154036 1176817 1202564 1231442 1262608 1296893 1336202 1380452 1427862 1478375
$$ packed form
58731A993167k1870k1712k2075k3141k4549k6817k9984l2627l3954l5166l7167
58720A684105l8717l8563l7534l6814l5896l3932l1560k9716k8110k6219k4297
58709A322747k2333j9729j6923j5318j4689j3018r978p940q114q433o969m856
58697A174447l827l403k676k675m534p268r542j1869j4916j7447j8121j7749j7755
58684A042665j7761j6646j4616j2531j0470q418o943n943m318k024n93m76J7J840
58670I43783L467L505K809K553K373K047K757M951P046P802P876P649O024K987
58656A007629P79P12J263J177J820M333P062Q167Q508R761J1733J3684J6067J8936
58642A111631K0881K1524K2781K5747K8878L1166L4285L9309M4250M7410N0513
$$ plain form
58631 1478375 1534072 1596135 1664214 1739096 1823245 1918206 2023988 2141445 2272810 2419548
58621 2419548 2582168 2762432 2963179 3185662 3429559 3695664 3985256 4295807 4619754
58612 4619754 4947893 5270967 5577061 5850622 6076095 6241389 6337985 6361030 6311216 6194905
58602 6194905 6021462 5801768 5548857 5276622 4996203 4715062 4439637 4176298 3929096
58593 3929096 3699122 3487011 3293877 3119311 2961150 2818239 2691258 2580173 2483252 2399246
58583 2399246 2328035 2268344 2217241 2172613 2133703 2098572 2063746 2027280 1989579 1950405 1907875
58572 1907875 1861576 1814031 1767785 1723404 1681283 1642814 1608438 1576959 1547979 1522698 1501218
58561 1501218 1481461 1461849 1442684 1423916 1404178 1383224 1362850 1344161 1326251 1308595 1292220
$$ packed form
58631A478375N5697O2063O8079P4882Q4149R4961J05782J17457J31365J46738
58621B419548J62620J80264K00747K22483K43897K66105K89592L10551L23947
58612D619754L28139L23074L06094K73561K25473J65294R6596K3045m9814j16311
58602F194905j73443k19694k52911k72235k80419k81141k75425k63339k47202
58593C929096k29974k12111j93134j74566j58161j42911j26981j11085r6921q4006
58583B399246p1211n9691n1103m4628l8910l5131l4826l6466l7701l9174m2530
58572A907875m6299m7545m6246m4381m2121l8469l4376l1479k8980k5281k1480
58561A501218j9757j9612j9165j8768j9738k0954k0374j8689j7910j7656j6375
$$ plain form
58550 1292220 1277418 1262955 1248638 1235914 1224692 1212404 1197617 1181809 1166124 1149313 1130644
58539 1130644 1112069 1095454 1080071 1064691 1049878 1036405 1023610 1011074 999788 990020 980204 969446
58527 969446 958899 949234 939196 928176 917682 908551 899259 888785 878608 869944 861466 851956 842957
58514 842957 836584 832622 829712 827443 825476 822711 819321 817705 819494 823343 827229 830985 835023 838722
58500 838722 841883 845865 851534 857839 863817 870068 877040 884075 891415 900727 912194 923478 932931 941361
58486 941361 949300 955288 958419 959801 959857 957045 950988 943992 937617 930696 922597 915249 909721 903967 896381
58471 896381 888650 882539 876782 869804 862707 856771 850734 843405 836384 831266 826505 819940 812303 805559
58457 805559 799948 795190 792245 791245 789983 787084 784439 784020 784654 784545 784504 786062 788748 791905 796807
$$ packed form
58550A292220j4802j4463j4317j2724j1222j2288j4787j5808j5685j6811j8669
58539A130644j8575j6615j5383j5380j4813j3473j2795j2536j1286r768r816j0758
58527I69446j0547r665j0038j1020j0494r131r292j0474j0177q664q478r510q999
58514H42957o373l962k910k269j967k765l390j616J789L849L886L756M038L699
58500H38722L161L982N669O305N978O251O972P035P340R312J1467J1284R453Q430
58486I41361P939N988L131J382N6k812o057o996o375o921q099p348n528n754p586
58471H96381p731o111n757o978p097n936o037p329p021n118m761o565p637o744
58457H05559n611m758k945j000j262k899k645m19O34j09m1J558K686L157M902
$$ plain form
58442 796807 804264 812531 820197 828698 839409 850864 861531 872621 885268 897577 907391 915324 922228
58429 922228 926525 927158 926429 926607 926326 923497 919093 914832 909906 903381 897113 892774 888752 883483 879079
58414 879079 877904 878362 877975 877934 880610 885076 889270 894184 901735 910691 918819 926872 936337 945358 951070
58399 951070 954066 956566 958210 957651 956217 955882 955531 953235 950258 948933 948659 947912 947974 950601 954281 956930
58383 956930 960026 965750 972301 976447 978567 980826 982639 982544 982369 984888 989304 993552 998872 1007446 1017631
58368 1017631 1026303 1033950 1042771 1051867 1059093 1065571 1073467 1081378 1086798 1091068 1096910 1103267 1107741 1111980
58354 1111980 1119282 1128791 1137309 1144960 1153794 1162806 1169724 1175756 1183174 1190180 1193639 1194862 1197161 1199801
58340 1199801 1200194 1199962 1202819 1208250 1213229 1218388 1226566 1237092 1247497 1258929 1273818 1290109 1303981
$$ packed form
58442G96807P457Q267P666Q501J0711J1455J0667J1090J2647J2309R814P933O904
58429I22228M297O33p29J78k81k829m404m261m926o525o268m339m022n269m404
58414H79079j175M58l87m1K676M466M194M914P551Q956Q128Q053R465R021N712
58399I51070K996K500J644n59j434l35l51k296k977j325k74p47O2K627L680K649
58383I56930L096N724O551M146K120K259J813r5j75K519M416M248N320Q574J0185
58368A017631Q672P647Q821R096P226O478P896P911N420M270N842O357M474M239
58354A111980P302R509Q518P651Q834R012O918O032P418P006L459J223K299K640
58340A199801L93k32K857N431M979N159Q178J0526J0405J1432J4889J6291J3872
$$ plain form
58327 1303981 1316347 1330433 1345079 1357002 1367615 1380810 1395858 1409245 1421593 1435910 1451027
58316 1451027 1463913 1476566 1493187 1512326 1529216 1544052 1560341 1576933 1589769 1600013 1612326
58305 1612326 1626328 1637813 1647204 1658655 1671913 1683273 1693535 1706804 1722468 1736656 1750558
58294 1750558 1768826 1790718 1811275 1830229 1851286 1873859 1894295 1914035 1937506 1963262 1986497
58283 1986497 2008877 2036175 2067494 2097004 2125241 2158151 2195737 2232396 2267979 2307631 2350861
58272 2350861 2391732 2429889 2470597 2513856 2554527 2593153 2635505 2681315 2724782 2766249 2811944
58261 2811944 2862151 2911394 2960270 3014998 3075241 3134725 3193903 3259371 3330827 3401745 3472916
58250 3472916 3551746 3638071 3724533 3811134 3905024 4005868 4106422 4207756 4318389 4438094
$$ packed form
58327A303981J2366J4086J4646J1923J0613J3195J5048J3387J2348J4317J5117
58316A451027J2886J2653J6621J9139J6890J4836J6289J6592J2836J0244J2313
58305A612326J4002J1485R391J1451J3258J1360J0262J3269J5664J4188J3902
58294A750558J8268K1892K0557J8954K1057K2573K0436J9740K3471K5756K3235
58283A986497K2380K7298L1319K9510K8237L2910L7586L6659L5583L9652M3230
58272B350861M0871L8157M0708M3259M0671L8626M2352M5810M3467M1467M5695
58261B811944N0207M9243M8876N4728O0243N9484N9178O5468P1456P0918P1171
58250C472916P8830Q6325Q6462Q6601R3890J00844J00554J01334J10633J19705
$$ plain form
58240 4438094 4558612 4680714 4813712 4957599 5103241 5251071 5411423 5585360 5764089
58231 5764089 5948567 6149999 6369403 6597060 6833920 7092274 7373331 7666385 7972523
58222 7972523 8306064 8670109 9054819 9462499 9908971 10397357 10917402 11473841 12087281
58213 12087281 12764217 13496698 14294959 15187882 16187835 17290645 18514798 19903416 21484597
58204 21484597 23273320 25319395 27710097 30522757 33827142 37739344 42414157 47980145
58196 47980145 54556208 62349665 71671503 82861842 96314038 112601213 132480774
58189 132480774 156787027 186454770 222431019 264716814 310609953 353849993 386374113
58182 386374113 402005793 399242258 381094528 352710757 319028890 283750059 249330497
$$ packed form
58240D438094J20518J22102J32998J43887J45642J47830J60352J73937J78729
58231E764089J84478K01432K19404K27657K36860K58354K81057K93054L06138
58222G972523L33541L64045L84710M07680M46472M88386N20045N56439O13440
58213A2087281O76936P32481P98261Q92923R99953J102810J224153J388618J581181
58204B1484597J788723K046075K390702K812660L304385L912202M674813N565988
58196D7980145O576063P793457R321838J1190339J3452196J6287175J9879561
58189A32480774K4306253K9667743L5976249M2285795M5893139M3240040L2524120
58182C86374113J5631680k763535j8147730k8383771l3681867l5278831l4419562
$$ plain form
58175 249330497 217260120 188338257 162916339 141041453 122507575 106934285 93897245
58168 93897245 83005125 73895914 66241604 59785704 54344161 49762532 45900259 42651210
58160 42651210 39942208 37708368 35895451 34481359 33471078 32879548 32740789 33120611
58152 33120611 34107720 35817306 38385934 41829328 45768083 49325031 51463660 51560389
58144 51560389 49692096 46426851 42417703 38167271 34004812 30122942 26609934 23497372
58136 23497372 20797960 18499685 16554492 14903416 13504210 12321578 11311349 10435413
58128 10435413 9677916 9029128 8466417 7965879 7518439 7119221 6753677 6408185 6082366
58119 6082366 5778115 5488163 5207346 4943164 4703163 4482751 4276206 4088244 3923592
$$ packed form
58175B49330497l2070377k8921863k5421918k1874886j8533878j5573290j3037040
58168I3897245j0892120r109211p654310o455900n441543m581629l862273l249049
58160D2651210k709002k233840j812917j414092j010281n91530j38759L79822
58152C3120611R87109J709586K568628L443394L938755L556948K138629R6729
58144E1560389j868293l265245m009148m250432m162459l881870l513008l112562
58136B3497372k699412k298275j945193j651076j399206j182632j010229q75936
58128A0435413p57497o48788n62711n00538m47440l99218l65544l45492l25819
58119F082366l04251k89952k80817k64182k40001k20412k06545j87962j64652
$$ plain form
58110 3923592 3776024 3638653 3514587 3406584 3306134 3203523 3099799 2999055 2898240
58101 2898240 2794650 2694658 2604766 2521547 2439514 2361310 2291271 2226460 2162809 2103097 2050554
58090 2050554 2001446 1951891 1905245 1865166 1828193 1790632 1755853 1727166 1700113 1669481 1637772
58079 1637772 1609426 1582771 1554903 1528556 1506859 1486751 1464501 1442485 1424085 1407281 1389548
58068 1389548 1373609 1361993 1351302 1338200 1325778 1317701 1311206 1302250 1292565 1285338 1278612 1269175 1258532
58055 1258532 1249136 1239099 1226285 1213275 1202780 1192584 1180388 1169064 1161672 1155801 1148322 1141189
58043 1141189 1137039 1133578 1128043 1122888 1121362 1121535 1120276 1119107 1120571 1122832 1123397 1124321 1128144 1132486 1134171
58028 1134171 1134923 1137445 1139612 1138386 1136037 1136642 1139464 1141396 1142995 1146583 1151180 1154645 1158174 1163444
$$ packed form
58110C923592j47568j37371j24066j08003j00450j02611j03724j00744j00815
58101B898240j03590r9992q9892q3219q2033p8204p0039o4811o3651n9712n2543
58090B050554m9108m9555m6646m0079l6973l7561l4779k8687k7053l0632l1709
58079A637772k8346k6655k7868k6347k1697k0108k2250k2016j8400j6804j7733
58068A389548j5939j1616j0691j3102j2422q077o495q956r685p227o726r437j0643
58055A258532r396j0037j2814j3010j0495j0196j2196j1324p392n871p479p133
58043A141189m150l461n535n155j526J73j259j169J464K261N65R24L823M342J685
58028A134171P52K522K167j226k349O05K822J932J599L588M597L465L529N270
$$ plain form
58014 1163444 1168001 1168571 1166453 1164705 1162662 1158192 1152589 1148149 1143435 1136008 1127469 1120886 1115525 1108961
58000 1108961 1102049 1096942 1092482 1086415 1080038 1075857 1072714 1068009 1062710 1059411 1057343 1054022 1050127 1048214
57986 1048214 1048250 1048736 1050456 1054831 1060305 1064577 1068652 1074592 1081229 1086343 1091080 1097760 1105131 1110272 1113537
57971 1113537 1117208 1120840 1122358 1122338 1122934 1123931 1123898 1123671 1124580 1124833 1122004 1117732 1115632 1115835 1115676 1114519 1113701
57954 1113701 1112897 1110718 1107926 1106151 1104525 1101358 1097917 1096797 1097876 1099627 1102789 1108600 1114939 1118667
57940 1118667 1120606 1123846 1128209 1130791 1130949 1130286 1128559 1124149 1118111 1113256 1109450 1103969 1096276 1088439
57926 1088439 1081084 1072939 1064302 1057109 1051571 1046375 1042028 1040332 1040740 1040848 1040481 1041839 1045632 1050420 1055590
57911 1055590 1061667 1067882 1072828 1077402 1083905 1092398 1101108 1109904 1119993 1130573 1139401 1146608 1154495
$$ packed form
58014A163444M557N70k118j748k043m470n603m440m714p427q539o583n361o564
58000A108961o912n107m460o067o377m181l143m705n299l299k068l321l895j913
57986A048214L6M86J720M375N474M272M075N940O637N114M737O680P371N141L265
57971A113537L671L632J518k0N96R97l3k27R09K53k829m272k100K03j59j157q18
57954A113701q04k179k792j775j626l167l441j120J079J751L162N811O339L728
57940A118667J939L240M363K582J58o63j727m410o038m855l806n481p693p837
57926A088439p355q145q637p193n538n196m347j696M08J08l67J358L793M788N170
57911A055590O077O215M946M574O503Q493Q710Q796J0089J0580Q828P207P887
$$ plain form
57898 1154495 1163517 1171765 1178350 1184085 1188910 1191927 1193914 1196549 1199138 1199316 1196931 1194093 1191462 1187795
57884 1187795 1183152 1179163 1175921 1171813 1166735 1162471 1159656 1157282 1155270 1154548 1154548 1153708 1152606 1153581 1157115
57869 1157115 1161506 1166199 1172335 1179911 1187512 1195111 1204049 1213997 1222922 1230367 1237676 1244739 1249626 1251983
57855 1251983 1253760 1255973 1257548 1257897 1257888 1257767 1256801 1255442 1255193 1255962 1256173 1255764 1256306 1257923 1258978 1259140 1259863
57838 1259863 1261356 1262046 1261684 1262110 1264163 1266464 1267921 1268849 1269024 1267264 1263663 1259766 1256028 1251512 1246396
57823 1246396 1242092 1238448 1233623 1227306 1221238 1216003 1210188 1203468 1197647 1193709 1190564 1187654 1186060 1186001
57809 1186001 1185859 1184833 1184139 1184558 1185227 1185839 1187564 1190694 1193806 1196400 1200059 1205822 1212622 1219538 1227447
57794 1227447 1237352 1249093 1262754 1279164 1297783 1315976 1331567 1344522 1355398 1364109 1371006 1377220
$$ packed form
57898A154495R022Q248O585N735M825L017J987K635K589J78k385k838k631l667
57884A187795m643l989l242m108n078m264k815k374k012p22%q40j102R75L534
57869A157115M391M693O136P576P601P599Q938R948Q925P445P309P063M887K357
57855A251983J777K213J575L49rj21r66j359k49P69K11m09N42J617J055J62P23
57838A259863J493O90l62M26K053K301J457R28J75j760l601l897l738m516n116
57823A246396m304l644m825o317o068n235n815o720n821l938l145k910j594n9
57809A186001j42j026o94M19O69O12J725L130L112K594L659N763O800O916P909
57794A227447R905J1741J3661J6410J8619J8193J5591J2955J0876Q711O897O214
$$ plain form
57782 1377220 1382978 1387313 1390013 1392038 1393520 1393450 1391865 1390133 1388556 1386019 1382615 1380091 1378934 1377520
57768 1377520 1375189 1373602 1373959 1375303 1376870 1379738 1384727 1390823 1397068 1403929 1411438 1418039 1422816 1427073
57754 1427073 1432347 1438519 1445024 1452161 1459976 1467608 1474901 1482991 1492210 1501202 1509119 1516911 1525448 1534200
57740 1534200 1542743 1551651 1560870 1569220 1576612 1584803 1594878 1605929 1617245 1629648 1643453 1657370
57728 1657370 1670847 1685328 1701613 1717999 1732871 1747341 1763596 1782195 1802510 1824255 1847027
57717 1847027 1869880 1892876 1917602 1944814 1973146 2001534 2031204 2063808 2099235 2136782 2176849
57706 2176849 2219921 2265501 2313746 2366685 2426121 2491744 2562957 2641214 2728894 2827150 2936562
57695 2936562 3058777 3195845 3348918 3519065 3708304 3918475 4149982 4402782 4677304
$$ packed form
57782A377220N758M335K700K025J482p0j585j732j577k537l404k524j157j414
57768A377520k331j587L57J344J567K868M989O096O245O861P509O601M777M257
57754A427073N274O172O505P137P815P632P293Q090R219Q992P917P792Q537Q752
57740A534200Q543Q908R219Q350P392Q191J0075J1051J1316J2403J3805J3917
57728A657370J3477J4481J6285J6386J4872J4470J6255J8599K0315K1745K2772
57717A847027K2853K2996K4726K7212K8332K8388K9670L2604L5427L7547M0067
57706B176849M3072M5580M8245N2939N9436O5623P1213P8257Q7680R8256J09412
57695B936562J22215J37068J53073J70147J89239K10171K31507K52800K74522
$$ plain form
57686 4677304 4972853 5285604 5608690 5932709 6245123 6530781 6774764 6964628 7090698
57677 7090698 7147371 7136162 7066011 6949255 6798500 6627472 6451495 6284437 6136033 6012250
57667 6012250 5914195 5833444 5751205 5646928 5509293 5339133 5144820 4937718 4729811 4530908
57657 4530908 4346550 4179424 4031847 3905239 3798442 3708869 3634795 3574918 3526887 3488533
57647 3488533 3459890 3441964 3434127 3434604 3442731 3458862 3482812 3514490 3555421 3607557 3671010 3744905
57635 3744905 3830077 3929031 4043594 4174423 4322566 4489678 4676744 4883897 5110986 5356750
57625 5356750 5617539 5887944 6161839 6431162 6684283 6907358 7087337 7213248 7276544 7273152
57615 7273152 7205523 7081229 6909737 6701374 6467900 6221149 5970360 5721822 5480567 5250853
$$ packed form
57686D677304K95549L12751L23086L24019L12414K85658K43983J89864J26070
57677G090698N6673j1209p0151j16756j50755j71028j75977j67058j48404j23783
57667F012250r8055q0751q2239j04277j37635j70160j94313k07102k07907j98903
57657D530908j84358j67126j47577j26608j06797q9573p4074n9877m8031l8354
57647C488533k8643j7926p837M77Q127J6131K3950L1678M0931N2136O3453P3895
57635C744905Q5172R8954J14563J30829J48143J67112J87066K07153K27089K45764
57625E356750K60789K70405K73895K69323K53121K23075J79979J25911O3296l392
57615G273152o7629j24294j71492k08363k33474k46751k50789k48538k41255k29714
$$ plain form
57605 5250853 5035293 4835070 4650980 4483227 4330745 4192122 4066822 3954408 3853350
57596 3853350 3761991 3679988 3607301 3542504 3483700 3430464 3383110 3340632 3301175 3264241 3230685
57585 3230685 3200816 3174092 3150408 3130027 3112406 3096595 3082635 3071198 3062134 3054723 3048963 3045192
57573 3045192 3042898 3041356 3041049 3042982 3047005 3052238 3058687 3066903 3076578 3087075 3098892 3112962 3128928
57560 3128928 3145746 3163604 3183534 3205548 3228905 3253871 3281359 3311138 3342244 3375000 3410870
57549 3410870 3450486 3493647 3541052 3594074 3652818 3716334 3784923 3860492 3944556 4037676 4140995
57538 4140995 4256458 4385137 4527012 4682642 4853376 5039483 5239546 5451936 5675128
57529 5675128 5905813 6137714 6362492 6570571 6751134 6893232 6988229 7031232 7020970 6959977
$$ packed form
57605E250853k15560k00223j84090j67753j52482j38623j25300j12414j01058
57596C853350r1359q2003p2687o4797n8804n3236m7354m2478l9457l6934l3556
57585C230685k9869k6724k3684k0381j7621j5811j3960j1437r064p411n760l771
57573C045192k294j542l07J933M023N233O449Q216R675J0497J1817J4070J5966
57560C128928J6818J7858J9930K2014K3357K4966K7488K9779L1106L2756L5870
57549C410870L9616M3161M7405N3022N8744O3516O8589P5569Q4064R3120J03319
57538D140995J15463J28679J41875J55630J70734J86107K00063K12390K23192
57529E675128K30685K31901K24778K08079J80563J42098R4997M3003j0262o0993
$$ plain form
57519 6959977 6854965 6715373 6550827 6370270 6182435 5995024 5813066 5639471 5477059
57510 5477059 5328473 5194269 5073093 4964160 4867927 4784123 4710960 4646946 4591932 4545830
57500 4545830 4507773 4477137 4454005 4437908 4427268 4420679 4417760 4418412 4422436 4430291 4443067 4461193
57488 4461193 4484141 4511653 4544282 4582474 4626290 4676295 4733626 4798918 4872271 4954505 5047362
57477 5047362 5152199 5269563 5400159 5545081 5704875 5879447 6068849 6272695 6488263
57468 6488263 6710009 6930812 7142445 7334938 7497220 7619312 7693623 7715159 7682794 7600844
57458 7600844 7477766 7322579 7143370 6948716 6748028 6549313 6357723 6176711 6009007
57449 6009007 5855796 5716474 5590253 5477149 5376980 5288684 5211208 5143886 5085445 5033919
$$ packed form
57519F959977j05012j39592j64546j80557j87835j87411j81958j73595j62412
57510E477059j48586j34204j21176j08933r6233q3804p3163o4014n5014m6102
57500D545830l8057l0636k3132j6097j0640o589k919O52M024P855J2776J8126
57488D461193K2948K7512L2629L8192M3816N0005N7331O5292P3353Q2234R2857
57477E047362J04837J17364J30596J44922J59794J74572J89402K03846K15568
57468F488263K21746K20803K11633J92493J62282J22092P4311K1536l2365q1950
57458G600844j23078j55187j79209j94654k00688j98715j91590j81012j67704
57449F009007j53211j39322j26221j13104j00169q8296p7476o7322n8441n1526
$$ plain form
57439 5033919 4988191 4948424 4914395 4884644 4857892 4834125 4813604 4796013 4781214 4769616 4761040
57428 4761040 4754329 4748873 4745413 4744487 4745122 4745981 4747052 4749362 4753602 4759617 4766665 4773738 4780247 4786726 4794350
57413 4794350 4803703 4814698 4827442 4841993 4857376 4872270 4886802 4902253 4918843 4935425 4951665
57402 4951665 4968739 4987271 5006306 5025158 5044637 5065373 5086387 5106505 5125997 5145652 5165340
57391 5165340 5184653 5204038 5224148 5244772 5265338 5285805 5306270 5326418 5346137 5365916 5385980
57380 5385980 5405760 5424847 5443611 5462369 5480924 5499559 5519413 5540973 5563131 5584601 5605457
57369 5605457 5626496 5647947 5669648 5691732 5714253 5736723 5758786 5780801 5803213 5825936 5848811
57358 5848811 5871954 5895271 5918376 5941303 5964416 5987375 6009288 6030306 6051842 6074742 6098396
$$ packed form
57439E033919m5728l9767l4029k9751k6752k3767k0521j7591j4799j1598q576
57428D761040o711n456l460r26O35Q59J071K310M240O015P048P073O509O479P624
57413D794350R353J0995J2744J4551J5383J4894J4532J5451J6590J6582J6240
57402D951665J7074J8532J9035J8852J9479K0736K1014K0118J9492J9655J9688
57391E165340J9313J9385K0110K0624K0566K0467K0465K0148J9719J9779K0064
57380E385980J9780J9087J8764J8758J8555J8635J9854K1560K2158K1470K0856
57369E605457K1039K1451K1701K2084K2521K2470K2063K2015K2412K2723K2875
57358E848811K3143K3317K3105K2927K3113K2959K1913K1018K1536K2900K3654
$$ plain form
57347 6098396 6122201 6146575 6171793 6197154 6222111 6247060 6272127 6296424 6319448 6342086 6365205
57336 6365205 6388387 6411069 6433817 6457291 6480893 6503665 6525820 6548329 6571670 6595837 6620815
57325 6620815 6646208 6671237 6695861 6721041 6747156 6773264 6798759 6824530 6851426 6878724 6905427
57314 6905427 6932010 6959481 6987581 7015302 7042579 7070178 7098425 7127209 7156699 7187008 7217716
57303 7217716 7248679 7280687 7314408 7349371 7384885 7421164 7458589 7496843 7535871 7576847 7620876
57292 7620876 7667478 7715494 7764750 7815673 7868114 7921880 7977593 8035617 8094773 8153514 8211758
57281 8211758 8270105 8327788 8382785 8433513 8479025 8517954 8548716 8570636 8583770 8588085 8583944 8572919
57269 8572919 8556855 8536652 8513159 8488603 8465462 8444290 8424173 8405100 8388393 8374952 8364566
$$ packed form
57347F098396K3805K4374K5218K5361K4957K4949K5067K4297K3024K2638K3119
57336F365205K3182K2682K2748K3474K3602K2772K2155K2509K3341K4167K4978
57325F620815K5393K5029K4624K5180K6115K6108K5495K5771K6896K7298K6703
57314F905427K6583K7471K8100K7721K7277K7599K8247K8784K9490L0309L0708
57303G217716L0963L2008L3721L4963L5514L6279L7425L8254L9028M0976M4029
57292G620876M6602M8016M9256N0923N2441N3766N5713N8024N9156N8741N8244
57281H211758N8347N7683N4997N0728M5512L8929L0762K1920J3134M315m141j1025
57269H572919j6064k0203k3493k4556k3141k1172k0117j9073j6707j3441j0386
$$ plain form
57258 8364566 8356911 8351832 8348642 8346479 8345497 8346586 8349893 8354733 8360834 8368456 8377241 8386130 8394484 8402335
57244 8402335 8409621 8416335 8423400 8432133 8442658 8453786 8464580 8475077 8485475 8495698 8505965 8516843
57232 8516843 8528365 8539736 8549965 8558324 8564360 8568194 8570677 8572511 8573418 8572848 8571203 8569532 8568392 8567917
57218 8567917 8568730 8571710 8577045 8584458 8594201 8606765 8621742 8638083 8655495 8674560 8695288 8716462
57206 8716462 8736650 8755263 8772550 8789117 8805426 8821227 8835602 8848030 8859120 8869832 8880413
57195 8880413 8890666 8900659 8910403 8919422 8927521 8935456 8943992 8952839 8961483 8970428 8980423 8990911 9000458
57182 9000458 9008398 9014896 9019796 9022632 9023617 9023445 9022235 9019595 9015457 9009883 9002450 8992903 8981994 8970511
57168 8970511 8957956 8943414 8927257 8910573 8893219 8873907 8852049 8828019 8801662 8772026 8738602
$$ packed form
57258H364566p655n079l190k163r82J089L307M840O101P622Q785Q889Q354P851
57244H402335P286O714P065Q733J0525J1128J0794J0497J0398J0223J0267J0878
57232H516843J1522J1371J0229Q359O036L834K483J834R07n70j645j671j140m75
57218H567917Q13K980N335P413R743J2564J4977J6341J7412J9065K0728K1174
57206H716462K0188J8613J7287J6567J6309J5801J4375J2428J1090J0712J0581
57195H880413J0253R993R744R019Q099P935Q536Q847Q644Q945R995J0488R547
57182I000458P940O498M900K836R85j72j210k640m138n574p433r547j0909j1483
57168H970511j2555j4542j6157j6684j7354j9312k1858k4030k6357k9636l3424
$$ plain form
57157 8738602 8701499 8660320 8614158 8562835 8506996 8446909 8382298 8313287 8240400 8163740 8083407
57146 8083407 8000650 7917279 7833815 7749378 7663370 7576107 7487940 7399110 7310555 7223644 7139064
57135 7139064 7057139 6979120 6906789 6840710 6780130 6724527 6673804 6626707 6580306 6531262 6476727
57124 6476727 6414376 6343091 6263873 6179007 6090448 6000124 5911252 5827512 5750718 5680635 5616817
57113 5616817 5558975 5505688 5454732 5405199 5358038 5314671 5276813 5247707 5231671 5232166 5252005 5295807
57101 5295807 5370861 5485871 5650996 5879341 6186273 6586570 7093461 7719932 8478462 9378981
57091 9378981 10428659 11632726 12991918 14498042 16133428 17872546 19678543 21497429
57083 21497429 23260960 24896596 26328528 27468527 28222158 28527311 28398316 27928814 27243391
$$ packed form
57157H738602l7103m1179m6162n1323n5839o0087o4611o9011p2887p6660q0333
57146H083407q2757q3371q3464q4437q6008q7263q8167q8830q8555q6911q4580
57135G139064q1925p8019p2331o6079o0580n5603n0723m7097m6401m9044n4535
57124F476727o2351p1285p9218q4866q8559r0324q8872q3740p6794p0083o3818
57113E616817n7842n3287n0956m9533m7161m3367l7858k9106j6036M95J9839M3802
57101E295807P5054J15010J65125K28345L06932M00297N06891O26471P58530R00519
57091I378981J049678J204067J359192J506124J635386J739118J805997J818886
57083B1497429J763531J635636J431932J139999P53631L05153j28995m69502o85423
$$ plain form
57074 27243391 26438084 25554217 24591628 23536309 22380458 21130952 19810763 18455732
57066 18455732 17107307 15803654 14573300 13433906 12395181 11462423 10638218 9922517
57058 9922517 9312257 8800824 8377793 8029903 7743100 7503917 7299595 7118572 6951951
57049 6951951 6794199 6642137 6493941 6349364 6209601 6075582 5946425 5819772 5692858
57040 5692858 5562727 5426408 5282085 5130044 4972193 4811144 4649886 4491159 4336152
57031 4336152 4184196 4034181 3885681 3738401 3591634 3444995 3298916 3153743 3009235
57022 3009235 2865674 2724472 2586686 2451684 2318284 2186615 2058013 1933698 1814568
57013 1814568 1701783 1596529 1499365 1410438 1330062 1258580 1195970 1142058 1096777 1060066 1032092
$$ packed form
57074B7243391q05307q83867r62589j055319j155851j249506j320189j355031
57066A8455732j348425j303653j230354j139394j038725r32758q24205p15701
57058I922517o10260n11433m23031l47890k86803k39183k04322j81023j66621
57049F951951j57752j52062j48196j44577j39763j34019j29157j26653j26914
57040E692858j30131j36319j44323j52041j57851j61049j61258j58727j55007
57031D336152j51956j50015j48500j47280j46767j46639j46079j45173j44508
57022C009235j43561j41202j37786j35002j33400j31669j28602j24315j19130
57013A814568j12785j05254r7164q8927q0376p1482o2610n3912m5281l6711k7974
$$ plain form
57002 1032092 1013812 1006742 1012118 1031057 1065486 1118219 1192828 1294734 1430100 1597561 1777521
56991 1777521 1932742 2025365 2036916 1973953 1858008 1712537 1556352 1402650 1259698 1131867
56981 1131867 1020537 924265 839280 761616 689371 622632 561980 507983 461545 423297 392687
56970 392687 368522 350138 337232 329053 324677 323676 325654 329692 335244 343038 354048 368208 385236
56957 385236 405954 431023 458382 483220 500597 507554 503434 489752 469805 447076 423623 400383
56945 400383 378421 358782 341541 326254 313283 303634 297697 295205 296307 301546 310782 323235 338811
56932 338811 358601 383852 414643 448909 481871 506935 518619 515266 498989 473703 443653 412595
56920 412595 382704 354243 327113 302333 281200 263669 248810 236344 226406 218166 210183 202100
$$ packed form
57002A032092j8280p070N376J8939L4429N2733P4609J01906J35366J67461J79960
56991A777521J55221R2623J1551o2963j15945j45471j56185j53702j42952j27831
56981A131867j11330r6272q4985p7664p2245o6739o0652n3997m6438l8248l0610
56970C92687k4165j8384j2906q179m376j001J978M038N552P794J1010J4160J7028
56957C85236K0718K5069K7359K4838J7377O957m120j3682j9947k2729k3453k3240
56945D00383k1962j9639j7241j5287j2971r649n937k492J102N239R236J2453J5576
56932C38811J9790K5251L0791L4266L2962K5064J1684l353j6277k5286l0050l1058
56920D12595k9891k8461k7130k4780k1133j7531j4859j2466r938q240p983q083
$$ plain form
56908 202100 194787 188891 184337 181080 179105 177708 175970 174056 173007 173240 174219 175619 177831 181239 185905
56893 185905 191977 199657 208908 220013 234199 252811 276015 303036 333085 364826 395169 419954
56881 419954 436143 442825 440647 431468 418289 404139 390657 378374 367975 360302 355460 353099 353432
56868 353432 356996 363764 373660 387714 407551 434054 467750 510248 563709 628384 700957 774389
56856 774389 838409 881743 897077 885142 853209 809673 760851 711558 665716 625470 591374
56845 591374 564155 545090 534537 531683 536181 548799 570303 601260 643174 698361 768455 854382
56833 854382 957081 1074815 1197885 1307977 1385421 1418202 1405328 1354473 1277871 1188233 1095226
56822 1095226 1004444 919329 842960 777513 723374 680128 647820 626455 615109 612716 619376 636118
$$ packed form
56908B02100p313n896m554l257j975j397j738j914j049K33R79J400K212L408M666
56893A85905O072P680R251J1105J4186J8612K3204K7021L0049L1741L0343K4785
56881D19954J6189O682k178r179j3179j4150j3482j2283j0399p673m842k361L33
56868C53432L564O768R896J4054J9837K6503L3696M2498N3461O4675P2573P3432
56856G74389O4020M3334J5334j1935l1933m3536m8822m9293m5842m0246l4096
56845E91374k7219j9065j0553k854M498J2618K1504L0957M1914N5187P0094Q5927
56833H54382J02699J17734J23070J10092P7444L2781j2874n0855p6602q9638r3007
56822A095226r0782q5115p6369o5447n4139m3246l2308k1365j1346k393O660J6742
$$ plain form
56810 636118 663877 703554 756609 824240 904900 991861 1072736 1132387 1158859 1148816 1108046
56799 1108046 1046862 974916 899169 824373 753836 689869 634123 587402 549294 518669 494824
56788 494824 477767 467505 463893 467189 477954 496249 521733 554450 594224 638486 681186 714379
56776 714379 731132 727929 705938 670359 627564 582157 536649 492943 452746 416773 384963 357597
56764 357597 334947 315888 298430 281921 267422 255657 246016 237940 231743 227413 223909 220401 217080
56751 217080 214139 211099 207735 204598 202021 199559 196938 194508 192257 189543 186351 183697 182157 181018
56737 181018 179463 177504 175240 172425 169433 167412 166657 165922 164164 161964 160449 159780 159493 159313 158837 157363
56721 157363 154923 152729 151814 152025 152893 154514 156815 158882 159891 159997 159686 159068 158397 158295 158749 158722 157451
$$ packed form
56810F36118K7759L9677N3055O7631Q0660Q6961Q0875N9651K6472j0043m0770
56799A108046o1184p1946p5747p4796p0537o3967n5746m6721l8108l0625k3845
56788D94824j7057j0262l612L296J0765J8295K5484L2717L9774M4262M2700L3193
56776G14379J6753l203k1991l5579m2795m5407m5508m3706m0197l5973l1810k7366
56764C57597k2650j9059j7458j6509j4499j1765r641q076o197m330l504l508l321
56751B17080k941l040l364l137k577k462k621k430k251k714l192k654j540j139
56737A81018j555j959k264k815k992k021p55p35j758k200j515o69k87j80m76j474
56721A57363k440k194r15K11Q68J621K301K067J009J06l11o18o71j02M54k7j271
$$ plain form
56704 157451 155319 152935 150379 147911 146347 145916 145759 145260 144878 144990 145030 144638 144537 145375 146669 147763 148833
56687 148833 150053 150829 150869 151089 152411 154474 156415 158045 159347 159771 159109 158212 157877 157778 157467 157468 158353 159530
56669 159530 160089 160181 160567 161417 162406 163294 163631 162694 160571 158471 157170 156041 154392 152703 151529 150311
56653 150311 148389 146203 144272 141933 138385 134164 130319 126942 123698 121023 119422 118270 116614 114602
56639 114602 112924 111556 110245 109545 110007 110936 111237 111004 111016 111264 111280 111465 112635 114541 116100 116852 117162
56622 117162 117280 117298 117718 119018 120870 122703 124678 127237 130110 132673 134850 136835 138398 139348 140186 141432
56606 141432 142812 143863 144729 145653 146392 146964 148108 150101 152007 153042 153791 154983 156086 156358 156409 157299
56590 157299 158771 159683 159701 159364 159074 159087 159931 161752 163916 166070 168710 171802 174027 174613 174725 175750 177442
$$ packed form
56704A57451k132k384k556k468j564m31j57m99l82J12M0l92j01Q38J294J094J070
56687A48833J220P76M0K20J322K063J941J630J302M24o62q97l35r9l11JQ85J177
56669A59530N59R2L86Q50R89Q88L37r37k123k100j301j129j649j689j174j218
56653A50311j922k186j931k339l548m221l845l377l244k675j601j152j656k012
56639A14602j678j368j311p00M62R29L01k33J2K48J6J85J170J906J559P52L10
56622A17162J18J8M20J300J852J833J975K559K873K563K177J985J563R50Q38J246
56606A41432J380J051Q66R24P39N72J144J993J906J035P49J192J103K72N1Q90
56590A57299J472R12J8l37k90J3Q44J821K164K154K640L092K225N86J12J025J692
$$ plain form
56573 177442 179181 181723 185824 190353 193797 196686 200452 204797 208443 211829 216638 222941 229041 234094
56559 234094 238848 243833 248789 253960 260161 267351 274638 281654 288503 294567 298997 302182 305126 307579
56545 307579 308360 307359 305554 303259 299995 295939 291779 287302 281822 275858 270628 266050 261065 255835
56531 255835 251701 248867 245982 242240 238202 234347 230487 226816 223870 221189 217530 212652 207507 202662
56517 202662 197996 193937 191261 189542 187418 184657 182428 181388 180918 180335 179383 177625 174961 172704 172430
56502 172430 173678 174470 174109 173728 174070 174696 175571 177370 179800 181469 181964 182326 183085 183634 183995 185340 188036
56485 188036 190870 192935 194782 197038 199341 201381 203624 206303 208906 211247 213906 217149 220523 223813
56471 223813 227269 230712 233636 236373 239829 243922 247613 250537 253211 255675 257512 259222 261852 265154
$$ packed form
56573A77442J739K542M101M529L444K889L766M345L646L386M809O303O100N053
56559B34094M754M985M956N171O201P190P287P016O849O064M430L185K944K453
56545C07579P81j001j805k295l264m056m160m477n480n964n230m578m985n230
56531B55835m134k834k885l742m038l855l860l671k946k681l659m878n145m845
56517B02662m666m059k676j719k124k761k229j040m70n83r52j758k664k257k74
56502A72430J248P92l61l81L42O26Q75J799K430J669M95L62P59N49L61J345K696
56485A88036K834K065J847K256K303K040K243K679K603K341K659L243L374L290
56471B23813L456L443K924K737L456M093L691K924K674K464J837J710K630L302
$$ plain form
56457 265154 267859 269912 272550 275938 278696 280209 281420 282775 283347 282746 282123 282368 282864 282904 282940 283694 285212
56440 285212 287370 290094 292755 294556 295677 296647 296690 294436 290355 286477 283507 280253 276166 272193 268566
56425 268566 264085 258450 253209 249383 246135 242762 240003 238263 236438 233739 231034 229253 228012 226873
56411 226873 226344 226496 226158 224676 223109 222566 222674 222734 223058 224096 225418 226494 227448 228329 228794 229102 230174
56394 230174 232138 234061 235501 236867 238040 238356 238346 239561 242098 244243 245165 245975 247459 248913 250157
56379 250157 252548 256842 261933 266780 271715 276809 280915 283544 285798 288272 289901 290085 290003 290524 290663
56364 290663 289536 288091 287509 287541 287733 288636 290423 291966 292615 293330 294852 296411 297463 298915 301285 303429
56348 303429 304532 305686 308032 310993 313747 316829 320807 324973 328760 332889 337787 342499 346543 351209
$$ packed form
56457B65154K705K053K638L388K758J513J211J355N72o01o23K45M96M0L6P54J518
56440B85212K158K724K661J801J121R70M3k254m081l878k970l254m087l973l627
56425B68566m481n635n241l826l248l373k759j740j825k699k705j781j241j139
56411B26873n29J52l38j482j567n43J08O0L24J038J322J076R54Q81M65L08J072
56394B30174J964J923J440J366J173L16j0J215K537K145R22Q10J484J454J244
56379B50157K391M294N091M847M935N094M106K629K254K474J629J84q2N21J39
56364B90663j127j445n82L2J92R03J787J543O49P15J522J559J052J452K370K144
56348C03429J103J154K346K961K754L082L978M166L787M129M898M712M044M666
$$ plain form
56334 351209 357645 365278 373377 382361 392237 401604 409735 417889 427109 436492 445038 453310 461823 469752
56320 469752 476804 484263 492451 499231 502904 504592 505866 506070 504153 501190 498763 496480 493334 489924
56306 489924 487232 484739 481883 479761 479213 478782 476921 474809 474738 476901 479944 483464 487858 492814 497951
56291 497951 503897 510997 518226 525028 532821 542930 554531 566352 578812 592713 607579 623161
56279 623161 640799 661319 683358 705776 729885 757256 787334 819359 854596 894242 937187
56268 937187 982510 1032298 1089312 1153686 1224697 1303908 1393489 1493003 1600917 1717993 1846226
56257 1846226 1985675 2135139 2294648 2464316 2641795 2823516 3007180 3190372 3368041
56248 3368041 3534318 3685763 3820318 3934507 4024674 4089915 4131187 4148988 4144673 4122479 4087025
$$ packed form
56334C51209O436P633Q099Q984R876R367Q131Q154R220R383Q546Q272Q513P929
56320D69752P052P459Q188O780L673J688J274K04j917k963k427k283l146l410
56306D89924k692k493k856k122n48m31j861k112p1K163L043L520M394M956N137
56291D97951N946P100P229O802P793J0109J1601J1821J2460J3901J4866J5582
56279F23161J7638K0520K2039K2418K4109K7371L0078L2025L5237L9646M2945
56268I37187M5323M9788N7014O4374P1011P9211Q9581R9514J07914J17076J28233
56257A846226J39449J49464J59509J69668J77479J81721J83664J83192J77669
56248C368041J66277J51445J34555J14189R0167O5241M1272J7801m315k2194l5454
$$ plain form
56237 4087025 4039969 3982000 3916601 3848462 3779296 3708427 3636349 3564333 3491433 3415192 3334716
56226 3334716 3250168 3160274 3063386 2960184 2852466 2740381 2623813 2505189 2387660 2271593
56216 2271593 2156068 2042591 1933921 1830312 1730519 1635577 1548018 1468095 1394202 1326278
56206 1326278 1265442 1211050 1161478 1116944 1078244 1043681 1010720 979698 952359 927836 903864
56195 903864 880966 861416 844857 829009 814075 802289 793538 785554 778201 773558 771862 771191 771170
56182 771170 773247 777375 782041 787445 795157 804775 814381 823949 834872 846567 857028 866174 875010
56169 875010 882213 885423 885360 884827 884227 881978 878560 876001 873997 870841 867546 866700 867830 868481 869301 873278
56153 873278 880321 887519 894608 904176 916468 929139 942525 960169 983471 1010521 1040880 1076932
$$ packed form
56237D087025m7056n7969o5399o8139o9166p0869p2078p2016p2900p6241q0476
56226C334716q4548q9894r6888j03202j07718j12085j16568j18624j17529j16067
56216B271593j15525j13477j08670j03609r9793r4942q7559p9923p3893o7924
56206A326278o0836n4392m9572m4534l8700l4563l2961l1022k7339k4523k3972
56195I03864k2898j9550j6559j5848j4934j1786q751p984p353m643j696o71k1
56182G71170K077M128M666N404P712R618R606R568J0923J1695J0461R146Q836
56169H75010P203L210o3n33o00k249l418k559k004l156l295q46J130O51Q20L977
56153H73278P043P198P089R568J2292J2671J3386J7644K3302K7050L0359L6052
$$ plain form
56141 1076932 1119899 1169051 1225582 1293012 1373233 1466272 1573988 1699278 1840961 1993514
56131 1993514 2151688 2310835 2463141 2599490 2716451 2817426 2906821 2987649 3064038 3139542
56121 3139542 3211372 3271264 3313314 3336939 3342651 3330908 3305985 3275029 3241191 3201697 3152797
56110 3152797 3091594 3013193 2912692 2791883 2659101 2521533 2382666 2247236 2121872 2009065
56100 2009065 1906159 1811915 1728700 1657031 1593763 1537252 1488878 1448181 1412001 1379645 1353290
56089 1353290 1332214 1312491 1293486 1278541 1268110 1258510 1248700 1241751 1238174 1234475 1230014 1228524 1231012
56076 1231012 1233848 1235775 1240033 1247527 1254808 1260904 1269203 1280315 1290170 1297579 1306608 1318911 1330905
56063 1330905 1341094 1353011 1368120 1383008 1396367 1411540 1429351 1445848 1460035 1476384 1496667
$$ packed form
56141A076932M2967M9152N6531O7430Q0221R3039J07716J25290J41683J52553
56131A993514J58174J59147J52306J36349J16961J00975Q9395Q0828P6389P5504
56121C139542P1830N9892M2050K3625N712j1743k4923l0956l3838l9494m8900
56110C152797o1203p8401j00501j20809j32782j37568j38867j35430j25364j12807
56100B009065j02906r4244q3215p1669o3268n6511m8374m0697l6180l2356k6355
56089A353290k1076j9723j9005j4945j0431r600r810o949l577l699m461j490K488
56076A231012K836J927M258P494P281O096Q299J1112R855P409R029J2303J1994
56063A330905J0189J1917J5109J4888J3359J5173J7811J6497J4187J6349K0283
$$ plain form
56052 1496667 1516806 1534832 1554329 1576893 1598973 1619321 1641728 1667248 1691761 1714395 1740065
56041 1740065 1770437 1800931 1829870 1861673 1897570 1932509 1965061 2000794 2041762 2082380 2120143
56030 2120143 2160435 2206059 2252078 2296013 2342858 2394684 2445652 2492872 2541872 2595689 2649210
56019 2649210 2700143 2754532 2815166 2875696 2932794 2992860 3060029 3129086 3197213 3270798 3353270
56008 3353270 3438306 3522612 3612991 3712979 3815371 3916270 4023225 4140855 4262147 4383088
55998 4383088 4511772 4653384 4800716 4949668 5109103 5284643 5468173 5654618 5853092
55989 5853092 6069623 6295503 6525343 6769471 7035224 7313921 7600530 7907631 8244965
55980 8244965 8604460 8981403 9390178 9842198 10329514 10848314 11416595 12049804 12742821
$$ packed form
56052A496667K0139J8026J9497K2564K2080K0348K2407K5520K4513K2634K5670
56041A740065L0372L0494K8939L1803L5897L4939L2552L5733M0968M0618L7763
56030B120143M0292M5624M6019M3935M6845N1826N0968M7220M9000N3817N3521
56019B649210N0933N4389O0634O0530N7098O0066O7169O9057O8127P3585Q2472
56008C353270Q5036Q4306R0379R9988J02392J00899J06955J17630J21292J20941
55998D383088J28684J41612J47332J48952J59435J75540J83530J86445J98474
55989E853092K16531K25880K29840K44128K65753K78697K86609L07101L37334
55980H244965L59495L76943M08775M52020M87316N18800N68281O33209O93017
$$ plain form
55971 12742821 13496398 14336102 15283390 16335460 17497871 18808463 20304556 22000260
55963 22000260 23926245 26158718 28780682 31856623 35480828 39804253 44973634 51100721
55955 51100721 58347126 66988798 77352949 89781253 104743862 122919595 145103487
55948 145103487 172171863 205148151 244688123 289491181 334748092 372723123 395965985
55941 395965985 400881352 388839046 364412653 332756945 298045022 263179641 230015580
55934 230015580 199620105 172527881 148936820 128774763 111737916 97412969 85402304
55927 85402304 75342754 66881943 59711525 53608021 48402092 43929921 40045540 36650344
55919 36650344 33670610 31023928 28636863 26473901 24518007 22739300 21107988 19618297
$$ packed form
55971A2742821P53577Q39704R47288J052070J162411J310592J496093J695704
55963B2000260J925985K232473K621964L075941L624205M323425N169381O127087
55955E1100721P246405Q641672J0364151J2428304J4962609J8175733K2183892
55948A45103487K7068376L2976288L9539972M4803058M5256911L7975031K3242862
55941C95965985M915367j2042306k4426393l1655708l4711923l4865381l3164061
55934B30015580l0395475k7092224k3591061k0162057j7036847j4324947j2010665
55927H5402304j0059550q460811p170418o103504n205929m472171l884381l395196
55919C6650344k979734k646682k387065k162962j955894j778707j631312j489691
$$ plain form
55911 19618297 18271271 17047957 15922734 14887755 13941318 13066684 12244995 11476440 10767756
55902 10767756 10110863 9493500 8918881 8394963 7914636 7464861 7045358 6660658 6303385
55893 6303385 5962722 5640819 5344624 5069738 4807679 4560833 4335129 4125662 3924086
55884 3924086 3732773 3557779 3395157 3237950 3089603 2956915 2836283 2720044 2609975
55875 2609975 2511720 2421911 2333586 2248731 2173253 2104807 2037396 1972898 1916500 1865573 1814036
55864 1814036 1762973 1716337 1671267 1623471 1577273 1539479 1507846 1476191 1446425 1424758 1410226
55853 1410226 1397788 1389184 1389889 1398013 1405991 1410511 1411657 1405633 1388250 1363205 1337808 1312750 1284392
55840 1284392 1253993 1225685 1198048 1166701 1133092 1102147 1073334 1042385 1009771 979385 950821
$$ packed form
55911A9618297j347026j223314j125223j034979r46437q74634q21689p68555p08684
55902A0767756o56893o17363n74619n23918m80327m49775m19503l84700l57273
55893F303385l40663l21903k96195k74886k62059k46846k25704k09467k01576
55884C924086j91313j74994j62622j57207j48347j32688j20632j16239j10069
55875B609975r8255q9809q8325q4855p5478o8446o7411o4498n6398n0927n1537
55864A814036n1063m6636m5070m7796m6198l7794l1633l1655k9766k1667j4532
55853A410226j2438q604P05Q124P978M520J146o024j7383k5045k5397k5058k8358
55840A284392l0399k8308k7637l1347l3609l0945k8813l0949l2614l0386k8564
$$ plain form
55829 950821 921014 891631 866958 846201 825477 805560 790104 777892 764321 749048 735075
55818 735075 721982 707155 692035 680057 670030 658547 647230 640506 637709 634445 630442 629075
55806 629075 630242 630592 629856 630400 631353 629565 625465 621925 618432 612303 604347 597182 589420 577799 563772
55791 563772 551552 540807 527798 512765 499625 489078 478397 467503 458987 452528 445346 437803
55779 437803 432737 429823 426535 423986 425486 429508 430296 425639 418334 410062 399754 388250 378658 371356
55765 371356 363780 355677 349626 346224 343640 341880 342418 343599 341613 336214 330540 325265 318064 308861
55751 308861 300311 292682 283512 272852 263850 257505 251678 245887 242190 240582 238280 234464 231288 229416
55737 229416 226945 223477 220989 219922 218553 216905 217139 219500 221907 223909 226861 229750 229338 225192 220334
$$ packed form
55829I50821k9807k9383k4673k0757k0724j9917j5456j2212j3571j5273j3973
55818G35075j3093j4827j5120j1978j0027j1483j1317o724k797l264m003j367
55806F29075J167L50p36N44R53j788m100l540l493o129p956p165p762j1621j4027
55791E63772j2220j0745j3009j5033j3140j0547j0681j0894q516o459p182p543
55779D37803n066k914l288k549J500M022P88m657p305q272j0308j1504r592p302
55765C71356p576q103o051l402k584j760N38J181j986n399n674n275p201r203
55751C08861q550p629r170j0660r002o345n827n791l697j608k302l816l176j872
55737B29416k471l468k488j067j369j648K34K361K407K002K952K889m12m146m858
$$ plain form
55722 220334 216191 211145 204883 199783 196781 193867 189948 186586 184824 183730 183010 183663 185344 186433 187309
55707 187309 190194 195312 200733 206345 214175 224269 234083 242560 250970 259020 264162 265837 266693 268425
55693 268425 269829 269905 269470 268637 266045 261640 257177 253109 248041 241909 236550 232479 228359 224252 222091
55678 222091 222281 223098 224005 226151 229014 230118 228918 227563 227011 225830 223615 222111 221923 221481 220192 219349
55662 219349 219079 217793 215517 214306 214441 213757 211830 211208 213191 215804 217308 218383 219414 218865 215971
55647 215971 212055 207712 201594 193369 185078 178197 171966 165754 160276 155468 150039 144142 139625 136698
55633 136698 133343 128915 125117 122423 119012 114472 111156 110361 110368 109663 108832 107890 105236 100990 98024 97734
55617 97734 97963 96978 96230 97019 97643 96349 94319 93249 92494 91049 89976 90394 91100 90458 88890 87530 86219
$$ packed form
55722B20334m143n046o262n100l002k914l919l362j762j094p20O53J681J089Q76
55707A87309K885N118N421N612P830J0094R814Q477Q410Q050N142J675Q56J732
55693B68425J404P6m35q33k592m405m463m068n068o132n359m071m120m107k161
55678B22091J90Q17R07K146K863J104j200j355n52j181k215j504j88m42j289q43
55662B19349k70j286k276j211J35o84j927o22J983K613J504J075J031n49k894
55647B15971l916m343o118q225q291o881o231o212n478m808n429n897m517k927
55633A36698l355m428l798k694l411m540l316p95Pp05q31r42k654m246k966k90
55617I7734K29r85p48P89O24j294k030j070p55j445j073M18P06o42j568j360j311
$$ plain form
55600 86219 84583 83229 82226 80328 77238 74659 73680 73238 72541 72685 74326 76050 76733 77242 78204 78417
55584 78417 77202 76023 76055 76314 75906 75805 76621 76939 75734 74247 73631 73062 72096 72453 75280 78826 81096
55567 81096 82762 85240 87947 89864 91924 95311 98896 100722 100760 100110 98770 96194 92829 89284 85193
55552 85193 80472 76367 73732 71767 69867 68985 69644 70435 70235 70114 71294 72997 74177 75560 78020 80602
55536 80602 82161 83373 85175 86862 87672 88645 90824 93163 94321 95045 96625 98360 98668 97516 95786
55521 95786 93469 90424 87646 85809 83737 80200 75999 72496 69435 66102 63240 61757 60777 59058 57137
55506 57137 56071 55201 53277 50743 48836 47389 45508 43521 42316 41608 40656 39793 39468 38827 37079 35308
55490 35308 35081 36082 36919 37310 37812 38322 38579 39233 40650 41596 40796 38959 37645 37063 36505 35917 35459 34597
$$ packed form
55600H6219j636j354j003j898l090k579r79m42o97J44J641J724O83N09R62K13
55584G8417j215j179L2K59m08j01Q16L18j205j487o16n69r66L57K827L546K270
55567H1096J666K478K707J917K060L387L585J826L8o50j340k576l365l545m091
55552H5193m721m105k635j965j900q82O59P91k00j21J180J703J180J383K460K582
55536H0602J559J212J802J687Q10R73K179K339J158P24J580J735L08j152j730
55521I5786k317l045k778j837k072l537m201l503l061l333k862j483r80j719j921
55506E7137j066q70j924k534j907j447j881j987j205p08r52q63l25o41j748j771
55490C5308k27J001Q37L91N02N10K57O54J417R46q00j837j314n82n58n88m58q62
$$ plain form
55472 34597 33217 32503 33151 33901 33447 32419 31837 31160 29723 28597 28806 29164 28167 26745 26659 27412 27255 26281
55454 26281 25899 26110 25938 25903 27325 29548 30465 29700 28940 29174 29768 30161 30407 30040 28410 26206 24924 24822
55436 24822 24959 25016 25461 26226 26880 27825 29710 31884 33023 32973 32532 31843 30634 29606 29885 31348 32968
55419 32968 34427 35930 36929 36621 35386 34288 33545 32792 32237 32143 31846 30767 29657 29443 29719 29963 31112
55402 31112 33995 37138 38273 37394 36245 35477 34446 33297 32966 33411 33874 34592 36254 38057 38426 37414
55386 37414 36453 35956 35182 34223 34038 34594 34936 35007 35452 35761 34662 32390 30607 30034 30043 30534 32171 34543
55368 34543 35987 35663 34232 32375 30222 28280 27297 27086 26940 27129 28374 29991 30360 29265 28070 27547
55352 27547 27216 26851 26902 27272 27232 26677 26060 25223 23842 22780 23206 24467 24691 23474 22146 21392 20582 19654
$$ packed form
55472C4597j380p14O48P50m54j028n82o77j437j126K09L58r97j422q6P53j57r74
55454B6281l82K11j72l5J422K223R17p65p60K34N94L93K46l67j630k204j282j02
55436B4822J37N7M45P65O54R45J885K174J139n0m41o89j209j028K79J463J620
55419C2968J459J503R99l08j235j098p43p53n55r4k97j079j110k14K76K44J149
55402C1112K883L143J135q79j149p68j031j149l31M45M63P18J662J803L69j012
55386C7414r61m97p74r59j85N56L42P1M45L09j099k272j783n73RM91J637K372
55368C4543J444l24j431j857k153j942r83k11j46J89J245J617L69j095j195n23
55352B7547l31l65N1L70m0n55o17q37j381j062M26J261K24j217j328p54q10r28
$$ plain form
55334 19654 19659 20927 22385 23195 23651 24117 24446 24691 25100 25303 24773 24014 23943 24261 23937 23038 22463 22147 21327
55315 21327 20385 20462 21291 21384 20419 19545 19229 18852 18557 19376 21211 22679 23371 24273 25569 26053 25332 24648 24807
55296 24807 25082 24845 24604 24776 25039 25478 26697 28212 28450 27023 25447 24901 24887 24777 25066 26229 27752
55279 27752 29117 30506 31899 32713 32907 33200 33720 33772 33324 33287 33865 34123 33727 33636 34430 35304 35306 34353 32681
55260 32681 30613 29164 29358 30557 31046 30572 30636 31855 32931 32875 32387 32230 31999 31435 31292 31932 32525 32574
55242 32574 32752 33361 33542 32985 32849 33915 35281 35997 36540 37473 38015 37340 36103 35392 35081 34469 33677 33230
55224 33230 33021 32747 32729 33358 34365 35368 36424 37415 37751 37316 36890 36993 37144 36827 36312 35961 35672 35528
55206 35528 36007 36990 37548 37260 36758 36533 36286 35911 35923 36417 36758 36785 37022 37299 36611 35063 34381 35630 37774
$$ packed form
55334A9654NJ268J458Q10M56M66L29K45M09K03n30p59p1L18l24q99n75l16q20
55315B1327r42P7Q29R3r65q74l16l77k95Q19J835J468O92R02J296M84p21o84J59
55296B4807K75k37k41J72K63M39J219J515K38j427j576n46j4j10K89J163J523
55279B7752J365J389J393Q14J94K93N20N2m48l7N78K58l96r1P94Q74Kr53j672
55260C2681k068j449J94J199M89m74O4J219J076n6m88j57k31n64j43O40N93M9
55242C2574J78O09J81n57j36J066J366P16N43R33N42o75j237p11l11o12p92m47
55224C3230k09k74j8O29J007J003J056R91L36m35m26J03J51l17n15l51k89j44
55206C5528M79R83N58k88n02k25k47l75J2M94L41K7K37K77o88j548o82J249K144
$$ plain form
55187 37774 39390 40384 41016 40694 39004 36817 35084 33423 31061 28304 26042 24543 23649 23362 23405 23064
55171 23064 22287 22081 23062 24505 25539 26303 27125 27601 27371 26965 27031 27540 28356 29683 31325 32583 33493 35037
55153 35037 37398 39239 39516 38777 37859 36568 34613 32640 31300 30421 29972 30598 32173 33136 32467 31126
55137 31126 30400 30098 29687 29925 31781 34647 37126 38868 40313 41420 42021 42747 44257 46102 47469 48411
55121 48411 49287 49744 49344 48440 47396 45833 43778 42533 43052 44313 44711 44289 44112 44195 43649 42415 41313
55104 41313 40643 40156 40143 41241 43289 45441 47293 49001 50645 52316 54342 56554 57895 57720 56884 56581
55088 56581 56768 56838 57103 58288 60086 61567 62624 63797 65031 65847 66444 67427 68616 69281 69418 69768 70675
55071 70675 71792 72771 73453 73642 73384 73151 73118 72753 71836 71183 71566 72531 73203 73584 74093 74509 74426 74133 73964
$$ packed form
55187C7774J616R94O32l22j690k187j733j661k362k757k262j499q94k87M3l41
55171B3064p77k06R81J443J034P64Q22M76k30m06O6N09Q16J327J642J258R10J544
55153C5037K361J841K77p39r18j291j955j973j340q79m49O26J575R63o69j341
55137C1126p26l02m11K38J856K866K479J742J445J107O01P26J510J845J367R42
55121D8411Q76M57m00r04j044j563k055j245N19J261L98m22j77Q3n46j234j102
55104D1313o70m87j3J098K048K152J852J708J644J671K026K212J341j75q36l03
55088E6581J87P0K65J185J798J481J057J173J234Q16N97R83J189O65J37L50R07
55071G0675J117R79O82J89k58k33l3l65r17o53L83R65O72L81N09M16q3k93j69
$$ plain form
55052 73964 73372 71819 69994 68943 68439 67441 65774 64197 63101 62290 61808 61885 62205 62154 61609 60804 59814 58872
55034 58872 58569 58922 58915 57932 56926 57094 58121 58913 59355 60005 60615 60408 59523 58949 59218 60178 61595 62952
55016 62952 63215 62074 60885 61160 62566 63671 64059 64328 64513 64150 63624 63815 64508 64568 63709 62773 62284 62030
54998 62030 62038 62711 63961 65275 66535 67736 68164 67109 65214 63850 63330 62962 62598 62734 63191 63172 62718 62752
54980 62752 63540 64322 64650 64923 65524 66428 67736 69549 71325 72377 72924 73648 74501 75123 76111 78440 81738
54963 81738 84640 86860 89429 92758 96060 99007 102516 107379 113355 120082 127811 136701 146394 156697
54949 156697 167738 179075 189428 197680 203476 206805 207738 206573 203343 197236 187500 174988 161824
54936 161824 149565 138627 129292 121923 116070 110648 105319 100635 96687 92834 89005 86055 84410 83446
$$ packed form
55052G3964n92j553j825j051n04r98j667j577j096q11m82P7L20n1n45q05r90r42
55034E8872l03L53pr83j006J68J027P92M42O50O10k07q85n74K69R60J417J357
55016F2952K63j141j189K75J406J105L88K69J85l63n26J91O93O0q59r36m89k54
54998F2030QO73J250J314J260J201M28j055j895j364n20l68l64J36M57j9m54L4
54980F2752P88P82L28K73O01R04J308J813J776J052N47P24Q53O22R88K329L298
54963H1738K902K220K569L329L302K947L509M863N976O727P729Q890R693J0303
54949A56697J1041J1337J0353Q252N796L329R33j165l230o107r736j2512j3164
54936A61824j2259j0938r335p369n853n422n329m684l948l853l829k950j645r64
$$ plain form
54922 83446 82625 82216 82512 83236 84147 85450 87260 89406 91961 95220 99083 103280 108274 115043 123863 134093
54906 134093 145107 156449 167229 176479 184064 190105 193593 192977 188315 181512 174145 166310 157849 149277
54892 149277 140950 132616 124350 116888 110449 104342 98225 92732 88324 84559 81088 78368 76745 75689
54878 75689 74526 73196 71874 70651 69996 70608 72319 73929 74578 74501 74133 73394 72324 71428 70795 69706 67708
54861 67708 65437 63831 63131 63006 63028 62708 61741 60501 59680 59291 58752 57986 57510 57373 57046 56508 56337 56446
54843 56446 55927 54518 53133 52464 52172 51928 52184 53287 54804 56266 57652 58712 58850 58196 57789 58111 58468
54826 58468 58426 58726 60070 61976 63604 64803 65641 65850 65539 65576 66403 67323 67722 68213 69644 71740 73627
54809 73627 75109 76563 78157 79983 82479 85908 89842 93823 98159 103542 110350 118763 128998 140903
$$ packed form
54922H3446q21m09K96P24R11J303J810K146K555L259L863M197M994O769Q820J0230
54906A34093J1014J1342J0780R250P585O041L488o16m662o803p367p835q461q572
54892A49277q327q334q266p462o439o107o117n493m408l765l471k720j623j056
54878G5689j163j330j322j223o55O12J711J610O49p7l68p39j070q96o33j089j998
54861F7708k271j606p00j25K2l20r67j240q21l89n39p66m76j37l27n38j71J09
54843E6446n19j409j385o69k92k44K56J103J517J462J386J060J38o54m07L22L57
54826E8468m2L00J344J906J628J199Q38K09l11L7Q27R20L99M91J431K096J887
54809G3627J482J454J594J826K496L429L934L981M336N383O808Q413J0235J1905
$$ plain form
54795 140903 153817 167228 180935 194266 205924 215074 221721 225597 225706 221741 215022 207175 198655
54782 198655 189379 179976 171394 163802 156865 150640 145392 140972 137157 134200 132315 131016 129681 128418
54768 128418 127768 127921 128765 130264 132289 134564 137237 140976 146061 152048 158841 167251 177869 190123
54754 190123 203193 217143 232268 248051 263645 278766 293095 305313 313751 317678 317091 311725
54742 311725 301351 286912 270401 253616 237618 223070 210254 198793 188055 177818 168170 159057
54730 159057 150572 143397 138253 134961 132502 129907 126728 123014 119294 116284 114131 112190 109932 107742
54716 107742 106365 105929 105984 106130 106147 105896 105550 105578 106046 106315 105854 104926 104017 103106 102056 101291 101387 102263 103309
54697 103309 104086 104551 104908 105564 106810 108257 109068 109093 109183 109972 110954 111288 110944 110525 110459 110882 111810 112896 113525
$$ packed form
54795A40903J2914J3411J3707J3331J1658R150O647L876J09l965o719p847q520
54782A98655r276r403q582p592o937o225n248m420l815k957j885j299j335j263
54768A28418o50J53Q44J499K025K275K673L739N085N987O793Q410J0618J2254
54754A90123J3070J3950J5125J5783J5594J5121J4329J2218Q438L927n87n366
54742C11725j0374j4439j6511j6785j5998j4548j2816j1461j0738j0237r648r113
54730A59057q485p175n144l292k459k595l179l714l720l010k153j941k258k190
54716A07742j377m36N5J46J7k51l46K8M68K69m61r28r09r11j050p65R6Q76J046
54697A03309P77M65L57O56J246J447Q11K5R0P89R82L34l44m19o6M23R28J086O29
$$ plain form
54678 113525 113617 113886 114916 116510 118321 120388 122642 124690 126579 129043 132435 136270 140335 145258 151168
54663 151168 156853 161231 164872 168911 173260 177054 180253 183530 186928 189847 192139 194273 196652 199600
54649 199600 203697 209203 215480 221863 228749 237019 246874 258094 270884 285212 299642 312034 321276
54636 321276 327280 329559 327068 319618 308441 295146 280836 266190 251615 237209 223160 210098
54624 210098 198527 188201 178700 170280 163434 157997 153528 150218 148482 147983 148035 148691 150388 152707 154595
54609 154595 155737 156718 157875 159010 160134 161385 162173 161496 159323 156699 154264 151564 148098 144206 140550
54594 140550 137318 134258 130986 127186 122879 118557 114632 110958 107353 104200 101821 99669 97060 94379
54580 94379 92527 91367 89880 87794 85867 84426 82860 80878 79198 78478 78466 78641 78898 79156 79071 78633 78439
$$ packed form
54678A13525R2K69J030J594J811K067K254K048J889K464L392L835M065M923N910
54663A51168N685M378L641M039M349L794L199L277L398K919K292K134K379K948
54649A99600M097N506O277O383O886Q270R855J1220J2790J4328J4430J2392R242
54636C21276O004K279k491p450j1177j3295j4310j4646j4575j4406j4049j3062
54624B10098j1571j0326r501q420o846n437m469l310j736m99N2O56J697K319J888
54609A54595J142R81J157J135J124J251P88o77k173k624k435k700l466l892l656
54594A40550l232l060l272l800m307m322l925l674l605l153k379k152k609k681
54580I4379j852j160j487k086j927j441j566j982j680p20j2J75K57K58q5m38j94
$$ plain form
54563 78439 78907 79725 80401 80811 80943 80677 80134 79722 79476 78926 77869 76797 76226 76175 76656 78081 80629 83631
54545 83631 86212 88332 90709 93762 97104 100146 102887 105889 109593 113952 118796 124271 130572 137391
54531 137391 144121 150559 156805 162397 166304 168089 168362 167566 165118 160444 154199 147606 141119 134653 128617
54516 128617 123631 119405 114993 110181 105717 102137 99150 96216 93067 89720 86637 84745 84525 85139 85243
54501 85243 84557 83864 83555 83124 82204 81183 80569 80437 80701 81353 82245 83178 84236 85579 86971 88068 89070
54484 89070 90464 92233 93979 95652 97436 99059 100059 100629 101446 102706 104078 105482 107036 108364 108869
54469 108869 108693 108454 108124 107207 105983 105362 105349 104875 103524 102264 101954 102138 101961 101372 100729 99935 98769 97527
54451 97527 96678 96195 95729 95174 94641 94111 93404 92355 90990 89696 89070 89175 89173 88276 86891 86167 86525 87382
$$ packed form
54563G8439M68Q18O76M10J32k66n43m12k46n50j057j072n71n1M81J425K548L002
54545H3631K581K120K377L053L342L042K741L002L704M359M844N475O301O819
54531A37391O730O438O246N592L907J785K73p96k448m674o245o593o487o466o036
54516A28617m986m226m412m812m464l580k987k934l149l347l083j892k20O14J04
54501H5243o86o93l09m31r20j021o14j32K64O52Q92R33J058J343J392J097J002
54484H9070J394J769J746J673J784J623J000N70Q17J260J372J404J554J328N05
54469A08869j76k39l30r17j224o21j3m74j351j260l10J84j77n89o43p94j166j242
54451I7527q49m83m66n55n33n30p07j049j365j294o26J05kq97j385p24L58Q57
$$ plain form
54433 87382 88178 88739 88717 87779 86524 86180 87082 88359 89361 90342 91380 91765 91207 90783 91780 94082 96385
54416 96385 97655 97898 97871 98405 99701 101032 101510 101284 101428 102579 104373 106365 108685 111409 114124 116665
54400 116665 119661 123751 128742 133947 138913 143392 147086 149867 151902 153270 153815 153595 152967 152039 150624
54385 150624 148940 147674 146979 146065 144241 141787 139285 136610 133195 128968 124463 120205 116392 113055 110220
54370 110220 107959 106343 105285 104499 103847 103520 103568 103594 103403 103536 104320 104820 103864 101976 101013 101737 102959 103414
54352 103414 103259 103204 103338 103548 104182 105549 107440 109747 112807 116599 120359 123579 126680 130119 133620 136926
54336 136926 140493 144641 148588 151129 151880 151327 150150 148970 148073 146833 144120 139852 135484 132268 129769
54321 129769 126815 123176 119377 115572 111664 108103 105450 103372 100959 97898 94588 91319 88111 85179
$$ packed form
54433H7382P96N61k2r38j255l44R02J277J002R81J038L85n58m24R97K302K303
54416I6385J270K43k7N34J296J331M78k26J44J151J794J992K320K724K715K541
54400A16665K996M090M991N205M966M479L694K781K035J368N45k20o28r28j415
54385A50624j684j266o95r14j824k454k502k675l415m227m505m258l813l337k835
54370A10220k261j616j058p86o52l27M8K6j91J33P84N00r56j888r63P24J222M55
54352A03414j55n5J34K10O34J367J891K307L060L792L760L220L101L439L501L306
54336A36926L567M148L947K541P51n53j177j180q97j240k713m268m368l216k499
54321A29769k954l639l799l805l908l561k653k078k413l061l310l269l208k932
$$ plain form
54307 85179 82795 80811 78992 77707 77546 78257 78635 77621 75214 72418 70540 70282 71162 71969 71957 71274 70192
54290 70192 68636 66871 65830 65951 66242 65340 63232 61153 60031 59759 59850 60100 60544 61262 62255 63305 64132
54273 64132 64884 66096 67875 69542 70435 70592 70344 69879 69636 70404 72226 73819 73928 72874 71917 71560 71394
54256 71394 71309 71715 72600 73320 73503 73423 73380 73365 73468 73953 74794 75588 76083 76353 76419 76178 75819 75867 76617 77758 78644
54235 78644 78776 78057 76854 75821 75491 75973 77029 78207 78881 78539 77331 76050 75309 75001 74733 74463 74397
54218 74397 74575 74825 74923 74603 73732 72679 72108 72195 72455 72457 72248 71899 71247 70374 69692 69238 68547 67605 67177 67680
54198 67680 68466 68839 69057 69569 69935 69438 68289 67361 67067 67293 68069 69436 70917 71924 72525 73119 73567 73384
54180 73384 72581 71651 70895 70356 70168 70338 70442 70209 70077 70497 71054 71079 70762 70787 71081 70887 70012 69087 68601 68480
$$ packed form
54307H5179k384j984j819j285j61P11L78j014k407k796j878k58Q80Q07j2o83j082
54290G0192j556j765j041J21K91r02k108k079j122k72R1K50M44P18R93J050Q27
54273F4132P52J212J779J667Q93J57k48m65k43P68J822J593J09j054r57l57j66
54256G1394q5M06Q85P20J83q0m3j5J03M85Q41P94M95K70O6k41l59M8P50J141Q86
54235G8644J32p19j203j033l30M82J056J178O74l42j208j281p41l08k68k70o6
54218G4397J78K50R8l20q71j053n71Q7K60Kk09l49o52q73o82m54o91r42m28N03
54198F7680P86L73K18N12L66m97j149r28k94K26P76J367J481J007O01N94M48j83
54180G3384q03r30p56n39j88J70J04k33j32M20N57K5l17K5K94j94q75r25m86j21
$$ plain form
54160 68480 68623 69073 69596 69818 69892 70396 71455 72536 73144 73200 72733 71738 70423 69193 68391 68257 68845 69591
54142 69591 69433 68044 66536 66230 67065 68039 68804 69738 70600 70412 68921 67184 66307 66374 66915 67730 68790 69875
54124 69875 70668 70938 70533 69502 68242 67106 66005 64881 64313 64836 65683 65195 62787 59757 57716 56847
54108 56847 56195 55194 54277 54145 54885 55928 56706 57243 57937 58828 59439 59510 59449 59665 59887 59710 59501 60039 61363
54089 61363 62654 63238 63165 62810 62444 62233 62141 61790 60842 59510 58271 57169 55913 54627 53986 54485 55886
54072 55886 57423 58381 58636 58862 59916 61741 63295 63926 64285 65321 66868 68008 68432 68584 68728 68755 68826
54055 68826 69310 70172 71099 72181 73699 75371 76591 77344 78091 78829 79105 78953 78998 79557 80416 81580 83363
54038 83363 85649 87845 89808 92129 95323 99321 103875 108795 113728 118355 122973 128252 134343 140745
$$ packed form
54160F8480J43M50N23K22P4N04J059J081O08N6m67r95j315j230q02j34N88P46
54142F9591j58j389j508l06Q35R74P65R34Q62j88j491j737q77O7N41Q15J060J085
54124F9875P93K70m05j031j260j136j101j124n68N23Q47m88k408l030k041q69
54108E6847o52j001r17j32P40J043P78N37O94Q91O11P1o1K16K22j77k09N38J324
54089F1363J291N84p3l55l66k11r2l51r48j332j239j102j256j286o41M99J401
54072E5886J537R58K55K26J054J825J554O31L59J036J547J140M24J52J44K7P1
54055F8826M84Q62R27J082J518J672J220P53P47P38K76j52M5N59Q59J164J783
54038H3363K286K196J963K321L194L998M554M920M933M627M618N279O091O402
$$ plain form
54024 140745 147038 153076 158506 162881 166314 169324 171977 173958 175549 177664 180711 184105 187128 189542
54010 189542 191254 192155 192536 192910 193148 192505 190776 188733 187031 185268 182550 178587 173932 169460 165737
53995 165737 162659 159677 156601 153900 151870 150003 147870 146063 145272 144880 143687 141850 140734 140813 141109
53980 141109 140901 140536 140066 138500 135213 131162 127870 125938 125075 124829 124698 124272 123762 123766 124239 124507 124583 125360
53962 125360 126903 127686 126457 124068 122528 122813 124411 126450 128435 130178 131812 133694 135906 138123 140271
53947 140271 142840 146197 150049 153863 157289 159994 161866 163755 167139 172430 178250 182945 186197 188666
53933 188666 190739 192257 192833 191884 188964 184697 180673 177803 175405 172558 169674 167938 167808 168938 171120
53918 171120 174406 178628 183498 188902 194472 199332 203031 206346 210446 215546 221053 226732 232969 240068
$$ packed form
54024A40745O293O038N430M375L433L010K653J981J591K115L047L394L023K414
54010A89542J712R01L81L74K38o43j729k043j702j763k718l963m655m472l723
53995A65737l078k982l076k701k030j867k133j807p91l92j193j837j116P9K96
53980A41109k08l65m70j566l287m051l292j932q63k46j31m26n10MM73K68P6P77
53962A25360J543P83j229k389j540K85J598K039J985J743J634J882K212K217K148
53947A40271K569L357L852L814L426K705J872J889L384N291N820M695L252K469
53933A88666K073J518N76r49k920m267m024k870k398k847k884j736j30J130K182
53918A71120L286M222M870N404N570M860L699L315M100N100N507N679O237P099
$$ plain form
53904 240068 247869 255908 263486 269870 274880 278942 282136 283749 283345 281791 280480 279869 279420 278588 277166
53889 277166 274911 271670 267724 263500 259035 254156 248840 242932 235999 228104 220317 213741 208326 203334
53875 203334 198581 194448 190878 187232 183106 178640 174110 169747 165792 162181 158321 153787 149057 144967
53861 144967 141701 138888 136480 134771 133649 132532 131016 129050 126601 123809 121346 119903 119181 118017
53847 118017 115667 112587 109833 108057 107123 106407 105434 104358 103677 103333 102527 100728 98465 96625 95356 94226
53831 94226 93166 92506 92228 91866 91213 90591 90410 90819 91777 93097 94447 95555 96338 96671 96343 95561 95139 95799
53813 95799 97545 100014 102969 106049 108587 110269 111565 112879 113740 113608 113087 113410 114912 116869 118787
53798 118787 121006 123997 127776 132167 137007 141959 146619 150940 155123 159171 162950 166616 170462 174355
$$ packed form
53904B40068P801Q039P578O384N010M062L194J613m04j554j311o11m49q32j422
53889B77166k255l241l946m224m465m879n316n908o933p895p787o576n415m992
53875B03334m753m133l570l646m126m466m530m363l955l611l860m534m730m090
53861A44967l266k813k408j709j122j117j516j966k449k792k463j443p22j164
53847A18017k350l080k754j776r34p16r73j076o81l44q06j799k263j840j269j130
53831I4226j060o60k78l62o53o22j81M09R58J320J350J108P83L33l28p82m22O60
53813I5799J746K469K955L080K538J682J296J314Q61j32n21L23J502J957J918
53798A18787K219K991L779M391M840M952M660M321M183M048L779L666L846L893
$$ plain form
53784 174355 177784 180450 182465 184060 185467 186907 188341 189432 190084 190660 191279 191356 190424 188892 187256 185049
53768 185049 181602 177573 174598 173370 173016 172432 171309 169678 167449 164780 162173 159779 157195 154263 151507
53753 151507 149452 147995 146794 145817 145116 144381 143122 141233 139177 137611 136763 136124 134973 133368 132277
53738 132277 132376 133102 133395 133027 132573 132404 132493 132975 134053 135310 135986 135983 135890 135941 135719 135020 134239 133683 133249 132953
53718 132953 133056 133386 133240 132406 131613 131563 132055 132542 133056 134052 135628 137412 139060 140530 141988 143642 145502
53701 145502 147197 148252 148696 149180 150416 152725 156064 160109 164276 168040 171368 174521 177440 179778 181650
53686 181650 183773 186555 189449 191569 192797 194012 196251 199739 203648 206859 209080 211055 213512 216173
53672 216173 218203 219407 220413 221782 223430 224930 225793 225484 223782 221292 219028 217304 215496 213053 210253
$$ packed form
53784A74355L429K666K015J595J407J440J434J091O52N76O19P7r32j532j636k207
53768A85049l447m029k975j228l54n84j123j631k229k669k607k394k584k932k756
53753A51507k055j457j201r77p01p35j259j889k056j566q48o39j151j605j091
53738A32277R9P26K93l68m54j69Q9M82J078J257O76lr3N1k22o99p81n56m34k96
53718A32953J03L30j46q34p93n0M92M87N14R96J576J784J648J470J458J654J860
53701A45502J695J055M44M84J236K309L339M045M167L764L328L153K919K338J872
53686A81650K123K782K894K120J228J215K239L488L909L211K221J975K457K661
53672B16173K030J204J006J369J648J500Q63l09j702k490k264j724j808k443k800
$$ plain form
53657 210253 207775 206015 205056 204829 205009 205112 204965 204818 204816 204691 204166 203356 202566 201966 201627 201568 201616 201479 201093
53638 201093 200601 199945 198814 197185 195592 194628 194418 194736 195413 196495 198103 200238 202606 204667 206072 207027
53622 207027 208020 209226 210403 211322 212041 212806 213872 215377 217251 219428 222322 226637 232343 238214 242969
53607 242969 246603 250062 253858 257719 261368 264870 268257 271559 275245 279886 285314 290780 296011 301390
53593 301390 307066 312654 317948 323146 328153 332492 336215 340118 344646 349259 353296 356821 360125 363027
53579 363027 365281 367148 369011 370746 372033 372997 374054 375348 376781 378370 380201 382134 383881 385241
53565 385241 386062 386142 385421 384225 383183 383003 384164 386572 389521 392267 394556 396294 397006 396268 394603 393215
53549 393215 392783 393157 394205 396060 398370 400296 401696 403453 406049 408625 410167 410953 412034 413755 415638
$$ packed form
53657B10253k478j760r59k27J80J03j47j47kj25n25q10p90o00l39n9M8j37l86
53638B01093m92o56j131j629j593r64k10L18O77J082J608K135K368K061J405R55
53622B07027R93J206J177R19P19P65J066J505J874K177K894M315N706N871M755
53607B42969L634L459L796L861L649L502L387L302L686M641N428N466N231N379
53593C01390N676N588N294N198N007M339L723L903M528M613M037L525L304K902
53579C63027K254J867J863J735J287R64J057J294J433J589J831J933J747J360
53565C85241Q21Q0p21j196j042j80J161K408K949K746K289J738P12p38j665j388
53549C93215m32L74J048J855K310J926J400J757K596K576J542P86J081J721J883
$$ plain form
53534 415638 417384 419142 420897 422389 423719 425510 428310 432194 436983 442532 448755 455550 462724 469966
53520 469966 477040 484101 491598 499810 508738 518461 529222 541035 553635 566910 580933 595411 609680
53507 609680 623543 637579 652312 667671 683713 701199 720721 741702 763071 784695 807400
53496 807400 831624 856844 882389 908194 934492 961217 988028 1014720 1041360 1068048 1094616
53485 1094616 1120559 1145398 1169248 1192911 1217223 1242292 1267496 1292094 1315764 1338714 1361509
53474 1361509 1384734 1408549 1432403 1455303 1476521 1496196 1515171 1534096 1552727 1570285 1586380
53463 1586380 1601103 1614209 1624952 1633173 1639955 1646499 1652745 1657749 1660984 1662379 1661387 1657166 1649789
53450 1649789 1640366 1629801 1618188 1605443 1591638 1576562 1559869 1541865 1523216 1503669 1482132
$$ packed form
53534D15638J746J758J755J492J330J791K800L884M789N549O223O795P174P242
53520D69966P074P061P497Q212Q928R723J0761J1813J2600J3275J4023J4478J4269
53507F09680J3863J4036J4733J5359J6042J7486J9522K0981K1369K1624K2705
53496H07400K4224K5220K5545K5805K6298K6725K6811K6692K6640K6688K6568
53485A094616K5943K4839K3850K3663K4312K5069K5204K4598K3670K2950K2795
53474A361509K3225K3815K3854K2900K1218J9675J8975J8925J8631J7558J6095
53463A586380J4723J3106J0743Q221O782O544O246N004L235J395r92m221p377
53450A649789r423j0565j1613j2745j3805j5076j6693j8004j8649j9547k1537
$$ plain form
53439 1482132 1458414 1433863 1409738 1385847 1361322 1335870 1309612 1282638 1255504 1229406 1205037
53428 1205037 1181913 1159568 1138719 1120394 1104454 1089902 1076189 1063437 1051810 1041513 1032993
53417 1032993 1026333 1020787 1015694 1011513 1009230 1009079 1010586 1013476 1017742 1023166 1029673 1037920 1048718 1062022
53403 1062022 1077191 1093922 1112168 1131492 1151427 1172307 1194881 1219315 1245407 1273504 1304149
53392 1304149 1336879 1370527 1404879 1441084 1480117 1521659 1564758 1608911 1654202 1700941 1749503
53381 1749503 1800044 1852251 1905690 1960411 2016724 2074486 2133089 2191985 2250624 2308108 2363834
53370 2363834 2418408 2472915 2527099 2579198 2627883 2673357 2716104 2755420 2789988 2819295 2843802
53359 2843802 2864040 2880228 2892581 2901339 2906386 2907120 2902780 2892924 2877807 2858406 2835815 2810460
$$ packed form
53439A482132k3718k4551k4125k3891k4525k5452k6258k6974k7134k6098k4369
53428A205037k3124k2345k0849j8325j5940j4552j3713j2752j1627j0297q520
53417A032993o660n546n093m181k283j51J507K890M266N424O507Q247J0798J3304
53403A062022J5169J6731J8246J9324J9935K0880K2574K4434K6092K8097L0645
53392A304149L2730L3648L4352L6205L9033M1542M3099M4153M5291M6739M8562
53381A749503N0541N2207N3439N4721N6313N7762N8603N8896N8639N7484N5726
53370B363834N4574N4507N4184N2099M8685M5474M2747L9316L4568K9307K4507
53359B843802K0238J6188J2353Q758N047P34m340r856j5117j9401k2591k5355
$$ plain form
53347 2810460 2782069 2750300 2715008 2675845 2632151 2583643 2531021 2475705 2419169 2362579 2306709
53336 2306709 2251917 2198360 2146338 2096201 2047796 2000369 1953262 1906541 1860753 1816227 1772850
53325 1772850 1730413 1689004 1649109 1611384 1576204 1543359 1512327 1482932 1455683 1431336 1410143
53314 1410143 1391475 1374109 1356933 1339547 1322236 1305427 1289309 1274029 1259948 1247449 1236586
53303 1236586 1227186 1219197 1212685 1207556 1203564 1200668 1199162 1199328 1201051 1203802 1207066 1210859 1215711 1221981
53289 1221981 1229316 1237166 1245781 1256182 1268985 1283828 1300197 1318257 1338392 1360467 1384148 1409514
53277 1409514 1436650 1464877 1493129 1520998 1548767 1576407 1603156 1628221 1651415 1672987 1693196
53266 1693196 1712109 1729526 1745060 1758527 1770084 1779709 1786812 1790829 1792071 1791487 1789654 1786411 1781352
$$ packed form
53347B810460k8391l1769l5292l9163m3694m8508n2622n5316n6536n6590n5870
53336B306709n4792n3557n2022n0137m8405m7427m7107m6721m5788m4526m3377
53325A772850m2437m1409l9895l7725l5180l2845l1032k9395k7249k4347k1193
53314A410143j8668j7366j7176j7386j7311j6809j6118j5280j4081j2499j0863
53303A236586r400p989o512n129l992k896j506J66J723K751L264L793M852O270
53289A221981P335P850Q615J0401J2803J4843J6369J8060K0135K2075K3681K5366
53277A409514K7136K8227K8252K7869K7769K7640K6749K5065K3194K1572K0209
53266A693196J8913J7417J5534J3467J1557R625P103M017J242n84j833l243n059
$$ plain form
53253 1781352 1774233 1764975 1753768 1741083 1727180 1711655 1693913 1673881 1651843 1627800 1601672 1573977
53241 1573977 1545628 1517087 1488365 1459745 1431703 1404074 1376130 1347793 1320033 1293726 1268719
53230 1268719 1244351 1220342 1196803 1173822 1151459 1129827 1108903 1088552 1068941 1050463 1033009
53219 1033009 1015783 998215 980717 964116 948637 933934 919963 907262 896213 886318 876478 865940
53207 865940 854710 842958 830337 816404 801670 787490 774459 761514 747266 731845 716625
53196 716625 702452 689015 675853 662987 650421 637924 625620 614015 603051 591841 579689
53185 579689 566793 553545 539904 525891 511986 498346 484228 469037 453579 439425 427210
53174 427210 416322 406156 396797 388343 380356 372416 364724 357673 351144 344611 337822 330964 324282 317904
$$ packed form
53253A781352p119r258j1207j2685j3903j5525j7742k0032k2038k4043k6128k7695
53241A573977k8349k8541k8722k8620k8042k7629k7944k8337k7760k6307k5007
53230A268719k4368k4009k3539k2981k2363k1632k0924k0351j9611j8478j7454
53219A033009j7226j7568j7498j6601j5479j4703j3971j2701j1049r895r840j0538
53207H65940j1230j1752j2621j3933j4734j4180j3031j2945j4248j5421j5220
53196G16625j4173j3437j3162j2866j2566j2497j2304j1605j0964j1210j2152
53185E79689j2896j3248j3641j4013j3905j3640j4118j5191j5458j4154j2215
53174D27210j0888j0166r359q454p987p940p692p051o529o533o789o858o682o378
$$ plain form
53160 317904 312071 307108 302979 299162 295197 291154 287270 283406 279301 275202 271681 268790 265920 262627
53146 262627 259130 255816 252834 250402 248915 248374 248187 247919 247708 247534 246750 245032 243246 242533 242887 243455
53130 243455 243964 244928 246639 248854 251466 254577 257828 260471 262312 263873 265502 266917 267774 268046 267666
53115 267666 266334 263838 260159 255314 249675 244326 240360 237701 235177 231811 227503 222610 217603 213070
53101 213070 209254 205567 201360 197115 193932 191844 189665 186714 183567 180839 178286 175621 173218 171438
53087 171438 170043 168774 167702 166583 164730 162060 159425 157381 155487 153410 151748 151051 150873 150649 150666
53072 150666 151291 151988 152072 151827 151857 151896 151303 150267 149435 148654 147215 145163 143379 142348 141733 141145 140590 140131
53054 140131 139771 139649 139811 139855 139347 138389 137282 135994 134636 134073 135062 136884 137788 136880 134864 132862 131251
$$ packed form
53160C17904n833m963m129l817l965m043l884l864m105m099l521k891k870l293
53146B62627l497l314k982k432j487n41j87k68k11j74p84j718j786p13L54N68
53130B43455N09R64J711K215K612L111L251K643J841J561J629J415Q57K72l80
53115B67666j332k496l679m845n639n349l966k659k524l366m308m893n007m533
53101B13070l816l687m207m245l183k088k179k951l147k728k553k665k403j780
53087A71438j395j269j072j119j853k670k635k044j894k077j662o97j78k24J7
53072A50666O25O97Q4k45L0L9n93j036q32p81j439k052j784j031o15n88n55m59
53054A40131l60j22J62M4n08r58j107j288j358n63R89J822R04r08k016k002j611
$$ plain form
53037 131251 129793 128177 126133 123578 120888 118745 117571 117388 118080 119350 120527 120966 120661 120090 119551 119110
53021 119110 118966 119221 119405 118944 118128 117906 118601 119495 119857 119781 119754 119929 120184 120465 120732 120815 120607 120241 120003 120207
53001 120207 121110 122657 124321 125545 126338 127150 128231 129497 130946 132693 134568 136212 137671 139431 141711
52986 141711 144197 146683 149512 153075 157178 161226 164842 168099 171289 174619 177971 180909 183063 184555
52972 184555 185739 186523 186301 184705 182105 179161 176181 173185 170357 168011 166109 164180 161831 159188 156709
52957 156709 154662 152979 151557 150427 149511 148507 147322 146375 146023 145779 144778 143098 141887 141838 142221 142018
52941 142018 141435 141460 142255 142942 142934 142598 142390 142106 141381 140373 139531 139079 139146 140061 142025 144590 146836 148132
52923 148132 148547 148483 148189 147731 147333 147410 148126 149111 149874 150447 151260 152345 153102 153104 152770 152854 153535 154359 154882 154954
$$ packed form
53037A31251j458j616k044k555k690k143j174j83O92J270J177M39l05n71n39m41
53021A19110j44K55J84m61q16k22O95Q94L62p6k7J75K55K81K67Q3k08l66k38K04
53001A20207R03J547J664J224P93Q12J081J266J449J747J875J644J459J760K280
52986A41711K486K486K829L563M103M048L616L257L190L330L352K938K154J492
52972A84555J184P84k22j596k600k944k980k996k828k346j902j929k349k643k479
52957A56709k047j683j422j130r16j004j185r47l52k44j001j680j211m9L83k03
52941A42018n83K5P95O87ql36k08k84p25j008q42m52O7R15J964K565K246J296
52923A48132M15o4k94m58l98P7P16R85P63N73Q13J085P57Kl34Q4O81Q24N23P2
$$ plain form
52903 154954 154549 153780 153051 152848 153306 154238 155496 157044 158793 160657 162681 164790 166543 167527 167940 168423
52887 168423 169342 170602 172110 173958 176035 177804 178637 178295 177102 175876 175571 176606 178470 180239 181471
52872 181471 182416 183424 184499 185461 186234 186885 187597 188668 190387 192825 195795 198963 202020 204922 208063
52857 208063 211899 216262 220356 223672 226534 229421 232135 234124 235340 236160 236670 236627 236107 235625 235540 235746
52841 235746 235950 235948 235678 235307 235067 234655 233123 229886 225594 221420 217778 214444 211598 209743 208531 206776
52825 206776 203913 200660 197939 195872 194180 192736 191318 189513 187391 185660 184585 183337 181072 178214
52811 178214 175972 174866 174346 173672 172598 171300 170118 169411 169302 169554 169806 169768 169078 167361 164766 162098
52795 162098 160043 158518 157134 155967 155347 155131 154812 154246 153743 153401 152899 152073 151265 150895 150909 150784 149882 147841
$$ packed form
52903A54954m05p69p29k03M58R32J258J548J749J864K024K109J753R84M13M83
52887A68423R19J260J508J848K077J769Q33l42j193j226l05J035J864J769J232
52872A81471R45J008J075R62P73O51P12J071J719K438K970L168L057K902L141
52857B08063L836M363M094L316K862K887K714J989J216Q20N10m3n20m82q5K06
52841B35746K04kk70l71k40m12j532l237m292m174l642l334k846j855j212j755
52825B06776k863l253k721k067j692j444j418j805k122j731j075j248k265k858
52811A78214k242j106n20o74j074j298j182p07j09K52K52l8o90j717k595k668
52795A62098k055j525j384j167o20k16l19n66n03l42n02q26q08l70J4j25r02k041
$$ plain form
52777 147841 144952 142249 140878 141070 141916 142355 142218 142058 142084 141730 140441 138551 136924 135828 134622 132802
52761 132802 130923 130058 130519 131542 132197 132161 131551 130478 129056 127549 126230 125210 124523 124167 123879 123060 121203
52744 121203 118450 115621 113705 113225 113840 114521 114295 112929 110845 108496 106125 104135 103219 103830 105695 108038
52728 108038 110123 111512 112098 112172 112252 112652 113335 114258 115563 117232 118833 119987 120874 121944 123258 124453
52712 124453 125337 126173 127414 129385 132126 135206 137704 138823 138643 138039 137680 137370 136476 134760 132531 130221
52696 130221 128060 126066 124072 121825 119290 116806 114659 112600 110195 107697 106022 105560 105436 104449 102493
52681 102493 100471 98931 97445 95440 93078 90994 89557 88691 88128 87614 87150 87226 88398 90401 92052 92360
52665 92360 91429 89959 88386 86924 85985 85809 85936 85705 85103 84513 83836 82663 81227 80308 80058 79728 78847
$$ packed form
52777A47841k889k703j371J92Q46M39j37j60K6l54j289j890j627j096j206j820
52761A32802j879q65M61J023O55l6o10j073j422j507j319j020o87l56k88q19j857
52744A21203k753k829j916m80O15O81k26j366k084k349k371j990r16O11J865K343
52728A08038K085J389N86P4Q0M00O83R23J305J669J601J154Q87J070J314J195
52712A24453Q84Q36J241J971K741L080K498J119j80o04l59l10q94j716k229k310
52696A30221k161j994j994k247k535k484k147k059k405k498j675m62j24r87j956
52681A02493k022j540j486k005k362k084j437q66n63n14m64P6J172K003J651L08
52665I2360r31j470j573j462r39j76J27k31o02n90o77j173j436r19k50l30q81
$$ plain form
52648 78847 77940 77691 77996 78338 78595 79017 79720 80651 81754 82794 83283 83052 82691 83031 84244 85760 87013
52631 87013 87926 88669 89249 89461 89197 88639 88039 87296 85991 84081 82258 81235 80839 80397 79962 80397 82015
52614 82015 83863 84799 84799 84677 84910 85311 85603 85727 85712 85739 86241 87486 89059 90185 90627 90873 91414 92217 92990
52595 92990 93623 94197 94795 95494 96406 97573 98903 100270 101613 102923 104216 105555 106937 108135 108778 108766
52579 108766 108482 108431 108723 109106 109534 110392 111983 114030 116065 118144 120665 123430 125442 125976 125447 124827 124561
52562 124561 124532 124826 125812 127479 129260 130655 131638 132341 132796 133094 133420 133761 133853 133587 133200 132977 133030 133383 133953
52543 133953 134434 134618 134951 136245 138614 141052 142396 142442 141915 141655 142109 143318 145035 146897 148657 150189
52527 150189 151229 151429 150838 150006 149415 149006 148480 147809 147184 146622 145899 144840 143551 142408 141821 141885 142260 142611
$$ packed form
52648G8847r07k49L05L42K57M22P03R31J103J040M89k31l61L40J213J516J253
52631H7013R13P43N80K12k64n58o00p43j305j910j823j023l96m42m35M35J618
52614H2015J848R36%j22K33M01K92J24j5K7N02J245J573J126M42K46N41Q03P73
52595I2990O33N74N98O99R12J167J330J367J343J310J293J339J382J198O43j2
52579A08766k84n1K92L83M28Q58J591K047K035K079K521K765K012N34n29o20k66
52562A24561k9K94R86J667J781J395R83P03M55K98L26L41R2k66l87k23N3L53N70
52543A33953M81J84L33J294K369K438J344M6n27k60M54J209J717J862J760J532
52527A50189J040K00n91q32n91m09n26o71o25n62p23j059j289j143n87O4L75L51
$$ plain form
52509 142611 143067 143943 145040 145646 145373 144597 143960 143757 143959 144381 144649 144445 144067 144389 145875 147958 149716
52492 149716 150910 151985 153280 154691 156030 157322 158638 159827 160546 160649 160555 161040 162349 163695 164074 163537
52476 163537 163051 163106 163203 162969 162997 163965 165530 166793 167553 168440 169976 172114 174581 177082 179137 180259 180450
52459 180450 180263 180245 180536 181021 181715 182891 184839 187398 189761 191002 190951 190367 190244 191072 192665 194255 194775
52442 194775 193654 191585 189985 189468 189340 188787 187855 186837 185493 183639 181968 181400 181812 182201 181986 181443
52426 181443 180918 180296 179383 178313 177403 176877 176753 176798 176734 176667 177074 178071 179077 179569 179779 180155 180538 180550 180465 180903
52406 180903 181848 182734 183438 184407 185771 187036 187829 188294 188660 188969 189392 190236 191463 192694 193778 194887 195978
52389 195978 196706 196982 197059 196959 196429 195700 195695 197095 199567 202182 204205 205316 205558 205505 206062 207637 209653 211216
$$ packed form
52509A42611M56Q76J097O06k73p76o37k03K02M22K68k04l78L22J486K083J758
52492A49716J194J075J295J411J339J292J316J189P19J03r4M85J309J346L79n37
52476A63537m86N5R7k34K8R68J565J263P60Q87J536K138K467K501K055J122J91
52459A80450j87j8K91M85O94J176J948K559K363J241n1n84j23Q28J593J590N20
52442A94775j121k069j600n17j28n53r32j018j344j854j671n68M12L89k15n43
52426A81443n25o22r13j070r10n26j24M5o4o7M07R97J006M92K10L76L83J2q5M38
52406A80903R45Q86P04R69J364J265P93M65L66L09M23Q44J227J231J084J109J091
52389A95978P28K76P7j00n30p29nJ400K472K615K023J111K42n3N57J575K016J563
$$ plain form
52371 211216 212128 213011 214527 216705 218929 220476 221164 221469 222006 222992 224419 226443 229088 231691 233323 233871
52355 233871 234153 234779 235544 236238 237436 239831 243141 246203 248077 248711 248768 249194 250705 253202 255712 257344
52339 257344 258281 259505 261580 264124 266502 268585 270520 272134 273021 273213 273375 274093 275228 276245 277145 278657
52323 278657 281333 284754 287946 290428 292492 294539 296573 298494 300565 303311 307019 311473 316150 320634
52309 320634 324907 329281 334056 339331 345193 351879 359516 367823 376339 384977 394102 404011 414577 425460
52295 425460 436517 447944 460084 473065 486580 500126 513555 527217 541345 555560 569286
52284 569286 582478 595597 609055 623106 638046 653861 669713 684515 698198 711745 725674
52273 725674 739221 751492 762816 774196 785790 796732 806343 814678 821800 827304 830978 833384 835227
$$ packed form
52371B11216R12Q83J516K178K224J547O88L05N37R86J427K024K645K603J632N48
52355B33871K82O26P65O94J198K395L310L062J874O34N7M26J511K497K510J632
52339B57344R37J224K075K544K378K083J935J614Q87J92J62P18J135J017R00J512
52323B78657K676L421L192K482K064K047K034J921K071K746L708M454M677M484
52309C20634M273M374M775N275N862O686P637Q307Q516Q638R125R909J0566J0883
52295D25460J1057J1427J2140J2981J3515J3546J3429J3662J4128J4215J3726
52284E69286J3192J3119J3458J4051J4940J5815J5852J4802J3683J3547J3929
52273G25674J3547J2271J1324J1380J1594J0942R611Q335P122N504L674K406J843
$$ plain form
52260 835227 836435 836372 834825 832293 829302 825976 822439 819135 816307 813498 810054 806020 802046 798469 795050
52245 795050 791779 789346 788416 788837 790026 791923 795055 799767 805866 812993 821001 829867 839589 850291
52231 850291 862115 874825 887667 899833 911061 921749 932485 943381 953794 962852 970380 977220
52219 977220 984422 992161 999583 1005593 1009589 1011460 1011234 1008946 1004843 999564 993921 988285 982177 974667
52205 974667 965279 954344 942511 930228 917809 905588 893683 881843 869849 857899 846390 835526
52193 835526 825343 815873 807064 798776 791078 784231 778172 772427 766860 762031 758353 755381 752508 749914
52179 749914 748090 746742 745074 743021 741300 740183 738984 736952 733993 730366 726303 722175 718439 715152
52165 715152 711945 708625 705405 702396 699403 696328 693286 690172 686637 682713 678955 675799 673185 670887
$$ packed form
52260H35227J208o3j547k532k991l326l537l304k828k809l444m034l974l577l419
52245G95050l271k433r30M21J189J897L132M712O099P127Q008Q866R722J0702
52231H50291J1824J2710J2842J2166J1228J0688J0736J0896J0413R058P528O840
52219I77220P202P739P422O010L996J871k26k288m103n279n643n636o108p510
52205I74667r388j0935j1833j2283j2419j2221j1905j1840j1994j1950j1509j0864
52193H35526j0183r470q809q288p698o847o059n745n567m829l678k972k873k594
52179G49914j824j348j668k053j721j117j199k032k959l627m063m128l736l287
52165G15152l207l320l220l009k993l075l042l114l535l924l758l156k614k298
$$ plain form
52151 670887 668610 665649 661277 655932 651337 648814 647879 647001 645391 643408 641530 639644 637377 634576 631280
52136 631280 627521 623394 619232 615551 612675 610378 608054 605380 602661 600208 597657 594446 590889 588135
52122 588135 586855 586495 586048 585055 583602 581839 579979 578445 577552 577208 577219 577708 578944 580905 583252 585625
52106 585625 587876 590222 593271 597658 603475 610271 617723 625986 635326 645738 657134 669561 683007
52093 683007 697322 712566 729163 747421 767114 787704 808741 829880 850825 871517 892174
52082 892174 912905 933475 953533 972861 991295 1008693 1025065 1040355 1054034 1065407 1074594 1082711
52070 1082711 1090641 1097917 1103169 1105511 1105238 1103412 1101036 1098365 1094780 1089520 1082612 1074809 1066465 1057080
52056 1057080 1046261 1034690 1023574 1013413 1003725 993824 983469 972995 963237 955206 949390 945335
$$ packed form
52151F70887k277k961m372n345m595k523r35q78j610j983j878j886k267k801l296
52136F31280l759m127m162l681k876k297k324k674k719k453k551l211l557k754
52122E88135j280l60m47r93j453j763j860j534q93l44J1M89J236J961K347K373
52106E85625K251K346L049M387N817O796P452Q263R340J0412J1396J2427J3446
52093F83007J4315J5244J6597J8258J9693K0590K1037K1139K0945K0692K0657
52082H92174K0731K0570K0058J9328J8434J7398J6372J5290J3679J1373R187Q117
52070A082711P930P276N252K342k73j826k376k671l585n260o908p803q344r385
52056A057080j0819j1571j1116j0161r688r901j0355j0474r758q031n816m055
$$ plain form
52044 945335 942174 939478 937435 936352 936306 937216 939003 941678 945372 950203 956125 963033 970943 979768 988977
52029 988977 997909 1006453 1014888 1022970 1029886 1035433 1040605 1046448 1052753 1058446 1062897 1066279 1068870 1070576
52015 1070576 1071097 1070057 1067020 1061730 1054402 1045616 1035979 1025837 1014977 1002546 987775 971043 953700
52002 953700 936529 918895 899855 879526 858746 837850 816551 794781 772892 751087 729280
51991 729280 707482 685811 664218 642680 621591 601522 582633 564645 547149 529550 511147
51980 511147 492004 473436 456809 441926 427424 412737 398753 386303 374972 363931 353207
51969 353207 343467 334963 327349 320306 313720 307267 300396 292929 285420 278714 273291 269123 265956 263409
51955 263409 260844 257514 253261 248897 245540 243473 241879 239763 236845 233521 230329 227637 225560 223991
$$ packed form
52044I45335l161k696k043j083m6R10J787K675L694M831N922O908P910Q825R209
52029I88977Q932Q544Q435Q082O916N547N172N843O305N693M451L382K591J706
52015A070576N21j040l037n290p328q786r637j0142j0860j2431j4771j6732j7343
52002I53700j7171j7634j9040k0329k0780k0896k1299k1770k1889k1805k1807
51991G29280k1798k1671k1593k1538k1089k0069j8889j7988j7496j7599j8403
51980E11147j9143j8568j6627j4883j4502j4687j3984j2450j1331j1041j0724
51969C53207r740q504p614p043o586o453o871p467p509o706n423m168l167k547
51955B63409k565l330m253m364l357k067j594k116k918l324l192k692k077j569
$$ plain form
51941 223991 222833 222233 222244 222288 221513 219873 218309 217524 217138 216423 215333 214204 212924 211149 209095 207401
51925 207401 206254 205248 204011 202486 200629 198391 195979 193765 191924 190427 189256 188225 186833 184747
51911 184747 182317 180173 178472 176979 175696 174843 174340 173812 173057 171989 170286 167714 164851 162864 162420
51896 162420 163130 164087 164541 164155 163125 162101 161560 161257 160710 160006 159578 159295 158536 157263 156268 156117 156473 156775
51878 156775 156963 157119 156887 155872 154390 153324 153183 153619 153900 153720 153430 153510 153960 154421 154877 155832 157536 159443
51860 159443 160843 161820 163052 164817 166687 168189 169264 170080 170862 172011 173975 176811 180111 183415 186529
51845 186529 189421 192027 194073 195023 194537 193162 192140 192067 192182 191501 190241 189382 189176 189019 188661 188509 188621
51828 188621 188321 187201 185767 184753 184292 184083 183881 183596 183294 183279 183770 184463 184901 185309 186452 188546 190915
$$ packed form
51941B23991j158o00J1M4p75j640j564p85l86p15j090j129j280j775k054j694
51925B07401j147j006j237j525j857k238k412k214j841j497j171j031j392k086
51911A84747k430k144j701j493j283q53n03n28p55j068j703k572k863j987m44
51896A62420P10R57M54l86j030j024n41l03n47p04m28k83p59j273r95j51L56L02
51878A56775J88J56k32j015j482j066j41M36K81j80k90Q0M50M61M56R55J704J907
51860A59443J400R77J232J765J870J502J075Q16P82J149J964K836L300L304L114
51845A86529K892K606K046R50m86j375j022p3J15o81j260q59k06j57l58j52J12
51828A88621l00j120j434j014m61k09k02k85l02j5M91O93M38M08J143K094K369
$$ plain form
51811 190915 192865 194306 195297 195646 195252 194339 193103 191665 190526 190425 191387 192456 192659 191817 190216 188163
51795 188163 186125 184668 183838 183160 182535 182554 183527 184885 186022 187058 188218 189105 189371 189569 190483 191899 192875
51778 192875 193079 193111 193522 194172 194652 194780 194567 194130 193803 194023 194927 196241 197581 198804 200058 201575 203374
51761 203374 205163 206701 208219 210246 212998 216266 219902 223986 228391 232637 236365 239625 242605 245552
51747 245552 249104 254055 260501 267677 274957 282373 289730 295949 299973 301940 302796 303129 303015 302649 302301
51732 302301 301827 300899 299728 298981 299044 299868 301351 303269 304997 306013 306691 307925 309869 311694 312675 312853
51716 312853 312440 311322 309643 308270 308022 308667 309219 309159 308822 308583 308185 307164 305626 304192 303185 302254 300884
51699 300884 299070 297217 295633 294382 293537 293127 292851 292247 291281 290446 290116 290088 289949 289625 289408 289722 291083
$$ packed form
51811A90915J950J441R91L49l94r13j236j438j139j01R62J069K03q42j601k053
51795A88163k038j457q30o78o25J9R73J358J137J036J160Q87K66J98R14J416R76
51778A92875K04L2M11O50M80J28k13m37l27K20R04J314J340J223J254J517J799
51761B03374J789J538J518K027K752L268L636M084M405M246L728L260K980K947
51747B45552L552M951O446P176P280P416P357O219M024J967Q56L33j14l66l48
51732C02301m74r28j171p47O3Q24J483J918J728J016O78J234J944J825R81J78
51716C12853m13j118j679j373k48O45N52o0l37k39l98j021j538j434j007r31j370
51699C00884j814j853j584j251q45m10k76o04r66q35l30k8j39l24k17L14J361
$$ plain form
51682 291083 293970 298418 303777 309028 313191 315460 315427 313512 310890 308679 307286 306647 306685 307254 308027 308924
51666 308924 310445 313119 316734 320424 323365 325084 325328 324113 321889 319291 316659 313984 311108 307681
51652 307681 303190 297498 291353 285873 281415 277191 272133 265970 259514 254073 250478 248435 246783 244519
51638 244519 241568 238508 235805 233575 231811 230467 229313 227994 226261 224026 221369 218681 216542 215127
51624 215127 213928 212451 210989 210193 209968 209431 208074 206425 205247 204484 203425 201716 199800 198342 197489
51609 197489 196852 196102 195392 195153 195569 196406 197399 198560 199993 201497 202546 202674 201841 200572 199804 200369 202370
51592 202370 205080 207623 209724 211666 213764 216175 219158 223038 227699 232408 236541 240442 245187 251290
51578 251290 257963 263953 268915 273451 277841 281411 283476 284266 284377 283817 282363 280442 278728 276953 274172
$$ packed form
51682B91083K887M448N359N251M163K269l3j915k622k211j393o39L8N69P73Q97
51666C08924J521K674L615L690K941J719K44j215k224k598k632k675k876l427
51652C07681m491n692o145n480m458m224n058o163o456n441l595k043j652k264
51638B44519k951l060k703k230j764j344j154j319j733k235k657k688k139j415
51624B15127j199j477j462p96k25n37j357j649j178p63j059j709j916j458q53
51609A97489o37p50p10k39M16Q37R93J161J433J504J049J28q33j269p68N65K001
51592B02370K710K543K101J942K098K411K983L880M661M709M133L901M745O103
51578B51290O673N990M962M536M390L570K065P90J11n60j454j921j714j775k781
$$ plain form
51563 274172 270307 266429 263214 260162 256921 254463 253996 255314 257136 258730 260367 262408 264828 267634
51549 267634 271072 275234 279918 284924 290109 295203 299935 304262 308154 311341 313674 315578 317628 319688
51535 319688 320963 320924 319832 318350 317031 316207 315956 316093 316383 316819 317548 318634 320103 321962 323901 325207
51519 325207 325356 324556 323336 321827 319856 317480 314848 311693 307596 302786 298075 293882 289824 285438 280859
51504 280859 276589 272935 269802 266785 263436 259734 256358 254158 253297 253172 253094 252678 251672 250006 248126
51489 248126 246726 245911 245097 244059 243616 244758 247334 250069 251962 253250 254916 257501 260635 263680 266547
51474 266547 269693 273464 277732 282210 286793 291472 296226 301204 306730 312916 319523 326417 333829 341802
51460 341802 349761 357067 363748 370181 376322 381864 386957 392008 396753 400278 402211 403313 404600 406356
$$ packed form
51563B74172l865l878l215l052l241k458m67J318J822J594J637K041K420K806
51549B67634L438M162M684N006N185N094M732M327L892L187K333J904K050K060
51535C19688J275l9j092j482j319q24k51J37K90M36P29J086J469J859J939J306
51519C25207J49q00j220j509j971k376k632l155m097m810m711m193m058m386m579
51504B80859m270l654l133l017l349l702l376k200q61j25p8m16j006j666j880
51489B48126j400q15q14j038m43J142K576K735J893J288J666K585L134L045K867
51474B66547L146L771M268M478M583M679M754M978N526O186O607O894P412P973
51460C41802P959P306O681O433O141N542N093N051M745L525J933J102J287J756
$$ plain form
51446 406356 408239 409912 411244 412238 413133 414326 415886 417315 417981 417603 416208 413886 410836 407366 403532
51431 403532 398880 392889 385662 377990 370681 364009 357848 352149 347060 342541 338028 332782 326645 320360
51417 320360 315074 311579 309946 309565 309436 308792 307733 307074 307401 308506 309913 311571 313651 315939 317952
51402 317952 319526 320945 322561 324545 326773 328617 329110 327875 325663 323425 320994 317315 311906 305416
51388 305416 298651 291732 284448 276871 269323 262117 255579 249908 244829 239720 234342 229113 224448 220159
51374 220159 215755 211033 206125 201211 196489 192266 188803 186084 183832 181686 179362 176827 174353 172222
51360 172222 170386 168627 167053 166092 165848 165781 165168 163785 162003 160353 159157 158402 157872 157382 156904 156442 155879
51343 155879 155129 154393 154100 154514 155490 156553 157233 157409 157452 157923 159061 160681 162523 164437 166262 167950 169925
$$ packed form
51446D06356J883J673J332R94Q95J193J560J429O66l78j395k322l050l470l834
51431D03532m652n991p227p672p309o672o161n699n089m519m513n246o137o285
51417C20360n286l495j633l81j29o44j059o59L27J105J407J658K080K288K013
51402C17952J574J419J616J984K228J844M93j235k212k238k431l679n409o490
51388C05416o765o919p284p577p548p206o538n671n079n109n378n229m665m289
51374B20159m404m722m908m914m722m223l463k719k252k146k324k535k474k131
51360A72222j836j759j574r61k44o7o13j383j782j650j196p55n30m90m78m62n63
51343A55879p50p36k93M14R76J063O80J76M3M71J138J620J842J914J825J688J975
$$ plain form
51326 169925 172786 176436 180035 183140 186308 190127 194258 198086 201805 206050 210821 215539 219831 223507
51312 223507 226044 227051 227075 227019 226809 225538 222863 219312 215231 210510 205457 200877 196942 192958 188591
51297 188591 184450 180976 177660 173912 170013 166638 164023 162054 160613 159420 158034 156417 154972 153747
51283 153747 152284 150561 149293 148785 148235 146772 144571 142343 140342 138534 137179 136487 136133 135656 134990 134126
51267 134126 132863 131500 131079 132136 133769 134838 135593 137100 139384 141288 142118 142388 142811 143408 143850 144008
51251 144008 143900 143577 143172 142657 141594 139645 137294 135475 134486 133836 133233 133024 133468 134144 134473 134405 134257 134101
51233 134101 133641 132578 130954 129229 128056 127810 128294 129061 129923 130930 131939 132576 132683 132509 132377 132405 132618
51216 132618 133029 133507 133806 133963 134476 135806 137718 139364 140133 140245 140350 140678 140935 141050 141454 142309 142896 142418
$$ packed form
51326A69925K861L650L599L105L168L819M131L828L719M245M771M718M292L676
51312B23507K537J007K4n6k10j271k675l551m081m721n053m580l935l984m367
51297A88591m141l474l316l748l899l375k615j969j441j193j386j617j445j225
51283A53747j463j723j268n08n50j463k201k228k001j808j355o92l54m77o66q64
51267A34126j263j363m21J057J633J069P55J507K284J904Q30K70M23N97M42J58
51251A44008j08l23m05n15j063j949k351j819r89o50o03k09M44O76L29o8j48j56
51233A34101m60j063j624j725j173k46M84P67Q62J007J009O37J07j74j32K8K13
51216A32618M11M78K99J57N13J330J912J646P69J12J05L28K57J15M04Q55N87m78
$$ plain form
51198 142418 141214 140484 140793 141551 142069 142375 142706 142903 142822 142751 142951 143201 143279 143451 143977 144574 144931 145327 146098
51179 146098 146926 147340 147610 148277 149066 149186 148662 148467 149119 149978 150219 149783 149013 147996 146778 145735 145151 144708
51161 144708 143882 142749 141868 141420 140878 139692 138009 136468 135388 134384 132869 130836 128990 128132 128473 129546
51145 129546 130638 131317 131644 131961 132423 132862 133129 133379 133805 134349 135016 136222 138255 140501 141949 142578 143476
51128 143476 145273 147267 148587 149506 150806 152296 152907 152152 150687 149393 148484 147558 146080 143748 140830
51113 140830 138190 136612 136008 135602 134844 133846 132980 132443 132264 132388 132661 132906 133095 133314 133672 134328 135407 136733
51095 136733 137927 139039 140669 143060 145413 146733 147164 147782 149105 150496 151183 151235 151208 151316 151344 151139 150799
51078 150799 150485 150277 150176 150118 149983 149702 149336 149058 149050 149356 149879 150613 151819 153712 155932 157669 158453 158626
$$ packed form
51198A42418j204p30L09P58N18L06L31J97q1p1K00K50P8J72N26N97L57L96P71
51179A46098Q28M14K70O67P89J20n24j95O52Q59K41m36p70j017j218j043n84m43
51161A44708q26j133q81m48n42j186j683j541j080j004j515k033j846q58L41J073
51145A29546J092O79L27L17M62M39K67K50M26N44O67J206K033K246J448O29Q98
51128A43476J797J994J320R19J300J490O11p55j465j294r09r26j478k332k918
51113A40830k640j578o04m06p58r98q66n37j79J24K73K45J89K19L58O56J079J326
51095A36733J194J112J630K391K353J320M31O18J323J391O87N2k7J08K8k05l40
51078A50799l14k08j01n8j35k81l66k78qL06N23P34J206J893K220J737P84J73
$$ plain form
51060 158626 158866 159546 160691 162165 163641 164720 165390 166094 167046 167895 168423 169099 170408 171941 172801 172727 172265
51043 172265 172001 172193 173010 174458 176043 177042 177237 177006 176729 176571 176704 177153 177429 176920 175783 174911 174889 175426
51025 175426 175970 176344 176542 176356 175645 174775 174502 175421 177554 180246 182451 183410 183215 182675 182536 182982 183841 185012
51007 185012 186622 188873 191776 195006 198043 200567 202641 204557 206717 209592 213431 217810 221922 225567
50993 225567 229456 234240 239675 245213 251023 257812 265832 274577 283345 291656 299417 307183 316090 326939
50979 326939 339488 353067 367589 383443 400746 419520 440385 464244 491269 521014 553566
50968 553566 589809 630354 674874 722740 773712 827792 884945 945188 1008451 1074033 1140517
50957 1140517 1206377 1270454 1331861 1389779 1443252 1490872 1530894 1562261 1585368 1601180 1609805
$$ packed form
51060A58626K40O80J145J474J476J079O70P04R52Q49N28O76J309J533Q60p4m62
51043A72265k64J92Q17J448J585R99J95k31k77j58J33M49K76n09j137q72k2N37
51025A75426N44L74J98j86p11q70k73R19K133K692K205R59j95n40j39M46Q59J171
51007A85012J610K251K903L230L037K524K074J916K160K875L839M379M112L645
50993B25567L889M784N435N538N810O789Q020Q745Q768Q311P761P766Q907J0849
50979C26939J2549J3579J4522J5854J7303J8774K0865K3859K7025K9745L2552
50968E53566L6243M0545M4520M7866N0972N4080N7153O0243O3263O5582O6484
50957A140517O5860O4077O1407N7918N3473M7620M0022L1367K3107J5812Q625
$$ plain form
50946 1609805 1610673 1604010 1591176 1573460 1551580 1526682 1500845 1475875 1452201 1429540 1408104 1388498
50934 1388498 1370674 1353564 1335765 1316362 1295253 1272806 1249093 1223450 1195032 1163674 1129855
50923 1129855 1093937 1055976 1016284 975538 934262 892752 851575 811559 773146 736318 701282
50912 701282 668692 639081 612603 589358 569233 551363 534551 518536 504210 492375 482992 475749
50900 475749 470426 466342 462409 458370 455213 453747 453436 453262 453057 453278 454080 455409 457509 460485 463659
50885 463659 466089 467612 468826 470337 472544 475830 480255 485193 489938 494632 500148 507095 515295 524119
50871 524119 533017 541885 551216 561770 573915 587580 602944 620575 640559 662129 684749 709175
50859 709175 736811 768453 804280 844717 890475 941910 999172 1063060 1135035 1216184 1306602
$$ packed form
50946A609805Q68o663j2834j7716k1880k4898k5837k4970k3674k2661k1436j9606
50934A388498j7824j7110j7799j9403k1109k2447k3713k5643k8418l1358l3819
50923A129855l5918l7961l9692m0746m1276m1510m1177m0016l8413l6828l5036
50912G01282l2590k9611k6478k3245k0125j7870j6812j6015j4326j1835r383p243
50900D75749n323m084l933m039l157j466l11j74k05K21Q02J329K100K976L174
50885D63659K430J523J214J511K207L286M425M938M745M694N516O947Q200Q824
50871E24119Q898Q868R331J0554J2145J3665J5364J7631J9984K1570K2620K4426
50859G09175K7636L1642L5827M0437M5758N1435N7262O3888P1975Q1149R0418
$$ plain form
50848 1306602 1405903 1513893 1630522 1755436 1887837 2026762 2171481 2321367 2474944 2628859
50838 2628859 2778153 2917856 3044056 3153418 3242558 3308850 3351793 3372874 3374021 3356639 3322153
50827 3322153 3272921 3212270 3143882 3071491 2999073 2930862 2870403 2819164 2776276 2739931 2708783
50816 2708783 2681541 2655724 2627951 2595580 2557196 2511491 2456913 2393007 2321001 2242303 2157277
50805 2157277 2066331 1971227 1874198 1776422 1678677 1583027 1492410 1408470 1331014 1259721 1195246
50794 1195246 1138228 1088162 1043901 1004858 971312 943883 922891 907945 897970 891792 888684 888207
50782 888207 889854 893250 898467 905464 913303 920456 925907 929508 931311 931219 929374 926313 922426 917563 911345
50767 911345 903686 894953 885732 876305 866280 855014 842647 830287 818780 807840 797033 787209
$$ packed form
50848A306602R9301J07990J16629J24914J32401J38925J44719J49886J53577J53915
50838B628859J49294J39703J26200J09362Q9140O6292M2943K1081J147j7382l4486
50827C322153m9232o0651o8388p2391p2418o8211o0459n1239m2888l6345l1148
50816B708783k7242k5817k7773l2371l8384m5705n4578o3906p2006p8698q5026
50805B157277r0946r5104r7029r7776r7745r5650r0617q3940p7456p1293o4475
50794A195246n7018n0066m4261l9043l3546k7429k0992j4946r975o178l108m77
50782H88207J647L396N217O997P839P153N451L601J803r2j845l061l887m863o218
50767I11345p659q733r221r427j0025j1266j2367j2360j1507j0940j0807r824
$$ plain form
50755 787209 780020 776151 774898 775505 778109 783158 790687 800452 812230 825730 840715 857443 876470
50742 876470 897780 920636 944632 970532 999751 1033246 1071200 1113543 1160525 1212890 1271614
50731 1271614 1337383 1410322 1490258 1576937 1669585 1766326 1864519 1961737 2056214 2146460 2230835
50720 2230835 2307421 2373852 2427274 2464972 2485291 2487883 2473277 2442746 2398558 2343871 2282091
50709 2282091 2216495 2150245 2086230 2026686 1973072 1926158 1885929 1851711 1822879 1799263 1780358
50698 1780358 1764307 1748309 1729943 1707512 1679405 1644231 1601872 1553607 1500823 1444255 1384845
50687 1384845 1324617 1266088 1211004 1159957 1112881 1069659 1030571 996359 967596 943953 924540
50676 924540 909088 898220 892382 891143 893945 900955 912727 929413 950761 976434 1005765 1037519
$$ packed form
50755G87209p189l869j253O07K604N049P529R765J1778J3500J4985J6728J9027
50742H76470K1310K2856K3996K5900K9219L3495L7954M2343M6982N2365N8724
50731A271614O5769P2939P9936Q6679R2648R6741R8193R7218R4477R0246Q4375
50720B230835P6586O6431N3422L7698K0319K592j4606l0531m4188n4687o1780
50709B282091o5596o6250o4015n9544n3614m6914m0229l4218k8832k3616j8905
50698A780358j6051j5998j8366k2431k8107l5174m2359m8265n2784n6568n9410
50687A384845o0228n8529n5084n1047m7076m3222l9088l4212k8763k3643j9413
50676I24540j5452j0868n838j239K802P010J1772J6686K1348K5673K9331L1754
$$ plain form
50664 1037519 1070432 1103843 1137387 1170358 1201927 1231832 1260300 1287235 1312057 1334556 1355524
50653 1355524 1376203 1397159 1417875 1437498 1455859 1473681 1491838 1510705 1530388 1551317 1574148
50642 1574148 1599094 1625705 1653356 1681738 1710936 1741499 1774403 1810383 1848967 1888469 1927219
50631 1927219 1964591 2000661 2035188 2067178 2095249 2118173 2135252 2146439 2152098 2152614 2148360 2140055
50619 2140055 2128949 2116598 2104621 2094628 2088040 2085839 2088611 2096661 2109709 2126474 2145115 2164311
50607 2164311 2183627 2202701 2220487 2235524 2246614 2253061 2254458 2250372 2239907 2221499 2193553 2155622
50595 2155622 2108701 2054317 1993705 1928001 1858687 1787337 1715146 1643015 1571923 1502946 1437009
50584 1437009 1374703 1316155 1261115 1209532 1162079 1119530 1081551 1046799 1014590 985712 961054
$$ packed form
50664A037519L2913L3411L3544L2971L1569K9905K8468K6935K4822K2499K0968
50653A355524K0679K0956K0716J9623J8361J7822J8157J8867J9683K0929K2831
50642A574148K4946K6611K7651K8382K9198L0563L2904L5980L8584L9502L8750
50631A927219L7372L6070L4527L1990K8071K2924J7079J1187N659N16m254q305
50619B140055j1106j2351j1977r993o588k201K772Q050J3048J6765J8641J9196
50607B164311J9316J9074J7786J5037J1090O447J397m086j0465j8408k7946l7931
50595B155622m6921n4384o0612o5704o9314p1350p2191p2131p1092o8977o5937
50584A437009o2306n8548n5040n1583m7453m2549l7979l4752l2209k8878k4658
$$ plain form
50573 961054 940103 921613 905317 892035 882257 875550 871383 869732 870629 873860 879438 887815 899205
50560 899205 913044 928516 945385 964069 985090 1008724 1034935 1063403 1093781 1126296 1161905
50549 1161905 1201513 1244965 1291095 1338788 1387701 1437842 1488784 1539648 1589661 1638369 1685419
50538 1685419 1730691 1774838 1819274 1865192 1912743 1961515 2011547 2063399 2117327 2173024 2230370
50527 2230370 2289951 2352601 2418794 2488783 2563025 2641948 2725253 2811737 2899872 2988422 3076465
50516 3076465 3162920 3246155 3324127 3394798 3456305 3506653 3543611 3565299 3570938 3560795 3535465
50505 3535465 3495512 3441852 3376063 3300051 3215601 3124560 3029508 2934133 2842844 2759731 2687585
50494 2687585 2627779 2581054 2548178 2529645 2524992 2532821 2551438 2578984 2612942 2649918 2686045 2717399
$$ packed form
50573I61054k0951j8490j6296j3282r778o707m167j651Q97L231N578Q377J1390
50560H99205J3839J5472J6869J8684K1021K3634K6211K8468L0378L2515L5609
50549A161905L9608M3452M6130M7693M8913N0141N0942N0864N0013M8708M7050
50538A685419M5272M4147M4436M5918M7551M8772N0032N1852N3928N5697N7346
50527B230370N9581O2650O6193O9989P4242P8923Q3305Q6484Q8135Q8550Q8043
50516C076465Q6455Q3235P7972P0671O1507N0348L6958K1688N639j0143k5330
50505C535465l9953n3660o5789p6012q4450r1041r5052r5375r1289q3113p2146
50494B687585n9806m6725l2876j8533m653P829J8617K7546L3958L6976L6127L1354
$$ plain form
50482 2717399 2740123 2750747 2746609 2725745 2686583 2628517 2553106 2464168 2366196 2262815 2156667
50471 2156667 2049923 1944275 1840864 1740888 1646090 1558096 1477414 1403582 1336171 1275103 1220090
50460 1220090 1170457 1125772 1086233 1052133 1023214 998784 978287 961505 948301 938397 931467 927291
50448 927291 925731 926622 929826 935362 943306 953478 965367 978580 993310 1010164 1029540 1051283 1074887
50435 1074887 1099857 1125877 1152884 1181025 1210506 1241468 1274041 1308259 1343745 1379660 1415240
50424 1415240 1450240 1484688 1518488 1551574 1584101 1615948 1646354 1674724 1701643 1728403 1755696
50413 1755696 1783643 1813030 1845310 1881001 1919045 1958310 1998833 2040884 2083536 2125160 2164925
50402 2164925 2202953 2239168 2272796 2302911 2328750 2349435 2363940 2371414 2371218 2362717 2345376 2318950
$$ packed form
50482B717399K2724J0624m138k0864l9162n8066p5411q8938r7972j03381j06148
50471B156667j06744j05648j03411r9976r4798q7994q0682p3832o7411o1068n5013
50460A220090m9633m4685l9539l4100k8919k4430k0497j6782j3204r904o930m176
50448I27291j560Q91L204N536P944J0172J1889J3213J4730J6854J9376K1743K3604
50435A074887K4970K6020K7007K8141K9481L0962L2573L4218L5486L5915L5580
50424A415240L5000L4448L3800L3086L2527L1847L0406K8370K6919K6760K7293
50413A755696K7947K9387L2280L5691L8044L9265M0523M2051M2652M1624L9765
50402B164925L8028L6215L3628L0115K5839K0685J4505P474j96q501j7341k6426
$$ plain form
50390 2318950 2283210 2237666 2182136 2117620 2046243 1970320 1891804 1812510 1734379 1659310 1588976
50379 1588976 1524777 1467747 1418560 1377837 1346287 1324198 1310876 1305045 1305888 1313313 1327026 1345494
50367 1345494 1365923 1385166 1400697 1410960 1414996 1411887 1400767 1381408 1354589 1321742 1284370 1243827
50355 1243827 1201316 1157806 1114065 1070980 1029590 990561 953833 919077 886363 856100 828487
50344 828487 803350 780444 759660 740990 724453 710011 697440 686396 676732 668607 662223 657741
50332 657741 655487 655808 658500 662772 668065 674471 682087 690492 699370 709118 720163 732052 744021 756271
50318 756271 769876 785425 802503 820588 839630 859537 879819 900204 921157 943294 966494
50307 966494 989852 1012308 1033087 1051875 1068904 1084782 1099846 1113629 1125057 1133179 1137707 1138998
$$ packed form
50390B318950l5740m5544n5530o4516p1377p5923p8516p9294p8131p5069p0334
50379A588976o4199n7030m9187m0723l1550k2089j3322n831Q43P425J3713J8468
50367A345494K0429J9243J5531J0263M036l109j1120j9359k6819l2847l7372m0543
50355A243827m2511m3510m3741m3085m1390l9029l6728l4756l2714l0263k7613
50344H28487k5137k2906k0784j8670j6537j4442j2571j1044r664q125o384m482
50332F57741k254L21K692M272N293O406P616Q405Q878R748J1045J1889J1969J2250
50318G56271J3605J5549J7078J8085J9042J9907K0282K0385K0953K2137K3200
50307I66494K3358K2456K0779J8788J7029J5878J5064J3783J1428Q122M528J291
$$ plain form
50295 1138998 1137695 1134425 1129664 1123677 1116412 1107589 1097132 1085542 1073517 1061084 1047417 1031736
50283 1031736 1014143 995317 975670 955171 933877 912239 890849 870139 850253 831043 812214
50272 812214 793614 775269 757107 738931 720872 703612 687821 673643 660927 649664 639788 630927
50260 630927 622861 615925 610426 605854 601353 596906 593413 591496 590842 590779 590979 591335 591827 592821 595042 598740
50244 598740 603049 606581 608644 609681 610571 611679 612608 612781 612096 610919 609508 607686 605187 602046 598480
50229 598480 594655 590835 587436 584502 581339 577200 572263 567515 563634 560404 557236 553903 550715 548318
50215 548318 547357 547962 549523 551289 553221 555913 559580 563537 566891 569473 571859 574658 577918 581200 584077
50200 584077 586501 588595 590144 590653 590119 589399 589359 589828 589864 588961 587518 586177 585179 584483 584082 583976 584055 584106
$$ packed form
50295A138998j303l270m761n987p265q823j0457j1590j2025j2433j3667j5681
50283A031736j7593j8826j9647k0499k1294k1638k1390k0710j9886j9210j8829
50272H12214j8600j8345j8162j8176j8059j7260j5791j4178j2716j1263r876q861
50260F30927q066o936n499m572m501m447l493j917o54o3K00L56M92R94K221L698
50244E98740M309L532K063J037Q90J108R29J73o85j177j411j822k499l141l566
50229E98480l825l820l399k934l163m139m937m748l881l230l168l333l188k397
50215E48318r61O05J561J766J932K692L667L957L354K582K386K799L260L282K877
50200E84077K424K094J549N09n34p20m0M69L6r03j443j341r98o96m01j06P9N1
$$ plain form
50182 584106 583730 582262 579029 573793 566831 558708 550216 542350 535845 530677 526340 522649 519916 518365
50168 518365 517728 517600 517945 519113 521445 524818 528519 531655 533782 534846 534415 531538 525874 518547 511236
50153 511236 504621 498310 492013 485989 480428 475270 470782 467559 465645 464250 462551 460301 457593 454627
50139 454627 451942 450243 449715 449924 450496 451352 452209 452658 453050 454488 457421 460847 463513 465432 467598 470668
50123 470668 474593 479249 484664 490572 496311 501346 505670 509698 513845 518093 521830 524306 525385 525580
50109 525580 525294 524438 523085 521988 521928 522770 523667 524090 524213 524325 524353 524123 523793 523779 524312 525175 525991 526856 528566
50090 528566 531991 537187 543323 549556 555740 562243 569346 577019 585090 593478 602284 611709 621825 632548
50076 632548 643944 656332 669720 683345 696343 708868 721962 736230 751119 765649 779293
$$ packed form
50182E84106l76j468l233n236o962q123q492p866o505n168m337l691k733j551
50168E18365o37j28L45J168K332L373L701L136K127J064m31k877n664p327p311
50153E11236o615o311o297o024n561n158m488l223j914j395j699k250k708k966
50139D54627k685j699n28K09N72Q56Q57M49L92J438K933L426K666J919K166L070
50123D70668L925M656N415N908N739N035M324M028M147M248L737K476J079J95
50109E25580k86q56j353j097o0Q42Q97M23J23J12K8k30l30j4N33Q63Q16Q65J710
50090E28566L425N196O136O233O184O503P103P673Q071Q388Q806R425J0116J0723
50076F32548J1396J2388J3388J3625J2998J2525J3094J4268J4889J4530J3644
$$ plain form
50065 779293 791897 803356 813749 823404 832387 840236 846594 851840 856802 862007 867418 872683 877419
50052 877419 881533 885488 889945 894933 899647 903316 905922 907845 909182 909756 909590 909017 908488 908420 908951 909702
50036 909702 910161 910535 911881 915126 920339 927272 936170 947655 962122 979650 1000256 1023852 1050260
50023 1050260 1079555 1111946 1146740 1181717 1214079 1241943 1264594 1281755 1293432 1300476 1304658 1307892
50011 1307892 1311613 1316756 1323888 1333093 1343816 1354732 1363743 1368418 1366906 1358424 1342779 1319828 1289764
49998 1289764 1253665 1213286 1170312 1126092 1081810 1038423 996489 956460 919010 884694 853336
49987 853336 824185 796678 770688 746180 723078 701573 682115 664988 650039 636799 624597
49976 624597 612757 601118 590402 581607 574865 569191 563546 557891 552949 549127 545961 542663 538993
$$ packed form
50065G79293J2604J1459J0393R655Q983P849O358N246M962N205N411N265M736
50052H77419M114L955M457M988M714L669K606J923J337N74j66n73n29o8N31P51
50036I09702M59L74J346L245N213O933Q898J1485J4467J7528K0606K3596K6408
50023A050260K9295L2391L4794L4977L2362K7864K2651J7161J1677P044M182L234
50011A307892L721N143P132R205J0723J0916R011M675j512q482j5645k2951l0064
49998A289764l6099m0379m2974m4220m4282m3387m1934m0029l7450l4316l1358
49987H53336k9151k7507k5990k4508k3102k1505j9458j7127j4949j3240j2202
49976F24597j1840j1639j0716q795o742n674n645n655m942l822l166l298l670
$$ plain form
49963 538993 535396 532274 529372 526165 522715 519739 517780 516622 515662 514471 512793 510392 507287 503944
49949 503944 500899 498308 496051 494051 492276 490669 489341 488627 488688 489302 490297 491914 494469 497884 501863
49934 501863 506255 510934 515673 520529 526102 532909 540733 549092 558137 568449 580003 591939 603635
49921 603635 615574 628879 644145 660907 678337 696540 717038 741648 770823 803522 838972
49910 838972 878066 922574 973301 1029412 1089135 1150458 1211307 1269764 1324364 1374026 1417975
49899 1417975 1456170 1489655 1519978 1548283 1575219 1601481 1627850 1654648 1681425 1706948 1729103
49888 1729103 1745138 1752695 1750709 1739066 1717697 1686581 1646514 1599262 1546908 1491359 1434214 1376472
49876 1376472 1318410 1260258 1202847 1147149 1093495 1041964 993252 948260 906880 868116 831509
$$ packed form
49963E38993l597l122k902l207l450k976j959j158r60j191j678k401l105l343
49949E03944l045k591k257k000j775j607j328p14O1O14R95J617K555L415L979
49934E01863M392M679M739M856N573O807P824Q359R045J0312J1554J1936J1696
49921F03635J1939J3305J5266J6762J7430J8203K0498K4610K9175L2699L5450
49910H38972L9094M4508N0727N6111N9723O1323O0849N8457N4600M9662M3949
49899A417975L8195L3485L0323K8305K6936K6262K6369K6798K6777K5523K2155
49888A729103J6035P557j986j1643k1369l1116m0067m7252n2354n5549n7145n7742
49876A376472n8062n8152n7411n5698n3654n1531m8712m4992m1380l8764l6607
$$ plain form
49865 831509 797554 766613 738375 712672 689900 670095 652359 635809 620566 607293 596216
49854 596216 587036 579305 572367 565327 557688 549787 542245 535210 528402 521582 514624 507416 500022 492651
49840 492651 485271 477636 469980 463150 457599 452719 447733 442852 438908 436108 433873 431822 430180 429093
49826 429093 428187 427073 425805 424565 423314 422150 421724 422781 425286 428345 431106 433493 435906 438499 441083
49811 441083 443659 446603 450203 454340 458844 463883 469667 475898 481932 487459 492868 498927 506206 514641
49797 514641 523529 532240 541211 551973 565781 582492 601219 621829 645111 671644 701270 733826
49785 733826 769688 809194 851899 896515 941147 983479 1021266 1053094 1078566 1097846 1111533
49774 1111533 1121034 1128460 1135736 1144021 1153899 1165464 1177875 1189360 1198110 1202835 1202170 1194131 1176889
$$ packed form
49865H31509l3955l0941k8238k5703k2772j9805j7736j6550j5243j3273j1077
49854E96216r180p731o938p040p639p901p542p035o808o820o958p208p394p371
49840D92651p380p635p656o830n551m880m986m881l944k800k235k051j642j087
49826D29093r06j114j268j240j251j164m26J057K505L059K761K387K413K593K584
49811D41083K576K944L600M137M504N039N784O231O034N527N409O059P279Q435
49797E14641Q888Q711Q971J0762J3808J6711J8727K0610K3282K6533K9626L2556
49785G33826L5862L9506M2705M4616M4632M2332L7787L1828K5472J9280J3687
49774A111533R501P426P276Q285R878J1565J2411J1485Q750M725o65q039j7242
$$ plain form
49761 1176889 1150080 1115072 1074073 1029159 981883 933388 884799 837551 793185 752866 717210
49750 717210 686448 660256 637491 616782 597665 580718 566424 554512 544612 536820 531100 526636
49738 526636 522377 517926 513466 509208 505402 502505 500753 499712 498726 497572 496349 495061 493745 492689
49724 492689 491994 491207 489889 488252 486728 485264 483652 482217 481410 480902 479849 478034 476039 474338 472962
49709 472962 472055 471998 472740 473715 474651 475883 477577 479234 480269 480662 480734 480707 480772 481225 482115 483069 483773 484386 485226
49690 485226 486285 487307 488162 488887 489566 490369 491478 492773 493874 494701 495744 497427 499414 500927 501582 501595
49674 501595 501285 500829 500489 500651 501448 502616 503915 505424 507248 509105 510500 511300 511977 513232 515447 518450
49658 518450 521668 524455 526424 527609 528337 528947 529626 530419 531284 532080 532603 532708 532332 531398 529909 528201 526897
$$ packed form
49761A176889k6809l5008m0999m4914m7276m8495m8589m7248m4366m0319l5656
49750G17210l0762k6192k2765k0709j9117j6947j4294j1912r900p792n720m464
49738E26636m259m451m460m258l806k897j752j041r86j154j223j288j316j056
49724D92689o95p87j318j637j524j464j612j435q07n08j053j815j995j701j376
49709D72962r07n7P42R75R36J232J694J657J035L93P2k7O5M53Q90R54P04O13Q40
49690D85226J059J022Q55P25O79Q03J109J295J101Q27J043J683J987J513O55J3
49674E01595l10m56l40J62P97J168J299J509J824J857J395Q00O77J255K215L003
49658E18450L218K787J969J185P28O10O79P93Q65P96N23J05l76r34j489j708j304
$$ plain form
49641 526897 526378 526475 526851 527491 528451 529302 529413 528875 528647 529492 531180 533030 534887 537046 539409 541265 542071
$$ packed form
49641E26897n19R7L76O40R60Q51J11n38k28Q45J688J850J857K159K363J856Q06
$$ [...]
##END NTUPLES=NMR SPECTRUM
##END=
