
##TITLE=AC1238_CCAAH12093_6610292_HVyUi4M1H8
##JCAMPDX= 6.0         $$ Bruker NMR JCAMP-DX V2.0
##DATA TYPE= NMR SPECTRUM
##DATA CLASS= NTUPLES
##ORIGIN= BRUKER
##OWNER= Administrator
$$ 1.72 TOPSPIN		Version 2.1
$$ 2012-08-02 12:20:15.578 -0500  Administrator@TOPSPIN
$$ Compression mode = diff/dup
##.OBSERVE FREQUENCY= 400.02188249412
##.OBSERVE NUCLEUS= ^1H
##.ACQUISITION MODE= SIMULTANEOUS (DQD)
##.ACQUISITION SCHEME= undefined
##.AVERAGES= 8
##.DIGITISER RES= 22
##SPECTROMETER/DATA SYSTEM= spect
##.PULSE SEQUENCE= zg30
##.SOLVENT NAME= COFFEE_meoh
##.SHIFT REFERENCE= INTERNAL, COFFEE_meoh, 1, 14.98509
##AUDIT TRAIL= $$ (NUMBER, WHEN, WHO, WHERE, PROCESS, VERSION, WHAT)
$$ ##TITLE= Audit trail, TOPSPIN		Version 2.1
$$ ##JCAMPDX= 5.01
$$ ##ORIGIN= Bruker BioSpin GmbH
$$ ##OWNER= Administrator
$$ $$ C:\Bruker\TOPSPIN/data/COFFEE/nmr/AC1238_CCAAH12093_6610292_HVyUi4M1H8/10/pdata/1/auditp.txt
$$ ##AUDIT TRAIL=  $$ (NUMBER, WHEN, WHO, WHERE, PROCESS, VERSION, WHAT)
(   1,<2012-08-02 12:20:07.453 -0500>,<Administrator>,<TOPSPIN>,<go>,<TOPSPIN 2.1>,
      <created by zg
	started at 2012-08-02 12:19:00.718 -0500,
	POWCHK enabled, PULCHK disabled,
       configuration hash MD5:
       6B 1B 68 BB D9 2E 58 E2 7F 35 AD 54 07 DF 0E 41
       data hash MD5: 64K
       7F 26 E7 82 96 E7 91 FE CA C9 FE 5D 11 40 23 B6>)
(   2,<2012-08-02 12:20:10.562 -0500>,<Administrator>,<TOPSPIN>,<proc1d>,<TOPSPIN 2.1>,
      <Start of raw data processing
       efp LB = 0 FT_mod = 6 PKNL = 1 PHC0 = 0 PHC1 = 0 SI = 32K 
       data hash MD5: 32K
       28 50 BC 27 16 58 FA F2 AD AB 36 51 CC 21 56 36>)
(   3,<2012-08-02 12:20:10.921 -0500>,<Administrator>,<TOPSPIN>,<proc1d>,<TOPSPIN 2.1>,
      <pk PHC0 = 177.9346 PHC1 = 0 
       data hash MD5: 32K
       4E 4D E4 60 E3 9B 98 FE 28 0D 55 8D A9 2C BA E3>)
(   4,<2012-08-02 12:20:11.000 -0500>,<Administrator>,<TOPSPIN>,<proc1d>,<TOPSPIN 2.1>,
      <abs ABSG = 1 
       data hash MD5: 32K
       31 64 A9 00 56 2C 89 52 41 80 69 F3 A1 46 37 55>)
(   5,<2012-08-02 12:20:11.046 -0500>,<Administrator>,<TOPSPIN>,<proc1d>,<TOPSPIN 2.1>,
      <abs ABSG = 2 
       data hash MD5: 32K
       40 BF 2A 44 27 7F 4B 43 A2 A4 2D 68 07 7F 6F E7>)
(   6,<2012-08-02 12:20:11.078 -0500>,<Administrator>,<TOPSPIN>,<proc1d>,<TOPSPIN 2.1>,
      <abs ABSG = 3 
       data hash MD5: 32K
       80 52 59 A5 EE 20 07 9E 58 A9 DC C1 89 17 F2 25>)
(   7,<2012-08-02 12:20:11.109 -0500>,<Administrator>,<TOPSPIN>,<proc1d>,<TOPSPIN 2.1>,
      <abs ABSG = 4 
       data hash MD5: 32K
       F7 03 2C 8A 16 34 FB 23 9C 29 5A BA 7C CB C8 8D>)
(   8,<2012-08-02 12:20:11.140 -0500>,<Administrator>,<TOPSPIN>,<proc1d>,<TOPSPIN 2.1>,
      <abs ABSG = 5 
       data hash MD5: 32K
       7E 27 4B E4 3A 3F FF D4 69 9E 36 CE EC D2 5D 5A>)
$$ ##END=
$$ 
$$ $$ hash MD5
$$ $$ 86 D3 91 24 E2 D3 CA 89 6D D0 95 CC 44 C1 33 24
##$RELAX= 
##$RELAX= 
##$RELAX= 
##$RELAX= 
##$RELAX= 
##$RELAX= 
##$RELAX= 
$$ Bruker specific parameters
$$ --------------------------
$$ [...]
150 150 150 150 150 150 150 150
##$TP07= 0
##$TPNAME0= <>
##$TPNAME1= <>
##$TPNAME2= <>
##$TPNAME3= <>
##$TPNAME4= <>
##$TPNAME5= <>
##$TPNAME6= <>
##$TPNAME7= <>
##$TPOAL= (0..7)
0.5 0.5 0.5 0.5 0.5 0.5 0.5 0.5
##$TPOFFS= (0..7)
0 0 0 0 0 0 0 0
##$TUNHIN= 0
##$TUNHOUT= 0
##$TUNXOUT= 0
##$USERA1= <user>
##$USERA2= <user>
##$USERA3= <user>
##$USERA4= <user>
##$USERA5= <user>
##$V9= 5
##$VALIST= <valist>
##$VCLIST= <CCCCCCCCCCCCCCC>
##$VD= 0
##$VDLIST= <DDDDDDDDDDDDDDD>
##$VPLIST= <PPPPPPPPPPPPPPP>
##$VTLIST= <TTTTTTTTTTTTTTT>
##$WBST= 1024
##$WBSW= 4
##$XGAIN= (0..3)
0 0 0 0
##$XL= 0
##$YL= 0
##$YMAX_a= 478027
##$YMIN_a= -626731
##$ZGOPTNS= <>
##$ZL1= 120
##$ZL2= 120
##$ZL3= 120
##$ZL4= 120
##$ABSF1= 14.98509
##$ABSF2= -5.573092
##$ABSG= 5
##$ABSL= 3
##$ALPHA= 0
##$AQORDER= 0
##$ASSFAC= 0
##$ASSFACI= 0
##$ASSFACX= 0
##$ASSWID= 0
##$AUNMP= <proc_prof1d_extract_pilot.lims>
##$AXLEFT= 0
##$AXNAME= <>
##$AXNUC= <1H>
##$AXRIGHT= 0
##$AXTYPE= 0
##$AXUNIT= <>
##$AZFE= 0.1
##$AZFW= 0.1
##$BCFW= 0
##$BC_mod= 0
##$BYTORDP= 0
##$COROFFS= 0
##$CY= 15
##$DATMOD= 1
##$DC= 0
##$DFILT= <>
##$DTYPP= 0
##$F1P= 0
##$F2P= 0
##$FCOR= 0.5
##$FTSIZE= 32768
##$FT_mod= 6
##$GAMMA= 0
##$GB= 0
##$INTBC= 1
##$INTSCL= 1
##$ISEN= 128
##$LB= 0
##$LEV0= 0
##$LPBIN= 0
##$MAXI= 10000
##$MC2= 0
##$MEAN= 0
##$ME_mod= 0
##$MI= 0
##$NCOEF= 0
##$NC_proc= -8
##$NLEV= 6
##$NOISF1= 0
##$NOISF2= 0
##$NSP= 0
##$NTH_PI= 0
##$NZP= 0
##$OFFSET= 14.98509
##$PC= 1
##$PHC0= 177.9346
##$PHC1= 0
##$PH_mod= 1
##$PKNL= yes
##$PPARMOD= 0
##$PPDIAG= 0
##$PPIPTYP= 0
##$PPMPNUM= 2147483647
##$PPRESOL= 1
##$PSCAL= 4
##$PSIGN= 0
##$PYNMP= <proc.py>
##$REVERSE= no
##$SF= 400.02
##$SI= 32768
##$SIGF1= 0
##$SIGF2= 0
##$SINO= 400
##$SIOLD= 32768
##$SPECTYP= <>
##$SREGLST= <1H.CDCl3>
##$SSB= 0
##$STSI= 32768
##$STSR= 0
##$SW_p= 8223.68421052631
##$SYMM= 0
##$S_DEV= 0
##$TDeff= 65536
##$TDoff= 0
##$TI= <>
##$TILT= no
##$TM1= 0
##$TM2= 0
##$TOPLEV= 0
##$USERP1= <user>
##$USERP2= <user>
##$USERP3= <user>
##$USERP4= <user>
##$USERP5= <user>
##$WDW= 1
##$XDIM= 32768
##$YMAX_p= 461657570
##$YMIN_p= -694399
##$CURPLOT= <Network HP LaserJet P1505>
##$CURPRIN= <$Network HP LaserJet P1505>
##$DFORMAT= <normdp>
##$LAYOUT= <+/1D_H.xwp>
##$LFORMAT= <normlp>
##$PFORMAT= <normpl>
##$SURQMSG= 1
$$ End of Bruker specific parameters
$$ ---------------------------------
##NTUPLES= NMR SPECTRUM
##VAR_NAME=  FREQUENCY,     SPECTRUM/REAL,   SPECTRUM/IMAG
##SYMBOL=    X,             R,               I
##VAR_TYPE=  INDEPENDENT,   DEPENDENT,       DEPENDENT
##VAR_FORM=  AFFN,          ASDF,            ASDF
##VAR_DIM=   32768,         32768,           32768
##UNITS=     HZ,            ARBITRARY UNITS, ARBITRARY UNITS
##FACTOR=    0.250966925370066, 1,           1
##FIRST=     8223.43324360094, -97369,       -82287
##LAST=      0,             -147581,         -266080
##MIN=       0,             -694399,         0
##MAX=       8223.43324360094, 461657570,    0
$$ Real data points
##PAGE= N=1
##DATA TABLE= (X++(R..R)), XYDATA
$$ [...]
19440c67331R6473j89787F1132c0539J3551r8577o3962E168J8507R2235E5576
19428c02844A73308e4296g790j03128k42591J3364J57578c6566l55398C52591
19417g8322k05701a05091A41037c47087J9660J38775j0167f8828A90644b17164
19406g6233q8491l3156B30342A1601K7068J22266a30196k02186f6979F913O0438
19395F7351N3557b7789k95176B96192a98052g5552k10504I6553a61967k5182Q116
19384a79033B24253b9903A42446h4318j3719j59280A93490o5580h4366j68410
19374b52776a1823j58248j04258o647a18853c0031k3355j31875A1602L62210C4223
19362B07393I2327a83444K5301A81513a94663p0198a3559r5552L1739j45139B42965
$$ y = [-367331, -270858, -460645, 61132, -30539, -16988, -115565, -179527, 5168, 23675, 115910, 55576, -302844, 173308, -54296, -7790, -110918, -353509, -340145, -182567, -36566, -391964, 352591, -78322, -284023, -105091, 141037, -347087, -327427, -188652, -198819, -68828, 190644, -217164, -76233, -164724, -197880, 230342, 11601, 38669, 160935, -130196, -332382, -66979, 6913, 67351, 120908, -27789, -322965, 296192, -198052, -75552, -286056, 96553, -161967, -187149, -179033, 224253, -29903, 142446, -84318, -98037, -257317, 193490, 127910, -84366, -252776, -11823, -170071, -274329, -280976, -118853, -30031, -53386, -185261, 11602, 373812, 34223, 207393, 92327, -183444, -158143, 181513, -194663, -264861, -13559, -109111, -77372, -222511, 242965]
19350e1903p2780e7204j41045O566A35951D3104a26089B35514f0902k2663F3887
19338B53921b4271k19360b2984H0979a16753G1528b63692I7285b19589i6212l17840
19327d14052m4766g7931p6752j34199a37355k6561B03227e1146B19236A9711K08322
19316B28033J12097b77727b9907j9908K1580k40501L9501H4850O3717K5102c10635
19304B26671a24603A6574O2416e3320C60413B2761K5936b21702A69149h8780j10391
19293a99171B27657a95373A8317b02062Q9656j42904P5181c2962n1875j21600
19283b06437p5826J02581C1086I870c1789Q928r2700A75604a3084C6305L1861
19272F8166J18007b49259J00195j45077h6372j55390B49003E6723a27874a3197
$$ y = [-51903, -124683, -57204, -198249, -191683, 135951, 43104, -126089, 235514, -60902, -83565, 63887, 253921, -24271, -243631, -22984, 80979, -116753, 71528, -263692, 97285, -219589, -96212, -414052, -458818, -77931, -154683, -288882, -137355, -163916, 203227, -51146, 219236, 19711, 228033, 340130, -277727, -29907, -49815, -28235, -268736, -229235, 84850, 148567, 173669, -310635, 226671, -124603, 16574, 78990, -53320, 360413, 22761, 48697, -221702, 169149, -88780, -199171, 227657, -195373, 18317, -202062, -112406, -255310, -180129, -32962, -84837, -206437, -282263, -179682, 31086, 9870, -31789, -22861, -115561, 175604, -13084, 36305, 68166, 186173, -249259, -149064, -294141, -86372, -241762, 249003, 56723, -127874, -13197]
19261d5725j97029I5050a69007f9055E6338c22707C36507j31963b78903A94395
19250a48707c8208j2182j12100j41193B72084D3621a09871n0723a5182k08885
19240b24067j18078a39051j29842K8155D1044d28761k9514a65733A36964O7358
19230B04322e63176A62587A3318c34455i7839b9160I3992B6159K58357d51985
19219b81481b8575j14373D6110e0176A58356a77622O0349j62009j78427G4826
19208b42147g8378m424k1988K3939n2052b6997A62832E0017b9315l32473i728
19196a00726l5676O3508k82580C25876b03291A4835a5382k65735O2434l4436f0965
19184C8646j5733K20890d11340a60641K0648k5025O6985e724p8356J3694j73786
$$ y = [-45725, -242754, 95050, -169007, -69055, 56338, -322707, 336507, 204544, -278903, 194395, -148707, -38208, -50390, -162490, -303683, 272084, 43621, -109871, -160594, -15182, -224067, -342145, -139051, -268893, -240738, 41044, -428761, -458275, -165733, 136964, 204322, -563176, 162587, 13318, -334455, -97839, -29160, 93992, 26159, 284516, -451985, -281481, -28575, -142948, 46110, -50176, 158356, -177622, -117273, -279282, -457709, 74826, -242147, -78378, -82802, -104790, -80851, -132903, -26997, 162832, 50017, -29315, -361788, -9728, -100726, -136402, -72894, -355474, 325876, -203291, 14835, -15382, -281117, -218683, -253119, -60965, 38646, 22913, 243803, -411340, -160641, -139993, -165018, -98033, -5724, -84080, -70386, -244172]
19173b44172L8365H3328O1035f5191k8214F461a46326G9805O8766o7458L5236
19162A16349h6879j31619B6006Q0118a1760m31836A64056b87069J22907B07931
19151F4361k2037c13965a22669b7815j1195p395r2689H9391c29903A57203f7879
19139a55705C0835K12319b15816P6277B5275a44574k26016A01392a7362C939K77829
19128B81768d44937A36869b2917j14019r7581d7682a7908q6023j91171B60194
19117a17291k29739B4411f1545K447A02218L9766b6608m2054A49215j389g3347
19105g2824D2815a1889B74647G7416b01298A21563a96597A24371g3335o2568B27943
19093B81373c9416q2810M2034A96614a54805M9288j28072g0079l5529C43234c65921
$$ y = [-244172, -205807, 83328, 144363, -65191, -93405, 6461, -146326, 79805, 148571, 81113, 116349, -86879, -218498, 26006, 106124, -11760, -443596, 164056, -287069, -164162, 207931, 64361, 42324, -313965, -122669, -27815, -39010, -46405, -139094, 89391, -329903, 157203, -67879, -155705, 30835, 243154, -215816, -139539, 25275, -144574, -370590, 101392, -17362, 3939, 281768, -444937, 136869, -22917, -136936, -234517, -47682, -17908, -103931, -295102, 260194, -117291, -347030, 24411, -61545, -59098, 102218, 141984, -26608, -68662, 149215, 147826, -73347, -72824, 42815, -11889, 274647, 77416, -201298, 121563, -196597, 124371, -73335, -135903, 227943, 281373, -39416, -122226, -80192, 196614, -154805, -105517, -233589, -70079, -105608, 343234, -365921]
19081C2240h8227k70386c3666A12517b8338l8880k08232a33925L1449d4995H3749
19069A91920J66935j64195a25528C43357A31382a48825A51116b90935N803e4370
19058c87796L9715A26279b38725Q3084m0434e9200A5098a6890j37648I1501q929
19047H2572a20131N0401j51168P5225J5252e4913l2819c8021A02529b01606d3877
19035a28472j946F6160b42061a06897B02087d1036C4326L6010J97761a29502d1687
19023A14223E5176g9832H5085M5934g0029H021Q3494J40609I1763a21854j46405
19012b68259A82704j4967J27811g8736p3391A37472b68960J04904q3700A67529
19001a96407c7375j6553B47665I1790d8990l57314H7177e6766j89025A7986J31925
$$ y = [32240, -88227, -358613, -33666, 112517, -28338, -67218, -275450, -133925, -102476, -44995, 83749, 191920, 358855, 194660, -125528, 343357, 131382, -148825, 151116, -290935, -285132, -54370, -387796, -348081, 126279, -238725, -155641, -196075, -59200, 15098, -16890, -154538, 91501, 82572, -120131, -69730, -220898, -145673, -130421, -54913, -87732, -38021, 102529, -201606, -43877, -128472, -130418, 66160, -242061, -106897, 202087, -41036, 34326, 70336, 268097, -129502, -41687, 114223, 55176, -79832, 85085, 131019, -70029, 8021, 91515, 232124, 91763, -121854, -268259, 182704, 167737, 295548, -78736, -152127, 137472, -268960, -164056, -247756, 167529, -196407, -37375, -53928, 247665, 91790, -48990, -406304, 87177, -56766, -245791, 17986, 149911]
18990A49911f6598G4066b19539I7572N5488k4261P7019J2112o3423C453e34293
18978A19061h2489l05003B0299K4163J25943q2689a47601E76771K64401C47036
18967B23058b47041A16121J1482a4710F5891j7158L4537b45763E2659b00161P9865
18956a20296b8492l8234D1411c58464a28400C25440b23673A65342E6547h5071
18945a5799q1763k4467j07917a14056A06061J1994a31888I7360h9775c6611E8361
18933a73249N0418B38031p5050i1343B5667e9486B3217a74498e989q8261a0552
18921H9798Q0279a76538D3197A3928h2150K1377B81637i4616n1094f2529C72504
18909G0210Q3255J04786L15989P285A12207P9305D4463j1617a08762L1521a9888
$$ y = [149911, -66598, 74066, -219539, 97572, 153060, 128799, 205818, 217930, 154507, 3453, -534293, 119061, -82489, -387492, 20299, 44462, 170405, 87716, -147601, 576771, 841172, 347036, 223058, -247041, 116121, 127603, -14710, 65891, 48733, 83270, -245763, 52659, -200161, -120296, -28492, -66726, 41411, -358464, -128400, 325440, -223673, 165342, 56547, -85071, -15799, -97562, -122029, -229946, -114056, 106061, 118055, -131888, 97360, -89775, -36611, 58361, -173249, -122831, 238031, 162981, -91343, 25667, -59486, 23217, -174498, -5989, -94250, -10552, 89798, 170077, -176538, 43197, 13928, -82150, -60773, 281637, -94616, -145710, -62529, 372504, 70210, 153465, 258251, 574240, 581525, 112207, 191512, 44463, 32846, -108762, -77241, -19888]
18897A57864D8456a90260j4516l3812h4910j69695B09410a78208A350b39555A45456
18885b9405l30730e2552j20669e1279k59167A1669N1279b4393k40286i7264F595
18873b43108A4071b04714F372a42871b4053A16054e2623J1932j06391e872k18397
18862b24269h3187b8766n0077j32413A20112a42387K4833j19262i877j53842O2259
18851a01460p1164K1390C76238e4014B37878F0463a19387d7535A75558q7238a3638
18839b7386j96647I4404k9392g6566A24347h8450B57900b76914M7948J13346R114
18828a06506D200a36757l6322B47233a2665E830Q1707k7588r356J0902g8040p8256
18816a56296E3720a60478A09767a07762b8798j26960B03800h1868A68332o695
$$ y = [157864, 48456, -190260, -204776, -238588, -84910, -254605, 209410, -178208, 1350, -239555, 145456, -29405, -360135, -52552, -173221, -51279, -310446, 11669, 62948, -24393, -264679, -97264, 6595, -243108, 14071, -204714, 6372, -142871, -24053, 116054, -52623, -40691, -147082, -5872, -224269, -83187, -28766, -78843, -211256, 120112, -142387, -117554, -236816, -9877, -163719, -101460, -172624, -151234, 376238, -54014, 237878, 60463, -119387, -47535, 175558, 88320, -13638, -27386, -224033, 94404, 65012, -76566, 124347, -88450, 257900, -276914, -228966, -115620, -106506, 4200, -136757, -173079, 247233, -12665, 5830, 87537, 59949, 50593, 61495, -78040, -156296, 53720, -160478, 109767, -107762, -28798, -155758, 203800, -81868, 168332, 161637]
18806A61637f2594j35380h8607G8715M1030a43481A71931G8737i5113B8787J09190
18795A37977h4828j26903l1717b1841j38734P5204j09906B59249e9660C48782
18784a05824L0776b9817B00586H6651h9010j31341l0800J05985B0418O0314D0059
18772d7115A87411c1449A6339g0286D3565f3564C3725L8407c49364A21236b84078
18760h2506l45690J80074a09204N0203K0736l32534F9176H961Q637f9311L3285
18749c6026k25272K6102O0505j10245B79853a21455I0949R2786a70272P0665E2934
18737i9177k06135a25800j70715H2932a10406r4371P4439f3497b1221l6841m7708
18726a05770m2001C02465D2646a4951n2114I3871b29262C87905i5329j59075j820
$$ y = [161637, -62594, -197974, -88607, 78715, 119745, -143481, 171931, 78737, -95113, 28787, 137977, -84828, -211731, -243448, -21841, -160575, -85371, -195277, 259249, -59660, 348782, -105824, -75048, -29817, 200586, 86651, -89010, -220351, -251151, -145166, 20418, 80732, 40059, -47115, 187411, -31449, 16339, -70286, 43565, -63564, 33725, 72132, -349364, 121236, -284078, -82506, -428196, -248122, -109204, -59001, -38265, -370799, 69176, 8961, 17598, -69311, -36026, -261298, -235196, -174691, -284936, 279853, -121455, 90949, 183735, -170272, -99607, 52934, -99177, -305312, -125800, -296515, 82932, -110406, -204777, -130338, -63497, -21221, -58062, -105770, -147771, 302465, 42646, -14951, -67065, 93871, -229262, 387905, -95329, -254404, -256224]
18715b56224L7374H2727P4966J25630g7284j71600D6714K8917c7418p6665b3568
18703A33070a39503b9257Q258k98581a02447K8985o8907C545N0375L5313O9470
18692A58703c51549a43891J2648j29785A95827b89437B08547f2576J4172b821
18681F4033a91876k27711a51257j96476a38512B69587b39514j33441C20575a36531
18670i094k32657A77515d05838A09071g6711c2553G2847h5905j32887M971d9019
18658H3739b86031J27917a4871l0600K164B29696a17130K7122r4664D3634c12875
18646C879b14004J5225c756j35083j29451o152n8002d557l0540B49989f5498E2896
18633C05283g5713C21084a43129A78353a00362k06030d1523F7323a50327d878
$$ y = [-256224, -218850, 82727, 157693, 283323, -77284, -248884, 46714, 75631, -37418, -114083, -23568, 133070, -139503, -29257, -20999, -319580, -102447, -73462, -142369, 3545, 53920, 89233, 158703, -351549, -143891, -131243, -261028, 195827, -289437, 208547, -62576, -48404, -2821, 64033, -191876, -419587, -151257, -347733, -138512, 269587, -239514, -372955, 320575, -136531, -9094, -241751, 177515, -405838, 109071, -76711, -32553, 72847, -85905, -218792, -213821, -49019, 83739, -286031, -158114, -14871, -45471, -43307, 229696, -117130, -90008, -184672, 43634, -312875, 3879, -214004, -198779, -3756, -138839, -268290, -274442, -332444, -4557, -35097, 249989, -65498, 52896, 305283, -75713, 321084, -143129, 178353, -100362, -306392, -41523, 67323, -150327, -4878]
18622a02266A24367E3272a19465A1730N2348J93554b85512J39842D8733b14746
18611a773B49382b9738n3932B13352k8073a99943p5845d8945C7624c00487a9638
18599a9306H4941J632a36331A09938c02151P4152j00830B84556c3618A38167h2587
18587b12337D5807J12072D109i6403K008j33319N1180A94362a06632c1490A2658
18575c4298A83743B0688b34037A12653e077H6509l8691i6116n7879q7730n3994
18564b95719K3050F0257A5765a97010C15889A7074b60426A00458a8958C42069
18553C9053J5706b71873D10066b79667A71473a20197b0901B2300a82372N7583
18543a24789H5307f850j08102B5766M254e2981j14316a6922D4391a25198k54842
$$ y = [-102266, 124367, 53272, -119465, 11730, 64078, 257632, -285512, -145670, 48733, -214746, -1773, 249382, -29738, -83670, 213352, 185279, -199943, -275788, -48945, 37624, -300487, -19638, -19306, 84941, 86573, -136331, 109938, -302151, -227999, -328829, 284556, -33618, 138167, -82587, -212337, 45807, 157879, 4109, -96403, -94395, -227714, -176534, 194362, -106632, -31490, 12658, -34298, 183743, 20688, -234037, 112653, -5077, 86509, 47818, -96116, -153995, -241725, -295719, -272669, 60257, 15765, -197010, 315889, 17074, -260426, 100458, -18958, 342069, 39053, 54759, -271873, 410066, -279667, 171473, -120197, -20901, 22300, -182372, -124789, 85307, -6850, -114952, 25766, 30020, -52981, -167297, -16922, 44391, -125198, -380040]
18532c80040O0378R533J07903A22061J9765a96962L3818j7471K6929c1588r3606
18521a25194A42168a48573A06506a66963a43B02851H836a66402j96751A05101
18510a90969L2779A97703i1032o7513A89510a89301p2865B5316a53252k54203
18500d07455A13226e8852j36483C34291I0847M7975a47895G7436e8066o0884j65222
18489b84172c439j20304N3255H0744a50007j90836C71771A84227G2715b86890
18478d57768b06422O6236A44491j2692I549i9663A86053O8373b05310B8870K8131
18467E7001a21663A7190a10290N0699a4459n0015m8245B27822I2851b80129m2972
18456c23101B2701C314c5006j84730A01079L78551a5222j40810k08593a52761
$$ y = [-380040, -319662, -310129, -202226, 122061, 141826, -196962, -163144, -180615, -153686, -31588, -125194, 142168, -148573, 106506, -166963, -143, 202851, 8836, -166402, -363153, 105101, -190969, -158190, 197703, -91032, -158545, 189510, -189301, -262166, 25316, -153252, -407455, 113226, -58852, -195335, 334291, 90847, 138822, -147895, 77436, -58066, -118950, -284172, -3439, -123743, -70488, 80744, -150007, -340843, 371771, 184227, 72715, -286890, -457768, -206422, -140186, 144491, 131799, 9549, -99663, 186053, 254426, -205310, 28870, 57001, -121663, 17190, -110290, -59591, -14459, -64474, -112719, 227822, 92851, -280129, -323101, 22701, 3314, -35006, -219736, 101079, 479630, -15222, -156032, -364625, -152761]
18445D9214f1932J2839B17748b75205a18629F2391b21561A75897G9306J45874
18435B25180a82485A12172K7402m3837R7913a28255F5115M2917B1344J53097b15371
18423c39772a13165A54310D9174c41517F0324J46111g4662n7166e4626B8568J96526
18412B25094a55174B19408b20649a3825G7771c21663A60235a84055A7464c01639
18401d4090A28235g2051q4149C58400b38347h7168B991a45851B00879D5024f3247
18389g2307B02519b4691B1257J36590a23321A14934b17315O5217E8895J62061
18379B20956e9335k20290A43930a76308j79603a43833k7015g1882N915A49384
18368E2045g1161g213B72224a61628D07844A41893B9919g9794D8768a06802j83947
$$ y = [49214, -61932, -49093, 217748, -275205, -118629, 62391, -221561, 175897, 79306, 225180, -182485, 112172, 139574, 95737, 193650, -128255, 65115, 108032, 21344, 174441, -215371, -339772, -113165, 154310, 49174, -341517, 60324, 206435, -74662, -131828, -54626, 28568, 225094, -155174, 219408, -220649, -13825, 77771, -321663, 160235, -184055, 17464, -301639, -44090, 128235, -72051, -156200, 358400, -238347, -87168, 2991, -145851, 200879, 45024, -63247, -72307, 202519, -24691, 21257, 157847, -123321, 114934, -217315, -152098, 58895, 220956, -59335, -279625, 143930, -176308, -355911, -143833, -170848, -71882, -65967, 149384, 52045, -71161, -7213, 272224, -161628, 407844, 141893, 29919, -79794, 48768, -106802, -290749]
18357b90749M4074D6355a27147B5816K03707b43583a06047j1098j62051A18222
18346a91103H8623a21726D309a08842B45537A13543m130D1825a2210A02436B0146
18334b36825P2977H4445a27868G4057d522m88497H5895b40611B2569h8823A31786
18322g289q3456j95583J12905F243R9166a07965C5872b9175l355K730m5968l3988
18310a09756j89094a45132j56021J05659d628A38387c0224j94450J4193R0118
18300a20363L7342a8874o104C2616b01446B28025a47680M451F6671Q2800j2004
18289A37467a15564l3374B19320a3073C30488H9760M0460l1672i8752l56707H4433
18277c628r826j15210B0391b26099e4893A52387a29328k82693J77800R9871D4900
$$ y = [-290749, -246675, 46355, -127147, 25816, 229523, -243583, -106047, -117145, -279196, 118222, -191103, 88623, -121726, 4309, -108842, 245537, 113543, 109413, 41825, -12210, 102436, 20146, -236825, -163848, 84445, -127868, 74057, -4522, -493019, 85895, -240611, 22569, -88823, 131786, -7289, -90745, -286328, -173423, 6243, 105409, -107965, 35872, -29175, -32530, -29800, -75768, -109756, -298850, -145132, -301153, -195494, -4628, 138387, -30224, -224674, -210481, -120363, -83021, -18874, -24978, 32616, -201446, 228025, -147680, -143229, 66671, 149471, 137467, -115564, -148938, 219320, -13073, 330488, 89760, 130220, 98548, -98752, -455459, 84433, -3628, -13454, -128664, 20391, -226099, -54893, 152387, -129328, -412021, -234221, -134350, 44900]
18265A14310M983O3883a74010j20684C62432d9657l21763B9020L21a7291F9484
18253A12207M5711g8611n0077p5501g8132B8609J15439c137j23375K1169A03016
18241I0167l2816k8381h4540A45225a75460J1797l1404N6906C07555a1290G0841
18229b71509f617j24006l0771f3610k44849a1784I6454B5664a82564A82455A9039
18217g0386J8473g423A02289a51514m7704E2444B376K11442D8607K5955J53027
18206B27589j04246a2419j85029R1154A15440E945J30572R1318b57298J17356
18196a39942k93072a21845D4679J30620m6423b5227J521B39225e9505A88996o129
18185A82867M9655m3193b26865P7554O1477j63543d5444A30410C164b65970O0515
$$ y = [114310, 119293, 183176, -174010, -294694, 362432, -49657, -371420, 29020, 29341, -17291, 69484, 112207, 157918, -78611, -128688, -204189, -78132, 28609, 144048, -3137, -126512, -105343, 103016, 90167, 57351, 28970, -84540, 145225, -175460, -163663, -195067, -138161, 307555, -11290, 70841, -271509, -6617, -130623, -161394, -63610, -308459, -11784, 96454, 25664, -182564, 182455, 19039, -70386, -51913, -7423, 102289, -151514, -199218, 52444, 2376, 213818, 48607, 74562, 227589, 123343, -12419, -197448, -106294, 115440, 5945, 136517, 227835, -257298, -139942, -433014, -121845, 44679, 175299, 128876, -25227, -23706, 239225, -59505, 188996, 182867, 232522, 189329, -226865, -149311, -87834, -251377, -45444, 130410, 3164, -265970, -205455]
18174b05455d23j43982A19056b6237n018B1277N9006O7499J49589c9113o3426
18163a02539H582a10813B02656E1336h6891K8702k4717A20466h9787A55926O283
18152A62209k6105F2930a94912F9314O1688b7993l26699A04377b31793A57756
18141B0976b19530A7303a06023A82276d6022k65074k9812a39833D47677j57053
18131B90624c6239C3575b51018B44665d22348N6683A92622h2638A61870A1460
18120h3540B97159E7848a22338M0224A07018d7604j85794N5513F1152a29632B77334
18108d4871A93281J2760c09814d4240l6223A8842h4269C9819c13546A98764c77863
18096I3549L0474j5581a2166D12321b18744Q6900a9571A30b221j60615H4028Q1436
$$ y = [-205455, -423, -144405, 119056, -26237, -31255, 21277, 80283, 147782, 297371, -39113, -102539, 8582, -110813, 202656, 51336, -86891, -58189, -82906, 120466, -89787, 155926, 162209, 136104, 62930, -194912, 69314, 131002, -27993, -354692, 104377, -231793, 157756, 20976, -219530, 17303, -106023, 182276, -46022, -311096, -340908, -139833, 447677, 290624, -36239, 33575, -251018, 244665, -422348, -365665, 192622, -82638, 161870, 11460, -83540, 297159, 57848, -122338, -82114, 107018, -47604, -233398, -177885, 61152, -129632, 277334, -44871, 193281, 206041, -309814, -44240, -80463, 18842, -84269, 39819, -313546, 198764, -377863, 93549, 124023, 108442, -12166, 412321, -218744, -131844, -19571, 130, -2221, -162836, 84028, 165464]
18084A65464a18562r4471B60003e8118D2088d1531A48237a76969A95087p8070
18074A17017g1871i735j25333A53386F9902B074J67802G5329J89300b40437A01995
18062E9305b79432a27029d4708C09892E435f8307D4975a3722B54303b10593D5785
18050f2008j66841L9497A3670c5112A8656J56543a99184c8872j49559A33813B0712
18038E3639a54478B80795B8964b09304O0262D6442K30273F1529N0262c6854B08056
18026a23617B5846b39010M5093L1543A31979J00665j11382O7693c35161J47891
18016a87270A20070J43142j6054c26719B5645b98438B62805d80461A25142L6055
18006A61197b40572D28988g9893J9896n8200A04314a13328C5707c19308d3335
$$ y = [165464, -118562, -213033, 260003, -58118, 42088, -41531, 148237, -176969, 195087, 117017, -71871, -9735, -135068, 153386, 69902, 2074, 169876, 75329, 264629, -240437, 101995, 59305, -279432, -127029, -44708, 309892, 5435, -68307, 44975, -13722, 254303, -210593, 45785, -62008, -228849, -189352, 13670, -35112, 18656, 175199, -199184, -38872, -188431, 133813, 20712, 53639, -154478, 280795, 28964, -209304, -149042, 46442, 276715, 61529, 111791, -36854, 208056, -123617, 25846, -239010, -193917, -162374, 131979, 232644, 121262, 188955, -335161, -187270, 120070, 263212, 247158, -326719, 25645, -298438, 262805, -480461, 125142, 161197, -240572, 428988, -79893, -59997, -118197, 104314, -113328, 35707, -319308, -43335]
17995a38052d0010A3265a12123D9444f9708A07947B5441L13297b10832B8405J16368
17984A44773j6324B7088J29690p0966q570A725J10809g6978A38076o6856J15543
17973A86763J61162F3932N9691q739k9105J66722j23817K33g848A01361a32847
17961B39552f4339A71302K1710C371J02836b16571D189R995J08861b54059G0456
17949c27908h1567k0330A77387b38770C0404e9734A45927d7268l1830I8993M4458
17938A43451b26493P5413A14a65118C31150A33592F6584j0473a76996A66601K4111
17927A90712a42533d9693E1016A8215a65513F3015a4921k87474H5277a5011A17155
17915A14867b41330A86234G8679J29827G5179j44K31893h4908B04490a34096b7018
$$ y = [-138052, -40010, 13265, -112123, 49444, -69708, 107947, 25441, 338738, -210832, 28405, 144773, 128449, 27088, 156778, 85812, 77242, 1725, 112534, -76978, 138076, 71220, 186763, 347925, 63932, 123623, 114884, 85779, 252501, 128684, 128917, -7848, 101361, -132847, 239552, -64339, 171302, 193012, 3371, 106207, -216571, 4189, 14184, 123045, -254059, 70456, -327908, -81567, -101897, 177387, -238770, 30404, -59734, 145927, -47268, -79098, 98993, 143451, -226493, -151080, 114, -165118, 331150, 133592, 66584, 56111, -176996, 166601, 190712, -142533, -49693, 51016, 18215, -165513, 63015, -14921, -302395, 85277, -15011, 117155, 114867, -241330, 186234, 78679, 208506, 75179, 75035, 306928, -84908, 204490, -134096, -27018]
17903G1749J9426M8692O6457J67183A45546A3344a32543A26353P039Q6594f932
17891A30598a58276e8908C60981j29762I7971l8011c079B1919N2114b46722H6015
17879F0027J46259B0440a44748D231a19652D67261k31546K4136a6487B04947J80279
17868C85226A2496M53731E821d8702k9527A09648k3154R4912C3594a00946B2857
17856B52599D9414J00174K7845B6980a21113e2175B12352c3218B23307a41353
17845i761j57579E5346M0082O5104N576a22675d8673F9049Q8799K53747A31962
17833a67362F9320J85784a40240c3538m8374A07106a44130B07595a24242b1787
17822c46598a32551A6394L43523j75880g5804G7064a64655A72715a9073m2040
$$ y = [71749, 91175, 139867, 206324, 373507, 145546, 13344, -132543, 126353, 133392, 219986, -6932, 130598, -158276, -58908, 360981, 231219, 97971, 59960, -3079, 21919, 74033, -246722, 86015, 60027, 206286, 20440, -144748, 4231, -119652, 467261, 235715, 259851, -16487, 204947, 385226, 12496, 466227, 5821, -48702, -78229, 109648, 86494, 181406, 33594, -100946, 22857, 252599, 49414, 149588, 177433, 26980, -121113, -52175, 212352, -33218, 223307, -141353, -9761, -167340, 55346, 95428, 160532, 166108, -122675, -48673, 69049, 157848, 411595, 131962, -167362, 69320, 255104, -140240, -33538, -81912, 107106, -144130, 207595, -124242, -21787, -346598, -132551, 16394, 359917, 184037, -75804, 77064, -164655, 172715, -19073, -61113]
17812f1113A62036J65331j62286J15071b6852G4129f0417j0430B36433A3788K88821
17801C02609G6660l4085J9913Q5164C8404c13j02635B56343c31512D35430j85854
17790B49576k0807L48637A6714J40075a15653E7132N7009J55905A5L50333a40773
17778f4261I7459K80494i0590k28546g977H8786K06661j39573b46058B24357C5473
17766A54094L1875d9080C98847A62197L81838E3624N4602h1106A96022b3032A92304
17754b60434g5807O499B79503f340A23071m6359b060j54878C39568H4627a85559
17742A957b20920A52029L7345G6713J44614L6836r9164g4889A78820b94606a24071
17730a09581B6550b66596A08651K85439A46124M9782b38960j59118e0453A99593
$$ y = [-61113, 162036, 327367, 165081, 280152, -26852, 74129, -60417, -70847, 236433, 13788, 302609, 76660, 42575, 62488, 147652, 38404, -313, -102948, 256343, -331512, 435430, 249576, 228769, 577406, 16714, 156789, -115653, 57132, 114141, 270046, 15, 350348, -140773, -64261, 97459, 377953, -90590, -319136, -7977, 88786, 295447, 155874, -246058, 224357, 35473, 154094, 185969, -49080, 398847, 162197, 544035, 53624, 108226, -81106, 196022, -23032, 192304, -260434, -75807, -69308, 279503, -6340, 123071, 76712, -2060, -156938, 339568, 84627, -185559, 1957, -220920, 152029, 189374, 76713, 221327, 258163, 158999, -74889, 178820, -294606, -124071, -109581, 26550, -266596, 108651, 394090, 146124, 195906, -238960, -398078, -50453, 199593]
17719C74389j70122C6551J21417b04310B4853J64063D2376K41173j33954m4671
17709A04924K24177a44407A30083a44167b6957G3645J31249q3263C3613M12522
17699D46135a45640B07861J99455a3568C2451N0708b91727B3310J33095J42106
17689B98511H6450k1672a20109F8929J24837C1704J04606E2141L9054a16465C24951
17677C2686a55983O4571B7993c3887B39447b29683B94398j04847f9588A26381
17666A81511a07727B32878J03330j18989N6010K6313I0277L45222j62883A15544
17655A09733M6427J08030M342e7982C40081j05836j10429e3635o7883B81904a72185
17643B21218M029L592F0490N664a25995C5843N629a5337B93696E1413H891J98731
$$ y = [374389, 204267, 36551, 157968, -204310, 24853, 188916, 42376, 283549, 149595, 104924, 329101, -144407, 130083, -144167, -26957, 73645, 204894, 121631, 33613, 446135, -145640, 207861, 407316, -13568, 32451, 83159, -291727, 23310, 156405, 298511, 86450, 64778, -120109, 68929, 193766, 31704, 136310, 52141, 91195, -116465, 324951, 32686, -155983, -91412, 27993, -33887, 239447, -229683, 294398, 189551, -69588, 126381, 181511, -107727, 232878, 336208, 217219, 273229, 299542, 90277, 435499, 272616, 115544, 109733, 156160, 264190, 268532, -57982, 340081, 234245, 123816, -53635, -121518, 281904, -172185, 221218, 225247, 228839, 60490, 66154, -125995, 35843, 41472, -15337, 293696, 51413, 8891, 207622]
17631B07622J85576H8296K3030L23422C7026j1596J91119k1935B7379m735L32917
17620C55561A1378i5I8034M8902b52798A38275j0092a65581I7696A2481K83051
17609B95532f8632B81861H8223L2056M0542J10122F8771L09222e1466G991K33364
17598B41355j2972C7691R3375a7042H7358j7702J15199J24168G4084K44453A1213
17586A37759L07327a12380A5161Q2752b24844B02454I8824J12762e4512C93184
17575H9836P0886p6756b00496A15408B0173K72904h3266l1978I3379K8637J1112
17564A33128k0554q105b8999B42243l8761M0390l1190K19639A82366O7915H6158
17552A85463P8837c518A25751J02969R0739d9258C16708D7005R2532D0141L84936
$$ y = [207622, 393198, 88296, 111326, 434748, 37026, 25430, 216549, 194614, 27379, 22644, 355561, 11378, -95, 98034, 146936, -252798, 138275, 128183, -165581, 97696, 12481, 295532, -68632, 281861, 88223, 120279, 160821, 270943, 68771, 377993, -51466, 7991, 241355, 228383, 37691, 131066, -17042, 87358, 69656, 184855, 309023, 74084, 318537, 11213, 137759, 445086, -112380, 15161, 97913, -224844, 202454, 98824, 211586, -54512, 393184, 89836, 160722, 83966, -200496, 115408, 20173, 293077, -83266, -115244, 93379, 122016, 133128, 112574, 104469, -28999, 242243, 203482, 243872, 212682, 432321, 182366, 250281, 86158, 185463, 264300, -3518, 125751, 228720, 319459, -49258, 316708, 47005, 139537, 40141, 425077]
17541D25077D1871K00025J80088A38535K95436j21604J79883A59893R3144o405
17531B46632K92870p8195J01834A20767M07402J9481N49451r0035J95928o6878
17521A136116l07302k82278J44831j42301p7935k24516J3084A4947O90042p3592
17511F31397m0183L13607J83647J11787J39191l64237l11202j28976J5555k37003
17501C13583J17990j90710J1361j02601M4002J21425f6209F15459J0342k95693
17491C30108A15024F268M53625n1622C099M98631r4900j29630J88143k13699q6324
17480A65320R2499r90K9347j3881J51319e2649B65839k8614J6046K13932p1547
17469C95656F5365J44791J43379E8087J98914L66271k63443A13213J40472P3084
$$ y = [425077, 41871, 241896, 421984, 138535, 433971, 312367, 492250, 159893, 253037, 246632, 539502, 461307, 563141, 120767, 528169, 547650, 1097101, 1007066, 1202994, 1136116, 828814, 546536, 691367, 549066, 471131, 246615, 259699, 14947, 704989, 631397, 591214, 904821, 1088468, 1200255, 1339446, 975209, 664007, 535031, 550586, 313583, 431573, 240863, 252224, 149623, 193625, 315050, -66209, 615459, 625801, 330108, 115024, 6268, 459893, 408271, 3099, 501730, 406830, 277200, 465343, 251644, 165320, 257819, 256829, 286176, 272295, 423614, -52649, 265839, 237225, 253271, 467203, 395656, 65365, 210156, 353535, 58087, 257001, 623272, 359829, 113213, 253685, 326769]
17459C26769n8958L84525g2833A96619J28371k6211J14383j92765K10643k04989
17449B26051K27482L28302l00999j96775M59435n2378k49250J02675A84580J95218
17439C79798M37653n2390B65543l9028K63594j49717L6799j00972J29202A95926
17428D02040A77669J64146K11646j40418J95934j89099I4159K8285L01324j54169
17418B69599J05709m3907N4127L8426j1228P2921l3606j81760n3110L41168A8405
17406D48214j3802K09210A00843a13529F47160A55394R6596F2913R6179o3941
17396I5151L45790C9654K00384k3107N9881A17119C5537J23732M55943j34278
17386D80934j48946j02207M31996A78181J43858e9392D68555B8444N4586J37714
$$ y = [326769, 267811, 652336, -72833, 196619, 324990, 298779, 413162, 220397, 431040, 226051, 453533, 781835, 480836, 284061, 743496, 691118, 441868, 544543, 184580, 379798, 817451, 765061, 265543, 226515, 490109, 340392, 377191, 276219, 405421, 195926, 402040, 177669, 341815, 553461, 413043, 608977, 419878, 94159, 122444, 423768, 269599, 375308, 331401, 385528, 423954, 412726, 485647, 452041, 270281, 217171, 558339, 18405, 448214, 434412, 643622, 100843, -113529, 647160, 155394, 251990, 62913, 159092, 95151, 440941, 39654, 240038, 216931, 276812, 117119, 35537, 159269, 615212, 480934, 331988, 229781, 661777, 178181, 322039, -59392, 468555, 28444, 83030, 220744]
17376B20744J37840A00960J02753J10427A24651J03318M16611j68143E0838i7203
17365b6585H6598J73263K09800r9872L9610A86447p4721J01428J77619j43721
17355B47052c442B45836p3125J33261E9297K55775A20654J1883R6755Q9210N0176
17344C68678J25143k14012j9277a12694A15111K49699j78623J60396j56247n0385
17334A39951O0917B9915K6908J57097J81513j93483N2211E0009J67320M3604K02633
17323D63566A06907E744K57707k8504K35106B32630L63072A91265J45704q547
17313C28422j5530p1933J14691A22226K45762H1517J9633J32490K11644k20888
17303B24396n3594L63047k60692r4845J27366J45250E2833O04309B09455J31437
$$ y = [220744, 358584, 100960, 203713, 314140, 124651, 227969, 644580, 476437, 50838, -97203, -26585, 86598, 259861, 469661, 369789, 409399, 186447, 111726, 213154, 390773, 247052, -3442, 245836, 172711, 305972, 59297, 315072, 120654, 132537, 229292, 318502, 368678, 493821, 279809, 260532, -112694, 115111, 364810, 186187, 346583, 190336, 139951, 200868, 29915, 56823, 213920, 395433, 201950, 254161, 50009, 217329, 260933, 463566, 106907, 5744, 263451, 234947, 470053, 232630, 595702, 191265, 336969, 328422, 312892, 240959, 355650, 122226, 367988, 81517, 101150, 233640, 445284, 224396, 170802, 533849, 273157, 178312, 305678, 450928, 52833, 657142, 209455, 340892]
17293C40892a22089B11175K20870k04408J48679F9275J49647K9623j17805L59164
17283D89904o5254R7964D3458K75213L2358K93892B92344Q7808j85079J88840
17273C83913G5587J34611n106J14289L19398k73602j28168J77667H6603K25675
17263C12278R1622J47821n6661j56029j07697Q0995K23787m3023k08384L17087
17253F01796j77555J34682a29858A60037K28015j19044j1821n4569M18654k62047
17243C59225n1934J53936J10058k82405P0347K38291j35245k2049j49377r2210
17233A98637I0755M13844B09552M47328k09809p4944G0099K85693N3526L99333
17223H08651B30545K60540k20353K12853D8219K46738K22842j63385j25239K58964
$$ y = [340892, -122089, 211175, 432045, 227637, 376316, 69275, 218922, 248545, 130740, 489904, 424650, 522614, 43458, 318671, 351029, 644921, 292344, 380152, 195073, 383913, 75587, 210198, 205092, 319381, 638779, 365177, 237009, 414676, 86603, 312278, 403900, 551721, 495060, 339031, 231334, 312329, 536116, 493093, 284709, 601796, 424241, 558923, -129858, 160037, 388052, 269008, 257187, 202618, 621272, 359225, 307291, 461227, 571285, 288880, 359227, 597518, 462273, 440224, 290847, 198637, 90755, 504599, 209552, 656880, 447071, 372127, 70099, 355792, 409318, 808651, 230545, 491085, 270732, 483585, 48219, 294957, 517799, 354414, 229175, 488139]
17213D88139B26202N55231C20741J38974D5905O92879p5627k54627J6013O2958
17203D87501L13080C99019R839j48382M25063B68305I8748L20852l5257B1019
17192A61554J16027L7612K9796L28527M2927k58546J92594j01792A0861M08922
17182D19783q108A94062j5037N08796q2495M711p6715J18002B53847K37392j15942
17171C75297J23577L19792C41419j21031K43837K11932m7152J04540l8458k19375
17161D75712K52256B04689M36271J61359j44029N1707m2134l13013O5689J49049
17151E69588j28593k3312m3750L92133k60425j13752J88496j88071O55465m04700
17141F43079j50876J7500M10238m55404J79468l16460n0431L8538M26570k84227
$$ y = [488139, 226202, 781433, 320741, 459715, 45905, 738784, 663157, 408530, 424543, 487501, 800581, 399019, 408858, 260476, 685539, 268305, 98748, 419600, 384343, 21019, 161554, 277581, 315193, 344989, 673516, 716443, 457897, 650491, 548699, 10861, 419783, 411675, 194062, 179025, 687821, 605326, 610037, 533322, 651324, 253847, 491239, 375297, 498874, 818666, 341419, 220388, 464225, 676157, 629005, 733545, 695087, 475712, 727968, 204689, 640960, 802319, 658290, 709997, 667863, 354850, 420539, 569588, 440995, 417683, 373933, 766066, 505641, 391889, 580385, 392314, 1047779, 643079, 492203, 509703, 919941, 464537, 644005, 327545, 277114, 315652, 742222, 457995]
17131D57995L26513j42551R999P5754l43923K39523j02038L0834r1719j48113
17121C12274J91021K09021k85367K29129L5954o4274K92453j44921l5179J3204
17111G53315k62535L0924K91839k60958K1226M28440l53671Q0259o8810P4929
17101G34958k39846L12052k17188p87K64322k49693K05976j57939q7244M5968
17091F10579l9926L50439k36916o433J85596m29673K30181j02430K81026k04877
17081F37566l1613L66417J96341E82376J40058q2285j10906N17785j34348j30969
17071G81711O3024l03182M88501J14740m69069M57001k03275L8703L7799j10524
17061H95429k81244O3099K08567K41367m53441N39535k67045P318J44229k32436
$$ y = [457995, 784508, 641957, 651956, 727710, 383787, 623310, 521272, 552106, 460387, 312274, 503295, 712316, 426949, 656078, 692032, 627758, 920211, 775290, 740111, 753315, 490780, 521704, 813543, 552585, 573811, 1002251, 648580, 728839, 660029, 734958, 495112, 807164, 589976, 589189, 853511, 603818, 809794, 651855, 564611, 610579, 570653, 921092, 684176, 677743, 863339, 433666, 663847, 561417, 842443, 637566, 605953, 972370, 1168711, 582376, 722434, 640149, 529243, 1047028, 912680, 781711, 844735, 541553, 1030054, 1144794, 675725, 1132726, 929451, 968154, 1005953, 895429, 614185, 677284, 885851, 1127218, 673777, 1213312, 946267, 953585, 1097814, 865378]
17051H65378J31255j74427J05900j91466K98361r353L3196k01720K3028J17933
17041I98085k04963K02078j69621J69207J48730l01650K25839j34196J01489J04209
17031A139207j93602L01003j64635J56172j46170K62266m66280k3411J48360K97901
17021A310811E02138N89451l1355r8787M05281l9580L5672k4051l98687L27200
17011A267282j15537L0979J20446r9266J69551m05464O14186j45311k62399m576
17001A169891M48569l10430n7487l98374R04217m52970n9482k30430M11946R1005
16991A516455l03359l18454N30249k05127J25398J14069J29910k96672K73498
16982A565967Q7785j23902j85430J04M80503k80200o7149L2867j4756p7691L30916
$$ y = [865378, 996633, 822206, 928106, 736640, 1035001, 1025648, 1058844, 857124, 880152, 998085, 793122, 995200, 825579, 994786, 1143516, 841866, 1067705, 933509, 1034998, 1139207, 945605, 1246608, 1081973, 1238145, 1091975, 1354241, 887961, 864550, 1012910, 1310811, 502138, 1091589, 1060234, 961447, 1366728, 1327148, 1362820, 1338769, 940082, 1267282, 1151745, 1182724, 1303170, 1203904, 1373455, 967991, 1582177, 1436866, 1174467, 1169891, 1618460, 1308030, 1250543, 852169, 1756386, 1303416, 1243934, 1013504, 1425450, 1516455, 1213096, 894642, 1424891, 1219764, 1345162, 1459231, 1589141, 1292469, 1565967, 1653752, 1529850, 1344420, 1344524, 1825027, 1544827, 1477678, 1510545, 1495789, 1418098, 1749014]
16971A749014j57419j38959q8287J21383K81735j64416L76164m14059J76836j19180
16961A622812m6167K72663k82368M95598k71010r7378J91247r8881K64874R0588
16951B141978r1941j81161l42103N56287k03235j27885K26206j34041K57119J64516
16941B265740k93575q9167J95165q1019K04246k60277L11412l79513L08632J24373
16931B306017l9666J83415j22860j64450K472K28563J13105m38407N9922L02120
16921B430231J50795o3687j26081L8850O3851j8261R4977J29579k74171J15315
16911B541398l6951K02540q2173N13796k63737J71038l49429J34691K55382j77077
16901B909478J24794k70031K47694j15912K66981J03095j84725J78522J63080
$$ y = [1749014, 1591595, 1452636, 1364349, 1485732, 1767467, 1603051, 1979215, 1565156, 1741992, 1622812, 1576645, 1849308, 1566940, 2062538, 1791528, 1694150, 1885397, 1786516, 2051390, 2141978, 2050037, 1868876, 1526773, 2083060, 1879825, 1751940, 1978146, 1844105, 2101224, 2265740, 1972165, 1882998, 2078163, 1997144, 2201390, 1941113, 2252525, 1873012, 2181644, 2306017, 2266351, 2449766, 2326906, 2162456, 2164928, 2393491, 2506596, 2068189, 2128111, 2430231, 2581026, 2517339, 2391258, 2430108, 2493959, 2475698, 2570675, 2700254, 2426083, 2541398, 2504447, 2706987, 2624814, 3138610, 2874873, 3045911, 2696482, 2831173, 3086555, 2909478, 3034272, 2764241, 3011935, 2896023, 3163004, 3266099, 3081374, 3259896, 3422976]
16892C422976q8462k5230q3404P4978J55255J50323R1490Q0149j26604j38980
16882C512491K70657P575J60322k76819L83466l55969m225O39923n33924L09995
16872D113492l8380O9632j02873K10891K04773J03434n4180M92176k02224q0895
16862D715846L85928m27374K39828K30740k05851m1230N4003K52778j44669L16114
16852E376113J55573K2907K1995k6453Q365J63106K10505k728n1589J81803J56371
16841F215968j65569M96960j84525N3144J99822L83672k47088L51270L62528j70914
16831G295268r2532K67772L29061J41584k65439O49648n3199k8846N16857K29410
16821H989584j67750N25996k59487N92499k2439j25234K07956M71264J25490M9403
$$ y = [3422976, 3334514, 3309284, 3225880, 3300858, 3456113, 3606436, 3697926, 3778075, 3651471, 3512491, 3783148, 3790723, 3951045, 3674226, 4057692, 3701723, 3697498, 4337421, 3803497, 4113492, 4075112, 4144744, 4041871, 4252762, 4457535, 4560969, 4506789, 4998965, 4796741, 4715846, 5101774, 4674400, 4914228, 5144968, 4939117, 4897887, 4951890, 5204668, 5059999, 5376113, 5531686, 5554593, 5576588, 5550135, 5558500, 5721606, 5932111, 5929383, 5877794, 6059597, 6215968, 6050399, 6547359, 6362834, 6415978, 6615800, 6999472, 6752384, 7103654, 7466182, 7295268, 7202736, 7470508, 7799569, 7941153, 7675714, 8325362, 8272163, 8243317, 8760174, 8989584, 8821834, 9347830, 9088343, 9680842, 9658403, 9533169, 9741125, 10212389, 10337879, 10387282]
16811A0387282J9213O69323K33414j52508N17109L86930J49497L71838J25014
16802A2707112L19535Q4005M57829L50536J44523R74390m10893O79091J50462
16793A5456590L41844K78663M06544N81634N47414K98123N27586N38605M25344
16784A9402347L91290N50021P15570N22868N84676O36235Q16210O30942P55423
16775B5005582N87727P13686O83249Q69364N33791R00710J081533Q61744J140615
16766C2378001P66643J229887J188466J113229J337742J056375J020683J393184
16758D1484210J624587J467907J418379J639304J631764J906273J700392J542542
16750E4415358K215017J764247K182245K346955K153742J618726K788646K237227
$$ y = [10387282, 10406495, 11075818, 11309232, 11156724, 11673833, 12060763, 12210260, 12582098, 12707112, 13026647, 13110652, 13568481, 13919017, 14063540, 15037930, 14627037, 15306128, 15456590, 15798434, 16077097, 16483641, 17065275, 17612689, 17910812, 18438398, 18977003, 19402347, 19793637, 20343658, 21059228, 21582096, 22166772, 22803007, 23619217, 24250159, 25005582, 25593309, 26306995, 26990244, 27859608, 28393399, 29294109, 30375642, 31237386, 32378001, 33144644, 34374531, 35562997, 36676226, 38013968, 39070343, 40091026, 41484210, 43108797, 44576704, 45995083, 47634387, 49266151, 51172424, 52872816, 54415358, 56630375, 58394622, 60576867, 62923822, 65077564, 66696290, 69484936, 71722163]
16742G1722163K542555K484575K024027K961684K614037K527167K643564K428883
16734I1948655K663504K514213K176996K551912K316287J948238J916613J747926
16726A09784344J361759J091351J585677O33810L44288L44360K3877N6661j078464
16717A14147663p87732j034508j071883j773082j279804k429533j865385k164133
16709A01741603k549827k548479k599679k499809k410116k491807k496182l198694
16701H0947010k091329k796279k757089j918180k542834k336121k491055k081184
16693F1932939k265752k116401j990385j849609j736235j887981j730573j757075
16685D6598928j379557j899789j145835j445986j529551j367714j156705j058089
$$ y = [71722163, 74264718, 76749293, 78773320, 81735004, 84349041, 86876208, 89519772, 91948655, 94612159, 97126372, 99303368, 101855280, 104171567, 106119805, 108036418, 109784344, 111146103, 112237454, 113823131, 114456941, 114801229, 115145589, 115169466, 115226127, 114147663, 113359931, 112325423, 111253540, 109480458, 108200654, 105771121, 103905736, 101741603, 99191776, 96643297, 94043618, 91543809, 89133693, 86641886, 84145704, 80947010, 78855681, 76059402, 73302313, 71384133, 68841299, 66505178, 64014123, 61932939, 59667187, 57550786, 55560401, 53710792, 51974557, 50086576, 48356003, 46598928, 45219371, 43319582, 42173747, 40727761, 39198210, 37830496, 36673791, 35615702]
16677C5615702j247086r58336j298728o90669q35741j362993q47879o94494j066182
16668B6613594m86176q53122q08521m87310p83864o74697p52987p50259m01646
16659B0615012r39956L9639p59120l13258k49891n95465o06726j26603o93196
16650A6370436m92921l47331m59679l92082k89709k67518k92778n32029r8766
16641A3197623q5946m77162k95321K5759p42971J65458m65424J07061q90584l5218
16631A0503275J71351l14575k58995k91092m85459P4924J8830l43041J34711o06854
16621H603075k22236l65481K38998l39040J69286k15295l28198L9406k57085j9533
16611G303897j91249k21878k5444k99831O1576J97752m67773l83n8830l03657
$$ y = [35615702, 34368616, 33410280, 32111552, 31420883, 30585142, 29222149, 28374270, 27679776, 26613594, 26127418, 25274296, 24465775, 23978465, 23194601, 22519904, 21766917, 21016658, 20615012, 19675056, 19714695, 18955575, 18642317, 18392426, 17796961, 17190235, 17063632, 16370436, 15877515, 15530184, 15070505, 14678423, 14388714, 14121196, 13828418, 13296389, 13197623, 13111677, 12634515, 12339194, 12364953, 11621982, 11787440, 11322016, 11429077, 10538493, 10503275, 10674626, 10360051, 10101056, 9809964, 9324505, 9399429, 9418259, 9075218, 9209929, 8603075, 8380839, 8015358, 8254356, 7915316, 8084602, 7869307, 7541109, 7580515, 7323430, 7303897, 7112648, 6890770, 6865326, 6565495, 6627071, 6824823, 6357050, 6356667, 6297837, 5994180]
16601E994180k50167N7055j55344r3556K62268k03429k24342j32885K3382j51835
16591E125327O0192j72776Q192k03626J16241L6250r0517J60233k56890j82702
16581D599924k54931J56994l29122k32089K89912N9017l78727k7566K85031m5306
16571D123137l58435K90874j72846k80846P5658L26728m31130K7514R7390k13743
16561C484301J01006j2391K1916k24810o2436J53410l92387K06151M1529j18633
16551C197656j58463M7546M5861l28869J47418k68839J42928j65118L14766L32657
16541C307543p37204K55518k22202J61835k32520J27082J70436k22472K8068k90840
16531B345244J15570j54409K20986m6528p2135k08930M9092n1013J93808N2549
$$ y = [5994180, 5744013, 5801068, 5645724, 5552168, 5814436, 5611007, 5386665, 5253780, 5277162, 5125327, 5185519, 5012743, 5020935, 4817309, 4933550, 4969800, 4879283, 5039516, 4782626, 4599924, 4344993, 4501987, 4172865, 3940776, 4230688, 4289705, 3910978, 3883412, 4168443, 4123137, 3764702, 4055576, 3882730, 3601884, 3677542, 4004270, 3573140, 3600654, 3698044, 3484301, 3585307, 3572916, 3594832, 3370022, 3307586, 3460996, 3068609, 3274760, 3316289, 3197656, 3039193, 3086739, 3132600, 2803731, 2951149, 2682310, 2825238, 2660120, 2974886, 3307543, 2570339, 2825857, 2603655, 2765490, 2532970, 2660052, 2830488, 2608016, 2636084, 2345244, 2460814, 2306405, 2527391, 2480863, 2408728, 2199798, 2248890, 2197877, 2391685, 2444234]
16521B444234n29785L64406j63907J89447j98160j94563k6903L38181k12099P4164
16511B085015O9184P7320k7850m19347L95072k24939J36989m39824M72885m83288
16501A641217K02762M30276p71681K9866K94487L40054l37710j7023L75912n89250
16491A598910j01687Q906L96787j09329j44068m15466M1640M45939j10209l31374
16481A280049Q1717K34652O8655m06667N42284l11827j25361r725L0479P0225
16471A454481k08891N0941L05322l47704m3519K8828j81208J27348K25930j82610
16461A228918L60910q0652j82917J12814J9390k07221k18593K45550k2972L0367
16451A285594q2281J4058k6886K95191n13473L09978m07501M39427k67169L369
$$ y = [2444234, 1914449, 2278855, 2114948, 2304395, 2106235, 1911672, 1884769, 2222950, 2010851, 2085015, 2154199, 2231519, 2203669, 1784322, 2179394, 1954455, 2091444, 1651620, 2124505, 1641217, 1843979, 2274255, 1502574, 1532440, 1826927, 2166981, 1829271, 1812248, 2188160, 1598910, 1497223, 1506129, 1902916, 1793587, 1649519, 1234053, 1275693, 1721632, 1611423, 1280049, 1361766, 1596418, 1665073, 1258406, 1800690, 1488863, 1363502, 1353777, 1384256, 1454481, 1245590, 1296531, 1601853, 1254149, 1210630, 1239458, 1058250, 1185598, 1411528, 1228918, 1589828, 1509176, 1326259, 1439073, 1458463, 1251242, 1032649, 1278199, 1255227, 1285594, 1203313, 1217371, 1190485, 1485676, 972203, 1282181, 874680, 1314107, 1046938, 1050307]
16441A050307K3755P3322l50875K58047K60966K1809k49921k4038j23815J07441
16431A046998k23328N11521k08913j7108j18600k91652K62439K51146j81235r9642
16421I31626j0684M14983l12795k43440m6109L47626k72506K7077l25357L21311
16411H31732J46833j1206k02698L05296J96454p2930m74070K78068j8984j87835
16401G90660o8464M00697j85744j08271r792K2351l3797j01036K11091J84081
16391A101776l76612M7598J63421j16214R1896j00809j01280J64749j0031n4874
16381H09620l67495K96877n170n3085K75805k83656K6229q5465J30676Q7723j07892
16370G24167C03923L76698L05068D62653L17855B77768L70804J18411k18584K41249
$$ y = [1050307, 1074062, 1147384, 796509, 1054556, 1315522, 1337331, 1087410, 1063372, 939557, 1046998, 823670, 1335191, 1126278, 1109170, 990570, 698918, 961357, 1212503, 1031268, 931626, 920942, 1335925, 1023130, 779690, 733581, 1081207, 808701, 835778, 510421, 831732, 978565, 967359, 764661, 1069957, 1266411, 1193481, 719411, 997479, 978495, 790660, 722196, 1122893, 937149, 828878, 819086, 841437, 807640, 706604, 917695, 1101776, 725164, 772762, 936183, 819969, 911865, 811056, 709776, 874525, 864494, 809620, 442125, 739002, 733832, 680747, 956552, 672896, 699125, 613660, 744336, 832059, 724167, 303923, 680621, 985689, 462653, 780508, 277768, 648572, 766983, 548399, 789648]
16360G89648k710l27646K20186j81470l4071k27107K99212N5177L26394j91395
16350G26218l04471K11471J69668j51662L67927m54416L7839L09879j58435l47937
16340D06081J29406L52962D42620j45272j06761J57987L19075N8497k94604j04813
16330C26729r1052M84039k60042r6708L5333R658n9204J56092K88206k84341j78102
16319C30608L10373p8696k08056N56441k08268k03037k04117M22737K8899C58508
16308C98345J63326k05528J02548M12776D19554l1557L2253j4180m873k4115K22069
16297E99151n3126K55183k83405N153q8315O6489j51575K02610l6382j93781N18545
16286H40547D6190L64157l7619L18639j71310n9646k3100Q3543F2756L87078j27485
$$ y = [789648, 786938, 459292, 679478, 498008, 463937, 236830, 536042, 591219, 917613, 726218, 421747, 633218, 802886, 651224, 1019151, 564735, 602574, 912453, 754018, 406081, 535487, 888449, 442620, 297348, 190587, 348574, 667649, 726146, 431542, 326729, 235677, 719716, 459674, 362966, 398299, 407957, 348753, 504845, 793051, 508710, 330608, 640981, 562285, 354229, 910670, 702402, 499365, 295248, 717985, 746884, 358508, 398345, 561671, 356143, 458691, 871467, 419554, 387997, 420250, 406070, 401197, 377082, 599151, 546025, 801208, 517803, 522956, 434641, 501130, 349555, 552165, 515783, 322002, 840547, 46190, 410347, 372728, 691367, 520057, 460411, 437311, 520854, 62756, 449834, 322349]
16275C22349Q0923M6060A87696J55096J56117J16828k28569j84886K26123q3300
16265C45105n5955K49826k51050M4532Q0209j04632K41686r0206B23533E8770
16254C21493j05621J36305J13942M6553A86750L65648k13845J1396p4541o3139
16244B12269P3873J40149F1703K20884O4918p3549H9819J11317M01175j98304
16234D04007A61380J23963A26394L00394B04013q8019L40837k28413p7008K32118
16224C83528J94761j76274K42112a44535C5744M28010A35465D6492K07786J64377
16214D18655A2254N68422G5053J42376K45148j35917M4783A69857J49544k9723
16204B89678K80498j243j73016K2528j14380A19650M10696a00469D01413J10475
$$ y = [322349, 403272, 449332, 187696, 342792, 498909, 615737, 387168, 202282, 428405, 345105, 289150, 538976, 287926, 332458, 412667, 308035, 549721, 459515, 223533, 58770, 321493, 215872, 352177, 466119, 512672, 186750, 552398, 338553, 349949, 275408, 212269, 286142, 426291, 61703, 282587, 347505, 273956, 89819, 201136, 602311, 404007, 161380, 285343, 126394, 426788, 204013, 115994, 456831, 228418, 151410, 383528, 578289, 402015, 644127, -144535, 35744, 463754, 135465, 46492, 254278, 418655, 12254, 580676, 75053, 217429, 462577, 326660, 371443, 169857, 319401, 289678, 570176, 568933, 395917, 418445, 304065, 119650, 530346, -100469, 401413, 511888]
16194E11888I5856K82441Q2358j61013A10381L29682a12112C52162G4167K63132
16184C37299A55743L9172m041M4213O1304J18120B04373F3869M51825k21013A36860
16172D23051A81057J10554j3759A7659Q5526L076j1026J65134L6803k1870J36143
16161D11445A09531J02426L3077o0842K31800j29771J07799D4998K5004L03694
16151C73696A64009m1745d6186I8027J41854N252O6503B8037m324M56261f6120
16139a5300G1844J15639K7385a79167G6416A9693c4547k3843A20325J35770r0946
16128A65149K61275A87411m9954n7038a00297B95131h5714D3384K25609g3031
16117B05143b32398A7431a56169C0813J94642b58309a0758B45945a78122H4660
$$ y = [511888, 95856, 378297, 460655, 299642, 110381, 440063, -112112, 352162, 74167, 337299, 155743, 194915, 190874, 235087, 296391, 414511, 204373, 63869, 515694, 294681, 136860, 423051, 181057, 291611, 277852, 17659, 103185, 106261, 95235, 260369, 297172, 275302, 411445, 109531, 211957, 245034, 184192, 415992, 286221, 394020, 44998, 70002, 373696, 164009, 122264, -46186, 98027, 239881, 245133, 311636, 28037, 23713, 479974, -66120, -15300, 71844, 187483, 214868, -179167, 76416, 19693, -34547, -58390, 120325, 256095, 165149, 426424, 187411, 137457, 80419, -100297, 295131, -85714, 43384, 268993, -73031, 205143, -232398, 17431, -156169, 30813, 225455, -258309, -10758, 245945, -178122, 84660]
16106C09023a14561B10575F4297O1853N53078B19588b34329f936B66566p5327
16096A91239J1245r3107j5442J8011a71652A19949K3605i102k67446E9584R1322
16085A50906n3799D7321J07147J68458A54218k2425K85921D0542K31541a72633
16074I1843n824a12943I7853l8733b5446j01171B33649b50847B20990p1805n8607
16063I0578J75203d2060F0096a72428A44647a96100O4313k08563I6533K7404J88749
16052C12686a66741A62396G6802c7101B48738A22501M6969D2354Q9788J0708K55460
16041C98310l9699a62827A75548l1747b5576A45132c09501A56822p3810d8819
16030H2341J20118R566J46020k3144b90951B70463C2917a01107C6624b614A09365
$$ y = [309023, -114561, 210575, 64297, 126150, 679228, 219588, -234329, -6936, 266566, 191239, 202484, 109377, 93935, 111946, -171652, 119949, 143554, -9102, -276548, 59584, 150906, 97107, 47321, 154468, 322926, 154218, 131793, 417714, 40542, 272083, -172633, 91843, 86019, -112943, 97853, 59120, -25446, -126617, 233649, -250847, 220990, 149185, 90578, 265781, -42060, 60096, -172428, 144647, -196100, -131787, -340350, 96533, 123937, 312686, -166741, 162396, 76802, -37101, 248738, 122501, 169470, 42354, 132142, 142850, 398310, 358611, -162827, 175548, 143801, -25576, 145132, -309501, 156822, 83012, -48819, 82341, 202459, 212025, 358045, 334901, -290951, 270463, 32917, -101107, 36624, -2614, 109365]
16018d9719A48935e23328C70268c83446g8537C77280N6901E1332K53104a4384
16007f842l05331A35949d7717a5870A21922j3496k3000J17388b2868A54503h4341
15995A29368C1105N2748J60499J79012j96155C1544g7807J7677D58926N03591
15985I62517j29415k0976M29203j66378j99111C58650j21379L3763C1311L05998
15975C37309A61862K25538N2694f2726B13293c24152D8008O5446m4179F166J08057
15964A14223g5876A29603a03282b5588A69536f7410H4106J08601J82520H894a00268
15952a27031f0286B8196b14408A84452N0254A9169a72192q8753B34411B2074J72091
15941A94165a08071c7005g303A45474A1506f7939j2925A19794b25962d188j13173
$$ y = [-49719, 148935, -523328, 370268, -383446, -78537, 377280, 434181, 51332, 304436, -14384, -6842, -312173, 135949, -47717, -15870, 121922, 108426, 85426, 202814, -22868, 154503, -84341, 129368, 31105, 83853, 244352, 423364, 227209, 31544, -77807, -60130, 458926, 962517, 833102, 812126, 1241329, 1074951, 875840, 358650, 237271, 271034, 31311, 337309, 161862, 387400, 440094, -62726, 213293, -324152, 48008, 113454, 69275, 6166, 114223, -75876, 129603, -103282, -25588, 169536, -67410, 84106, 192707, 375227, 8894, -100268, -127031, -60286, 28196, -214408, 184452, 234706, 19169, -172192, -260945, 234411, 22074, 194165, -108071, -37005, -7303, 145474, 11506, -67939, -80864, 119794, -225962, -4188, -117361]
15930a17361A3968a9872j61081I4570e783j24927d5926q3299B42861k0654C8425
15918b89797B24934b33585b5417B0406K42929b75987M902A91687G1130J99347
15908B70477m7693f1891J7342j14046f6246A15701g7662K2666n2562A85709H144
15896F0399J29530d2272E9734i338A22640b3848n6185a6788l78175h8436H8932
15884D3428A4411J6533a2654j27068C63151j71282a6218D472a36172A14270n6084
15873E8186Q2538o7455J26241i3714D5996b48344h2375j56171A63161G8200a21740
15861a06255C5938a29968k6673k84486C12081j49652a18332A6735a39204D1426
15850B48128B7433J15360i1934m766A43765M3521r2169h4081A99145q251i3604
$$ y = [-117361, 13968, -19872, -180953, 94570, -5783, -130710, -45926, -129225, 242861, 222207, 38425, -289797, 224934, -233585, -25417, 20406, 263335, -275987, -271085, 191687, 71130, 270477, 222784, -61891, -44549, -158595, -66246, 115701, -77662, -54996, -107558, 185709, 8144, 60399, 189929, -42272, 59734, -9338, 122640, -23848, -80033, -16788, -394963, -88436, 88932, 43428, 14411, 30944, -12654, -139722, 363151, 191869, -16218, 4472, -136172, 114270, 58186, 140724, 73269, 199510, -93714, 45996, -248344, -82375, -238546, 163161, 78200, -121740, -106255, 35938, -129968, -156641, -441127, 312081, 162429, -118332, 16735, -139204, 41426, 248128, 27433, 142793, -91934, -96700, 143765, 187286, 95117, -84081, 199145, 190894, -93604]
15838A09298c07053F3457a39567j81933A34392c88073a43820N3050B15586e7502
15827B73734g9080B32578B7019P0398g9195j0286H8602M9565L045m1106a5829
15815a24171p786C9624c4124l7608j07157H3049k0304J10607C8199d3359A39632
15803a75733n8912C17382h1269A34100J80111A12540A9856L6104A560J52354k2496
15792A31418h7888I3703N422b47367J16012j7172B87260a78460A1899J16918k3806
15781A05011j5935b40236K2201J9967i6068j35623A91544O1929i8701q6167N4749
15770a30119A91905a44455j39852k3184A13856J36027B0634a29552o8412A10297
15759b1168A95019e2208A30322c76190c6422G275J46265k2881c6211D5649J22278
$$ y = [109298, -307053, 63457, -139567, -321500, 134392, -388073, -143820, -90770, 215586, -57502, 273734, -79080, 232578, 27019, 97417, -79195, -89481, 88602, 138167, 141212, 100106, -15829, -124171, -131957, 39624, -34124, -71732, -178889, 83049, 62745, 173352, 38199, -43359, 139632, -175733, -234645, 317382, -81269, 134100, 314211, 112540, 19856, 55960, 1560, 153914, 131418, -87888, 93703, 99125, -247367, -131355, -148527, 287260, -178460, 11899, 128817, 105011, 89076, -240236, -218035, -198068, -96068, -231691, 191544, 253473, -98701, -184868, -130119, 191905, -144455, -284307, -307491, 113856, 249883, 20634, -129552, -197964, 110297, -21168, 195019, -52208, 130322, -376190, -36422, 7275, 153540, 130659, -36211, 45649, 167927]
15748A67927a02324A38015b82382C12039j51680a60178L8978j06687c6487B4926
15737b02498a7597C52495A02764a68055B39541b35357A24828D9259O38541a61970
15726e9121G9709b15020e7174n0745l12690a36084M9932I762b68548A17135a5078
15714B82910b50885G6248L3361a33647B09486o9238b06710R4620a8102A65603
15703a94604J7895n3704J06671A51375o8611b11330i5006d7187N446D0175J87908
15692B28083D1819b34735A52966L57145E0398n35a25911c3566A71302D0081b66673
15680d6753k21176n2759e8541B59845J15719B5687K49032f9567k1183D6601e1492
15668E4255g5272C5800L3210h2092C57130c0718J4592l30196i5142C73992b47564
$$ y = [167927, -102324, 138015, -282382, 312039, 160359, -160178, -121200, -227887, -36487, 24926, -202498, -17597, 352495, 102764, -168055, 239541, -235357, 124828, 49259, 687800, -161970, -59121, 79709, -215020, -57174, -107919, -420609, -136084, -86152, 9762, -268548, 117135, -15078, 282910, -250885, 76248, 109609, -133647, 209486, 140248, -206710, -112090, -18102, 165603, -194604, -176709, -230413, -123742, 151375, 82764, -211330, -95006, -47187, -41741, 40175, 228083, 41819, -234735, 152966, 510111, 50398, 49863, -125911, -33566, 171302, 40081, -266673, -46753, -267929, -320688, -58541, 259845, 375564, 25687, 274719, -69567, -90750, 46601, -51492, 54255, -75272, 35800, 69010, -82092, 357130, -30718, -16126, -346322, -95142, 373992, -247564]
15656a57160B44307F9375M2500f2711A44978b33043j63391a64119m3513a5784
15645b45754F5357f8331E9932b75868R4716B8925j2885a01388n6881P2589n2535
15634a38215A31285c46763N3684C8559a4942j30320j74397A4493N4177c7224C13775
15622B92355A33775d04866A2652a62623G2900b07972B13144J45372j55059H9310
15611I8753a54509A28989A6919P5420a0483A37801m7819d54515a7283r6569a5884
15599A3575b29785B0897h7089j46164G7010c84808A54861c65384h5185D0815f549
15587F3739J57599E1891J70075L4328c30539A95218J11579A16985a6542B20284
15576d3876B08482c4849F2336K181R050a56794g5895L5211j08279L455B78541
$$ y = [-157160, 244307, 69375, 111875, -62711, 144978, -233043, -396434, -164119, -207632, -15784, -245754, 65357, -68331, 59932, -275868, -181152, 28925, 16040, -101388, -158269, -85680, -138215, 131285, -346763, -293079, 38559, -14942, -145262, -319659, 14493, 68670, -37224, 313775, 292355, 133775, -404866, 12652, -162623, 72900, -207972, 213144, 358516, 203457, 89310, 98753, -154509, 128989, 16919, 92339, -10483, 137801, 89982, -454515, -17283, -113852, -15884, 13575, -229785, 20897, -87089, -233253, 77010, -384808, 154861, -365384, -85185, 40815, -6549, 63739, 221338, 51891, 221966, 256294, -330539, 195218, 306797, 116985, -16542, 220284, -43876, 208482, -34849, 62336, 64517, 73567, -156794, -75895, -40684, -148963, -145508, 278541]
15564G6756K48188a3821l44406B62207a67320e4943F9159L5812a11568D5652l79
15553D5273d32612C3282a04076M316C80383E6080a54900d0967A8754J25944m025
15542A40673k2246a86960j36570a38582n5693h9218j39508B5897M64856A22299
15531e734o6002B32360K2374H1564k8599b77513A60940C3321k878a83329B80901
15519A95667K09604A3767K8957L8922J49233J15497c0963F27541b09611D32333
15508D2755Q4131J74310a49874e1695B44979f603A56605K68276j51433A19927
15497B20046r1485J27586h9516C25562C6543a03692A4495N8938a98042e6038Q070
15486d7968B52021O0844a47601a936A57212G1301a59037A26646Q8458b26731C96244
$$ y = [76756, 324944, -13821, -358227, 262207, -167320, -54943, 69159, 104971, -111568, 45652, 45273, -432612, 33282, -104076, -99760, 380383, 56080, -154900, -40967, 18754, 144698, 140673, 118427, -186960, -323530, -138582, -194275, -89218, -228726, 25897, 490753, 122299, -5734, -71736, 232360, 254734, 81564, 52965, -277513, 160940, 33321, 30443, -183329, 280901, 195667, 405271, 13767, 42724, 81646, 230879, 346376, -30963, 627541, -209611, 432333, 42755, 126886, 301196, -149874, -51695, 244979, -6603, 156605, 424881, 273448, 119927, 220046, 128561, 256147, -89516, 325562, 36543, -103692, 14495, 73433, -198042, -56038, -47968, 252021, 312865, -147601, -1936, 157212, 71301, -159037, 126646, 215104, -226731, 396244]
15474E38877n2205B42866O27877j56489l39339H3075J67599b525C3292r534L3185
15463E6943j3771i0450A70030L206n6901a22314D05536d8929A28791J12775D0549
15451B67950r2815a33100E2322j1251L03784j69417q3585M55455l0050K66064
15441G83322K29060L60418o7266m41585B98816J76062j91352j04556C071L43786
15431C46857b30592H7163f6169F1432L3950c7890I0209J16686J04973F9857H598
15419d011B05961d5310B9280P4774a85655j01997A3688f3724k61179A29936B2427
15407c3601r2677M6975j25122I588b6772E1473e2911j61645d8220B36343C2271
15395A04271g6860B01287c988A59634k8617D1785a67j90987C13777a78440B0895
$$ y = [538877, 486672, 242866, 870743, 714254, 374915, 83075, 250674, -2525, 33292, 23758, 56943, 43172, -90450, 170030, 173236, 116335, -122314, 405536, -48929, 128791, 241566, 40549, 267950, 175135, -133100, 52322, 41071, 344855, 175438, 91853, 547308, 517258, 783322, 1012382, 1372800, 1305534, 863949, 298816, 474878, 283526, 178970, 3071, 346857, -230592, 87163, -66169, 61432, 95382, -37890, 90209, 206895, 311868, 69857, 8598, -4011, 205961, -45310, 29280, 104054, -185655, -287652, 13688, -63724, -324903, 129936, 22427, -33601, -126278, -79303, -204425, 9588, -26772, 51473, -52911, -214556, -48220, 236343, 32271, 104271, -76860, 201287, -3988, 159634, 131017, 41785, -167, -191154, 313777, -178440, 20895]
15383A23379Q8783J23150a76533f3873p3674j44438Q2106i5601D42598g9298B37884
15371A33194K85289q5668a78715C9064J55918C1251A4740O2164O3859J95035E8814
15359E4270Q6344R1961m024D4346K02463k6590I5219a48437A79760L9307c2904
15347C16024m5906j3132Q5068K5422Q644p7653M10334C14420O2101n7386H7350
15335C42560n0025o6043c0986E6271p804q016j7916K12594m2086K20958A62281
15323f7260C10385Q7182b32524B00676M3068i59B71350L60912D2109K93620a96889
15311B73500E4199b8646A00987J12376H2454m915J39463R5150j04402K3247N9063
15300B90060N5621b63461B36903G9849b65907E0649K69864c5869G8019K6356c24701
$$ y = [123379, 212162, 335312, -176533, -63873, -137547, -281985, -199879, -95601, 442598, -79298, 237884, 133194, 418483, 332815, -178715, 39064, 194982, 31251, 14740, 76904, 140763, 335798, 58814, 54270, 140614, 232575, 228551, 44346, 246809, 220219, 95219, -148437, 179760, 219067, -32904, 316024, 270118, 256986, 342054, 367476, 376120, 298467, 708801, 314420, 376521, 319135, 87350, 342560, 292535, 226492, -30986, 56271, 48467, 40451, 22535, 235129, 193043, 414001, 162281, -67260, 310385, 397567, -232524, 200676, 243744, -959, 271350, 632262, 42109, 335729, -196889, 273500, 54199, -28646, 100987, 213363, 82454, 77539, 217002, 312152, 207750, 230997, 290060, 345681, -263461, 236903, 79849, -265907, 50649, 320513, -35869, 78019, 104375, -324701]
15288I0913R5628a25409A2138A041K01861j5729P3848a2110A06057b67328G9370
15276a32980C33741b4770l0256f39j49008D71619a29677H6746K48784A08957A0394
15264b36662A12615J0525J33900a33028k64362A42364a43950B53725D6379b09089
15253f2208A84199p8987M4673a20856k15036j39116I5078J64789r2784H2247N00405
15242E82652N3000J133995M42087p15594O52156q58933C07336n0838j1196B9900
15231B8283E103K75175A4242P1511c47724c5143A41133b5362A62437C7140J27776
15220A64916J13471A35983L9824J27299A08188k0336c6168j99866C30163B1981
15209H7222c37222J42676B6820J64827a44811B44274I7070a12509B2570b37437
$$ y = [90913, 186541, -125409, 12138, 1041, 202902, 187173, 261021, -12110, 106057, -267328, 79370, -132980, 333741, -24770, -55026, -639, -149647, 471619, -129677, 86746, 335530, 108957, 10394, -236662, 112615, 123140, 257040, -133028, -397390, 142364, -143950, 253725, 46379, -209089, -62208, 184199, 105212, 149885, -120856, -335892, -475008, 95078, 259867, 167083, 82247, 582652, 635652, 1769647, 2211734, 1496140, 2148296, 1289363, 307336, 256498, 245302, 29900, 28283, 5103, 280278, 14242, 85753, -347724, -35143, 141133, -25362, 162437, 37140, 164916, 278387, 135983, 175807, 303106, 108188, 87852, -36168, -236034, 330163, 21981, 87222, -337222, -194546, 26820, 191647, -144811, 244274, 97070, -112509, 22570, -237437]
15198B57693R6916D8756g5008B78530J04466j25292d9439j37778A91690q2858
15188A08832Q4315J07668G2019N8034c5754C6241J5538J20340C3334K84790j47233
15177A70891d17172a10389A59824n1086k258D2675J25890a12341J7165A93185
15166c7617F542R9182n2585Q2005b0974B65310f9720D0874i6868d8231B80843
15154A58585l3317c69469C20158j15509g4265C09858e2951b2287B40723a2750
15143f5425F7411e0689I8489J91882a3322A19762f868k3062A7747J16780E5421
15131G6170K00201A1140J68481B2137a85236B46269F9872J12159i9000A35111
15120A39565B77N27082j76041j05027K72947j84671j57763j4073O5584J43949
$$ y = [257693, 354609, 48756, -75008, 278530, 382996, 257704, -49439, -187217, 191690, 108832, 193147, 300815, 72019, 130053, -35754, 36241, 51779, 172119, 33334, 318124, 170891, -417172, -110389, 159824, 108738, 106480, 42675, 168565, -112341, -95176, 193185, -37617, 6542, 105724, 53139, 135144, -20974, 265310, -69720, 40874, -96868, -48231, 280843, 158585, 125268, -369469, 320158, 204649, -74265, 309858, -52951, -22287, 240723, -12750, -65425, 67411, -50689, 98489, 290371, -13322, 119762, -6868, -29930, 17747, 134527, 55421, 76170, 276371, 11140, 179621, 22137, -185236, 246269, 69872, 182031, -99000, 135111, 139565, 277, 527359, 351318, 246291, 519238, 334567, 176804, 162731, 228315, 372264]
15110C72264j49171a52118C59785A20379J49620a38467B18910P4170j32589c9652
15099a07744G8703M02032B12316k5513g2239A67052p6407b79086H1594b85323
15088C18691A56936J56722N7334j04294J82017A52909J82151A22497a898C63110
15077A08479R1228A5135Q4880K70024A25173K949D4323M8084K2006J64791O673
15066B85877o8868a77324A22223L67935g6417C26642R165K22897k35306K69778
15056E93176k62074A23209J28544J35960J49861B61067J17337j69059N31021A44654
15045C87148N6129A72693M3435K86113p63j95004J45628A77153H5344L61964p0306
15034C77002j76149N07216n3110B54216M70228p0698J81445j93394J8203J94554
$$ y = [372264, 223093, -152118, 359785, 120379, 269999, -138467, 218910, 293080, 160491, -39652, -107744, 78703, 480735, 212316, 186803, -72239, 167052, 90645, -279086, 81594, -285323, 318691, 156936, 313658, 370992, 266698, 448715, 152909, 335060, 122497, -1898, 363110, 108479, 199707, 15135, 100015, 370039, 125173, 128122, 44323, 92407, 114413, 279204, 285877, 217009, -177324, 122223, 490158, -76417, 326642, 335807, 558704, 323398, 593176, 331102, 123209, 251753, 387713, 537574, 261067, 378404, 209345, 740366, 144654, 387148, 443277, 172693, 216128, 502241, 501478, 306474, 452102, 177153, 85344, 447308, 377002, 200853, 708069, 654959, 254216, 724444, 653746, 835191, 641797, 660000, 854554]
15024H54554A81440J75841K65131k75026J3207L02015q6464r8649k16026A09430
15013F23375C05156K63404j64282o903J57423K12983O1617C20632J22844A42192
15002A60409J25988K1890J33370L97943m5839k52913M1262B57213J41333j11110
14992B87436F9051L45836K44689j53089P201K86757l77259L07299l00301J99760
14982F29944P1134J46203L34984l10148J42178l02827B32944O09100k25481n1804
14972E64759J06186M38385m06456k69880K987J5842A13212K1297K742O7336j0681
14961A93906O0317Q7824N9445k00253K4140M07351j95905P0708r7162L50903l15616
14950D45658A08291M16788k61747K01136j70260n3587M46690N11J58781j26976
$$ y = [854554, 181440, 357281, 622412, 347386, 360593, 662608, 576144, 477495, 261469, 109430, 623375, 305156, 568560, 404278, 397375, 554798, 767781, 829398, 320632, 443476, 142192, 160409, 286397, 308287, 441657, 839600, 793761, 540848, 582110, 257213, 398546, 287436, 69051, 414887, 659576, 506487, 513688, 800445, 423186, 730485, 430184, 629944, 701078, 847281, 1182265, 872117, 1014295, 711468, 232944, 842044, 616563, 564759, 670945, 1109330, 702874, 432994, 435981, 451823, 113212, 134509, 137251, 204587, 193906, 254223, 342047, 401492, 201239, 225379, 632730, 436825, 507533, 410371, 761274, 445658, 108291, 525079, 263332, 464468, 294208, 240621, 687311, 687822, 846603, 719627]
14940G19627l37905K08331r9376l3218J5350j20459K37214J53106R3529K84052
14930A120251j75633M68398j90289K70623l2385L99555k51813J96144N0895l68226
14920A487520J97713K4174M01047J83102M94758k28874n52137n44877j07910l05451
14910A049065j572l01092l4288k20231M1489j15922K35074j85876J5845r277k59
14899D72956B35902M08876k47867M23741B72244J60666J64784k17572n5679N4494
14889C78937K32153m3024J48694j56511L38577p3172J69180R7371j25997J03080
14879A069288j53923j87659J35457l01291j12900J409J44034J55755k26036L1698
14869E55832O6150j85696J2665L86664o640o0924J9869q1808j24142m2013j21635
$$ y = [719627, 381722, 590053, 490677, 457459, 472809, 352350, 589564, 742670, 836199, 1120251, 944618, 1413016, 1222727, 1493350, 1460965, 1860520, 1608707, 1804851, 1855746, 1487520, 1685233, 1709407, 2110454, 2293556, 2788314, 2559440, 2007303, 1462426, 1354516, 1049065, 1047493, 746401, 712113, 491882, 533371, 417449, 652523, 466647, 482492, 473215, 472956, 235902, 644778, 396911, 820652, 272244, 432910, 597694, 380122, 324443, 378937, 611090, 568066, 716760, 560249, 898826, 825654, 994834, 1092205, 966208, 1069288, 915365, 727706, 863163, 561872, 448972, 450381, 594415, 750170, 524134, 555832, 621982, 436286, 448951, 835615, 828975, 768051, 787920, 706112, 581970, 539957, 418322]
14858D18322J19127j91606p7100J37031k01872K61442j53961J45215J63209J02445
14848G22252k5834p6493J2927J06217L25742M4708N26834n41196K64658n08451
14838H51364j1052K99515j42251r106j66717l5674j31606j45844j7182M22925
14828I14372q6281j38141j74809J12763Q2449J36128r0260p6758o7232J63890
14818G76121J83911r8419k4531r9034J40810C14778M18567l65463M67486P9584
14808I14952k79945j71309K58813M32188l89793L64723n09391o0975K99269O6161
14798I24693D60519j37965L60573q6726p665j86669L10251J28697j39942j41632
14788E59441N5915J02629K18601m08536K75215j92660J99785j71920P1316J33698
$$ y = [418322, 537449, 345843, 268743, 405774, 203902, 465344, 311383, 456598, 619807, 722252, 696418, 619925, 632852, 739069, 1064811, 1109519, 1636353, 1095157, 1359815, 851364, 840312, 1139827, 997576, 988470, 821753, 786079, 654473, 508629, 491447, 914372, 828091, 689950, 515141, 627904, 710353, 846481, 756221, 679463, 612231, 776121, 960032, 861613, 837082, 738048, 878858, 314778, 733345, 367882, 835368, 914952, 635007, 463698, 722511, 1154699, 764906, 1129629, 620238, 559263, 858532, 924693, 460519, 322554, 683127, 596401, 588736, 402067, 712318, 841015, 701073, 559441, 615356, 717985, 936586, 528050, 803265, 610605, 810390, 638470, 709786, 843484]
14778H43484N2682j3570j94579L29235J69681l92748j24358j06917K11093O6146
14768H40149k0794j02376J03838j15892j94738M33972m02559L10349j86299L15761
14758I81411D19776N09016l10821j96523J39420j11697L21299j51896j62799o069
14748D49706M97176k64500J54701K24293C65282L09353J27206R8390k54850L31896
14738I77277K04232n46086J65758m2477J55979J75085j91310K2425M73887m45078
14728I49692P66665o5541N00490l57307j7290k45716k07214k69432P6741k80361
14718H50727K66267m24041N56308m15922j55064J33203J87726J77675k87742j5350
14708H73787L97793j84855K9017K24155j65345N0813M52880L83290R716j56596
$$ y = [843484, 896166, 882596, 688017, 1017252, 1186933, 794185, 669827, 562910, 774003, 840149, 819355, 716979, 820817, 704925, 510187, 944159, 541600, 851949, 665650, 981411, 419776, 928792, 617971, 421448, 560868, 449171, 770470, 618574, 455775, 449706, 946882, 682382, 837083, 1061376, 365282, 674635, 801841, 900231, 645381, 977277, 1181509, 635423, 801181, 758704, 914683, 1089768, 898458, 920883, 1394770, 949692, 1716357, 1650816, 2151306, 1793999, 1776709, 1530993, 1323779, 1054347, 1131088, 850727, 1116994, 692953, 1249261, 833339, 678275, 811478, 999204, 1176879, 889137, 873787, 1271580, 1086725, 1115742, 1339897, 1174552, 1225365, 1678245, 2061535, 2071251, 1914655]
14698A914655l09777m80595Q8115m9184j21181K2563L4790l11436L21480m10206
14688F99224J90061k3558K41825j45848M9619m52817L69702Q6307m69842K66108
14678H10781L66540m01764L8626J189N07287o05996N53895k68566J04193l03211
14668H02974L20986r2958M9527j16567k4659J38667Q6780Q1409k97091Q4345J75210
14657A208623k60132K36205m897l0416K22606R8986l11526K06955k06861N18163
14647A677706n62496K55547k19432J03323N5858l52783J49037O5642K34676j50549
14637A256529o2120j09852J90099K06327n154j86731l06314N83055p8043n2218
14627A435578r1752L02262k52136p7771k32675N88061m49183M53737k37834M0208
$$ y = [1914655, 1604878, 1124283, 1212398, 1163214, 1042033, 1064596, 1099386, 787950, 1109430, 699224, 889285, 865727, 1107552, 961704, 1011323, 558506, 928208, 1014515, 544673, 810781, 1177321, 775557, 814183, 815372, 1322659, 716663, 1270558, 1001992, 1106185, 802974, 1123960, 1031002, 1080529, 963962, 939303, 1077970, 1164750, 1246159, 949068, 1033413, 1208623, 948491, 1184696, 1179799, 1149383, 1371989, 1470975, 1159449, 1366404, 1159543, 1677706, 1115210, 1370757, 1151325, 1254648, 1310506, 957723, 1106760, 1172402, 1407078, 1256529, 1194409, 1084557, 1274656, 1480983, 1475829, 1289098, 982784, 1565839, 1487796, 1435578, 1343826, 1646088, 1393952, 1316181, 1083506, 1671567, 1222384, 1676121, 1438287, 1478495]
14617A478495J83001j05842k4010j68607N2609M1705k67983K18727Q1600r7497
14607A392198p881J11961J4121K0977q180K48108j86239j04304M84426J735m57631
14596A509291M8181O6081J56781J14441k08648L91304l54526P2330L96091m66020
14586A725306Q6266O6347k88458L61637j53411L30339k15526K67016k94694R2566
14576A977388L45463k80532J9117J8903J8451m0015R9632K2105L47540j72547
14566B355505l82409N17357N1478R2277O435K55508l21868J19391Q9127M42117
14556C224918K6598J68652K19191N3917K15368Q31361N72509J613233L073582
14547I999329P490404J8074783J0513038B1534547I744363m440001j735335k97318
$$ y = [1478495, 1661496, 1555654, 1531644, 1363037, 1415646, 1457351, 1189368, 1408095, 1489695, 1392198, 1384317, 1496278, 1510399, 1531376, 1523196, 1771304, 1585065, 1480761, 1965187, 1966922, 1509291, 1557472, 1623553, 1780334, 1894775, 1686127, 2077431, 1722905, 1795235, 2191326, 1725306, 1811572, 1877919, 1589461, 1951098, 1797687, 2128026, 1912500, 2179516, 1884822, 1977388, 2322851, 2042319, 2061436, 2080339, 2098790, 2058775, 2158407, 2180512, 2528052, 2355505, 1973096, 2490453, 2541931, 2634208, 2640643, 2896151, 2574283, 2693674, 2782801, 3224918, 3251516, 3420168, 3639359, 3693276, 3908644, 4740005, 5312514, 6925747, 9999329, 17489733, 35564516, 46077554, 21534547, 9744363, 5304362, 3569027, 3271709]
14539C271709q16168O93671O34750K096251k486135q28282n5875j96664l66419
14530A946838O8466K14681q7880K43047j30315J22950o1871m96946N59390K32853
14520B611213m29049M35169k82900J77904q8785K85969Q7218j50856p3795K20464
14510B792552k4133k2q8264J15114K5039j35116L29925R2308N8001n7934k7889
14499C079581J79656k21728J70495J11294K13489j30507j39055j37287K38485
14490C364423j12613J52982L03524m23363M81844l06786M84735n45937M32748
14481C831557j0512j30651r9861N67191L7690r8965j14404o7295K89694r090o4657
14470D130697K73733j59024j22531L94177k27900N50138j72281j46202k1294L76051
$$ y = [3271709, 2455541, 3149212, 3783962, 5880213, 3394078, 2565796, 2509921, 2313257, 1946838, 2015304, 2229985, 2142105, 2385152, 2254837, 2377787, 2315916, 1818970, 2378360, 2611213, 2182164, 2617333, 2334433, 2512337, 2423552, 2709521, 2796739, 2645883, 2572088, 2792552, 2768419, 2768397, 2680133, 2795247, 2820286, 2685170, 3015095, 3107403, 3165404, 3107470, 3079581, 3259237, 3037509, 3208004, 3319298, 3532787, 3402280, 3263225, 3125938, 3364423, 3251810, 3404792, 3708316, 3284953, 3766797, 3460011, 3944746, 3398809, 3831557, 3821045, 3690394, 3590533, 4157724, 4195414, 4096449, 3982045, 3914750, 4204444, 4195354, 4130697, 4404430, 4245406, 4122875, 4517052, 4289152, 4839290, 4667009, 4520807, 4499513, 4875564]
14460D875564O3494J88525n70161M42981J33591n6734j22891L04631n7132K3336
14450E225204J55068L41945J08962m03813K15484J10469J24210M93313m77558
14441E893284k0029P3696K8604K88716M883L32152J94378m20095Q2328L02034
14431F759951J15189L38667K7217k40576M75914r2528J37139K20457O3370L02696
14421H107496L7856L66850J52136k96058M73097p5519Q200J42930P7233k34750
14411H759471K95232R5440J51740n264N19782L68031M8441N10451k87059K00564
14401A0656829j50687K8424J4917L93866J12941K51738j44726P44004r0498M71737
14391A2288545m3108K62857J27555K35972R952P52755L44141L40916K5629K98268
$$ y = [4875564, 4939058, 5127583, 4557422, 5000403, 5133994, 5077260, 4954369, 5259000, 5201868, 5225204, 5380272, 5722217, 5831179, 5427366, 5642850, 5753319, 5877529, 6370842, 5893284, 5873255, 5946951, 5975555, 6264271, 6269154, 6601306, 6795684, 6375589, 6457917, 6759951, 6875140, 7213807, 7241024, 7000448, 7476362, 7383834, 7520973, 7741430, 7804800, 8107496, 8145352, 8512202, 8664338, 8368280, 8841377, 8765858, 8774058, 8916988, 8994221, 8759471, 9054703, 9150143, 9301883, 9296619, 9816401, 10184432, 10232873, 10743324, 10456265, 10656829, 10506142, 10534566, 10549483, 10943349, 11056290, 11308028, 11163302, 11907306, 11816808, 12288545, 12245437, 12508294, 12635849, 12871821, 12881773, 13634528, 13978669, 14319585, 14345214, 14643482]
14381A4643482K29186J80591N57431k5183O3730L12137L72455O5034M38572M66216
14371A7303651K78378N3314O16848N68600O33121O6370N90008J68557O61971K60366
14361B1201184J61528N31373K76841J04330J026313O77116N27293K97614O54735
14352B5458327O33239J066055K59663O59751P39351R25265M20121J021000O03438
14343C1786210J061181O24918J410715M43296J037341J182248P86703J088681
14335C9421293J380914J333487J038398J720317J035782J492908J550147J887591
14327E0860837P93697J429388K287117J897545K373376J936849K045749K167816
14319F5792374K313439K773742K285474K291208L407007K820172L450111L220754
$$ y = [14643482, 14872668, 15053259, 15610690, 15585507, 15649237, 15961374, 16333829, 16398863, 16837435, 17303651, 17582029, 17635343, 18252191, 18820791, 19453912, 19520282, 20110290, 20278847, 20940818, 21201184, 21362712, 21894085, 22170926, 22275256, 23301569, 23978685, 24505978, 24803592, 25458327, 26091566, 27157621, 27417284, 28077035, 28816386, 29741651, 30161772, 31182772, 31786210, 32847391, 33472309, 34883024, 35326320, 36363661, 37545909, 38332612, 39421293, 40802207, 42135694, 43174092, 44894409, 45930191, 47423099, 48973246, 50860837, 51654534, 53083922, 55371039, 57268584, 59641960, 61578809, 63624558, 65792374, 68105813, 70879555, 73165029, 75456237, 78863244, 81683416, 85133527, 88354281]
14311H8354281L607067L535951M318231M363385M139881M602526N110537N319326
14303A23351185N507733O461654N909150O592577P022064P592805P579422Q273703
14295A78290293Q960050R231468J0086610J0145436J1308298J1624485J1589393
14288B51236033J2655880J3265475J3655964J3633549J4819541J4774956J4635783
14281C48677181J4883498J4834780J4440804J4188128J2928668J2157624J0749911
14274D42860594Q841209O376718K820874P58175j379654k223381m862905n898489
14266D47293141p001658r184285j0995757j2283065j3531156j4493581j4160444
14259C65643195j5315443j5823710j5619651j5152425j4803559j4310832j3359541
$$ y = [88354281, 91961348, 95497299, 99815530, 104178915, 108318796, 112921322, 118031859, 123351185, 128858918, 135320572, 141229722, 147822299, 154844363, 162437168, 170016590, 178290293, 187250343, 196481811, 206568421, 216713857, 228022155, 239646640, 251236033, 263891913, 277157388, 290813352, 304446901, 319266442, 334041398, 348677181, 363560679, 378395459, 392836263, 407024391, 419953059, 432110683, 442860594, 451701803, 458078521, 460899395, 461657570, 460277916, 458054535, 453191630, 447293141, 440291483, 431107198, 420111441, 407828376, 394297220, 379803639, 365643195, 350327752, 334504042, 318884391, 303731966, 288928407, 274617575, 261258034]
14252B61258034j3189821j2768155j1990014j1435748j0713048q887724q347014
14245A83926510r210345q439479p732471p480480p228006o813285n961019n701224
14237A25360201n182830n184410n267954m641756m445843l834064l393463l692052
14229H9717829l908964l710590k953136k735665k917833k642436k632978k596523
14221F5619704k066224j937357k207477j769609k459778j644654j384492j507539
14213E0642574j110540j977247j341429j784760j230729j032381o38201p35332
14205D0791955j580240j354111j022905j055139q29676m92924r38085j169654
14197C2349221j015901p27571o77981q17407k92186r96207j057005l86930l87537
$$ y = [261258034, 248068213, 235300058, 223310044, 211874296, 201161248, 192273524, 183926510, 174716165, 166276686, 158544215, 151063735, 143835729, 137022444, 131061425, 125360201, 120177371, 114992961, 109725007, 105083251, 100637408, 96803344, 93409881, 89717829, 85808865, 82098275, 79145139, 76409474, 73491641, 70849205, 68216227, 65619704, 63553480, 61616123, 59408646, 57639037, 55179259, 53534605, 52150113, 50642574, 49532034, 47554787, 46213358, 44428598, 43197869, 42165488, 41527287, 40791955, 39211715, 37857604, 36834699, 35779560, 34949884, 34456960, 33518875, 32349221, 31333320, 30605749, 29927768, 29110361, 28818175, 27821968, 26764963, 26378033, 25990496]
14188B5990496q44204q77977n0818q66622l62688n66810N748q79840l41639o84655
14178B0520991l24017m72862k47377o66395k09437k28597m94916m21408j91752
14169A7264230p42098j34099j23046n32642L1045k76238l03485j23935q59669
14160A4200063M645l75322K2986j89147n02478m08420L1342k11013k14861l25441
14150A2032354K54104l05914N890r65500K83500l33265K1489k94852L2626k52168
14140A0478264N0654m16451o1546k67698l59915J33916n03491J30543j38443k03336
14130H842497K5076k35249j15115r4441j89892J38013j7706j37415O9359l21927
14120G963200j85954l1451m82720K86792j22790J1428m15669J1844L0131k36026
$$ y = [25990496, 25146292, 24268315, 24217497, 23350875, 22988187, 22421377, 22427125, 21547285, 21205646, 20520991, 20196974, 19724112, 19476735, 18810340, 18600903, 18372306, 17877390, 17455982, 17264230, 16522132, 16388033, 16264987, 15732345, 15763390, 15487152, 15183667, 15059732, 14200063, 14204708, 13829386, 13852372, 13663225, 13160747, 12752327, 12783669, 12572656, 12357795, 12032354, 12286458, 11980544, 11986434, 11020934, 11304434, 10971169, 10992658, 10697806, 10730432, 10478264, 10528918, 10112467, 10050921, 9783223, 9423308, 9557224, 9053733, 9184276, 9045833, 8842497, 8867573, 8632324, 8517209, 8422768, 8232876, 8370889, 8353183, 8215768, 8285127, 7963200, 7777246, 7745795, 7263075, 7549867, 7427077, 7438505, 7022836, 7034680, 7064811, 6828785]
14110F828785q5283J86018k69565J88628l79716r1526j78895J07060J53454l77981
14100F080979k16669K06579m39749M53480k03133M3921j87425l18471J42800l5156
14090E527156k28070j38694O626J25888m24084K38583j35254j47545K04071J38214
14080E166891m57700J66791M2042j98247l38396K76372l76641K85080m1258j31626
14070D393308K94508m49429R5091m01273K13076J02575J84669m35135J77422r3034
14060D081778J9048p5653k1785k93786L13775l02151j20132J87964K6165j3506
14050C801717l76451K20475m41915N18181l63583K45539k91930J96795p5871k11844
14040C221113k36627M84827j65354N207J53501r6856l66011M01364l03929o5629
$$ y = [6828785, 6743502, 6929520, 6659955, 6848583, 6468867, 6377341, 6198446, 6305506, 6458960, 6080979, 5864310, 6070889, 5631140, 6084620, 5881487, 5925408, 5737983, 5419512, 5562312, 5527156, 5299086, 5160392, 5167018, 5292906, 4868822, 5107405, 4972151, 4824606, 5028677, 5166891, 4709191, 4875982, 4918024, 4719777, 4381381, 4657753, 4281112, 4566192, 4524934, 4393308, 4687816, 4238387, 4333478, 3932205, 4145281, 4247856, 4432525, 3997390, 4174812, 4081778, 4100826, 4025173, 4003388, 3709602, 4023377, 3721226, 3601094, 3789058, 3815223, 3801717, 3425266, 3645741, 3203826, 3722007, 3358424, 3603963, 3312033, 3508828, 3432957, 3221113, 2984486, 3469313, 3303959, 3309166, 3462667, 3365811, 2999800, 3401164, 3097235, 3031606]
14030C031606j1457K19402J53586k35141l1715k07214l83765J79931O252L25476
14020C046961k45348j1645J32230l09912L07067m66371J62406j36365L1451m49775
14010B060699K19598P2567J69823k36414K40778n27201L11616q556J29751p0919
14000B361742n603j96490k8604l50294M51545r7017K75300j87048J53750K05430
13990B582711R0204O13939J821797N316378J6385846K0306456j8415595j3373639
13982A5328097o458859k441685j373687o98038p06158n21988M24048o13676j26950
13973B811104P2041j38553l37332k05078L03373j83286J44081J07502n41386L92629
13963B425095J35003n64821K75815l14415L41978j68735r4543l8078k85062N47890
$$ y = [3031606, 3020149, 3239551, 3393137, 3157996, 3126281, 2919067, 2535302, 2715233, 2721485, 3046961, 2801613, 2789968, 2922198, 2612286, 2919353, 2452982, 2615388, 2479023, 2510474, 2060699, 2280297, 2352864, 2522687, 2286273, 2527051, 1999850, 2311466, 2302910, 2432661, 2361742, 2356139, 2159649, 2131045, 1780751, 2232296, 2135279, 2410579, 2223531, 2377281, 2582711, 2672915, 3286854, 5108651, 10425029, 26810875, 47117331, 28701736, 15328097, 8869238, 6427553, 5053866, 4355828, 3649670, 3127682, 3551730, 2938054, 2811104, 2883145, 2744592, 2407260, 2202182, 2505555, 2322269, 2466350, 2573852, 2032466, 2425095, 2560098, 1995277, 2271092, 1956677, 2298655, 2129920, 2035377, 1997299, 1712237, 2260127]
13953B260127j02196k05961K71068k90235j36821J94827j64128J04844J27327
13944B058852o1387m25154M19913k36073J3021o4908q5877K82824j41321j63186
13934A596704j75347L47006o3647k39956o0770J56288n4989P1641k599k19358
13924A354973K50517R584L9794l39423M3338J06052p4390P2957K34466k85670
13914A412198K2986K09720j75059J30505k97450j23349J76996j89843M71429k44563
13904A393570k04163L9171L17823p8525l40722K7807L2042K14433J04601l76886
13894A129151J78312M9531j80919J37097n5639L4015j61283K12354J937l19057
13884A025499K7211K27671Q9637L6679Q8633l53549J20805M55482l37667l52148
$$ y = [2260127, 2157931, 1951970, 2223038, 1932803, 1795982, 1990809, 1826681, 1931525, 2058852, 1997465, 1572311, 1992224, 1756151, 1769172, 1704264, 1618387, 1901211, 1759890, 1596704, 1421357, 1768363, 1704716, 1464760, 1403990, 1560278, 1505289, 1576930, 1574331, 1354973, 1605490, 1615074, 1654868, 1315445, 1358783, 1464835, 1390445, 1463402, 1697868, 1412198, 1435184, 1644904, 1469845, 1600350, 1302900, 1179551, 1356547, 1166704, 1638133, 1393570, 1189407, 1228578, 1546401, 1467876, 1127154, 1154961, 1187003, 1401436, 1506037, 1129151, 1307463, 1356994, 1176075, 1313172, 1257533, 1291548, 1130265, 1342619, 1344556, 1025499, 1052710, 1280381, 1370018, 1406697, 1495330, 1141781, 1262586, 1718068, 1380401, 1028253]
13874A028253J08597p0064j1452J53681j79718m6909J09516j99343M1396J73666
13864A107623K9281k8518r5041N883M6622k7418j17514K76415k22719K29859p1527
13853A132946j00922P0875j51160J76199j44495J63940j06937j74953N27540m56375
13843I36658k39579J83145R6836j77107L76489n34849M95178j12411L57703n01954
13833H80109Q1546j89763N29250m81567L92865k52049n2007q228k39646K51659
13823I12169p0653l0218K06047j68107J43024k60612k34745K34358P3186q4852
13813G19597o3992P3934k6205M15747m12486N7129J96009q4756j96517k12907
13803D65553J90030M28579j41461j91425K73357j67508N681Q2935m60023L96205
$$ y = [1028253, 1136850, 1066786, 1055334, 1209015, 1029297, 982388, 1091904, 892561, 933957, 1107623, 1136904, 1108386, 1013345, 1019228, 1065850, 1038432, 920918, 1197333, 974614, 1204473, 1132946, 1032024, 1102899, 951739, 1127938, 983443, 1147383, 1040446, 865493, 1393033, 936658, 697079, 880224, 977060, 799953, 1176442, 641593, 1136771, 1024360, 1382063, 880109, 961655, 771892, 1301142, 819575, 1212440, 960391, 908384, 900156, 660510, 912169, 841516, 811298, 1017345, 849238, 992262, 731650, 496905, 731263, 804449, 719597, 655605, 729539, 703334, 1119081, 706595, 763724, 959733, 874977, 678460, 465553, 655583, 1084162, 942701, 751276, 1024633, 857125, 862806, 945741, 485718, 881923]
13793H81923o6009j83590K62578k13159k12673n4334P46818E64337L01997J64052
13783A030386j44763r1337j97747J52780K41166C77371J86837K89460j17178k02238
13773E34252J80257q914m7386L64096k24205l66238J42114J4616k56636J57950
13763D89906K46582j62857K79428r9526J54877j50993p4899R7926l07552Q2613
13753E55505K51846M2518q1506k52411Q9010j13259J60684o4785k05520K39697
13743F21779J91345m03923m813K47273J25274j51521r7980M4155J22204N7798
13733G51591k20263j10269L60006l69823K93977n9221j03262M6115k42916L44685
13723F90620k61653L81424n6372j14870Q1761k31476q0429K09696K25924k99169
$$ y = [881923, 815914, 632324, 894902, 681743, 469070, 414736, 1161554, 564337, 866334, 1030386, 885623, 794286, 596539, 749319, 990485, 377371, 564208, 853668, 736490, 534252, 714509, 705595, 658209, 1022305, 798100, 431862, 573976, 588592, 331956, 489906, 736488, 573631, 853059, 753533, 908410, 757417, 682518, 780444, 472892, 555505, 807351, 849869, 768363, 515952, 604962, 491703, 652387, 587602, 382082, 621779, 813124, 409201, 404388, 651661, 776935, 625414, 527434, 571589, 693793, 751591, 531328, 421059, 781065, 411242, 705219, 645998, 542736, 588851, 345935, 690620, 428967, 810391, 754019, 639149, 720910, 489434, 409005, 618701, 844625, 545456]
13713E45456j14487J30201k21131M74299k76415j69853K39742j83916K62987j1941
13703F74942j43896n6072O3973m8903J38580B91817L55329o8812j91342K29602
13693F16594B39038K52204L20502C70357M96096l70619L00440C64807r3254J26482
13683C98035J67584k54079O8792R0967J11974k8369B63774n4517K24481j47945
13673B85793L17071j04926n3492j61101M80350L24196l59441B73598j28398K43813
13663C89013M4447j69391J98824Q8762k73446a16701E41443k42482K75572o4306
13653E10227J337j601L5873k32909P5608C3017K90543J31902l7495J01887j86823
13642C33031J030R1406l9768A26307B1339L80895j34987M06813l35683O1114j27342
$$ y = [545456, 430969, 561170, 340039, 814338, 537923, 368070, 607812, 423896, 686883, 674942, 531046, 474974, 538947, 490044, 628624, 291817, 647146, 578334, 386992, 616594, 239038, 491242, 811744, 370357, 866453, 495834, 796274, 364807, 271553, 398035, 565619, 311540, 380332, 471299, 583273, 554904, 263774, 209257, 433738, 285793, 602864, 497938, 444446, 283345, 763695, 1087891, 728450, 273598, 145200, 389013, 433460, 264069, 462893, 551655, 278209, -116701, 541443, 298961, 574533, 510227, 511564, 509963, 545836, 312927, 388535, 33017, 323560, 455462, 417967, 519854, 333031, 334061, 425467, 385699, 126307, 21339, 402234, 267247, 674060, 338377, 399491, 272149]
13631B72149q38k309n0284A08779M84925k90985J68050N951n1349M7757j86569
13620B86559o4447J81975N7369n0874j43006O7359J53789Q9627k15226J01829
13610D64954E0127L63528j57365m5377K04649r6057k606J50139B09523N63191
13600G72714l72621A70490K88594m0926j58824n509K33276k04658L3384l0821
13590B85006j22484K16876i0946F8559J84421M8431L38586k17776l6565R4736
13580D80392C7090Q1567m7102O40126H0126N2611J5969J20818J7973p1616L01548
13569E17429L8115j89489R7388k1439B08614R6629o7626M07633l19786O4859P0532
13558D60855R8734A46191M13942j43942l848H9099J67600j1632P4898j13573L13936
$$ y = [272149, 271311, 269002, 218718, 108779, 593704, 302719, 470769, 476720, 425371, 473128, 286559, 222112, 404087, 461456, 410582, 267576, 334935, 488724, 578351, 363125, 464954, 50127, 413655, 256290, 210913, 415562, 319505, 316899, 467038, 209523, 772714, 400093, 170490, 459084, 418158, 259334, 253825, 487101, 282443, 315827, 285006, 162522, 379398, -90946, 68559, 252980, 301411, 639997, 422221, 385656, 480392, 37090, 118657, 71555, 711681, 80126, 132737, 148706, 269524, 287497, 215881, 517429, 555544, 366055, 463443, 442004, 208614, 305243, 237617, 645250, 325464, 390323, 460855, 559589, 146191, 560133, 416191, 412343, 89099, 256699, 245067, 319965, 206392, 520328]
13547E20328K4596p1404k09659J95956o0801J09983N5230B49020D7794L69423
13537D17217p7971A51843M47865j80254J2888q6136N0220A4006K81976K41716
13527E37698J10731j48800k42298E9327J12127o195J00945O5311l9496J12153
13517D04172b2969B7974N719K47218A15054K55953A11386N7864K00632A63020
13506C73826j81159J7736K13031p592j05543F2443N7655J44644Q2118J03392j29644
13495C20608r1797E7313N4496J05720M1314J18079A24400m1747J9651K28167b24450
13483A83704J58623J1472j58206M33360C01983p6648K480C9746R5730a2188k45469
13472b57657C7381K852J35764a0263C82495J20874k51637K8382A04106L52413
$$ y = [520328, 544924, 473520, 263861, 459817, 399016, 508999, 564229, 249020, 47794, 417217, 339246, 151843, 599708, 419454, 432342, 346206, 396426, 14006, 295982, 537698, 648429, 499629, 257331, 59327, 171454, 165259, 266204, 331515, 292019, 404172, -22969, 27974, 33693, 280911, 115054, 371007, 111386, 169250, 369882, 163020, 373826, 192667, 210403, 423434, 415842, 310299, 62443, 120098, 264742, 346860, 450252, 320608, 228811, 57313, 111809, 217529, 258843, 376922, 124400, 82653, 102304, 330471, -224450, 183704, 342327, 353799, 195593, 628953, 301983, 225335, 227815, 39746, 135476, -12188, -257657, 37381, 40233, 175997, -10263, 382495, 503369, 251732, 280114, 104106, 456519]
13462D56519j66095A35434L34374m2263q3036j60048g9272B15954J1606b9965
13451D02445J63431B42527o5650K08376n75A82616p7497a9864C45381j32470o6263
13440A46648a46132C81867A21217E7610J75866J48328j26054L6936A26169L7543
13430A63712A765K11271F1667J59281c9454A96841a9767A61874p3548K34935m0064
13419B83197J00916A83844K72858a04266B31996j1831g6154F40357a3146A60152
13408E0743f888F5464K09738D0082d6879n226l0813A87341J44611A35826K60685
13397C96511e2222j96798A12715N3908b0655A22300K91064c35755H8451J54914
13387B43365k5137j9046N9990b59960E42095A10467K34817D6503J38279n1273
$$ y = [456519, 290424, 135434, 469808, 427545, 344509, 184461, -79272, 215954, 227560, -29965, 402445, 565876, 242527, 176877, 385253, 384678, 182616, 105119, -19864, 345381, 212911, 146648, -146132, 381867, 121217, 57610, 233476, 381804, 255750, 292686, 126169, 163712, 1765, 213036, 61667, 220948, -39454, 196841, -19767, 161874, 88326, 323261, 283197, 384113, 183844, 456702, -104266, 231996, 220165, -76154, 640357, -13146, 160152, 50743, -6888, 65464, 275202, 40082, -46879, -52105, -82918, 187341, 331952, 135826, 396511, -52222, -249020, 112715, 166623, -20655, 122300, 413364, -335755, 88451, 243365, 218228, 199182, 259172, -259960, 542095, 110467, 345284, 46503, 184782, 133509]
13377A33509l6670d708A12200m4635b22161B93771j13623K27630c8633j4503B82555
13365E55715c8483A06689j1276K41270i6851H5916K21252m7031J61710E8514L22105
13354C80619A90080P8324r3442M4059o673I7683K38043g8806C39582Q4502j2289
13343D11795l5238n5015H8912L02332A81027M0727A8287J03644D0756K72895J20805
13332D34456H2690a6265A21065D7566J54369r472J12743n3007J37028F185K0465
13321B6650L39456k9470K88737k03395D1005J88956R5322m0582j11538K26087
13311C99250o4967k4912r7875r993b54225F9053L98233B29613J67566a59117B8221
13299D73723G3890k851K10637c84018H6641O1152A675J04532N50108A76345K31400
$$ y = [133509, 96839, -4708, 112200, 67565, -222161, 293771, 180148, 407778, -38633, -53136, 282555, 555715, -38483, 106689, 95413, 336683, -96851, 85916, 307168, 260137, 421847, 58514, 380619, 190080, 268404, 174962, 219021, 212348, 97683, 335726, -78806, 339582, 424084, 411795, 376557, 321542, 88912, 391244, 181027, 221754, 18287, 121931, 40756, 313651, 434456, 82690, -16265, 121065, 47566, 201935, 192463, 305206, 252199, 389227, 6185, 26650, 366106, 336636, 625373, 421978, 41005, 229961, 325283, 284701, 173163, 399250, 334283, 309371, 211496, 201503, -254225, 69053, 467286, 229613, 397179, -159117, 28221, 473723, 73890, 71039, 281676, -384018, 86641, 147793, 1675, 106207, 656315, 176345, 407745]
13288D07745a78080d9489E27558A61405J029g76D25968l9068A18618k4752J13422
13277B07288n0795L2313d6408I3991N5677F0389a5995A30162L56395D2155d1894
13265E0243J21367L97693a87880A32296J46717Q2932j43935J0350h1199A97384
13254a82590L1078A2400M9610g4042C16147A45531K7686c6512j57198j2762D0613
13242A47585j3378F5228K3706J73537C9056b32899B20618G7209M44177k40675
13232B80711A38044a45770p744H5687L23058H1687O2462F6228a144D38725j58613
13221B80112i9972A01670m8417b90286B3775N6439M5294F994c3241B17508b55903
13209A64662j8066a06970B04007a1506n636A32285E2791A8505K25311r735D9606
$$ y = [407745, -178080, -49489, 527558, 161405, 162434, -776, 425968, 386900, 118618, 93866, 207288, 156493, 188806, -46408, 93991, 149668, 60389, -15995, 130162, 486557, 42155, -41894, 50243, 171610, 569303, -187880, 132296, 279013, 361945, 218010, 228360, -81199, 197384, -182590, -151512, 12400, 62010, -74042, 316147, 145531, 173217, -36512, -193710, -206472, 40613, 147585, 134207, 65228, 88934, 262471, 39056, -232899, 220618, 77209, 521386, 280711, 138044, -145770, -153514, 85687, 408745, 81687, 144149, 66228, -1144, 438725, 280112, -99972, 101670, 53253, -290286, 23775, 80214, 125508, 6994, -33241, 217508, -255903, 164662, 146596, -106970, 204007, -11506, -17142, 132285, 52791, 18505, 243816, 234081, 49606]
13197i0403i709C24501j42194J30112G8416b02278C54451a55407O6843l89998
13187d78562A80818L2531n5850F5574L00596a7217B11881k8794a10347D5031f8499
13175C328a87635H611P5379f7552C73001e4826j81319C20879D9594J44093J61045
13164C54732b15428A3392d2609A79949f47A65116C7064J50168B6426J30047E2125
13152A68763j6574B8393N6508K6450c3791B72445j06258A9460i1499A22906a08399
13140F2345M59377a64241B16362a7450r6244A36711e8421H6498J81930A20586
13129B73338j05048k5138g7227A74204C3423i020G3489K05760r2931M210G180
13117E7934J62399q9453c0442A21684H143M8055g639l6186A67006G5839b24620
$$ y = [-90403, -9709, 324501, 182307, 312419, 78416, -202278, 354451, -155407, -88564, -478562, 180818, 213349, 157499, 65574, 366170, -17217, 211881, 183087, -110347, 45031, -68499, 3328, -187635, 8611, 83990, -67552, 373001, -54826, -236145, 320879, 49594, 193687, 354732, -215428, 13392, -42609, 179949, -647, 165116, 37064, 187232, 26426, 156473, 52125, 168763, 152189, 28393, 84901, 111351, -33791, 272445, 166187, 19460, -91499, 122906, -108399, 62345, 521722, -164241, 216362, -17450, -113694, 136711, -58421, 86498, 268428, 120586, 273338, 168290, 143152, -77227, 174204, 33423, -9020, 73489, 279249, 186318, 190528, 7180, 57934, 220333, 130880, -30442, 121684, 8143, 56198, -7639, -43825, 167006, 75839, -224620]
13105b0179p7582B57939b65365g7495B2523a53858j63036P3494A51501P2195a63040
13093F2597L9714A3652b15647B39823a75717H3205J99466D6263A929a73444F3200
13081c1681C5706K70428a8944C85821b5820A70270b54109G4660p710a53696M5611
13070a08085A89907h3792k4021B95748b1413A81658P984b5559A15605R9063B1997
13058B09444a30092E5393P8906n3285D692N16908k37602q8107F2630J79113h7496
13046A70936E7880f6514A49829m4395M3742a20942l9867k40126C39852i9166A22070
13034d3067A918L45587I1559K26807a79610H6125a24412r9329D6426a11096H1537
13022A17106d24667B22036b4035E7140J7037O3810O0394F8426a08338F4247L5250
$$ y = [-20179, -97761, 257939, -265365, -77495, 22523, -153858, -316894, -243400, 151501, 223696, -163040, 62597, 102311, 13652, -215647, 239823, -175717, 83205, 282671, 46263, 1929, -173444, 63200, -31681, 35706, 306134, -18944, 385821, -25820, 170270, -254109, 74660, 66950, -153696, -108085, 189907, -83792, -107813, 295748, -21413, 181658, 189642, -25559, 115605, 214668, 21997, 209444, -130092, 55393, 134299, 81014, 4692, 521600, 283998, 195891, 62630, 241743, -87496, 170936, 57880, -66514, 149829, 105434, 149176, -120942, -160809, -400935, 339852, -99166, 122070, -43067, 1918, 347505, 91559, 318366, -179610, 86125, -124412, -223741, 46426, -111096, 81537, 117106, -424667, 222036, -24035, 57140, 74177, 137987, 198381, 68426, -108338, 64247, 99497]
13011I9497c67917G1845L5946P2649m0964J88761D0477J03085f3958A82392b2729
12999F4495b33607B42447j05143F6277h4533K9444r1759B58520m756l6735a63822
12987B68427j32455J91620A2330e4761H3614N6110a12689F9498b1666K533j55989
12976a75122I1453G216h894q7551a7339E7213a47242A71496N466N9182m4602F1056
12963A36816a67553q106B47817h8961B10318r8141d2178J2639I2927J54915e7433
12951B55094I1140b13392l7575D6537A6517J62563A7162a75123G785K76340e1883
12939b51967i7403K8126k81809A53126B5109J2477e0581I6377J76376E8248a45906
12927c3654A01419j8269r631a71945D1757L48517a38006A4144K86170B3514d1175
$$ y = [99497, -367917, 71845, 107791, 180440, 139476, 328237, 40477, 143562, -63958, 182392, -22729, 64495, -233607, 242447, 137304, 66277, -84533, -55089, -146848, 258520, 253764, 217029, -163822, 268427, 135972, 327592, 12330, -54761, 83614, 139724, -112689, 69498, -21666, -19133, -175122, 91453, 7216, -8894, -96445, -17339, 57213, -147242, 171496, 176962, 236144, 191542, 61056, 136816, -167553, -175659, 247817, -88961, 210318, 112177, -42178, -29539, 92927, 247842, -57433, 255094, 91140, -213392, -250967, 46537, 16517, 179080, 17162, -175123, 7785, 284125, -51883, -251967, -97403, -69277, -351086, 153126, 25109, 37586, -50581, 96377, 272753, 58248, -145906, -33654, 101419, 83150, 73519, -171945, 41757, 390274, -138006, 14144, 300314, 23514, -41175]
12915H3163M72967D3470b14171K3998f7071E9626J10857p3780J23493E5751b33151
12903a50229F4055J9823C8765J19885i0499B65601a70197q5181a20442d9395A62697
12891G754K09487b12404h406H2493A249a11139J869j54203B01921a78098M177
12880a73921e4664j5635r9535Q3845F8688a72866A38154C6550c4891M420D5738
12868b49925C02344K6901a517q308p6562l6121H4141A1777a24641B20392R8299
12857C18691a27179A11543O2073P7547q2365b628k1015l71144J38347B96179d7580
12845C97377A04320a38629A21554B5906p587f9688k41687a17578p459b8609F7408
12833c52121a19643d5533J9664l4506A9144K52813J16299A53182l0638K55347
$$ y = [83163, 556130, 43470, -214171, -190173, -67071, 59626, 170483, 96703, 220196, 55751, -233151, -150229, 64055, 83878, 38765, 158650, -90499, 265601, -170197, -255378, -120442, -49395, 162697, 7754, 217241, -212404, -8406, 82493, 1249, -111139, -109270, -263473, 201921, -178098, -173921, -54664, -70299, -169834, -85989, 68688, -172866, 138154, 36550, -34891, -30471, 45738, -249925, 302344, 329245, -1517, -9825, -86387, -122508, 84141, 11777, -124641, 220392, 318691, -127179, 111543, 173616, 251163, 168798, -2628, -23643, -394787, -256440, 296179, -47580, 397377, 104320, -138629, 121554, 25906, 18319, -69688, -311375, -117578, -125037, -28609, 67408, -352121, -119643, -45533, -25869, -60375, 19144, 271957, 388256, 153182, 122544, 377891]
12823C77891j1825a90218M9172L443E3256b63927B54397a05221j18705i0467A88947
12811a28463B32927a33017c5621B10243g4550r4744G5847a46505B26099A2791
12800D1544A1048K70118A07516b81219B8424N5190b2592A29154k8599b32607A8091
12788A7259h7979K5988A90199a65037f6931A34094c5637B03906k2491a3647j22632
12777a36279H5791Q9576a97675B51121a97626q5089C28540A51711J16758f1453
12766C7113i5290k40856D82336a88909A37849a40826A41049i2069C73410D4247
12755a00144l11224B5162b53623a15174k03138a03132G4324h278j62878O1913
12745a09243B0383K40786H5955c05088A8451J41885L9804g3879A80970r0283d087
$$ y = [377891, 366066, -190218, -141046, -137603, 53256, -263927, 254397, -105221, -223926, -90467, 188947, -128463, 232927, -133017, -35621, 210243, -74550, -169294, 75847, -146505, 226099, 12791, 41544, 11048, 281166, 107516, -281219, 28424, 83614, -22592, 129154, 100555, -232607, 18091, 17259, -87979, -61991, 190199, -165037, -66931, 134094, -35637, 203906, 181415, -13647, -136279, 85791, 175367, -197675, 251121, -197626, -282715, 328540, 151711, 268469, -61453, 37113, -95290, -336146, 482336, -188909, 137849, -140826, 141049, -92069, 373410, 44247, -100144, -411368, 25162, -253623, -115174, -318312, -103132, 74324, -8278, -171156, -109243, 20383, 261169, 85955, -305088, 18451, 160336, 200140, -73879, 180970, 90687, -4087]
12733b2533k1578I8424e7367m6713B89969k4587b19354L4788A18777a78771K8378
12722a50393G1449a64477A96150a65124A40565D1766b52603J17406j72387B45482
12711c75062a57738G2135c4854G2887j6880D17g9015A33869a21387M6341l9556
12700a14602B55399C3186a86367A7566K17319C3570e7604C4365K4078J1066M7744
12689A17253E7531a33480g784A42497q494D5217O6588a04r465D02208A2109J19723
12677A31832K9995b7450j72738C03719A24175c1630D22163b78030a8997j91911
12667b10908C1664O1307K50032h5392H0249J22023b9552J876A26390O530m9006
12656H3914h2913A4503a62888Q039n2036C73751D9687o315e7239D5091c49443
$$ y = [-22533, -44111, 98424, -57367, -104080, 289969, 265382, -219354, -184566, 118777, -178771, -150393, 71449, -164477, 196150, -165124, 140565, 41766, -252603, -135197, -307584, 245482, -375062, -157738, 72135, -34854, 72887, 56007, 417, -79015, 133869, -121387, -75046, -114602, 255399, 33186, -186367, 17566, 234885, 33570, -57604, 34365, 58443, 69509, 117253, 57531, -133480, -7784, 142497, 134003, 45217, 111805, -104, -9569, 402208, 12109, 131832, 161827, -27450, -200188, 303719, 124175, -31630, 422163, -278030, -18997, -210908, 31664, 92971, 343003, -85392, 80249, 202272, -29552, -27676, 126390, 132920, 83914, -82913, 14503, -162888, -154849, -206885, 373751, 49687, 43372, -57239, 45091, -349443]
12644G4873J45900D3752c9888r1581N4310k51096A85930o4589D7664L31574d37064
12632A90437p9552l593b12172c804A18235L08794j72101K49987B26085C8211g1098
12620B07531i9527a1931r6789A81523f9310K566A72743m2611d3587j70274B4898
12608a80737Q2580C2323b15359B76081f6539B13351j04396k5715K14388A23346
12597B1413J11063M4437a07499q1377D3973e319G4139K17853j13967e3579b2669
12585G6397c14481e9078G995J05221J58268a18133A0271c2305j34642C86306e6750
12573C5289J32727a96379g4539A7708K18052g8389F5746b07512a03034q6191A30901
12561a67189k11535e8158k16088H4334a7124q7341C4839f8851D6413a01241p2427
$$ y = [74873, 220773, 43752, -39888, -131469, -77159, -328255, 185930, 121341, 47664, 379238, -437064, 190437, 110885, 107292, -212172, -3804, 118235, 427029, 254928, 504915, 226085, 38211, -71098, 207531, -99527, -11931, -108720, 181523, -69310, -66744, 172743, 130132, -43587, -213861, 24898, -180737, -98157, 32323, -215359, 276081, -66539, 213351, 108955, 83240, 297628, 123346, 21413, 132476, 176913, -107499, -188876, 43973, -5319, 74139, 291992, 178025, -53579, -22669, 76397, -314481, -59078, 7995, 113216, 271484, -118133, 10271, -32305, -166947, 386306, -56750, 35289, 168016, -196379, -74539, 17708, 235760, -78389, 65746, -207512, -103034, -189225, 130901, -167189, -378724, -58158, -274246, 84334, -17124, -104465, 34839, -68851, 46413, -101241, -173668]
12550a73668P1044l1099o818D8643K6288c21852J17475i4209c5570n6744D6744
12538B5833K56998a74435A44086N6488o2341a68269B10666D7986c23704C58681
12527b06600B52044C0328J01014a32795A27202b86771E5147b746A67355d11444
12516H8933L24070A50182a97978j81184F5464L6615K02528f8823I191M5390b55433
12504c43684B89917a91889E3918K66378b3380r9260I0271J78413j17319o9952
12494H1413a91160i1806j7010B33461f6086B9228c7310D47918B03081e5586k8028
12483h3614A80741b3345A42138b50975I7794a14704N7282I589Q6199O0268M793
12472A60849j8187D3331J02432R1798F6618J26000M3122C4076b84172h9065B52069
$$ y = [-173668, -102624, -133723, -140541, 48643, 74931, -321852, -204377, -94209, -35570, -92314, 46744, 25833, 282831, -174435, 144086, 200574, 138233, -168269, 210666, 47986, -323704, 358681, -206600, 252044, 30328, 131342, -132795, 127202, -286771, 55147, -2746, 167355, -411444, 88933, 413003, 150182, -197978, -379162, 65464, 102079, 304607, -68823, 9191, 54581, -255433, -343684, 289917, -191889, 53918, 320296, -23380, -122640, 90271, 268684, 151365, 81413, -191160, -91806, -108816, 233461, -66086, 29228, -37310, 447918, 203081, -55586, -83614, 180741, -23345, 142138, -250975, 97794, -114704, -57422, 9589, 95788, 156056, 160849, 142662, 43331, 145763, 237561, 66618, 192618, 235740, 34076, -284172, -89065, 252069]
12460e5577B09601K1406a13237A74547p9943d19671i1140L1212n1753b1430k4325
12449d5755A39119M3113B6316c00326H1717M0949R9422A1773P5374N5120a4293
12437g0217p8326E2691b82166a00900A87646n929C9457J05105a28832F0627c6648
12425B87211I8459c497j18130A64944l8145a426B8497g0780j20977b431n5635
12414e8066A93501E0930g3644b7253G0898b19733C00977a72778q1468J15072A24914
12402a45016A80188j3198F8545a87200h1622b4369q4798G9573a15517p0477A97944
12390b29781F3809Q4037K52007a51102b1558B36046q0838D7056f7231l006C5357
12378B57113k5452K09556A29179K34066E1177J48375a48346L5557B96211a60331
$$ y = [-55577, 209601, 231007, -113237, 174547, 94604, -419671, -91140, -59928, -111681, -21430, -45755, 139119, 182232, 26316, -300326, 81717, 122666, 222088, 11773, 87147, 142267, -14293, -70217, -148543, 52691, -282166, -100900, 187646, 181717, 39457, 144562, -128832, 60627, -36648, 287211, 98459, -3497, -121627, 164944, 126799, -1426, 28497, -70780, -191757, -2431, -58066, 193501, 50930, -73644, -27253, 70898, -219733, 300977, -172778, -254246, -139174, 124914, -145016, 180188, 166990, 68545, -187200, -81622, -24369, -109167, 79573, -115517, -185994, 197944, -229781, 63809, 147846, 399853, -151102, -21558, 236046, 155208, 47056, -67231, -70237, 35357, 257113, 231661, 441217, 129179, 363245, 51177, 199552, -148346, -112789, 296211, -160331]
12367d725k67664B66219E858h3882C2586L65000c11399a32026C24082E0024a68185
12355b1890j82596q327G6381k0277a24429n8608E5061D865K7907Q3430b00352
12343I2263l1836a98896h6750C31528a05365D49832f4447q1096H3204J19350o6101
12332A36453N2198m4586O4272J26991O1128j91041i2113I6090K63467a01900j35252
12321b37152f283l94078A13212L76500p4069i6122A66157A5710M96619G4493B8153
12309F0592K54088j29064K23275F5657d4622A60094n755f6548B67494j06961J17290
12298B77823F5896j6918J3337a14972C13869e0041G1869a8999C29100E9053d054
12286A26427a74833A4816a75392A61687a14038A25229a17425E00238j72793r1525
$$ y = [-4725, -272389, 266219, 5858, -83882, 32586, 397586, -311399, -132026, 324082, 50024, -168185, -21890, -204486, -212813, 76381, 56104, -124429, -183037, 55061, 4865, 32772, 116202, -200352, 92263, 60427, -198896, -86750, 331528, -105365, 449832, -64447, -145543, 83204, 202554, 136453, 188651, 144065, 208337, 335328, 396456, 205415, -92113, 96090, 359557, -101900, -237152, -6283, -400361, 113212, 489712, 415643, -96122, 166157, 15710, 512329, 74493, 28153, 60592, 314680, 185616, 408891, 65657, -44622, 160094, 154339, -66548, 267494, 160533, 277823, 65896, 48978, 62315, -114972, 313869, -50041, 71869, -18999, 329100, 59053, -4054, 126427, -174833, 14816, -175392, 161687, -114038, 125229, -117425, 500238, 327445, 235920]
12276B35920j04283O3326G8060a56274C63851a51741B16169G7524J45600k3705
12266A99419J98276A08900J35172p4874a74279D1960J36432m476K433J82362G2200
12254B48180p6282n6097L3157a48586c2327B62713c3842A19262E8929J16711l9418
12243A36222a82340Q6131F7877j1291o481M963a48759e119j11219C5590J06037
12232A41627J39542a23507a47B04264g710p5158B62278a00757B62699O7700j13992
12221B16407F1303R8405e3679D4156J27138K13948I787K98085n1970J49318J34185
12210E39405H9934b42833O4793C24914b7512A16552L5777b7805A66007K25796
12200C91803a9891q9547C25471B9445K38669a1272A10288L50534p4343A66018
$$ y = [235920, 131637, 194963, 78060, -156274, 363851, -151741, 216169, 77524, 223124, 199419, 397695, 108900, 244072, 169198, -174279, 41960, 178392, 173916, 176349, 358711, 72200, 248180, 171898, 115801, 148958, -148586, -32327, 262713, -33842, 119262, 58929, 175640, 136222, -182340, -96209, 67877, 56586, 50105, 55068, -148759, -5119, -116338, 35590, 141627, 281169, -123507, -147, 204264, -7710, -82868, 262278, -100757, 262699, 330399, 216407, 61303, 159708, -53679, 44156, 171294, 385242, 9787, 307872, 255902, 405220, 539405, 89934, -242833, -178040, 324914, -27512, 116552, 152329, -27805, 166007, 391803, -19891, -109438, 325471, 29445, 268114, -11272, 110288, 460822, 386479, 166018]
12189B07643a28410B24266b01485c7018C96722j65030J36882I598M58525A79659
12178A69226o2533J25891q938p5596j0716e2611B08516b60149G8141J98128L8672
12167C14941j22566k1395K9845N5859r1661Q8948m2548f8846I6191R4216O3271
12156B53678I2992m5665a71391A10979E928K83405A31347F3836d7298A05141K5165
12145A30306G149d477q3704B68698a16458A0820a49053A90216K04002B5737L05940
12134C31677a14344B66230A9090a52202B7956J96433b71994D9586A2601J49397
12124A61998A4869J62520K3797F9490J42089p4559J26227D9619J93888M8634e8452
12112B05427c9681B93398O8976p3596j15484b22188A41974a6158B3363P2645L9211
$$ y = [207643, -128410, 224266, -201485, -37018, 396722, 231692, 368574, 9598, 468123, 179659, 169226, 106693, 232584, 223646, 148050, 137334, -52611, 208516, -260149, 78141, 276269, 314941, 192375, 170980, 200825, 256684, 165023, 253971, 211423, -68846, 96191, 190407, 253678, 92992, 47327, -171391, 110979, 5928, 289333, 131347, 63836, -47298, 105141, 130306, 7149, -4477, -88181, 268698, -116458, 10820, -149053, 190216, 394218, 25737, 331677, -114344, 266230, 19090, -152202, 27956, 224389, -271994, 49586, 12601, 161998, 14869, 177389, 201186, 69490, 211579, 137020, 263247, 49619, 243507, 292141, -58452, 205427, -39681, 293398, 362374, 288778, 173294, -222188, 141974, -16158, 23363, 96008, 135219]
12101A35219J12018b8393E18801j85448A40597c0865I0833J20698j3687J42698
12091C40542r4423G380d4322A92475O0025D6793Q2575J92172q0350f2656B09350
12079A92149p400a6724A96069k6010K82569B12666J27747J9422j42307L14430
12069E31958C5032a46203O3676b6631k53347B08869g405G749J59432l1179b56008
12057f1260b2439C57640j77213b9927j80383r5987D7019J01260a46047A61109
12046a00472j6026k5052n0058B8824g1221C03602a09539k718B18920B0461L00995
12035C21456F7507f2412A54566a4573B9775P2983f9244k00175J05359d5132k10712
12024b55844A17516Q9244c04337J06924h8323A22555a77355b9327r5743e862q0563
$$ y = [135219, 247237, -28393, 518801, 333353, 140597, -30865, 90833, 211531, 197844, 340542, 246119, 7380, -44322, 192475, 252500, 46793, 129368, 321540, 241190, -62656, 209350, 192149, 184749, -16724, 196069, 170059, 452628, 212666, 340413, 359835, 217528, 531958, 35032, -146203, -82527, -26631, -279978, 208869, -7405, 7749, 167181, 136002, -256008, -61260, -22439, 357640, 180427, -29927, -210310, -306297, 47019, 148279, -146047, 161109, -100472, -116498, -141550, -191608, 28824, -71221, 303602, -109539, -112257, 218920, 20461, 321456, 67507, -62412, 154566, -14573, 29775, 102758, -69244, -269419, -164060, -45132, -255844, 117516, 206760, -304337, -197413, -88323, 122555, -177355, -29327, -125070, -5862, -86425]
12013h6425B07728R753a92229J4580a6299j12805d6374A71467d4163k65331D41669
12001A70407q626d6136l17378i0147H9323J9938c748j02889d288m09605A1301
11989d1675G4547N9939B5779a28777j88790A4557a08144o7794D4277a34314G4083
11977B68153C9394P5643a13718A11523c6504A79934H7393Q628b60121R2947E1937
11965a4309q3169A38131D3767a54307P4603n7143G6163J76177d094j42291E4532
11953c90432J67292o9788a44776A44721A203J0026a98531j42085J31540A06844
11942a01531K9357H4957a54980j60K9250j2213p6093C340N2919A4028J88501a33746
11929e541B63976a95281F1482M24396F8927j9345a6093m77802E8590J22164a08177
$$ y = [-86425, 207728, 217481, -192229, -177649, -16299, -129104, -46374, 171467, -44163, -309494, 441669, 170407, 161781, -46136, -363514, -90147, 89323, 109261, -3748, -106637, -4288, -413893, 11301, -41675, 74547, 134486, 25779, -128777, -317567, 14557, -108144, -175938, 44277, -134314, 74083, 268153, 39394, 115037, -113718, 111523, -36504, 179934, 87393, 96021, -260121, -167174, 51937, -14309, -97478, 138131, 43767, -154307, -79704, -136847, 76163, 252340, -4094, -146385, 54532, -390432, -223140, -292928, -144776, 144721, 1203, 11229, -198531, -340616, -209076, 106844, -101531, -72174, 84957, -154980, -155140, -125890, -138103, -214196, 3340, 56259, 14028, 202529, -133746, -5541, 263976, -195281, 61482, 485878, 68927, 49582, -16093, -493895, 58590, 180754, -108177]
11917c7298n5179A90611b63559A29594d98720d4770e873A67468G4404N3714D2559
11905A50451f1162l71529g8028D8206h067A88849E9287a01160b4384k76000D67574
11893e84243h6693L3290j78229D1399d720E5141d01148D3276J25800m1333l9986
11882H7757a35060B14934e4150j17810k00585O3443A06803k9036e57615I9890
11871E4817c4711k77016i7047n7250b5967j00575p3082j17474a1619b136C5243
11859H1440d2507C0890b1894k99774h4249j95019e3612B31443A11214A44b67457
11847a8943f210l10872A12490d4573q817l03336h3014j7332B24895q9249J00078
11836B35724b47662J09258A20066a26681E3621P4986K7899c55710c1957P579k3291
$$ y = [-37298, -92477, 190611, -263559, 129594, -498720, -44770, -5873, 167468, 74404, 128118, 42559, 150451, -61162, -432691, -78028, 48206, -8067, 188849, 59287, -101160, -24384, -300384, 467574, -584243, -86693, -53403, -231632, 41399, -4720, 55141, -401148, 43276, 169076, 127743, 87757, -135060, 214934, -54150, -171960, -372545, -309102, 106803, 77767, -557615, 99890, 54817, -34711, -311727, -97047, -154297, -25967, -126542, -199624, -317098, -11619, -2136, 35243, 81440, -42507, 30890, -21894, -321668, -84249, -279268, -53612, 231443, 111214, 144, -267457, -18943, -6210, -317082, 112490, -44573, -53390, -356726, -83014, -100346, 224895, 135646, 235724, -247662, -138404, 120066, -126681, 53621, 128607, 156506, -355710, -31957, -24378, -47669]
11825d7669B3351J28324f5990j66141c9835k16818B33102a08007n6108A18047
11814A84280p7504J31815I8813K77704D289P8762N580f2790k45096r2121a5509
11802a83212N539j13919a16698a8662l16601B25819f7275p0405f2382q880j58718
11791b29980f4725D5120b0256n2210A40409a33774A14290m1541K9078C230c70337
11779A40353B0128M189M4200g7469L8311E6784J90476a1221B7419K0048a73423
11767d9347a5316j17105j11224f66k41920J9793R7878I4521K36320G3053c3734
11755b79575B30875H6427I195K34273c23465f8927j61651R0783H671a14808A46431
11743b58429A67275J04037g1188j87793B26474B7084i3698H8215O4471o3217a24597
$$ y = [-47669, 23351, 151675, -65990, -232131, -39835, -256653, 233102, -108007, -164115, 118047, 184280, 106776, 238591, 98813, 376517, 4289, 83051, 88631, -62790, -307886, -400007, -15509, -183212, -177673, -291592, -116698, -18662, -335263, 225819, -67275, -137680, -62382, -71262, -229980, -64725, 45120, -20256, -72466, 140409, -133774, 114290, 72749, 101827, 3230, -370337, 140353, 20128, 24317, 68517, -77469, -39158, 56784, 247260, -11221, 27419, 47467, -173423, -49347, -15316, -132421, -243645, -666, -242586, -222793, -124915, 94521, 330841, 73053, -33734, -279575, 230875, 86427, 9195, 243468, -323465, -68927, -230578, -139795, 8671, -114808, 146431, -258429, 167275, 271312, -71188, -258981, 226474, 27084, -93698, 88215, 152686, 89469, -124597]
11731i926A43069a2252j99584b3384k78673C49253D7899K17093I1162c4031B47490
11719D97469c50601H9533J0545a26583A9348N533K09818e9032F6436a15143c7248
11707C9950J14952D5063J37779P6323a97452A15848P9447a72003p0599M4878B18209
11695B98954G6924d5530k41724B11338A8454b36961O3751B54261A7043L29231
11685C46274r2979a93835B09794b93740p667O3113D7025d4108j64609B92511a23995
11673C5473J45017F4673A6206b71334J18282H2537a39360c7671J0627l4922a1497
11661f7906m1036H8589a29944G3973k1676b61838G0960J72889r2596R4642h938
11649B84339n1435C6078a79257Q4478L8845B39927i1861K2828a4616l59900P6954
$$ y = [-9926, 143069, -12252, -211836, -23384, -302057, 349253, 47899, 264992, 91162, -34031, 247490, 497469, -350601, 89533, 100078, -126583, 19348, 24881, 234699, -59032, 66436, -115143, -37248, 39950, 154902, 45063, 182842, 259165, -197452, 115848, 195295, -172003, -242602, -197724, 218209, 298954, 76924, -45530, -287254, 211338, 18454, -236961, -173210, 254261, 17043, 346274, 253295, -193835, 209794, -293740, -301407, -238294, 47025, -44108, -208717, 292511, -123995, 35473, 180490, 64673, 16206, -271334, -153052, 82537, -139360, -37671, -27044, -61966, -11497, -67906, -108942, 88589, -129944, 73973, 52297, -261838, 70960, 243849, 151253, 245895, -8938, 284339, 232904, 36078, -179257, -94779, -55934, 239927, -91861, -69033, -14616, -374516, -297562]
11638b97562J27157c8041j14110f2184H2279a39213A42374D2662L5656K6453l4642
11627G0129b43782A8594J43887M4939j5872a75514M9261A59421g2163A12319f2554
11615B6597J05695j1663d35992a6410C6036a79444e7056l515E3043g3421H4884
11603B39834j6535D5978b8506F5732h3552A62255k0019o9453e1677R155E4460
11591a55795A40157j2144B9440h2k23018P0989g2014l00838a13749B89852A04254
11579A07299K14531a1796H9164c4922p2745E5894J95542a85819e6030B11788c84898
11567D677K09351n2413c5693k2251a0315p0320n2408A75451q7111a13562c6147
11555C14166k0756F2359M8516a23210j23096B38884I8667a36006C27170G5954
$$ y = [-297562, -170405, -38041, -152151, -62184, 82279, -139213, 142374, 42662, 78318, 104771, 70129, -243782, 18594, 162481, 207420, 191548, -175514, -126253, 159421, -72163, 112319, -62554, 26597, 132292, 120629, -435992, -16410, 36036, -179444, -57056, -60571, 53043, -73421, 84884, 239834, 223299, 45978, -28506, 65732, -83552, 162255, 142236, 72783, -51677, -42522, 54460, -155795, 140157, 128013, 29440, -82, -223100, -152111, -72014, -372852, -113749, 289852, 104254, 107299, 321830, -11796, 89164, -34922, -107667, 55894, 251436, -185819, -56030, 211788, -384898, 4677, 214028, 161615, -35693, -57944, -10315, -80635, -133043, 175451, 88340, -113562, -36147, 314166, 293410, 62359, 110875, -123210, -246306, 238884, 98667, -136006, 327170, 75954]
11544E3241H572a04161C66879a04354C13502E8540b12129i6158q745G5798J59475
11533B35273K1898n4668J3257a2662A46603f7838B3630J8012e7469j50900A88910
11521B92682a63398f2904A69945o1259B1985P2829i4271C48810a72276B1052b73360
11509A42764M6536i4079b2011j27660A67719K9870N6743R2399a18932B65411j15663
11498A49748c9642B2597f2804A96282c36682G4538g6171H8604K84755I5705B9254
11486A46874l2079d0635C00168d8302m04477a37993b1382E5404K15134H1933d1343
11474A24488a97343C12828B4759K55890j27808l9547Q1832n8842A5657K43330
11464B58987J51810c28383F5474L36429A53370K53396A53826Q8551b4554j13580
$$ y = [53241, 8572, -104161, 366879, -104354, 313502, 58540, -212129, -96158, -104903, 75798, 235273, 257171, 202503, 215760, -12662, 146603, -67838, 23630, 41642, -57469, -208369, 188910, 292682, -163398, -62904, 169945, 108686, 21985, 94814, -94271, 348810, -172276, 21052, -273360, 142764, 189300, -94079, -22011, -149671, 167719, 197589, 254332, 346731, -118932, 265411, 149748, -39642, 22597, -62804, 196282, -336682, 74538, -76171, 88604, 373359, 95705, 29254, 146874, 114795, -40635, 300168, -48302, -452779, -137993, -21382, 55404, 270538, 81933, -41343, 124488, -197343, 312828, 24759, 280649, 152841, 113294, 195126, 136284, 15657, 258987, 410797, -328383, 65474, 401903, 153370, 406766, 153826, 242377, -24554, -138134]
11454a38134N8864o7174N8195B6484e8412i460l82045c1057A39651J40902b2590
11442a24356C6297K6506i4491B42834a61875A62578p352a6074A49437c10511i7757
11430D46828C5191l68J04900m0629A5336b11279I1788C2346c48515F5922a33224
11418B2985a40498f8578b6392k58525B81210a99476i2760H4934d0876H6360a78528
11406A54022J77482a75203B19039c27649d2843A57518a69406b942B24268a65747
11395A06256B2011a65515j3588J2850r4095a11629j78732A55139f9295r9784G0482
11383a66795O3894M9358n3631j77170g5338C2517q786J72590a692j5286n045d436
11370A65661D2401b37133i991l14274g2513j26685c7014j31840B44689a84854
$$ y = [-138134, -79270, -146444, -88249, 26484, -58412, -9460, -391505, -31057, 139651, 280553, -22590, -124356, 36297, 62803, -94491, 242834, -161875, 162578, 155226, -16074, 149437, -310511, -97757, 446828, 35191, 34823, 139723, 99094, 15336, -211279, 91788, 32346, -348515, 65922, -133224, 22985, -140498, -68578, -26392, -284917, 281210, -199476, -92760, 84934, -40876, 86360, -178528, 154022, 331504, -175203, 219039, -327649, -42843, 157518, -169406, -2942, 224268, -165747, 106256, 22011, -165515, -179103, -166253, -260348, -111629, -290361, 155139, -69295, -169079, 70482, -166795, -102901, -53543, -107174, -284344, -75338, 32517, 23731, 196321, -1692, -16978, -22023, -4436, 165661, 42401, -237133, -9991, -324265, -72513, -199198, -37014, -168854, 244689, -184854]
11359B97358a32118m9642j15428j58700A01013a92514B13963i442I6335a31254
11348a46079a2467B75803m8528b09600e6482B37320r8389b03221I8311a02010
11337A14444j4346g1988B50791c06845j70893A08337D981c9639l15362J00062
11327b54939f8020A31836b127j40917A43756E1574a2344C49640c8724B91838r9701
11316A92137B180K77901e3825I032a22246Q514J3552F6002b4584l59974i4373
11304a02327a6619k82613g3407E9435a21980A88755b23331A32780b76922B02691
11293H7879c73031D2041K13174I3784a85661c0559j29462f8849B8867J18432f6963
11281b54399c475A41329a33348q9721c8343l11289a57634k56741a61311d1237
$$ y = [297358, -132118, -181760, -297188, -455888, 101013, -192514, 213963, -9442, 96335, -131254, -146079, -12467, 275803, 227275, -209600, -56482, 237320, 138931, -203221, 98311, -102010, 114444, 100098, -71988, 250791, -306845, -477738, 108337, 4981, -39639, -355001, -254939, -68020, 131836, -2127, -143044, 143756, 51574, -12344, 349640, -38724, 291838, 192137, 2180, 280081, -53825, 9032, -122246, -113732, -100180, 66002, -24584, -384558, -94373, -102327, -16619, -299232, -73407, 59435, -121980, 188755, -223331, 132780, -276922, 202691, 87879, -373031, 42041, 255215, 93784, -185661, -30559, -160021, -68849, 28867, 147299, -66963, -254399, -3475, 141329, -133348, -223069, -38343, -349632, -157634, -414375, -161311, -41237]
11270B40582c8793l33444A23449J4006b54121r4996J15060j6798B66764L5057
11260C01821j1264A32703a27978l7729J8359j24589B29233a41180M8529L9302
11250e3349j05968E3669R7434D9967a94829e7726A82789O7321b45693g0741B43160
11238c4743I739a85713A35056a12808j48510J9779a02700d2522j48159M5088l560
11227a49153d7230p0331d8096k243A65606a26385q5954A3405a82413r436r5709
11216b87558E9170d0705n2548D3796b07230M6118B31849p0928d21845e6598j0530
11205f7128j7612E8750J29039g2634k28265J5024J20284P4889K8023o7362j20117
11194b50158B23468H8245j9482K31844g391q746j89744d4341J1359p6815A91074
$$ y = [240582, -38793, -372237, 123449, 137455, -254121, -349117, -234057, -250855, 266764, 301821, 290557, 132703, -127978, -165707, -147348, -271937, 229233, -141180, -92651, -53349, -159317, 53669, 151103, 49967, -194829, -57726, 182789, 250110, -245693, -70741, 243160, -34743, 9739, -185713, 135056, -112808, -261318, -241539, -102700, -42522, -190681, -145593, -149153, -47230, -117561, -48096, -50339, 165606, -126385, -212339, 13405, -182413, -191849, -287558, 59170, -40705, -93253, 43796, -207230, -161112, 231849, 160921, -421845, -56598, -67128, -84740, 58750, 187789, -72634, -300899, -285875, -165591, -90702, -62679, -130041, -250158, 223468, 88245, 68763, 300607, -7391, -16137, -205881, -44341, -32982, -109797, 191074]
11182i0495d1161k28551J18501I9039h6561k21451a06703L9503A43562g4424A41834
11170E4255P9988m5863K00785d343C688a22742M5355m1854l19771A4122K1822
11159C5944K6119c3390C17011L7970g96D46978I9456c02193K7136C68618b00988
11147f5932F3065K78308b3703j1192j18729A05229a23033A03328c24954e6942
11136b67332A43230c48996J00570A27120g7180B18455a88633K39c4732A79102
11125h4776L4092B31765e1788D313L21512n1428E2432b9721A54430o0130J20066
11114B14366c3441l15956a13014A65849C721L4997b90176H5870Q6962a25980A47527
11102C6202J12658L8005E5360J5249M5562K8974J81080j14227b2892C30128H083
$$ y = [-90495, -41161, -269712, -151211, 99039, -86561, -308012, -106703, -67200, 143562, -74424, 141834, 54255, 134243, 88380, 289165, -4343, 3688, -122742, -77387, -119241, -439012, 14122, 35944, 62063, -33390, 317011, 354981, -796, 446978, 99456, -302193, -275057, 368618, -200988, -65932, 63065, 341373, -23703, -34895, -153624, 105229, -123033, 103328, -324954, -56942, -267332, 143230, -348996, -248426, 127120, -77180, 218455, -188633, -188394, -34732, 179102, -84776, -50684, 231765, -51788, 4313, 325825, 274397, 52432, -29721, 154430, 94300, 214366, -33441, -349397, -113014, 165849, 3721, 38718, -290176, 85870, 172832, -125980, 147527, 36202, 148860, 186865, 55360, 70609, 116171, 145145, 326225, 211998, -22892, 330128, 8083]
11090A66164B449L57717f3957B89628j30695R2678G7932M708a39432a9028A64714
11078A71781J84396p7322a54580B58065j16352K22126A76516B1130K75046J6306
11068C12482J76508C9731J23351N5747l753L01217A58285K40002R0296B33293
11057B55285k6192J43489A69681M29437k98224L47961J15633j81863B26127L08579
11047E34706K2416j25530o519J37564O1553R381j5160j54673L7824L14097k88035
11036E27624J21225J08841n0104k9306j35410K68216k72587o3312j7032L11042
11026G69197k46865J94253j08769k77831P6753K59933K11950m06085J53610B08361
11015E79681r1346l1967K9087J15803J54591k47354B27131J62852j34772L2984
$$ y = [166164, 2449, 360166, -63957, 289628, 158933, 251611, 77932, 82640, -139432, -19028, 164714, 171781, 356177, 278855, -154580, 258065, 141713, 363839, 176516, 21130, 296176, 312482, 488990, 39731, 163082, 218829, 215076, 516293, 158285, 398287, 488583, 233293, 255285, 229093, 372582, 169681, 599118, 300894, 648855, 764488, 582625, 226127, 534706, 557122, 431592, 425073, 562637, 624190, 633571, 618411, 463738, 501562, 815659, 527624, 648849, 757690, 707586, 678280, 542870, 811086, 538499, 475187, 458155, 769197, 522332, 716585, 607816, 329985, 406738, 666671, 878621, 472536, 626146, 208361, 579681, 488335, 456368, 485455, 601258, 755849, 508495, 227131, 389983, 255211, 288195]
11005B88195L91318l06706J73898k18672L7292L93510C61761K03199p5867K20388
10995G09481j74184N533k3008r2561J41399j26097P7254P6428K39922l18839K88669
10984H03997k15889R9517J25234J79072l48363K68342P0604l8856K88624P8427
10974A310709K62954p4569J26145J17718K65316K25034N6317K26076j20439l50393
10964B044868J79482m20179Q708m11311J91339k08461k07720L80714l75639L89408
10954A571209l29243K47300m89071M96255j1623J33416p37876q5377L16856m17733
10944F94113M5941j08945n3775j45761q4837R557A01105Q3050a40763A99358K2161
10933B21519k6714r0798h4973I1614A6638J49590a9545C9674J75b9403B63682
$$ y = [288195, 679513, 372807, 546705, 328033, 365325, 758835, 361761, 564960, 489093, 709481, 535297, 540830, 517822, 425261, 566660, 440563, 517817, 594245, 834167, 515328, 803997, 588108, 687625, 812859, 991931, 643568, 911910, 982514, 943658, 1232282, 1310709, 1573663, 1499094, 1625239, 1742957, 2008273, 2233307, 2289624, 2515700, 2395261, 2044868, 2224350, 1804171, 1812879, 1401568, 1592907, 1384446, 1176726, 1557440, 1181801, 1571209, 1241966, 1489266, 1000195, 1496450, 1484827, 1618243, 880367, 794990, 1111846, 694113, 740054, 631109, 577334, 431573, 346736, 356293, 101105, 184155, -140763, 199358, 221519, 194805, 104007, -84973, 91614, 16638, 166228, -19545, 39674, 39849, -29403, 263682]
10921A03487D2770O7493a73434N2217j04933a7859q0179o2078A34468a3020m4678
10910e7698K0444l6852B65942I5118i9936O368J7759G0002M6537b19345L8995
10899a80350e3016P547R488q7651C6193a39609q9258A17215b8101A75358b1223
10887i2023n5472m4052A59491F2403a6042A2859a76837B88449h2100j77418A45646
10875h549o0374k36632A81619A3632a76519j51177A45019a76251A5673K08290
10865B23963F8374b8541j33574M4669j08979o5038A2704b26882h9615A44097a26086
10853a74161O9258F9874a1222I7160b19495J04265B73968b20860D8621L25072
10843C73693G2985L50207c31918C6979d63977A77125d7026j6193K5808j06058
$$ y = [103487, 42770, 110263, -173434, -121217, -226150, -17859, -98038, -160116, 134468, -13020, -57698, -37254, -74106, 265942, 95118, -99936, -93568, -75809, 70002, 116539, -219345, -180350, -53016, -45469, -35981, -123632, 36193, -139609, -228867, 117215, -28101, 175358, -21223, -92023, -147495, -191547, 159491, 62403, -16042, 12859, -176837, 288449, -82100, -259518, 145646, -8549, -68923, -305555, 181619, 13632, -176519, -327696, 145019, -176251, 15673, 223963, 68374, -28541, -162115, -117446, -226425, -291463, 12704, -226882, -89615, 144097, -126086, -174161, -104903, 69874, -11222, 97160, -219495, -115230, 273968, -220860, 48621, 373693, 72985, 423192, -331918, 36979, -463977, 177125, -47026, -63219, -37411, -143469]
10833a43469k43818A01077a9170n7817C05011b88422a32686e8633p9646l2236
10823a70515f9562A6088b0674k32504B79109d39517b5560k31886I7802a06230
10812B06606f9690C0540b5062J886k28066R8195c3788j44251B73617g4463j20004
10801a94467A01728c15576A35774K62025a10032A17541b34616j31034a56753P6936
10791g9817K9744B01017A8084a38994f4126j55251f9722A00960b5750j2607A33898
10779a37380A7030c98429j56371I322K4251Q5488a12972A06951a70895m006A1564
10767A05277a58717A3360h5127l97448E1575K64861c86403A13353n5080c20369
10756F8819K7220D1042A5399a55603j20406a4793k35363A13638h184k55641A70080
$$ y = [-143469, -387287, 101077, -19170, -76987, 305011, -288422, -132686, -58633, -138279, -170515, -69562, 16088, -20674, -253178, 279109, -439517, -25560, -257446, 97802, -106230, 206606, -69690, 30540, -25062, -23176, -251242, -153047, -33788, -178039, 273617, -74463, -194467, 101728, -315576, 135774, 397799, -110032, 117541, -234616, -365650, -156753, -79817, -50073, 201017, 18084, -138994, -64126, -219377, -69722, 100960, -25750, -38357, 133898, -137380, 17030, -398429, -554800, 9322, 33573, 119061, -112972, 106951, -170895, -174901, 11564, 105277, -158717, 13360, -85127, -482575, 51575, 316436, -386403, 113353, 58273, -320369, 68819, 96039, 41042, 15399, -155603, -276009, -14793, -250156, 113638, -8184, -263825, 170080]
10744c5180A79923A5487h7632K6405A75604G8843b13372f088j30316K9995M0925
10733f5484A11521c9002k39670a0455H838e0285a6050l76639A18699c42965b3488
10721B5764J02410b41832h3617I4118a57794A04682h9440F6624J31312c10019
10710b77692i3069n7076j66544L7458l3954a12651o5208m878O8159K8117M0349
10699d6112j88944I6730e3681k62262a28935i897k32458c0333j1535j35726c3826
10687a26788B30329i5410A67418B398d73926A14768d88581A48622A1J32897n8763
10676G4145f1448A01931b50783R3950a1448m06605D6804k1209b77299G0659a3411
10664A96203D8717K5559d4949C0269f8290j9280m2542A967a35635r6193i985A71519
$$ y = [-35180, 179923, 15487, -87632, -61227, 175604, 78843, -213372, -6088, -136404, -106409, -65484, 111521, -39002, -278672, -10455, 8838, -50285, -16050, -392689, 118699, -342965, -23488, 25764, 128174, -241832, -83617, 94118, -157794, 104682, -89440, 66624, 197936, -310019, -277692, -93069, -150145, -316689, -279231, -313185, -112651, -177859, -182737, -114578, -86461, -46112, -235056, 96730, -53681, -315943, -128935, -9897, -242355, -30333, -41868, -177594, -33826, -126788, 230329, -95410, 167418, 2398, -473926, 114768, -488581, 148622, 11, 132908, 74145, -61448, 101931, -250783, -156833, -11448, -418053, 46804, 25595, -277299, 70659, -13411, 196203, 48717, 74276, -44949, 30269, -68290, -87570, -130112, 1967, -135635, -231828, -9985, 171519]
10651e0503m03998H8865d7030A31237n5509J83490b59455A62935g2420k2045j28614
10640b23079a0012j33151I7140a5942B1384d3239E4561b61172r1134G8754c12398
10628I5743a53123A86833b5478D0745h7844A20212c6560j45573o405Q3317r1855
10617a97076O3016A87940A3962R9742a29855B61533a61152A22654h8168n3184
10607a41352j44342i7392E6464J28661J22485E9831d1985A55029g2951a6533j12379
10596a28912d5150j08698p5644B68947c33154j24707B66868H7165L0423e58C40951
10584e9733j09846A20755d05964P3647f8497l03891J37927a04447j53579A14286
10573E5684f7887A29316a95062M8417J9741j20184a2746k9494q8152b0905j63747
$$ y = [-50503, -454501, 88865, -47030, 131237, 75728, 259218, -259455, 162935, -72420, -94465, -223079, -10012, -143163, 97140, -15942, 21384, -43239, 54561, -261172, -352306, 78754, -312398, 95743, -153123, 186833, -25478, 40745, -87844, 120212, -36560, -182133, -188538, -105221, -197076, -134060, 187940, 13962, 113704, -129855, 261533, -161152, 122654, -88168, -141352, -285694, -97392, 56464, 185125, 307610, 59831, -41985, 155029, -72951, -16533, -128912, -45150, -153848, -229492, 268947, -333154, -457861, 266868, 87165, 117588, -558, 340951, -59733, -169579, 120755, -405964, -332317, -68497, -372388, -234461, -104447, -258026, 114286, 55684, -67887, 129316, -195062, -146645, -126904, -247088, -12746, -42240, -130392, -20905, -184652]
10562a84652C6392a6153p2608A62517a15703j5984j8037o9172a07690G8564c6980
10550a06817B56188a43215k06244a2339j44725q8050E9464a78543e9109b0759
10539b14420k2025M2569A06207k4804G973Q979a51522I0421b39487M103e3192
10527G7683b85794e2672A02309c52216P5142a6473k24401J13927l6922A21066
10516b36241G2838a94941A90913a1987k01734b7794A65739a10058B9229b19489
10505c2552j43888h120A00214m6074P5947e2629K954A23915l9676i9122B38380
10493b94605e6768F8781f9242A67455E9870a70399D1428a51921B7726a03070a7681
10481a29367K7683N611A15954J03722C2830K13747A15473K20021J16044Q5063
$$ y = [-184652, 36392, -16153, -88761, 162517, -115703, -131687, -149724, -218896, -107690, 78564, -36980, -106817, 256188, -143215, -349459, -12339, -157064, -245114, 59464, -178543, -59109, -20759, -214420, -236445, -193876, 106207, 81403, 7973, 16952, -151522, 90421, -239487, -235384, -53192, 77683, -285794, -52672, 102309, -352216, -277074, -16473, -240874, -126947, -163869, 121066, -236241, 72838, -194941, 190913, -11987, -213721, -27794, 165739, -110058, 29229, -219489, -32552, -176440, -8120, 100214, 54140, 130087, -52629, -49675, 123915, 84239, -99122, 238380, -294605, -56768, 68781, -69242, 167455, 59870, -170399, 41428, -151921, 27726, -103070, -17681, -129367, -101684, -96073, 115954, 219676, 32830, 246577, 115473, 335494, 451538, 536601]
10471E36601A64326K23968c12546A4202a47482k01719e8979F231K1571J3143e6342
10459c2181E6986J00834a15751j87727e0878n7188B8213a0684A14213i1040k7601
10448a18641j78163l7181i9311d4831o0801j00180R3230B74340a22546r2336i6036
10436a13841o6847l16024b02854o0447c5726r9245j33143P3491E4217a62772b4935
10424c3398I6933n648l8852B5184g5519A57975d92724a70286c7139r8585C53699
10412a77733A84147L40508d6981a5888j52341E6596J0295a93299j8966o5552a15797
10400A01976b51770A97286R0252F0803b55724G9284K30142a47044A71322G0859
10389a87909A12764k6976j1613K07474n3081B018J14695h5567B10834I2761c45034
$$ y = [536601, 164326, 388294, -312546, 14202, -147482, -349201, -58979, 6231, 27802, 40945, -56342, -32181, 56986, 157820, -115751, -303478, -50878, -108066, 28213, -10684, 114213, -91040, -118641, -296804, -333985, -99311, -44831, -105632, -205812, -112582, 274340, -122546, -214882, -96036, -113841, -180688, -496712, -202854, -263301, -35726, -134971, -268114, -194623, 54217, -162772, -24935, -33398, 96933, 91285, 52433, 25184, -75519, 157975, -492724, -170286, -37139, -135724, 353699, -177733, 184147, 524655, -46981, -15888, -168229, 56596, 66891, -193299, -212265, -277817, -115797, 101976, -251770, 197286, 287538, 60803, -255724, 79284, 309426, -147044, 171322, 70859, -187909, 112764, 85788, 74175, 281649, 228568, 2018, 116713, -85567, 210834, 92761, -345034]
10377c85537B66931a27689B66541j29715k0556J79707A03285K15824A18577a57297
10366A47194Q9547J58316m0320K0073J67783A18531J88327P7773A51632a37602
10355B04574E2484d3530H6550J44711p1201M257K21166A80330K14107R6835E9997
10343B90320k8884K07676l696k22061M31214B55585D6622K07271B8322K55792
10333B84114I8820J65J43458r7817a4067A54244b20468A69566l9135b36770c4684
10321B28676G2112g0371c86k81875G0103K10610j7586L0588r6015J26522A3944
10309A74766C4613a05684O28C03904c56214N0641B38800j08371a41785j24048
10299b65833A8760c73325A88093c15030E4451i5484d0692j1449k93972M503a53387
$$ y = [-385537, 266931, -127689, 266541, 136826, 116270, 295977, 103285, 319109, 118577, -157297, 147194, 236741, 395057, 354737, 374810, 542593, 118531, 306858, 384631, 151632, -137602, 204574, 52484, -43530, 86550, 231261, 160060, 164317, 385483, 180330, 394437, 491272, 59997, 290320, 261436, 469112, 465416, 243355, 674569, 255585, 46622, 253893, 28322, 284114, 98820, 98985, 242443, 144626, -14067, 154244, -220468, 169566, 130431, -236770, -34684, 228676, 72112, -70371, -386, -282261, 70103, 280713, 263127, 293715, 197700, 324222, 13944, 174766, 34613, -105684, -105056, 303904, -356214, -305573, 238800, 130429, -141785, -265833, 18760, -373325, 188093, -315030, 54451, -95484, -40692, -52141, -346113, -341610, -153387]
10287a7719j20588f4845j56445F9208N0596a81943o3232F7760A8202c84718i0331
10275B5109J17231A1436c32370D1518I069d7289F8750J02798a42150p0739d2436
10263a83912j9325Q2661A4697b51306L1077G8425b24484o3309b7808B02791k436
10252B00355O5430a4052A47467J19262L8829A01920K21715J6439f053m0302m09728
10241d56083E5332d81828B7437M2931K66083C8934M296e8332A65310D1351D32
10229a18181j79690C62143A03347P0188N6842b6462G0654b21715p8644g2288A78467
10217G6373b3778j64199A9322e43607R1116a23920b8923j36439j05235c0568B5426
10205g9595D6036K42491a06833j22609R8200B52817G2973d00486h0704C02000
$$ y = [-17719, -138307, -64845, -221290, 69208, 119804, -181943, -245175, 67760, 18202, -384718, -90331, 25109, 142340, 11436, -332370, 41518, 9069, -47289, 68750, 171548, -142150, -212889, -42436, -183912, -203237, -120576, 14697, -251306, -220229, 78425, -224484, -287793, -27808, 202791, 200355, 265785, -14052, 147467, 266729, 305558, 101920, 323635, 340074, -6053, -46355, -456083, 55332, -481828, 27437, 70368, 336451, 38934, 43230, -58332, 165310, 41351, 432, -118181, -297871, 362143, 103347, 173535, 230377, -26462, 70654, -221715, -300359, -72288, 178467, 76373, -23778, -187977, 19322, -543607, -452491, -123920, -28923, -165362, -270597, -30568, 25426, -79595, 46036, 288527, -106833, -229442, -131242, 252817, 72973, -400486, -80704, 302000]
10194A21244a42366j24655A86610b12868c7973A61075P4363d408j84304L4366
10184a54346j0155p6482A32677b41285H828h654m47454H7425L5483D0210c6822
10172c82670J72868M6869F844b78020l3949J00609A21506h7855l5047r0253F6714
10160a12414A03430d1239l02445a31897I6092c20812b0665j00066j96883g4812
10149D6326d2368B10753a09459k80174J69314A4721N4326j9753P3743c18813a24049
10137g9578F5110p109J4221M9206d4724j21674B1243K57773A26466e00054f6976
10125c6687A22160M8784L1400g8751b6464l8037A65206c68122e4833l8080p2173
10114a65086B3646R8741f6374l3280j05422q4798m2675h3403n3341r0185A94271
$$ y = [121244, -142366, -267021, 186610, -212868, -37973, 161075, 235438, -4408, -188712, -154346, -164501, -240983, 132677, -241285, 8828, -8654, -456108, 87425, 122908, 40210, -36822, -382670, -209802, -162933, 6844, -278020, -311969, -211360, 121506, -87855, -122902, -213155, 66714, -112414, 103430, -41239, -343684, -131897, 96092, -320812, -20665, -120731, -317614, -74812, 46326, -42368, 210753, -109459, -389633, -220319, 14721, 69047, 49294, 123037, -318813, -124049, -79578, 65110, 58001, 72222, 121428, -44724, -166398, 21243, 279016, 126466, -500054, -66976, -36687, 122160, 170944, 202344, -78751, -26464, -64501, 165206, -368122, -54833, -92913, -165086, 23646, 122387, -66374, -99654, -205076, -289874, -332549, -83403, -136744, -226929, 194271]
10102d50018K17963Q1181c5091j17228A21802O4303c05019A39905Q0724k0153
10092B00476a03535j73742a01651A64916b46712A34394e9146B20672e969j9650
10082b5619A16287g0274A24336e2128F329a21718B3398J95044a95761O8940j13647
10071b40468B05506b92462H660a39981A7417a70970k52234d1113B02035Q8747
10061B90782b11451D0589f2603n1982j42468J19025f3503B19104b41532J06926
10051a34606O6658n7555j9205j00205L3977i9906L5017M747A96789b40868a12683
10039e1344k34637B16721c035j59559N1579F1711a22274j77941P8829A48309A555
10027I9876a95575A16331f8310m7878m8667j90060B21485a47643B36855b69221
$$ y = [-450018, -232055, -150874, -35091, -152319, 121802, 186105, -305019, 139905, 220629, 200476, -103535, -277277, -101651, 164916, -246712, 134394, -59146, 220672, -5969, -25619, 116287, -70274, 124336, -52128, 6329, -121718, 23398, 218442, -195761, -126821, -240468, 205506, -292462, 8660, -139981, 17417, -170970, -423204, -41113, 202035, 290782, -211451, 40589, -62603, -114585, -257053, -138028, -63503, 219104, -241532, -134606, -67948, -125503, -144708, -244913, -210936, -99906, -64889, -60142, 196789, -240868, -112683, -51344, -285981, 216721, -3035, -162594, -111015, 61711, -122274, -300215, -221386, 148309, 1555, 99876, -195575, 116331, -68310, -116188, -164855, -354915, 221485, -147643, 236855, -269221]
10016g6483j8241k05391F5669R4622a54592A37792b99002I814e3448C59381j16260
10005B43121c40095J31982a6571j47136D3157g3434C3563J08559H255d2614n9805
9994a02419K0972q0859a8879A42055c1636m8680k3297M362k31467n4021B62240
9982b68650C11365g0115j01105A46584c12469B52655k2679b29464C5662a36003
9971b09025c4844I226b61826H5271b62806M5751f836A26095b10376B21862n3982
9960A67880e9142q644j47535j53938A74884G6053c9428A40275Q7258e2636k4065
9949g6701A40062E6176A3267a75774O8760j2220A340d8792I0685c93939A64901
9937c0909j84893J03899A49772F2334b20013o9791r3864A04048a28626q7466A9017
$$ y = [-76483, -94724, -300115, 65669, 160291, -154592, 137792, -299002, 9814, -53448, 359381, 243121, -340095, -208113, -16571, -163707, 43157, -73434, 33563, 142122, 8255, -42614, -102419, -81447, -162306, -18879, 142055, -31636, -80316, -103613, -99251, -330718, -384739, 262240, -268650, 311365, -70115, -171220, 146584, -312469, 252655, 229976, -229464, 35662, -136003, -209025, -34844, 9226, -261826, 85271, -262806, -217055, -6836, 126095, -210376, 221862, 167880, -59142, -67786, -215321, -369259, 174884, 76053, -39428, 140275, 227533, -52636, -76701, 140062, 56176, 13267, -175774, -107014, -119234, 1340, -48792, 90685, -393939, 164901, -30909, -215802, -111903, 149772, 62334, -220013, -289804, -383668, 104048, -128626, -216092, 19017]
9925b02688I9932a51769B59965a54587f8567n1283n0310j3880g2318c4193J61
9914c4032k48824a00585K7526P936m6870B57551a54616C3439Q1080e46301i3736
9902a30336N8215D3397q891a9034k49559D3313c7061A00897b03474k99431I729
9890b10571j11326J12849B1403g5861C18827b55482N3798b9720A20979c4459A37057
9878a08197R755q7987b8696l5756m26746B45949G949a66560j0781a5892n07166
9867e23058A35984a90790o0373b6017n00453d8679E3270a61127O5047p4717O6038
9856a04759H3957Q6222a88178F3737a01596A12346c34640E9076g2694C2270b78556
9844A11800i7935c0268I7303m5103b23687j8549k39391A5762K1963b91922A21957
$$ y = [-202688, 99932, -151769, 259965, -154587, -68567, -119850, -170160, -184040, -72318, -34193, -34032, -282856, -100585, -73059, -65123, -111993, 257551, -154616, 33439, 114519, -546301, -93736, -130336, -72121, 43397, 34506, -19034, -268593, 43313, -37061, 100897, -203474, -502905, 9729, -210571, -321897, -209048, 21403, -75861, 318827, -255482, -201684, -29720, 120979, -34459, 137057, -108197, -98442, -186429, -28696, -64452, -491198, 245949, 7949, -166560, -177341, -15892, -523058, 135984, -190790, -251163, -26017, -526470, -48679, 53270, -161127, -96080, -170797, -104759, 83957, 170179, -188178, 63737, -101596, 112346, -334640, 59076, -72694, 32270, -278556, 111800, -97935, -30268, 97303, 52200, -223687, -242236, -481627, 15762, 37725, -291922, 121957]
9832C10959a89880J5975B95722c9121j19972j10286K9529i0849k6707j04257L9220
9821a82593l9111c0932l29784A31234e6249k15376J09856J2044e8644B91043f2022
9809a2444A06137c25227q114g4282C9459a17207A51772b6931B6505c0968r8378
9798a29346k15315j40558B4132d72568b0421B4391b63095a9865l7777m4435B96313
9786E6725g9661l21523a12123r7434A17224a23002G0676C1625e303j60856F1952
9774G7593N2020a22895j10597G3499a28300m506o5035m3629P2942P6877G8418
9762E28347i923A83863b50967A40822b82020a31503k84496J86603d914j06570
9752a11484l6839B330J4474N4221k4122b44388A1109J22381b13981N8613o6695
$$ y = [310959, -189880, -173905, 295722, -39121, -159093, -269379, -239850, -90849, -117556, -221813, -182593, -221704, -30932, -360716, 131234, -56249, -271625, -161769, -149725, -58644, 291043, -62022, -12444, 106137, -325227, -333341, -74282, 39459, -117207, 151772, -26931, 26505, -30968, -129346, -344661, -485219, 24132, -472568, -20421, 24391, -263095, -19865, -57642, -102077, 296313, 56725, -79661, -401184, -112123, -209557, 117224, -123002, 70676, 31625, -5303, -166159, 61952, 77593, 129613, -122895, -233492, 73499, -128300, -132806, -197841, -241470, -168528, -91651, 78418, 528347, -9923, 183863, -250967, 140822, -282020, -131503, -415999, -229396, -4914, -111484, -148323, 2330, 16804, 71025, 46903, -244388, 11109, 133490, -213981, -155368, -222063]
9741b22063h9372p8747A79075j5850n8788f7581R597H4319J94391c1985j12232
9730a44217f8220Q400k73387C3611h5900C1172i8069k38591f1948k6605c5644
9718h1181r1078k9960j37571A04804c16211H2770c8925c566p6215E2600b07869
9706b5582b875B19479E0190b17211A1561M9178a65227j9204B39553j05072a67
9694a33183j61242a45714o4651A93324D2968b3738k01341A49593K52019E9277
9683b81615h1495k2060M3345k31793j15359B59254b94639i1160B19440G1626d1965
9671a09663c105k78608A06575K2091e0715J5547l02948f2376F2326a26393q3916
9660b10309n6509J2344C9859J43827a76056k10364D14417a33115A57010h8950
$$ y = [-222063, -89372, -168119, 179075, 163225, 104437, -67581, -57984, 84319, 278710, -31985, -144217, -68220, -59820, -333207, 33611, -85900, 31172, -98069, -336660, -61948, -88553, -35644, -81181, -172259, -202219, -339790, 104804, -316211, 82770, -38925, -3566, -79781, 52600, -207869, -25582, -2875, 219479, 50190, -217211, 11561, 60739, -165227, -184431, 239553, 134481, -167, -133183, -294425, -145714, -210365, 193324, 42968, -23738, -225079, 149593, 401612, 59277, -281615, -81495, -103555, -60210, -292003, -407362, 259254, -294639, -91160, 219440, 71626, -41965, -109663, -3105, -281713, 106575, 128666, -50715, -35168, -338116, -62376, 62326, -126393, -210309, -266818, -254474, 39859, 183686, -176056, -386420, 414417, -133115, 157010, -88950]
9649f5654A01044a2131o8850H6913B6819N5593c2744j08675c1064G609a89400
9637b29937K179e5993J9109A98053c6556m4096J8492A36268C225a27295j77687
9626c04982h8342A30024d26949C3680J21875o4042b41245R3157r8350A14435a66710
9614A50953a65686G7081h9613A32741K9797a53739G0660A8003h9958k85762g9907
9602I5399c03582H623c08874A61662M0415g7819l8653j48626J01775P8360A9941
9590A141d4635Q082j59215k22405d0142a876q7754j21695L0195M9990k0954N5250
9578i6844k44847B27313A11275J67317a72403d5530k03290h6998H3125c4697B5448
9566C6131a63096B23713C8589E442b82276G5389B2968L53594a67440g7457m1387
$$ y = [-65654, 101044, -12131, -80981, 86913, 26819, 82412, -32744, -141419, -31064, 7609, -189400, -229937, -227758, -55993, -36884, 198053, -36556, -80652, -62160, 136268, 3225, -127295, -304982, -88342, 130024, -426949, 33680, 155555, 91513, -241245, -148088, -246438, 114435, -166710, 150953, -165686, 77081, -89613, 132741, 162538, -153739, 70660, 18003, -89958, -375720, -79907, 95399, -303582, 8623, -308874, 161662, 202077, -77819, -116472, -265098, -163323, -84963, 19941, 1141, -44635, -36553, -195768, -418173, -40142, -1876, -89630, -211325, -181130, -131140, -152094, -96844, -341691, 227313, 111275, 278592, -172403, -45530, -248820, -86998, 83125, -34697, 25448, 36131, -163096, 223713, 38589, 5442, -282276, 75389, 22968, 376562, -167440, -77457, -118844]
9555a18844j46806A50301a74673E1875m116a58518a0837q5387h776j26695k95835
9544d31306N9616g8729c7111B4105e3259C9962b70816G8759a80195j91066j55778
9533e27039B63942i0416k8046j47215q9490a48024k00124K5932J13709J03230
9523a05277b3936j6410k0643j35349E3514Q0514b33207h7299j53551q521g5093
9511E6863b8928a1079k95331d9578k10082i3498K2605J5075l7373J3342A61966
9499b42966K5299a952A63887a32820r4064H8356b53124C29319A04905l4615c93524
9487a22995l8355j96379F9635K0940O7234e282k10012d0221B30804f7945j68709
9476b36654r87P4426A38412f9981J6884A30993C4510c68862F5800K8157a80849
$$ y = [-118844, -265650, 150301, -174673, 51875, 47759, -158518, -10837, -96224, -8776, -135471, -431306, -371690, -78729, -37111, 24105, -53259, 39962, -270816, 78759, -180195, -371261, -527039, 263942, -90416, -118462, -265677, -355167, -148024, -348148, -322216, -208507, -105277, -23936, -40346, -60989, -196338, 53514, 134028, -233207, -87299, -240850, -249371, -75093, 56863, -28928, -11079, -306410, -49578, -259660, -93498, -70893, -55818, -93191, -79849, 161966, -242966, -217667, -1952, 163887, -132820, -226884, 88356, -253124, 329319, 104905, 70290, -393524, -122995, -161350, -357729, 69635, 90575, 157809, -5282, -215294, -40221, 230804, -67945, -236654, -237641, -163215, 138412, -69981, -53097, 130993, 34510, -368862, 65800, 93957, -180849]
9464b02344d7331j48225p1973j14388B54759j20233o2696M2299i8372q2264q3363
9453b63999A27919a70881Q2233A02154C6720J09885i0073D5836a36339o0806B69484
9441d68955a56074A51692c33211n91I8505O3617a2004F4158B0557J2566L09243
9430C42366b82672H5328C7312b09510I3384a47954B8480a10553A85720a23347
9419b38891E7675g2719r4926O064A50167a26960k6917j52885k0995a04530F0587
9407B24625q8420J65683a90214A5652J24334m0430a59109P13B71943j18558a82055
9395E5782a70450a4992l43803A96980E2652d14483a9709A39368d3866j05867M5717
9384a04016G5237J22748q0085n2381K67100A23535a4742A1885J02602b10330F2561
$$ y = [-202344, -47331, -195556, -267529, -381917, 254759, 134526, 71830, 114129, -98372, -180636, -263999, 127919, -170881, -88648, 102154, 36720, 146605, -90073, 45836, -136339, -197145, 269484, -468955, -156074, 151692, -333211, -333802, 98505, 162122, -12004, 64158, 20557, 33123, 342366, -282672, 85328, 37312, -209510, 93384, -147954, 28480, -110553, 185720, -123347, -238891, 57675, -72719, -167645, -161581, 150167, -126960, -153877, -306762, -327757, -104530, 60587, 224625, 136205, 301888, -190214, 15652, 139986, 99556, -159109, -158396, 271943, 153385, -182055, 55782, -170450, -14992, -358795, 196980, 52652, -414483, -19709, 139368, -43866, -149733, -104016, 75237, 197985, 117900, 65519, 332619, 123535, -14742, 11885, 114487, -210330, 62561]
9372g7400B36187B3229h015B30178b86535A57910a13860q7546I4094f8892j3052
9361h1944A3638J1279J54292b74444a35249A2836b76676R1286D3107b18205E738
9349D7651b26564C7389O0510b27921f8017b5460b286p5962H1809b72261B7352
9337b53810A14666d12809d3932m2941r50a614E0032a91926B32868i8194C77097
9325a2562j73036Q3306D9366a11085D744a53214g3090m3924L8928b8728k2068
9314e0796A62190g6466J2704o9014A94493a83984A4665b62747D3040a82459n8281
9303b40740g117B33242b31409J08643n3615b6207B3247d431H619b08012B1974
9291d27216a82275n1482J12226D9961a62545A65925h0875k43705A38196M5596
$$ y = [-77400, 236187, 23229, -8015, 230178, -286535, 157910, -113860, -201406, 94094, -68892, -81944, 13638, 24917, 179209, -274444, -135249, 12836, -276676, -185390, 43107, -218205, 5738, 47651, -226564, 37389, 97899, -227921, -68017, -25460, -2286, -78248, 81809, -272261, 27352, -253810, 114666, -412809, -43932, -86873, -87823, -1614, 50032, -191926, 232868, -98194, 377097, -12562, -185598, -102292, 49366, -111085, 4744, -153214, -73090, -117014, -78086, -28728, -50796, 162190, -76466, -63762, -132776, 194493, -183984, 14665, -262747, 43040, -182459, -240740, -7117, 233242, -231409, -122766, -176381, -26207, 23247, -4431, 8619, -208012, 21974, -427216, -182275, -233757, -121531, 49961, -162545, 165925, -80875, -324580, 138196, 183792]
9281A83792b25710J9386B29173a09747o2743g4161I365J81963b82620a27069j333
9270a28402A72608i36r406j15271k3869L05o7990P5967I5472J7404c3796j03197
9258a36993k9401F9894K20794i1128k6149l45999b15379M1713I6188c39447k7387
9247c66834B08505a6352l6146j66409C29762c2504o6490Q439B60209h6367j2238
9236i8605c8208g387B07415d45395E4634a4338I1907b19870k82330J59377a50950
9224d1705k09933e7605B21907e1951q4507k35435J49587b1561a929k9419j58912
9213a90260R487m27879A38244i6966j10425C9182A5217b52054Q8181J0625j4911
9202a68159n5972K9073A82746a3617D498a21832l36453h3153E2203a03121o4029
$$ y = [183792, -225710, -206324, 229173, -109747, -172490, -74161, 9365, 191328, -282620, -127069, -128402, 172608, -936, -10342, -125613, -149482, -149177, -217167, -141200, 95472, 112876, -33796, -136993, -166394, 69894, 290688, -91128, -117277, -463276, -215379, -173666, 96188, -339447, -366834, 208505, -16352, -52498, -218907, 329762, -32504, -98994, -90555, 260209, -86367, -98605, -38208, -7387, 207415, -445395, 54634, -14338, 91907, -219870, -502200, -342823, -150950, -41705, -251638, -57605, 221907, -51951, -136458, -371893, -222306, -21561, -1929, -31348, -190260, -180773, -608652, 138244, -96966, -207391, 39182, 15217, -252054, -163873, -153248, -168159, -224131, -195058, 182746, -13617, 4498, -121832, -458285, -83153, 52203, -103121, -167150]
9191a67150k07312a17395j58068h4376A23209a0664k20920D6781c0591k38942
9181b69533A94792c35960c690j05775l46049F5608n484N3632K1767a05282k62057
9170c67339J05348i7693l08021a24927A70517E2505K9301d0167A62636m096a21042
9158a21465K8482l25629A073c9917k24905b4794k6857A93427n5103N1396j990
9147A87730c52654a47353I8271e44365A48397f9466A55355d23060F1877a96621
9136c14339G8860B2802R2428a25350A04264Q5895a9747I9998k0950b08088E9974
9124d5434j4107j41871Q4024A53354b7177j54358a7441n53l13759B18440b22630
9112A37045h5650p3079e0298C24253a63254K5614C18991b88932J4034A36270a1610
$$ y = [-167150, -374462, -117395, -275463, -84376, 123209, -10664, -231584, 46781, -30591, -269533, 194792, -335960, -3690, -109465, -455514, 65608, 60124, 113756, 135523, -105282, -367339, -261991, -97693, -405714, -124927, 170517, 52505, 81806, -40167, 162636, 158540, -121042, -121465, -92983, -418612, 1073, -39917, -264822, -24794, -51651, 193427, 138324, 189720, 187730, -352654, -147353, 98271, -544365, 148397, -69466, 155355, -423060, 61877, -196621, -314339, 78860, 22802, 115230, -125350, 104264, 190159, -19747, 99998, 79048, -208088, 59974, -45434, -59541, -201412, -117388, 153354, -27177, -181535, -17441, -17994, -331753, 218440, -222630, 137045, -85650, -158729, -50298, 324253, -163254, -137640, 318991, -288932, -274898, 136270, -11610]
9100A57647G5406R5651O1127A0315d37774a43737A99119b70291L1609j42999A21560
9088c7612l81594a60863C7555a47276j88649h1825A25979N7904d2281a1700o6667
9077g8367D2178b62504m9757J52730L4328C09635d965B04178e3764p4576A70998
9065A1817J47684m3415b37439a5458j3624A65066a7155n2431E7065K245b680G5950
9052c9321C30331f8768n7139k39709A11408a79358A2685b65448K5630c687j1716
9041a5403q4914F8835i170F4170b40684c384j48403F5717c12341A37675E2834
9029i3038C398M469f3993B3954a90606A24027b63447Q5965e880j57544A80783
9017b55270M1309A02603e5327j82371b2627m9797k06184C0468g1432C203M2422
$$ y = [157647, 75406, 171057, 232184, 10315, -437774, -143737, 199119, -270291, -238682, -381681, 121560, -37612, -419206, -160863, 37555, -147276, -335925, -81825, 125979, 183883, -42281, -11700, -78367, 42178, -262504, -312261, -159531, -125203, 309635, -4965, 204178, -53764, -128340, 170998, 11817, 159501, 116086, -237439, -15458, -29082, 165066, -17155, -69586, 57065, 59310, -2680, 75950, -39321, 330331, -68768, -125907, -365616, 111408, -179358, 12685, -265448, -239818, -3687, -15403, -100317, 68835, -9170, 64170, -240684, -3384, -151787, 65717, -312341, 137675, 52834, -93038, 3398, 7867, -63993, 23954, -190606, 124027, -263447, -177482, -5880, -163424, 180783, -255270, -213961, 102603, -55327, -237698, -22627, -72424, -278608, 30468, -71432, 3203, 45625]
9006D5625a28906c984B13248d4355k06153c2003A79554R4756A27748K06491f2847
8994h1321j44410A00577c24867J50860B2840b15881A13079J65747b56353B29167
8983f1383K05A8376J08554a89792M9422A41196a49592m7642c706p8452j10792
8972a92950A02370b13876F599g0778H2028g8901B01913a03951m5321A02916a86057
8960a96663f6370G6128b68902a12482J2377L1597F8635a43500b0853A1329a54151
8948G9023N4437F5859B3242R2267E7515e7884b3552p5187o1578J033C1979N9727
8936I1706i5801B49120F3591f9244E4702J49194c01853Q6601a5736l1714C2942
8924B09473l9708J11086O8987O64828K064528P198075m517587A884451G44460
$$ y = [45625, -128906, -3984, 213248, -44355, -250508, -32003, 179554, 274310, 127748, 334239, -62847, -81321, -225731, 100577, -324867, -174007, 22840, -215881, 113079, 278826, -256353, 229167, -61383, -61178, 18376, 126930, -189792, -140370, 141196, -149592, -197234, -3706, -82158, -192950, 102370, -213876, 6599, -70778, 82028, -78901, 201913, -103951, -149272, 102916, -186057, -196663, -66370, 76128, -268902, -112482, -100105, -68508, 68635, -143500, -20853, 11329, -154151, 79023, 133460, 65859, 23242, 115509, 57515, -57884, -23552, -98739, -160317, -159284, 31979, 91706, -95801, 249120, 63591, -69244, 54702, 203896, -301853, -215252, -15736, -47450, 32942, 209473, 169765, 280851, 349838, 1014666, 3079194, 10277269, 5759682, 1884451, 744460]
8914C87503R518A70657o9944e2379A38314g2798b0297G8366b10948D12276a08499
8902D3251b5158j98359F5052a78490J8986k04061L6365A13823l5154e10206R7279
8891d12927a76647j51153J57301G9427j5623b25188A4949M5109J34496B2175b42271
8879b11718K6939b1906o5616B12265c4848A62460A6571Q0220c30409c436A06278
8867e767m03583G6075B4174J5298J6743J33024D8727c61803O8083e0673a594k15455
8855b17049o6995h4476A09304b42694c1781j6107A06580b52961h2642o2657a8681
$$ y = [387503, 397021, 170657, 100713, -52379, 138314, -72798, -20297, 78366, -210948, 412276, -108499, 43251, -25158, -223517, 65052, -178490, -159504, -363565, -327200, 113823, 78669, -510206, -412927, -176647, -327800, -170499, 79427, 63804, -225188, 14949, 60058, 194554, 22175, -242271, -211718, -184779, -21906, -87522, 212265, -34848, 162460, 16571, 96791, -330409, -3436, 106278, -5767, -409350, 76075, 24174, 39472, 56215, 189239, 48727, -361803, -293720, -50673, -1594, -217049, -284044, -84476, 109304, -242694, -31781, -47888, 106580, -252961, -82642, -145299, -18681]
$$ [...]
##END NTUPLES=NMR SPECTRUM
##END=
