
##TITLE=AC1238_CCAAH12093_6610292_HVyUi4M1H8
##JCAMPDX= 6.0         $$ Bruker NMR JCAMP-DX V2.0
##DATA TYPE= NMR SPECTRUM
##DATA CLASS= NTUPLES
##ORIGIN= BRUKER
##OWNER= Administrator
$$ 1.72 TOPSPIN		Version 2.1
$$ 2012-08-02 15:34:14.843 -0500  Administrator@TOPSPIN
$$ Compression mode = diff/dup
##.OBSERVE FREQUENCY= 400.02188249412
##.OBSERVE NUCLEUS= ^1H
##.ACQUISITION MODE= SIMULTANEOUS (DQD)
##.ACQUISITION SCHEME= undefined
##.AVERAGES= 64
##.DIGITISER RES= 22
##SPECTROMETER/DATA SYSTEM= spect
##.PULSE SEQUENCE= noesygpps1d.comp
##.SOLVENT NAME= COFFEE_meoh
##.SHIFT REFERENCE= INTERNAL, COFFEE_meoh, 1, 14.9626
##AUDIT TRAIL= $$ (NUMBER, WHEN, WHO, WHERE, PROCESS, VERSION, WHAT)
$$ ##TITLE= Audit trail, TOPSPIN		Version 2.1
$$ ##JCAMPDX= 5.01
$$ ##ORIGIN= Bruker BioSpin GmbH
$$ ##OWNER= Administrator
$$ $$ C:\Bruker\TOPSPIN/data/COFFEE/nmr/AC1238_CCAAH12093_6610292_HVyUi4M1H8/12/pdata/1/auditp.txt
$$ ##AUDIT TRAIL=  $$ (NUMBER, WHEN, WHO, WHERE, PROCESS, VERSION, WHAT)
(   1,<2012-08-02 12:33:14.875 -0500>,<Administrator>,<TOPSPIN>,<go>,<TOPSPIN 2.1>,
      <created by zg
	started at 2012-08-02 12:21:44.593 -0500,
	POWCHK enabled, PULCHK disabled,
       configuration hash MD5:
       6B 1B 68 BB D9 2E 58 E2 7F 35 AD 54 07 DF 0E 41
       data hash MD5: 64K
       43 55 75 DD D0 CD B7 21 B9 F3 7B 7A F1 33 F8 33>)
(   2,<2012-08-02 12:33:17.687 -0500>,<Administrator>,<TOPSPIN>,<proc1d>,<TOPSPIN 2.1>,
      <Start of raw data processing
       efp LB = 0.3 FT_mod = 6 PKNL = 1 PHC0 = 0 PHC1 = 0 SI = 128K 
       data hash MD5: 128K
       63 74 FF E9 E2 EA 4D 9D CC AF AF 23 D1 EF 4A B1>)
(   3,<2012-08-02 12:33:18.890 -0500>,<Administrator>,<TOPSPIN>,<proc1d>,<TOPSPIN 2.1>,
      <pk PHC0 = 0.2362061 PHC1 = 0 
       data hash MD5: 128K
       80 77 62 FA D3 8B 4B 8E 55 AE 46 F8 BA 49 CB E7>)
(   4,<2012-08-02 12:33:19.890 -0500>,<Administrator>,<TOPSPIN>,<proc1d>,<TOPSPIN 2.1>,
      <abs ABSG = 1 
       data hash MD5: 128K
       2C 23 D6 96 E7 E8 90 B5 8F 8E 8B 36 94 4C 7E 10>)
(   5,<2012-08-02 12:33:20.109 -0500>,<Administrator>,<TOPSPIN>,<proc1d>,<TOPSPIN 2.1>,
      <abs ABSG = 2 
       data hash MD5: 128K
       81 7F 90 F3 59 2A A1 54 81 2F 75 24 C5 3D 45 3E>)
(   6,<2012-08-02 12:33:20.296 -0500>,<Administrator>,<TOPSPIN>,<proc1d>,<TOPSPIN 2.1>,
      <abs ABSG = 3 
       data hash MD5: 128K
       8D 30 67 9B 6F 11 8B 8C 48 3A B1 A7 C3 3B 54 4A>)
(   7,<2012-08-02 12:33:20.578 -0500>,<Administrator>,<TOPSPIN>,<proc1d>,<TOPSPIN 2.1>,
      <abs ABSG = 4 
       data hash MD5: 128K
       6D 33 F3 EB 6B 1C CF FC 80 2F 15 60 3D 4F E3 87>)
(   8,<2012-08-02 12:33:20.875 -0500>,<Administrator>,<TOPSPIN>,<proc1d>,<TOPSPIN 2.1>,
      <abs ABSG = 5 
       data hash MD5: 128K
       33 6A 75 75 48 EA 36 D5 94 6A C7 06 D4 8A 6A B2>)
(   9,<2012-08-02 12:33:51.593 -0500>,<Administrator>,<TOPSPIN>,<audit>,<TOPSPIN 2.1>,
      <user comment:
       ICON-NMR User ID: COFFEE
       data hash MD5: 128K
$$ [...]
150 150 150 150 150 150 150 150
##$TP07= 0
##$TPNAME0= <>
##$TPNAME1= <>
##$TPNAME2= <>
##$TPNAME3= <>
##$TPNAME4= <>
##$TPNAME5= <>
##$TPNAME6= <>
##$TPNAME7= <>
##$TPOAL= (0..7)
0.5 0.5 0.5 0.5 0.5 0.5 0.5 0.5
##$TPOFFS= (0..7)
0 0 0 0 0 0 0 0
##$TUNHIN= 0
##$TUNHOUT= 0
##$TUNXOUT= 0
##$USERA1= <user>
##$USERA2= <user>
##$USERA3= <user>
##$USERA4= <user>
##$USERA5= <user>
##$V9= 5
##$VALIST= <valist>
##$VCLIST= <CCCCCCCCCCCCCCC>
##$VD= 0
##$VDLIST= <DDDDDDDDDDDDDDD>
##$VPLIST= <PPPPPPPPPPPPPPP>
##$VTLIST= <TTTTTTTTTTTTTTT>
##$WBST= 1024
##$WBSW= 4
##$XGAIN= (0..3)
0 0 0 0
##$XL= 0
##$YL= 0
##$YMAX_a= 16139343
##$YMIN_a= -9192494
##$ZGOPTNS= <>
##$ZL1= 120
##$ZL2= 120
##$ZL3= 120
##$ZL4= 120
##$ABSF1= 14.9626
##$ABSF2= -5.595582
##$ABSG= 5
##$ABSL= 3
##$ALPHA= 0
##$AQORDER= 0
##$ASSFAC= 0
##$ASSFACI= 0
##$ASSFACX= 0
##$ASSWID= 0
##$AUNMP= <proc_prof1d_extract.lims>
##$AXLEFT= 0
##$AXNAME= <>
##$AXNUC= <1H>
##$AXRIGHT= 0
##$AXTYPE= 0
##$AXUNIT= <>
##$AZFE= 0.1
##$AZFW= 0.1
##$BCFW= 0
##$BC_mod= 0
##$BYTORDP= 0
##$COROFFS= 0
##$CY= 15
##$DATMOD= 1
##$DC= 0
##$DFILT= <>
##$DTYPP= 0
##$F1P= 0
##$F2P= 0
##$FCOR= 0.5
##$FTSIZE= 131072
##$FT_mod= 6
##$GAMMA= 0
##$GB= 0
##$INTBC= 1
##$INTSCL= 1
##$ISEN= 128
##$LB= 0.3
##$LEV0= 0
##$LPBIN= 0
##$MAXI= 10000
##$MC2= 0
##$MEAN= 0
##$ME_mod= 0
##$MI= 0
##$NCOEF= 0
##$NC_proc= -2
##$NLEV= 6
##$NOISF1= 0
##$NOISF2= 0
##$NSP= 0
##$NTH_PI= 0
##$NZP= 0
##$OFFSET= 14.9626
##$PC= 1
##$PHC0= 0.2362061
##$PHC1= 0
##$PH_mod= 1
##$PKNL= yes
##$PPARMOD= 0
##$PPDIAG= 0
##$PPIPTYP= 0
##$PPMPNUM= 2147483647
##$PPRESOL= 1
##$PSCAL= 4
##$PSIGN= 0
##$PYNMP= <proc.py>
##$REVERSE= no
##$SF= 400.020008996082
##$SI= 131072
##$SIGF1= 0
##$SIGF2= 0
##$SINO= 400
##$SIOLD= 131072
##$SPECTYP= <>
##$SREGLST= <1H.CDCl3>
##$SSB= 0
##$STSI= 131072
##$STSR= 0
##$SW_p= 8223.68421052631
##$SYMM= 0
##$S_DEV= 0
##$TDeff= 65536
##$TDoff= 0
##$TI= <>
##$TILT= no
##$TM1= 0
##$TM2= 0
##$TOPLEV= 0
##$USERP1= <user>
##$USERP2= <user>
##$USERP3= <user>
##$USERP4= <user>
##$USERP5= <user>
##$WDW= 1
##$XDIM= 131072
##$YMAX_p= 392263504
##$YMIN_p= -12301
##$CURPLOT= <Network HP LaserJet P1505>
##$CURPRIN= <$Network HP LaserJet P1505>
##$DFORMAT= <normdp>
##$LAYOUT= <+/1D_H.xwp>
##$LFORMAT= <normlp>
##$PFORMAT= <normpl>
##$SURQMSG= 1
$$ End of Bruker specific parameters
$$ ---------------------------------
##NTUPLES= NMR SPECTRUM
##VAR_NAME=  FREQUENCY,     SPECTRUM/REAL,   SPECTRUM/IMAG
##SYMBOL=    X,             R,               I
##VAR_TYPE=  INDEPENDENT,   DEPENDENT,       DEPENDENT
##VAR_FORM=  AFFN,          ASDF,            ASDF
##VAR_DIM=   131072,        131072,          131072
##UNITS=     HZ,            ARBITRARY UNITS, ARBITRARY UNITS
##FACTOR=    0.0627417313425164, 1,          1
##FIRST=     8223.62146879497, 597,          -51229
##LAST=      0,             748,             -51494
##MIN=       0,             -12301,          0
##MAX=       8223.62146879497, 392263504,    0
$$ Real data points
##PAGE= N=1
##DATA TABLE= (X++(R..R)), XYDATA
$$ [...]
60946B0386243k546592k284121k005662j738707j492895j272376j078589r10144
$$ 20386243 17839651 15555530 13549868 11811161 10318266 9045890 7967301 7057157
60938G057157p65021o42304n41024m58944l93372l41783l01017k67437k38799
$$ 7057157 6292136 5649832 5108808 4649864 4256492 3914709 3613692 3346255 3107456
60929C107456k14809j95110j77954j61606j45785j30782j16341j02517r0633q2051
$$ 3107456 2892647 2697537 2519583 2357977 2212192 2081410 1965069 1862552 1771919 1689868
60919A689868p6497p2633o9612o7129o4551o1234n7365n3460m9337m4529l9383
$$ 1689868 1613371 1540738 1471126 1403997 1339446 1278212 1220847 1167387 1118050 1073521 1034138
60908A034138l4774l0953k7640k4956k3216k1947k0182j7779j5490j3722j2101
$$ 1034138 999364 968411 940771 915815 892599 870652 850470 832691 817201 803479 791378
60897G91378j0348q676p183n657m098k705j281M79K158K961K996L209L885M194
$$ 791378 781030 772354 765171 759514 755416 752711 751430 751909 754067 757028 760024 763233 767118 771312
60883G71312L636K799K203J338l80k436l845m471m998n909p117q365r447j0156
$$ 771312 774948 777747 779950 781288 780908 778472 774627 770156 765158 759249 752132 743767 734320 724164
60869G24164j0325r896q872p530o595o653p266p269o164m585l190j906n51O22
$$ 724164 713839 703943 695071 687541 680946 674293 667027 659758 653594 649009 645819 643913 643362 643984
60855F43984J521K596M018N142N517N802O993R116J1365J3067J3991J4242J4457
$$ 643984 645505 648101 652119 657261 662778 668580 675573 684689 696054 709121 723112 737354 751811
60842G51811J5501J7284J8444J7994J6700J5889J5460J4240J1929R442P400N491
$$ 751811 767312 784596 803040 821034 837734 853623 869083 883323 895252 904694 912094 917585
60830I17585L516K014J457J565J780J752J322M96l78j006j762l240n152o417o647
$$ 917585 921101 923115 924572 926137 927917 929669 930991 931487 931109 930103 928341 925101 919949 913532 906885
60815I06885o786p902r873j1699j2711j3054j3209j3450j3690j3632j3055j2003
$$ 906885 900099 892197 882324 870625 857914 844860 831651 818201 804511 790879 777824 765821
60803G65821j0750r630q930q703q564p948o751n351l845j863M79K099K286J929
$$ 765821 755071 745441 736511 727808 719244 711296 704545 699194 695349 693486 693965 696064 698350 700279
60789G00279K538M253N928O973P970R267J0210J0303J0219J0971J2571J4177J5145
$$ 700279 702817 707070 712998 719971 727941 737208 747418 757721 767940 778911 791482 805659 820804
60776H20804J5382J5079J4556J4278J4420J4577J4203J3315J2441J1848J1176
$$ 820804 836186 851265 865821 880099 894519 909096 923299 936614 949055 960903 972079
60765I72079R966Q337O892N853M693K925J021r2m24j017k398l733m105l871l994
$$ 972079 982045 990382 997274 1003127 1007820 1010745 1011766 1011674 1011250 1010233 1007835 1004102 999997 996126 992132
60750I92132m486m537l862k996k388k064k034k301k555k643l138m597o453p652
$$ 992132 987646 983109 979247 976251 973863 971799 969765 967464 964909 962266 959128 954531 948078 940426
60736I40426q191q913r838j0027r242q431q147p709o506m981l626k157l78J016
$$ 940426 932235 923322 913484 903457 894215 885784 877637 869928 863422 858441 854815 852658 852280 853296
60722H53296J502J722K511L591M153M190M253M333L945K993J749K75j325k366
$$ 853296 854798 856520 859031 862622 866775 870965 875218 879551 883496 886489 888238 888513 887188 884822
60708H84822k258j594j622k635l664l832l305k691k199j669j081p06r42k014l632
$$ 884822 882564 880970 879348 876713 873049 869217 865912 863221 861022 859353 858272 857566 856624 854610 850978
60693H50978n082n918o495p434q731r845j0583j1371j2454j3336j3341j2517j1657
$$ 850978 845896 839978 833483 826049 817318 807473 796890 785519 773065 759729 746388 733871 722214
60680G22214j1381j1431j1012r734q035o540n274l804k064n43L64Q51J378K225
$$ 722214 710833 699402 688390 678656 670621 664081 658807 655003 652939 652396 652760 653611 654989 657214
60666F57214L447M808N680N489M571L986M086L914K563P24l9O76J638J669R66
$$ 657214 660661 665469 671149 676638 681209 685195 689281 693195 695758 696482 696443 697119 698757 700426 701392
60651G01392M63N05P82J175K020L456M966N807N741N152M487L849L180K712K858
$$ 701392 701855 702360 703142 704317 706337 709793 714759 720566 726307 731459 735946 739795 742975 745687 748545
60636G48545L724M856N686O123O589P445Q518R328R806J0502J1810J3239J3870
$$ 748545 752269 757125 762811 768934 775523 782968 791486 800814 810620 821122 832932 846171 860041
60623H60041J3617J3370J3656J3758J2656J0418P958N780L690J576l32k048l905
$$ 860041 873658 887028 900684 914442 927098 937516 945474 951254 954944 956520 956188 954140 950235
60610I50235n857p325p933p914p550o730n314l547j779k09R58J341O91q61k938
$$ 950235 944378 937053 929120 921206 913656 906926 901612 898065 896286 896077 897035 898376 899067 898206 895268
60595H95268n067o741p633p780p299o100m267k577j899k091k100j296j70M52K88
$$ 895268 890201 883460 875827 868047 860748 854648 850381 847804 845905 843814 841714 840418 840248 840700 840988
60580H40988m67j528k584l382l911m190l993l186k220j573q57P03K879M444M786
$$ 840988 840521 838993 836409 833027 829116 824926 820933 817747 815527 813954 813097 813800 816679 821123 825909
60565H25909M634M866N393N567M994L636J805L00k25k79j068k714l950l926l277
$$ 825909 830543 835409 840802 846369 851363 854999 856804 857104 856879 856600 855532 852818 848868 844942 841665
60550H41665k829k322j237J37J279K341L551M552N193O242Q331J0913J3310J6076
$$ 841665 838836 836514 835277 835414 836693 839034 842585 847137 852330 858572 866903 877816 891126 907202
60536I07202K0196K5357L0366L4885L9504M4188M7748M8874M6837M1291L2397
$$ 907202 927398 952755 983121 1018006 1057510 1101698 1149446 1198320 1245157 1286448 1318845
60525A318845K1183Q978l474j5567k5767l2110l3972l2528k9346k5213k0412j5231
$$ 1318845 1340028 1349006 1345532 1329965 1304198 1272088 1238116 1205588 1176242 1151029 1130617 1115386
60513A115386r968m966p86K157M211O092P854Q911R134R189R623J0307J1085J2413
$$ 1115386 1105418 1100452 1099666 1101823 1106034 1112126 1119980 1128891 1138025 1147214 1156837 1167144 1178229 1190642
60499A190642J4805J8185K2181K6865L2737L9937M7891N5892O3933P2645Q2292
$$ 1190642 1205447 1223632 1245813 1272678 1305415 1345352 1393243 1449135 1513068 1585713 1668005
60488A668005R2210J01731J11415J22633J36023J51306J68936J90880K18977K53169
$$ 1668005 1760215 1861946 1973361 2095994 2232017 2383323 2552259 2743139 2962116 3215285
60478C215285K91823L32667L72003M03353M18414M09964L73861L09178K18211
$$ 3215285 3507108 3839775 4211778 4615131 5033545 5443509 5817370 6126548 6344759
60469F344759J07032j4584j34736k41777l26715l84968m16527m24482m13452l89080
$$ 6344759 6451791 6437207 6302471 6060694 5733979 5349011 4932484 4508002 4094550 3705470
60459C705470l57467l23433k89232k55539k23333j94006j68187j45623j26192
$$ 3705470 3348003 3024570 2735338 2479799 2256466 2062460 1894273 1748650 1622458
60450A622458j09997r6491q4597p3856o4588n6803m9895m3582l8313l4382l1323
$$ 1622458 1512461 1415970 1331373 1257517 1192929 1136126 1086231 1042649 1004336 969954 938631
60439I38631k8542k5971k3854k2334k1389k0745j9816j8191j6140j4222j2516
$$ 938631 910089 884118 860264 837930 816541 795796 775980 757789 741649 727427 714911
60428G14911j0841r445q682q142o996n259l882l477l703l984m032l571k424j118
$$ 714911 704070 694625 685943 677801 670805 665546 661664 658187 654484 650500 646468 642897 640473 639355
60414F39355n23o24m61M29J337J496J081O16J43l99n66J34J475K715L456L901
$$ 639355 638832 638208 637747 638176 639513 641009 642090 642706 642849 642450 641884 642018 643493 646208 649664 653565
60398F53565M434N204O017O572O796O872O740N919M290K745K323K838L076K388
$$ 653565 657999 663203 669220 675792 682588 689460 696200 702119 706409 709154 711477 714315 717391 719779
60384G19779J320N98K24k51j086k242l344l755l212k422k309k726k741k149j774
$$ 719779 721099 721697 721921 721670 720584 718342 714998 711243 708031 705609 703300 700574 697833 695684 693910
60369F93910k024k206j703q71k48L36J190J978K199K004J890J955J994K006K145
$$ 693910 691886 689680 687977 687106 686858 687194 688384 690362 692561 694565 696455 698410 700404 702410 704555
60354G04555K394K678L099L764M597N498O416P219P802Q385R236J0076J0361J0204
$$ 704555 706949 709627 712726 716490 721087 726585 733001 740220 748022 756407 765643 775719 786080 796284
60340G96284J0385J1220J2091J2312J1806J0744R238P796P226P608Q003P753P466
$$ 796284 806669 817889 829980 842292 854098 864842 874080 881876 889102 896710 904713 912466 919932
60327I19932Q149R925J2262J4905J7766K0144K0939J9718J7079J3789R934M980
$$ 919932 928081 938006 950268 965173 982939 1003083 1024022 1043740 1060819 1074608 1084542 1089522
60315A089522j351q312j4311j8120j9865k0533k0660k0017j8478j6449j4293j2036
$$ 1089522 1088171 1079859 1065548 1047428 1027563 1007030 986370 966353 947875 931426 917133 905097
60303I05097r894q373p530o728n544m302l274j985J09K660M740N820O011N651
$$ 905097 895203 886830 879300 872572 867028 862726 859452 857467 857576 860236 864976 870796 876807 882458
60289H82458N083M594M181L624K971K571K423K011J173N76Q91J817K429K298J799
$$ 882458 887541 892135 896316 899940 902911 905482 907905 909916 911089 911665 912556 914373 916802 919100 920899
60274I20899J603K210L713N650P199P922Q154Q620R786J1659J3869J5875J7444
$$ 920899 922502 924712 928425 934075 941274 949196 957350 965970 975756 987415 1001284 1017159 1034603
60261A034603J9027K1221K3871K6273K8320L0717L3886L7429M1077M5357N0729
$$ 1034603 1053630 1074851 1098722 1124995 1153315 1184032 1217918 1255347 1296424 1341781 1392510
60250A392510N6675O2357O7782P3692Q0554Q8245R6466J04948J13366J21422J28947
$$ 1392510 1449185 1511542 1579324 1653016 1733570 1821815 1918281 2023229 2136595 2258017 2386964
60239B386964J35647J40900J43911J43995J40825J34730J26606J16938J05123
$$ 2386964 2522611 2663511 2807422 2951417 3092242 3226972 3353578 3470516 3575639
60230C575639R0480P3797N6861M0358K3482N930j0953k5700l8224m8792n6681
$$ 3575639 3666119 3739916 3796777 3837135 3860617 3866547 3855594 3829894 3791670 3742878 3686197
60219C686197o0961o1995o0828n7523n1345m2318l1535j9953p777M999J8286L2183
$$ 3686197 3625236 3563241 3502413 3444890 3393545 3351227 3319692 3299739 3291962 3296961 3315247 3347430
60207C347430M6811O1880P6897R1721J06244J19699J30936J39289J44583J46445
$$ 3347430 3394241 3456121 3533018 3624739 3730983 3850682 3981618 4120907 4265490 4411935
60197D411935J44267J37917J27858J14500R7958P8578N7211L4832J2098j0569
$$ 4411935 4556202 4694119 4821977 4936477 5034435 5113013 5170224 5205056 5217154 5206585
60187E206585l2753n3871p3116q9630j02792j12245j17630j18687j15685j09377
$$ 5206585 5173832 5119961 5046845 4957215 4854423 4742178 4624548 4505861 4390176 4280799
60177D280799j00377q8938p5348o0004m3029k4541n466J2752K9582M5665O1197
$$ 4280799 4180422 4091484 4016136 3956132 3913103 3888562 3883096 3895848 3925430 3971095 4032292
60166D032292P4964Q5638R3024R7202R7379R2862Q4505P3925O1677M7373L1362
$$ 4032292 4107256 4192894 4285918 4383120 4480499 4573361 4657866 4731791 4793468 4840841 4872203
60155D872203J5036m54j4626k6867l6217m2149m4690m3709l8887l0435j9078n204
$$ 4872203 4887239 4886785 4872159 4845292 4809075 4766926 4722236 4678527 4639640 4609205 4590127 4584923
60143D584923J1149K9454M8634O8005Q7534J07162J26760J47024J69454J94916
$$ 4584923 4596072 4625526 4674160 4742165 4829699 4936861 5063621 5210645 5380099 5575015
60133E575015K22694K51330K79934L08338L36395L63466L88315M09291M24870
$$ 5575015 5797709 6049039 6328973 6637311 6973706 7337172 7725487 8134778 8559648
60124H559648M34155M36630M31513M17880L95475L64969L27291K83140K33285
$$ 8559648 8993803 9430433 9861946 10279826 10675301 11040270 11367561 11650701 11883986
60115A1883986J78814J20751N9816l046o6081j27176j84876k38547k87262l28727
$$ 11883986 12062800 12183551 12243367 12240321 12174240 12047064 11862188 11623641 11336379 11007652
60105A1007652l59881l78912l86407l84231l73587l54720l28257k95792k59034
$$ 11007652 10647771 10268859 9882452 9498221 9124634 8769914 8441657 8145865 7886831
60096G886831k19174j77443j35407r4092n3526j3796K4018N8548Q9083J15044
$$ 7886831 7667657 7490214 7354807 7260715 7207189 7193393 7217411 7275959 7365042 7480086
60086G480086J35146J48025J53361J51557J42605J26267J03178P5005M3580J0625
$$ 7480086 7615232 7763257 7916618 8068175 8210780 8337047 8440225 8515230 8558810 8569435
60076H569435k2027n2918q1682j08578j33346j55249j74015j89939k02990k12698
$$ 8569435 8547408 8494490 8412808 8304230 8170884 8015635 7841620 7651681 7448691 7235993
60066G235993k18920k21914k21502k16982k08192j96134j82176j67047j50698
$$ 7235993 7017073 6795159 6573657 6356675 6148483 5952349 5770173 5603126 5452428
60057E452428j32791j13165r2071p0099m7748k5146k257K0951M4588O8449R1326
$$ 5452428 5319637 5206472 5114401 5044302 4996554 4971408 4969151 4990102 5034690 5103139 5194465
60046E194465J11385J27850J41418J52354J58971J59158J52746J41147J25152
$$ 5194465 5305850 5433700 5575118 5727472 5886443 6045601 6198347 6339494 6464646
60037F464646J04551P9738N2189K3157o855l7113o6322r3587j18652j40802j58528
$$ 6464646 6569197 6648935 6701124 6724281 6717426 6680313 6613991 6520404 6401752 6260950 6102422
60026F102422j70774j77705j79935j77763j71504j61796j49190j34058j17148
$$ 6102422 5931648 5753943 5574008 5396245 5224741 5062945 4913755 4779697 4662549
60017D662549r9459q1337o2402m2587k2420k011J9317M1872O4901Q7580J10084
$$ 4662549 4563090 4481753 4419351 4376764 4354344 4352333 4371650 4413522 4478423 4566003 4676087
60006D676087J33008J56170J78384J98072K13688K23961K28053K25370K15326
$$ 4676087 4809095 4965265 5143649 5341721 5555409 5779370 6007423 6232793 6448119
59997F448119J97856J74189J46354J15738Q2733M7853J2347k2649n6731q9436
$$ 6448119 6645975 6820164 6966518 7082256 7164989 7212842 7225189 7202540 7145809 7056373
59987G056373j19421j44859j64335j77091j83024j82765j77268j66976j51947
$$ 7056373 6936952 6792093 6627758 6450667 6267643 6084878 5907610 5740634 5588687
59978E588687j33024j12097r0693o8905m6217k2813N11K3190M4970O5300Q3299
$$ 5588687 5455663 5343566 5252873 5183968 5137751 5114938 5115449 5138639 5183609 5248909 5332208
59967E332208R8262J09934J18410J24001J26984J27300J24600J18680J09650R7790
$$ 5332208 5430470 5540404 5658814 5782815 5909799 6037099 6161699 6280379 6390029 6487819
59957F487819Q3727O8651N3811L9648K5969J3009J704p174j3476j6957j6824j2278
$$ 6487819 6571546 6640197 6694008 6733656 6759625 6772634 6774338 6767164 6753688 6736731 6719907 6707629
59945F707629k964J1317L0706N4763Q2572J13703J48470J86896K28073K70922
$$ 6707629 6704665 6715982 6746688 6801451 6884023 6997726 7146196 7333092 7561165 7832087
59935G832087L14838L59107M02376M43158M80011N10485N30579N36114N24311
$$ 7832087 8146925 8506032 8908408 9351566 9831577 10342062 10872641 11408755 11933066
59926A1933066M93521M42436L71005K81921J80179P1140m0122j47898k45849l28846
$$ 11933066 12426587 12869023 13240028 13521949 13702128 13773268 13733146 13585248 13339399 13010553
59916A3010553l94502m42602m73658m88420m88295m75560m52927m22967l87692
$$ 13010553 12616051 12173449 11699791 11211371 10723076 10247516 9794589 9371622 8983930
59907H983930l48501l06515k63045k19472j76570j34131r1566m8930p116L3015
$$ 8983930 8635429 8328914 8065869 7846397 7669827 7535696 7444130 7395200 7388084 7421099
59897G421099P1367J08200J43081J74695K01627K22880K37335K43166K38342K21594
$$ 7421099 7492466 7600666 7743747 7918442 8120069 8342949 8580284 8823450 9061792 9283386
59887I283386J92652J51946J00682M1157k3552r0252j55687k16182k68134l09218
$$ 9283386 9476038 9627984 9728666 9769823 9746271 9656019 9500332 9284150 9016016 8706798
59877H706798l38963l58022l67205l67333l59568l45467l26600l04186k79110
$$ 8706798 8367835 8009813 7642608 7275275 6915707 6570240 6243640 5939454 5660344
59868E660344k52394k25481j99669j75230j51738j29568j10384r5522q4492p5930
$$ 5660344 5407950 5182469 4982800 4807570 4655832 4526264 4415880 4320358 4235866 4159936
59858D159936o9554o6082o5437o6073o6256o5166o2569n8310n2476m5417l7342
$$ 4159936 4090382 4024300 3958863 3892790 3826534 3761368 3698799 3640489 3588013 3542596 3505254
59847C505254k8305j8762r733k356K306L269J46o314j4801k4499l4958m5156n3603
$$ 3505254 3476949 3458187 3448454 3446098 3448404 3451673 3451819 3445505 3430704 3406205 3371247 3326091 3272488
59834C272488n9393o2510o3104o1309n7675n2862m6899l9634l1824k4602j7811
$$ 3272488 3213095 3150585 3087481 3026172 2968497 2915635 2868736 2829102 2797278 2772676 2754865
59823B754865j0127j087Q236J7001K5785L5332M5218N4478O2684O9566P4436P6904
$$ 2754865 2744738 2743651 2751887 2768888 2794673 2830005 2875223 2929701 2992385 3061951 3136387 3213291
59811C213291P7637P7618P7009P5276P1935O6546N8544M7723L4739K0778P107
$$ 3213291 3290928 3368546 3445555 3520831 3592766 3659312 3717856 3765579 3800318 3821096 3828203
59800C828203m897j3785j8668j9575j7173j2407o204J282J1095K4223L9937N6440
$$ 3828203 3823306 3809521 3790853 3771278 3754105 3741698 3735494 3736776 3747871 3772094 3812031 3868471
59788C868471P3234R1712J13170J37637J65172J96795K33121K73227L15748L60064
$$ 3868471 3941705 4033417 4146587 4284224 4449396 4646191 4879312 5152539 5468287 5828351
59778E828351M05089M47540M82031N02005M99829M67714M01021L01620J78150
$$ 5828351 6233440 6680980 7163011 7665016 8164845 8632559 9033580 9335200 9513350
59769I513350M3832q6010j97104k80397l34231l62004l68216l57367l34978l06812
$$ 9513350 9557182 9471172 9274068 8993671 8659440 8297436 7929220 7571853 7236875 6930063
59759F930063k76468k44942k12830j81562j52274j24824r8750p4276n1807l1011
$$ 6930063 6653595 6408653 6195823 6014261 5861987 5737163 5638413 5564137 5512330 5481319
59749E481319j1097Q400K7514M6219O4511Q2387J00080J18293J37849J58996J81171
$$ 5481319 5470222 5478622 5506136 5552355 5616866 5699253 5799333 5917626 6055475 6214471 6395642
59738F395642K03694K26834K51937K80152L11367L44959L81199M20933M63798
$$ 6395642 6599336 6826170 7078107 7358259 7669626 8014585 8395784 8816717 9280515
59729I280515N07897N51749N95360O38660O79588P14593P40435P54750P55547
$$ 9280515 9788412 10340161 10935521 11574181 12253769 12968362 13708797 14463547 15219094
59720A5219094P41453P12720O71634O22242N70040N21367M82085M56464M47030
$$ 15219094 15960547 16673267 17344901 17967143 18537183 19058550 19540635 19997099 20444129
59711B0444129M54597M77889N13706N58048O06837O55436O98324P29875P44935
$$ 20444129 20898726 21376615 21890321 22448369 23055206 23710642 24408966 25138841 25883776
59702B5883776P38636P06886O48247N64816M60761L40907K11523Q1171m0976j47821
$$ 25883776 26622412 27329298 27977545 28542361 29003122 29344029 29555552 29636723 29595747 29447926
59692B9447926k34849k98942l38180l52526l43435l12719k62466j95629j15480
$$ 29447926 29213077 28914135 28575955 28223429 27879994 27567275 27304809 27109180 26993700
59683B6993700k4433P5963J84198K98937M19607N45755O75614Q05902R32550J050456
$$ 26993700 26969267 27045230 27229428 27528365 27947972 28493727 29169341 29975243 30907793 31958249
59673C1958249J152365J228840J269622J264713J204859J082893Q96268O49350
$$ 31958249 33110614 34339454 35609076 36873789 38078648 39161541 40057809 40707159
59665D0707159L54122K9097l03431o20938r03457j135157j305805j412249j458035
$$ 40707159 41061281 41090378 40786947 40166009 39262552 38127395 36821590 35409341 33951306
59656C3951306j450681j399406j315206j211317j101844r99958r17725q65732
$$ 33951306 32500625 31101219 29786013 28574696 27472852 26472894 25555169 24689437
59648B4689437q50187q69621r14904r72448j027605j067513j084193j076215j046881
$$ 24689437 23839250 22969629 22054725 21082277 20054672 18987159 17902966 16826751 15779870
59639A5779870j000776r42455q77008q09465p42929o78393o16454n58125n04026
$$ 15779870 14779094 13836639 12959631 12150166 11407237 10728844 10112390 9554265 9050239
59630I050239m54087m08312l66917l29607k95657k64735k36762k11089j86851
$$ 9050239 8596152 8187840 7820923 7491316 7195659 6930924 6694162 6483073 6296222
59621F296222j64011j43067j23881j05969q9791p6458o6169n8261n2798n0704
$$ 6296222 6132211 5989144 5865263 5759294 5669503 5593045 5526876 5468615 5415817 5365113
59611E365113n2136n6090o1939o9914p9577q9155r7160j03593j08927j12798j14468
$$ 5365113 5312977 5256887 5194948 5125034 5045457 4956302 4859142 4755549 4646622 4533824 4419356
59600D419356j13740j10824j05917r9467r2192q4397p5822o6508n7162m8285l9659
$$ 4419356 4305616 4194792 4088875 3989408 3897216 3812819 3736997 3670489 3613327 3565042 3525383
59589C525383l1041k2788j5342q636k333L734R584J5053J9573K2584K4266K5360
$$ 3525383 3494342 3471554 3456212 3447576 3445243 3448977 3458561 3473614 3493187 3515771 3540037 3565397
59577C565397K6140K6192K5333K4183K3710K4616K7111L0762L4790L9146M4991
$$ 3565397 3591537 3617729 3643062 3667245 3690955 3715571 3742682 3773444 3808234 3847380 3892371
59566C892371N3296O3279P3305Q3097R3789J05870J18541J31446J45553J61652
$$ 3892371 3945667 4008946 4082251 4165348 4259137 4365007 4483548 4614994 4760547 4922199
59556D922199J79137J97113K15740K35635K56566K77530K97660L16343L32777
$$ 4922199 5101336 5298449 5514189 5749824 6006390 6283920 6581580 6897923 7230700
59547G230700L45922L54870L59106L58677L54031L45408L32577L15675K95980
$$ 7230700 7576622 7931492 8290598 8649275 9003306 9348714 9681291 9996966 10292946
59538A0292946K75133K53902K32491K11589J91791J72279J51830J31536J15008
$$ 10292946 10568079 10821981 11054472 11266061 11457852 11630131 11781961 11913497 12028505
59529A2028505J05323J02845J06473J15318J28044J41670J52367J56944J52938
$$ 12028505 12133828 12236673 12343146 12458464 12586508 12728178 12880545 13037489 13190427
59520A3190427J38074J10785P1016J9802m1330j09891j81961k53143l19929l79722
$$ 13190427 13328501 13439286 13510302 13530104 13488774 13378883 13196922 12943779 12623850 12244128
59510A2244128m30120m69117m95929n11005n15220n09541m95444m75105m50717
$$ 12244128 11814008 11344891 10848962 10337957 9822737 9313196 8817752 8342647 7891930
59501G891930m23535l93745l61512l28153k95767k65490k36793k08981j82618
$$ 7891930 7468395 7074650 6713138 6384985 6089218 5823728 5586935 5377954 5195336
59492E195336j58617j36622j15575r5443p6913n9572m1974k3711n886J0842K7250
$$ 5195336 5036719 4900097 4784522 4689079 4612166 4552594 4510620 4486909 4481023 4491865 4519115
59481D519115M4126O1231P8385R6300J15518J35562J55965J77127J99362K21933
$$ 4519115 4563241 4624472 4702857 4799157 4914675 5050237 5206202 5383329 5582691 5804624
59471E804624K43817K64557K83560K99318L10094L14598L11288K97940K73053
$$ 5804624 6048441 6312998 6596558 6895876 7205970 7520568 7831856 8129796 8402849
59462H402849K37102J91673J38044P7589J2905n2615j16046j74887k26329k67849
$$ 8402849 8639951 8831624 8969668 9047257 9060162 9007547 8891501 8716614 8490285 8222436
59452H222436k98720l20110l33573l39880l39308l32398l20308l04621k86830
$$ 8222436 7923716 7603606 7270033 6930153 6590845 6258447 5938139 5633518 5346688
59443E346688k67866k48218k28489k09424j91344j73959j56983j40535j24892
$$ 5346688 5078822 4830604 4602115 4392691 4201347 4027388 3870405 3729870 3604978
59434C604978j10327r7199q5613p4900o4173n3582m4234l6630k9966k3335j6774
$$ 3604978 3494651 3397452 3311839 3236939 3172766 3119184 3074950 3038320 3008354 2985019 2968245
59423B968245j0659m829R73O437J1032J4755J8063K1334K4662K7922L0954L4064
$$ 2968245 2957586 2952757 2953730 2960167 2971199 2985954 3004017 3025351 3050013 3077935 3108889 3142953
59411C142953L7993M2670M6187M6243M2840L8513L5834L5824L8940M5914N6783
$$ 3142953 3180946 3223616 3269803 3316046 3358886 3397399 3433233 3469057 3507997 3553911 3610694
59400C610694P0283Q5278J01699J19304J36488J51627J64978J78417J94014K13646
$$ 3610694 3680977 3766255 3867954 3987258 4123746 4275373 4440351 4618768 4812782 5026428
59390E026428K39036K70814L07853L48551L92450M39689M89280N38875N86037
$$ 5026428 5265464 5536278 5844131 6192682 6585132 7024821 7514101 8052976 8639013
59381H639013O28782O64862O91168P04188P01246O81899O48459O04702N53795
$$ 8639013 9267795 9932657 10623825 11328013 12029259 12711158 13359617 13964319 14518114
59372A4518114M97873M39452L81856L27592K77272K30693J87802J47610J07274
$$ 14518114 15015987 15455439 15837295 16164887 16442159 16672852 16860654 17008264 17115538
59363A7115538O3703J5712l6318r2152j51684k13304k73455l27851l72562m04461
$$ 17115538 17179241 17194953 17158635 17066483 16914799 16701495 16428040 16100189 15727627 15323166
59353A5323166m21937m25656m18199m02913l83324l63236l46441l35890l32977
$$ 15323166 14901229 14475573 14057374 13654461 13271137 12907901 12561460 12225570 11892593
59344A1892593l37275l46786l58925l71634l83449l92703l97527l96843l90608
$$ 11892593 11555318 11208532 10849607 10477973 10094524 9701821 9304294 8907451 8516843
59335H516843l79024l62404l42039l19891k96879k72521k46888k21577j97891
$$ 8516843 8137819 7775415 7433376 7113485 6816606 6544085 6297197 6075620 5877729
59326E877729j75290j52837j31172j11592r3972p7095o0585m5078l0796j7344
$$ 5877729 5702439 5549602 5418430 5306838 5212866 5135771 5075186 5030108 4999312 4981968
59316D981968m846N995J5110K3254L0773L7009M1092M2724M2016L9067L3938K6719
$$ 4981968 4977122 4983117 4998227 5021481 5052254 5089263 5130355 5173079 5215095 5254162 5288100 5314819
59304E314819J7721P648k661j2864k2961l2380l9918m4936m7867m9001m7579m2832
$$ 5314819 5332540 5340188 5337527 5324663 5301702 5269322 5229404 5184468 5136601 5087600 5040021 4997189
59292D997189l5301k6270j6374n437O811K0563L6004N2810O9957Q6661J03185
$$ 4997189 4961888 4935618 4919244 4913807 4920618 4941181 4977185 5029995 5099952 5186613 5289798
59281E289798J20132J37352J54025J69363J82678J93244K00516K04059K02999
$$ 5289798 5409930 5547282 5701307 5870670 6053348 6246592 6447108 6651167 6854166
59272F854166J96318J84072J67402J47027J22798R5326O6703L8531J0344j8801
$$ 6854166 7050484 7234556 7401958 7548985 7671783 7767109 7833812 7872343 7882687 7863886
59262G863886m7903p4517r6946j14782j27792j35657j38785j38475j36303j33755
$$ 7863886 7815983 7741466 7644520 7529738 7401946 7266289 7127504 6989029 6852726 6718971
59252F718971j31818j30308j28043j24261j19293j13493j06466r7941q8304p7472
$$ 6718971 6587153 6456845 6328802 6204541 6085248 5971755 5865289 5767348 5679044 5601572
59242E601572o4393m8511l0584j1028J1250L7108O5516R5188J26723J61493J99288
$$ 5601572 5537179 5488668 5458084 5447056 5458306 5495414 5560930 5656118 5782841 5944334 6143622
59231F143622K38822K79741L22189L64795M04782M39723M67447M84604M87119
$$ 6143622 6382444 6662185 6984374 7349169 7753951 8193674 8661121 9145725 9632844
59222I632844M72300M39326L88110L19188K34748J38383L3933p4371j80965k79699
$$ 9632844 10105144 10544470 10932580 11251768 11486516 11624899 11658832 11584461 11403496 11123797
59212A1123797l65714m35906m88317n22406n39569n41995n31314n09370m79557
$$ 11123797 10758083 10322177 9833860 9311454 8771885 8229890 7698576 7189206 6709649
59203F709649m45705m09932l73064l36570l02418k71271k42533k16032j92164
$$ 6709649 6263944 5854012 5480948 5144378 4841960 4570689 4328156 4112124 3919960
59194C919960j70636j50754j32842j17784j05270r4043q3759p4982o7533o0464
$$ 3919960 3749324 3598570 3465728 3347944 3242674 3148631 3064872 2989890 2922357 2861893
59184B861893n3643m7656m2176l6162k9772k4294k0052j5914j1125o027q48M575
$$ 2861893 2808250 2760594 2718418 2682256 2652484 2628190 2608138 2592224 2581099 2575072 2574224 2578799
59172B578799R771J4007J7851K2698K8532L3906L8390M3197M8939N4609N9443
$$ 2578799 2588570 2602577 2620428 2643126 2671658 2705564 2743954 2787151 2836090 2890699 2950142
59161B950142O4099O9194P4249P8783Q3035Q6876Q9343R0085Q9832Q8738Q5567
$$ 2950142 3014241 3083435 3157684 3236467 3319502 3406378 3495721 3585806 3675638 3764376 3849943
59150C849943P9391P0924O1258N0480L8385K5579J2892M51j1798k3337l3452m1782
$$ 3849943 3929334 4000258 4061516 4111996 4150381 4175960 4188852 4189303 4177505 4154168 4120716 4078934
59138D078934m7988n1597n2582n1550m8973m4833l9190l2323k4173j4445l415
$$ 4078934 4030946 3979349 3926767 3875217 3826244 3781411 3742221 3709898 3685725 3671280 3667865
59127C667865Q142J9916L2216M5150N8529P2515Q7398J02824J18302J34293J51713
$$ 3667865 3676007 3695923 3728139 3773289 3831818 3904333 3991731 4094555 4212857 4347150 4498863
59116D498863J70398J89349K08373K28157K48728K69163K88742L06828L21530
$$ 4498863 4669261 4858610 5066983 5295140 5543868 5813031 6101773 6408601 6730131
59107F730131L30074L30664L22527L04127K73273K29510J74891J12014M3118k8322
$$ 6730131 7060205 7390869 7713396 8017523 8290796 8520306 8695197 8807211 8850329 8822007
59097H822007r7098j58580k10627k52752k84863l07544l22210l30020l31595l28186
$$ 8822007 8724909 8566329 8355702 8102950 7818087 7510543 7188333 6858313 6526718 6198532
59087F198532l21764l13342l02502k89124k74279k58805k42486k25434k08936
$$ 6198532 5876768 5563426 5260924 4971800 4697521 4438716 4196230 3970796 3761860
59078C761860j93919j79747j65410j51004j37308j24796j13671j03974r5128q6355
$$ 3761860 3567941 3388194 3222784 3071780 2934472 2809676 2696005 2592031 2496903 2410548
59068B410548p7832p0391o3894n7257n0314m4081l8818l3469k7654k2440j8433
$$ 2410548 2332716 2262325 2198431 2141174 2090860 2046779 2007961 1974492 1946838 1924398 1905965
59057A905965j4727j0677p114m865l691l660n937j0889j6883k2225k7027l1928
$$ 1905965 1891238 1880561 1873447 1868582 1864891 1861231 1855294 1844405 1827522 1805297 1778270 1746342
59045A746342l6311l9178m0633m1124m0207l7397l3363k9068k4675k0256j6527
$$ 1746342 1710031 1670853 1630220 1589096 1548889 1511492 1478129 1449061 1424386 1404130 1387603
59034A387603j3637j0323n644o25L164N895Q925J2565J5747J7504J7614J6212
$$ 1387603 1373966 1363643 1357999 1357374 1360538 1366433 1375358 1387923 1403670 1421174 1438788 1455000
59022A455000J3728J0920Q176N164J739j478l899n546o307n587l428r84R59K938
$$ 1455000 1468728 1479648 1487824 1492988 1494727 1493249 1489350 1483804 1477497 1471910 1468482 1467498 1468457 1471395
59008A471395N491P993R708J1001J2413J3499J3629J3107J2422J1151Q770N875
$$ 1471395 1476886 1484879 1494587 1505588 1518001 1531500 1545129 1558236 1570658 1581809 1590579 1596454
58996A596454L565K175J446J353J877K589L129L608M068M376M969O581Q761R945
$$ 1596454 1600019 1602194 1603640 1604993 1606870 1609459 1612588 1616196 1620264 1624640 1629609 1636190 1644951 1654896
58982A654896R762R783J1144J2880J3690J3987J4886J6418J8114K0228K2911K5319
$$ 1654896 1664658 1674441 1685585 1698465 1712155 1726142 1741028 1757446 1775560 1795788 1818699 1844018
58970A844018K6935K8806L1987L5677L8420M0324M2494M4937M6710M7571M7959
$$ 1844018 1870953 1899759 1931746 1967423 2005843 2046167 2088661 2133598 2180308 2227879 2275838
58959B275838M7706M6320M4248M2570M1619M1032M0917M1866M4097M7448N1887
$$ 2275838 2323544 2369864 2414112 2456682 2498301 2539333 2580250 2622116 2666213 2713661 2765548
58948B765548N7240O2856O8368P4285Q1109Q8569R6477J05470J15912J26878J37429
$$ 2765548 2822788 2885644 2954012 3028297 3109406 3197975 3294452 3399922 3515834 3642712 3780141
58937C780141J48182J60452J74392J89112K04174K20043K37462K57212K79943
$$ 3780141 3928323 4088775 4263167 4452279 4656453 4876496 5113958 5371170 5651113
58928E651113L05501L33030L62423L94856M31180M70753N12652N56983O04028
$$ 5651113 5956614 6289644 6652067 7046923 7478103 7948856 8461508 9018491 9622519
58919I622519O53156P03584P55044Q06393Q54408Q95059R25015R40765R37456
$$ 9622519 10275675 10979259 11734303 12540696 13395104 14290163 15215178 16155943 17093399
58910A7093399R10148Q55652P72246O59088N17763L53809J75384r049j90882l60927
$$ 17093399 18003547 18859199 19631445 20290533 20808296 21162105 21337489 21328440 21137558 20776631
58900B0776631n11272o37498p38006q11958q59398q82629q85622q72127q45385
$$ 20776631 20265359 19627861 18889855 18077897 17218499 16335870 15450248 14578121 13732736
58891A3732736q08896p65908p18388o67641o15491n63902n14052m66870m23730
$$ 13732736 12923840 12157932 11439544 10771903 10156412 9592510 9078458 8611588 8187858
58882H187858l85538l51838l21959k96186k74858k57248k42502k30454k20358
$$ 8187858 7802320 7450482 7128523 6832337 6557479 6300231 6057729 5827275 5606917
58873E606917k10112j98350j86061j74636j63485j51411j39025j27738j17408
$$ 5606917 5396805 5198455 5012394 4837758 4674273 4522862 4383837 4256099 4138691
58864D138691j07025r6960q8328q0844p3324o5735n8798n2239m5358l8631l2762
$$ 4138691 4031666 3934706 3846378 3765534 3692210 3626475 3567677 3515438 3470080 3431449 3398687
58853C398687k6879j9739j1989n013J744R828J8735K6477L2856L9624M7360N4838
$$ 3398687 3371808 3352069 3340080 3335067 3336811 3346639 3365374 3391851 3424707 3464331 3511691 3566529
58841C566529O1638O8882P6959Q4869R2375J00737J10614J21226J32197J44433
$$ 3566529 3628167 3697049 3774008 3858877 3951252 4051989 4162603 4283829 4416026 4560459
58831D560459J58469J73606J89318K06111K24447K44134K65262K88531L14328
$$ 4560459 4718928 4892534 5081852 5287963 5512410 5756544 6021806 6310337 6624665
58822F624665L42698L74361M10407M50746M94146N39924N88394O39465O91996
$$ 6624665 6967363 7341724 7752131 8202877 8697023 9236947 9825341 10464806 11156802
58813A1156802P44459P94891Q40075Q76029Q99285R06523Q93253Q54493P87097
$$ 11156802 11901261 12696152 13536227 14412256 15311541 16218064 17111317 17965810 18752907
58804A8752907O90572N66175M16935K48669O9569j11546k85964m45137n82190
$$ 18752907 19443479 20009654 20426589 20675258 20744827 20633281 20347317 19902180 19319990
58795A9319990o93668p78818q37617q70967q82173q76047q56417q25874p87541
$$ 19319990 18626322 17847504 17009887 16138920 15256747 14380700 13524283 12698409 11910868
58786A1910868p45058p00778o55657o10881n67861n26721m86683m48075m12269
$$ 11910868 11165810 10465032 9809375 9198494 8630633 8103912 7617229 7169154 6756885
58777F756885l79547l48889l19963k93667k70444k49763k31456k15927k02813
$$ 6756885 6377338 6028449 5708486 5414819 5144375 4894612 4663156 4447229 4244416
58768D244416j90952j79819j69592j59781j49452j38775j28798j19597j10305
$$ 4244416 4053464 3873645 3704053 3544272 3394820 3256045 3127247 3007650 2897345
58759B897345j00965r2626q5550p8890p2236o5972o0127n4495m9688m6384m3683
$$ 2897345 2796380 2703754 2618204 2539314 2467078 2401106 2340979 2286484 2236796 2190412 2146729
58748B146729m0089l5972l3045l1473k9608k6741k3963k1970k0105j8072j6772
$$ 2146729 2106640 2070668 2037623 2006150 1976542 1949801 1925838 1903868 1883763 1865691 1848919
58737A848919j6714j7223j7664j8086j8383j8288j8250j8943j9915k0275k0440
$$ 1848919 1832205 1814982 1797318 1779232 1760849 1742561 1724311 1705368 1685453 1665178 1644738
58726A644738k1533k3305k4490k5025k5884k7012k7524k7652k8270k8693k7420
$$ 1644738 1623205 1599900 1575410 1550385 1524501 1497489 1469965 1442313 1414043 1385350 1357930
58715A357930k4971k3389k2920k1869j9952j8822j8859j8375j6747j5550j5590
$$ 1357930 1332959 1309570 1286650 1264781 1244829 1226007 1207148 1188773 1172026 1156476 1140886
58704A140886j5539j4613j4006j4365j4295j2789j0999j0157r660q598p387o589
$$ 1140886 1125347 1110734 1096728 1082363 1068068 1055279 1044280 1034123 1024463 1015865 1008478 1001889
58692A001889n827m959m815n711o796p722r189j1150j2318j2345j2567j3569j3955
$$ 1001889 996062 991103 986288 980577 973781 966059 956870 945720 933402 921057 908490 894921 880966
58679H80966j2649j0662r329q387o974n123l237j444k23k60j061j166k84L99M16
$$ 880966 868317 857655 848326 839939 832965 827842 824605 823161 822938 822678 821617 820451 820167 820566 820982
58664H20982P07J582K068J928K227L098L008J193j108k737l942m783m330k544
$$ 820982 821689 823271 825339 827267 829494 832592 835600 836793 835685 832948 829006 824223 819893 817349
58650H17349r73m03L72K496N503Q855J2971J7708K1609K3955K5873K8453L1305
$$ 817349 816376 815973 816345 818841 824344 833199 846170 863878 885487 909442 935315 963768 995073
58637I95073L3854L6355L8836M0835M2912M6506N1634N6733O1377O6940P3904
$$ 995073 1028927 1065282 1104118 1144953 1187865 1234371 1286005 1342738 1404115 1471055 1544959
58626A544959Q1030Q8179R7347J09575J23294J37177J52287J69899J89317K09415
$$ 1544959 1625989 1714168 1811515 1921090 2044384 2181561 2333848 2503747 2693064 2902479
58616B902479K30137K50876K69217K82863K90915K91901K82646K60798K26817
$$ 2902479 3132616 3383492 3652709 3935572 4226487 4518388 4801034 5061832 5288649
58607E288649J82232J27995O6183J438o1068j17791j66114k03601k29505k45295
$$ 5288649 5470881 5598876 5665059 5666497 5605429 5487638 5321524 5117923 4888418 4643123
58597D643123k52428k51305k43296k31537k18276k03516j87396j71760j57879
$$ 4643123 4390695 4139390 3896094 3664557 3446281 3242765 3055369 2883609 2725730
58588B725730j44886j31937j19793j08795r7556q5323p3599o3785n5286m7434
$$ 2725730 2580844 2448907 2329114 2220319 2122763 2037440 1963841 1900056 1844770 1797336
58578A797336m1147l7066l4117l1510l0200l0855l2424l4041l6126l8341l8915
$$ 1797336 1756189 1719123 1685006 1653496 1623296 1592441 1560017 1525976 1489850 1451509 1412594
58567A412594l7469l5907l5009l2967k8958k5254k3679k2841k1163j9817k0123
$$ 1412594 1375125 1339218 1304209 1271242 1242284 1217030 1193351 1170510 1149347 1129530 1109407
58556A109407k0636j9515j7511j6049j4567j2266j0270r499q481n856l037j903
$$ 1109407 1088771 1069256 1051745 1035696 1021129 1008863 998593 989094 980613 974757 971720 969817
58544I69817j892j760k054l290l920k857j921l076n172o136o431p524q859r196
$$ 969817 967925 966165 964111 960821 956901 954044 952123 949047 943875 937739 931308 923784 914925 905729
58530I05729r258j0279j1496j1736j1794j2733j3547j3034j2292j2775j3608j3317
$$ 905729 896471 886192 874696 862960 851166 838433 824886 811852 799560 786785 773177 759860
58518G59860j2433j2007j1370r808q481q272p835o135m696m782m784l191j637
$$ 759860 747427 735420 724050 714242 705761 697489 689654 683519 678823 674041 669257 666066 664429
58505F64429j988k857k161p93m62k19J389K920K426J187J425K274J678M29N70
$$ 664429 662441 659584 657423 656630 656168 655949 657338 660258 662684 663871 665296 667570 669248 669677 670247
58490F70247J459J187K61L24P22J8o73N43K715L720M034N353P071P630P746Q766
$$ 670247 671706 672893 673154 673478 674200 674218 673545 674088 676803 680523 684557 689910 696981 704611 712357 721123
58474G21123R524Q461O946O747O173K858j498l484l461m245n863o241n905p229
$$ 721123 730647 739108 746054 752801 758974 761832 760334 756850 753389 749144 743281 737040 731135 723906
58460G23906r713j0580r570q977r427r504r045r006q741p031n023m585m796l650
$$ 723906 714193 703613 694043 685066 675639 666135 657090 648084 639343 632312 627289 622704 617908 614258
58446F14258j962j795k342j412L58Q63Q10K300M542N228M963N826O925N957M013
$$ 614258 612296 610501 608159 606747 607105 607968 608778 611078 615620 620848 625811 631637 638562 644519 648532
58431F48532L914M832L612O26p16K12R25Q36J763L697M741N020O190P555P172
$$ 648532 652446 657278 660890 661516 660800 661012 661937 662773 664536 668233 672974 677994 684184 691739 698911
58416F98911O115O972Q846Q653O715N973O356N179K708J893K756K390N39j00P56
$$ 698911 705026 711998 720844 729497 736212 742185 748541 753720 756428 758321 761077 763467 764006 763906 764662
58401G64662N35j087j801j559k700m986n563m251l742m340l529j178jl87J75J981
$$ 764662 765197 764110 762309 760750 758050 753064 747501 743250 739508 735168 731639 730461 730460 730073 730248 732229
58385G32229K486J259P31J440J374M86J001K774L224K276K588M558N859O136P311
$$ 732229 734715 735974 736705 738145 739519 740005 741006 743780 747004 749280 751868 756426 762285 768421 775732
58370G75732R092R126P745P552Q359P602N668N405O490N799L385K436L318L366
$$ 775732 784824 793950 801695 809247 817606 825208 830876 836281 842771 848570 851955 854391 857709 861075
58356H61075K603L751O386P086N650N204N993N200L048K763M211L926J811J322
$$ 861075 863678 867429 873815 880901 886551 891755 897748 902948 905996 908759 912970 916896 918707 920029
58342I20029K663K501Q45J344M166N460M629N197P737Q890Q247R038J1241J1234
$$ 920029 922692 925193 926038 927382 931548 937008 941637 946834 954571 963461 971708 980746 991987 1003221
58328A003221R185R306J1874J2525J0511R888J1387J1152Q829Q748J1448J2240
$$ 1003221 1012406 1021712 1033586 1046111 1056622 1066510 1077897 1089049 1097878 1106626 1118074 1130314
58316A130314J0077R549J2074J3342J1777J1233J3004J3308J1177J0643J2640
$$ 1130314 1140391 1149940 1162014 1175356 1187133 1198366 1211370 1224678 1235855 1246498 1259138
58305A259138J2892J0291R171J0891J1530J0193J1041J4598J5901J3847J3472
$$ 1259138 1272030 1282321 1291492 1302383 1313913 1324106 1335147 1349745 1365646 1379493 1392965
58294A392965J6377J7864J6306J6102J8561J9242J7238J7460K0761K1697J9102
$$ 1392965 1409342 1427206 1443512 1459614 1478175 1497417 1514655 1532115 1552876 1574573 1593675
58283A593675J8770K2373K4171K2119K1636K4654K5934K4157K5512L1998L7268
$$ 1593675 1612445 1634818 1658989 1681108 1702744 1727398 1753332 1777489 1803001 1834999 1872267
58272A872267L8466M0734M5658M7117M3512M2078M5799M8162M6245M6542N2071
$$ 1872267 1910733 1951467 1997125 2044242 2087754 2129832 2175631 2223793 2270038 2316580 2368651
58261B368651N6310N6046N7430O3064O5973O3013O1229O4258O5779O3209O3946
$$ 2368651 2424961 2481007 2538437 2601501 2667474 2730487 2791716 2855974 2921753 2984962 3048908
58250C048908P0866P5709P4472P4988Q1567Q6985Q7650R1302J01313J09098J10901
$$ 3048908 3119774 3195483 3269955 3344943 3426510 3513495 3601145 3692447 3793760 3902858 4013759
58239D013759J15771J27874J37790J40919J46861J60520J72227J77295J86296
$$ 4013759 4129530 4257404 4395194 4536113 4682974 4843494 5015721 5193016 5379312
58230E379312K04429K20430K28176K39017K59801K79754K92783L10668L39745
$$ 5379312 5583741 5804171 6032347 6271364 6531165 6810919 7103702 7414370 7754115
58221G754115L67452L87489M14166M55349M96503N29276N69299O26671O86909
$$ 7754115 8121567 8509056 8923222 9378571 9875074 10404350 10973649 11600320 12287229
58212A2287229P41736Q09075R00424R99930J099836J223101J385087J569339J770089
$$ 12287229 13028965 13838040 14738464 15738394 16838230 18061331 19446418 21015757 22785846
58203B2785846K019453K341448K722911L165691L719896M425694N276440O285698
$$ 22785846 24805299 27146747 29869658 33035349 36755245 41180939 46457379 52743077
58195E2743077P531109R084602J0981413J3324296J6308189K0021594K4316446
$$ 52743077 60274186 69358788 80340201 93664497 109972686 129994280 154310726
58188A54310726K8991226L3894065L8456458M1096186L9543390L2245524J9635659
$$ 154310726 183301952 217196017 255652475 296748661 336292051 368537575 388173234
58181C88173234M090270j1238040k3670125l1706108l5209067l5147309l2939715
$$ 388173234 392263504 381025464 357355339 325649231 290440164 255292855 222353140
58174B22353140k9759554k6270254k2803009j9564343j6658772j4088278j1839349
$$ 222353140 192593586 166323332 143520323 123955980 107297208 93208930 81369581
58167H1369581r928851q345430p021340n896526m953591m168237l485644k870164
$$ 81369581 71440730 63095300 56073960 50177434 45223843 41055606 37569962 34699798
58159C4699798k325078j842966j386154r29745m70985J4995N70660J195962J854401
$$ 34699798 32374720 30531754 29145600 28215855 27744870 27759865 28330525 29526487 31380888
58150C1380888K541987L252902L828045L926864L254258J821267l9505j877206
$$ 31380888 33922875 37175777 41003822 44930686 48184944 50006211 49966706 48089500
58142D8089500l321672m176158m442450m284357l913510l474493l028010k604068
$$ 48089500 44767828 40591670 36149220 31864863 27951353 24476860 21448850 18844782
58134A8844782k226382j897875j606703j352340j142908r72191q24138o95869
$$ 18844782 16618400 14720525 13113822 11761482 10618574 9646383 8822245 8126376
58126H126376n94271n15187m47026l89648l49643l22165k96310k73050k59593
$$ 8126376 7532105 7016918 6569892 6180244 5830601 5508436 5212126 4939076 4679483
58117D679483k51389k37421k18390k02727j89473j71461j50787j35121j22847
$$ 4679483 4428094 4190673 3972283 3769556 3580083 3408622 3257835 3122714 2999867
58108B999867j07054r0322q1043p8777p6850p5407p8564q2665q0650p4591p1458
$$ 2999867 2892813 2802491 2721448 2642671 2565821 2490414 2411850 2329185 2248535 2173944 2102486
58097B102486p0237o5229n8193n5054n4307n0498m5566m5114m6924m4665l9684
$$ 2102486 2032249 1967020 1908827 1853773 1799466 1748968 1703402 1658288 1611364 1566699 1527015
58086A527015l7894l8239l5325l0502k9362l0956l0060k7523k8025l0132k8717
$$ 1527015 1489121 1450882 1415557 1385055 1355693 1324737 1294677 1267154 1239129 1208997 1180280
58075A180280k4844k3466k3715k1172j7246j6653j7872j5723j1332j0059j1470
$$ 1180280 1155436 1131970 1108255 1087083 1069837 1053184 1035312 1019589 1008257 998198 986728
58064I86728j0627p613o700p676o806m951o077r049r314p437p849j0475j1433
$$ 986728 976101 968488 961788 954112 947306 942355 936278 927229 917915 910478 902629 892154 880721
58051H80721j0748j1580j3168j2224r856r713j0764r334o568o307p328n481j932
$$ 880721 869973 858393 845225 833001 823145 813432 802668 793334 786766 780459 773131 767650 765718
58038G65718j309l032k489K64R47n65k05K279K922J040J1N35j04k102k866k496
$$ 765718 764409 761377 758888 759152 760099 759534 759329 761608 764530 765570 765581 766116 766012 763910 761044 758548
58022G58548l393m886m337k847l652n719n328l141l112n139n555m380n177p913
$$ 758548 755155 750269 745932 743085 739433 733714 728386 725245 722133 716994 711439 707059 701882 693969
58008F93969q776p213o562p499p229n558n377o702o297l889k847m050m743l998
$$ 693969 685193 677980 671418 663919 656690 651132 645755 639053 632756 628867 626020 621970 617227 613229
57994F13229l849m492l802k091k046l533l616j980j177j368j70K095K474J007
$$ 613229 609380 604888 601086 598995 596949 593416 589800 587820 586643 585275 585105 587200 589674 590681
57980E90681Q48K393K740J459J391L008L452K042J424K252J905l28j790j463j672
$$ 590681 591529 593922 596662 598121 599512 602520 605972 608014 609438 611690 613595 613267 611477 610014 608342
57965F08342l474m807m521m126m389m114l159k844k831j537M1q62l890n724n484
$$ 608342 604868 600061 595540 591414 587025 582911 579752 576908 574077 572540 572581 571719 567829 562105 556621
57950E56621n450o146n407k959j325j258o90J066K318K898M583O953P284N357
$$ 556621 551171 545025 539618 536659 535334 534076 533386 534452 536770 539668 544251 551204 558488 563845
57936E63845L907L511J743j679l712l247l050m896p077q184r230j0543j0575r265
$$ 563845 567752 571263 573006 571327 567615 564368 561318 556422 549345 541161 531931 521388 510813 501548
57922E01548q739r277q527n965m122m017l436j213P08J152J721L300M276L926
$$ 501548 492809 483532 475005 469040 464918 460901 457465 456252 456960 458112 459833 463133 467409 471335
57908D71335M014N339O187N792N814O887P190O015N213N545N104K983J095O43
$$ 471335 475349 480688 486875 492667 498481 505368 512558 518573 523786 529331 534435 537418 538513 539156
57894E39156K07j118j990j883k380l814m129k798k416m386o495o803o565p126
$$ 539156 539363 538245 536255 534372 531992 528178 524049 521251 518835 514449 507954 501151 494586 487460
57880D87460p213n735m335m544n101m414l299l060l090k438j572p97R20L726N762
$$ 487460 480247 474512 470177 465633 460532 456118 452819 449759 446669 444231 442659 441862 442782 446508 452270
57865D52270N910N533N974O582O668P053Q079Q388P247N909N212M158K155L87
$$ 452270 458180 463713 469687 476269 482937 489990 498069 506457 513704 519613 524825 528983 531138 531525
57851E31525m49j403l023m174m361m830o157p154p379q026r264r379p903o672
$$ 531525 531076 529673 526650 522476 518115 513285 507128 499974 492595 484569 475305 465926 458023 451351
57837D51351o521n876m070k925l332l424k056j104k122l586l763l584m297m879
$$ 451351 444830 438954 434884 431959 428627 425203 423147 422043 419921 416335 412572 408988 404691 399812
57823C99812m237l675m628o097o571o582p100p397o695o021o327o595n759m609
$$ 399812 395575 391900 387272 381175 374604 368022 360922 353525 346830 340809 334482 327887 322128 317519
57809C17519m003l167j673r30j720k346j384j10j08n29n4N11J15JJ796M573O327
$$ 317519 313516 310349 308676 307746 306026 303680 302296 302186 302078 301549 301495 302006 302121 302122 303918 308491 314818
57792C14818P096Q263R929J1113J1486J1111R617P348N968O276O792O083M959
$$ 314818 321914 330177 340106 351219 362705 373816 383433 390781 396749 403025 409817 415900 420859
57779D20859M726M839M008K215mk682n362o628o226n898o611o990n967m763m485
$$ 420859 425585 430424 434432 436647 436643 433961 428599 421971 415745 409847 403236 396246 390279 385516 381031
57764C81031m052k580j516k034k585j455K41P69R09K070L181K550J285J690L370
$$ 381031 376979 374399 372883 370849 368264 366809 367050 367819 368728 370798 373979 376529 377814 379504 382874
57749C82874M068L492L319L962M157L483K894K862L090L692M837N743N711N542
$$ 382874 386942 390434 393753 397715 401872 405355 408249 411111 414201 417893 422730 428473 434184 439726
57735D39726O326P588Q262Q587R384J0504J1515J2841J4587J5597J5340J5319
$$ 439726 446052 453640 461902 470489 479873 490377 501892 514733 529320 544917 560257 575576
57723E75576J6625J7634J6323J3513J1442J0381R176Q080Q372R906J1478J3069
$$ 575576 592201 609835 626158 639671 651113 661494 670670 678750 687122 697028 708506 721575
57711G21575J5473J8269K0382K2173K4843K8323L1669L5031L9258M4112M8842
$$ 721575 737048 755317 775699 797872 822715 851038 882707 917738 956996 1001108 1049950
57700A049950N3956O0530O8357P6604Q5603R6275J08480J21746J36677J53809
$$ 1049950 1103906 1164436 1232793 1309397 1395000 1491275 1599755 1721501 1858178 2011987
57690B011987J72050J90292K09428K30507K51713K69501K81907K88334K86796
$$ 2011987 2184037 2374329 2583757 2814264 3065977 3335478 3617385 3905719 4192515
57681D192515K74115K48790K11606J63912J07719M7364j1294o3522j06190j36447
$$ 4192515 4466630 4715420 4927026 5090938 5198657 5246021 5234727 5171205 5065015 4928568
57671D928568j52398j55025j47456j32504j13003r4298q3824q7200j05304j34337
$$ 4928568 4776170 4621145 4473689 4341185 4228182 4133884 4050060 3962860 3857556 3723219
57661C723219j67042j94654k10517k13022k04737j89242j69789j49483j30363
$$ 3723219 3556177 3361523 3151006 2937984 2733247 2544005 2374216 2224733 2094370
57652B094370j12437r5093p8951o4886n2309m0291k9449k0721j3098m830L907
$$ 2094370 1981933 1886840 1807889 1743003 1690694 1650403 1620954 1600233 1587135 1582305 1586212
57641A586212J1763J9041K7315L6778M6250N5582O5768P6973Q8675J01472J16563
$$ 1586212 1597975 1617016 1644331 1681109 1727359 1782941 1848709 1925682 2014357 2115829 2232392
57630B232392J33653J51393J69477J88074K05698K20099K30914K38775K41904
$$ 2232392 2366045 2517438 2686915 2874989 3080687 3300786 3531700 3770475 4012379
57621D012379K36159K18726J89559J49442R9360M2336j6598p2990j24023j67149
$$ 4012379 4248538 4467264 4656823 4806265 4905625 4947961 4931363 4858373 4734350 4567201
57611D567201k00100k22589k36062k41486k39288k31304k20416k07909j93376
$$ 4567201 4367101 4144512 3908450 3666964 3427676 3196372 2975956 2768047 2574671
57602B574671j77453j62335j49106j36784j24595j13132j02719r2689q2939p4415
$$ 2574671 2397218 2234883 2085777 1948993 1824398 1711266 1608547 1515858 1432919 1358504
57592A358504o7387o1001n4953m9982m6213m2642l8676l4699l0961k7448k4765
$$ 1358504 1291117 1230116 1175163 1125181 1078968 1036326 997650 962951 931990 904542 879777
57581H79777k3428k2417k0308j7708j6403j6234j5193j2702j0302q788p254n454
$$ 879777 856349 833932 813624 795916 779513 763279 748086 735384 725082 716294 709040 703586
57569G03586m487m354l359r64J121J809K438M470P277R499J0898J1818J2303J2751
$$ 703586 699099 694745 691386 690422 691543 693352 695790 700260 707537 717036 727934 739752 752055 764806
57555G64806J3955J5753J7021J7563J8427J9981K1562K3477K7222L2891L8529
$$ 764806 778761 794514 811535 829098 847525 867506 889068 912545 939767 972658 1011187
57544A011187M3005M7643N3938O1618O9942P9109Q9206R9623J10572J23385J38174
$$ 1011187 1054192 1101835 1155773 1217391 1287333 1366442 1455648 1555271 1665843 1789228 1927402
57533A927402J53008J66482J79233J91536K01236K05534K03294J94106J76682
$$ 1927402 2080410 2246892 2426125 2617661 2818897 3024431 3227725 3421831 3598513
57524C598513J49936J14618P2681K6233k1730o7086j06520j38851j63571j79630
$$ 3598513 3748449 3863067 3935748 3961981 3940251 3873165 3766645 3627794 3464223 3284593
57514C284593j86885j87286j83194j75651j65368j53893j42382j30470j17805
$$ 3284593 3097708 2910422 2727228 2551577 2386209 2232316 2089934 1959464 1841659
57505A841659j05468r4546q4590p4918o6188n9048n2402m4800l6672k9529k3701
$$ 1841659 1736191 1641645 1557055 1482137 1415949 1356901 1304499 1259699 1223027 1193498 1169797
57494A169797j8424j3498r248n318j053L354P306J1084J5472K0515K5673L0845
$$ 1169797 1151373 1137875 1128627 1123309 1122256 1125610 1132916 1144000 1159472 1179987 1205660 1236505
57482A236505L6273M1914M7926N5297O4992P6687Q9124J01425J13486J25645J38488
$$ 1236505 1272778 1314692 1362618 1417915 1482907 1559594 1648718 1750143 1863629 1989274 2127762
57471B127762J52347J66317J78277J86384J89843J87798J78427J59898J31628
$$ 2127762 2280109 2446426 2624703 2811087 3000930 3188728 3367155 3527053 3658681
57462C658681R4270M9627J118m6749r0422j28155j58710j80569j93327j98542
$$ 3658681 3752951 3802578 3803696 3756947 3666525 3538370 3379660 3199091 3005764 2807222
57452B807222j98145j92955j83645j71956j59696j47370j34798j22317j10422
$$ 2807222 2609077 2416122 2232477 2060521 1900825 1753455 1618657 1496340 1385918
57443A385918r9087q8341p8807p0819o3848n7505n2121m7700m3420l9005l5341
$$ 1385918 1286831 1198490 1119683 1048864 985016 927511 875390 827690 784270 745265 709924
57432G09924l2817l0365k7258k4460k2892k1699j9733j7587j6407j5664j4007
$$ 709924 677107 646742 619484 595024 572132 550433 530700 513113 496706 481042 467035
57421D67035j1664j0145r852r682q886p814o858n927n124m849n124n486n574n293
$$ 467035 455371 445226 435374 425692 416806 408992 402134 396207 391083 386234 381110 375624 370050 364757
57407C64757m634l827l324l179k925k363j810j285l83O47Q34P7m10j4K37m74j159
$$ 364757 360123 356296 352972 349793 346868 344505 342695 341410 341027 341674 342508 342585 342175 342161 342398 341924 340765
57390C40765n38Q76J597J237M79k17p18p32l56m26j268j908j588j054j230j638
$$ 340765 340227 341103 342700 343937 344416 344199 343481 342749 342393 341967 340699 338791 337203 336149 334919 333281
57374C33281j399q79q49q81j31J045J690J888K332K898L073L154L572L667K665
$$ 333281 331882 331003 330154 329273 329142 330187 331877 333765 336097 338995 342068 345222 348794 352461 355126
57359C55126J315J007J704K223K199K262K557K609K380K212J948J350R89J503
$$ 355126 356441 357448 359152 361375 363574 365836 368393 371002 373382 375594 377542 378892 379881 381384
57345C81384K379K730K808L356M000L831L193L291M185M720M361L706L242K928
$$ 381384 383763 386493 389301 392657 396657 400488 403681 406972 411157 415877 420238 423944 427186 430114
57331D30114K912L436M095M320M408M958N591N453M708M279M433M871N766P347
$$ 430114 433026 436462 440557 444877 449285 454243 459834 465287 469995 474274 478707 483578 489344 496691
57317D96691Q777Q973Q319Q131Q621Q869Q615Q532Q797Q896Q919R611J1038J2378
$$ 496691 505468 514441 522760 530891 539512 548381 556996 565528 574325 583221 592140 601751 612789 625167
57303F25167J3199J3748J4124J4301J4779J6001J7373J8142J8873K0607K2909
$$ 625167 638366 652114 666238 680539 695318 711319 728692 746834 765707 786314 809223
57292H09223K4402K5058K6200K8249L0185L1394L2384L3487L4391L5137L6038
$$ 809223 833625 858683 884883 913132 943317 974711 1007095 1040582 1074973 1110110 1146148
57281A146148L6426L5115L2324K9461K6709K2553J6201Q872J906m839j1908j8811
$$ 1146148 1182574 1217689 1250013 1279474 1306183 1328736 1344937 1353809 1355715 1350876 1338968 1320157
57269A320157k4494k8378l0314l0438k9488k8455k7460k5805k3260k0379j7486
$$ 1320157 1295663 1267285 1236971 1206533 1177045 1148590 1121130 1095325 1072065 1051686 1034200
57258A034200j4369j1157q382o098l895j826k44J194L001M568M848M350M795O649
$$ 1034200 1019831 1008674 1000292 994194 990299 988473 988229 989423 992424 996992 1001840 1006190 1010985 1017634
57244A017634Q660J0061J1514J3421J5141J6497J8332K0823K2721K3180K2916
$$ 1017634 1026294 1036355 1047869 1061290 1076431 1092928 1111260 1132083 1154804 1177984 1200900
57233A200900K2789K2630K2320K2556K3580K4372K4077K3193K2450K1730K0952
$$ 1200900 1223689 1246319 1268639 1291195 1314775 1339147 1363224 1386417 1408867 1430597 1451549
57222A451549K0851K1778K2725K2616K1776K1252K1432K2132K3199K4281K4772
$$ 1451549 1472400 1494178 1516903 1539519 1561295 1582547 1603979 1626111 1649310 1673591 1698363
57211A698363K4747K5098K6149K7085K7394K7753K8663K9300K8773K7653K7148
$$ 1698363 1723110 1748208 1774357 1801442 1828836 1856589 1885252 1914552 1943325 1970978 1998126
57200A998126K7429K7719K7429K6399K4666K2768K1710K1912K2746K3680K5028
$$ 1998126 2025555 2053274 2080703 2107102 2131768 2154536 2176246 2198158 2220904 2244584 2269612
57189B269612K6945K8676K9615L0309L1427L2516L2693L2016L1283L0996L1270
$$ 2269612 2296557 2325233 2354848 2385157 2416584 2449100 2481793 2513809 2545092 2576088 2607358
57178B607358L2130L3217L3738L3508L3369L3933L4668L4955L5200L5969L6772
$$ 2607358 2639488 2672705 2706443 2739951 2773320 2807253 2841921 2876876 2912076 2948045 2984817
57167B984817L6812L6380L6386L6897L7118L6615L5680L4667L3680L2732L1660
$$ 2984817 3021629 3058009 3094395 3131292 3168410 3205025 3240705 3275372 3309052 3341784 3373444
57156C373444L0182K8435K7026K6080K4807K2597J9939J7674J5927J4484J3537
$$ 3373444 3403626 3432061 3459087 3485167 3509974 3532571 3552510 3570184 3586111 3600595 3614132
57145C614132J3271J3134J2363J0878R156P533O197N358M920M447L850L533L578
$$ 3614132 3627403 3640537 3652900 3663778 3672934 3680467 3686664 3692022 3696942 3701389 3705239 3708772 3712350
57132C712350L598L743M835O996R254J1158J3545J6845J9842K1374K1909K2145
$$ 3712350 3715948 3719691 3724526 3731522 3740776 3751934 3765479 3782324 3802166 3823540 3845449 3867594
57120C867594K1234J8192J4141J1243R991R470R851J2620J8423K6510L6276M7469
$$ 3867594 3888828 3907020 3921161 3932404 3942395 3951865 3961716 3974336 3992759 4019269 4055545 4103014
57108D103014N8896O9035P8497R0273J07018J29754J59439J97802K45799L03229
$$ 4103014 4161910 4230945 4309442 4399715 4506733 4636487 4795926 4993728 5239527 5542756
57098E542756L71085M52739N51641O69172Q05596R61137J134465J321604J517983
$$ 5542756 5913841 6366580 6918221 7587393 8392989 9354126 10488591 11810195 13328178
57089A3328178J719971J922237K114833K284746K419345K507152K538419K507988
$$ 13328178 15048149 16970386 19085219 21369965 23789310 26296462 28834881 31342869
57081C1342869K413589K245465J982438J612161J160365O88521K49584j52136
$$ 31342869 33756458 36001923 37984361 39596522 40756887 41445408 41694992 41542856
57073D1542856n48504r57032j352694j690146j942255k111392k213248k261324
$$ 41542856 40994352 40037320 38684626 36994480 35052225 32940833 30727585 28466261
57065B8466261k264405k228144k155010k046929j910015j754536j590155j423963
$$ 28466261 26201856 23973712 21818702 19771773 17861758 16107222 14517067 13093104
57057A3093104j262547j112157r75883q53587p45367o52568n74907n09528m53914
$$ 13093104 11830557 10718400 9742517 8888930 8143563 7490995 6916088 6406560 5952646
57048E952646m07487l69419l37360l09496k85874k66528k50138k35513k22597
$$ 5952646 5545159 5175740 4838380 4528884 4243010 3976482 3726344 3490831 3268234
57039C268234k10986j99231j86621j74023j62042j49980j37494j25527j14623
$$ 3268234 3057248 2858017 2671396 2497373 2335331 2185351 2047857 1922330 1807707
57030A807707j04006r3355q3767p5879o8723o1564n5202n0241m5732m0822l6260
$$ 1807707 1703701 1610346 1526579 1450700 1381977 1320413 1265211 1214970 1169238 1128416 1092156
57019A092156l2908l0246k7553k5149k3196k0824j7648j4728j2728j0779q280
$$ 1092156 1059248 1029002 1001449 976300 953104 932280 914632 899904 887176 876397 868117
57008H68117o096m531k044K405P672J2790J9061K7769L7969M8866O2379Q0565
$$ 868117 862021 857490 855446 857851 865523 878313 897374 925143 963112 1011978 1074357 1154922
56996A154922J02511J26782J54508J84809K07451K05413J67722R8649J4456o6094
$$ 1154922 1257433 1384215 1538723 1723532 1930983 2136396 2304118 2402767 2417223 2351129
56986B351129j28506j65397j77471j71770j57015j39676j23429j10127j00110
$$ 2351129 2222623 2057226 1879755 1707985 1550970 1411294 1287865 1177738 1077628
56977A077628r2404q5633p8674p0751o1780n2647m4279l6572k9075k2362j7452
$$ 1077628 985224 899591 820917 750166 688386 635739 591460 554888 525813 503451 485999
56966D85999j4067j0753o777k667J029M444P725J0854J4150J7846K1101K2333
$$ 485999 471932 461179 454402 451735 452764 457208 464933 475787 489937 507783 528884 551217
56954E51217K0561J5727Q090j525j1159j8540k2604k3607k2302j9833j7652j6262
$$ 551217 571778 587505 595595 594070 582911 564371 541767 518160 495858 476025 458373 442111
56942D42111j4575j1688q525o361m574j650K345O228J0108J5113K0986K6042K9448
$$ 442111 427536 415848 407323 400962 396388 394738 397083 403311 413419 428532 449518 475560 505008
56929E05008L1235L0090K3734J2231j107j2924k2135k8646l1951l2143l0595k8441
$$ 505008 536243 566333 590067 602298 601191 588267 566132 537486 505535 473392 442797 414356
56917D14356k5574k1929j8422j5713j3315j0804q751p662p060o379n764n276m400
$$ 414356 388782 366853 348431 332718 319403 308599 299848 292186 285126 278747 272983 267707 263307
56904B63307l024j883j342q07N1N86L82J28N59J505K671M345O638Q961J0964J3143
$$ 263307 260283 258400 257058 256251 256302 256888 257270 257398 257957 259462 262133 266478 273116 282077 293041 306184
56888C06184J5877J8793K1644K4648K7194K7345K3705J6987Q907M71p638j3996
$$ 306184 322061 340854 362498 387146 414340 441685 465390 482377 491284 491755 484117 470121
56876D70121j7148j7144j5236j2414r063n692k825j59L242P735J2691J7482K2375
$$ 470121 452973 435829 420593 408179 399116 393424 390599 390440 393682 401417 414108 431590 453965
56863D53965K8180L5289M3363N1749N9643O5387O5969N8394M2235K0558k086k2157
$$ 453965 482145 517434 560797 612546 672189 737576 803545 861939 904174 924732 922646 900489
56851I00489l7495m6663m9342m7073m2225l6224k9397k2026j4361n957L614J3630
$$ 900489 862994 816331 766989 719916 677691 641467 612070 590044 575683 569726 573340 586970
56839E86970K3120L2641M3713N6510O9695Q2514R5002J05378J08740R9723P6239
$$ 586970 610090 642731 686444 742954 812649 895163 990165 1095543 1204283 1304006 1380245
56828A380245M0883j8l8438o7630q4753r0941q9112q2320p3487o4695n6028m6292
$$ 1380245 1421128 1421110 1382672 1315042 1230289 1139348 1050236 967916 894429 829734 773706 727414
56816G27414l5309k4431j4560m984N250J6101K7252L8914N1116O2845P2175P6409
$$ 727414 692105 667674 653114 648130 653380 669481 696733 735647 786763 849608 921783 998192
56804I98192P2164N6988L1907J728k7678n1842o8070p5386p5052p0013o2855n4806
$$ 998192 1070356 1127344 1159251 1160979 1133301 1081459 1013389 938003 862951 792938 730083 675277
56792F75277m6677l9356l2902k6379j9250j1953m797K558J0084J7099K3472K9810
$$ 675277 628600 589244 556342 529963 510713 498760 493963 496521 506605 523704 547176 576986
56780E76986L5790L9368L8196L1131J8385J714j5321k8877l7512m2283m4217m3236
$$ 576986 612776 652144 690340 721471 739856 741570 726249 697372 659860 617577 573360 530124
56768E30124l9913l6113l2910k9576k5550k1762j8967j6376j3197j0178q333p344
$$ 530124 490211 454098 421188 391612 366062 344300 325333 308957 295760 285582 277249 269905
56756B69905o345n281m453l718l051k827k889k498j776j732k305k098q64k55j096
$$ 269905 263560 258279 253826 250108 247057 244230 241341 238843 237067 235335 233030 230932 230068 229813 228717
56741B28717j869j312n26q29j439j206q97j624k460j888n14o5o08r26r19j377
$$ 228717 226848 225536 225010 224181 222742 221536 220639 219015 216555 214667 214153 214088 213480 212554 211635 210258
56725B10258k012j850j198j183j654j437n12n1m09p09n13l29m40n62p35j251j716
$$ 210258 208246 206396 205198 204015 202361 200924 200412 200361 199952 199243 198730 198401 197961 197399 196664 195413 193697
56708A93697j361k60P12J054Q61K15p16j250q81j28J74P8J71M89O61P03P71N90
$$ 193697 192336 192076 192788 193842 194703 194918 194202 192952 192071 191943 192117 192195 192366 192855 193516 194219 194990 195580
56690A95580o7p67r62o46R0J237K174J917P43L42J364K259J626L02k18k9Q8L69
$$ 195580 195513 194746 193784 193138 193228 194465 196639 198556 199299 199641 201005 203264 204890 205192 204974 204945 205033 205402
56672B05402J157J484M58r34j308j148j665k373j979q75n47j018j006k79K77N33
$$ 205402 206559 208043 208501 207567 206259 205111 203446 201073 199094 198219 197672 196654 195648 195369 195646 196179
56656A96179J019J281M02r66j180j60N34J70m97r49j419j613p72O71J280O64r0
$$ 196179 197198 198479 198881 197915 196735 196575 197109 197279 196782 195833 194414 192801 192029 192700 193980 194644 194554
56639A94554k17l5J52M64O71L45j55j28J44j79q97r58l1J368K973M549N062L794
$$ 194554 194337 194302 194454 194918 195589 195934 195779 195651 195795 195616 194719 193761 193730 195098 198071 202620 207682 211476
56621B11476J914J224J638J680J126J076J566J308Lj115j448j820k648l173l030
$$ 211476 213390 214614 216252 217932 219058 220134 221700 223008 223011 221896 220448 218628 215980 212807 209777
56606B09777k974l421l725l490l225l261l180k697k047j250j45Q06Q70L14P5K54
$$ 209777 206803 203382 199657 196167 192942 189681 186501 183804 181757 180507 180362 181168 182038 182352 182427 182681
56590A82681J39l79p17q01j035j181o91Q1L57L89R45J690J692J228J325J756J394
$$ 182681 182820 182441 181724 180923 179888 178707 178016 178097 178454 178843 179788 181478 183170 184398 185723 187479 188873
56573A88873L85N5O91J296J497J828K125J736J282K101L822M616M045L538L780
$$ 188873 189258 189313 190004 191300 192797 194625 196750 198486 199768 201869 205691 210307 214352 217890 221670
56558B21670L840L340L212L756M027L731L741M143L886K923K620L282L438K332
$$ 221670 225510 228850 232062 235818 239845 243576 247317 251460 255346 258269 260889 264171 267609 269941
56544B69941J102N69q6j348k102j585q70j174k104k744l086l385l324k873k736
$$ 269941 271043 271612 271526 270178 268076 266491 265621 264447 262343 259599 256513 253128 249804 246931 244195
56529B44195l156l346k721j676p02Q6L02m27j330j165k65k47j476k612k864k847
$$ 244195 241039 237693 234972 233296 232594 232680 232982 232555 231225 230060 229795 229548 228072 225460 222596 219749
56513B19749k878k512k099k695l886l887k383j148j219j692j912k413k924k028
$$ 219749 216871 214359 212260 209565 205679 201792 199409 198261 197042 195350 193438 191025 188101 186073
56499A86073J22J291N33l56o0J71p81j634j002J95N96P48J602K454K357K032K466
$$ 186073 186195 187486 188019 187663 187603 187774 186993 185359 184357 184552 185148 185896 187498 189952 192309 194341 196807
56482A96807L040K901K679L159L563K941J981J755J895J649J490K098K942L339
$$ 196807 199847 202748 205427 208586 212149 215090 217071 218826 220721 222370 223860 225958 228900 232239
56468B32239L708M344M379L374K571K947L505L073K435K838L713L714K935K326
$$ 232239 235947 240291 244670 248044 250615 253562 257067 260140 262575 265413 269126 272840 275775 278101
56454B78101J941J394J098J470J783J340Q24J087J616J560J196J125J081Q76J156
$$ 278101 280042 281436 282534 284004 285787 287127 287951 289038 290654 292214 293410 294535 295616 296492 297648
56439B97648J938J783k9j935k244j542j258j297r36q38k108m199n590n805n314
$$ 297648 299586 301369 301340 299405 297161 295619 294361 293064 292128 291290 289182 284983 279393 273588 268274
56424B68274m369l414l582n133o528o479n867o060o607o386n756n762o151o157
$$ 268274 263905 260491 256909 251776 245248 238769 232902 226842 220235 213849 208093 202331 196180 190023
56410A90023o238p194q332q358p278n807l719n54K854N258O693P792Q226P492
$$ 190023 183785 176591 168259 159901 152623 146816 143097 142543 145397 150655 157348 165140 173366 180858
56396A80858O414O218O729O909O486N755M695L507L064L565L883L396L123L731
$$ 180858 187272 193490 200219 207128 213614 219369 224064 227571 230635 234200 238083 241479 244602 248333
56382B48333M062L226K499L194M256M028L004K611K580J890J166J676K824L030
$$ 248333 252395 255621 258120 261314 265570 269598 272602 275213 277793 279683 280849 282525 285349 288379
56368B88379K452K504L285L611L193K706K160J058j92p20o81p88r63p69m04l3
$$ 288379 290831 293335 296620 300231 303424 306130 308290 309348 309156 308436 307755 306967 306004 305235 304831 304798
56352C04798Q75K248K734J791J006J692K663K298J256J109J679J919K124L017
$$ 304798 305673 307921 310655 312446 313452 315144 317807 320105 321361 322470 324149 326068 328192 331209
56338C31209L934M070M256N352O240N735N019N723P025P266P009P724Q780Q803
$$ 331209 335143 339213 343469 348821 355061 360796 365815 371538 378563 385829 392838 400562 409342 418145
56324D18145Q674J0031J1719J1174Q683O937O762O494N428M711M700M253K946
$$ 418145 426819 436850 448569 459743 468426 475363 482125 488619 494047 498758 503458 507711 510657
56311E10657J623O27m63j510k169l024m380m737k808j81N39m85r70k22N59J033
$$ 510657 512280 512907 512444 510934 508765 505741 501361 496624 493816 493635 494174 493689 492719 492497 493056 494089
56295D94089J999L297M047M609N785O743O291N513O406Q526R814J0083J0904J2557
$$ 494089 496088 499385 503432 508041 513826 520569 526860 532373 538779 547305 557119 567202 578106 590663
56281E90663J4040J5438J7473J9333J9939K0633K3449K7419K9947L1193L3607
$$ 590663 604703 620141 637614 656947 676886 697519 720968 748387 778334 809527 843134
56270H43134L7554M1124M4097M8386N4390O0516O6587P4306Q3902R3687J03310
$$ 843134 880688 921812 965909 1014295 1068685 1129201 1195788 1270094 1353996 1447683 1550993
56259A550993J14245J26541J38330J49032J60025J71537J81761J89600J95496
$$ 1550993 1665238 1791779 1930109 2079141 2239166 2410703 2592464 2782064 2977560
56250B977560J99098J98744J93705J84333J70031J49729J24570R7303O9050L9411
$$ 2977560 3176658 3375402 3569107 3753440 3923471 4073200 4197770 4295073 4364123 4403534
56240D403534R659j7222l9847n8918p4537q5982r3986j00161j04174j04578j02292
$$ 4403534 4413193 4395971 4356124 4297206 4222669 4136687 4042701 3942540 3838366 3733788 3631496
56229C631496j00108r8929r7675r6628r7326r9326j00669j01635j04342j08618
$$ 3631496 3531388 3432459 3334784 3238156 3140830 3041504 2940835 2839200 2734858 2626240
56219B626240j11852j13114j13721j13683j11385j07158j03312j00165r5663q9293
$$ 2626240 2514388 2401274 2287553 2173870 2062485 1955327 1852015 1751850 1656187 1566894
56209A566894q2859p7082p1051o5134o0654n6643n0872m4159l9536l7043l3808
$$ 1566894 1484035 1406953 1335902 1270768 1210114 1153471 1102599 1058440 1018904 981861 948053
56198I48053k9391k6368k5090k2714j8411j4839j3334j2028r905q359p624n963
$$ 948053 918662 892294 867204 844490 826079 811240 797906 785878 775973 767614 759990 754027
56186G54027l498k466k758j609J286L056L045M060O890Q625Q062P846R339J0191
$$ 754027 750529 748063 745305 743696 744982 748038 751083 755143 762033 770658 778720 786566 795905 806096
56172H06096R016P844P761O661L616R79J2j318l960n607n101m694n624n706l649
$$ 806096 815112 822956 830717 837378 840994 841973 841985 840667 836707 831100 825999 821305 815681 809975 806326
56157H06326j656j331j077K27J036Q35J872M956P536Q176Q911J1067J2935J3632
$$ 806326 804670 803339 802262 802489 803525 804360 806232 811188 818724 826900 835811 846878 859813 873445
56143H73445J5109J8251K1233K3770K8513L6171M3863N0518N9234P1940Q6278
$$ 873445 888554 906805 928038 951808 980321 1016492 1060355 1110873 1170107 1242047 1328325
56132A328325J00088J14182J28254J38809J43717J44191J40217J29267J12201
$$ 1328325 1428413 1542595 1670849 1809658 1953375 2097566 2237783 2367050 2479251
56123B479251R5232Q2970P4175O6684O0999N6113M7547L3318J7227L142r146j9808
$$ 2479251 2574483 2657453 2731628 2798312 2859311 2915424 2962971 2996289 3013516 3016658 3007512 2987704
56111B987704k6463k9212l2915m1016n2075o4961q1416j00174j14730j21128j22386
$$ 2987704 2961241 2932029 2899114 2858098 2806023 2741062 2659646 2559472 2444742 2323614 2201228
56100B201228j21642j17048j07437r6750q8132p9369o8662n9148n3101m7523m0119
$$ 2201228 2079586 1962538 1855101 1758351 1670219 1590850 1522188 1463040 1409939 1362416 1322297
56089A322297l3834l0831k7912k2715j8418j7232j5468j0342n557m593m447j702
$$ 1322297 1288463 1257632 1229720 1207005 1188587 1171355 1155887 1145545 1139988 1135395 1130948 1129246
56077A129246J158J260J208L615N616M695M127O742R189Q355P401R411J1240R930
$$ 1129246 1130404 1131664 1132872 1136487 1142103 1146798 1150925 1157667 1166856 1175211 1182612 1192023 1203263 1213193
56063A213193Q904J1352J3803J2870J1957J4425J6748J5415J4009J6142J8125
$$ 1213193 1222097 1233449 1247252 1260122 1272079 1286504 1303252 1318667 1332676 1348818 1366943
56052A366943J6202J4202J6185J8346J6509J4744J7852K1923K1337J8788J9459
$$ 1366943 1383145 1397347 1413532 1431878 1448387 1463131 1480983 1502906 1524243 1543031 1562490
56041A562490K1481K1119K1070K4614K7838K6795K5921L0253L5982L7924L9273
$$ 1562490 1583971 1605090 1626160 1650774 1678612 1705407 1731328 1761581 1797563 1835487 1874760
56030A874760M4305M8813M7976M6438M9986N4610N4492N3376N6795O0673N9275
$$ 1874760 1919065 1967878 2015854 2062292 2112278 2166888 2221380 2274756 2331551 2392224 2451499
56019B451499N6783N9173O2314O0353N7868O1044O5051O3341O1135O5770P2286
$$ 2451499 2508282 2567455 2629769 2690122 2747990 2809034 2874085 2937426 2998561 3064331 3136617
56008C136617P2955P2501P8712Q6728Q8430Q8831R6660J07221J11605J14252J23833
$$ 3136617 3209572 3282073 3360785 3447513 3535943 3624774 3721434 3828655 3940260 4054512 4178345
55997D178345J35528J40606J44631J57103J72098J79068J83659J97026K13909
$$ 4178345 4313873 4454479 4599110 4756213 4928311 5107379 5291038 5488064 5701973
55988E701973K23074K30020K46384K66487K78378K88569L10676L39329L61584
$$ 5701973 5925047 6155067 6401451 6667938 6946316 7234885 7545561 7884890 8246474
55979H246474L83980M20410M63678M98663N33048N83801O44392O98837P56609
$$ 8246474 8630454 9050864 9514542 10013205 10546253 11130054 11774446 12473283 13229892
55970A3229892Q37855R36153J034391J144978J292572J470452J660127J880552
$$ 13229892 14067747 15003900 16038291 17183269 18475841 19946293 21606420 23486972
55962B3486972K167927K521867K928056L419257M051091M833696N759009O879202
$$ 23486972 25654899 28176766 31104822 34524079 38575170 43408866 49167875 56047077
55954E6047077Q279353J0000750J2097354J4736713J8089103K2109253K6586960
$$ 56047077 64326430 74327180 86424534 101161247 119250350 141359603 167946563
55947A67946563L1375282L6201600M0001486M0707176L6234906K6004101J1567186
$$ 167946563 199321845 235523445 275524931 316232107 352467013 378471114 390038300
55940C90038300m141341j8127244k8304261l3895672l5392422l4081921l1314290
$$ 390038300 385896959 367769715 339465454 305569782 270177360 236095439 204781149
55933B04781149k7988103k4547964k1234012j8198875j5489682j3090550j1008613
$$ 204781149 176793046 152245082 131011070 112812195 97322513 84231963 73223350
55926G3223350r263558p822268o615861n607484m787164m118685l549341l060886
$$ 73223350 63959792 56137524 49521663 43914179 39127015 35008330 31458989 28398103
55918B8398103k661079k335020k050204j799586j596012j431297j280599j140701
$$ 28398103 25737024 23402004 21351800 19552214 17956202 16524905 15244306 14103605
55910A4103605j026588r35409q48518p64367o96517o43049n88571n32992m89201
$$ 14103605 13077017 12141608 11293090 10528723 9832206 9189157 8600586 8067594 7578393
55901G578393m55592m18428l78340l47944l25963k99324k68579k46561k33543
$$ 7578393 7122801 6704373 6326033 5978089 5652126 5352802 5084223 4837662 4604119
55892D604119k17418j97082j82969j75306j63827j48420j39187j36224j29334
$$ 4604119 4386701 4189619 4006650 3831344 3667517 3519097 3379910 3243686 3114352
55883C114352j17666j10496j08595j03354r4342q9769q9420q4619p5379p0655
$$ 3114352 2996686 2886190 2777595 2674241 2579899 2490130 2400710 2316091 2240712 2170057
55873B170057p1209o8661o1974n8615n8794n4471m5224l9751m0154l9304l5160
$$ 2170057 2098848 2030187 1968213 1909598 1850804 1796333 1751109 1711358 1671204 1631900 1596740
55862A596740l3544l5185l3732k8365k5367k5601k2916j6347j1711r839n278K226
$$ 1596740 1563196 1528011 1494279 1465914 1440547 1414946 1392030 1375683 1363972 1354133 1348855 1351081
55850A351081O493O164N655M452k795j4664k3197k6724l1011l6820l8130l4214
$$ 1351081 1357574 1363738 1369393 1373845 1371050 1356386 1333189 1306465 1275454 1238634 1200504 1166290
55838A166290l1741l2948l2803k9886k9104l1366l1236k7314k4806k5403k4414
$$ 1166290 1134549 1101601 1068798 1038912 1009808 978442 947206 919892 895086 869683 845269
55827H45269k0268j7326j6972j5346j2020j1594j4459j5250j2699j1860j4207
$$ 845269 825001 807675 790703 775357 763337 751743 737284 722034 709335 697475 683268
55816F83268j4733j1492r039r569r263o281m120m224l241l40N99j309j874J24
$$ 683268 668535 657043 648004 638435 629172 622891 618771 614547 611306 610966 611565 610256 608382 608506
55802F08506N60j935l363k365l010o746r319q693q630j1263j3243j2474j1739
$$ 608506 609066 607131 603768 601403 598393 591647 582328 573635 565005 553742 540499 528025 516286
55789E16286j2573j2150r394p685q528q802p000n960o793o427l821k265k932k552
$$ 516286 503713 491563 482169 474484 465956 457154 450154 444194 437401 430974 427153 424888 421956 419404
55775D19404j52M13k622n808p143r293j3292j5450j3895j2012j2025j1235p972
$$ 419404 419252 419665 417043 411235 404092 394799 381507 366057 352162 340150 328125 316890 308918
55762C08918n329n335n137k733r59k082l596l109k376l055l331k243k391m864
$$ 308918 303589 298254 293117 290384 289425 287343 283747 280638 278262 275207 271876 269633 267242 262378
55748B62378o304m536k429k736l696l240k981m429n529m574l461l762l618j809
$$ 262378 256074 251538 249109 246373 242677 239437 236456 232027 226498 221924 218463 214701 211083 209274
55734B09274o77j760k538r06J129J450J475K543K607N2k897l970m499n970o685
$$ 209274 208597 206837 204299 203393 204522 205972 207447 209990 212597 212649 209752 205782 201283 195313 188628
55719A88628n135l287l141l299k142j148j789k388j210L85Q22J309K975M175L680
$$ 188628 183493 180206 177065 173766 171624 170476 168687 166299 165089 165474 166296 167605 170580 174755 178435
55704A78435L439N169P074O942N699N041M321K626J173R79P22n78j520j150r59
$$ 178435 181874 187043 194117 201059 206758 211799 216120 218746 219919 220898 221620 221042 219522 218372 217413
55689B17413j775j953r16j116l833o384o287m959m402l601j251J023J448J257
$$ 217413 215638 213685 212769 211653 207820 201436 195149 190190 185788 182187 180936 181959 183407 184664
55675A84664K002K427J032q48j522j881l016l506k006p8M49M71J265J781J037
$$ 184664 186666 189093 190125 189277 187755 185874 182858 179352 177346 177268 177717 178188 179453 181234 182271
55660A82271O28J920L245K771J749J995K530J652J61l53l66r19j435j419k125
$$ 182271 182899 184819 188064 190835 192584 194579 197109 198761 198922 198569 198203 197284 195849 194430 192305
55645A92305m105n445m803l761l853l996l299l447n440o923n855m126m322n456
$$ 192305 188200 182755 177952 174191 170338 166342 163043 159596 154156 147233 141378 137252 132930 127474
55631A27474n251m229m086m222l258k046j969k114j241n91j646l025k692j439
$$ 127474 122223 117994 113908 109686 106428 104382 102413 100299 99058 98467 96821 93796 91104 89665
55617H9665j115j287o43R3l59j182j159j139k080k645j600n36j169k106j401j76
$$ 89665 88550 87263 86620 86713 86354 85172 84013 82874 80794 78149 76549 76013 74844 72738 71337 71161
55601G1161m18j203o59L24j46j214r48q1m85j385q52L33L9j121q04Q52J610J055
$$ 71161 70743 69540 68881 69205 69059 67845 66897 66816 66331 64946 64094 64427 64466 63345 62541 63393 65003 66058
55583F6058P63J140J218J033J301J373K87r67q83j58k58m73O41K057J692L3p31
$$ 66058 66821 67961 69179 70212 71513 72886 73173 72206 71323 71165 70907 70434 71075 73132 74824 74857 74126
55566G4126l71l20n65N3J140J335R64J196J299k32k471l039j865j027j216j195
$$ 74126 73755 73435 72870 72923 74063 75398 76362 77558 78857 78625 76154 73115 71250 70223 69007 67812
55550F7812n43k58p41j468k261k902k246P3K076J861N73M69J301J253L45pK00
$$ 67812 67269 67011 66270 64802 62541 59639 57393 57466 59542 61403 61976 62445 63746 64999 65344 65337 65537
55533F5537O7J67J467K832K570J484J382J644N29j125j102J19J24j075j240j91
$$ 65537 65604 65771 67238 70070 72640 74124 75506 77150 77679 76554 75452 75571 75695 74620 73380 73189
55517G3189r8j405k066j314p38j141j441j238j540k337k261j210p15j171j300
$$ 73189 73091 71686 69620 68306 67568 66427 64986 63748 62208 59871 57610 56400 55685 54514 53214
55502E3214p14n20r21o80N40J593J999K466L078L084K773L262M357M760M504M957
$$ 53214 52500 51980 51059 50379 50919 52512 54511 56977 60055 63139 65912 69174 73531 78291 82795 87752
55486H7752O372P564P960P861O918M557J691l47k186n174q357r478q708q266q531
$$ 87752 94124 101688 109648 117509 124427 128984 130675 130328 128142 122968 114611 105133 96425 88159 79628
55471G9628p764n795m665m988m948l652k497k296j971j087r70k089k842k182j191
$$ 79628 71864 66069 61404 56416 51468 47816 45319 43023 41052 39965 38995 36906 34064 31882 30691
55456C0691q96o75M6N32K95J19M62N68m4p02r55j198j477j226n97m17n23K8R81
$$ 30691 29795 29120 29166 29698 29993 30112 30574 31142 31098 30396 29441 28243 26766 25540 24943 24526 24003 24031 25012
55437B5012J047K63Q1Q52J369J217J360J915J675M40l99l07m30j287j786j380
$$ 25012 26059 26322 26403 27255 28624 29841 31201 33116 34791 35231 34832 34525 34095 32808 31022 29642
55421B9642j053j273j073j00M08k38r25o33J16N98J060J600J502O31l8K4K02K32
$$ 29642 28589 27316 26243 26143 26551 26313 25388 24755 24871 25469 26529 28129 29631 30262 30224 30248 30450 30682
55403C0682P18J573J595L95q16j080q07m92J24R06R18q0j162j739k110k152j199
$$ 30682 31400 32973 34568 34963 34147 33067 32260 31768 31892 32798 33716 33636 32474 30735 28625 26473 25274
55386B5274L25Q79P9o83m85k7NK7K64J11m95o76k60k30q92j218p72n39j043j271
$$ 25274 25599 26478 26557 25874 25389 25362 25367 25394 25658 25769 25274 24598 24338 24108 23216 21998 21226 20687 19644 18373
55366A8373m16P71J282J256J251J297J314J369J107Q8j085j263n54j56l15j51
$$ 18373 17957 18728 20010 21266 22517 23814 25128 26497 27604 27692 26607 25344 24790 24634 24319 24168
55350B4168M47N98L02N68J364J449P01M19Q80P12n54j515j333j025j372j536q43
$$ 24168 24615 25213 25515 26083 27447 28896 29597 30016 30896 31608 31054 29539 28206 27181 25809 24273 23430
55333B3430k3L00O00R97O11n90j181m80M23P28J142J984K088Q59m26o52n15q29
$$ 23430 23407 23707 24307 25304 25915 25325 24144 23664 24087 24815 25957 27941 30029 30888 30462 29810 29295 28466
55315B8466r01m2Q74Q08J54k96o33r44n55O02J254O37k20j67M21P17P81P82K06
$$ 28466 27565 27523 28397 29205 29359 29063 28430 27486 26931 27533 28787 29424 29204 29037 29458 30175 30956 31738 31944
55296C1944r62j635j195m47n4N25J603K296K006J452J178N96m77r96m98r8m69
$$ 31944 30982 29347 28152 27705 27651 28176 29779 32075 34081 35533 36711 37307 36830 35834 35336 35238 34769
55279C4769o39K7M45j81p39k30L69M3j66R50K194J590m51j702j257k43J94q0p43
$$ 34769 34130 34157 34602 34421 33682 33452 33821 33864 33698 34648 36842 38432 37981 36279 35022 34779 34973 34893 34150
55260C4150j286j072j73L58j06q27r39o43l39K40J041J077l0j080j018m49l21
$$ 34150 32864 31792 31619 31977 31871 31044 30105 29462 29123 29363 30404 31481 31451 30371 29353 28904 28583
55243B8583l02K23Q05Q72R04J239R98m02j813j886j029l07L70J448K174J643N47
$$ 28583 28281 28504 29309 30181 31085 32324 33322 32920 31107 29221 28192 27885 28255 29703 31877 33520 34067
55226C4067J29J84l16j208j413p37N7N77R52J050P35L73J87k51r09o75R98K766
$$ 34067 34196 34380 34064 32856 31443 30706 30763 31340 32292 33342 34077 34450 34637 34386 33477 32802 33800 36566
55208C6566L026K021J061N27K4k67J38Q90J200R55M25m41j532k106j823j439j574
$$ 36566 39592 41613 42674 43201 43225 42958 43096 43986 45186 46141 46566 46125 44593 42487 40664 39225 37651
55191C7651j661j064k69P8K80O62P08J49j70K96P26M15Q3M16O75J08n48m84l99
$$ 37651 35990 34926 34657 34735 35015 35677 36385 36534 36364 36660 37386 37801 37884 38300 38975 39083 38535 38051 37652
55172C7652j074j669j152k19Mn5M57R17M31k78j38J66n08j417j148k32k39j015
$$ 37652 36578 34909 33757 33538 33542 33487 33944 34861 35292 35014 34876 35042 34534 33117 31969 31737 31498 30483
55154C0483j203q26r81j443j037l7J88k98j77O35R13N37N92J106R45J67J33J019
$$ 30483 29280 28454 27473 26030 24993 24956 25144 24846 24669 25304 26217 26754 27346 28452 29397 29564 29697 30716
55136C0716J356N11l99n55m55l56L30J495J939J309P90J173J697J578J271J410
$$ 30716 32072 32583 32184 31629 31174 30818 31148 32643 34582 35891 36681 37854 39551 41129 42400 43810
55120D3810J760J905J970K007J634Q78M27N74P31L79k82r30j544j982j938j485
$$ 43810 45570 47475 49445 51452 53086 53964 54391 54965 55696 56075 55793 54863 53319 51337 49399 47914
55104D7914j016m95M10J504K178K365K502K621K334J694J151O96k8p65p54Q0R53
$$ 47914 46898 46403 46813 48317 50495 52860 55362 57983 60317 62011 63162 63858 63830 63065 62311 62391 63344
55087F3344J280J183R24O04L96L89K89j47n47l93J88O80Q53O45o6r33j091l43
$$ 63344 64624 65807 66731 67335 67731 68120 68409 68262 67715 67322 67510 68190 69043 69688 69622 68689 67598 67255
55069F7255K87K8m87m55k84n19n07M58J453J201K50J31Q31R95L23j07J39K97j1
$$ 67255 67542 67570 67083 66628 66344 65825 65318 65776 67229 68430 68680 68811 69642 70637 70960 70853 70992 71289 71278
55050G1278l11m80r68j630j681j036m56l15l15l16l90j70O40J369J140K79k86
$$ 71278 70967 70487 69519 67889 66208 65172 64716 64401 64086 63770 63380 63210 63850 65219 66359 66638 66352
55033F6352n67j113j531j006L3M49K95N24J038Q50O2j64L43N42J38m0K19J34m26
$$ 66352 65785 64672 63141 62135 62168 62617 62912 63436 64474 65324 65386 65222 65565 66107 66245 66205 66424 66558 66132
55014F6132o36m02o11j397j705j082l07J10N09Q46M39n15q32k27J67k93q20p46
$$ 66132 65496 65094 64483 63086 61381 60299 59992 60102 60611 61457 61896 61381 60549 60322 60489 60196 59376 58630
54996E8630n62o77n78M0N54N31M28N34L59k85o16n3R09J506J567J148K63o66r74
$$ 58630 58068 57391 56813 56853 57407 57938 58366 58900 59259 58974 58358 58305 59214 60720 62287 63435 63698 63032 62058
54977F2058o69l71k01K34P40O41J44K99J261J893J555J090J424K300K907K911
$$ 62058 61389 61018 60817 61051 61791 62432 62576 62875 64136 66029 67584 68674 70098 72398 75305 78216
54961G8216K458J945K027L128M778O191P366Q719R923J0302J0140J0264J0582
$$ 78216 80674 82619 84646 87774 92552 98743 106109 114828 124751 135053 145193 155457 166039
54948A66039J0379R859R696R243P001L012r95m015o630r144j0867j1635j2220
$$ 166039 176418 186277 195973 205216 212217 215229 214234 210219 203589 194445 183578 171943 159723
54935A59723j2684j2041j0164q305p161o084m816m168m235l822k525j625j924
$$ 159723 147039 134998 124834 116529 109368 103284 98468 94300 90065 86243 83718 82093 80169
54922H0169k284j499j07Q12J307J919K544L000L592M309M594M609N447P247Q594
$$ 80169 77885 76386 76279 77091 78398 80317 82861 85861 89453 93762 98356 102965 108412 115659 124253
54907A24253Q650Q514R341J0491J0650R578P642M750R41k954o242r090j1515j2741
$$ 124253 132903 141417 150758 161249 171899 181477 189119 193869 194810 191856 185614 176524 165009 152268
54893A52268j2399j1271j0063q522o577n027m232l454k418k142l126m077l720
$$ 152268 139869 128598 118535 110013 103436 98409 94177 90723 88305 86163 83037 78960 75240
54880G5240k614j911j492p35nL9k22m2L59L85J60N4j57n48m80K68O40k52j706
$$ 75240 72626 70715 69223 68488 68483 68522 68300 68258 68617 69002 69162 69216 69059 68511 68031 68299 68939 68687 66981
54861F6981k484k455k145j666j080q80j039o03O50J329M36r07j115n05l71o78
$$ 66981 64497 62042 59897 58231 57151 56271 55232 54629 55279 56608 57044 56137 55022 54517 54146 53468
54845E3468m31L00M32l71j361j874j675o31Q46J570R66O3M6N22M70Q4J91N15J43
$$ 53468 53037 53337 53769 53398 52037 50163 48488 47857 48703 50273 51239 51302 51348 51870 52340 52424 52615 53130 53273
54826E3273o87q46j70M51O75J033J664J986J695J172Q09Q01J337K253K783K495
$$ 53273 52586 51740 51570 52021 52696 53729 55393 57379 59074 60246 61055 61856 63193 65446 68229 70724
54810G0724K086K429L252L669L584L587L810L917L919M163M767N724P101Q524
$$ 70724 72810 75239 78491 82160 85744 89331 93141 97058 100977 105140 109907 115631 122732 131256
54796A31256R206R217R822J1538J2813J1894R155O252L685Q30k242m654o231p548
$$ 131256 140462 149679 159501 171039 183852 195746 204901 211153 214838 215668 213426 208772 202541 194993
54782A94993q559q663q014p457p104o357n297m704m554l870k351r59n02n66l73
$$ 194993 186434 177771 169757 162300 155196 148839 143542 138838 134284 130414 128063 127104 126602 126036 125663
54767A25663J29M63M04J83K23Q13J891L219M804O766Q627R550R638J0172J1913
$$ 125663 125792 126255 126659 126842 127065 127878 129769 132988 137792 144558 153185 162735 172373 182545 194458
54752A94458J3988J5230J5770J6311J6673J6142J4638J2356Q933M224o12m144
$$ 194458 208446 223676 239446 255757 272430 288572 303210 315566 324499 328723 328111 323967
54740C23967o410q527j0846j2786j4076j4901j5090j4361j3229j2490j1979j1023
$$ 323967 317557 309030 298184 285398 271322 256421 241331 226970 213741 201251 189272 178249
54728A78249r798r002q488p485o069n071m562l844k882k426k567k445j704j000
$$ 178249 168451 159449 150961 143476 137407 132336 127774 123930 121048 118622 116055 113610 111906 110906
54714A10906p83o66l63k56n88r32r25p83q23r64r90p86k23P34J720K215K107J610
$$ 110906 110123 109457 109094 108838 108250 107318 106393 105610 104787 103823 102833 102047 101824 102558 104278 106493 108600 110210
54696A10210Q61L4m45l17O2J74q3n59j127j366p38L94Q07J74k10O37J731J692
$$ 110210 111071 111105 110660 110343 110405 110579 110496 109937 108810 107444 106706 107100 107907 108081 107871 108508 110239 111931
54678A11931R94J078J974K494K300K099K053J723J430K003L127L589L273L422
$$ 111931 112925 114003 115977 118471 120771 122870 124923 126646 128076 130079 133206 136795 140068 143490
54664A43490M611N903O302N850M974L988L383L526L833L364K305J704J793J806
$$ 143490 148101 154004 160306 166156 171130 175118 178501 182027 185860 189224 191529 193233 195026 196832
54650A96832J582J878K887L839M397N088O046O631O817P669R756J2276J4276J5748
$$ 196832 198414 200292 203179 207018 211415 216503 222549 229180 235997 243666 253422 265698 279974 295722
54636B95722J6928J7484J7034J5656J3388R953N408L01n051j0627j5775j9258
$$ 295722 312650 330134 347168 362824 376212 386165 391573 391874 386823 376196 360421 341163
54624C41163k0569k0361j9308j7524j5364j3629j2512j1281r592q086p225o481
$$ 341163 320594 300233 280925 263401 248037 234408 221896 210615 201023 192937 185712 179231
54612A79231n301l989k909j666J36J927K756K435J550O62q4q54j894l118l878
$$ 179231 173930 169941 167032 165366 165502 167429 170185 172620 174170 174832 174748 173894 172000 168882 165004
54597A65004l668k982k819l311l670l602l752m456n075n022m649m500m412l940
$$ 165004 161336 158354 155535 152224 148554 144952 141200 136744 131669 126647 121998 117498 113086 109146
54583A09146l136k337j656j132r22r92j013r35j133j770k379k446j997j337o70
$$ 109146 106010 103673 102017 100885 99963 98971 97958 97023 95890 94120 91741 89295 87298 85961 85291
54568H5291j68o8m20r79j396j360o62M45J189J122P95R78J441J311M62l30n95
$$ 85291 85123 85055 84635 83656 82260 80900 80238 80683 81872 82994 83789 84767 86208 87519 87981 87651 87056
54551H7056o24o60m92p8K93O18J232K087K628K634K503K583K726K656K305J799
$$ 87056 86432 85772 85280 85202 85495 86113 87345 89432 92060 94694 97197 99780 102506 105162 107467 109266
54535A09266J598K327L935N312N623N637O725Q839J0558J0926J0118Q438O022
$$ 109266 110864 113191 117126 122438 128061 133698 140423 149262 159820 170746 180864 189302 195324
54522A95324L533J773M41j508m095o179p253p958q579q487p616o994p113p083
$$ 195324 198857 200630 201071 199563 195468 189289 182036 174078 165499 157012 149396 142402 135289 128206
54508A28206o215n276n195n478m962l540k169j631j948k659l138k929k125j180
$$ 128206 121991 116715 111520 106042 101080 97540 95371 93740 91792 89133 85995 83066 80941 79761
54494G9761l30L87O53K04m79o48m21n13q98q48l34n3l3M68J359J471M71l48J05
$$ 79761 79431 79818 80471 80675 80196 79548 79127 78614 77716 76868 76534 76481 76448 76916 78275 79746 80217 79869 79974
54475G9974J321K236K606K524J761M35n07l40N11J213J442J164L09p67j353j379
$$ 79974 81295 83531 86137 88661 90422 90857 90350 90010 90521 91734 93176 94340 94649 93882 92529 91150
54459I1150j497j821j619o49K22L14j6l30p33j119r53m03m38j142j288l72L35
$$ 91150 89653 87832 86213 85564 85786 86100 86084 85754 85021 83902 82949 82546 82108 80966 79678 79306 79641
54442G9641k33j199j225m54K09P03J257J313M00o24o48m0Q4k72k12L44N41K6p18
$$ 79641 79408 78209 76984 76530 76739 77442 78699 80012 80412 79788 79140 79100 79184 78912 78700 79044 79585 79611 78893
54423G8893j263j539j348n31N04J108J123P83K48j94kQ27J447J283Q94J049J544
$$ 78893 77630 76091 74743 74212 74716 75824 76947 77730 77978 77784 77782 78609 80056 81339 82233 83282 84826
54406H4826J757J742J912K203K432K909L773M345M071L574L799M604N112N081
$$ 84826 86583 88325 90237 92440 94872 97781 101554 105899 109970 113544 117343 121947 127059 132140
54392A32140M885M543L822L020K660K623K360J803J174K96j109k590l331l218
$$ 132140 137025 141568 145390 148410 151070 153693 156053 157856 159030 159326 158217 155627 152296 149078
54378A49078k841k635k594k690k928l167l314l416l300k665j826j662k282k622
$$ 149078 146237 143602 141008 138318 135390 132223 128909 125493 122193 119528 117702 116040 113758 111136
54364A11136j970j015n68j90P78J654J192m83j934k150j277jR77J138P72R38K073
$$ 111136 109166 108151 107583 107393 108171 109825 111017 110534 108600 106450 105173 105172 106149 107287 108059 108997 111070
54347A11070L167L159K508K315K633K836L055L835M719M746M087L865M282M309
$$ 111070 114237 117396 119904 122219 124852 127688 130743 134578 139297 144043 148130 151995 156277 160586
54333A60586L357K008J025N51M19K48p59k986n326o057m989l743l673m490n189
$$ 160586 163943 165951 166976 167527 167946 168194 167435 164449 159123 153066 148077 144334 140661 136171 130982
54318A30982n347n045m384l607l204l384l757l799l416k914k690k943l498l899
$$ 130982 125635 120590 116206 112599 109395 106011 102254 98455 95039 92125 89435 86492 82994 79095
54304G9095l833l308k363j073N5L12k20o02l33k3k14m42k14j0l53o58j91M91L20
$$ 79095 75262 71954 69591 68518 68573 68885 68665 68063 67730 67707 67493 67051 66837 66827 66474 65816 65625 66116 66436
54285F6436m97q30m46j96m81p50n43l0M48N82m0j250j844q58Q47J513Q26J47L91
$$ 66436 65939 65109 64663 64467 63986 63236 62693 62663 63111 63693 63653 62403 60559 59701 60548 62061 62887 63034 63425
54266F3425R67J033O54L49L45O16R97J081O71K68M56R31Q84K35l76o29o85m85
$$ 63425 64392 65425 66079 66428 66773 67389 68386 69467 70138 70406 70862 71793 72677 72912 72536 71907 71222 70737
54248G0737J37P98R23O80O27O16J67l73k12M12M29k90p30m03M3K10N93J340J626
$$ 70737 70874 71672 72595 73275 73902 74518 74685 74312 74100 74512 74941 74651 73921 73518 73561 73771 74364 75704 77330
54229G7330Q95k66j096j651k178k363j901j190q50r23r94o96Q1J042J439P60m14
$$ 77330 78225 77959 76863 75212 73034 70671 68770 67580 66730 65807 64813 64117 64198 65240 66679 67439 67025
54212F7025q91l66L07M04J57N6J09J22M7j98o88j057p48Q1N87L90Q6K81Q03J093
$$ 67025 66134 65768 66075 66479 66636 66692 66801 66923 66970 66772 66084 65027 64279 64360 64947 65337 65423 65704 66507 67600
54192F7600R23L70l52q85r20n70k03Q5L93N55L37QL1K46R6m02o98o43o04n81j22
$$ 67600 68523 68893 68541 67656 66736 66166 65963 66048 66441 66996 67333 67341 67372 67618 67714 67312 66614 65971 65367 64786 64664
54171F4664P80J489J586J260P33L6n74p12m48j80L0L45N23K95J57O87J212M74
$$ 64664 65444 66933 68519 69779 70512 70548 69974 69262 68814 68634 68664 69009 69532 69827 69984 70671 71883 72357
54153G2357j310k427k004r98l97J60J144J811J273M7o37n14l22m85p33q71j103
$$ 72357 71047 68620 66616 65618 65221 65381 66525 68336 69609 69656 69019 68505 68183 67698 66965 66094 64991
54136F4991j451j451o20Q85K229K545J747N85k21o50r36r86p24n69q10r03k68
$$ 64991 63540 62089 61469 62354 64583 67128 68875 69460 69239 68589 67653 66667 65943 65374 64564 63661 63393
54119F3393N28M37l80p49k60L16M47M52N05K52k02q6O76J052L59p03j133q56l27
$$ 63393 63921 64358 63978 63229 62969 63285 63732 64184 64689 64941 64739 64653 65329 66381 66740 66037 64904 64048 63721
54100F3721K41O34L52o91j736j997j502q27m25m84q32q45p9Q73R50J38n16m57
$$ 63721 63962 64596 64948 64257 62521 60524 59022 58195 57770 57286 56454 55609 55530 56403 57353 57491 56975 56518
54082E6518k00n5M32J281J555P56l01p77r88j464j731j133p6N95R35J480J984
$$ 56518 56318 56263 56695 57976 59531 60287 59986 59209 58221 56757 55026 53893 53817 54412 55347 56827 58811
54065E8811J695P28J02L36Q03P36K58J37P91J750K130J577O75K73N76J113J424
$$ 58811 60506 61234 61336 61672 62475 63211 63469 63606 64397 66147 68277 69854 70529 70802 71378 72491 73915
54048G3915J400J095P09O14Q80J012O94M14P28J199J022L86J93O58J310K129L475
$$ 73915 75315 76410 77119 77733 78613 79625 80319 80733 81461 82660 83682 84068 84261 84919 86229 88358 91833
54031I1833M881N391N094N018N393N468N193N390N955N699M490L822M361M721
$$ 91833 96714 102105 107199 112217 117610 123078 128271 133661 139616 145315 149805 153627 157988 162709
54017A62709L719K245J648J685J469J277J775K443K235J176R2o96j259j404j142
$$ 162709 166428 168673 170321 172006 173475 174752 176527 178970 181205 182381 182473 181777 180518 179114 177972
54002A77972j198j962k703k772k733l219l548k857j804j647k236k386j863j488
$$ 177972 176774 174812 172109 169337 166604 163385 159837 156980 155176 153529 151293 148907 147044 145556
53988A45556j521j384r69q97j395j956k202k199j935j296o68p76j775k952l353
$$ 145556 144035 142651 141682 140785 139390 137434 135232 133033 131098 129802 129134 128358 126583 123631 120278
53973A20278k481p16O76N15r62k254k404j880j331o00L80Q97O31M57R68J287O16
$$ 120278 117797 117081 117757 118272 117310 115056 112652 110772 109441 108841 109221 110118 110749 111206 112174 113461 114077
53956A14077q5M73J668J816P11l08m67j15N33J589K539K619K162K240L017L735
$$ 114077 113992 114465 116133 117949 118660 118352 117885 117770 118303 119892 122431 125050 127212 129452 132469 136204
53940A36204M178M802N491N621N359N476N863N635M799M308M273L615J880oj182
$$ 136204 140382 145184 150675 156296 161655 167131 172994 178629 183428 187736 192009 195624 197504 197498 196316
53925A96316j782k000j548o56l33r33j447r21L57J662K850L844M024L072J882
$$ 196316 194534 192534 190986 190330 189997 189064 187617 186696 187053 188715 191565 195409 199433 202505 204387
53910B04387J752L017M902O399O894O408N582N138N038M652L786K929K300J499
$$ 204387 206139 209156 214058 220457 227351 233759 239341 244479 249517 254169 257955 260884 263184 264683
53896B64683L99l28j59M07M67k44j399k660l698m064l651l057l036l723m657n395
$$ 264683 265082 264754 264595 265002 265469 265225 263826 261166 257468 253404 249753 246696 243660 239937 235280 229885
53880B29885n757n729n484n370n569n836n766n283m720m473m632m914m952m641
$$ 229885 224128 218399 212915 207545 201976 196140 190374 185091 180371 175898 171266 166352 161400 156759
53866A56759m167l692l205k766k607k758k882k741k536k503k477k270k146k399
$$ 156759 152592 148900 145695 142929 140322 137564 134682 131941 129405 126902 124425 122155 120009 117610
53852A17610k675k349j503r21j067j535j623j104l68nl05r65j394j340j102r82
$$ 117610 114935 112586 111083 110162 109095 107560 105937 104833 104465 104460 104155 103190 101796 100456 99354 98372
53836I8372r32q56q44q38m97K41Q56Q56L17l98r55q71J93J536J700L21j098j082
$$ 98372 97440 96584 95740 94902 94405 94646 95502 96358 96675 96277 95322 94451 94644 96180 97880 98201 97103 96021
53818I6021j09L29j28n93m38K37J210K124K218J217K08M24J437J802J195O31O52
$$ 96021 95912 96241 96113 95520 95082 95319 96529 98653 100871 102088 102296 102720 104157 105959 107154 107785 108437
53801A08437Q05R96J851L329M339M281L886L987M423M681M710M556M017L241K931
$$ 108437 109242 110238 112089 115418 119757 124038 127924 131911 136334 141015 145725 150281 154298 157539 160470
53786A60470L363L854L671K969K358K046J774J250L69o24j080n67L97P47J48p53
$$ 160470 163833 167687 171358 174327 176685 178731 180505 181755 182124 181500 180420 179853 180250 180997 181145 180392
53770A80392j369j804k333k883l346l766l983l649k836k129j934k105k355k574
$$ 180392 179023 177219 174886 172003 168657 164891 160908 157259 154423 152294 150360 148255 145900 143326
53756A43326k672k597k553k694k665k020r92k37P9L03N40O07O30Q33R10L86m11
$$ 143326 140654 138057 135504 132810 130145 128125 127133 126896 126975 127278 127818 128425 129055 129888 130798 131184 130773
53739A30773o98m53l44n03m70l47p78j594j739q96JK42K00K62R5m15n46J63J070
$$ 130773 130075 129622 129278 128775 128305 127958 127180 125586 123847 122951 122952 123194 123394 123656 123751 123336 122790 122953 124023
53720A24023J412J322J245J121Q14N96N28J40o33r04LJ467K388K495K187J669
$$ 124023 125435 126757 128002 129123 129937 130533 131061 131201 130568 129664 129667 131134 133522 136017 138204 139873
53704A39873J014N62M91M15P0n3N58J487J896J684J453J630K107K608K874K719
$$ 139873 140887 141449 141940 142355 142425 142372 142930 144417 146313 147997 149450 151080 153187 155795 158669 161388
53688A61388K312K095K135J950J368R96J352K030K307K154J984J810J415J079
$$ 161388 163700 165795 167930 169880 171248 172244 173596 175626 177933 180087 182071 183881 185296 186375
53674A86375J340K065K433J935R58K47J34M18P46R13Q88O46J95j46J36J057J800
$$ 186375 187715 189780 192213 194148 195106 195353 195487 195905 196651 197564 198452 199098 199293 199147 199283 200340 202140
53657B02140J550N40l53q21j247j715j797j470j289j392j240o95n08j142j888
$$ 202140 203690 204230 203877 203056 201809 200094 198297 196827 195538 194146 192906 192211 191703 190561 188673
53642A88673j759q18Q7L75O6n55j066j054n38QL28O39J008J042N84J64K71O46
$$ 188673 186914 186096 186183 186558 186624 186069 185003 183949 183411 183419 183747 184386 185394 186436 187020 187184 187455 188101
53624A88101P59O26P05J226K036K764K965K444J661J347J580J750J613J668K234
$$ 188101 188860 189486 190191 191417 193453 196217 199182 201626 203287 204634 206214 207964 209577 211245 213479
53609B13479K841L023L063L413L901M028L721L332L165L291L545L619L515L806
$$ 213479 216320 219343 222406 225819 229720 233748 237469 240801 243966 247257 250802 254421 257936 261742
53595B61742M887O010N987M888M030M098M373M159L810L752L639L210K962L185
$$ 261742 266629 272639 278626 283514 287544 291642 296015 300174 303984 307736 311375 314585 317547 320732
53581C20732L202K467J582J403J795K083K026J574N39p02j022p2R10P90K26M71
$$ 320732 323934 326401 327983 329386 331181 333264 335290 336864 337403 336701 335679 335607 336517 337307 337533 338004
53565C38004J257J294L95m00n10l04RP34J787K483K379J646O88OJ61J098J831
$$ 338004 339261 340555 340950 340550 340040 339736 339745 340479 342266 344749 347128 348774 349462 349468 349629 350727 352558
53548C52558J614J075J252J953K163J789J744K312K707K461K110K156K311K191
$$ 352558 354172 355247 356499 358452 360615 362404 364148 366460 369167 371628 373738 375894 378205 380396
53534C80396K041K304K930L445L430K925K576L203M751O032O068N378N210N823
$$ 380396 382437 384741 387671 391116 394546 397471 400047 403250 408001 414033 420101 425479 430689 436512
53520D36512O432O636O856P323P624P545P554Q170R405J1016J2720J3969J4171
$$ 436512 442944 449580 456436 463759 471383 478928 486482 494652 504057 515073 527793 541762 555933
53507E55933J3413J2615J2671J3701J5163J6445J7359J8262J9514K0750K1141
$$ 555933 569346 581961 594632 608333 623496 639941 657300 675562 695076 715826 736967
53496G36967K0673K0528K1559K3043K3780K3834K4160K4914K5339K5174K4926
$$ 736967 757640 778168 799727 822770 846550 870384 894544 919458 944797 969971 994897
53485I94897K4712K4033K2949K2348K2578K2806K2228K1167K0455K0369K0635
$$ 994897 1019609 1043642 1066591 1088939 1111517 1134323 1156551 1177718 1198173 1218542 1239177
53474A239177K0969K1145K0949K0443J9979J9697J9343J8723J7978J7220J6252
$$ 1239177 1260146 1281291 1302240 1322683 1342662 1362359 1381702 1400425 1418403 1435623 1451875
53463A451875J4915J3416J2149J1333J0777R905Q149N617L136J302k35k183m591
$$ 1451875 1466790 1480206 1492355 1503688 1514465 1524370 1532519 1538136 1541272 1542574 1542339 1540156 1535565
53450A535565o980r074j0821j2036j2731j3523j4898j6348j7105j7461j8326j9689
$$ 1535565 1528585 1519511 1508690 1496654 1483923 1470400 1455502 1439154 1422049 1404588 1386262 1366573
53438A366573k0681k1161k1946k3200k3888k3366k2465k2235k2545k2585k2068
$$ 1366573 1345892 1324731 1302785 1279585 1255697 1232331 1209866 1187631 1165086 1142501 1120433
53427A120433k1232k0213j9096j8081j7043j5358j2809j0269q792q301p800o672
$$ 1120433 1099201 1078988 1059892 1041811 1024768 1009410 996601 986332 977540 969239 961439 954767
53415I54767n225m016l173k419j409N7J874L668N086O082O923Q027R745J2073
$$ 954767 949542 945526 942353 939934 938525 938582 940456 944124 949210 955292 962215 970242 979987 992060
53401I92060J4548J6607J8075J9170K0105K0936K1750K2664K3683K4828K6312
$$ 992060 1006608 1023215 1041290 1060460 1080565 1101501 1123251 1145915 1169598 1194426 1220738
53390A220738K8259L0340L2084L3537L5210L7375L9727M1712M2959M3500M3957
$$ 1220738 1248997 1279337 1311421 1344958 1380168 1417543 1457270 1498982 1541941 1585441 1629398
53379A629398M5197M7398M9604N0759N0935N0914N0846N0186M8845M7475M6418
$$ 1629398 1674595 1721993 1771597 1822356 1873291 1924205 1975051 2025237 2074082 2121557 2167975
53368B167975M5273M3780M2272M0856L8920L5960L2301K8527K4712K0681J6608
$$ 2167975 2213248 2257028 2299300 2340156 2379076 2415036 2447337 2475864 2500576 2521257 2537865
53357B537865J2773R057N149R58l491q312j3385j8079k1764k4559k7148k9903
$$ 2537865 2550638 2559695 2564844 2565802 2562311 2553999 2540614 2522535 2500771 2476212 2449064 2419161
53345B419161l2550l4710l6500l8487m1042m3825m5992m7002m7073m6680m5914
$$ 2419161 2386611 2351901 2315401 2276914 2235872 2192047 2146055 2099053 2051980 2005300 1959386
53334A959386m4696m3401m2689m2695m2858m2652m1960m0724l8811l6508l4568
$$ 1959386 1914690 1871289 1828600 1785905 1743047 1700395 1658435 1617711 1578900 1542392 1507824
53323A507824l3358l2282l0471k7867k5262k3360k2092k0838j9139j7155j5385
$$ 1507824 1474466 1442184 1411713 1383846 1358584 1335224 1313132 1292294 1273155 1256000 1240615
53312A240615j4066j3016j2165j1857j2311j2986j2945j1844j0227q848q038p618
$$ 1240615 1226549 1213533 1201368 1189511 1177200 1164214 1151269 1139425 1129198 1120350 1112312 1104694
53300A104694p142o205m836l543k678j903o16J193K921M120M917N703O778Q169
$$ 1104694 1097552 1091347 1086511 1082968 1080290 1078387 1077771 1078964 1081885 1086005 1090922 1096625 1103403 1111572
53286A111572R633J0861J1976J3530J5750J8101J9994K1489K2853K3838K4102
$$ 1111572 1121205 1132066 1144042 1157572 1173322 1191423 1211417 1232906 1255759 1279597 1303699
53275A303699K3908K3780K3762K3675K3736K4067K3995K2827K1004J9434J7993
$$ 1303699 1327607 1351387 1375149 1398824 1422560 1446627 1470622 1493449 1514453 1533887 1551880
53264A551880J5833J3094J0867R384P620N024K406N21j037k922m997o851q561
$$ 1551880 1567713 1580807 1591674 1601058 1608678 1613702 1616108 1616629 1615592 1612670 1607673 1600822 1592261
53251A592261j0287j1825j3136j4647j6500j8163j9258k0110k1040k1871k2565
$$ 1592261 1581974 1570149 1557013 1542366 1525866 1507703 1488445 1468335 1447295 1425424 1402859
53240A402859k3519k4681k5199k4644k3789k3443k3272k2588k1603k0973k0657
$$ 1402859 1379340 1354659 1329460 1304816 1281027 1257584 1234312 1211724 1190121 1169148 1148491
53229A148491k0176j9589j9289j9094j8450j7327j6168j5109j4024j3122j2691
$$ 1148491 1128315 1108726 1089437 1070343 1051893 1034566 1018398 1003289 989265 976143 963452
53218I63452j2382j1587j0463r819r821r569q304o483n320n471o513p564q189
$$ 963452 951070 939483 929020 919201 909380 899811 891507 885024 879704 874233 867720 860156 851967
53205H51967q608r129r613r770r811j0276j1178j1793j1648j1202j1163j1454
$$ 851967 843359 834230 824617 814847 805036 794760 783582 771789 760141 748939 737776 726322
53193G26322j1358j0528r477q998r385j0207j0847j1189j1687j2621j3535j3802
$$ 726322 714964 704436 694959 685961 676576 666369 655522 644333 632646 620025 606490 592688
53181E92688j3503j3229j3193j3140j3066j3166j3094j2161j0500r161q745q795
$$ 592688 579185 565956 552763 539623 526557 513391 500297 488136 477636 468475 459730 450935
53169D50935q898r339j0154j0461r636q443q032q332q327p612o779o401o428o535
$$ 450935 442037 432698 422544 412083 402447 394004 385972 377640 369313 361701 354922 348521 342093 335558
53155C35558o443n921m986m053l555l535l812m296m808m928m391l387k242j206
$$ 335558 329115 323194 318208 314155 310600 307065 303253 298957 294149 289221 284830 281443 279201 277995
53141B77995o98j121k071k450j850j186j300j726j598j092q67o65K81J651K193
$$ 277995 277297 276176 274105 271655 269805 268619 267319 265593 263995 262903 262036 261371 261652 263303 265496
53126B65496J611J155J902L325M099L724K805K065J536P80l92j529k068k164k575
$$ 265496 267107 268262 270164 273489 277588 281312 284117 286182 287718 288498 288106 286577 284509 282345 279770
53111B79770l538m290m158l579l450l844m176m381n009o059o637o067m822l920
$$ 279770 276232 271942 267784 264205 260755 256911 252735 248354 243345 237286 230649 224582 219760 215840
53097B15840l844m267m602m466l865l150k768k841l036k869k230j527j244j347
$$ 215840 211996 207729 203127 198661 194796 191646 188878 186037 183001 180132 177902 176375 175131 173784
53083A73784j339j062j081j863k816k877j990j160r75j002q85j096j950k759k722
$$ 173784 172445 171383 170302 168439 165623 162746 160756 159596 158621 157619 156734 155638 153688 150929 148207
53068A48207k046j411q98k92R6q6l53KO85P48P1n07n18m11o02q62r13r13j104
$$ 148207 146161 144750 143852 143560 143656 143570 143217 143219 143904 144652 144723 144216 143698 143287 142685 141823 140910 139997 138893
53049A38893j441j768j931j649p66K81P66M95q9o22j123j534j554j175q76r74
$$ 138893 137452 135684 133753 132104 131338 131619 132385 132880 132791 132169 131046 129512 127958 126783 125907 124933
53033A24933j137q71k86o7o83j776k412k031j084m53l49j98L49Q76J006J088J520
$$ 124933 123796 122925 122639 122572 121889 120113 117701 115670 114586 114133 113784 113586 113935 114811 115817 116905 118425
53016A18425J900J562O00k94p56q31m54M16J262J430J051Q36J009J150J017P83
$$ 118425 120325 121887 122487 122193 121437 120606 120152 120568 121830 123260 124311 125147 126156 127306 128323 129106
53000A29106M85j9m42k56L53N26l3n60l71K23O19R06J523K321K671K380J969J989
$$ 129106 129591 129572 129130 128874 129227 129753 129720 129160 128789 129012 129631 130537 132060 134381 137052 139432 141401 143390
52982A43390K434K971L421L869M340M698M892N166N692O101N728M394K626R03
$$ 143390 145824 148795 152216 156085 160425 165123 170015 175181 180873 186974 192702 197096 199722 200625
52968B00625p55k263l028k632j638j146j631k616l412l729l656l410l135k744
$$ 200625 199870 197607 194579 191947 190309 189163 187532 184916 181504 177775 174119 170709 167574 164830
52954A64830k103j453j328j835k357k421k299k400k517k281j887j708j541j016
$$ 164830 162727 161274 159946 158111 155754 153333 151034 148634 146117 143836 141949 140241 138700 137684
52940A37684m23l44o58p59n64m65l82J87J045J240L85o85r43l28M30O57K64k44
$$ 137684 137261 136917 136259 135500 134936 134471 134089 134276 135321 136561 136946 136261 135318 134990 135420 136077 136341 136097
52922A36097j46P49J679J685P40k56n33j7R39J813J990J222Q2o20p85q02o09J96
$$ 136097 135951 136700 138379 140064 140804 140548 140015 139998 140937 142750 144740 145962 146044 145424 144639 143837 143228 143424
52904A43424J288J660J047M46Q17J872K544K151Q11p90j702j351k01O38O69N29
$$ 143424 144712 146372 147419 147865 148682 150554 153098 155249 156060 155270 153568 152217 152016 152654 153323 153852
52888A53852R46J722K129J921J536J463J752K061K026J601J053N57lo00p60j51
$$ 153852 154798 156520 158649 160570 162106 163569 165321 167382 169408 171009 172062 172619 172616 172016 171256 171105
52872A71105P70J219J092Q91Q33P43P48J272K205K830K844K751L006L371L488
$$ 171105 171875 173094 174186 175077 175910 176653 177401 178673 180878 183708 186552 189303 192309 195680 199168
52857A99168L532L805M176M291M105L882L836L980M155M129L801L261K504J358
$$ 199168 202700 206505 210681 214972 219077 222959 226795 230775 234930 239059 242860 246121 248625 249983
52843B49983k6r30r41p03j108j914k053j200k38o6p62k011l475m563m706m163
$$ 249983 249957 249027 248086 247383 246275 244361 242308 241108 240870 240804 240042 238031 234556 229993 225287 221124
52827B21124l842m019m003l332k558k399k803l239l369l122k548k005j872j956
$$ 221124 217282 213263 209260 205928 203370 200971 198168 194929 191560 188438 185890 183885 182013 180057
52813A80057j660r64n24o64r54j028j057j151j093j030j515k479k952k353j326
$$ 180057 178397 177433 176909 176245 175291 174263 173206 172055 170962 169932 168417 165938 162986 160633 159307
52798A59307p48o27n44m30l21J9N91Q43M55r0k76l24n99q87q96q59j026j127r69
$$ 159307 158559 157932 157388 156958 156637 156656 157247 158090 158545 158455 158179 157855 157256 156369 155473 154614 153588 152461 151492
52779A51492q80j004q45k84k24j233k291j979n22O09O87K06l71j027j388q46L27
$$ 151492 150612 149608 148763 148479 148255 147022 144731 142752 142230 142839 143526 143732 143361 142334 140946 140100 140427
52762A40427R60M67n41j288j670j759j454r67r20j394j603j067m69o44j207j104
$$ 140427 141387 141854 141313 140025 138355 136596 135142 134175 133255 131861 130258 129191 128722 128078 126871 125767
52746A25767l02or48k250k556j798j105j166j510j581j616j892j805o84Q89J611
$$ 125767 125465 125459 124511 122261 119705 117907 116802 115636 114126 112545 110929 109037 107232 106548 107437 109048
52730A09048J251Q39Q90P01j29o94j37Q52J025M45K02N87P14R5n45k90P73J835
$$ 109048 110299 111138 112028 112729 112600 111906 111769 112621 113646 114091 114293 114880 115594 115689 115144 114854 115627 117462
52712A17462K398K613K848L176L309K907K028J150P66R92J551J947J715Q26r9
$$ 117462 119860 122473 125321 128497 131806 134713 136741 137891 138657 139649 141200 143147 144862 145688 145589
52697A45589l78k14m51j349k138k205j951k052k365k340k030j977k278k519k543
$$ 145589 145211 144997 144546 143197 141059 138854 136903 134851 132486 130146 128116 126139 123861 121342 118799
52682A18799k673l109l514l394k588j518r12j147j725j853j571j709k435k745
$$ 118799 116126 113017 109503 106109 103521 102003 101091 99944 98219 96366 94795 93086 90651 87906
52668H7906j898o26p7k29l16k75n56q79n11K85K92p95j749j451k35Q73J415J436
$$ 87906 86008 85382 85305 85076 84760 84485 83929 83050 82539 82824 83116 82321 80572 79121 78886 79759 81174 82610
52650H2610R13K6n30k48M21O22J97l47p62j281j872j990j315k77M87R49J438J831
$$ 82610 83523 83549 83019 82771 83192 83814 84011 83664 82902 81621 79749 77759 76444 76167 76654 77603 79041 80872
52632H0872J570O33j63j90L4m01j414k004j700j127r03p20m1Q61J190O57k32q19
$$ 80872 82442 83075 82912 82722 82756 82355 80941 78937 77237 76110 75207 74487 74446 75307 76497 77154 76922 76103
52614G6103p75j81N01P45M92K61M36P09N61M3l17k41J06M31O01O00N15M71N05
$$ 76103 75328 75147 75648 76393 76885 77146 77582 78291 78852 78895 78578 78337 78443 78874 79475 80075 80590 81061 81566
52595H1566O03R10J534K121K079J414Q80R71J288J226Q05M38K86K69K88J14m61
$$ 81566 82169 83079 84613 86734 88813 90227 91107 92078 93366 94592 95397 95835 96121 96390 96678 96792 96331
52578I6331j015o44P56J974J866P53k06m25n3O95J440J458N62k18J34J087J318
$$ 96331 95316 94672 95428 97402 99268 100021 99815 99390 99337 100032 101472 102930 103492 103274 103408 104495 105813
52561A05813P36M84R97J388R86L48K34N55Q72J234J891K610K810K191J043M1k84
$$ 105813 106549 107033 108030 109418 110404 110752 110986 111541 112413 113647 115538 118148 120958 123149 124192 124233 123949
52544A23949q1o0m53n32L30J501J826J205N73M40N23O97J153J509R73k37q32k89
$$ 123949 123868 123808 123355 122823 123153 124654 126480 127685 128258 128698 129221 129918 131071 132580 133553 133316 132484 132195
52526A32195K94j19r91j170n75K6L31N94Q22P72O21Q09J246J391J080P06M83J21
$$ 132195 132489 132370 131379 130209 129634 129660 129991 130585 131407 132179 132800 133609 134855 136246 137326 138032 138515 138636
52508A38636n90j259j284n91K22N10K38m4R9M18L30k82q70q73k90M58R50J007
$$ 138636 138046 136787 135503 134912 135134 135644 135882 135838 135937 136355 136685 136403 135533 134660 134370 134828 135778 136785
52490A36785P28M15K84K95L27M50P25R22Q07O40Q72J415J682J426J077J098J465
$$ 136785 137513 137928 138212 138507 138834 139284 140009 140931 141738 142378 143250 144665 146347 147773 148850 149948 151413
52473A51413J914K278K433K263J849J379P76j30j026j190l67Q12J548J609J223
$$ 151413 153327 155605 158038 160301 162150 163529 164305 164175 163149 161959 161592 162404 163952 165561 166784
52458A66784O93L31L28M14P6o33r16k31R28J612J503J011N90M35O19J088J574
$$ 166784 167477 167808 168136 168550 168626 167993 167077 166846 167774 169386 170889 171900 172490 172925 173544 174632 176206
52441A76206J852K033K307K544K452K056J656J374J057O37L13K38L34M54N41N01
$$ 176206 178058 180091 182398 184942 187394 189450 191106 192480 193537 194174 194487 194725 195059 195513 196054 196555
52425A96555J82l59p27o12k64k18n39p32n96p14j609k745k982k019p10J41N52
$$ 196555 196737 196378 195651 195039 194775 194557 194018 193286 192690 191976 190367 187622 184640 182621 181911 182052 182604
52408A82604P14L94l76p59n9J122J506P27m29j221j598j698j466r52m35m4L17
$$ 182604 183318 183712 183336 182577 182518 183640 185146 185873 185444 184223 182625 180927 179461 178509 178074 178030 178347
52391A78347N84N28J86j12j97j62l6K08L65K32P9L69R88J339J244J192J529J986
$$ 178347 178931 179459 179645 179533 179336 179174 179138 179346 179711 179943 180022 180391 181379 182718 183962 185154 186683 188669
52373A88669K124J848J285O96M81Q12J189R16J19l17M6P15J145J409J665J632
$$ 188669 190793 192641 193926 194622 195103 195915 197104 198020 198139 197822 197868 198583 199728 201137 202802 204434
52357B04434J143P31J013J794K260J987J366J075J366J875K081J944J958K375
$$ 204434 205577 206308 207321 209115 211375 213362 214728 215803 217169 219044 221125 223069 225027 227402
52343B27402K696K313J475J017J173J322J044O89P26J059J324J389J277J030Q45
$$ 227402 230098 232411 233886 234903 236076 237398 238442 239131 239857 240916 242240 243629 244906 245936 246781
52328B46781R84J388J736J921K050J968J416P46P60J625K552K883K914L269L936
$$ 246781 247765 249153 250889 252810 254860 256828 258244 258990 259750 261375 263927 266810 269724 272993 276929
52313B76929M351M020K922J703J492K889M972O082N785N247N410N813N821N912
$$ 276929 281280 285300 288222 289925 291417 294306 299278 305360 311145 316392 321802 327615 333436 339348
52299C39348O759P822Q069P625P581Q344R240R795J0385J1389J2526J3320J3704
$$ 339348 346107 353929 361998 369623 377204 385548 394788 404583 414968 426357 438883 452203 465907
52286D65907J3845J3825J3791J4080J4857J5844J6602J6972J7107J7093J6801
$$ 465907 479752 493577 507368 521448 536305 552149 568751 585723 602830 619923 636724
52275F36724J6174J5535J5346J5508J5217J3857J1938J0650J0476J0637J0097
$$ 636724 652898 668433 683779 699287 714504 728361 740299 750949 761425 772062 782159
52264G82159Q656O889N296L901K538J301N98O04P24J1j588k876k891k291k358
$$ 782159 790815 797704 803000 806901 809439 810740 811338 811942 812666 812677 811089 808213 805322 803031 800673
52249H00673l039l118k297j809k561l871m621m617m081k772n75J664K926L275
$$ 800673 797634 794516 792219 790410 787849 783978 779357 774740 770659 767887 767312 768976 771902 775177
52235G75177L661M686O197P726Q805R199R330J0054J1520J2696J2618J1603J0620
$$ 775177 778838 783524 789721 797447 806252 815451 824781 834835 846355 859051 871669 883272 893892
52222H93892R996R416Q812Q412Q175P861P420O751N423L344J299J22m69j423l056
$$ 893892 903888 913304 922116 930528 938703 946564 953984 960735 966158 969502 970801 970923 970454 969031 965975
52207I65975m885o573q157r491j0291j0753j1363j2088j2404j2175j1907j2033
$$ 965975 961090 954517 946360 936869 926578 915825 904462 892374 879970 867795 855888 843855
52195H43855j2493j3006j3195j2537j0857q936p987q270q790q471p263n928n155
$$ 843855 831362 818356 805161 792624 781767 772831 764844 756574 747784 739313 732050 726122 720967
52182G20967n004n047m805m264l849l779l692l199k530k202k258k314k266k387
$$ 720967 715963 710916 706111 701847 697998 694219 690527 687328 684798 682596 680338 678024 675758 673371
52168F73371k769l054k868k233j624j688k667l902m246l394k371k292k974l389
$$ 673371 670602 667548 664680 662447 660823 659135 656468 652566 648320 644926 642555 640263 637289 633900
52154F33900l107k608k361k365k510k787k975k782k287j855j595j369j207j252
$$ 633900 630793 628185 625824 623459 620949 618162 615187 612405 610118 608263 606668 605299 604092 602840
52140F02840j384j402j471j910k548k859k669k291k018j966k265k915l538l782
$$ 602840 601456 600054 598583 596673 594125 591266 588597 586306 584288 582322 580057 577142 573604 569822
52126E69822l844m101m373m194l663l270k990k323j373r97j636k604k881k068
$$ 569822 565978 561877 557504 553310 549647 546377 543387 541064 539691 538694 537058 534454 531573 529505
52112E29505m17J497K895L179K619K194K483L034L169K978L168M098N378O356
$$ 529505 529088 530585 533480 536659 539278 541472 543955 546989 550158 553136 556304 560402 565780 572136
52098E72136O818P196Q132R753J1494J2746J3526J4319J5367J6484J7470J8352
$$ 572136 578954 586150 594282 604035 615529 628275 641801 656120 671487 687971 705441 723793
52086G23793J9224K0083K0803K1164K1012K0521K0056J9638J8936J8003J7427
$$ 723793 743017 763100 783903 805067 826079 846600 866656 886294 905230 923233 940660
52075I40660J7432J7367J6619J5425J4123J2321R732P252N978N438M096J548j018
$$ 940660 958092 975459 992078 1007503 1021626 1033947 1043679 1050931 1056909 1062347 1066443 1067991 1066973
52062A066973k633l577m383n087n881p396r635j1489j2025j1556j0929j0450j0090
$$ 1066973 1064340 1060763 1056380 1051293 1045412 1038016 1028381 1016892 1004867 993311 982382 971932 961842
52049I61842j0045j0357j0529j0073r076p787o186m454l246k787k264q61R22J878
$$ 961842 951797 941440 930911 920838 911762 903975 897789 893335 890089 887302 885038 884177 885099 886977
52035H86977J802J814K865M591N839N973N384M989N345O280P279Q052Q513Q415
$$ 886977 888779 890593 893458 898049 903888 909861 915245 920234 925579 931859 939138 947190 955703 964118
52021I64118P511O105M928M289L803L074K137J050k98j636k292k219k475m031
$$ 964118 971629 977734 982662 986951 990754 993828 995965 997015 996717 995081 992789 990570 988095 984064
52007I84064o484q683j0199j1533j3013j4399j5514j6542j7543j8280j8678j9020
$$ 984064 977580 968897 958698 947165 934152 919753 904239 887697 870154 851874 833196 814176
51995H14176j9518k0098k0762k1683k2711k3259k2975k2257k1673k1196k0423
$$ 814176 794658 774560 753798 732115 709404 686145 663170 640913 619240 598044 577621
51984E77621j9374j8560j8215j7987j7575j7167j6966j6653j5870j4892j4245
$$ 577621 558247 539687 521472 503485 485910 468743 451777 435124 419254 404362 390117
51973C90117j3751j2713j1085r747r244r079q622q099p909p590o445m957m435
$$ 390117 376366 363653 352568 342821 333577 324498 315876 307777 299868 292278 285833 280876 276441
51960B76441n212o094n932m961m172l956l916l630l116k637k401k448k696l076
$$ 276441 271229 265135 259203 254242 250070 246114 242198 238568 235452 232815 230414 227966 225270 222194
51946B22194l572l925l560k204n50K06l65j496k180k166j827j469j100p06l89
$$ 222194 218622 214697 211137 208933 208383 208589 208224 206728 204548 202382 200555 199086 197986 197280 196891
51931A96891k61l13m27n19o52q44q36l48L08L84k07n06K12J223J214J3j373k217
$$ 196891 196630 196317 195890 195371 194719 193875 193039 192691 192999 193383 193176 192670 192882 194105 195319 195332 193959 191742
51913A91742k575k466j688p02n18j296k023k023j875k216k544k060r98k22N0K47
$$ 191742 189167 186701 185013 184311 183793 182497 180474 178451 176576 174360 171816 169756 168758 168536 168586 168833
51897A68833M57L68k9l72o11j035j633j964j778j316r34p76q33j006j020o12J35
$$ 168833 169290 169658 169629 169257 168646 167611 165978 164014 162236 160920 159986 159210 158377 157371 156351 155739 155874
51880A55874Q05J031P61K17k94n61n75l94M6P68J356J191K87m69l17M29P64K70
$$ 155874 156679 157710 158471 158688 158394 157833 157258 156864 156910 157678 159034 160225 160512 160043 159726 160155 160919 161189
51862A61189m59o48k14K85L56K7l43n00l86J0O28J105R57L19P4Q30J980K404J933
$$ 161189 160730 160082 159868 160153 160509 160536 160193 159693 159307 159317 159945 161050 162007 162326 162400 163230 165210 167614 169547
51843A69547J436J477J662J573J500J827K236K159J597R51L51l33r66j232j127
$$ 169547 170983 172460 174122 175695 177195 179022 181258 183417 185014 185965 186316 185983 185017 183785 182658
51828A82658r45p89m89n6J39j82p57j004o15J22O14M87k05j121j778j689p45M52
$$ 182658 181713 180924 180435 180379 180518 180336 179579 178575 177960 178082 178696 179183 178978 177857 176079 174390 173645 174097
51810A74097J015P37K50L7j99o99q28J56J847L043L166K556J547J88j127j725
$$ 174097 175112 175849 176099 176136 175937 175238 174410 174566 176413 179456 182622 185178 186725 186913 185786 184061
51794A84061j535j105o36J15Q57O81n74j831k107j604j026n40n6J56j21m58k58
$$ 184061 182526 181421 180785 180900 181757 182438 181864 180033 177926 176322 175296 174756 174700 174856 174735 174277 174019
51777A74019M33J021J057N30j77m25J70J172J675J388P98K39m21r75p21L86J346
$$ 174019 174452 175473 176530 177060 176883 176458 176628 177800 179475 180863 181661 181900 181479 180504 179783 180169 181515
51760A81515J462J295J642K261K392J906J230O63M41R49K153L259L626L537L466
$$ 181515 182977 184272 185914 188175 190567 192473 193703 194366 194807 195756 197909 201168 204794 208331 211797
51745B11797L254K722K482L216M596N791O658P587Q545R234R832J0745J1734J2214
$$ 211797 215051 217773 220255 223471 228067 233858 240516 248103 256648 265882 275714 286459 298193 310407
51731C10407J2198J2180J2237J1917J0855Q903N964K412p24k749m076n272n863
$$ 310407 322605 334785 347022 358939 369794 378697 384661 387073 386349 383600 379524 374252 368389
51718C68389n174l853l305l751m079l638k970k622k411k122j949j918j715j330
$$ 368389 363215 359362 356057 352306 348227 344589 341619 338997 336586 334464 332515 330597 328882 327552
51704C27552j097q66j36Q80J231O49M5J55N93P46P32Q51P92K25l68k03P45J772
$$ 327552 326455 325589 325453 326333 327564 328213 328258 328413 329006 329752 330484 331335 332127 332352 331984 331781 332526 334298
51686C34298K359K582K835L451M432N313N544N171M711M161K773K98k132l075
$$ 334298 336657 339239 342074 345525 349957 355270 360814 365985 370696 374857 377630 377928 375796 372721
51672C72721k517j771j805k293k430k004j361p53j70L83Q39J250J714K117K241
$$ 372721 370204 368433 366628 364335 361905 359901 358540 357787 357617 358000 358839 360089 361803 363920 366161
51657C66161K170K263K551K508J812R23M54J55p19k147l243l520l512l742m025
$$ 366161 368331 370594 373145 375653 377465 378388 378842 378997 378278 376131 372888 369368 365856 362114 358089
51642C58089m231m931o378p568p277n828m779m963n676n840n197m225l538l540
$$ 358089 353858 348927 342549 334981 327704 321876 317097 312134 306458 300618 295421 291196 287658 284118
51628B84118m129m612m321l360k404j820j473j327j612k320l004l234k948k305
$$ 284118 279989 275377 271056 267696 265292 263472 261999 260672 259060 256740 253736 250502 247554 245249
51614B45249j622j321j563j916j830j417j268j581j953k023j877j699j618j808
$$ 245249 243627 242306 240743 238827 236997 235580 234312 232731 230778 228755 226878 225179 223561 221753
51600B21753k308k663k261j146q3K85k0n94j034r98l77M53R24R23Q52J028J372
$$ 221753 219445 216782 214521 213375 213292 213577 213557 212963 211929 210931 210554 211007 211931 212854 213706 214734 216106
51583B16106J707J965K116K188K360K768L206L392L461L806M551N456O260O730
$$ 216106 217813 219778 221894 224082 226442 229210 232416 235808 239269 243075 247626 253082 259342 266072
51569B66072O567N608M163K766J744J170R26N29o07k247l233k963k374k687l632
$$ 266072 272639 278247 282410 285176 286920 288090 289016 289545 288938 286691 283458 280495 278121 275434 271802
51554B71802m002l634l500l916l950k911j287J50J253J994J998J219M27M61J367
$$ 271802 267800 264166 260666 256750 252800 249889 248602 248752 250005 251999 253997 255216 255643 256104 257471
51539B57471K599L668M376M820N437O464P278O835N030L039K020J978K135J901
$$ 257471 260070 263738 268114 272934 278371 284835 292113 298948 303978 307017 309037 311015 313150 315051
51525C15051J215L68k81o40r86j363j204k05P18L76q05j068K61J794K082J449
$$ 315051 316266 316634 316353 315713 314727 313364 312160 311955 312673 313049 312244 311176 311437 313231 315313 316762
51509C16762J061J072P33j75j086j625k109k938m031m911n164m902m699m922n245
$$ 316762 317823 318895 319628 319453 318367 316742 314633 311695 307664 302753 297589 292687 287988 283066 277821
51494B77821n199n001n096n097m146k438j335j527k157k195j806j647j684j580
$$ 277821 272622 267621 262525 257428 253282 250844 249509 247982 245825 243630 241824 240177 238493 236913
51480B36913j492j576j262j2J587K431K360K206K444K686K538K245K246K553K822
$$ 236913 235421 233845 232583 232571 234158 236589 238949 241155 243599 246285 248823 251068 253314 255867 258689
51465B58689K825K766L124M123N327O024O016N687N369N126N191N910P023P695
$$ 258689 261514 264280 267404 271527 276854 282878 288894 294581 299950 305076 310267 316177 323200 330895
51451C30895P621P548Q216R293R791R142P438N174L149K097J925J767J160O31
$$ 330895 338516 346064 354280 363573 373364 382506 389944 395118 398267 400364 402289 404056 405216 405847
51437D05847P01J007J019R28J086J210J005J056K016L283L606K874K273K472K671
$$ 405847 406548 407555 408574 409502 410588 411798 412803 413859 415875 419158 422764 425638 427911 430383 433054
51422D33054J803p4j981l137l483l442l540m114n107o094o599o409n758n142m852
$$ 433054 434857 434783 432802 429665 426182 422740 419200 415086 409979 403885 397286 390877 385119 379977 375125
51407C75125m630m071l253k631k298j874j271r06r26q06j62N33N86Jo91j127j189
$$ 375125 370495 366424 363171 360540 358242 356368 355097 354191 353265 352459 352297 352830 353416 353417 352726 351599 350410
51390C50410p66oN39N33L69N76J035J256J083N95l35j786l325m423n123n830o591
$$ 350410 349644 349638 350177 350710 351079 351655 352690 353946 355029 355624 355289 353503 350178 345755 340632 334802 328211
51373C28211p164p559p951q195p996p502p242p475p971q344q315p773o920o155
$$ 328211 321047 313488 305537 297342 289346 281844 274602 267127 259156 250812 242497 234724 227804 221649
51359B21649n569m843l880l151k985k992k650k077j674j430j183j217j850k657
$$ 221649 216080 211237 207357 204206 201221 198229 195579 193502 191828 190398 189215 187998 186148 183491
51345A83491k850k327j745j591j713j717j381p77l18m49r60r82k04M21j44j447
$$ 183491 180641 178314 176569 174978 173265 171548 170167 169390 169072 168623 167663 166681 166477 166898 166754 165307
51329A65307k056j374j83N65P36O85P14R29J218J244Q95N76P03J142J549J977
$$ 165307 163251 161877 161694 162259 162995 163680 164394 165323 166541 167785 168680 169256 169959 171101 172650 174627
51313A74627K583L079L151L156L584M167M312M191M446M916M714L663K650K322
$$ 174627 177210 180289 183440 186596 190180 194347 198659 202850 207296 212212 216926 220589 223239 225561
51299B25561K334K141J762J336O87l30j477k446l100l380l403l675m497n256n021
$$ 225561 227895 230036 231798 233134 233821 233491 232014 229568 226468 223088 219685 216010 211513 206257 201236
51284B01236l955l225l392l781l796l837m312m630m027k868k222k423k818k769
$$ 201236 197281 194056 190664 186883 183087 179250 174938 170308 166281 163413 161191 158768 155950 153181
51270A53181k270j585q69l23k55p60j506k053k292k412k429k035j178n52r10j851
$$ 153181 150911 149326 148457 148134 147879 147119 145613 143560 141268 138856 136427 134392 133214 132662 131752 129901
51254A29901k026r34K56L62j20P9R24J295R68Q84J302J164j8j031n86Q12J718
$$ 129901 127875 126941 127197 127559 127439 127518 128442 129737 130705 131589 132891 134055 134037 133006 132420 133232 134950
51237A34950J688J358J110P73M62N77R37P94n6q92j083r08j040j565j922j672
$$ 134950 136638 137996 139106 139879 140341 140918 141855 142649 142593 141701 140618 139710 138670 137105 135183 133511
51221A33511j019n00l41k24K32Q99J256J099P81O65N69J55l74l75L68J203J309
$$ 133511 132492 131992 131651 131427 131659 132558 133814 134913 135694 136359 136928 137083 136709 136334 136702 137905 139214
51204A39214O49j6r0K13L19J31j3n1l26q02p72J81J332J538P33qQ2N35M65k23
$$ 139214 139863 139847 139757 139970 140289 140420 140407 140356 140030 139228 138456 138637 139969 141507 142240 142232 142314 142849 143314 143091
51184A43091q12p83m04l32p88j391j693j635j351p79P5O47K81p24j148l85P61
$$ 143091 142279 141496 141092 140760 139972 138581 136888 135253 133902 133123 133198 133845 134126 133402 132254 131869 132630
51167A32630J270J233J283J317P97Jj56M59R80Q80O07O47P88O86M17R6m76j321
$$ 132630 133900 135133 136416 137733 138530 138531 138375 138834 139814 140694 141301 141948 142736 143422 143839 143935 143459 142138
51149A42138j984k145k103k264k473k288j634q55k97m9K2Q6R8k74j149k028k204
$$ 142138 140154 138009 135906 133642 131169 128881 127247 126392 126095 126046 126068 126154 126252 125978 124829 122801 120597
51132A20597j555n46M23J158J383J044P93J309K073J827N08l11N19K180L154L167
$$ 120597 119042 118496 118919 120077 121460 122504 123297 124606 126679 128506 129014 128703 129222 131402 134556 137723
51116A37723K930K653J974J086O91Q27O78j19q77r47o76p35j019q81k39K25N6
$$ 137723 140653 143306 145280 146366 147057 147884 148562 148443 147566 146619 145943 145208 144189 143308 143069 143294 143350
51099A43350l50l86o7J33N6o6j37k86m02j58K97L32k29o92n18j00K0J29P11J301
$$ 143350 143000 142614 142547 142680 142736 142670 142533 142247 141845 141687 141984 142316 142087 141395 140877 140777 140797 140926 141637 142938
51079A42938J012po80n43j69L8L96R63J111N52MJ86P88J078R59Q38P89N00j65
$$ 142938 143950 143943 143263 142720 142551 142589 142985 143948 145059 145611 145615 145801 146589 147667 148626 149464 150253 150753 150588
51060A50588r40j380j144l33L18L2j000j681j303l23M36Q21J209J775K374K761
$$ 150588 149648 148268 147124 146791 147109 147141 146141 144460 143157 142834 143270 144091 145300 147075 149449 152210
51044A52210K663J961J110R38J704K746L306L260K775J919R86O02R30J355J424
$$ 152210 154873 156834 157944 158882 160586 163332 166638 169898 172673 174592 175578 176180 177110 178465 179889
51029A79889J506J949K194J651Q74Q49J384J313K52q51j104p52n08n67o81p21
$$ 179889 181395 183344 185538 187189 188063 188912 190296 191609 191861 191010 189906 189154 188646 188079 187398 186677
51013A86677o43k73M33J116J374J323J362J503J355Q86P77J602K904L653L606
$$ 186677 186034 185761 186194 187310 188684 190007 191369 192872 194227 195113 195890 197492 200396 204049 207655
50998B07655L563M019M311L710K757K614L361L998M118M448N546O899P821Q350
$$ 207655 211218 215237 219548 223258 226015 228629 231990 235988 240106 244554 250100 256999 264820 273170
50984B73170Q767R023R205R860J1215J2677J3827J5238J7505K0117K2219K4083
$$ 273170 281937 290960 300165 310025 321240 333917 347744 362982 380487 400604 422823 446906
50972D46906K6710L0164L3401L5862L8253M1471M5441M9440N3020N6251N9201
$$ 446906 473616 503780 537181 573043 611296 652767 698208 747648 800668 856919 916120
50961I16120O1588O2942O3116O2514O1584O0080N7171N2500M6634M0213L3174
$$ 916120 977708 1040650 1103766 1166280 1227864 1287944 1345115 1397615 1444249 1484462 1517636
50950A517636K5329J7140R287J783n682j2751j8584k2916k6129k8230k8651k7365
$$ 1517636 1542965 1560105 1569392 1571175 1565493 1552742 1534158 1511242 1485113 1456883 1428232 1400867
50938A400867k5484k4220k3649k2937k1587k0083j9357j9881k1332k3090k4961
$$ 1400867 1375383 1351163 1327514 1304577 1282990 1262907 1243550 1223669 1202337 1179247 1154286
50927A154286k7188k9796l2331l4418l6198l7868l9174l9797l9943l9881l9217
$$ 1154286 1127098 1097302 1064971 1030553 994355 956487 917313 877516 837573 797692 758475
50916G58475l7330l4525l1920l0054k8314k6020k3394k1021j8884j6536j3970
$$ 758475 721145 686620 654700 624646 596332 570312 546918 525897 507013 490477 476507
50905D76507j1755j0335r586r095q535p703o429m677k648p44O48J285J216P87
$$ 476507 464752 454417 444831 435736 427201 419498 413069 408392 405744 405000 405648 406933 408149 408936
50891D08936M95N93Q86J006R75J193J826K461K722K940L731N005N952O119O001
$$ 408936 409431 410024 410910 411916 412891 414084 415910 418371 421093 424033 427764 432769 438721 444840 450841
50876D50841O317P152Q097Q912R696J0622J1779J3110J4346J5194J5763J6553
$$ 450841 457158 464310 472407 481319 491015 501637 513416 526526 540872 556066 571829 588382
50864E88382J7920J9777K1988K4657K7878L1472L5308L9570M4515N0136N6328
$$ 588382 606302 626079 648067 672724 700602 732074 767382 806952 851467 901603 957931
50853I57931O3090P0423P8296Q6816R6063J05632J14733J22935J30375J37052
$$ 957931 1021021 1091444 1169740 1256556 1352619 1458251 1572984 1695919 1826294 1963346
50843A963346J42449J46110J47951J47562J43796J35683J23448J08073R0237P0240
$$ 1963346 2105795 2251905 2399856 2547418 2691214 2826897 2950345 3058418 3148655 3218895
50833C218895M8629K6271M009j7217l6109n1458o2826p0458p4703p5888p4453
$$ 3218895 3267524 3293795 3297804 3280587 3244478 3193020 3130194 3059736 2985033 2909145 2834692
50822B834692p0717o4744n6866m8214m0372l4649l1848l2207l5125l9430m4499
$$ 2834692 2763975 2699231 2642365 2594151 2553779 2519130 2487282 2455075 2419950 2380520 2336021
50811B336021n0754n8541o7020p4832q1382q6647r0257r1804r1778r1095q9660
$$ 2336021 2285267 2226726 2159706 2084874 2003492 1916845 1826588 1734784 1643006 1551911 1462251
50800A462251q6486q1345p5326o9445o3593n7278n0725m4661l9448l4834l0335
$$ 1462251 1375765 1294420 1219094 1149649 1086056 1028778 978053 933392 893944 859110 828775
50789H28775k5634k0841j6478j2930r966p108m366k133m54J013K269K815K355
$$ 828775 803141 782300 765822 752892 742926 735818 731452 729319 728865 729878 732147 734962 737317
50776G37317J197j54j361k103k185j957k138k988m049m933n872p152q359q696
$$ 737317 738514 738360 736999 734896 732711 730754 728616 725628 721579 716646 710774 703622 695263 686567
50762F86567p886o562n665n583n802n455m170k292k49J932M271O416Q061R517
$$ 686567 678681 672119 666454 660871 655069 649614 645444 643152 642903 644835 649106 655522 663583 673100
50748F73100J1409J3964J6984K0260K3518K6252K8332L0615L4170L8913M3716
$$ 673100 684509 698473 715457 735717 759235 785487 813819 844434 878604 917517 961233
50737I61233M7964N2243N7305O3137O9311P5659Q2069Q8096R3157R6930R9230
$$ 961233 1009197 1061440 1118745 1181882 1251193 1326852 1408921 1497017 1590174 1687104 1786334
50726A786334R9749R8190R4559Q9097Q2019P3286O2556M9462L4166J7551O00j6184
$$ 1786334 1886083 1984273 2078832 2167929 2249948 2323234 2385790 2435252 2469418 2486969 2487569 2471385
50714B471385l2451m7309n9462o7984p2579p3416p1110o6800o1541n5708m9392
$$ 2471385 2438934 2391625 2332163 2264179 2191600 2118184 2047074 1980274 1918733 1863025 1813633
50703A813633m3093l7363l2079k7018k3100k1895k3667k6943l0477l4655m0240
$$ 1813633 1770540 1733177 1701098 1674080 1650980 1629085 1605418 1578475 1547998 1513343 1473103
50692A473103m6569n1917n5315n7122n7954n7773n6189n3184m9274m5108m0975
$$ 1473103 1426534 1374617 1319302 1262180 1204226 1146453 1090264 1037080 987806 942698 901723
50681I01723l6733l2233k7713k3510j9556j5489j1279p300l701j64L455O747R289
$$ 901723 864990 832757 805044 781534 761978 746489 735210 727910 724209 724045 727500 734247 743536
50668G43536J1364J3652J6334J8752K0076K0195J9922K0160K0905K1184K0133
$$ 743536 754900 768552 784886 803638 823714 843909 863831 883991 904896 926080 946213
50657I46213J7949J5676J4223J3774J3892J3894J3398J2754J2687J3322J4000
$$ 946213 964162 979838 994061 1007835 1021727 1035621 1049019 1061773 1074460 1087782 1101782
50646A101782J4465J5586J8244K1974K5554K8617L1732L5121L8334M1277M4487
$$ 1101782 1116247 1131833 1150077 1172051 1197605 1226222 1257954 1293075 1331409 1372686 1417173
50635A417173M8142N1545N3908N4999N4821N3344N0768M7483M3458L8247L1811
$$ 1417173 1465315 1516860 1570768 1625767 1680588 1733932 1784700 1832183 1875641 1913888 1945699
50624A945699K4829J8040J1799O366K063r76k703k805j092J818M916P940J1305
$$ 1945699 1970528 1988568 2000367 2006733 2008796 2007820 2005117 2002312 2001220 2003038 2007954 2015894 2027199
50611B027199J4791J7270J7982J7235J5587J3122R954O556L043j133o401j2592
$$ 2027199 2041990 2059260 2077242 2094477 2110064 2123186 2133140 2139696 2142739 2141606 2135205 2122613
50599B122613j9600k7636l6263m4056n0015n4755n9523o4442o8417p0527p0796
$$ 2122613 2103013 2075377 2039114 1995058 1945043 1890288 1830765 1766323 1697906 1627379 1556583
50588A556583o9782o7925o5349o2004n8040n4002n0446m7339m4266m1120l8028
$$ 1556583 1486801 1418876 1353527 1291523 1233483 1179481 1129035 1081696 1037430 996310 958282
50577I58282l4765l0971k6992k3623k0951j8360j5748j3599j1665q890n201j957
$$ 958282 923517 892546 865554 841931 820980 802620 786872 773273 761608 752718 747517 745560
50565G45560R7K034M893P883R795J1176J3400J6263J8219J8820J9374K1045K3682
$$ 745560 745657 747691 752584 760467 770262 781438 794838 811101 829320 848140 867514 888559 912241
50552I12241K6689K9833L2741L4693L5509L5999L6978L8193L8642L7729L5848
$$ 912241 938930 968763 1001504 1036197 1071706 1107705 1144683 1182876 1221518 1259247 1295095
50541A295095L3982L2826L2323L2022L1872L2284L3328L4440L5312L6557L8949
$$ 1295095 1329077 1361903 1394226 1426248 1458120 1490404 1523732 1558172 1593484 1630041 1668990
50530A668990M2374M6201N0311N5072O0454O5908P1151P6393Q1704Q6602R0451
$$ 1668990 1711364 1757565 1807876 1862948 1923402 1989310 2060461 2136854 2218558 2305160 2395611
50519B395611R2962R4156R3934R1700Q6550P8180O7539N6044M3985L0456J5155
$$ 2395611 2488573 2582729 2676663 2768363 2854913 2933093 3000632 3056676 3100661 3131117 3146272
50508C146272o17j5423k9260m2752n5428o5995p4019q0060q4092q5032q2178p6238
$$ 3146272 3145655 3130232 3100972 3058220 3002792 2936797 2862778 2782718 2698626 2613594 2531416 2455178
50496B455178o8362n8840m7382l4348k1065q920J605J0882J9257K6363L1320L3423
$$ 2455178 2386816 2327976 2280594 2246246 2225181 2216261 2217866 2228748 2248005 2274368 2305688 2339111
50484B339111L2283K7436J8492N909q924k4704m0835n6696p0870q1850q9239r3728
$$ 2339111 2371394 2398830 2417322 2423231 2414307 2389603 2348768 2292072 2221202 2139352 2050113 1956385
50472A956385r6069r6495r4973r1548q6553q0762p5064o9693o4106n7925n1563
$$ 1956385 1860316 1763821 1668848 1577300 1490747 1409985 1334921 1265228 1201122 1143197 1091634
50461A091634m5620m0149l4993l0336k6345k2743j9253j6022j3061r831o034k362
$$ 1091634 1046014 1005865 970872 940536 914191 891448 872195 856173 843112 833281 827247 824885
50449H24885L61K382M555P118R692J2186J4766J7143J8836K0025K1396K3176K5021
$$ 824885 825246 827628 832183 839301 848993 861179 875945 893088 911924 931949 953345 976521 1001542
50436A001542K6688K8127K9193K9955L0986L2539L3789L3835L3124L2828L2991
$$ 1001542 1028230 1056357 1085550 1115505 1146491 1179030 1212819 1246654 1279778 1312606 1345597
50425A345597L2577L1286L0018K9265K8207K6006K3042K0357J8581J7806J7889
$$ 1345597 1378174 1409460 1439478 1468743 1496950 1522956 1545998 1566355 1584936 1602742 1620631
50414A620631J8404J8885J9498K0911K3244K5626K7192K8024K8790K9825L0809
$$ 1620631 1639035 1657920 1677418 1698329 1721573 1747199 1774391 1802415 1831205 1861030 1891839
50403A891839L1076L0069K7798K4849K1686J8042J3390P809J796m603j1868k0205
$$ 1891839 1922915 1952984 1980782 2005631 2027317 2045359 2058749 2066558 2068354 2063751 2051883 2031678
50391B031678k9364l9054m8765n7292o3365o6963o9176p0644p0861o9197o5746
$$ 2031678 2002314 1963260 1914495 1857203 1793838 1726875 1657699 1587055 1516194 1446997 1381251
50380A381251o0898n4878m8003m0675l2831k4187j5236p240p87M808J0233J5045
$$ 1381251 1320353 1265475 1217472 1176797 1143966 1119779 1104543 1097303 1096516 1101324 1111557 1126602
50368A126602J8337J9735J9134J6209J1008M512k189q906j5845k2490k7801l1401
$$ 1126602 1144939 1164674 1183808 1200017 1211025 1215537 1213348 1204442 1188597 1166107 1138306 1106905
50356A106905l3766l5298l5834l5257l4009l2676l1370k9773k7700k5396k3256
$$ 1106905 1073139 1037841 1002007 966750 932741 900065 868695 838922 811222 785826 762570
50345G62570k1412j9723j8077j6471j4757j2677j0380q463p166n930m255k540
$$ 762570 741158 721435 703358 686887 672130 659453 649073 640610 633444 627514 623259 620719
50333F20719j455p87K64J836L467N149P374R926J1790J2582J3134J4236J5628
$$ 620719 619264 618477 618741 620577 624044 629193 636567 646493 658283 670865 683999 698235 713863
50320G13863J6684J7327J7699J7755J7707J8189J9300K0163K0131J9880K0446
$$ 713863 730547 747874 765573 783328 801035 819224 838524 858687 878818 898698 919144
50309I19144K1631K2311K1976K1060J9829J7985J5578J3448J2234J1379R679O690
$$ 919144 940775 963086 985062 1006122 1025951 1043936 1059514 1072962 1085196 1096575 1106254 1112944
50297A112944L177P4k528n049p342q711r144r723j1239j2975j3777j3892j4725
$$ 1112944 1116121 1116195 1113667 1108618 1101276 1092565 1083421 1073698 1062459 1049484 1035707 1021815 1007090
50284A007090j6813j9184k0830k1758k2240k2116k1465k1025k1179k1232k0445
$$ 1007090 990277 971093 950263 928505 906265 884149 862684 841659 820480 799248 778803
50273G78803j9185j8280j7706j6824j5567j4643j4543j5014j5382j5072j3836
$$ 778803 759618 741338 723632 706808 691241 676598 662055 647041 631659 616587 602751
50262F02751j1918r860q027o476n348m809m472l528j910o05k59j83N67J736K390
$$ 602751 590833 580973 572946 566470 561122 556313 551841 548313 546403 545798 545539 545356 545923 547659 550049
50247E50049K367K263K255K037J709J749K048J966J451J146J177Q19k32j121r92
$$ 550049 552416 554679 556934 558971 560680 562429 564477 566443 567894 569040 570217 571036 570804 569683 568691
50232E68691k84j28q72j882k614l169l738m064l814l175k774k954l372l401k827
$$ 568691 568407 568279 567407 565525 562911 559742 556004 551940 548126 544951 542177 539223 535851 532450 529623
50217E29623j976j184m26L70R64J113J140J721K972M108M319L805L537L989M501
$$ 529623 527647 526463 526037 526407 527371 528484 529624 531345 534317 538425 542744 546549 550086 554075 558576
50202E58576M155L034K137K093K397K231J638J392J843K388K239J318K16m54n02
$$ 558576 562731 565765 567902 569995 572392 574623 576261 577653 579496 581884 584123 585441 585657 585203 584701
50187E84701r9M30P65O71P8q94k002l094m239n481o523o979p009p199p594p327
$$ 584701 584602 585032 585797 586468 586546 585652 583650 580556 576317 570836 564313 557334 550325 543126 535532 528205
50171E28205n720l357j451m19L07J224K238L095L605L407K194K71j613l121m504
$$ 528205 522485 519128 517677 517258 517565 518789 521027 524122 527727 531134 533328 533599 531986 528865 524361
50156E24361n916p154q069q625q508p422n866m853m619m436l890l544l861m254
$$ 524361 518445 511291 503222 494597 486089 478667 472801 467948 463329 458893 455003 451459 447598 443344
50142D43344l908k913k020j601j479j400j265j029p98q10j047j082n56N44K033
$$ 443344 439436 436523 434503 432902 431423 430023 428758 427729 426931 426121 425074 423992 423436 423980 426013
50127D26013L594M573M460L741L636M612N804O234N979N632N344N023M901N230
$$ 426013 429607 434180 438640 442381 446017 450629 456433 462667 468646 474278 479622 484645 489546 494776
50113D94776N697N765N310M505L473K424J817J800J920J745J382R44J49j063j973
$$ 494776 500473 506238 511548 516053 519526 521950 523767 525567 527487 529232 530614 531558 531707 530644 528671
50098E28671j902j168n73l33j78j45m48p98o10J85J152K128L362M897O353P321
$$ 528671 526769 525601 525028 524695 524517 524372 523924 523126 522516 522701 523853 525981 529343 534240 540593 547914
50082E47914P688P627P557P885Q554R101R419R987J1034J2024J2501J2904J3869
$$ 547914 555602 563229 570786 578671 587225 596326 605745 615732 626766 638790 651291 664195 678064
50069F78064J5178J6188J6844J7427J7546J6386J4034J1691J0380R948R484Q290
$$ 678064 693242 709430 726274 743701 761247 777633 791667 803358 813738 823686 833170 841460
50057H41460O394M505L469L425L558K985J703M07m23r21j532k626m117n219n057
$$ 841460 847854 852359 855828 859253 862811 865796 867499 867906 867483 866562 865030 862404 858287 853068 848011
50042H48011l859l045l637n084o212o713p037p382p682q109q750r115q824q360
$$ 848011 844152 841107 837470 832386 826174 819461 812424 805042 797360 789251 780501 771386 762562 754202
50028G54202q290q186p377o413o432p348p820p164o048n178m461l817l709m353
$$ 754202 745912 737726 730349 723936 717504 710156 702336 695172 689124 683946 679485 675668 671959 667606
50014F67606n199n625n434m452k464J03K230L448M322N437O572P282P670Q128
$$ 667606 662407 656782 651348 646896 644432 644535 646765 650213 654535 659972 666544 673826 681496 689624
50000F89624Q814R799J1191J2765J3983J4787J5918J7969K0523K2559K3436K3209
$$ 689624 698438 708237 719428 732193 746176 760963 776881 794850 815373 837932 861368 884577
49988H84577K2173K0434J7794J4001R317M727J168j366l395m782m727l163j277
$$ 884577 906750 927184 944978 958979 968296 973023 974191 972825 969430 964648 959921 956758 955481
49975I55481l10l62q94j852l762o966j1179j5686j9742k3023k5793k8409l0583
$$ 955481 955171 954809 953915 952063 948301 941335 930156 914470 894728 871705 845912 817503 786920
49962G86920l1536l0976k9462k7635k5527k2916j9995j7327j5362j4217j3745
$$ 786920 755384 724408 694946 667311 641784 618868 598873 581546 566184 551967 538222
49951E38222j3582j3267j2470j1159r593q271p653p632p489o756n801n198m830
$$ 538222 524640 511373 498903 487744 478151 469880 462227 454595 447106 440350 434549 429351 424521
49938D24521m248l595l380l464l197k501j932j547p13P22J969K439K518K768L059
$$ 424521 420273 416678 413298 409834 406637 404136 402204 400657 399944 400666 402635 405074 407592 410360 413419
49923D13419L064K885K693K324J742J355J417J557J447J341J526J713J538J146
$$ 413419 416483 419368 422061 424385 426127 427482 428899 430456 431903 433244 434770 436483 438021 439167
49909D39167P44Q9q92j479r22M15J397J473J059P26O62R23J618K694L892M981
$$ 439167 439911 440000 439108 437629 436707 437122 438519 439992 441051 441777 442439 443362 444980 447674 451566 456547
49893D56547N808O250O426O767P606Q774R907J1007J2340J3966J5674J7389J9269
$$ 456547 462355 468605 475031 481798 489404 498178 508085 519092 531432 545398 561072 578461 597730
49880E97730K1479K4078K7102L0456L3805L6752L9046M0486M0766L9735L7679
$$ 597730 619209 643287 670389 700845 734650 771402 810448 850934 891700 931435 969114
49869I69114L5117L2311K9273K6162K3416K1421K0213J9547J9197J9070J9065
$$ 969114 1004231 1036542 1065815 1091977 1115393 1136814 1157027 1176574 1195771 1214841 1233906
49858A233906J8795J7535J4604R825L629l242j0087j6457k2160k7100l1055l3810
$$ 1233906 1252701 1270236 1284840 1294665 1298294 1295052 1284965 1268508 1246348 1219248 1188193 1154383
49846A154383l5561l6906l8157l9005l9161l8944l8733l8205l6702l4202l1314
$$ 1154383 1118822 1081916 1043759 1004754 965593 926649 887916 849711 813009 778807 747493
49835G47493k8523k6140k4612k3993k3202k0973j7639j4937j3720j2955j1477
$$ 747493 718970 692830 668218 644225 621023 600050 582411 567474 553754 540799 529322
49824E29322r684q729q786r018q764q000p011o202n906n854n272l971k879k863
$$ 529322 519638 510909 502123 493105 484341 476341 469330 463128 457222 451368 446096 442125 439246 436383
49810D36383l531l849l514k957k375j625q80n80o81o37j85L02L56j57r96j686
$$ 436383 432852 429003 425489 422532 420157 418532 417652 417072 416391 415754 415569 415871 416227 416070 415074 413388
49794D13388j747j193o01l50j80J49J68o36j746k049j257j99L48M07L11J18j68
$$ 413388 411641 410448 409847 409497 409317 409466 409634 408998 407252 405203 403946 403747 404095 404502 404813 404931 404763
49777D04763l21j20L82J007J613K043K200K243K480K986L554M057M580N273O222
$$ 404763 404442 404322 404704 405711 407324 409367 411567 413810 416290 419276 422830 426887 431467 436740 442962
49762D42962P492R008J0526J1947J3554J5675J8205K0867K3682K6798K9896L2249
$$ 442962 450454 459462 469988 481935 495489 511164 529369 550236 573918 600716 630612 662861
49750F62861L3390L3303L1962K9279K5612K1779J8309J5051J1811R008P315O896
$$ 662861 696251 729554 761516 790795 816407 838186 856495 871546 883357 892365 899680 906576
49738I06576P285P924Q503Q867Q766P724N145P58m886j0629j5632j9981k4158
$$ 906576 913861 921785 930288 939155 947921 955645 960790 961548 956662 946033 930401 910420 886262
49725H86262k8116l1240l3056l3555l2820l0844k8029k5291k3272k1623j9600
$$ 886262 858146 826906 793850 760295 727475 696631 668602 643311 620039 598416 578816
49714E78816j7117j4755j2785j0924r036p460o407n623n040m995n407n357m182
$$ 578816 561699 546944 534159 523235 514199 506739 500332 494709 489669 484674 479267 473910 469728
49701D69728k497j350p63pJ002J585J496J231J019N08l43q37n06K47P97J050J160
$$ 469728 467231 465881 465118 465111 466113 467698 469194 470425 471444 471952 471609 470772 470266 470513 471310 472360 473520
49684D73520J064P13L28Q7r0k59l65n23r30j420j602j493j336r00J86J395J680
$$ 473520 474584 475297 475625 475712 475622 475363 474998 474475 473545 472125 470523 469030 467694 466794 466980 468375 470055
49667D70055J134J072J982K690K244J377J114J089N30q3J90R84J174P65P66J379
$$ 470055 471189 472261 474243 476933 479177 480554 481668 482757 483287 483204 483394 484378 485552 486317 487083 488462
49651D88462J813J791J807J820J107k48j144j134j058j456j582p73K63M92J36
$$ 488462 490275 492066 493873 495693 496800 496552 495408 494274 493216 491760 490178 489405 489668 490160 490296
49636D90296J61P36J191J247J293J515J556J229Q75Q19R15Q97Q22Q93J098J293
$$ 490296 490457 491193 492384 493631 494924 496439 497995 499224 500099 500918 501833 502730 503552 504445 505543 506836
49620E06836J528J948K446K689K680K911L766M864N405N113M536M377M826N591
$$ 506836 508364 510312 512758 515447 518127 521038 524804 529668 535073 540186 544722 549099 553925 559516
49606E59516O257O513O379O282O639P275P657P748Q093Q926R732R984R866R896
$$ 559516 565773 572286 578665 584947 591586 598861 606518 614266 622359 631285 641017 651001 660867 670763
$$ [...]
##END NTUPLES=NMR SPECTRUM
##END=
