
##TITLE=AC1240__6945241_x3iRVr0fXr
##JCAMPDX= 6.0         $$ Bruker NMR JCAMP-DX V2.0
##DATA TYPE= NMR SPECTRUM
##DATA CLASS= NTUPLES
##ORIGIN= BRUKER
##OWNER= Administrator
$$ 1.72 TOPSPIN		Version 2.1
$$ 2012-10-18 13:36:01.817 -0700  Administrator@X
$$ Compression mode = diff/dup
##.OBSERVE FREQUENCY= 400.02188249412
##.OBSERVE NUCLEUS= ^1H
##.ACQUISITION MODE= SIMULTANEOUS (DQD)
##.ACQUISITION SCHEME= undefined
##.AVERAGES= 64
##.DIGITISER RES= 22
##SPECTROMETER/DATA SYSTEM= spect
##.PULSE SEQUENCE= noesygpps1d.comp
##.SOLVENT NAME= COFFEE_meoh
##.SHIFT REFERENCE= INTERNAL, COFFEE_meoh, 1, 14.96088
##AUDIT TRAIL= $$ (NUMBER, WHEN, WHO, WHERE, PROCESS, VERSION, WHAT)
$$ ##TITLE= Audit trail, TOPSPIN		Version 2.1
$$ ##JCAMPDX= 5.01
$$ ##ORIGIN= Bruker BioSpin GmbH
$$ ##OWNER= Administrator
$$ $$ C:\Bruker\TOPSPIN/data/COFFEE/nmr/AC1240__6945241_x3iRVr0fXr/12/pdata/1/auditp.txt
$$ ##AUDIT TRAIL=  $$ (NUMBER, WHEN, WHO, WHERE, PROCESS, VERSION, WHAT)
(   1,<2012-10-13 20:04:34.937 -0500>,<Administrator>,<TOPSPIN>,<go>,<TOPSPIN 2.1>,
      <created by zg
	started at 2012-10-13 19:53:04.703 -0500,
	POWCHK enabled, PULCHK disabled,
       configuration hash MD5:
       6B 1B 68 BB D9 2E 58 E2 7F 35 AD 54 07 DF 0E 41
       data hash MD5: 64K
       A0 16 11 18 C2 8D 7B 05 67 D6 BD 6A 0F D5 A4 2C>)
(   2,<2012-10-13 20:04:37.531 -0500>,<Administrator>,<TOPSPIN>,<proc1d>,<TOPSPIN 2.1>,
      <Start of raw data processing
       efp LB = 0.3 FT_mod = 6 PKNL = 1 PHC0 = 0 PHC1 = 0 SI = 128K 
       data hash MD5: 128K
       D5 F9 EC 4B 66 6D 05 18 DB E3 CF 0A F5 AE 4E 20>)
(   3,<2012-10-13 20:04:38.718 -0500>,<Administrator>,<TOPSPIN>,<proc1d>,<TOPSPIN 2.1>,
      <pk PHC0 = 3.548584 PHC1 = 0 
       data hash MD5: 128K
       FB 1A 7E 9F 55 B3 55 57 9E EF 8B 8B 4C CA C4 EF>)
(   4,<2012-10-13 20:04:38.953 -0500>,<Administrator>,<TOPSPIN>,<proc1d>,<TOPSPIN 2.1>,
      <abs ABSG = 1 
       data hash MD5: 128K
       59 C0 A6 7A 85 84 9E 88 F0 DE 85 BC AC 94 45 F1>)
(   5,<2012-10-13 20:04:39.062 -0500>,<Administrator>,<TOPSPIN>,<proc1d>,<TOPSPIN 2.1>,
      <abs ABSG = 2 
       data hash MD5: 128K
       B4 E3 54 82 6F D7 5A 50 24 88 65 19 28 D3 1D 1B>)
(   6,<2012-10-13 20:04:39.109 -0500>,<Administrator>,<TOPSPIN>,<proc1d>,<TOPSPIN 2.1>,
      <abs ABSG = 3 
       data hash MD5: 128K
       3D 7B 31 F0 9F 18 FF 37 A7 29 8A A3 83 ED 60 81>)
(   7,<2012-10-13 20:04:39.171 -0500>,<Administrator>,<TOPSPIN>,<proc1d>,<TOPSPIN 2.1>,
      <abs ABSG = 4 
       data hash MD5: 128K
       6E 57 CE 85 4E 13 90 1C EA 33 E8 77 60 A0 B1 9F>)
(   8,<2012-10-13 20:04:39.234 -0500>,<Administrator>,<TOPSPIN>,<proc1d>,<TOPSPIN 2.1>,
      <abs ABSG = 5 
       data hash MD5: 128K
       F6 FC 66 16 39 84 F1 4F CC FC D2 7B 08 80 00 6A>)
(   9,<2012-10-13 20:04:39.468 -0500>,<Administrator>,<TOPSPIN>,<audit>,<TOPSPIN 2.1>,
      <user comment:
       ICON-NMR User ID: COFFEE
       data hash MD5: 128K
       F6 FC 66 16 39 84 F1 4F CC FC D2 7B 08 80 00 6A>)
$$ [...]
##$TP07= 0
##$TPNAME0= <>
##$TPNAME1= <>
##$TPNAME2= <>
##$TPNAME3= <>
##$TPNAME4= <>
##$TPNAME5= <>
##$TPNAME6= <>
##$TPNAME7= <>
##$TPOAL= (0..7)
0.5 0.5 0.5 0.5 0.5 0.5 0.5 0.5
##$TPOFFS= (0..7)
0 0 0 0 0 0 0 0
##$TUNHIN= 0
##$TUNHOUT= 0
##$TUNXOUT= 0
##$USERA1= <user>
##$USERA2= <user>
##$USERA3= <user>
##$USERA4= <user>
##$USERA5= <user>
##$V9= 5
##$VALIST= <valist>
##$VCLIST= <CCCCCCCCCCCCCCC>
##$VD= 0
##$VDLIST= <DDDDDDDDDDDDDDD>
##$VPLIST= <PPPPPPPPPPPPPPP>
##$VTLIST= <TTTTTTTTTTTTTTT>
##$WBST= 2048
##$WBSW= 25
##$XGAIN= (0..3)
0 0 0 0
##$XL= 0
##$YL= 0
##$YMAX_a= 12391532
##$YMIN_a= -9233414
##$ZGOPTNS= <>
##$ZL1= 120
##$ZL2= 120
##$ZL3= 120
##$ZL4= 120
##$ABSF1= 14.96088
##$ABSF2= -5.597301
##$ABSG= 5
##$ABSL= 3
##$ALPHA= 0
##$AQORDER= 0
##$ASSFAC= 0
##$ASSFACI= 0
##$ASSFACX= 0
##$ASSWID= 0
##$AUNMP= <proc_prof1d_extract.lims>
##$AXLEFT= 0
##$AXNAME= <>
##$AXNUC= <1H>
##$AXRIGHT= 0
##$AXTYPE= 0
##$AXUNIT= <>
##$AZFE= 0.1
##$AZFW= 0.1
##$BCFW= 0
##$BC_mod= 0
##$BYTORDP= 0
##$COROFFS= 0
##$CY= 15
##$DATMOD= 1
##$DC= 0
##$DFILT= <>
##$DTYPP= 0
##$F1P= 0
##$F2P= 0
##$FCOR= 0.5
##$FTSIZE= 131072
##$FT_mod= 6
##$GAMMA= 0
##$GB= 0
##$INTBC= 1
##$INTSCL= 1
##$ISEN= 128
##$LB= 0.3
##$LEV0= 0
##$LPBIN= 0
##$MAXI= 10000
##$MC2= 0
##$MEAN= 0
##$ME_mod= 0
##$MI= 0
##$NCOEF= 0
##$NC_proc= -2
##$NLEV= 6
##$NOISF1= 0
##$NOISF2= 0
##$NSP= 0
##$NTH_PI= 0
##$NZP= 0
##$OFFSET= 14.96088
##$PC= 1
##$PHC0= 3.548584
##$PHC1= 0
##$PH_mod= 1
##$PKNL= yes
##$PPARMOD= 0
##$PPDIAG= 0
##$PPIPTYP= 0
##$PPMPNUM= 2147483647
##$PPRESOL= 1
##$PSCAL= 4
##$PSIGN= 0
##$PYNMP= <proc.py>
##$REVERSE= no
##$SF= 400.020009685751
##$SI= 131072
##$SIGF1= 0
##$SIGF2= 0
##$SINO= 400
##$SIOLD= 131072
##$SPECTYP= <>
##$SREGLST= <1H.CDCl3>
##$SSB= 0
##$STSI= 131072
##$STSR= 0
##$SW_p= 8223.68421052631
##$SYMM= 0
##$S_DEV= 0
##$TDeff= 65536
##$TDoff= 0
##$TI= <>
##$TILT= no
##$TM1= 0
##$TM2= 0
##$TOPLEV= 0
##$USERP1= <user>
##$USERP2= <user>
##$USERP3= <user>
##$USERP4= <user>
##$USERP5= <user>
##$WDW= 1
##$XDIM= 131072
##$YMAX_p= 307777871
##$YMIN_p= -11518
##$CURPLOT= <Network HP LaserJet P1505>
##$CURPRIN= <$Network HP LaserJet P1505>
##$DFORMAT= <normdp>
##$LAYOUT= <+/1D_H.xwp>
##$LFORMAT= <normlp>
##$PFORMAT= <normpl>
##$SURQMSG= 1
$$ End of Bruker specific parameters
$$ ---------------------------------
##NTUPLES= NMR SPECTRUM
##VAR_NAME=  FREQUENCY,     SPECTRUM/REAL,   SPECTRUM/IMAG
##SYMBOL=    X,             R,               I
##VAR_TYPE=  INDEPENDENT,   DEPENDENT,       DEPENDENT
##VAR_FORM=  AFFN,          ASDF,            ASDF
##VAR_DIM=   131072,        131072,          131072
##UNITS=     HZ,            ARBITRARY UNITS, ARBITRARY UNITS
##FACTOR=    0.0627417313425164, 1,          1
##FIRST=     8223.62146879497, 2283,         -58381
##LAST=      0,             3402,            -58207
##MIN=       0,             -11518,          0
##MAX=       8223.62146879497, 307777871,    0
$$ Real data points
##PAGE= N=1
##DATA TABLE= (X++(R..R)), XYDATA
$$ [...]
64011C52735l716l414l434l422k767j527l53K46K90K14M66J181K083K810L220
63996C44612L350L276L255L716M683N476N517N215N476O401P197P458P718Q482
63982D21832R402R902J0087J0471J1139J1737J2101J2376J2627J2713J2563J2294
63970E59244J2107J2259J3025J4411J5953J7108J7837J8662K0115K2196K4368
63959G47285K6123K7627K9708L2998L7145M1323M5430N0227N6141O2627O9103
63948A225737P5944Q3894R2881J02110J11063J19583J27193J33154J37377J40445
63938B349381J42465J42550J39799J34153J25908J14932J00945Q4235O5501M5317
63928C445186K4271L315j6799l6346n6091p5788r3862j08896j20760j29897j36204
$$ plain form
64011 352735 349019 345605 342171 338749 335982 334455 334102 334348 334638 334852 335318 336499 338582 341392 344612
63996 344612 347962 351238 354493 358209 362892 368368 373885 379100 384576 390977 398174 405632 413350 421832
63982 421832 431234 441136 451223 461694 472833 484570 496671 509047 521674 534387 546950 559244
63970 559244 571351 583610 596635 611046 626999 644107 661944 680606 700721 722917 747285
63959 747285 773408 801035 830743 863741 900886 942209 987639 1037866 1094007 1156634 1225737
63948 1225737 1301681 1385575 1478456 1580566 1691629 1811212 1938405 2071559 2208936 2349381
63938 2349381 2491846 2634396 2774195 2908348 3034256 3149188 3250133 3334368 3399869 3445186
63928 3445186 3469457 3472772 3455973 3419627 3363536 3287748 3193886 3084990 2964230 2834333 2698129
63917B698129j39357j39855j38812j36653j32789j26768j19082j10528j01364
63908A552921r1613q1816p2812o4956n7995n1695m6044m0909l6013l1412k7519
63897I50137k4513k2088j9932j8052j6488j5073j3782j2888j2504j2235j1612
63886G70970j0608r356p729n612l363j495n0J274K521L565M694O473Q862J1142
63872G71288J2845J4227J5559J6533J6881J7051J7703J8692J9186J8741J7728
63861I56434J6635J5454J3911J1930R619P026M182J229j689m623p630j0505j2931
63848I99042j4936j6930j9163k1336k2972k4088k5204k6564k7620k7605k6597
63837G46027k5612k5487k5886k5779k4798k3612k2845k2108k0647j8638j7098
$$ plain form
63917 2698129 2558772 2418917 2280105 2143452 2010663 1883895 1764813 1654285 1552921
63908 1552921 1461308 1379492 1306680 1241724 1183729 1132034 1085990 1045081 1009068 977656 950137
63897 950137 925624 903536 883604 865552 849064 833991 820209 807321 794817 782582 770970
63886 770970 760362 751006 743277 737665 734302 732807 732757 734031 736552 740117 744811 751284 760146 771288
63872 771288 784133 798360 813919 830452 847333 864384 882087 900779 919965 938706 956434
63861 956434 973069 988523 1002434 1014364 1023983 1031009 1035191 1036420 1034731 1030108 1022478 1011973 999042
63848 999042 984106 967176 948013 926677 903705 879617 854413 827849 800229 772624 746027
63837 746027 720415 694928 669042 643263 618465 594853 572008 549900 529253 510615 493517
63826D93517j6466j5959j4751j3193j2185j1775j1141r927q699p900p154o085
63814C58282n193n204n877o145n486m563m360n021n732n612m631l665l567m188
63800B89038m540m000k983k223j869j723j957k848l980m396l732k565j587r61
63786B49674o43p26j159j565j736j898k217k385k071j427p92k14L43N97K56m01
63770B33636p36n44l03n48j285k024k196j594n47L83R57J346J586J364O05j03
63754B29997k01nk45q87j114n29K94P41R30J130J080N05k6L44J433K015J445N41
63736B37448N15J414K278K531K569K850L076K649J581N70K47O36J307J803J968
63721B63442K059K446L042L178K395J189N05N27N19j3o43q47r31j467k247k512
$$ plain form
63826 493517 477051 461092 446341 433148 420963 409188 398047 388120 379421 371521 364367 358282
63814 358282 353089 347885 342008 335863 330377 325814 321454 316433 310701 305089 300458 296793 293226 289038
63800 289038 284498 280498 277515 275292 273423 271700 269743 266895 262915 258519 254787 252222 250635 249674
63786 249674 249031 248305 247146 245581 243845 241947 239730 237345 235274 233847 233055 232841 233184 233781 234037 233636
63770 233636 232900 232356 232053 231505 230220 228196 226000 224406 223859 224242 225199 226545 228131 229495 230100 229997
63754 229997 229796 229791 229546 228659 227545 227016 227310 228051 228981 230111 231191 231696 231670 232014 233447 235462 236907 237448
63736 237448 237963 239377 241655 244186 246755 249605 252681 255330 256911 257481 257728 258364 259671 261474 263442
63721 263442 265501 267947 270989 274167 276562 277751 278256 278783 279302 279289 278646 277799 276868 275401 273154 270642
63705B70642k126j757j784j693r01L05J125J251J127J275J731K075J919J366J097
63690B75652J765L117L921L187J402J76N30J848K658K201R61j28n97n62l20p9
63674B95732M3jj15n6L90J164J799J722Q15l07p99m56J27K87l1m97r60j476j951
63655B95430k170k139k077k012j789j470j363j501j450q75RP69J305J799K262
63640B84728K503K465K361K473K879L430L921M307M700N044M950M223L450L618
63626C35052M907O370P098P241P487Q025Q634R487J1077J3311J5334J6457J6790
63613D67270J6856J7023J7466J8276J9290K0075K0299J9935J9001J7387J5071
63602F67949J2268R165N781K293p84l014m522n700o627p066p053p076p627q744
$$ plain form
63705 270642 268516 266759 264975 263282 262381 262686 263811 265062 266189 267464 269195 271270 273189 274555 275652
63690 275652 277417 280534 284455 287642 289044 289220 289750 291598 294256 296457 297418 297290 296693 296131 295811 295732
63674 295732 295775 295774 295659 295603 295993 297157 298956 300678 301493 301186 300387 299931 300058 300345 300314 299817 298857 297381 295430
63655 295430 293260 291121 289044 287032 285243 283773 282410 280909 279459 278584 278593 279362 280667 282466 284728
63640 284728 287231 289696 292057 294530 297409 300839 304760 309067 313767 318811 323761 327984 331434 335052
63626 335052 339959 346329 353427 360668 368155 376180 384814 394301 405378 418689 434023 450480 467270
63613 467270 484126 501149 518615 536891 556181 576256 596555 616490 635491 652878 667949
63602 667949 680217 689382 695163 697456 696672 693658 689136 683436 676809 669743 662690 655614 647987 639243
63588F39243j0117j1491j2735j3699j4241j4429j4446j4203j3356j1905j0467
63577D98154r591q927p634n592l685k653k215j632o30O50K171L859N218N794N891
63562D79178O270P146Q054Q652R074R512J0079J1141J3134J5759J8003J9274K0053
63549F35329K1115K2494K3630K4084K3731K2449K0002J6195J1003M824j340o291
63537H17225r465j1107j1614j1205j0328r761r795r844r429r122r932j2005j4596
63524F79022j7071j9230k0804k1426k1276k1039k1008k0708j9704j8269j6964
63513D61523j5860j4628j3174j1806j0728r680q219o345m675l863l823l718k886
63500C52118j646r59j307k151k569k245j675j517j858k198j979j106N7J004J335
$$ plain form
63588 639243 629126 617635 604900 591201 576960 562531 548085 533882 520526 508621 498154
63577 498154 488563 479636 472002 466410 462725 460072 457857 456225 455595 456245 458416 462275 467493 473287 479178
63562 479178 485448 492594 500648 509300 518374 527886 537965 549106 562240 577999 596002 615276 635329
63549 635329 656444 678938 702568 726652 750383 772832 792834 809029 820032 824856 823516 817225
63537 817225 807760 796653 785039 773834 763506 753745 743950 734106 724677 715555 705623 693618 679022
63524 679022 661951 642721 621917 600491 579215 558176 537168 516460 496756 478487 461523
63513 461523 445663 431035 417861 406055 395327 385647 377428 371083 366408 362545 358722 355004 352118
63500 352118 350472 349513 348206 346055 343486 341241 339566 338049 336191 333993 332014 330908 330965 331969 333304
63485C33304R44K54P1Q16J903K340K018J868K562L560L860L274K408J757J308
63470C62247R08M47k57j254k179k554k412k168j982j662j204q97p74m58K79J164
63454C47244J815K200K495K769L046L467M175N196O537Q194R973J1445J2306J2716
63440D33578J3203J4245J5888J7714J9212K0249K1075K1657K1308J9379J6171
63429F33679J2748R820P278M918L118K542L448N467P922J0277J2518J5096J8125
63416G46956K0747K1750K0972J9444J7885J5704J2010P111K360j359m223o670
63404H72687q598r656r887r829j0117j1139j2858j4889j6814j8516k0072k1396
63392G08916k2120k1937k0976j9762j8759j7941j6844j5145j3105j1266r755q174
$$ plain form
63485 333304 334248 334502 334573 335389 337292 339632 341650 343518 346080 349640 353500 356774 359182 360939 362247
63470 362247 363155 363602 363345 362091 359912 357358 354946 352778 350796 349134 347930 347033 346259 345801 346080 347244
63454 347244 349059 351259 353754 356523 359569 363036 367211 372407 378944 387138 397111 408556 420862 433578
63440 433578 446781 461026 476914 494628 513840 534089 555164 576821 598129 617508 633679
63429 633679 646427 656247 663525 668443 671561 674103 677551 683018 690940 701217 713735 728831 746956
63416 746956 767703 789453 810425 829869 847754 863458 875468 882579 884939 883580 879357 872687
63404 872687 864089 854433 844546 834717 824600 813461 800603 785714 768900 750384 730312 708916
63392 708916 686796 664859 643883 624121 605362 587421 570577 555432 542327 531061 521306 513132
63380E13132o315m572l350k355r75P23J969K387K645L649N377P027Q226R506J1400
63365E48474J3482J4842J5320J5745J6849J8455J9986K1307K2534K3374K3289
63354G53657K2255K0787J9102J6812J3628R845N863J773k247n591p798r155j0227
63341H28704j1028j1229j1044j1270j2354j3938j5496j6995j8564j9924k0554
63330F66308k0338j9680j8923j7899j6242j3985j1621r506p472n252l160k013
63318E20217k315l864o195r022j1962j4226j5103j4671j3606j2389j1088r801
63306C95975q809q144p415o347n180m270l544k677j717j128j215j647j845j670
63292C40367j544j805k213k245j747j034m30j06l35j293k410k507j153N44J142
$$ plain form
63380 513132 506817 502245 498895 496540 495565 496288 498257 500644 503289 506938 512315 519342 527568 537074 548474
63365 548474 561956 576798 592118 607863 624712 643167 663153 684460 706994 730368 753657
63354 753657 775912 796699 815801 832613 846241 856086 861949 863722 861475 855884 848086 838931 828704
63341 828704 817676 806447 795403 784133 771779 757841 742345 725350 706786 686862 666308
63330 666308 645970 626290 607367 589468 573226 559241 547620 538114 530642 525390 522230 520217
63318 520217 517902 514038 507843 498821 486859 472633 457530 442859 429253 416864 405776 395975
63306 395975 387166 379022 371607 365260 360080 355810 352266 349589 347872 346744 345529 343882 342037 340367
63292 340367 338823 337018 334805 332560 330813 329779 329349 329243 328908 327615 325205 322698 321545 322089 323231
63277C23231N93M2J13K76N3o6N61J695K590K970L036K855K387J917J921K399K822
63260C49395K748K299K000K340L355M492N060N106N434O424P231O796N395M450
63246D12525M864O307Q110R982J1616J2498J2665J2957J3926J5023J5524J5725
63234E51722J6494J7964J9467K0534K1231K1575K1406K0895K0457K0174J9837
63223G71756J9578J9707J9841J9123J7593J6487J6609J7122J6626J4862J2577
63212I61881J0115P035L086j211n090q231j0858j3468j6508j9892k2867k4598
63200H59394k4890k4147k2849k1311j9768j8172j6099j3285j0210p654n748l917
63188F71344j740P04L184N501P231Q009Q131Q365Q956R458R626R844J0300J0483
$$ plain form
63277 323231 323824 323866 323979 324255 324308 324242 324803 326498 329088 332058 335094 337949 340336 342253 344174 346573 349395
63260 349395 352143 354442 356442 358782 362137 366629 371689 376795 382229 388653 395884 402680 408075 412525
63246 412525 417389 423696 431806 441788 453404 465902 478567 491524 505450 520473 535997 551722
63234 551722 568216 586180 605647 626181 647412 668987 690393 711288 731745 751919 771756
63223 771756 791334 811041 830882 850005 867598 884085 900694 917816 934442 949304 961881
63212 961881 971996 979031 982117 980906 975816 967585 956727 943259 926751 906859 883992 859394
63200 859394 834504 810357 787508 766197 746429 728257 712158 698873 688663 681009 675261 671344
63188 671344 669604 670308 673492 678993 686224 694233 702364 710729 719685 729143 738769 748613 758913 769396
63174G69396J0013R401R364R768R853R198P913O116L851J397q89l088n600q498
63160H28195j1363j3769j5623j7030j8238j9578k1103k2254k2270k1064j9380
63149F26523j8047j7256j6649j5797j4498j2859j1228r920q927p980o891n723
63137D80748m583l467k379j534j272j723k508k855k201p10Q85J959K370K249J803
63122D66782J411J470J901K141J903J631J839K343K601K551K607K922L211L287
63108D98600L332L478L540L246K579J823J407J573K008K059J557J149J396J886
63094E29633J908J682K109L275M152M033L417L080L002K798K622K979L909M981
63080E73580N886O566O986P233P670Q524R446R983J0319J1056J2243J3199J3481
$$ plain form
63174 769396 779409 788810 798174 807942 817795 826993 834906 841022 844873 846270 845381 842293 836693 828195
63160 828195 816832 803063 787440 770410 752172 732594 711491 689237 666967 645903 626523
63149 626523 608476 591220 574571 558774 544276 531417 520189 510269 501342 493362 486471 480748
63137 480748 476165 472698 470319 468785 467513 465790 463282 460427 458226 457516 458401 460360 462730 464979 466782
63122 466782 468193 469663 471564 473705 475608 477239 479078 481421 484022 486573 489180 492102 495313 498600
63108 498600 501932 505410 508950 512196 514775 516598 518005 519578 521586 523645 525202 526351 527747 529633
63094 529633 531541 533223 535332 538607 542759 546792 550209 553289 556291 559089 561711 564690 568599 573580
63080 573580 579466 586032 593018 600251 607921 616445 625891 635874 646193 657249 669492 682691 696172
63067F96172J3522J4028J5075J6188J7140J8289K0073K2435K4882K7029K8923
63056I13756L0781L2670L4559L6614L9100M1916M4428M5985M6541M6652M6872
63045A359874M7239M7320M6755M5741M4877M4484M4180M3349M1906M0336L8982
63034A845043L7676L6087L4099L1611K8363K4107J8799J2346M542m483j3940k2833
63022B031417l0706l7655m3779m8895n2739n5145n6023n5398n3447n0357m6197
63011A501076m1142l5749l0673k6070k1522j6638j1560o721k344J658N319Q383
62999A324017J0578J2098J3563J5370J7193J8381J8734J8576J8113J7182J5862
62988A499667J4746J4175J3523J1799Q842N335J663k542p627j3162j8381k2961
$$ plain form
63067 696172 709694 723722 738797 754985 772125 790414 810487 832922 857804 884833 913756
63056 913756 944537 977207 1011766 1048380 1087480 1129396 1173824 1219809 1266350 1313002 1359874
63045 1359874 1407113 1454433 1501188 1546929 1591806 1636290 1680470 1723819 1765725 1806061 1845043
63034 1845043 1882719 1918806 1952905 1984516 2012879 2036986 2055785 2068131 2072673 2068190 2054250 2031417
63022 2031417 2000711 1963056 1919277 1870382 1817643 1762498 1706475 1651077 1597630 1547273 1501076
63011 1501076 1459934 1424185 1393512 1367442 1345920 1329282 1317722 1311001 1308657 1310315 1315634 1324017
62999 1324017 1334595 1346693 1360256 1375626 1392819 1411200 1429934 1448510 1466623 1483805 1499667
62988 1499667 1514413 1528588 1542111 1553910 1562752 1568087 1569750 1567208 1559581 1546419 1528038 1505077
62976A505077k7140l1227l5244l8883m1616m3016m3174m2609m1632m0140l8139
62965A082257l6096l4313l2350k9667k6693k4549k3589k2893k1468j9431j7596
62954G93612j6336j5391j4605j4146j4067j4099j4005j3780j3403j2770j1993
62943F39017j1386j0984j0381r317q127p354p111p048o830o330n588m817m350
62930E39394m283m300m050l598l215k848k189j227l88j13n63j612k802l344k760
62915E02102j588j025j654k854l691l908l823l608l192k622k104j757j586j611
62901D67079j746j675j181n09j04n0n8K7M4j24l44m54m65m16k73j00j07m08q23
62882D58313j089j117r64o60k12K90P43J122J391J395R95L15l63r47j584k298
$$ plain form
62976 1505077 1477937 1446710 1411466 1372583 1330967 1287951 1244777 1202168 1160536 1120396 1082257
62965 1082257 1046161 1011848 979498 949831 923138 898589 875000 852107 830639 811208 793612
62954 793612 777276 761885 747280 733134 719067 704968 690963 677183 663780 651010 639017
62943 639017 627631 616647 606266 596949 588822 581468 574357 567309 560479 554149 548561 543744 539394
62930 539394 535111 530811 526761 523163 519948 517100 514911 513684 513296 513183 512620 511008 508206 504862 502102
62915 502102 500514 499489 497835 494981 491290 487382 483559 479951 476759 474137 472033 470276 468690 467079
62901 467079 465333 463658 462477 461968 461864 461814 461756 461783 461827 461703 461359 460905 460440 460024 459751 459651 459544 459136 458313
62882 458313 457224 456107 455143 454483 454271 454561 455304 456426 457817 459212 460207 460522 460159 459212 457628 455330
62866D55330k798k750k087j026J21J005J338J185R95J108J355J362J100Q04N28
62851D57570K48L14J121K264K652J826N97J2J21K61R2j82k99j08M90J263J555
62834D69797J091N26O58J323J795J999K480L284L820L850L717L523K945K145J909
62819E04862K575L612M613N768O930P198O220N071M993N843O667P259Q102R147
62805E88860R729R705R723J0250J1046J1744J2362J3062J3828J4576J5258J5848
62793G35991J6490J7588J9425K1809K4366K6990K9743L2583L5612L9280M3755
62782A043632M8305N2000N4944N8196O2322O6681P0165P2166P2581P1422O8786
62771A741200O4902N9902N3608M5689L6034K4995J3277J467j0320k2103l3313
$$ plain form
62866 455330 452532 449782 447695 446669 446790 447795 449133 450318 451313 452421 453776 455138 456238 457042 457570
62851 457570 457818 458132 459253 461517 464169 465995 466592 466604 466725 466986 467078 466896 466597 466489 466979 468242 469797
62834 469797 470888 471414 472072 473395 475190 477189 479669 482953 486773 490623 494340 497863 500808 502953 504862
62819 504862 507437 511049 515662 521430 528360 535558 541778 546849 551842 557685 564352 571611 579713 588860
62805 588860 598589 608294 618017 628267 639313 651057 663419 676481 690309 704885 720143 735991
62793 735991 752481 770069 789494 811303 835669 862659 892402 924985 960597 999877 1043632
62782 1043632 1091937 1143937 1198881 1257077 1319399 1386080 1456245 1528411 1600992 1672414 1741200
62771 1741200 1806102 1866004 1919612 1965301 2001335 2026330 2039607 2041074 2030754 2008651 1975338
62760A975338m2936n0564n6820o2321o6759o9438p0319o9903o8521o6397o4006
62749A287354o1598n8621n4479m9621m5066m1059l7088l3110k9696k7009k4602
62738H25405k2402k0814j9640j7945j5430j2983j1393j0339r167p859o602n176
62726F65655l461j959j136o93p5O89J281J784K461L186L688M128M863N966P373
62711F93750R217J1543J3903J5769J7126J8345J9774K1774K4688K8307L1723L4295
62699I40214L6372L8556M0642M2031M2797M3537M4270M4327M3275M1147L7763
62688A394931L2678K6118J9172J2556N711k358j1570k0640k8332l4417l9365m3423
62676A311061m6310m7787m8175m8081m7723m6857m5331m3311m0866l7810l4211
$$ plain form
62760 1975338 1932402 1881838 1825018 1762697 1695938 1626500 1556181 1486278 1417757 1351360 1287354
62749 1287354 1225756 1167135 1112656 1063035 1017969 976910 939822 906712 877016 850007 825405
62738 825405 803003 782189 762549 744604 729174 716191 704798 694459 685292 677433 670831 665655
62726 665655 662194 660235 659099 658406 658331 659020 660301 662085 664546 667732 671420 675548 680411 686377 693750
62711 693750 702967 714510 728413 744182 761308 779653 799427 821201 845889 874196 905919 940214
62699 940214 976586 1015142 1055784 1097815 1140612 1184149 1228419 1272746 1316021 1357168 1394931
62688 1394931 1427609 1453727 1472899 1485455 1491166 1488808 1477238 1456598 1428266 1393849 1354484 1311061
62676 1311061 1264751 1216964 1168789 1120708 1072985 1026128 980797 937486 896620 858810 824599
62665H24599l0739k8051k6111k4393k2544k0501j8249j5952j4145j3232j2830
62654E97852j2050j0566q997q111p948p911p523o860o317o067n864n338m461l592
62640D96247l100l032l108k852j918n45M25M19j05k38Q3J06l93p12m75l42q04
62623D79656j103k69J338K457K619K433K423K503K676L299M432N579O285O519
62609E20847O509O633P426R021J0658J1456J1704J2619J4655J6925J8582K0010
62597F67045K2077K4794K7370K9291L0775L2222L3599L4435L4180L2635L0089
62586I98512K6988K3529J9614J5081R731L383l680j0455j5950k0197k4003k7719
62574I94834l0770l2546l3196l3299l3197l2860l2002l0233k7530k4695k2707
$$ plain form
62665 824599 793860 765809 739698 715305 692761 672260 654011 638059 623914 610682 597852
62654 597852 585802 575236 566239 558128 550180 542269 534746 527886 521569 515502 509638 504300 499839 496247
62640 496247 493147 490115 487007 484155 482237 481692 482117 482536 482431 482193 482276 482382 481989 481277 480802 480460 479656
62623 479656 478553 478284 479622 482079 484698 487131 489554 492057 494733 498032 502464 508043 514328 520847
62609 520847 527356 533989 541415 550436 561094 572550 584254 596873 611528 628453 647035 667045
62597 667045 689122 713916 741286 770577 801352 833574 867173 901608 935788 968423 998512
62586 998512 1025500 1049029 1068643 1083724 1093455 1096838 1093158 1082703 1066753 1046556 1022553 994834
62574 994834 964064 931518 898322 865023 831826 798966 766964 736731 709201 684506 661799
62563F61799k1490j9912j7403j4856j3378j2713j1689r916q194p271o887o297
62551E11793n254m172l524l335l251k955k404j715r74l60j35k71j80O30J701K046
62535D87640J455Q20Q80J360J714K046K674L357L773M358N811P820R265R790J0324
62520E53087J1719J3619J5227J6588J8383K0699K2799K4200K5325K6716K8072
62509G76434K8512K7696K6200K4647K2931K0503J7166J3264R188N096J050k933
62497I69754o887j0638j3505j4739j4456j3687j3192j2564j0895q096n044k457
62485H43594j33K469N272P603R108J0227J1561J2964J3660J3218J1998J0408Q107
62472I60056M476k95n110r055j2199j5179j8374k1663k4656k6898k8076k8312
$$ plain form
62563 661799 640309 620397 602994 588138 574760 562047 550358 540442 532248 524977 518090 511793
62551 511793 506539 502367 498843 495508 492257 489302 486898 485183 484209 483849 483714 483443 483263 483893 485594 487640
62535 487640 489095 489915 490795 492155 493869 495915 498589 501946 505719 510077 515888 523708 532973 542763 553087
62520 553087 564806 578425 593652 610240 628623 649322 672121 696321 721646 748362 776434
62509 776434 804946 832642 858842 883489 906420 926923 944089 957353 966541 971637 972687 969754
62497 969754 962867 952229 938724 923985 909529 895842 882650 870086 859191 851095 846051 843594
62485 843594 843461 845930 851202 858805 867913 878140 889701 902665 916325 929543 941541 951949 960056
62472 960056 964532 964237 959127 950072 937873 922694 904320 882657 858001 831103 803027 774715
62460G74715k8114k7857k7382k6249k4288k1814j9380j7407j5886j4430j2667
62449E39241j0636q638o812n098l558k420j748j331r29m04L19J119J599J540J338
62434E03582J514J856J644P09m19j513k919m585n706n862n732o003o341o165n806
62419D58254n889o083n560m464l823l996m221l879l250k822k558k287k077j948
62405D05397j659j164p73o02l40K08P11Q20O79O51Q98J450K308L186L544L207
62389D18521K690K553K727K834K858L099L646M271M832N368N844O129O246O467
62375D78085P046P952Q885R492R667R686R960J0615J1484J2460J3636J5015J6411
62362F20394J7841J9644K1946K4298K6265K8124L0460L3111L5039L5428L4480
$$ plain form
62460 774715 746601 718744 691362 665113 640825 619011 599631 582224 566338 551908 539241
62449 539241 528605 519967 513155 508057 504499 502079 500331 499000 498071 497667 497986 499105 500704 502244 503582
62434 503582 505096 506952 508596 509305 508886 507373 504454 499869 494163 488301 482569 476566 470225 464060 458254
62419 458254 452365 446282 440722 436258 432435 428439 424218 420339 417089 414267 411709 409422 407345 405397
62405 405397 403738 402574 401801 401199 400859 401067 401778 402598 403277 403928 404826 406276 408584 411770 415314 418521
62389 418521 421211 423764 426491 429325 432183 435282 438928 443199 448031 453399 459243 465372 471618 478085
62375 478085 485131 493083 501968 511460 521127 530813 540773 551388 562872 575332 588968 603983 620394
62362 620394 638235 657879 679825 704123 730388 758512 788972 822083 857122 892550 927030
62351I27030L2945L1132K8688K5115K0245J4377Q208K562k151o189j0030j3738
62339A058194j7058j9999k2811k5302k6712k6677k5885k5244k4662k3353k1190
62328G99301j8994j7311j5758j3945j2344j1607j1492j1272j0888j0911j1493
62317F53286j2125j2501j2884j3422j3710j3361j2497j1368r988q546p617p446
62305E17821p374o567n129l928l450l342l110k642j978j061j2P25R01Q98J248
62290D83000J908K320K227K061K362L077L585L378K624K099K551L984N511O115
62276E26802N675M999M791M833M632M482N255P098R019J0116J0648J1460J2782
62263F22592J4222J5691J7672K0519K4007K7645L1008L3732L5643L6991L8228
$$ plain form
62351 927030 959975 991107 1019795 1044910 1065155 1079532 1087740 1090302 1088151 1081962 1071932 1058194
62339 1058194 1041136 1021137 998326 973024 946312 919635 893750 868506 843844 820491 799301
62328 799301 780307 762996 747238 733293 720949 709342 697850 686578 675690 664779 653286
62317 653286 641161 628660 615776 602354 588644 575283 562786 551418 541430 532884 525267 517821
62305 517821 510447 503880 498751 494823 491373 488031 484921 482279 480301 479240 479228 479953 480854 481752 483000
62290 483000 484908 487228 489455 491516 493878 496955 500540 503918 506542 508641 511192 515176 520687 526802
62276 526802 532477 537476 542267 547100 551732 556214 561469 568567 577586 587702 598350 609810 622592
62263 622592 636814 652505 670177 690696 714703 742348 773356 807088 842731 879722 917950
62252I17950L9297L9510L8217L5382L1412K6723K1630J6279J0628M723r56n844
62240A174951j0085j4379j8806k2496k4896k6732k8938l1100l1912l1044k9553
62229I05010k8372k7303k5846k4189k2749k1368j9688j7957j6754j6068j5371
62218F69345j4467j3663j2980j1993j0678r776r802j0166r818q543p061n978n201
62205E39219m446l688k964k090r79N7N96O63O85J007J652K484L428M441N407O141
62189E51613O481O408O076N761N742O231P227Q379R151R323R183Q963Q366P074
62175F55978N634N180O073P458Q428R161J0477J2704J5509J8487K1366K3770K5358
62162H25583K6165K6423K6110K4928K2659J9243J4807R905N428J772j615n269
$$ plain form
62252 917950 957247 996757 1034974 1070356 1101768 1128491 1150121 1166400 1177028 1181751 1180795 1174951
62240 1174951 1164866 1150487 1131681 1109185 1084289 1057557 1028619 997519 965607 934563 905010
62229 905010 876638 849335 823489 799300 776551 755183 735495 717538 700784 684716 669345
62218 669345 654878 641215 628235 616242 605564 595788 585986 575820 566002 557459 550398 544420 539219
62205 539219 534773 531085 528121 526031 525052 525109 525705 526368 527053 528060 529712 532196 535624 540065 545472 551613
62189 551613 558094 564502 570578 576339 582081 588312 595539 603918 613069 622392 631575 640538 648904 655978
62175 655978 661612 666792 672865 680323 688751 697912 708389 721093 736602 755089 776455 800225 825583
62162 825583 851748 878171 904281 929209 951868 971111 985918 995823 1001251 1003023 1001408 996139
62150I96139q725j1158j2777j4652j7175j9572k1067k1636k1474k0581j9206j7879
62138G90237j6536j4430j1368q302o126m552k869j180j15K88N79J067J698K459
62124G30850L270L767L832M076N074O338O850O408N698N067M177K895J742J117
62110G91161P33Q7r88k405l941n166n787o119o711p350p124n691l750k003l34
62095G34612J486L015L748M056M733N800O442O131N220M445M236M539N010N313
62081G98786N484N945O922P985Q508Q476Q518R131J0230J1407J2356J2922J3134
62068I19804J3227J3508J4044J4618J5017J5195J5152J4871J4338J3465J2011
62057A075250R786O925L807O50k570n765q600j0829j2595j4295j6225j8436k0784
$$ plain form
62150 996139 987414 976256 963479 948827 931652 912080 891013 869377 847903 827322 808116 790237
62138 790237 773701 759271 747903 739601 733475 728923 726054 724874 724759 725047 725626 726693 728391 730850
62124 730850 734120 737887 741719 745795 750869 757207 764057 770465 776163 781230 785407 788302 790044 791161
62110 791161 791894 791981 790993 788588 784647 779481 773694 767575 760864 753514 746390 740699 736949 734946 734612
62095 734612 736098 739113 742861 746917 751650 757450 763892 770023 775243 779688 783924 788463 793473 798786
62081 798786 804270 810215 817137 825122 833630 842106 850624 859755 869985 881392 893748 906670 919804
62068 919804 933031 946539 960583 975201 990218 1005413 1020565 1035436 1049774 1063239 1075250
62057 1075250 1085036 1091961 1095768 1096418 1093848 1088083 1079483 1068654 1056059 1041764 1025539 1007103 986319
62044I86319k3036k5035k6782k8227k9024k8751k7479k5869k4532k3423k2035
62033G02126k0064j7749j5656j4252j3526j2928j1840j0253q818q020p515o681
62021E54824n588m954n096n482n502n284n386n938o458o411n656m441l245k556
62007D82827k440k323j484J12J677K363K018J158M14J10J58J98q4o00r18p87m75
61990D81924m80j016j940k990l891m345m293m156m489n264n794n545m738l982
61976D29001l561l392l403l464l097j838l7J223J325Q30O61R67J201J083Q30N73
61960D18902J63k78k03P04K027L009L213K726K044J872K622L909M859N149N300
61945D56018N761O300O643P197Q443J0046J1236J1855J2299J2635J2530J1964
$$ plain form
62044 986319 963283 938248 911466 883239 854215 825464 797985 772116 747584 724161 702126
62033 702126 682062 664313 648657 634405 620879 607951 596111 585858 577040 569020 561505 554824
62021 554824 549236 544282 539186 533704 528202 522918 517532 511594 505136 498725 493069 488628 485383 482827
62007 482827 480387 478064 476580 476692 478369 480732 482750 483908 484322 484432 484590 484788 484704 484104 483186 482399 481924
61990 481924 481444 480428 478488 475498 471607 467262 462969 458813 454324 449060 443266 437721 432983 429001
61976 429001 425440 422048 418645 415181 412084 410246 410209 411432 412757 413587 414248 415215 416416 417499 418329 418902
61960 418902 419065 418787 418584 419288 421315 424324 427537 430263 432307 434179 436801 440710 445569 450718 456018
61945 456018 461779 468079 474722 481919 490362 500408 511644 523499 535798 548433 560963 572927
61933E72927J1307J0680R980R429R359R391Q780P668O970O657N347K269j313l569
61919F65882m266m454m615m342l585k984k760k246p84J508M088O497Q382R459
61905F65780R793R678R215Q287O984N564L957J775j003l824o057p467q122q300
61891F86260q504r121r978j0601j0861j0855j0304q778o630m941m289m256m363
61878E82779m732n360n663n338n022n275n489m706l107j732r08QJ314K350K518
61863E41637K204K274L171M724O499Q039R138J0051J1207J2587J3771J4633J5552
61850F55487J6764J8001J8924J9549J9896J9656J8594J6972J5237J3458J1390
61839H43928Q923O129L067j49l148n480o895p357o972o094n183m251k755m42K009
$$ plain form
61933 572927 584234 594914 604894 614323 623682 633073 641853 649521 656491 663148 668495 670764 669451 665882
61919 665882 661616 657162 652547 648205 644620 641636 638876 636630 635846 637354 641442 647939 656321 665780
61905 665780 675573 685251 694466 702753 709737 715301 719258 721033 720030 716206 710149 702682 694560 686260
61891 686260 677756 668635 658657 648056 637195 626340 616036 607258 600628 595687 591398 587142 582779
61878 582779 578047 572687 567024 561686 556664 551389 545900 541194 538087 536355 535447 535455 536769 539119 541637
61863 541637 543841 546115 549286 554010 560509 568548 577686 587737 598944 611531 625302 639935 655487
61850 655487 672251 690252 709176 728725 748621 768277 786871 803843 819080 832538 843928
61839 843928 852851 858980 862047 861898 858750 853270 846375 839018 832046 825952 820769 816518 813763 813321 815330
61824H15330L688M578N345O081O008M550K049q30l859p023j0099j2875j5464j7906
61810G79573j9793k0738k0958k0905k0530j9467j7893j6526j5699j4944j3704
61799E78416j2049j0430r096q072p421p187p137o846o047m829l607k933l073l639
61785D86050l764k947j672r22j154j930k563k866l159l629l954l589k444j106
61771D50351l64n01j099j551j605j456j369j326j117p20m90p75j349j504q61J13
61755D34377O42N02K3n42j157j581j380n79J51K30j80n04m34j19Q1j72r24j701
61737D26733j844j249m84l5J47J65j43n79l30R48K300K499J687J056J066J019
61721D32956M98J09L90Q71R22Q40J279K016K187J570Q87O49M63k31j193j697j631
$$ plain form
61824 815330 819018 823596 828941 835022 841030 845580 847629 846799 842940 835917 825818 812943 797479 779573
61810 779573 759780 739042 718084 697179 676649 657182 639289 622763 607064 592120 578416
61799 578416 566367 555937 546841 538769 531348 524161 517024 510178 504131 499302 495695 492762 489689 486050
61785 486050 482286 479339 477667 476745 475591 473661 471098 468232 465073 461444 457490 453901 451457 450351
61771 450351 449987 449486 448387 446836 445231 443775 442406 441080 439963 439243 438753 437978 436629 435125 434264 434377
61755 434377 435019 435521 435544 435002 433845 432264 430884 430305 430456 430686 430506 430002 429568 429449 429530 429358 428434 426733
61737 426733 424889 423640 423156 423121 423268 423433 423290 422711 422381 423329 425629 428128 429815 430871 431937 432956
61721 432956 433454 433563 433953 434824 435746 436586 437865 439881 442068 443638 444525 445174 445637 445406 444213 442516 440885
61704D40885j714k512l651m312m300m109l988l617k875k308k317k426k057j689
61690C99010k280l644m401l783k586j905j764j623j496j770k282k488k370k390
61676C64228k579k367j457l57K36J74k00n86r45j308j513j241l86N82R14L68m79
61659C53084r11q59o87n17j91K56N91Q23J173J586J718J499J251J173J065Q20
61643C61874P78J207J778J905J501J044R01Q47L46p61j988k620k496k235k539
61628C59542l327l887l788l276k639j763o65k1m56j477j810r32K51O09J20l76
61612C36105m28l75o57j252j897k441k801k905k846k907l197l473l476l249k994
61597C01207k817k759k828k835k451j750j326j497j719j315o16n79j252j539p61
$$ plain form
61704 440885 439171 436659 433008 428696 424396 420287 416299 412682 409807 407499 405182 402756 400699 399010
61690 399010 396730 393086 388685 384902 382316 380411 378647 377024 375528 373758 371476 368988 366618 364228
61676 364228 361649 359282 357825 357468 357704 357878 357678 357092 356147 354839 353326 352085 351699 352281 353195 353563 353084
61659 353084 352173 351314 350627 350110 349919 350175 350766 351589 352762 354348 356066 357565 358816 359989 361054 361874
61643 361874 362652 363859 365637 367542 369043 370087 370988 371835 372181 371420 369432 366812 364316 362081 359542
61628 359542 356215 352328 348540 345264 342625 340862 340197 340176 339720 338243 336433 335501 335752 336361 336481 336105
61612 336105 335677 335302 334645 333393 331496 329055 326254 323349 320503 317596 314399 310926 307450 304201 301207
61597 301207 298390 295631 292803 289968 287517 285767 284441 282944 281225 279910 279294 278715 277463 275924 275163
61582B75163K57L08n32j097p53m5K52N3l00o30r16r92p20l35k67n91q71o61K0
61563B67343Q42J549J955J699N05j177k166j684k65Q58J167J107J067P71n1r30
61547B72590j079k74J032K182K690K384J606J002P93N13j55n72J59J801K985K797
61531B90454J847J351J575J656Q54m55j278j174o17j99P7M03M29m27j855k560
61515B90081j695K7J146J060L42k86o58q90j086j334j663j792j330l71M68O95
61499B82714M30J30P4K78N67O64L53k46o93o11l5O10Q16L69m29r96j045p68l55
61480B81827L62J409K196K084J320P96R02J165J125R24Q30P36M93L46N73R61J022
61463B99071O20O5k95l96l72l52l36k27m5L1p6q0L20R35J266J186J075J207J430
$$ plain form
61582 275163 275420 275728 275196 274099 273346 273301 273553 273606 273306 272676 271760 270768 270048 269713 269446 268855 267984 267323 267343
61563 267343 268185 269734 271689 273388 273893 272716 270550 268866 268601 269459 270626 271733 272800 273571 273520 272590
61547 272590 271511 271237 272269 274451 277141 279525 281131 282133 282926 283439 283284 282712 282871 284672 287657 290454
61531 290454 292301 293652 295227 296883 297737 297282 296004 294830 294213 294014 294091 294494 294923 294496 292641 290081
61515 290081 288386 288413 289559 290619 290961 290675 290017 289127 288041 286707 285044 283252 281922 281551 282019 282714
61499 282714 283144 283274 283348 283626 284193 284857 285210 284964 284271 283660 283625 284235 285051 285420 284991 283995 282950 282182 281827
61480 281827 282189 283598 285794 287878 289198 289994 290896 292061 293186 294110 294940 295676 296169 296515 297088 298049 299071
61463 299071 299691 299756 299461 299065 298693 298341 298005 297778 297733 297764 297688 297608 297928 298863 300129 301315 302390 303597 305027
61444C05027J534J547J502J341J146J140J270J244J104J297J869K164J747J121
61430C25053J044J483J804J763J640J607J515J347J290J323J211R79R49J175J233
61415C45416Q29L09K17N69Q20N57m2n30p90j108j648k128k170j779j291r18o89
61398C35624p06j053j447j427r66m78j62K14O56P37K76k10k34m6j20l07j49L16
61380C30518O23O83Q39J206J440J225O18o7l73J08J283K397K761K512K218J989
61364C49980J528R40P38J106J722K354L016L497L432L002K930L533M412N170N838
61349C93198O350O315N730N253N281N322M765L820L100K739K543K595K987L253
61335D53251K778J740R80R15J141J182J015P77L77k72r96j498j655j580j487j478
$$ plain form
61444 305027 306561 308108 309610 310951 312097 313237 314507 315751 316855 318152 320021 322185 323932 325053
61430 325053 326097 327580 329384 331147 332787 334394 335909 337256 338546 339869 341080 342059 343008 344183 345416
61415 345416 346245 346554 346771 347340 348160 348717 348675 348145 347355 346247 344599 342471 340301 338522 337231 336313 335624
61398 335624 334918 333865 332418 330991 330025 329547 329385 329599 330255 330992 331268 331058 330824 330778 330658 330351 330202 330518
61380 330518 331141 331824 332663 333869 335309 336534 337152 337085 336712 336820 338103 340500 343261 345773 347991 349980
61364 349980 351508 352448 353186 354292 356014 358368 361384 364881 368313 371315 374245 377778 382190 387360 393198
61349 393198 399548 405863 411593 416846 422127 427449 432214 436034 439134 441873 444416 447011 449998 453251
61335 453251 456029 457769 458749 459664 460805 461987 463002 463779 464156 463884 462888 461390 459735 458155 456668 455190
61319D55190j343p08M41J607K415L113M018M760M719M125L973M721N756O462P170
61304E06419Q487J0081J0797R888P723N363L668K779K098Q24j168k991l620l082
61290E57266k506k879m030m947m962m350l849l773l781l478l029k929l219l273
61276E06261k554j348m08m5J91Q87K176L695M839N077M319L144K368K294K598
61261E33494K959L420M018M503M751N065N593N783M942L281J845J369J593J795
61247E84411J555Q99O8o53j114j461j881k244k293k152k186k306j982j158n10
61232E66993m46m28J56R52J189R39J032J806K731L294L569L735L700L502L552
61217E96276M172N120N925O345O393O152N799N464N023M255L365K907L055L338
$$ plain form
61319 455190 453847 453139 453580 455187 457602 460715 464733 469493 474212 478337 482310 487031 492787 499249 506419
61304 506419 514906 524987 535784 545672 553395 558758 562426 565205 567303 568127 566959 563968 560348 557266
61290 557266 554760 551881 547851 542904 537942 533592 529743 525970 522189 518711 515682 512753 509534 506261
61276 506261 503707 502359 501951 501906 502097 502984 505160 508855 513694 518771 523090 526234 528602 530896 533494
61261 533494 536453 539873 543891 548394 553145 558210 563803 569586 574528 577809 579654 581023 582616 584411
61247 584411 585966 586865 586933 586280 585166 583705 581824 579580 577287 575135 572949 570643 568661 567503 566993
61232 566993 566547 566119 566275 567227 568416 569355 570387 572193 574924 578218 581787 585522 589222 592724 596276
61217 596276 600448 605568 611493 617838 624231 630383 636182 641646 646669 650924 654289 657196 660251 663589
61203F63589L354L353L781M651N723O944Q276R375R921J0068J0136J0035R465
61190G58671Q592P953P720P457O707N398L669J738M0r72j375j780k567l404l799
61175G94048l898m382n562o824p167o299n134n013o367q366r905j0619j0737j0342
61161F93433r367q141p274o891o528n936n428n298n346n318n223m951m070k544
61147F11118j132n35n22n26p52j816l476m612m626m037l462k797j772o19L66J359
61131E82159K490L355L724M293N869P980R268R300R090R559J0412J1032J1730
61118F80261J3245J5404J7179J7984J8227J8441J8597J8495J8252J8003J7494
61107H71582J6416J5006J3878J3296J2858J1909J0072P408M300J213j625m319
$$ plain form
61203 663589 666943 670296 674077 678728 684451 691395 699671 709046 718967 729035 739171 749206 758671
61190 758671 767263 775216 782936 790393 797100 802498 806167 807905 807945 806973 805598 803818 801251 797847 794048
61175 794048 790150 785768 780206 773382 766215 759916 754782 749769 743402 735036 725131 714512 703775 693433
61161 693433 684066 675925 668651 661760 655232 649296 643868 638570 633224 627906 622683 617732 613662 611118
61147 611118 609986 609451 608929 608403 607651 605835 602359 597747 593121 589084 585622 582825 581053 580434 580800 582159
61131 582159 584649 588004 591728 596021 601890 609870 619138 628438 637528 647087 657499 668531 680261
61118 680261 693506 708910 726089 744073 762300 780741 799338 817833 836085 854088 871582
61107 871582 887998 903004 916882 930178 943036 954945 965017 972425 976725 977938 976313 971994
61095I71994p000r449j1289j2447j3235j3894j4315j4359j4135j3844j3475j2900
61083H21652j2190j1503j0778r802q569p300o081m715l049j229M69J876K873L412
61069G55066L792M621O198Q022R287R805J0112J0775J1954J3614J5675J7764J9295
61056H95980K0095K0683K1571K2644K3559K4538K6157K8463L0778L2580L4060
61045A181108L5681L7530L9417M1304M3248M5075M6542M7779M9276N1320N3702
61034A671982N6017N8034N9671O0905O1940O3292O5294O7592O9490P0889P2546
61023B377652P5233P8995Q3657Q9672R7752J07700J18432J29587J42579J59509
61013C460768J81521K08978K42902K85127L36630L96548M63298N35988O13768
$$ plain form
61095 971994 964994 955545 944256 931809 918574 904680 890365 876006 861871 848027 834552 821652
61083 821652 809462 797959 787181 777379 768810 761510 755429 750714 747665 746436 746905 748781 751654 755066
61069 755066 758858 763479 769677 777699 786986 796791 806903 817678 829632 843246 858921 876685 895980
61056 895980 916075 936758 958329 980973 1004532 1029070 1055227 1083690 1114468 1147048 1181108
61045 1181108 1216789 1254319 1293736 1335040 1378288 1423363 1469905 1517684 1566960 1618280 1671982
61034 1671982 1727999 1786033 1845704 1906609 1968549 2031841 2097135 2164727 2234217 2305106 2377652
61023 2377652 2452885 2531880 2615537 2705209 2802961 2910661 3029093 3158680 3301259 3460768
61013 3460768 3642289 3851267 4094169 4379296 4715926 5112474 5575772 6111760 6725528
61004F725528O94389P75044Q55187R36181J013954J069381J068260R77863P91395
60995A4907182N40230K81499P0049o3350j15517j03797o1498l5505p4865k07824
60985A5136604m22631o70377q90363j039140j103736j095485j035622r44621q38710
60976G095919p29987o26671n33188m51142l80814l21927k73455k33614k00717
60967C344404j73959j53108j37370j25027j14303j04439r5653q8217q1881p6198
60957B194249p0994o6318o2086n8135n4482n1293m8544m6023m3732m2018m1112
60946A609512m0648l9918l8577l6944l5563l4615l3842l2954l1956l1029l0222
60935A223244k9437k8717k8249k7945k7277k5903k4292k3246k2828k2254k0962
$$ plain form
61004 6725528 7419917 8194961 9050148 9986329 11000283 12069664 13137924 14115787 14907182
60995 14907182 15447412 15728911 15798960 15735610 15620093 15516296 15454798 15419293 15344428 15136604
60985 15136604 14713973 14043596 13153233 12114093 11010357 9914872 8879250 7934629 7095919
60976 7095919 6365932 5739261 5206073 4754931 4374117 4052190 3778735 3545121 3344404
60967 3344404 3170445 3017337 2879967 2754940 2640637 2536198 2440545 2352328 2270447 2194249
60957 2194249 2123255 2056937 1994851 1936716 1882234 1830941 1782397 1736374 1692642 1650624 1609512
60946 1609512 1568864 1528946 1490369 1453425 1417862 1383247 1349405 1316451 1284495 1253466 1223244
60935 1223244 1193807 1165090 1136841 1108896 1081619 1055716 1031424 1008178 985350 963096 942134
60924I42134j9316j7924j6817j5737j4829j4430j4365j4054j3285j2310j1260
60913G77807j0017q773q044p927p826p215o270n441m808m222l782l736l997m091
60899F91658l615k589j533j256k172l705m625m373l658l496m044m777n440o130
60885F40245o611o446n840n597o020o490o519o570p259q210q393p434n987m822
60871E48047m094l675l641m039m443m182l114j884j257j367j760k076k367k697
60857E07451k843k611k257k223k521k735k553j930q99K65P37k32k155l446l289
60842D78759k698l047m106m474l674k723k489k646k583k490k774l081k740j869
60828D37365j260j249j357j079n20q9L1p2k64m78p50j133j514j642j477j378j650
$$ plain form
60924 942134 922818 904894 888077 872340 857511 843081 828716 814662 801377 789067 777807
60913 777807 767790 759017 750973 743046 735220 728005 721735 716294 711486 707264 703482 699746 695749 691658
60899 691658 688043 685454 683921 682665 680493 676788 672163 667790 664132 660636 656592 651815 646375 640245
60885 640245 633634 627188 621348 615751 609731 603241 596722 590152 582893 574683 566290 558856 552869 548047
60871 548047 543953 540278 536637 532598 528155 523973 520859 518975 517718 516351 514591 512515 510148 507451
60857 507451 504608 501997 499740 497517 494996 492261 489708 487778 486879 487144 487881 487649 485494 482048 478759
60842 478759 476061 473014 468908 464434 460760 458037 455548 452902 450319 447829 445055 441974 439234 437365
60828 437365 436105 434856 433499 432420 431900 431811 431842 431770 431506 431028 430278 429145 427631 425989 424512 423134 421484
60811D21484k100k341k362k444k595k564k333k145j996j641j128q10o92m12q0
60796C95841m40j754l122l524l100k758k813k773k359j911j774j856j950k005
60782C63702j908j517r89o69n64l88k07m07q65q36p2O08M11k54m03J03N89P98
60764C57132J258K200K953K769J834R74O47N82L08k63p89q89n14pK82L44L98N22
60746C69741O23P01Q70J036Q74K81l98q13j110j725k788l923m630m717m375l976
60730C45671l747l570l113k341j730j809k417k703k016p34R6o3o38p45l66k75
60714C19500p74j124n81M31Q72N41K30L67L65l00j054r07K20J453K019J814J118
60697C24190L53J2L17Q66J113J100J270J607J654J351J236J580K017K318K885
$$ plain form
60811 421484 419384 417043 414681 412237 409642 407078 404745 402600 400604 398963 397835 397025 396333 395921 395841
60796 395841 395401 393647 390525 387001 383901 381143 378330 375557 373198 371287 369513 367657 365707 363702
60782 363702 361794 360277 359288 358619 358055 357667 357460 357053 356188 355352 355280 355888 356299 356045 355642 355745 356334 357132
60764 357132 358390 360590 363543 366312 368146 369120 369767 370349 370657 370394 369605 368716 368202 368195 368477 368821 369219 369741
60746 369741 370364 371065 371935 372971 373845 374126 373728 372915 371805 370080 367292 363369 358739 354022 349647 345671
60730 345671 341924 338354 335241 332900 331170 329361 326944 324241 322225 321491 321587 321524 320886 320141 319775 319500
60714 319500 318726 317602 317021 317452 318324 318865 319095 319462 319827 319527 318473 317566 317786 319239 321258 323072 324190
60697 324190 324543 324555 324872 325738 326851 327951 329221 330828 332482 333833 335069 336649 338666 340984 343869
60682C43869L935M759M411K939J393P27J070J904K496K290J355L62j36k73m22
60667C70679n43m48m78j191k406l282l409l227l097k718j787p02m4K27N13Q34
60651C48921R06P82Q22J042J079Q44P34R84J247J017K25q13j731k220k079j530
60635C50230j234j626k333k609k276j809j506j113m93j03m09j095j343p89K09
60620C31701J153J758J812J234M73K34O21Q86M71j65j64N90J409J758J708J562
60604C47041J411J178P53O6o98j038o60K4K95M1j53J65Q44J541K062K196J700
60587C56768Q23L16N95J174J367J193J161J470J895K341K889L358L350K895K680
60572C84275L330M638N764O147O086O350P181P894P664O601N672N420N237M253
$$ plain form
60682 343869 347804 352563 356974 359913 361306 362033 363103 365007 367503 369793 371148 371510 371374 371101 370679
60667 370679 370136 369688 369210 368019 365613 362331 358922 355695 352598 349880 348093 347391 347347 347574 348087 348921
60651 348921 349827 350609 351431 352473 353552 354396 355130 356114 357361 358378 358603 357790 356059 353839 351760 350230
60635 350230 348996 347370 345037 342428 340152 338343 336837 335724 335231 335128 334719 333624 332281 331492 331701
60620 331701 332854 334612 336424 337658 338131 338365 338986 339872 340343 340178 340014 340604 342013 343771 345479 347041
60604 347041 348452 349630 350383 350449 349751 348713 348053 348077 348372 348413 348260 348425 349269 350810 352872 355068 356768
60587 356768 357591 357907 358502 359676 361043 362236 363397 364867 366762 369103 371992 375350 378700 381595 384275
60572 384275 387605 392243 398007 404154 410240 416590 423771 431665 439329 445930 451602 457022 462259 466512
60558D66512K516P61o97k109l398l889l240k078j203n80L87J816L141L925M381
60543D66245M902N519O079O707P680Q861R642R640R223R041R171Q986P904N989
60529E75589L770J751J59r77j781k412k875l042k954k865k882k716k109j245n09
60514E54902J3M65Q47J145J672K730L930M492M464N032P116J0082J2493J3978
60500F23361J5624J8461K2091K5197K6972K7619K7694K7382K6508K4879K2450
60489H88238J9273J5341J0427M194l272j1016j7676k2608k6317k9534l2214l3700
60477G61136l3608l2144k9764k7033k4640k2965k1522j9448j6642j3940j2037
60466E07393j0881j0249j0227j0575j0332q712o215m181l434l718m223m244l580
$$ plain form
60558 466512 469028 469789 469092 466983 463585 459696 456456 454378 453175 452595 452982 454798 457939 461864 466245
60543 466245 471147 476666 482745 489452 497132 505993 515635 525275 534498 543539 552710 561696 569600 575589
60529 575589 579359 581110 581269 580292 578511 576099 573224 570182 567228 564363 561481 558765 556656 555411 554902
60514 554902 554915 555380 556227 557372 559044 561774 565704 570196 574660 579692 586808 596890 609383 623361
60500 623361 638985 657446 679537 704734 731706 759325 787019 814401 840909 865788 888238
60489 888238 907511 922852 933279 937473 934201 923185 905509 882901 856584 827050 794836 761136
60477 761136 727528 695384 665620 638587 613947 590982 569460 550012 533370 519430 507393
60466 507393 496512 486263 476036 465461 455129 446417 440202 436021 432587 428869 424646 420402 416822
60453D16822k767k613l148l435k872k114k010k217j898j307j430k147k192j149
60439C85523j76j77m90j81L39N6r73j704j543q64k88j53m80r16q32j24M26J01
60421C77544o48p80j09N67P14O16O68P87Q05Q38R37Q67N22K52L89P73R55P95O13
60402C87105P54J175J525J581J515J617J835J853J632J517J635J652J402J317
60388D08115J762K313K293J799J541J787K087K099K032K132K286K334K298K194
60374D37072K030K104K757L638L800K873J652J089J196J410J687K452L588M159
60360D71507L451J892O46M66J197K255L257M060M533M647M726N155N740N761M857
60345E24150L548K461J501K30j283k660l930n236n964n233l425k216k562l534
$$ plain form
60453 416822 414055 411442 408294 404859 401987 399873 397863 395646 393748 392441 391011 388864 386672 385523
60439 385523 385347 385170 384680 384499 384838 384894 383921 382217 380674 379810 379522 379369 378889 377973 377141 377017 377443 377544
60421 377544 376896 376116 376007 376574 377288 377904 378572 379359 380164 381002 381939 382806 383328 383580 383969 384742 385697 386492 387105
60402 387105 387859 389034 390559 392140 393655 395272 397107 398960 400592 402109 403744 405396 406798 408115
60388 408115 409877 412190 414483 416282 417823 419610 421697 423796 425828 427960 430246 432580 434878 437072
60374 437072 439102 441206 443963 447601 451401 454274 455926 457015 458211 459621 461308 463760 467348 471507
60360 471507 474958 476850 477496 477962 479159 481414 484671 488731 493264 497911 502637 507792 513532 519293 524150
60345 524150 527698 530159 531660 531890 530607 527947 524017 518781 512817 507584 504159 501943 499381 495847
60331D95847l710k983k184j700j405j518k361l432l693k894j810j087o41l20k38
60316D65871j46O89K473M329N369N824O574P918R367J0422J1001J1217J1301J1571
60302E63780J1994J1834J0219P128L383k54l590o597r163j1345j3311j4727j4723
60289E34628j2932j0292q252p346o964o398n554m676l880l221k845k818k936k946
60275D53568k842k794k876k944k768k186j314o10n07r34j330j245p77l61l07n93
60259D29180r36r07k69O73J216R44J17p05j115q97l9R40J151L55m92l12P08J450
60241D31062J421J154J094R82O25M03N81P38N04K74N89J161J304R78P67R44J282
60224D45863J634K059K316J995J302J023J472K002J998J805K223L385M660N431
$$ plain form
60331 495847 492137 489154 486970 485270 483865 482347 479986 476554 472861 469967 468157 467070 466429 466109 465871
60316 465871 465725 466414 468887 473216 478585 484409 490983 498901 508268 518690 529691 540908 552209 563780
60302 563780 575774 587608 597827 604955 608338 608084 604494 597897 588734 577389 564078 549351 534628
60289 534628 521696 511404 503152 495806 488842 482444 476890 472214 468334 465113 462268 459450 456514 453568
60275 453568 450726 447932 445056 442112 439344 437158 435844 435234 434727 433793 432463 431218 430441 430080 429773 429180
60259 429180 428244 427337 427068 427741 428957 429901 430018 429313 428198 427301 427262 428202 429353 429708 429216 428904 429612 431062
60241 431062 432483 433637 434731 435713 436338 436741 437322 438060 438564 438838 439427 440588 441892 442870 443637 444581 445863
60224 445863 447497 449556 451872 453867 455169 456192 457664 459666 461664 463469 465692 469077 473737 479168
60210D79168N551N151M448L819L625L859M166M282M207L998L589L001K493K287
60196E33644K284K168J791J342J124J192J219P39l79j680k512k676k548k544k650
60181E30514k604k397k293k488k879l205l218k814k228j955k189k426k003j032
60167D96783k94j88l16k71k58m85n36J8P71R94P57P44J108J299J146J189J686
60150E04147K058J785J193Q53P74P98J238K427L878M646M408L673K987K584K662
60135E40111L398M480N173N067M439L797L386L142K817K042P04o22j112o84j86
60120E75952l04o68n02K67R52J056P39L06k75j055j641j517q31m29q94j799k233
60103E67124j969j646j785k087j977j464j054r73r96r76j060j265j219n78M57
$$ plain form
60210 479168 484719 489870 494318 498137 501762 505621 509787 514069 518276 522274 525863 528864 531357 533644
60196 533644 535928 538096 539887 541229 542353 543545 544764 545503 545124 543444 540932 538256 535708 533164 530514
60181 530514 527910 525513 523220 520732 517853 514648 511430 508616 506388 504433 502244 499818 497815 496783
60167 496783 496489 496301 495985 495714 495456 494971 494435 494453 495224 496218 496975 497719 498827 500126 501272 502461 504147
60150 504147 506205 507990 509183 510036 510810 511608 512846 515273 519151 523797 528205 531878 534865 537449 540111
60135 540111 543509 547989 553162 558229 562668 566465 569851 572993 575810 577852 578556 577934 576822 576138 575952
60120 575952 575648 574980 574478 574745 575697 576753 577492 577798 577523 576468 574827 573310 572479 572050 571156 569357 567124
60103 567124 565155 563509 561724 559637 557660 556196 555142 554169 553173 552197 551137 549872 548653 548075 548532
60088E48532J266J374Q92M46N87J200J578J221M28j69m25o54q97q18l64j40p88
60071E53269k260l872m877m969m496m238m673n357n502n092m953n429n675m762
60057D87114l056j850j861k591l123k941k076r10O9O74J232K036K736K708J984
60042D80145J327J213J343J346J418J852K314K146J257K24m94r68j379j620j564
60027D88560j472j811k654l546l991l973l858l921m009l800l277k909l203m124
60013D42012n031n284m891m386m158m059l731l118k454j938j534j109n76j6L05
59998D00032J54k49k16O66J932K687K611K108J561R68M30L55Q80J510J736J653
59982D18818J584J420Q33l3o35p65p90j119j720k165j985j086JM38N0l45R7J170
$$ plain form
60088 548532 549798 551172 552064 552510 553097 554297 555875 557096 557524 557355 556930 556276 555379 554561 554197 554057 553269
60071 553269 551009 547137 542260 537291 532795 528557 523884 518527 513025 507933 502980 497551 491876 487114
60057 487114 484058 482208 480347 477756 474633 471692 469616 468706 468775 469449 470681 472717 475453 478161 480145
60042 480145 481472 482685 484028 485374 486792 488644 490958 493104 494361 494585 494091 493123 491744 490124 488560
60027 488560 487088 485277 482623 479077 475086 471113 467255 463334 459325 455525 452248 449339 446136 442012
60013 442012 436981 431697 426806 422420 418262 414203 410472 407354 404900 402962 401428 400319 399743 399727 400032
59998 400032 400186 399937 399721 400387 402319 405006 407617 409725 411286 412254 412684 413039 413919 415429 417165 418818
59982 418818 420402 421822 422655 422622 421987 421222 420432 419313 417593 415428 413443 412357 412358 412796 412846 412501 412598 413768
59964D13768K011K315K470K576K175J126P2l87l68k28R0P10J254J186N52o7k69
59947D28986j54j8p9m13q75j228j454j747k049j931j248n26k85k16L21J233J737
59930D20054J461R05O60P54R70J318J860K450K956L488M109M496M225L320K352
59915D55378J919K117K412K091J068K08N09J871L068L145K440J891J745J510J030
59900D82402Q40J277J831J758J067M60M10P08R01Q71Q55J099J651K357K914L081
59884E04482K885K570K256J817J277J065J569K481L044L032K966L205L244K419
59870E38312R60k65r20j487k265k765k452j629j113j188j355j061l35M07R77J574
59854E25395K395L226L639L601L642M161M752M576L346J540l50k210l829m580
$$ plain form
59964 413768 415779 418094 420564 423140 425315 426441 426513 426126 425758 425530 425620 426330 427584 428770 429322 429255 428986
59947 428986 428832 428814 428735 428322 427447 426219 424765 423018 420969 419038 417790 417264 416979 416763 417084 418317 420054
59930 420054 421515 422420 423080 423834 424804 426122 427982 430432 433388 436876 440985 445481 449706 453026 455378
59915 455378 457297 459414 461826 463917 464985 465193 465702 467573 470641 473786 476226 478117 479862 481372 482402
59900 482402 483242 484519 486350 488108 489175 489635 490045 490753 491654 492525 493380 494479 496130 498487 501401 504482
59884 504482 507367 509937 512193 514010 515287 516352 517921 520402 523446 526478 529444 532649 535893 538312
59870 538312 539272 539007 538087 536600 534335 531570 529118 527489 526376 525188 523833 522772 522437 522844 523821 525395
59854 525395 527790 531016 534655 538256 541898 546059 550811 555387 558733 560273 559923 557713 553884 549304
59840E49304m082k828j756j370j631k403l490m445m832m651m158l373k284j306
59826E06695j019j384j785j890j946k158k323k250k044j741j204o24o17j395k281
59811D82034k512k183j893j783j483q99m51n21j011j580k017k286k403k319j902
59796D56791j112k87k8n36j276j518j118n06p7J17J99L09M88N00l8j074j898j914
59778D47022j398j044j006r10o32l55M3Q88J894K280J942J743K262K958L098K879
59762D61664K911L141L045K645K513K801L001K734K265K090K454L343M527N477
59748E04611N674N140M439L984L678L350L149L254L426L152K234J055K44R0K53
59733E47733J24m57r38p24K7N13K56m04q35q48p37p87j043j378j604j548j222
$$ plain form
59840 549304 545222 542394 540638 539268 537637 535234 531744 527299 522467 517816 513658 510285 508001 506695
59826 506695 505676 504292 502507 500617 498671 496513 494190 491940 489896 488155 486951 486327 485710 484315 482034
59811 482034 479522 477339 475446 473663 472180 471281 470830 470309 469298 467718 465701 463415 461012 458693 456791
59796 456791 455679 455392 455364 454828 453552 452034 450916 450410 450333 450450 450649 450958 451446 451946 451908 450834 448936 447022
59778 447022 445624 444580 443574 442664 442032 441677 441720 442608 444502 446782 448724 450467 452729 455687 458785 461664
59762 461664 464575 467716 470761 473406 475919 478720 481721 484455 486720 488810 491264 494607 499134 504611
59748 504611 510285 515425 519864 523848 527526 530876 534025 537279 540705 543857 546091 547146 547390 547480 547733
59733 547733 547857 547400 546462 545738 545765 546278 546534 546130 545295 544447 543710 542923 541880 540502 538898 537350 536128
59716E36128r57j153j843k538k646k017j117n17l29k52j57l11q46j292j007p5
59700E19071O52M75m14j281j649j589j323q77j91N75J021Q44J83n18r38j044q30
59683E12167k68L35L26n47j637k086j865j624j694j852k021k484l222l725l757
59668D86046l648l490k805j531o59j046k073k362j614p51m16k71M7K89K80M58
59652D66454J142J848J937J499J040O83K40j37j17J00j30r44j675j682j082m49
59636D68727j33j66m90r09j025o46k01l44j094j750j778j460j378j575j565j075
59620D53138l84N4k8o88j740k630k746k036j055k37M83J152J373Q82K59L98J336
59603D47531K103J831O87m01o50QR56J449J338J170J400J706J501R08O03P34O60
$$ plain form
59716 536128 535171 534018 532175 529637 526991 524974 523857 523340 523011 522759 522602 522291 521445 520153 519146 519071
59700 519071 519723 520198 519784 518503 516854 515265 513942 513065 512874 513449 514470 515314 515497 514979 514041 512997 512167
59683 512167 511899 512234 512560 512013 510376 508290 506425 504801 503107 501255 499234 496750 493528 489803 486046
59668 486046 482398 478908 476103 474572 473913 472867 470794 468432 466818 466067 465651 465380 465427 465716 465996 466454
59652 466454 467596 469444 471381 472880 473920 474603 474843 474706 474589 474689 474559 473615 471940 470258 469176 468727
59636 468727 468594 468428 467938 467029 466004 465358 465157 464813 463719 461969 460191 458731 457353 455778 454213 453138
59620 453138 452754 452808 452780 452092 450352 447722 444976 442940 441885 441648 442131 443283 444656 445538 445797 446195 447531
59603 447531 449634 451465 452152 451751 451101 451109 452065 453514 454852 456022 457422 459128 460629 461537 462140 462874 463534
59586D63534k4r05j446j655j678j337n99l5j58o02o05j28J30k85j106j788j950
59569D49363j408l50N08M50m03j143j128n60N1N49R85J208R65M15J64P10J847
59552D52223K746K748K122J757J992K205J878J647K665N024P520Q973R245Q945
59538E11690Q752R168J0154J0767R719O758K994l89l149n346o476o018m360k466
59524E41798q29N53J474J582J024L28l13j040j715k043k260k951m092m967n223
59509E21326n259n415n484n336n218n065m285k812j642j666k425k815k555k189
59495D69160j986j740j442j285j041l20N37O99J46j31N05J514K116K285K355K309
59479D73681K065J961K305K830L178L578M332M976M723L688K884K915L318L327
$$ plain form
59586 463534 463510 462605 461159 459504 457826 456489 455890 455855 455697 455095 454490 454362 454492 454207 453101 451313 449363
59569 449363 447955 447605 448113 448563 448160 447017 445889 445329 445380 445929 446914 448122 449087 449502 449666 450376 452223
59552 452223 454969 457717 459839 461596 463588 465793 467671 469318 471983 477007 484527 493500 502745 511690
59538 511690 520442 529610 539764 550531 560250 567008 570002 569613 566464 561118 554642 548624 544264 541798
59524 541798 540969 541522 542996 544578 545602 545930 545617 544577 542862 540819 538559 535608 531516 526549 521326
59509 521326 516067 510652 505168 499832 494614 489549 485264 482452 480810 479144 476719 473904 471349 469160
59495 469160 467174 465434 463992 462707 461666 461346 461883 462582 462728 462597 463102 464616 466732 469017 471372 473681
59479 473681 475746 477707 480012 482842 486020 489598 493930 498906 503629 507317 510201 513116 516434 519761
59465E19761K719J737P32J29K98J082J787J986K091K806M215N663O446O404N900
59450E63756N424N140M758L892K599J368N65P4m66j301k484l850m922n144m458
59435E64951l479k895k789k762k460j768o80O80K005L046L905M847N859O672P323
59420E82455Q388J0396J3013J5049J5533J4794J4174J4563J5485J5831J4979J2753
59408G47413Q791L048l158p707r680r969r523q040n102j600R84K076J736m08m583
59393G04278r491j3005j4337j4379j3891j2667j0744q983p796o502m728l324l017
59380E81414l072k375j128l43j47J69P16Q25K97k10j99R8L98Q18J380J741J776
59363E82158J912K518L327L849M082M462N187N893O066N683N342N595O276O792
$$ plain form
59465 519761 522480 524217 524949 525078 525376 526458 528245 530231 532322 535128 539343 545006 551452 557856 563756
59450 563756 569180 574320 579078 582970 585569 586937 587502 587576 587110 585809 583325 579475 574553 569409 564951
59435 564951 561472 558577 555788 553026 550566 548798 548118 548798 550803 553849 557754 562601 568460 575132 582455
59420 582455 590843 601239 614252 629301 644834 659628 673802 688365 703850 719681 734660 747413
59408 747413 756204 759252 756094 748387 738707 728738 719215 711175 706073 704473 705457 707533 709269 708861 704278
59393 704278 694787 681782 667445 653066 639175 626508 615764 606781 598985 592483 587755 584431 581414
59380 581414 578342 575967 574839 574496 574349 574518 575234 576059 576356 576146 575947 576045 576443 577261 578641 580382 582158
59363 582158 584070 586588 589915 593764 597846 602308 607495 613388 619454 625137 630479 636074 642350 649142
59349F49142P089P823R251J0625J1119J0987J0973J0952J0006P897N513L719K427
59336G57523J153k36j698l389n339p102q218q794r258r793j0278j0613j0770j0708
59322F62480j0470j0284j0228j0002r246p994o597n315m190l190k220j100K34
59309E81878J548K487K940L086L175L440M054M885N261M301J718j761m918o967
59295F05127p961q401q651q734q489p720o244m185k212j202j370j916j842r54
59281E35246J79J096J885K796L782M611N170N552N987O692P675Q607R130R198
59267F07606Q984Q513P676O530N308M108K859J598L94q93k375l637m085l927m185
59252F34474n357o568o542n160l469k403k020j967j971j787j146o7J016J749K318
$$ plain form
59349 649142 656231 664054 673305 683930 695049 706036 717009 727961 737967 745864 751377 755096 757523
59336 757523 758676 758440 756742 753353 748014 740912 732694 723900 714642 704849 694571 683958 673188 662480
59322 662480 652010 641726 631498 621496 612250 604256 597659 592344 588154 584964 582744 581644 581878
59309 581878 583426 585913 588853 591939 595114 598554 602608 607493 612754 617055 618773 617012 612094 605127
59295 605127 597166 588765 580114 571380 562891 555171 548927 544742 542530 541328 539958 538042 536200 535246
59281 535246 535425 536521 538406 541202 544984 549595 554765 560317 566304 572996 580671 589278 598408 607606
59267 607606 616590 625103 632779 639309 644617 648725 651584 653182 653576 652683 650308 646671 642586 638659 634474
59252 634474 629117 622549 616007 610847 607378 604975 602955 600988 599017 597230 596084 596017 597033 598782 601100
59237F01100L117M056M536M136L105J992J040K30k79k34Q8j24j255k623l294l318
59221F12273l628m777o270p241p357o894o295n856n644n522n328n006m522l818
59207E34115l090k794k984k951k127j103r29j489j547o19K57J52l43j23O97J144
59191E16266R70R03J313J699J625J441J690K288K751K893K980L232L419L130K395
59176E48995J843J992K571K923L001L358M059M340L792L208L561M561N043M510
59162E97757L555K799K183J431N84k11j052k131l481m904o023o555o599o606o760
59147E63987o722o204n515n062m650l890l086k978l595m055l766l183l050l316
59133E04915l205k260r85l20n24p28J23J854L154L271K994L413M308M653M267
$$ plain form
59237 601100 604217 608273 612809 616945 620050 622042 623082 623312 623033 622799 622887 622763 621508 618885 615591 612273
59221 612273 608645 603868 597598 590357 583000 576106 569811 563955 558311 552789 547461 542455 537933 534115
59207 534115 531025 528231 525247 522296 520169 519066 518137 516648 515101 514482 514739 514891 514548 514425 515122 516266
59191 516266 517236 518139 519452 521151 522776 524217 525907 528195 530946 533839 536819 540051 543470 546600 548995
59176 548995 550838 552830 555401 558324 561325 564683 568742 573082 576874 580082 583643 588204 593247 597757
59162 597757 601312 604111 606294 607725 608309 608098 607046 604915 601434 596530 590507 583952 577353 570747 563987
59147 563987 557265 551061 545546 540484 535834 531944 528858 525880 522285 518230 514464 511281 508231 504915
59133 504915 501710 499450 498465 498145 497621 496893 497016 498870 502024 505295 508289 511702 516010 520663 524930
59118E24930M022M417N004N288N368N405N324N263N646O416O857O512N824N493
59104F01769N638N842N571M384K322K51p71p07n46r04j385j546j616j799j694
59089F14809j101o53q92j307j174q27j153k180l090l468l634l834l919l896m044
59074E79637m383m627m703m755m621l941k875k054j825j979k347k915l306k954
59060E32352k092j806k581l380k917j399l03m87j246j350m81O16J103Q23K34j90
59044E16896l52l98l58r2L97Q20R58R76J163J436J433J123R40J190J593J834K249
59027E31808L461N323O757O996O495O287O674P139P351P619Q167Q531Q021O544
59013F27173M619K778J245Q6o47j087j586k356l056k934j593M62K204L047L231
$$ plain form
59118 524930 528952 533369 538373 543661 549029 554434 559758 565021 570667 577083 583940 590452 596276 601769
59104 601769 607407 613249 618820 623204 625526 625777 625006 624299 623753 622849 621464 619918 618302 616503 614809
59089 614809 613708 613055 612163 610856 609682 608855 607702 605522 602432 598964 595330 591496 587577 583681 579637
59074 579637 575254 570627 565924 561169 556548 552607 549732 547678 545853 543874 541527 538612 535306 532352
59060 532352 530260 528454 525873 522493 519576 518177 517874 517387 516141 514791 514310 514926 516029 516852 517086 516896
59044 516896 516544 516146 515788 515696 516093 516913 517871 518847 520010 521446 522879 524002 524942 526132 527725 529559 531808
59027 531808 535269 540592 547349 554345 560840 567127 573801 580940 588291 595910 604077 612608 620629 627173
59013 627173 631792 634570 635815 635901 635254 634167 632581 630225 627169 624235 622642 623104 625308 628355 631586
58998F31586L237L230L232L424L919M461M650M269L192J426l72j022j82Q14M71
58983F66335q54j550j133p69j161j396m89J070K279L163M360N779O764P161P298
58968F96857P176O624O019O037O706P483Q065Q423Q237P177N740M870M602L851
58954G87867J789j181m103o511q444r866j0572j0567j0185r846r698r535r095
58941F90053q419p703o816n461l940l156l404l728l141j991j364j452j451r28
58927F37099l21q3j20k69n02n76j66M33M73k05r22j114r00n37m6M27N94O97J416
58908F35378K771L834L955L659L810M532N521O754Q219R373R680R402R238R366
58894G25492R392R154Q988R287J0166J1493J2903J3874J4163J4027J3823J3495
$$ plain form
58998 631586 634823 638053 641285 644709 648628 653089 657739 662008 665200 666626 666254 665232 665050 665864 666335
58983 666335 665481 663931 662798 662029 660868 659472 658983 660053 662332 665495 669855 675634 682398 689559 696857
58968 696857 704033 710657 716676 722713 729419 736902 744967 753390 761627 768804 774544 779414 784016 787867
58954 787867 789656 788475 784372 777861 769417 759551 748979 738412 728227 718381 708683 699148 690053
58941 690053 681634 673931 667115 661654 657714 654558 651154 647426 644285 642294 640930 639478 638027 637099
58927 637099 636778 636695 636575 636306 635804 635228 635062 635495 635968 635763 634841 633727 632827 632290 632244 632671 633265 633962 635378
58908 635378 638149 641983 645938 649597 653407 657939 663460 670214 678433 687806 697486 706888 716126 725492
58894 725492 734884 744038 753026 762313 772479 783972 796875 810749 824912 838939 852762 866257
58882H66257J2727J1355R326O616L472N28j780l707n745p905r821j1320j2422
58869H57581j2935j2616j1654j0555r531q472p470o912o896p019o879o532o269
58856G43841o228o359o598o815o778o335n694n334n496n862n861n353m830m761
58842F61537n037n270n464n837o164n953n279m851m938n015m715m494m727m831
58828E88962m008k515j346q32m14K90R44J220J327J556J805J854J823K026K581
58813E95273L256L584L141J947O23j00k3M80R38R56J70j458l247m234m150l634
58797E93522l369l399l447l479l650l967m285m474m424l969l041j838p54j51j24
58782E49151l91m80j76L01O98J061J400J352O95k7l5M83M63o11k032k945l350
$$ plain form
58882 866257 878984 890339 899665 906281 909753 910281 908501 904794 899049 891144 881323 870003 857581
58869 857581 844646 832030 820376 809821 800290 791818 784348 777436 770540 763521 756642 750110 743841
58856 743841 737613 731254 724656 717841 711063 704728 699034 693700 688204 682342 676481 671128 666298 661537
58842 661537 656500 651230 645766 639929 633765 627812 622533 617682 612744 607729 603014 598520 593793 588962
58828 588962 584954 582439 581093 580261 579847 580137 581081 582301 583628 585184 586989 588843 590666 592692 595273
58813 595273 598529 602113 605254 607201 607824 607724 607701 608181 609119 610075 610245 608787 605540 601306 597156 593522
58797 593522 590153 586754 583307 579828 576178 572211 567926 563452 559028 555059 552018 550180 549426 549275 549151
58782 549151 548760 548280 548104 548405 549103 550164 551564 552916 553611 553584 553549 554032 554495 553884 551852 548907 545557
58765E45557l609l611l090k377k036j995j675q83k1N56Q91J122J346J773K520
58750E34468L238L395L015K640K531K357J911J511J495J673J721J721K025K721
58736E66422L606M434M931M782M010L234L193L989N031N638N515M784L871L257
58722F26697L063K919K494K025K042K657L474M192M811N258N242M698L977L392
58708F76941K800J872M99j234l204n123o528p232p685q562j0002j1393j1956j1458
58694E97735j0440r792r927j0305r937q488o677n470n056m853m322l567l121l280
58680E02500l656l444k336j009l89m55k96N45J456J827J998K616L587M423N215
58665E12582O344P449P717P239P117P833Q283P066M228J197q47j995l041m270
$$ plain form
58765 545557 541948 538337 535247 532870 530834 528839 527164 526281 526260 526816 527707 528829 530175 531948 534468
58750 534468 537706 541101 544116 546756 549287 551644 553555 555066 556561 558234 559955 561676 563701 566422
58736 566422 570028 574462 579393 584175 588185 591419 594612 598601 603632 609270 614785 619569 623440 626697
58722 626697 629760 632679 635173 637198 639240 641897 645371 649563 654374 659632 664874 669572 673549 676941
58708 676941 679741 681613 682112 680878 677674 672551 666023 658791 651106 642544 632542 621149 609193 597735
58694 597735 587295 577503 567576 557271 547334 538846 532169 526699 521643 516790 512468 508901 505780 502500
58680 502500 498844 495400 493064 492055 491666 491211 490915 491460 492916 494743 496741 499357 502944 507367 512582
58665 512582 518926 526375 534092 541331 548448 556281 564564 571630 575858 577055 576208 574213 571172 566902
58651E66902n126n033m295l802l858l807l121k285k082k374k365j810j194p93
58637E24957l81P1K71K78N83J257J761J777J568J274O83o8l29oP4n68j158p48
58619E31296M43J493K104K652L316L911M336M536M287L573K976K958L093K629
58605E73603J622P82L67Mm71p37o41m44k61J16P16J152J146Q75O37N43P48J598
58587E81355L310N543P476Q391Q267P855P932Q491Q881Q751Q333P709O507M755
58573F83556L352K987L141L007K995M261O830R282J0510J0996J1914J3615J5402
58560G81848J6416J6436J5923J5459J4982J3767J1352Q208N085K071r96l513m466
58547H92572l942l330l734m875n905o569p130p708q304r106j0234j1364j2002
$$ plain form
58651 566902 561776 556743 552448 548646 544788 540981 537860 535575 533493 531119 528754 526944 525750 524957
58637 524957 524576 524647 524918 525196 525779 527036 528797 530574 532142 533416 534099 534031 533702 533696 533770 533202 532044 531296
58619 531296 531739 533232 535336 537988 541304 545215 549551 554087 558374 561947 564923 567881 570974 573603
58605 573603 575225 576007 576374 576378 575907 575170 574529 574085 573824 573940 574656 575808 576954 577829 578466 579009 579757 581355
58587 581355 584665 590208 597684 606075 614342 622197 630129 638620 647501 656252 664585 672294 678801 683556
58573 683556 686908 689895 693036 696043 699038 703299 710129 719411 729921 740917 752831 766446 781848
58560 781848 798264 814700 830623 846082 861064 874831 886183 894391 899476 901547 900551 897038 892572
58547 892572 888630 885300 881566 876691 870786 864217 857087 849379 841075 831969 821735 810371 798369
58534G98369j2068j1898j1772j1631j1157j0043q238o037l830j906n66j61o59
58521G08403j347j510j289j373j867k132j788j266j108j310j601j963k454k931
58507F84464l167l075k622j901j407j709k665l318k929j753n92R7L21K05m8j30
58491F59771J28N42R06J292J860K569L301M075M913N697O305O761P077P205P272
58476G19674P578Q127Q379P801O494N049L775K393N21j652l352m016l944l899
58462G52928m070l839k784j374j61J111K901M673N344M907M594N160N876N708
58448G80974M651L333J907R4k039l955n281n983o069n529m574l560k650j704n59
58433G49056O87J696K234K519L056L974M804N193N515O254P044P035O135N096
$$ plain form
58534 798369 786301 774403 762631 751000 739843 729800 721562 715525 711695 709789 709223 709062 708403
58521 708403 707056 705546 704257 702884 701017 698885 697097 695831 694723 693413 691812 689849 687395 684464
58507 684464 681297 678222 675600 673699 672292 670583 667918 664600 661671 659918 659326 659423 659744 659949 659901 659771
58491 659771 659899 660441 661347 662639 664499 667068 670369 674444 679357 685054 691359 698120 705197 712402 719674
58476 719674 727252 735379 743758 751559 758053 763102 766877 769270 769791 768139 764787 760771 756827 752928
58462 752928 748858 745019 742235 740861 740700 741811 744712 749385 754729 759636 764230 769390 775266 780974
58448 780974 785625 788958 790865 790959 788920 784965 779684 773701 767632 762103 757529 753969 751319 749615 749056
58433 749056 749743 751439 753673 756192 759248 763222 768026 773219 778734 784988 792032 799067 805202 810298
58419H10298M311L357J941N21m76j313k351l342l876m094m409m856n175n265n162
58404G80109m748l853k525r48O12J725J961J422Q04P31J231J989K759L382L797
58389G88448M133M417M209L045J313O8k34j70l01m26j57M08J123K263L996N802
58373H17937P020P594P942Q373Q949R519R681R097Q166P873Q642R813J0565J0815
58359I41986J0927J0999J0894J0569J0024R259Q448P747O946N860M991M995N513
58346A049158N564N194N537O945Q400R269J0188J1485J2198J1774J1407J2291
58334A159410J3735J4462J4803J5910J7477J8037J7245J6175J5481J4734J3718
58323A331187J2958J2746J2698J2544J2432J2380J2237J2280J3033J4403J5677
$$ plain form
58419 810298 814609 817966 819907 820428 819952 818639 816288 812946 809070 804976 800567 795711 790536 785271 780109
58404 780109 775361 771508 768983 768035 768647 770372 772333 773755 774559 775290 776521 778510 781269 784651 788448
58389 788448 792581 796998 801207 804252 805565 805633 805399 805229 804928 804502 804345 804753 805876 808139 812135 817937
58373 817937 824957 832551 840493 848866 857815 867334 877015 886112 894278 902151 910793 920606 931171 941986
58359 941986 952913 963912 974806 985375 995399 1004658 1013106 1020853 1027799 1033659 1038650 1043645 1049158
58346 1049158 1054722 1059916 1065453 1072398 1080798 1090067 1100255 1111740 1123938 1135712 1147119 1159410
58334 1159410 1173145 1187607 1202410 1218320 1235797 1253834 1271079 1287254 1302735 1317469 1331187
58323 1331187 1344145 1356891 1369589 1382133 1394565 1406945 1419182 1431462 1444495 1458898 1474575
58312A474575J6440J6850J7128J7452J8225J9707K1434K2706K3522K4411K5501
58301A697951K6426K7023K7507K8071K8831K9949L1323L2487L3264L4104L5279
58290B032215L6364L7150L8321M0456M3003M5130M7004M9267N1802N4059N6097
58279B530868N8402O1087O4223O8378P3836P9899Q5844R1997R8861J05978J12791
58268C432164J19776J27386J34679J40466J45265J50516J56486J62475J68603
58259D737816J75753J83991J92647K01713K11610K21760K30854K38447K45120
58250F639711K51488K58250K66668K77587K90205L02907L14679L24944L33384
58241I259823L41355L51943L66722L83793M00899M18795M39266M61699M84695
$$ plain form
58312 1474575 1491015 1507865 1524993 1542445 1560670 1580377 1601811 1624517 1648039 1672450 1697951
58301 1697951 1724377 1751400 1778907 1806978 1835809 1865758 1897081 1929568 1962832 1996936 2032215
58290 2032215 2068579 2105729 2144050 2184506 2227509 2272639 2319643 2368910 2420712 2474771 2530868
58279 2530868 2589270 2650357 2714580 2782958 2856794 2936693 3022537 3114534 3213395 3319373 3432164
58268 3432164 3551940 3679326 3814005 3954471 4099736 4250252 4406738 4569213 4737816
58259 4737816 4913569 5097560 5290207 5491920 5703530 5925290 6156144 6394591 6639711
58250 6639711 6891199 7149449 7416117 7693704 7983909 8286816 8601495 8926439 9259823
58241 9259823 9601178 9953121 10319843 10703636 11104535 11523330 11962596 12424295 12908990
58232A2908990N09372N37296N66171N91456O11936O30195O48170O66026O85019
58223A8354631P07309P32652P59036P86826Q18756Q55975Q97970R46182J003265
58214B5862602J068803J140308J218738J308175J410067J523335J650787J799750
58206C6982565J975645K181380K424602K719280L078805L514974M046214M699362
58198F1622827N499932O466331P613023Q947149J0456765J2110766J3869977J5680847
58190A42267617J7456374J9094019K0526180K1693278K2368763K1981783J9711779
58183B85099793J4935375P742703q96960r485538j6627413k1526292k4090776
58176B35150892k4703661k3904658k2192715j9975011j7571327j5208622j3018572
$$ plain form
58232 12908990 13418362 13955658 14521829 15113285 15725221 16355416 17003586 17669612 18354631
58223 18354631 19061940 19794592 20553628 21340454 22159210 23015185 23913155 24859337 25862602
58214 25862602 26931405 28071713 29290451 30598626 32008693 33532028 35182815 36982565
58206 36982565 38958210 41139590 43564192 46283472 49362277 52877251 56923465 61622827
58198 61622827 67122759 73589090 81202113 90149262 100606027 112716793 126586770 142267617
58190 142267617 159723991 178818010 199344190 221037468 243406231 265388014 285099793
58183 285099793 300035168 307777871 306880911 297395373 280767960 259241668 235150892
58176 235150892 210447231 186542573 164349858 144374847 126803520 111594898 98576326
58169I8576326j1062478r365197p929110o734168n746217m931816m262947l712636
58161D4831757l255399k872494k551317k280051k047618j847632j677096j531149
58153B6769001j403109j288935j187431j096464j012950r36252q67655q06566
58145A8169639p50686o99777o55734o18812n86875n58376n33122n10098m87504
58136A2768655m65199m44523m25669m07524l89938l73486l57227l39349l20097
58127I245643l01589k84713k68631k53284k39791k28234k17447k07206j98257
58118G046491j90183j81705j73330j67083j63146j59260j54021j48437j43436
58109E565890j38199j31986j25734j20670j16795j13602j10900j08285j05206
$$ plain form
58169 98576326 87513848 78148651 70219541 63485373 57739156 52807340 48544393 44831757
58161 44831757 41576358 38703864 36152547 33872496 31824878 29977246 28300150 26769001
58153 26769001 25365892 24076957 22889526 21793062 20780112 19843860 18976205 18169639
58145 18169639 17418953 16719176 16063442 15444630 14857755 14299379 13766257 13256159 12768655
58136 12768655 12303456 11858933 11433264 11025740 10635802 10262316 9905089 9565740 9245643
58127 9245643 8944054 8659341 8390710 8137426 7897635 7669401 7451954 7244748 7046491
58118 7046491 6856308 6674603 6501273 6334190 6171044 6011784 5857763 5709326 5565890
58109 5565890 5427691 5295705 5169971 5049301 4932506 4818904 4708004 4599719 4494513
58100D494513j01993r9561r7714r5268r2126q9577q7992q5924q2235p7707p3766
58089C510650p0796o8392o6173o3782o1030n8467n6803n5653n3975n1853n0461
58078B853265n0121m9797m8813m7635m6638m5534m4411m3919m3986m3737m3054
58067B345620m2701m2644m1833m0204l9080l8966l8585l7024l5208l4187l3459
58056A921729l2217l0923l0436l0573l0678l0697l0593k9724k7838k5870k4737
58045A597443k4125k3411k2781k2531k2160k1364k0993k1733k2595k2128k0615
58034A353007j9655j9852k0222j9904j9279j9181j9782k0527k0731k0149j9177
58023A134548j8449j8152j7980j7792j7684j7423j6554j5388j4902j5232j5244
$$ plain form
58100 4494513 4392520 4292959 4195245 4099977 4007851 3918274 3830282 3744358 3662123 3584416 3510650
58089 3510650 3439854 3371462 3305289 3241507 3180477 3122010 3065207 3009554 2955579 2903726 2853265
58078 2853265 2803144 2753347 2704534 2656899 2610261 2564727 2520316 2476397 2432411 2388674 2345620
58067 2345620 2302919 2260275 2218442 2178238 2139158 2100192 2061607 2024583 1989375 1955188 1921729
58056 1921729 1889512 1858589 1828153 1797580 1766902 1736205 1705612 1675888 1648050 1622180 1597443
58045 1597443 1573318 1549907 1527126 1504595 1482435 1461071 1440078 1418345 1395750 1373622 1353007
58034 1353007 1333352 1313500 1293278 1273374 1254095 1234914 1215132 1194605 1173874 1153725 1134548
58023 1134548 1116099 1097947 1079967 1062175 1044491 1027068 1010514 995126 980224 964992 949748
58012I49748j4232j3076j2793j2846j2015j0364r158r089r661j0216j0571j0648
58000H15079j0248r395q405p550o954o684o617o451o123n941o001n946n556n191
57986G18017n191n359n438n655o235o906p354p709q052q051p653p605q405r204
57972F19200q693o866n067m328m452m746m907m994n008m777m106k995j889j434
57958E54938j843k612l113l238l298l574m108m637m657l927k986k632k814k744
57944E08755k200j854j916j568l31R08J148P74Q20J333J560J376J374J781K161
57929E14121K200J914J162k60k067l671m919o045p027p554p563p229o598n705
57915D60759m891m464m224l852l445l175k775j981j122n44R9J188K140K058J091
$$ plain form
58012 949748 935516 922440 909647 896801 884786 874422 865264 856175 846514 836298 825727 815079
58000 815079 804831 795436 787031 779481 772527 765843 759226 752775 746652 740711 734710 728764 723208 718017
57986 718017 712826 707467 702029 696374 690139 683233 675879 668170 660118 652067 644414 636809 628404 619200
57972 619200 610507 603641 598574 594246 589794 585048 580141 575147 570139 565362 561256 558261 556372 554938
57958 554938 553095 550483 547370 544132 540834 537260 533152 528515 523858 519931 516945 514313 511499 508755
57944 508755 506555 504701 502785 501217 500886 501794 502942 503716 504536 505869 507429 508805 510179 511960 514121
57929 514121 516321 518235 519397 519137 517070 513399 508480 502435 495408 487854 480291 473062 466464 460759
57915 460759 455868 451404 447180 443328 439883 436708 433933 431952 430830 430286 430385 431573 433713 435771 436862
57900D36862J13p10j887l161l468k629j914k324l225l359k551j688j422j490j293
57885D05854p25l41p02j598k183k029j677j725j884j628j335j826k886l336k682
57870C79297j756j440j638j809j767j460p00L62J053J025Q63J381K533L511L687
57855C83142L184K654K698L331L888L663K695J628R15M62O5l35q58j635k449k921
57839D00127l141l578m222m456l992l375l185l272l163k768k270j681j012n97
57825C59415p86j408j874j747j070k44K43J38m00j006j533k034k470k732k992
57810C39500l574m429n104n278m976m259l218k326k188k756l264l219k876k536
57796B89497j958r56o0L9n47j015p90N9J192K375L469M303M687M596M375M631
$$ plain form
57900 436862 436975 436265 434378 431217 427749 425120 423206 420882 417657 414298 411747 410059 408637 407147 405854
57885 405854 405129 404788 404086 402488 400305 398276 396599 394874 392990 391362 390027 388201 385315 381979 379297
57870 379297 377541 376101 374463 372654 370887 369427 368727 369089 370142 371167 372030 373411 375944 379455 383142
57855 383142 386326 388980 391678 395009 398897 402560 405255 406883 407798 408260 408325 407990 407132 405497 403048 400127
57839 400127 396986 393408 389186 384730 380738 377363 374178 370906 367743 364975 362705 361024 360012 359415
57825 359415 358629 357221 355347 353600 352530 352286 352529 352667 352267 351261 349728 347694 345224 342492 339500
57810 339500 335926 331497 326393 321115 316139 311880 308662 306336 304148 301392 298128 294909 292033 289497
57796 289497 287539 286583 286523 286562 286015 285000 284210 284269 285461 287836 291305 295608 300295 304891 309266 313897
57780C13897N553O460O437N480M516M201M251M115L744L324K769J915R08J5p11
57765C66874j374k082k966l988m640m400l665l503m156m515l685k307j635j819
57751C22139j984j652j123o09N3P85J137R50N68L01J70K23N54R83J149J080J103
57734C25827J235J180J005J212J860K223J687N49m41r47j055q06k18L31K64n40
57718C33366j546k175k346k312k167j758j091n50n55j071j651j960k062k144k207
57703C07771k158k024j874j649j288r86j060j517j912j721r00ML25o9n92n03L92
57686B90239J622K559K882K676K306K220K632L382M303N623P649J0139J2524J4754
57672C65510J7371K0538K3609K6026K8038L0026L1477L1190K8260K2318J3236
$$ plain form
57780 313897 319450 325910 332347 337827 342343 346544 350795 354910 358654 361978 364747 366662 367570 367585 366874
57765 366874 365500 363418 360452 356464 351824 347424 343759 340256 336100 331585 327900 325593 323958 322139
57751 322139 320155 318503 317380 316771 316824 317609 318746 319696 320264 320565 320735 320958 321512 322495 323644 324724 325827
57734 325827 327062 328242 329247 330459 332319 334542 336229 336778 336337 335390 334335 333529 333311 333642 333906 333366
57718 333366 331820 329645 327299 324987 322820 321062 319971 319421 318866 317795 316144 314184 312122 309978 307771
57703 307771 305613 303589 301715 300066 298778 297792 296732 295215 293303 291582 290682 290686 291011 290942 290350 289847 290239
57686 290239 291861 294420 297302 299978 302284 304504 307136 310518 314821 320444 328093 338232 350756 365510
57672 365510 382881 403419 427028 453054 481092 511118 542595 573785 602045 624363 637599
57661F37599J461j1305k2460k9952l3268l3230l1218k8535k5918k3328k0410j7219
57649C62217j4303j2090j0487r129p758o348n094m183l504k638j425l35N6j74
57635B84805m34m17l10k86k85k92l99n13m60l75o00j065j344j397j686k287k538
57618B70117j961j071p19r72j243j279j329j422j139l92J59j45j037j585j284
57603B54698n78k07l71p39j014j223j425j518j419j267j232j275j278j264j366
57588B38522j567j739j839j951k105k225k220k076j871j752j733j561r67j80J64
57573B14900k09q27j141j256j553j945k013j725j417j128o01K7K69J47L35J116
57557B02979J799J661R65N01M83M49J20k37l48k91k19n4L69R56J325J157N65P5
$$ plain form
57661 637599 639060 627755 605295 575343 542075 508845 477627 449092 423174 399846 379436 362217
57649 362217 347914 335824 325337 316208 308450 302102 297008 292825 289321 286683 285258 284923 284979 284805
57635 284805 284371 283954 283644 283358 283073 282781 282382 281869 281409 281034 280434 279369 278025 276628 274942 272655 270117
57618 270117 268156 267085 266366 265394 264151 262872 261543 260121 258982 258590 258749 258604 257567 255982 254698
57603 254698 254120 253913 253542 252803 251789 250566 249141 247623 246204 244937 243705 242430 241152 239888 238522
57588 238522 236955 235216 233377 231426 229321 227096 224876 222800 220929 219177 217444 215883 214916 214736 214900
57573 214900 214691 213864 212723 211467 209914 207969 205956 204231 202814 201686 201085 201112 201381 201528 201863 202979
57557 202979 204778 206439 207404 207905 208388 208837 208957 208720 208372 208081 207862 207808 208177 209133 210458 211615 212180 212255
57539B12255J02N07Q20R60J321K013K421J879O48k62k33L41O45L66j63n43p35
57522B22342q71q71n16R5M71L20k1m9K18M12N55R98J558J443M44m75l02O73J348
57503B27772J352J259J381J205L27p69j290j135q28p68r52j245j502j476j006
57488B22325l27J13J60Q8J23J14j38m65m94j89K0k17o38n72L03J510K194J929
57470B25839J059K70p3j25k10m18o02o43n48l62j45n7l41r73j485j335m74N56
57452B19933J196J341J240J078Q64O48O13Q56J155J163Q40O06Q10J188J085L21
57436B34937m65n96j89J57L01O65J404K014K020J587J194J005Q94P87P14O75P51
57419B47855J089J474J324M76k95j51O63J174J066R53J217J434J248J066J311
$$ plain form
57539 212255 212357 212864 213684 214644 215965 217978 220399 222278 222926 222664 222431 222772 223417 223783 223620 223077 222342
57522 222342 221471 220600 220084 220179 220650 220970 220949 220900 221118 221530 222085 223083 224641 226084 226528 226053 225751 226424 227772
57503 227772 229124 230383 231764 232969 233296 232527 231237 230102 229274 228506 227554 226309 224807 223331 222325
57488 222325 221998 222111 222271 222359 222482 222596 222458 221993 221499 221310 221330 221113 220475 219903 220206 221716 223910 225839
57470 225839 226898 227168 227095 226970 226760 226342 225740 225097 224549 224187 224042 223985 223644 222671 221186 219851 219377 219933
57452 219933 221129 222470 223710 224788 225652 226300 226913 227769 228924 230087 230927 231533 232343 233531 234616 234937
57436 234937 234472 233876 233687 233844 234145 234810 236214 238228 240248 241835 243029 244034 244928 245715 246429 247104 247855
57419 247855 248944 250418 251742 252218 251923 251772 252435 253609 254675 255628 256845 258279 259527 260593 261904
57404B61904J574J212M27K8L03P71J073J369J801K065J846J284P56M29K84L43
57388B77469O88J306K082K767L007K626J943J570J714J962J921J763J935K489
57374C05242L011L049K474J503O27L11N67R63J215J529K083K487K266J674J486
57359C30487J922K442K694L045L865M734M901M276L566L465M063M937N549N581
57345C85527N145M677M538M670M781M774M793M930N100N240N428N747O081O214
57331D57645O082N941O120O612O988O864O406O143O350O734O809O358N624N209
57317E45885N716P137Q596R091Q600Q102Q344R030R389R188Q812Q635Q704Q924
57303F64153R252R760J0602J1719J2640J2947J3013J3721J5236J6650J7212J7269
$$ plain form
57404 261904 263478 264690 265117 265145 265448 266219 267292 268661 270462 272527 274373 275657 276413 276842 277126 277469
57388 277469 278157 279463 281545 284312 287319 289945 291888 293458 295172 297134 299055 300818 302753 305242
57374 305242 308253 311302 313776 315279 315906 316217 316784 317747 318962 320491 322574 325061 327327 329001 330487
57359 330487 332409 334851 337545 340590 344455 349189 354090 358366 361932 365397 369460 374397 379946 385527
57345 385527 390672 395349 399887 404557 409338 414112 418905 423835 428935 434175 439603 445350 451431 457645
57331 457645 463727 469668 475788 482400 489388 496252 502658 508801 515151 521885 528694 535052 540676 545885
57317 545885 551601 558738 567334 576425 585025 593127 601471 610501 619890 629078 637890 646525 655229 664153
57303 664153 673405 683165 693767 705486 718126 731073 744086 757807 773043 789693 806905 824174
57291H24174J7519J8031J8610J9520K0933K2133K2305K1856K1852K2408K2663
57280A052004K2388K2386K3114K3955K4272K4152K3737K2647K0764J8835J7745
57269A295999J7621J8089J8923K0021K1356K3200K5790K8482L0060L0403L0968
57258A560912L2940L5672L7836L9352M1166M3570M5925M7857M9709N1731N3656
57247B040326N5221N6486N7542N8300N8644N8479N7845N7249N7503N8807O0388
57236B676790O1598O2706O3970O4576O3654O1915O1095O1932O3865O6528P0241
57225C378870P4858P9440Q3361Q6616Q8752Q8796Q6793Q4238Q2273Q0548P8570
57214D293115P7051P6869P7501P7657P6954P5970P5034P3984P2813P1640P0249
$$ plain form
57291 824174 841693 859724 878334 897854 918787 940920 963225 985081 1006933 1029341 1052004
57280 1052004 1074392 1096778 1119892 1143847 1168119 1192271 1216008 1238655 1259419 1278254 1295999
57269 1295999 1313620 1331709 1350632 1370653 1392009 1415209 1440999 1469481 1499541 1529944 1560912
57258 1560912 1593852 1629524 1667360 1706712 1747878 1791448 1837373 1885230 1934939 1986670 2040326
57247 2040326 2095547 2152033 2209575 2267875 2326519 2384998 2442843 2500092 2557595 2616402 2676790
57236 2676790 2738388 2801094 2865064 2929640 2993294 3055209 3116304 3178236 3242101 3308629 3378870
57225 3378870 3453728 3533168 3616529 3703145 3791897 3880693 3967486 4051724 4133997 4214545 4293115
57214 4293115 4370166 4447035 4524536 4602193 4679147 4755117 4830151 4904135 4976948 5048588 5118837
57203E118837O8438O6596O5182O3931O2398O0999O0610O1272O2171O2776O3168
57192E816378O3346O3170O2954O3202O3698O3885O4146O5589O8374P1455P4406
57181F540603P8211Q3423Q8720R2325R4160R5423R6755R8139J00216J04234J10543
57170G582752J18312J27024J37029J48292J59661J70131J79949J89558J98056
57161I010764K03698K05708K04706K01504J96453J90102J83579J77844J73147
57152A0747505J69560J67320J66114J64519J60945J54952J46950J37019J25005
57143A2139889J11860R9694Q9634Q0286O9144N5289M0138K5650J2595O31j0609
57132A2714201k0884k9464l5537l8750l9647l9680m0602m3862n0275n9925p2223
$$ plain form
57203 5118837 5187275 5253871 5319053 5382984 5445382 5506381 5566991 5628263 5690434 5753210 5816378
57192 5816378 5879724 5942894 6005848 6069050 6132748 6196633 6260779 6326368 6394742 6466197 6540603
57181 6540603 6618814 6702237 6790957 6883282 6977442 7072865 7169620 7267759 7367975 7472209 7582752
57170 7582752 7701064 7828088 7965117 8113409 8273070 8443201 8623150 8812708 9010764
57161 9010764 9214462 9420170 9624876 9826380 10022833 10212935 10396514 10574358 10747505
57152 10747505 10917065 11084385 11250499 11415018 11575963 11730915 11877865 12014884 12139889
57143 12139889 12251749 12351443 12441077 12521363 12590507 12645796 12685934 12711584 12724179 12724810 12714201
57132 12714201 12693317 12663853 12628316 12589566 12549919 12510239 12469637 12425775 12375500 12315575 12243352
57121A2243352q6172j00786j15475j30283j45879j62975j81334j99357k14776
57112A0906315k25662k30686k29153k21635k10425j98451j87234j76065j62775
57103I064229j44552j18124q0439k9802L4094J11363K02033L04386M14038N25449
57093A0282675O33886P35718Q28310R11326R87895J063403J142177J222916J293159
57084A9101465J327304J297281J195629J050995R13409Q14956P41575O44431M79864
57075B7566909K40636m4723l35317o00174q25611j009707j153109j254036j309591
57066B1275277j319690j288516j222862j130499j020082r00825p80928o66354
57058A2945521n60997m67018l84702l13025k51087j98539j54460j16820q3804
$$ plain form
57121 12243352 12157180 12056394 11940919 11810636 11664757 11501782 11320448 11121091 10906315
57112 10906315 10680653 10449967 10220814 9999179 9788754 9590303 9403069 9227004 9064229
57103 9064229 8919677 8801553 8721114 8691312 8725406 8836769 9038802 9343188 9757226 10282675
57093 10282675 10916561 11652279 12480589 13391915 14379810 15443213 16585390 17808306 19101465
57084 19101465 20428769 21726050 22921679 23972674 24886083 25701039 26442614 27087045 27566909
57075 27566909 27807545 27762822 27427505 26827331 26001720 24992013 23838904 22584868 21275277
57066 21275277 19955587 18667071 17444209 16313710 15293628 14392803 13611875 12945521
57058 12945521 12384524 11917506 11532804 11219779 10968692 10770153 10615693 10498873 10415069
57049A0415069n4974l0529j0137O937K1193L3261M4239N4840O4639P3000Q0274
57038A0697812Q7092R2859R6089R6146R3676Q9397Q3700P7468P1939O7058O1014
57027A1614250N2211M1192K9962K0134J2488P722O350P726J0046J1719J2466J3019
57015A1839285J4221J6458J9466K2388K4350K5105K5064K4674K4219K4162K5076
57004A2084468K6942K9069L1076L3446L6433L8837L8883L6281L2640K9626K7526
56993A2445227K5957K5107K5541K7269K9796L2845L6398M0091M3278M5704M7601
56982A2824814M9124N0029M9960M8679M6154M2858L9880L8133L7444L6892L5999
56971A3299966L5037L4174L3007L1162K8767K6152K3568K1370J9821J8523J6558
$$ plain form
57049 10415069 10360095 10329566 10319429 10326366 10347559 10380820 10425059 10479899 10544538 10617538 10697812
57038 10697812 10784904 10877763 10973852 11069998 11163674 11253071 11336771 11414239 11486178 11553236 11614250
57027 11614250 11666461 11707653 11737615 11757749 11770237 11777959 11784309 11792035 11802081 11813800 11826266 11839285
57015 11839285 11853506 11869964 11889430 11911818 11936168 11961273 11986337 12011011 12035230 12059392 12084468
57004 12084468 12111410 12140479 12171555 12205001 12241434 12280271 12319154 12355435 12388075 12417701 12445227
56993 12445227 12471184 12496291 12521832 12549101 12578897 12611742 12648140 12688231 12731509 12777213 12824814
56982 12824814 12873938 12923967 12973927 13022606 13068760 13111618 13151498 13189631 13227075 13263967 13299966
56971 13299966 13335003 13369177 13402184 13433346 13462113 13488265 13511833 13533203 13553024 13571547 13588105
56960A3588105J3486R718N693J337l312p635j1069j3802j6359j8980k1716k4560
56948A3500906k7091k8513k8675k8453k8578k8555k7481k5437k3319k1649k0345
56937A3212810j9354j8652j7824j6513j5236j4959j5940j7630j9769k2812k7266
56926A3006855l3249m0717m9396n8386o6442p2779p7212p9609p9953p8903p7519
56915A2292690p6257p4899p3563p2955p3359p4174p4853p5659p7022p8670p9904
56904A1461375q0457q0626q0853q1371q2093q2616q2679q2730q3616q5604q8010
56893A0550720q9968r1119r1439r0911q9690q8070q5959q2783p8353p3624p0176
56882I618628o9105p0422p3325p6704p9644q1696q2754q2763q1716p9803p7229
$$ plain form
56960 13588105 13601591 13611309 13617002 13618339 13615027 13607392 13596323 13582521 13566162 13547182 13525466 13500906
56948 13500906 13473815 13445302 13416627 13388174 13359596 13331041 13303560 13278123 13254804 13233155 13212810
56937 13212810 13193456 13174804 13156980 13140467 13125231 13110272 13094332 13076702 13056933 13034121 13006855
56926 13006855 12973606 12932889 12883493 12825107 12758665 12685886 12608674 12529065 12449112 12370209 12292690
56915 12292690 12216433 12141534 12067971 11995016 11921657 11847483 11772630 11696971 11619949 11541279 11461375
56904 11461375 11380918 11300292 11219439 11138068 11055975 10973359 10890680 10807950 10724334 10638730 10550720
56893 10550720 10460752 10369633 10278194 10187283 10097593 10009523 9923564 9840781 9762428 9688804 9618628
56882 9618628 9549523 9479101 9405776 9329072 9249428 9167732 9084978 9002215 8920499 8840696 8763467
56871H763467p4163p1096o8945o8013o7213o5175o2130n9620n8283n6989n4588
56860H057252n1454m8788m7456m8260n2302n9904o9639p9443q8246r5726j01057
56849G314977j03193j02257r9639r6633r3712r1019q8649q6267q3272p9522p5322
56838F315492p0663o5256n9397n4015m9656m6219m4173m5301n1571o3469p9682
56827E686090r7908j15475j29724j38790j42373j41458j37226j30507j22109j13098
56817D417422j04331r6034q8190q1152p5380p0625o5924o0750n5686n1549m8239
56806C619562m5260m3190m3890m8876n7960o9538q1532r1764r8378j00783r9997
56795B838394r7443r3568q8146q1583p5130o9731o5270o1167n7204n3543n0235
$$ plain form
56871 8763467 8689304 8618208 8549263 8481250 8414037 8348862 8286732 8227112 8168829 8111840 8057252
56860 8057252 8005798 7957010 7909554 7861294 7808992 7749088 7679449 7600006 7511760 7416034 7314977
56849 7314977 7211784 7109527 7009888 6913255 6819543 6728524 6639875 6553608 6470336 6390814 6315492
56838 6315492 6244829 6179573 6120176 6066161 6016505 5970286 5926113 5880812 5829241 5765772 5686090
56827 5686090 5588182 5472707 5342983 5204193 5061820 4920362 4783136 4652629 4530520 4417422
56817 4417422 4313091 4217057 4128867 4047715 3972335 3901710 3835786 3775036 3719350 3667801 3619562
56806 3619562 3574302 3531112 3487222 3438346 3380386 3310848 3229316 3137552 3039174 2938391 2838394
56795 2838394 2740951 2647383 2559237 2477654 2402524 2332793 2267523 2206356 2149152 2095609 2045374
56784B045374m7045m3669l9969l6071l2381k9529k8274k9292l2702l7746m3105
56773A645591m7733n1246n3599n4754n4849n4254n3114n1140m8216m5000m2417
56762A089269m0662l9098l7164l5014l3173l1783l0414k8558k6241k4009k2336
56751G40817k1144k0070j8995j8002j7032j6076j5559j5872j6530j6504j5555
56740E49478j4524j4064j3892j3669j3719j4279j4761j4543j3853j3154j2232
56729C96788j0814r558r391j0096j0570j0267r582q857q011p097o420n933n317
56716B84875m702m559m825m836m335l866l964m495m956m962m433l702l436l959
56702B23845m744n094n133n361n529m856l462k499k605l132l270l096l057l114
$$ plain form
56784 2045374 1998329 1954660 1914691 1878620 1846239 1816710 1788436 1759144 1726442 1688696 1645591
56773 1645591 1597858 1546612 1493013 1438259 1383410 1329156 1276042 1224902 1176686 1131686 1089269
56762 1089269 1048607 1009509 972345 937331 904158 872375 841961 813403 787162 763153 740817
56751 740817 719673 699603 680608 662606 645574 629498 613939 598067 581537 565033 549478
56740 549478 534954 520890 506998 493329 479610 465331 450570 436027 422174 409020 396788
56729 396788 385974 376416 367025 356929 346359 336092 326510 317653 309642 302545 296125 290192 284875
56716 284875 280173 275614 270789 265953 261618 257752 253788 249293 244337 239375 234942 231240 227804 223845
56702 223845 219101 214007 208874 203513 197984 193128 189666 187167 184562 181430 178160 175064 172007 168893
56688A68893k943k510j936j212m28O2O2j85l56m27n45q50j471k285k743k434j791
56671A46901j592j749j411l81M82N76L75M80O46M56K58O58J495K005J751Q80k56
56654A51574j247j666j460j081q94o73o1P32J108P26k10j124j331o11L65N78q2
56637A44643o94o37l95n39o62r1Q38J117M36n38j136j267j067n79Q6O39Q05L98
56619A41357n74j691k294k170j913k120k540k458j702p85j62J72L73M79M96M12
56603A24880J32l22o72o62m58m77q26j147r95k96N36Q77M92j05j98K12M50J97
56585A21618n6J79O78R77J033J000P65K28k97m73l72p6O86J898K702K263R70Q1
56567A33804K82J247K397L366L820L580L106L137L744M259M239L871L346K481
$$ plain form
56688 168893 165950 163440 161504 160292 159864 159926 159988 159803 159447 159020 158475 157625 156154 153869 151126 148692 146901
56671 146901 145309 143560 142149 141768 142250 142826 143201 143681 144327 144783 145041 145699 147194 149199 150950 151830 151574
56654 151574 150327 148661 147201 146120 145226 144553 144492 145224 146332 147058 146848 145724 144393 143782 144147 144725 144643
56637 144643 143949 143312 142917 142378 141716 141625 142463 143580 144016 143478 142342 141075 140008 139429 139515 140154 140959 141357
56619 141357 140783 139092 136798 134628 132715 130595 128055 125597 123895 123110 122948 123120 123493 123972 124468 124880
56603 124880 125012 124690 124018 123356 122898 122421 121595 120448 119453 119157 119693 120570 121062 120957 120759 120971 121421 121618
56585 121618 121562 121741 122419 123396 124429 125429 126194 126422 126125 125652 125280 125204 125890 127788 130490 132753 133723 133804
56567 133804 134086 135333 137730 141096 144916 148496 151602 154739 158483 162742 166981 170852 174198 176679
56553A76679J295L51P5R2k87j113j735j671j190r18j088j349j311r91o17j67M72
56536A66527J023R55K31n64j000j246j523j597j252p29l27O8N82Q73N69j08o40
56519A61842q74r61r41q83j026j320j229o07j91n54j027n85N10R83L02q09j527
56502A51103j606j019P0Q86N75o09j540j766j808j828j185J91J221J196Q31R74
56486A45686J147N57k45J2J275K031J360N4n92l31K08N84R23J389J853K048J844
56469A59803J291N34k09o58o27j88L55P49R13P86K76m40q59o76j87J54M22R49
56451A62388J541J540P86q2m49l47o7L47Q55J158J047P91P09P16N81M52O10Q66
56433A73442P78M22M20R88J456J072M5o75o05k83m12q43q36j64N60P30M41J70
$$ plain form
56553 176679 177974 178325 178400 178492 178205 177092 175357 173686 172496 171578 170490 169141 167830 166839 166222 166055 166527
56536 166527 167550 168505 168736 168172 167172 165926 164403 162806 161554 160825 160498 160566 161148 162021 162590 162482 161842
56519 161842 160968 160007 159066 158183 157157 155837 154608 154001 153810 153256 152229 151644 152154 153137 153439 152630 151103
56502 151103 149497 148478 148548 149434 150009 149400 147860 146094 144286 142458 141273 141464 142685 143881 144712 145686
56486 145686 146833 147390 147145 147157 148432 150463 151823 151877 151285 150954 151162 151746 152669 154058 155911 157959 159803
56469 159803 161094 161628 161419 160761 160134 159946 160301 161050 161963 162749 163025 162585 161726 161050 160863 161017 161439 162388
56451 162388 163929 165469 166255 166173 165724 165377 165310 165657 166512 167670 168717 169508 170217 170933 171514 171966 172576 173442
56433 173442 174220 174642 175062 176050 177506 178578 178623 177948 177343 177060 176648 175805 174969 174805 175365 176095 176536 176706
56415A76706K14O87J619K602K749J641Q5o72m07P0K21L82R26J527J642J182M47
56398A91621k51n98l11M15Q74O16O2n3L69P70P41M91L80M01K28k36o26m90J93
56379A94596R60J365J359J079N44j54n19K8J370K535K590J572M19PL76Q67R45
56362B09939P09O11Q05J085J308J592K017K495K979L464L698L347K584K031J897
56347B40561J733J265Q89R37J088J027J107J673K351K686K920L315L296K301J004
56332B68153N08P15O57K54L10Q67J032O26O21J436K184K184K065K528L129L126
56316B90395K701K447K354K157K096K497L025L208L221L518M007M335M585N010
56302C35556N386N369N192N316N650N751N657N808O226O428O196N883N891O274
$$ plain form
56415 176706 176920 177607 179226 181828 184577 186218 186303 185631 185224 185294 185515 185897 186823 188350 189992 191174 191621
56398 191621 191370 190772 190461 190876 191750 192366 192428 192375 192744 193514 194255 194746 195126 195527 195755 195519 194893 194403 194596
56379 194596 195556 196921 198280 199359 199903 199749 199230 199258 200628 203163 205753 207325 207744 207751 208127 208994 209939
56362 209939 210648 211259 212064 213149 214457 216049 218066 220561 223540 227004 230702 234049 236633 238664 240561
56347 240561 242294 243559 244448 245385 246473 247500 248607 250280 252631 255317 258237 261552 264848 267149 268153
56332 268153 268661 269376 270033 270287 270597 271464 272496 273122 273743 275179 277363 279547 281612 284140 287269 290395
56316 290395 293096 295543 297897 300054 302150 304647 307672 310880 314101 317619 321626 325961 330546 335556
56302 335556 340942 346311 351503 356819 362469 368220 373877 379685 385911 392339 398535 404418 410309 416583
56288D16583O932P771Q584R116R305R326R327R340R464R964J0992J2222J2908
56275E41834J2624J1945J2027J3263J4798J5778J6521J7739J9169K0051K0675
56264G16424K2132K4451K6390K7472K8884L1656L5183L8470M1747M5728N0084
56253A088621N3981N7685O2322O8250P4696Q0887Q6569R1533R5538R8790J01615
56242A960487J03559J03416J00407R4699Q6831P7105O5665N2636L8050K2021N025
56231B709901j2213k9045m4803n8588o9731p8368q5149r0375r3883r5678r6100
56220A955968r5297r2977q9024q4011p8870p4123o9563o4708n9449n4240m9608
56209A144098m5666m2215l9162l6519l4089l1549k8833k6123k3471k0852j8522
$$ plain form
56288 416583 423515 431286 439870 448986 458291 467617 476944 486284 495748 505712 516704 528926 541834
56275 541834 554458 566403 578430 591693 606491 622269 638790 656529 675698 695749 716424
56264 716424 738556 763007 789397 816869 845753 877409 912592 951062 992809 1038537 1088621
56253 1088621 1142602 1200287 1262609 1330859 1405555 1486442 1573011 1664544 1760082 1858872 1960487
56242 1960487 2064046 2167462 2267869 2362568 2449399 2526504 2592169 2644805 2682855 2704876 2709901
56231 2709901 2697688 2668643 2623840 2565252 2495521 2417153 2332004 2241629 2147746 2052068 1955968
56220 1955968 1860671 1767694 1678670 1594659 1515789 1441666 1372103 1307395 1247946 1193706 1144098
56209 1144098 1098432 1056217 1017055 980536 946447 914898 886065 859942 836471 815619 797097
56198G97097j6819j5603j4401j3091j1864j0630r182p928p532p722p400o198m966
56185F63761m322l791k908k125j898j756j190o18o39q90o08K91J387K447L219
56170F50360L195K478K221L267M856N656N570N545O049O804P614Q454Q934Q806
56156G29809Q755R738J1599J3256J4215J5015J6302J8216K0642K3369K6094K8856
56144I35866L2235L6609M1466M6099N0521N5045N9342O2639O4430O4342O1870
56133A510464N7119N1303M5588M0048L4551K9908K6830K4368K0822J5844J0271
56122A867116M319k419r298j4743j8323k1365k5178k9953l5615m2294m9367n5139
56110A567741n8255n8703n7102n3796m9053m3426l7468l1564k6228k1922j8466
$$ plain form
56198 797097 780278 764675 750274 737183 725319 714689 705507 697579 690047 682325 674925 668727 663761
56185 663761 659439 655648 652740 650615 648717 646961 645771 645153 644514 643624 643016 643307 644694 647141 650360
56170 650360 653555 656033 658254 661521 666377 672033 677603 683148 689197 696001 703615 712069 721003 729809
56156 729809 738564 748302 759901 773157 787372 802387 818689 836905 857547 880916 907010 935866
56144 935866 968101 1004710 1046176 1092275 1142796 1197841 1257183 1319822 1384252 1448594 1510464
56133 1510464 1567583 1618886 1664474 1704522 1739073 1768981 1795811 1820179 1841001 1856845 1867116
56122 1867116 1871435 1869016 1859718 1844975 1826652 1805287 1780109 1750156 1714541 1672247 1622880 1567741
56110 1567741 1509486 1450783 1393681 1339885 1290832 1247406 1209938 1178374 1152146 1130224 1111758
56099A111758j5209j1872q680n767l123r84M42J608L142M824N848O040O002O185
56085A100214O545P135Q148R490J0876J2214J3272J3457J2739J2341J3414J5415
56073A235260J6858J7305J7464J7768J8124J8776K0009K1214K1554K1378K1640
56062A447350K2292K2644K3004K4284K6137K7248K7460K7917K9022K9975L0493
56051A737826L1190L2098L2493L2602L3665L5938L8302M0293M2803M6192M9446
56040B152848N1942N4457N7683O1128O4287O7641P1758P6469Q1485Q6837R2433
56029B918968R8190J04662J12163J19419J24708J28462J32876J38801J44887J50222
56019D173358J55773J62696J70937J80230J90638K01468K11286K19612K27191
$$ plain form
56099 1111758 1096549 1084677 1075997 1070230 1067107 1066123 1066565 1068173 1071315 1076139 1081987 1088027 1094029 1100214
56085 1100214 1106759 1113894 1122042 1131532 1142408 1154622 1167894 1181351 1194090 1206431 1219845 1235260
56073 1235260 1252118 1269423 1286887 1304655 1322779 1341555 1361564 1382778 1404332 1425710 1447350
56062 1447350 1469642 1492286 1515290 1539574 1565711 1592959 1620419 1648336 1677358 1707333 1737826
56051 1737826 1769016 1801114 1833607 1866209 1899874 1935812 1974114 2014407 2057210 2103402 2152848
56040 2152848 2204790 2259247 2316930 2378058 2442345 2509986 2581744 2658213 2739698 2826535 2918968
56029 2918968 3017158 3121820 3233983 3353402 3478110 3606572 3739448 3878249 4023136 4173358
56019 4173358 4329131 4491827 4662764 4842994 5033632 5235100 5446386 5665998 5893189
56010E893189K34352K40922K47890K57026K68319K79854K90525L00887L11044
56001H324008L20326L29581L41180L55855L71877L88149M05673M25212M46060
55992A1707921M67930M91472N15890N38691N58740N77209N94885O11582O28743
55983A6693063O49170O73150O98194P23695P52269P85600Q22980Q65222R15653
55974B3578996R75516J042661J116515J199738J293429J396220J510625J644954
55966C3758654J806296J997426K223609K496011K825000L217650L687047M257261
55958E6268954M953464N793185O790410P957020R291567J0774685J2379248J4066632
55950A28275165J5760704J7349776J8739810J9869651K0588946K0480290J8866895
$$ plain form
56010 5893189 6127541 6368463 6616353 6873379 7141698 7421552 7712077 8012964 8324008
56001 8324008 8644334 8973915 9315095 9670950 10042827 10430976 10836649 11261861 11707921
55992 11707921 12175851 12667323 13183213 13721904 14280644 14857853 15452738 16064320 16693063
55983 16693063 17342233 18015383 18713577 19437272 20189541 20975141 21798121 22663343 23578996
55974 23578996 24554512 25597173 26713688 27913426 29206855 30603075 32113700 33758654
55966 33758654 35564950 37562376 39785985 42281996 45106996 48324646 52011693 56268954
55958 56268954 61222418 67015603 73806013 81763033 91054600 101829285 114208533 128275165
55950 128275165 144035869 161385645 180125455 199995106 220584052 241064342 259931237
55943B59931237J5132251R169814J616110o325499j3358506j8567951k1642532
55936B25954924k2785600k2454016k1127699j9212090j7030548j4824188j2743485
55929I5777298j0862134r211688p802750o624528n647762m840175m175739l629953
55921D2982569l177033k796498k476234k206256j975283j775631j605170j461171
55913B5509293j336885j226446j128383j041762r63265q90625q25010p67376p15880
55904A6613661o69000o27805n92849n61954n33177n07065m83916m61715m39032
55895A1737148m17385l98529l81654l65206l49304l34257l18698l01393k83430
55886H587292k66797k52148k39354k28742k20180k12296k04024j95832j88313
$$ plain form
55943 259931237 275063488 284233302 285849412 279523913 266165407 247597456 225954924
55936 225954924 203169324 180715308 159587609 140375519 123344971 108520783 95777298
55929 95777298 84915164 75703476 67900726 61276198 55628436 50788261 46612522 42982569
55921 42982569 39805536 37009038 34532804 32326548 30351265 28575634 26970464 25509293
55913 25509293 24172408 22945962 21817579 20775817 19812552 18921927 18096917 17329541 16613661
55904 16613661 15944661 15316856 14724007 14162053 13628876 13121811 12637895 12176180 11737148
55895 11737148 11319763 10921234 10539580 10174374 9825070 9490813 9172115 8870722 8587292
55886 8587292 8320495 8068347 7828993 7600251 7380071 7167775 6963751 6767919 6579606
55877F579606j80952j73336j66234j60299j54987j49766j45082j41048j36542
55868E171360j30761j24534j19035j14309j09986j06267j03288j00535r7824r5734
55858D069087r4337r2616q9966q7041q4328q1138p7000p2872o9880o7870o6164
55847C185875o4752o3789o2771o1260n9576n8065n6392n4352n2458n1032m9536
55836B551892m7577m5654m4219m2914m1465m0404m0078l9882l9259l8601l8292
55825B093547l7809l6753l5885l6073l6838l7019l6383l5588l4973l4319l3507
55814A698400l2589l1392k9716k7804k6217k5280k4840k4216k2497j9525j6554
55803A417770j5128j5192j5261j4527j3636j3158j2682j2042j2095j3352j4963
$$ plain form
55877 6579606 6398654 6225318 6059084 5898785 5743798 5594032 5448950 5307902 5171360
55868 5171360 5040599 4916065 4797030 4682721 4572735 4466468 4363180 4262645 4164821 4069087
55858 4069087 3974750 3882134 3792168 3705127 3620799 3539661 3462661 3389789 3319909 3252039 3185875
55847 3185875 3121123 3057334 2994563 2933303 2873727 2815662 2759270 2704918 2652460 2601428 2551892
55836 2551892 2504315 2458661 2414442 2371528 2330063 2289659 2249581 2209699 2170440 2131839 2093547
55825 2093547 2055738 2018985 1983100 1947027 1910189 1873170 1836787 1801199 1766226 1731907 1698400
55814 1698400 1665811 1634419 1604703 1576899 1550682 1525402 1500562 1476346 1453849 1434324 1417770
55803 1417770 1402642 1387450 1372189 1357662 1344026 1330868 1318186 1306144 1294049 1280697 1265734
55792A265734j5955j6582j7492j8436j8817j8723j8477j7950j7272j7449j9074
55781A069507k1090k1941k1546k1016k0783k0194j8779j6834j4802j2866j1198
55770H68458r964r150q916r747j1693j3765j4840j4913j4852j5104j5351j5204
55758G14959j4641j3793j2890j2222j1844j1489j1059j0839j0902j0747j0063
55747E84470r326r134r379r666j0035j0591j0889j0421r462q684q235p821p417
55734D63410p204p022o601o156o105o300o226n832n575n680n912o057o117o079
55720C76544n925n829n901n841n261m294l464l017k719k265j573p78j55Nl29r35
55704C28263j653k455l194l724m322n418o670p066o307n404n329n735n669m973
$$ plain form
55792 1265734 1249779 1233197 1215705 1197269 1178452 1159729 1141252 1123302 1106030 1088581 1069507
55781 1069507 1048417 1026476 1004930 983914 963131 942937 924158 907324 892522 879656 868458
55770 868458 858494 849344 840428 830681 818988 805223 790383 775470 760618 745514 730163 714959
55758 714959 700318 686525 673635 661413 649569 638080 627021 616182 605280 594533 584470
55747 584470 575144 566010 556631 546965 536930 526339 515450 505029 495567 486883 478648 470827 463410
55734 463410 456206 449184 442583 436427 430322 424022 417796 411964 406389 400709 394797 388740 382623 376544
55720 376544 370619 364790 358889 353048 347787 343493 340029 337012 334293 332028 330455 329677 329522 329527 329198 328263
55704 328263 326610 324155 320961 317237 312915 307497 300827 293761 287454 282050 276721 270986 265317 260344
55690B60344m230l760l449l267l208k962k354j832j858k041j601m95O17J293J542
55675B32739J284M42n18r40r20j261k263l240l446l005k578k505k507k182j615
55660B07485j372j726k061j470j3J190J375R84P66P26N25L17L88M45M3o18j073
55643B05911j408j979k654l174l876n113o209o151n143m416m390m236l442k702
55629A51018k713l036k897k389k138k184j921j015Q7O55L75m58j308j901k283
55614A27892k476k345j911j483j208q81n07n75j279j919j756j139r08j054q67
55599A07584l22j70o15r34p52o29r41j106o15p7l63j187j414o02M74Q75N68K46
55581A00020M26R22J124P79K91K46O58J028J022Q18O89O01L53q1m76n12m9O00
$$ plain form
55690 260344 256114 252354 248905 245638 242430 239468 237114 235282 233424 231383 229782 229287 229904 231197 232739
55675 232739 234023 234465 233947 233007 232087 230826 228563 225323 221877 218872 216294 213789 211282 209100 207485
55660 207485 206113 204387 202326 200856 200843 202033 203408 204392 205158 205884 206409 206726 207114 207559 207602 206984 205911
55643 205911 204503 202524 199870 196696 192820 187707 181498 175347 170204 165788 161398 157162 153720 151018
55629 151018 148305 145269 142372 139983 137845 135661 133740 132725 132812 133467 133842 133384 132076 130175 127892
55614 127892 125416 123071 121160 119677 118469 117588 117081 116506 115227 113308 111552 110413 109505 108451 107584
55599 107584 107262 107092 106477 105543 104791 104162 103221 102115 101500 101423 101060 99873 98459 97857 98331 99206 99774 100020
55581 100020 100446 101368 102492 103271 103562 103808 104466 105494 106516 107334 108023 108624 108977 108896 108420 107908 107859 108459
55563A08459P60O3j124k167k906l448l546k825j728j414k327l450l473k333j074
55548G7467m55k31J38O25P88N21K73M42Q13R22P90Q41J168J331J133J028J429
55531H9023K043K305K063J438M20p81j436j096l90k44o11p33m98n23r23j079q19
55514H8159q28j472k071j852r44PN72N25k83j427j875j073K62R04L79q51k015
55497G6117k415j664j56R19O58n84j619j747j244p75o91q80r80p75m61m52p53
55480F2498q78n08Q4M96O81P00L98j68m15J07R26J132O29K06L32M58j54j265j823
55461F3436j248j23N15L98J70L79P06M92j68m22K17J146J346N65m07o34PP31O69
55442F7775k13j094j222o62OM32O51P50P40P18P28N48O9l11j64K91N16M96N68
$$ plain form
55563 108459 109219 109282 108158 105991 103085 99637 96091 93266 91538 90124 87797 84347 80874 78541 77467
55548 77467 77012 76781 76919 77544 78332 78853 79126 79568 80381 81303 82093 82934 84102 85433 86566 87594 89023
55531 89023 91066 93371 95434 96872 97292 96511 95075 93979 93589 93345 92734 92001 91503 90980 90057 88978 88159
55514 88159 87331 85859 83788 81936 80992 80999 81571 82096 81813 80386 78511 77438 77700 78604 78983 78132 76117
55497 76117 73702 72038 71882 72801 73459 72875 71256 69509 68265 67490 66799 65919 64939 64164 63703 63251 62498
55480 62498 61620 61112 61196 61692 62373 63073 63471 63303 62888 62995 63921 65053 65682 65888 66220 66678 66524 65259 63436
55461 63436 62188 62065 62580 62978 63148 63527 64233 64725 64557 64135 64352 65498 66844 67409 67002 66368 66375 67106 67775
55442 67775 67562 66468 65246 64584 64590 65022 65673 66423 67163 67881 68609 69157 69226 68915 68751 69042 69558 70054 70622
55423G0622N30r4r50r81L9J033J135P27M52K14j15Q0J184K238J968N88n46p87
55405G7337o86p43p75o34n51n14j27N31P22R2p25j003q50p50o99l80P9J03n40
55386F9887j359j596q91M09J477J674J111M73J85j9n41j170j292p35m7J36k47
55369F7455p51r52p02o7P44J333J321P27L2k55l5M48R31J242J221P88J08n53j052
55350G1983j384j450j078l09N00R30P96K61k50m17m28q00j565j960j309j5R19
55333F4424J171J222J270R05M7o00n54k93m54p92o27P2P12R63R66Q06M07p7k86
55314F9282j25J42L16L92L52J37j68m26o95j076j363j225o92j62J06K29M22O71
55296F6117P74N26k3m45k16N98J247J119M93O0l7k03n34o35l37l7o2j55P0M40
$$ plain form
55423 70622 71152 71058 70108 69127 69166 70199 71334 72061 72513 72727 72612 72692 73876 76114 78082 78670 78124 77337
55405 77337 76651 75908 75133 74499 73948 73434 73307 73838 74560 74652 73927 72924 72074 71324 70625 70245 70324 70427 69887
55386 69887 68528 66932 66041 66450 67927 69601 70712 71185 71370 71351 70810 69640 68348 67613 67566 67702 67455
55369 67455 66704 65752 65050 64983 65727 67060 68381 69108 69140 68885 68850 69298 70229 71471 72692 73480 73588 73035 71983
55350 71983 70599 69149 68071 67762 68262 69192 69988 70249 69999 69582 69154 68354 66789 64829 63520 63505 64424
55333 64424 65595 66817 68087 68992 69039 68439 67885 67592 67138 66346 65719 65791 66503 67466 68432 69238 69645 69568 69282
55314 69282 69157 69299 69615 70007 70359 70496 70328 69902 69207 68131 66768 65543 64851 64689 64795 65024 65446 66117
55296 66117 66891 67417 67394 66949 66733 67331 68578 69697 70190 70250 70213 70010 69476 68841 68504 68467 68405 68250 68320 68760
55276F8760M24j43q28j124r79o94m23mO76J292J345Q12K34P0K03K77K17J05j21
55257G0099n50q93p06QO98Q72N54J39m2O5K84L72K33j7k08l34n15q07j066r65
55237F7221k64P50J230N84o69j314q48L0M75N01N15N07L31L03P48J203Q58j90
55219G1971r51q51l82k24l54l82k93m25q65j233j073l17O20J224J359J261J130
55202G0215R58Q39J007J318J134K04p79j038q02q58j252j255n58K96Q70J363J947
55185G3609K201J691O67k06n86o18o52r38j349j368o63K88O03J29l09K4Q27J233
55167G4583Q73J54k75j34L30O36N84M36M52M73L04K49P24J398J444O71j76m13
55149H2313j22K91O07O42J71o60j348j684j857j796j084J73J106J176Q60P42O32
$$ plain form
55276 68760 69184 69041 68213 67089 66110 65416 64993 64989 65665 66957 68302 69114 69348 69418 69621 69898 70115 70220 70099
55257 70099 69549 68656 67950 67958 68656 69528 70082 70221 70179 70244 70528 70900 71133 71116 70908 70574 70059 69252 68186 67221
55237 67221 66957 67707 68937 69521 68852 67538 66690 66720 67195 67696 68211 68718 69049 69352 70100 71303 72161 71971
55219 71971 71020 70169 69787 69563 69209 68827 68534 68109 67244 66011 64938 64621 65241 66465 67824 69085 70215
55202 70215 71173 72012 73019 74337 75471 75675 74896 73858 73056 72198 70946 69691 69133 69429 70299 71662 73609
55185 73609 75810 77501 78168 77962 77376 76758 76106 75168 73819 72451 71788 72076 72679 72808 72499 72523 73350 74583
55167 74583 75456 75610 75335 75201 75531 76167 76751 77187 77639 78112 78416 78665 79389 80787 82231 82902 82726 82313
55149 82313 82191 82482 83089 83731 83902 83242 81894 80210 78353 76557 75473 75646 76752 77928 78788 79530 80162
55132H0162J97j86K5N75Q30P69Q50J088J042N93Q5k28l11r6L13L79k39r65r38
55113H3945k68O6m23j156j376r73k67M40Q60Q07N04L98N18M85K30K05O42J089
55095H5726J045O20K79K01K35K90M21O48Q37P84L65k49o06m09J14M80N06L42M4
55076I1673m27p98n88K43J131J581J606J368Q21j7p02p13p2O11O68k1q81j146
55058I4337o78j90k93n81k01P03R79O2j138j503j120p81n85M6J132J800J370K05
55040I3564p70j055q76p48q43p42K8J143J493M63j093j736j125k74j18n34q47
55023H5930o67N0J138K068K124J240K46p6J20J95J4r6l8m3j55k05k44m28m92P6
55003I0757J113J638R35n40j669j775r94J35J051J336R63L51pk4P3J45J93J94
$$ plain form
55132 80162 80359 80173 80198 80773 81603 82372 83222 84310 85352 85945 86030 85802 85491 85395 85708 86087 85848 84883 83945
55113 83945 83677 83743 83320 82164 80788 79815 79548 79988 80848 81655 82159 82557 83075 83560 83790 83995 84637 85726
55095 85726 86771 87391 87670 87871 88106 88396 88817 89465 90302 91086 91451 91202 90596 90187 90301 90781 91287 91629 91673
55076 91673 91246 90448 89860 90103 91234 92815 94421 95789 96610 96593 95891 95178 95106 95717 96385 96364 95483 94337
55058 94337 93659 93469 93176 92595 92394 93097 94076 94138 93000 91497 90377 89596 89011 89057 90189 91989 93359 93564
55040 93564 92794 91739 90863 90115 89272 88530 88558 89701 91194 91657 90564 88828 87703 87429 87311 86777 85930
55023 85930 85263 85313 86451 88519 90643 91883 92129 92053 92173 92368 92382 92286 92248 92205 92050 91845 91601 91173 90681 90757
55003 90757 91870 93508 94443 93903 92234 90459 89465 89600 90651 91987 92950 93301 93294 93270 93343 93488 93681 93875
54985I3875J09L9R5J42l4l27l55J2M95Q42J128J450J611J340P26J44j49j84l2
54966A00927L13P79J095R91M80j50o07p50n54l9O56J193J199O11j77o49o48m66
54948A04204m23m70k96J23L31r0q62j221q08j10K65L82O56R92R29O20Q88J941
54930A07051K781K450J386P86R74J243J230J473K426L629M291M161L543K880K549
54915A42853K661K749K084O77n60j009j182j901l012l662l530l084k688k221j593
54900A26582j077q96r65j201j629k070k047j309j64Q44J318J065K04o51p89j95
54884A17020L79M53M48J005K023K891L381L702L847L521K856K538K910L334K817
54869A53125J149r00k369k842k543k008j783k152k995l913m539m746m589m159
$$ plain form
54985 93875 93984 94023 94118 94260 94226 93899 93544 93556 94051 94893 96021 97471 99082 100422 101148 101292 101143 100959 100927
54966 100927 101240 102019 103114 104105 104585 104435 103828 103078 102524 102485 103141 104334 105533 106144 105967 105318 104670 104204
54948 104204 103781 103311 103015 103138 103469 103379 102517 101296 100488 100378 100643 101025 101681 102673 103602 104222 105110 107051
54930 107051 109832 112282 113668 114454 115428 116671 117901 119374 121800 125429 129720 133881 137424 140304 142853
54915 142853 145514 148263 150347 151024 150464 149455 148273 146372 143360 139698 136168 133084 130396 128175 126582
54900 126582 125505 124609 123644 122443 120814 118744 116697 115388 115224 116068 117386 118451 118655 118004 117215 117020
54884 117020 117399 117852 118300 119305 121328 124219 127600 131302 135149 138670 141526 144064 146974 150308 153125
54869 153125 154274 153374 151005 148163 145620 143612 141829 139677 136682 132769 128230 123484 118895 114736
54855A14736l526k809k122j485p90j3O17P17J73n97j018r77q56q67o47J33R76
54838A01645R14k43j475j675r17j89n7j40P3M67N90L89J44m7l50p10p16j43O42
54819I8202J008P42J84k35m16n43p59r87j013o61L5P82J249J400J530J839K089
54802A04446J807Q95j43o48m19J81O18O00K28j36j29L00Q17R37M72k19m57P6R11
54783A10137J219Q24M74Q16J421J366O83M08J041J786J780J414J659K487K955
54768A30470K675K301K444K897L200L305L277K960K315J684J294Q43j9j103j991
54753A56552k623l223l819m291m632m793m429l290j774o60k95m28p12r44q93l81
54737A19365K99N40J97j61J8O17J189J590J907J979J530P65M15R64K084K996L249
$$ plain form
54855 114736 111210 108401 106279 104794 104004 103991 104608 105325 105498 104901 103883 102906 102050 101183 100536 100669 101645
54838 101645 102559 102316 100841 99166 98249 98060 98003 97863 97936 98403 98993 99382 99526 99479 99129 98419 97703 97560 98202
54819 98202 99210 99952 100136 99901 99485 98942 98183 97196 96183 95522 95557 96339 97588 98988 100518 102357 104446
54802 104446 106253 107148 107005 106357 105938 106119 106737 107337 107565 107429 107300 107600 108417 109354 109826 109607 109150 109226 110137
54783 110137 111356 112180 112654 113470 114891 116257 116940 117348 118389 120175 121955 123369 125028 127515 130470
54768 130470 133145 135446 137890 140787 143987 147292 150569 153529 155844 157528 158822 159665 159646 158543 156552
54753 156552 153929 150706 146887 142596 137964 133171 128742 125452 123678 123018 122723 122295 121583 120639 119746 119365
54737 119365 119664 120204 120401 120240 120258 120875 122064 123654 125561 127540 129070 129835 130250 131214 133298 136294 139543
54720A39543L003K717K673K717K357J266k40j401j893k215k906l635l627k830
54706A35529k038j739j575j239j124j600k222k311j916j512j118n24p3l06r32
54691A15300j115p59o01r36j209j101r28p32L6J306J888J002m68j124q20m14l07
54674A09018k08mJ38L33P73J093P43p7n83n01k03J06N50Q98N84l64j136j168q17
54655A09175o78p67o56j24N89R46N55l54r16n37L18O87L63j4o2j25m91q31p61
54636A06317m17j27J00L92O78Q12Q00O67L23k11o82q30n90o7M37M76p7o50n06
54617A06845L53J247J720J831J606Q91q4p29r09j099j468j517r73l62k00j79J96
54600A07169P27Q73N84J49m18j142j547j058J00J088J418J274Q84K61l79n46j11
$$ plain form
54720 139543 142546 145263 147936 150653 153010 154276 154036 152635 150742 148527 145621 141986 138359 135529
54706 135529 133491 131752 130177 128938 127814 126214 123992 121681 119765 118253 117135 116611 116538 116232 115300
54691 115300 114185 113426 112825 111889 110680 109579 108651 107919 107955 109261 111149 112151 111683 110559 109739 109325 109018
54674 109018 108810 108806 108944 109277 110050 111143 111886 111809 111226 110725 110522 110628 111178 112076 112660 112296 111160 109992 109175
54655 109175 108497 107730 107074 106950 107539 108485 109040 108686 107770 107233 107551 108238 108601 108587 108525 108400 107909 107078 106317
54636 106317 105900 105773 105873 106265 106943 107755 108555 109222 109545 109334 108652 107822 107232 107165 107602 108078 108001 107351 106845
54617 106845 107198 108445 110165 111996 113602 114493 114409 113680 112771 111672 110204 108687 107714 107352 107152 106973 107169
54600 107169 107896 108769 109353 109502 109084 107942 106395 105337 105437 106525 107943 109217 110101 110362 109983 109437 109326
54583A09326L71K21n65j308j313n18N00J059R19K81n06j092j120n10K62N83M39
54566A07029L11L42J79k00k33L74J101J388J299J002L11o51r97k73N06J16r31
54549A10673r47M16J596J351L96J17O12R16O28L55O25J166J407J177O93J49m85
54532A20845j255j963k198j719q10j00J8k83n17l39K71J042J506J270L52o89j153
54515A14278q01j32J26k29o37m40L27J040J244R81M33k98r72j239j109r73r32
54498A10667n90J15N37K69k8M88J505J959J551R44N62J42l47l32M35J292J507
54481A20676J119N61j6n14n61PO23O01M0l76l28j14l3l0K0Q0O2m3k33m32m43j58
54459A20508J78J91j36m18l85j88q0l0J71N05O81N38K76J99L03K93K8k74l12q
$$ plain form
54583 109326 109697 109918 109353 108045 106732 106214 106714 107773 108692 108973 108467 107375 106255 105745 106007 106590 107029
54566 107029 107340 107682 107861 107661 107428 107802 108903 110291 111590 112592 112903 112252 111255 110982 111488 111604 110673
54549 110673 109726 110142 111738 113089 113485 113602 114214 115130 115758 116113 116738 117904 119311 120488 121181 121330 120845
54532 120845 119590 117627 115429 113710 112900 112800 112818 112535 112018 111679 111950 112992 114498 115768 116120 115431 114278
54515 114278 113477 113345 113471 113242 112605 112165 112492 113532 114776 115757 116190 115892 114920 113681 112572 111599 110667
54498 110667 110077 110192 110729 110998 110970 111458 112963 114922 116473 117417 117979 118121 117774 117442 117877 119169 120676
54481 120676 121795 122356 122340 121826 121265 121272 121895 122496 122536 122160 121832 121718 121685 121655 121675 121755 121817 121774 121541 121109 120666 120508
54459 120508 120686 120877 120741 120323 119938 119750 119670 119640 119811 120316 120997 121535 121811 122010 122313 122606 122634 122360 122048 122040
54439A22040N05J118J708K051J959J457O66l61j411j968j669r25n66p25n77M98
54423A23800J871K274J351J29k15L46Q35O00J3k18o3r2m52n71q2M92M05k21n87
54404A29615l13K17N64P39Q41P60M61K28L17O32R09R31O01M9k49O6N88N29j45
54385A37340n15M0J022J631J756J607R91j76j102q80J39O90L72J00N88J276J339
54368A46218R81J020J617K077J856J116M15K40P93J829K671K793K367J947J649
54353A69589J137M24J36N52R26L46r70j910k014k052k727l456l149j831o97n44
54337A53760r08j028r53j119j392j216o17k63m69p39n33k8J85j25o14p59l00N15
54319A43397R76N40m39q98l39M44L14p58j740j868j338o68n5L85M04M3j39K00
$$ plain form
54439 122040 122545 123663 125371 127422 129381 130838 131504 131143 129732 127764 126095 125170 124604 123879 123302 123800
54423 123800 125671 127945 129296 129425 129210 129556 130391 130991 131004 130786 130723 130631 130179 129608 129526 130018 130423 130202 129615
54404 129615 129302 129519 130083 130822 131663 132423 132884 133112 133429 134061 134970 135901 136502 136551 136302 136368 136956 137485 137340
54385 137340 136825 136865 137887 139518 141274 142881 143872 143696 142594 141714 141853 142543 142915 143015 143603 144879 146218
54368 146218 147199 148219 149836 151913 153769 154885 155300 155540 156333 158162 160833 163626 165993 167940 169589
54353 169589 170726 171150 171286 171838 172764 173110 172140 170230 168216 166164 163437 159981 156832 155001 154304 153760
54337 153760 152852 151824 150871 149752 148360 147144 146527 146264 145795 145056 144523 144495 144680 144555 143941 143182 142882 143397
54319 143397 144373 144913 144474 143576 143237 143681 143995 143237 141497 139629 138291 137623 137568 137953 138357 138400 138261 138461
54301A38461N51J90p35j320j081m48o8n4q3J55O60J063Q26j35j048r99p6P33Q22
54282A37414O27O71P39M14n3j48L0%k44k86p7N1J06M74J060J111K45q71j276q07
54262A39180r8K68K18l0k32j80K29Q46J325J400J167J039J267J558J368O30q5
54245A49870l37l74o24r32q99o54o56p91m54L54P83L27m13o17l78l70p33r52o98
54226A41452k79j43l40n32l78J73Q98J566K122K485K323J385M5r40j311j514j840
54209A45172j898j245j88N39N97K07k42m11q3N73R97Q26K86k18n94q64q65n67
54191A42022l62m76m79K5N43K84n65j013o86k26r8Q4O51J058O20m41j264j414
54173A38263j121o32K4P02J048R40P16P11Q16O50J29l49l53N2L88L31M9j11q9
$$ plain form
54301 138461 139012 139202 138467 137147 136066 135618 135550 135496 135413 135568 136228 137291 138117 137982 136934 135935 135859 136592 137414
54282 137414 138041 138712 139451 139865 139812 139664 139694 139694 139450 139164 139087 139138 139244 139718 140778 141889 142134 141263 139987 139180
54262 139180 139082 139350 139568 139538 139306 139126 139355 140201 141526 142926 144093 145132 146399 147957 149325 149955 149870
54245 149870 149533 149159 148535 147603 146704 146050 145394 144603 144149 144503 145286 145613 145200 144583 144205 143835 143102 142150 141452
54226 141452 141173 141030 140690 140158 139780 139953 140851 142417 144539 147024 149347 150732 150777 149837 148526 147012 145172
54209 145172 143274 142029 141841 142380 142977 143184 142942 142531 142448 143021 144018 144844 145130 144912 144318 143454 142589 142022
54191 142022 141660 141184 140705 140730 141273 141557 140992 139979 139293 139067 138969 139053 139704 140762 141382 140941 139677 138263
54173 138263 137142 136510 136534 137236 138284 139224 139940 140651 141467 142117 142246 141897 141544 141596 141984 142315 142364 142253 142164
54154A42164o7o9Q6M62Q12Q31M74ok57j24J88L00Q2k06l24l38l61j45N67J480
54134A45549J935J695J136N85p5q85j400j205n75j23O3M76J257J756J368N37L70
54117A52464J203K037J724L49r68j426j146m98M58J563K229K037J338P60M45K22
54101A62791K28O76J170R62Mq45q41j53M75N17J8n01l85N63J808K692L223L834
54083A76236M479M625M179L712L589L555L458L650M169M251L240J510k04j858
54069B18591l710n257n550m536l289k674k489k100j394p30l18k1L95R85J515J612
54053A91030J164O04M71P87J120J278J563K259L165L833M009L702L038K271J773
54038B22067J819K416L318M134M496M396M328M787N544N826N316M590M292M299
$$ plain form
54154 142164 142097 142028 142114 142576 143388 144219 144693 144687 144430 144306 144494 144794 144876 144670 144346 144008 143647 143502 144069 145549
54134 145549 147484 149179 150315 150900 150825 149940 148540 147335 146760 146637 146700 147176 148433 150189 151557 152094 152464
54117 152464 153667 155704 157428 157777 156809 155383 154237 153739 154197 155760 157989 160026 161364 162124 162569 162791
54101 162791 163019 163695 164865 165827 165831 164986 164145 163992 164467 164984 165002 164501 164116 164679 166487 169179 172402 176236
54083 176236 180715 185340 189519 193231 196820 200375 203833 207483 211652 215903 219143 220653 220449 218591
54069 218591 214881 209624 204074 199538 196249 193575 191086 188986 187592 186862 186544 186523 186918 187903 189418 191030
54053 191030 192194 192798 193269 194056 195176 196454 198017 200276 203441 207274 211283 214985 218023 220294 222067
54038 222067 223886 226302 229620 233754 238250 242646 246974 251761 257305 263131 268447 273037 277329 281628
54024B81628M070L534L062K744K217J272J34r61k095l330m425n117n412n409n116
54009B66796m767m948n956p144p379o260m497l091k432k331k425k414k139j752
53995B09261j599j710j650j126n24m00o29n55J9M17m0j118j852j612p09K3J43
53978A96339lJ43N40N77On16k40N98J080R06P49J112J497J203M52N6K49N29N73
53959B05850O76J054J374J322J190J405J767J766J525J814K888L911L980L381
53945B33903L299M344N947P299Q307R321J0321J0880J0809J0446J0254J0317J0210
53932C45657R154O580K810r11l445m712n332n558n077l809k231p77N47J714K407
53917C37017K508K408K424K346J975J702J973K462K440J766R54K46o94j996l078
$$ plain form
54024 281628 285698 289232 292294 295038 297255 298527 298661 297700 295605 292275 287850 282733 277321 271912 266796
54009 266796 262029 257081 251125 243981 236602 230342 225845 222754 220322 217991 215566 213152 211013 209261
53995 209261 207662 205952 204302 203176 202652 202252 201623 201068 201087 201504 201464 200346 198494 196882 196173 196196 196339
53978 196339 196336 196479 197019 197596 197602 197086 196846 197444 198524 199430 200179 201291 202788 203991 204443 204499 204748 205277 205850
53959 205850 206526 207580 208954 210276 211466 212871 214638 216404 217929 219743 222631 226542 230522 233903
53945 233903 237202 241546 247493 254792 263099 272420 282741 293621 304430 314876 325130 335447 345657
53932 345657 354811 361391 364201 363290 359845 355133 349801 344243 339166 335357 333126 332349 332896 334610 337017
53917 337017 339525 341933 344357 346703 348678 350380 352353 354815 357255 359021 359975 360221 359527 357531 354453
53902C54453l293k753k173k078k366k635k687k773l334m472n695o389o445o233
53888C01127n960n414m509l744l728m386m949m777m010l314l166l460l735l690
53874B42285l408l128k931k717k489k433k596k650k275j666j381j577j760j549
53860B09725j292j507j923j696o23M91Q74O91N06L92J28j37l5L23M10L1n21r90
53842B04847j228r66j24O23M49m12q05k92K52Q7k78r7K86L5p22j047n91O3M02
53823B00482N64Q41J269J769K213K343K056J750J807J929J609J128J281K027K361
53808B25429J891J600K449L847M356L644K863L036L690L548K269J003J071K327
53794B63023L258K735J239P4k03qK19M80P11O03J39k98o03j159k125l035l457
$$ plain form
53902 354453 351160 348407 346234 344156 341790 339155 336468 333695 330361 325889 320194 313805 307360 301127
53888 301127 295167 289753 285244 281500 277772 273386 268437 263660 259650 256336 253170 249710 245975 242285
53874 242285 238877 235749 232818 230101 227612 225179 222583 219933 217658 215992 214611 213034 211274 209725
53860 209725 208433 206926 205003 203307 202684 203175 204049 204740 205246 205638 205766 205629 205594 205917 206327 206358 205837 204847
53842 204847 203619 202653 202529 203152 203601 203189 202384 202092 202344 202431 202153 202056 202342 202377 201655 200608 200017 200080 200482
53823 200482 201046 201887 203156 204925 207138 209481 211537 213287 215094 217023 218632 219760 221041 223068 225429
53808 225429 227320 228920 231369 235216 239572 243216 246079 249115 252805 256353 258622 259625 260696 263023
53794 263023 266281 269016 270255 270329 270126 270118 270337 270817 271528 272131 272270 271972 271369 270210 268085 265050 261593
53777B61593l579l758l881l673l253k944k731k367j910j691j878k291k622k537
53763B22478j841q39k98p16j667k257k104j620j337j365j446j307q88l98j13p9
53747B04203j15j31j78j63J79P27Q35J59p10r09m31m3j75m52l45J31N92P68P27
53728B04669P60J122J717K067J818J195O84M22K50K39O86J480K059K115J969J977
53712B25229J967J580R54O94J199K232L125L327K828K121J725J732J913K135K429
53697B55190K701K743K594K521K502K098J148K31Q5O64J202J140O80L49L60M74
53681B76682L41j77q74j290j133o73n72j128j799j795j057k92PJ53N58R27O96
53664B68574Q5r4K62K61n87j411j121L5Q25P24L74M32P56R34R11P51L86k4L1P99
$$ plain form
53777 261593 258014 254256 250375 246702 243449 240505 237774 235407 233497 231806 229928 227637 225015 222478
53763 222478 220637 219798 219500 218784 217117 214860 212756 211136 209799 208434 206988 205681 204793 204395 204282 204203
53747 204203 204088 203957 203779 203616 203795 204522 205357 205516 204806 203897 203466 203423 203248 202796 202451 202582 203174 203942 204669
53728 204669 205429 206551 208268 210335 212153 213348 214032 214454 214704 214943 215629 217109 219168 221283 223252 225229
53712 225229 227196 228776 229730 230424 231623 233855 236980 240307 243135 245256 246981 248713 250626 252761 255190
53697 255190 257891 260634 263228 265749 268251 270349 271497 271728 271813 272477 273679 274819 275499 275848 276208 276682
53681 276682 277023 276846 275972 274682 273549 272876 272304 271176 269377 267582 266525 266233 266240 266393 266951 267878 268574
53664 268574 268659 268565 268827 269088 268501 267090 265969 266004 266829 267553 267927 268359 269115 270049 270960 271711 272097 272073 272104 272903
53644B72903J794K329K227J740J116M89J2k28k01K85J359K501K692J673N77O60
53628B91928J763K669K726K369K161K158K351K936L770M254M096L728L587L492
53614C33988L186L081L773N045N961N961N351M659M035L402K816K325J711O87
53600C85981o28j626j726r38Q7N91L41k40n73m52j02K00L46L37J72j67o59j195
53582C79749j544j433q25q2L16K15j90o90j137j301r78m01j54m33p12m28K33O90
53564C70895Q07Q89R80Q45O68J058K043K698K324J469J216J750K338K512K556
53549C95048K745K790K367J736J492J942K870L746M071L819L562L922M809N571
53535D40490N890O078O348O402O050N745O045O883P835Q809R927J0973J1520J1537
$$ plain form
53644 272903 274697 277026 279253 280993 282109 282598 282610 282382 282181 282466 283825 286326 289018 290691 291268 291928
53628 291928 293691 296360 299086 301455 303616 305774 308125 311061 314831 319085 323181 326909 330496 333988
53614 333988 337174 340255 344028 349073 355034 360995 366346 371005 375040 378442 381258 383583 385294 385981
53600 385981 385353 383727 382001 381063 381150 381741 382082 381842 381269 380817 380715 380915 381261 381598 381770 381603 380944 379749
53582 379749 378205 376772 375947 375865 376181 376396 376206 375516 374379 373078 372100 371699 371545 371112 370400 369972 370205 370895
53564 370895 371702 372591 373571 374416 375084 376142 378185 380883 383207 384676 385892 387642 389980 392492 395048
53549 395048 397793 400583 402950 404686 406178 408120 410990 414736 418807 422626 426188 430110 434919 440490
53535 440490 446380 452458 458806 465208 471258 477003 483048 489931 497766 506575 516502 527475 538995 550532
53521E50532J1426J1441J1473J1458J1538J1915J2738J4080J5666J6784J6931
53510F95982J6480J6311J6831J7753J8700J9476J9802J9427J8631J8000J7573
53499H94966J6873J5885J5291J5367J5453J4977J4434J4598J5300J5698J5414
53488A064256J4696J3752J2699J2098J2562J3745J4397J3768J2339J1023J0151
53477A205486R569R195Q953Q513P603O488N626M903L575J174j800m298n757o539
53463A252691p330q313r123r511r695r963j0287j0555j0930j1606j2347j2720
53451A130311j2724j2704j2673j2211j1248j0396j0178j0209r629q192o490n160
53439A008497m217l291k208j160m12M2N02J297K466L709M697N401O021O671P240
$$ plain form
53521 550532 561958 573399 584872 596330 607868 619783 632521 646601 662267 679051 695982
53510 695982 712462 728773 745604 763357 782057 801533 821335 840762 859393 877393 894966
53499 894966 911839 927724 943015 958382 973835 988812 1003246 1017844 1033144 1048842 1064256
53488 1064256 1078952 1092704 1105403 1117501 1130063 1143808 1158205 1171973 1184312 1195335 1205486
53477 1205486 1215055 1224250 1233203 1241716 1249319 1255807 1261433 1266336 1269911 1271085 1269285 1264987 1259230 1252691
53463 1252691 1245361 1237048 1227925 1218414 1208719 1198756 1188469 1177914 1166984 1155378 1143031 1130311
53451 1130311 1117587 1104883 1092210 1079999 1068751 1058355 1048177 1037968 1028339 1020147 1013657 1008497
53439 1008497 1004280 1000989 998781 997621 997209 997251 997753 999050 1001516 1005225 1009922 1015323 1021344 1028015 1035255
53424A035255P653Q116Q961J0238J1659J2976J4264J5691J7073J8006J8380J8557
53412A196829J8897J9378J9870K0562K1796K3527K5198K6281K6807K7418K8861
53401A455424L1244L3700L5091L5218L5091L5726L6946L7797L7910L7834L8064
53390A850045L8391L8380L8022L7527L6879L5919L4703L3459L2271L0939K9157
53379B235692K6742K3876K1019J8403J5719J2556R091N882K962k59m132q308j2405
53366B346838j6553k0874k4948k8299l1020l3455l5523l6904l7650l8100l8283
53355B005229l7860l6667l4975l3231l1887l1229l1098l0884l0166k9200k8496
53344A649536k8171k8028k7952k7709k6677k4481k1819j9937j9191j8712j7554
$$ plain form
53424 1035255 1042908 1051024 1059985 1070223 1081882 1094858 1109122 1124813 1141886 1159892 1178272 1196829
53412 1196829 1215726 1235104 1254974 1275536 1297332 1320859 1346057 1372338 1399145 1426563 1455424
53401 1455424 1486668 1520368 1555459 1590677 1625768 1661494 1698440 1736237 1774147 1811981 1850045
53390 1850045 1888436 1926816 1964838 2002365 2039244 2075163 2109866 2143325 2175596 2206535 2235692
53379 2235692 2262434 2286310 2307329 2325732 2341451 2354007 2363098 2368980 2371942 2371683 2367551 2359243 2346838
53366 2346838 2330285 2309411 2284463 2256164 2225144 2191689 2156166 2119262 2081612 2043512 2005229
53355 2005229 1967369 1930702 1895727 1862496 1830609 1799380 1768282 1737398 1707232 1678032 1649536
53344 1649536 1621365 1593337 1565385 1537676 1510999 1486518 1464699 1444762 1425571 1406859 1389305
53333A389305j5677j3669j2050j1004j0366r691q794q207q635r842j0742j0868
53321A259760j0969j1732j2471j1886r869p827p139p704q227p594n811l723k071
53308A152737r49q8O20J140J626K395L528M818O131P471Q729R723J0571J1599
53294A220051J2748J3536J3772J3956J4640J5698J6461J6391J5412J3887J2440
53283A378992J1536J0989J0159Q729O946M980K602j63k658m349n612p141q890
53270A406120j0228j1041j2014j3733j5936j7796j8701j8734j8614j9096k0249
53259A229978k1414k2012k2132k2106k1946k1611k1465k1771k1967k1204j9613
53248I92737j8304j7996j8305j8583j8730j8822j8585j7768j6723j6027j5742
$$ plain form
53333 1389305 1373628 1359959 1347909 1336905 1326539 1316848 1308054 1299847 1291212 1281370 1270628 1259760
53321 1259760 1248791 1237059 1224588 1212702 1202833 1195006 1187867 1180163 1171936 1164342 1158531 1154808 1152737
53308 1152737 1151788 1151700 1152320 1153460 1155086 1157481 1161009 1165827 1171958 1179429 1188158 1197881 1208452 1220051
53294 1220051 1232799 1246335 1260107 1274063 1288703 1304401 1320862 1337253 1352665 1366552 1378992
53283 1378992 1390528 1401517 1411676 1420405 1427351 1432331 1434933 1434770 1432112 1427763 1422151 1415010 1406120
53270 1406120 1395892 1384851 1372837 1359104 1343168 1325372 1306671 1287937 1269323 1250227 1229978
53259 1229978 1208564 1186552 1164420 1142314 1120368 1098757 1077292 1055521 1033554 1012350 992737
53248 992737 974433 956437 938132 919549 900819 881997 863412 845644 828921 812894 797152
53237G97152j5445j4819j3869j2674j1374j0314r809r756r749r623r561r628r513
53224F51018q924q109p757q349r691j1075j1859j1928j1614j1321j1233j1330
53212E27828j1501j1582j1341j0595r350p867o577n882n929o460o975p201p387
53199D19181p947q768r086q343o978n993n827o009n973n689n252m510l618l412
53185C31776m408n630n460l712j974j557k050k314k098j900j849j673j459j608
53171B94084k078k442k568k598k415j812j184j213j764j841r81nJ4r62k039k416
53155B67780j966j098m01k37m87q12j139j633k145k187j565o32K64J114J792J798
53139B58446R24k18q23p96o04m44j19L27M40q7r69j618j718j393r90p27n21j88
$$ plain form
53237 797152 781707 766888 753019 740345 728971 718657 708848 699092 689343 679720 670159 660531 651018
53224 651018 642094 633985 626228 617879 608188 597113 585254 573326 561712 550391 539158 527828
53212 527828 516327 504745 493404 482809 473459 465592 459015 453133 447204 440744 433769 426568 419181
53199 419181 411234 402466 393380 385037 378059 372066 366239 360230 354257 348568 343316 338806 335188 331776
53185 331776 327368 321738 316278 312566 310592 309035 306985 304671 302573 300673 298824 297151 295692 294084
53171 294084 292006 289564 286996 284398 281983 280171 278987 277774 276010 274169 273188 273183 273197 272235 270196 267780
53155 267780 265814 264716 264315 264078 263591 262779 261640 260007 257862 255675 254110 253478 253742 254856 256648 258446
53139 258446 259370 259152 258329 257533 256929 256485 256366 256693 257133 257046 256077 254459 252741 251348 250358 249631 249110 248922
53121B48922K30N18O71R43J354J471R18n0q35j191j349j487j459j126o13j48K11
53104B46980M88N50J53p35j721k246k064j397o42m0K48Q0m11p22n42k58m11p44
53086B36566m85L41P12Q2o99n79J54L69k04p58p34m52k48O8N17N10k83j189j331
53067B32357q19n02p00q81o23k19j46l52m65l57k49l24n27o25l80J88N61J56p98
53048B25295j156j38J504K251J651O88K21n8p09j442j614j302r95o50R7R56J224
53031B25823R12P05P43M76j11k27L47O59M0p17n26L81R36Q14N10J98l74r64q70
53012B28755qQ88J271J222Q82K42k79K0J012J526Q20l48p15j60L73K95K0J39N86
52993B36541Q09M97q6m30k79J73N63P55P79N50j8o03o34o7L92K09j51J68J137
$$ plain form
53121 248922 249152 249670 250341 251284 252638 254109 255027 254977 254142 252951 251602 250115 248656 247530 246917 246769 246980
53104 246980 247468 248018 248171 247436 245715 243469 241405 240008 239366 239326 239574 239654 239243 238521 237979 237721 237310 236566
53086 236566 236081 236422 237134 237216 236517 235938 236092 236461 236257 235499 234765 234313 234065 234133 234650 235160 234877 233688 232357
53067 232357 231538 231036 230336 229455 228832 228613 228467 228115 227650 227293 227044 226720 226193 225568 225188 225376 225937 226093 225295
53048 225295 224139 224001 225505 227756 229407 230095 230316 230258 229549 228107 226493 225191 224196 223546 223643 224599 225823
53031 225823 226735 227440 228183 228659 228548 228321 228668 229327 229367 228650 228124 228505 229441 230255 230765 230963 230589 229625 228755
53012 228755 228747 229635 230906 232128 233010 233252 232973 232993 234005 235531 236351 236003 235288 235128 235501 235796 235816 235955 236541
52993 236541 237350 237847 237761 237331 237052 237225 237788 238543 239322 239872 239854 239251 238617 238550 238942 239151 239000 239168 240305
52974B40305J721J190R5l70K92J414J986J688J097R61J391J703J200J2r72j115
52958B52598p36n96q86j169j199j231j417j443j210j256j925k480j923n48L00
52943B34879R0j87L57J074Q12k54p58NJ202J592Q97j25o23l98L1P0l13o16n24
52924B37211l04k99l78k24J13L47L70K19j31n51o71m67n18j151j699j333l14L91
52906B30611M94M22J84o93j898k221j091O17J778K186K069J344Q6r48j071n37
52890B31332m1J92K55Ko23j073q38l10k69p07r01n72j43J46N55J131J402J160
52872B30698R22J170J529J259M28nN89J572J740Q01k43l91J14K33m33j258j574
52855B37151j387j000n85l82p23j496k067k124k021j957j478m28L11r5j074j323
$$ plain form
52974 240305 242026 243216 243311 242941 243233 244647 246633 248321 249418 250379 251770 253473 254673 254685 253713 252598
52958 252598 251862 251266 250380 249211 248012 246781 245364 243921 242711 241455 239530 237050 235127 234579 234879
52943 234879 234969 234782 235139 236213 237025 236771 236013 236018 237220 238812 239709 239584 238961 238563 238594 238664 238351 237735 237211
52924 237211 236907 236608 236230 236006 236119 236466 236836 237055 236924 236373 235702 235235 234717 233566 231867 230534 230220 230611
52906 230611 231105 231527 231711 231018 229120 226899 225808 226425 228203 230389 232458 233802 233888 232940 231869 231332
52890 231332 231291 231483 231738 231740 231117 230044 229206 228896 228627 227920 227019 226447 226304 226450 227005 228136 229538 230698
52872 230698 231620 232790 234319 235578 236006 236001 236590 238162 239902 240703 240460 240069 240183 240416 239983 238725 237151
52855 237151 235764 234764 234179 233797 233074 231578 229511 227387 225366 223409 221931 221503 221814 221719 220645 219322
52839B19322o27J3n2l89m24j97N5K83L16j40q64j103n50J83L92J29j47k62k72
52820B15666r7L23P55R21Q67Q02P94Q28R65J210J401J445J379J080K54r95j946
52803B25652k044j676j678k138k227j309J68J169J277J027J079J367J262M40p30
52788B21639j612j848j428o41k7q1n74o69jP25P78N27P76J302J174M26K44J075
52770B21785J763J244J40k64R4K50j07l50k32l73j104j725j431m23M01N82M69
52753B20719N75R42J164R30M31K37O72J378J629J101K21k87j14M10P42O94N61
52736B32005O47Q55Q64N89K55N4j3L1J50J43j69n57n80k57p8k23k75m3o7p92j738
52715B30801k033j503o37K17R52J281R04J40l33l18j63K6N03J193J523J205O59
$$ plain form
52839 219322 218695 218708 218656 218267 217843 217646 217701 217984 218300 218160 217296 216193 215643 215826 216218 216347 216200 215938 215666
52820 215666 215569 215892 216647 217568 218435 219237 220031 220859 221824 223034 224435 225880 227259 228339 228593 227598 225652
52803 225652 223608 221932 220254 218116 215889 214580 214748 215917 217194 218221 219300 220667 221929 222369 221639
52788 221639 220027 218179 216751 216110 216083 216002 215428 214759 214758 215483 216261 216788 217564 218866 220040 220466 220710 221785
52770 221785 223548 224792 224932 224668 224762 225012 224905 224555 224323 223950 222846 221121 219690 219267 219668 220250 220719
52753 220719 221294 222236 223400 224330 224761 224998 225670 227048 228677 229778 229999 229712 229598 230008 230750 231444 232005
52736 232005 232652 233507 234371 234960 235215 235269 235256 235287 235437 235580 235411 234854 234274 234017 233939 233716 233441 233398 233331 232539 230801
52715 230801 228768 227265 226628 226845 227797 229078 229982 230122 229789 229471 229308 229334 229837 231030 232553 233758 234417
52698B34417M12N25P61Q61N21l66j270j342m76M86Q29P30O21M40N7j71J06N05
52680B37646M16q0m16m98p01j047j083p30n43q48j177q63Q7J041J425J194P80
52663B34603P15J151J661J676J174O95O44Q75J070J238J553J946K061J588N05
52648B53155q87k045k452j989j038j54L08K81m3k69q7L27L62k41q68o49M51J491
52630B45653J683J297J238J826K401K146J056j11q00j232j866k533k468j358L0
52615B46962N82J10n37n92k45j52m62p35o77m73k78J73J103K131K560K187J482
52598B53139R38N96K35k11o95j148j354r29J41J096J022m3r55p33L43J138J043
52581B53623N61M29O36N54o7o72o21n5K81L8k86j02L46K37p06j760k029j441o81
$$ plain form
52698 234417 234829 235354 236115 236976 237497 237131 235861 234519 234043 234529 235358 236088 236709 237149 237206 237035 237141 237646
52680 237646 238062 237982 237566 237068 236367 235320 234237 233507 232964 232116 230939 230076 230163 231204 232629 233823 234603
52663 234603 235318 236469 238130 239806 240980 241675 242319 243194 244264 245502 247055 249001 251062 252650 253155
52648 253155 252268 250223 247771 245782 244744 244590 244898 245179 245136 244867 244780 245107 245469 245228 244360 243711 244162 245653
52630 245653 247336 248633 249871 251697 254098 256244 257300 257189 256389 255157 253291 250758 248290 246932 246962
52615 246962 247544 247654 247117 246525 246280 246128 245666 244931 244254 243781 243503 243676 244779 246910 249470 251657 253139
52598 253139 254077 254673 254908 254697 254002 252854 251500 250571 250712 251808 252830 252787 251832 251099 251442 252580 253623
52581 253623 254184 254613 255249 255803 255736 255064 254443 254388 254669 254707 254421 254319 254665 254902 254196 252436 250407 248966 248285
52562B48285l48m79p69r24p62l08R7R8j55j17L59O38J50o61p98j34L10k39j214
52543B43029j509r27k16J84N85J211J634J383O82R2j90k84j16M93J316J777J585
52526B50729R95M02j9k58l45l66m15m45l29p1K20M87P03P39N57L99N59R73J396
52507B55911J908K703L459L432K433J132J56o56j664k602k902k533j988j525j012
52492B56252m71k44n22j078j570j805j692j205n08J58O92J087J236J099R70J194
52476B53593J591J595J085O22O96J078J163P70K64N3K17N67Q30Q69P67P40Q64
52459B67364J001R79P73M59J02k24m68p00j045j512j931k132k073j810j449j129
52443B56205q42l98K84Q82R36L66n14j400k056k063j118L10J121P97N9m2O21J328
$$ plain form
52562 248285 247937 247458 246689 245765 245003 244695 244792 244890 244735 244618 244977 245615 245765 245104 244306 244172 244482 244243 243029
52543 243029 241520 240593 240377 240561 241146 242357 243991 245374 246056 246148 245958 245674 245558 246051 247367 249144 250729
52526 250729 251724 252126 252107 251849 251504 251138 250723 250278 249949 249878 250098 250585 251288 252027 252584 252983 253542 254515 255911
52507 255911 257819 260522 263981 267413 269846 270978 271134 270478 268814 266212 263310 260777 258789 257264 256252
52492 256252 255781 255537 255015 253937 252367 250562 248870 247665 247157 247315 248007 249094 250330 251429 252399 253593
52476 253593 255184 256779 257864 258486 259182 260260 261423 262193 262457 262510 262727 263294 264124 264993 265760 266500 267364
52459 267364 268365 269344 270117 270576 270678 270454 269986 269286 268241 266729 264798 262666 260593 258783 257334 256205
52443 256205 255363 254965 255249 256131 257067 257433 256919 255519 253463 251400 250282 250592 251713 252510 252569 252527 253148 254476
52425B54476J565J503J451J380J112P29N59Q29J401J894K070K129K490L274M215
52410B81077N038N704O190O358O240O146O213O014M939K877L26k070l889m963
52396C26200n324n101m452l570k768k353k297k268k034j633j060j71R46J836K142
52381B98093J930J436Q41M68P19J531K297K688L037L549L763L348K859K923L150
52366C32632K796K159K225K969L181K190Q41L44Q42J573J929J888J778J945K420
52351C61712K865K987K952L026L034K742K468K714L299L765M349N583O943P249
52337D15688O612O602P934R317R518R280R989J1386J2064J1767J1699J2708J4337
52324E48901J5789J6799J7400J7625J7660J7715J7708J7550J7564J8041J8501
$$ plain form
52425 254476 256041 257544 258995 260375 261487 262216 262775 263604 265005 266899 268969 271098 273588 276862 281077
52410 281077 286115 291819 298009 304367 310607 316753 322966 328980 333919 336796 337122 335052 331163 326200
52396 326200 320876 315775 311323 307753 304985 302632 300335 298067 296033 294400 293340 293169 294115 295951 298093
52381 298093 300023 301459 302300 302768 303487 305018 307315 310003 313040 316589 320352 323700 326559 329482 332632
52366 332632 335428 337587 339812 342781 345962 348152 348993 349337 350179 351752 353681 355569 357347 359292 361712
52351 361712 364577 367564 370516 373542 376576 379318 381786 384500 387799 391564 395913 401496 408439 415688
52337 415688 422300 428902 436836 446153 455671 464951 474940 486326 498390 510157 521856 534564 548901
52324 548901 564690 581489 598889 616514 634174 651889 669597 687147 704711 722752 741253
52313G41253J8141J6943J5679J4875J4359J3832J3226J2466J1509J0569R815Q996
52301I01663P931P083O852O601N426L728K765K582J745m33k760l986m590n641
52287I28966o807o743n196l422k584k570k574k070r92N27K248L906N326O438P228
52272I21681P790Q336Q958R568J0128J0772J1455J1776J1391J0464R537R074R183
52259A050113R575R699R261Q600Q203P805O580M442K440J422R25k7j592l259m818
52244A109369o409p860q865r625j0586j1512j1700j1069j0317r919r681r446r411
52231I82969r506r198q265p204o441n721m730l808l417l323k858j863q33j93J55
52216I15764O41J532K670L480L465K820K391K762L622M225M211L674K804J829
$$ plain form
52313 741253 759394 776337 792016 806891 821250 835082 848308 860774 872283 882852 892667 901663
52301 901663 909594 916677 923529 930130 935556 939284 942049 944631 946376 945943 943183 939197 934607 928966
52287 928966 922159 915416 910220 906798 904214 901644 899070 897000 896008 896535 898783 902689 908015 914453 921681
52272 921681 929471 937807 946765 956333 966461 977233 988688 1000464 1011855 1022319 1031856 1040930 1050113
52259 1050113 1059688 1069387 1078648 1087248 1095451 1103256 1109836 1114278 1116718 1118140 1119065 1119038 1117446 1114187 1109369
52244 1109369 1102960 1095100 1086235 1076610 1066024 1054512 1042812 1031743 1021426 1011507 1001826 992380 982969
52231 982969 973463 964265 956000 948796 942355 936634 931904 928096 924679 921356 918498 916635 915802 915609 915764
52216 915764 916405 917937 920607 924087 927552 930372 932763 935525 939147 943372 947583 951257 954061 955890
52202I55890J158J102J499J958K345K710K884K682K398K540K992K938J922N81
52188I85599K2N92J458J389j10k277l766l928l400l199l482l617l349l226l667
52173I55039m236m258l703l009k338j520n82K06P77J333J942K414K578K501K336
52158I49480K279K546L124L596L504K905K299J988J861J779J844K146K600L148
52144I85099L845M568M918M598L760K871K401K655L591M745N607O197P024Q406
52130A050285J0113J1843J3603J5408J6948J7901J8446J9107K0169K1442K2444
$$ plain form
52202 955890 957048 958150 959649 961607 963952 966662 969546 972228 974626 977166 980158 983096 985018 985599
52188 985599 985621 986213 987671 989060 988950 986673 982907 978979 975579 972380 968898 965281 961932 958706 955039
52173 955039 950803 946545 942842 939833 937495 935975 935393 935599 936376 937709 939651 942065 944643 947144 949480
52158 949480 951759 954305 957429 961025 964529 967434 969733 971721 973582 975361 977205 979351 981951 985099
52144 985099 988944 993512 998430 1003028 1006788 1009659 1012060 1014715 1018306 1023051 1028658 1034855 1041879 1050285
52130 1050285 1060398 1072241 1085844 1101252 1118200 1136101 1154547 1173654 1193823 1215265 1237709
$$ [...]
##END NTUPLES=NMR SPECTRUM
##END=
