
##TITLE=AC1240__6945241_x3iRVr0fXr
##JCAMPDX= 6.0         $$ Bruker NMR JCAMP-DX V2.0
##DATA TYPE= NMR SPECTRUM
##DATA CLASS= NTUPLES
##ORIGIN= BRUKER
##OWNER= Administrator
$$ 1.72 TOPSPIN		Version 2.1
$$ 2012-10-18 13:35:47.864 -0700  Administrator@X
$$ Compression mode = diff/dup
##.OBSERVE FREQUENCY= 400.02188249412
##.OBSERVE NUCLEUS= ^1H
##.ACQUISITION MODE= SIMULTANEOUS (DQD)
##.ACQUISITION SCHEME= undefined
##.AVERAGES= 8
##.DIGITISER RES= 22
##SPECTROMETER/DATA SYSTEM= spect
##.PULSE SEQUENCE= zg30
##.SOLVENT NAME= COFFEE_meoh
##.SHIFT REFERENCE= INTERNAL, COFFEE_meoh, 1, 14.98509
##AUDIT TRAIL= $$ (NUMBER, WHEN, WHO, WHERE, PROCESS, VERSION, WHAT)
$$ ##TITLE= Audit trail, TOPSPIN		Version 2.1
$$ ##JCAMPDX= 5.01
$$ ##ORIGIN= Bruker BioSpin GmbH
$$ ##OWNER= Administrator
$$ $$ C:\Bruker\TOPSPIN/data/COFFEE/nmr/AC1240__6945241_x3iRVr0fXr/10/pdata/1/auditp.txt
$$ ##AUDIT TRAIL=  $$ (NUMBER, WHEN, WHO, WHERE, PROCESS, VERSION, WHAT)
(   1,<2012-10-13 19:51:28.562 -0500>,<Administrator>,<TOPSPIN>,<go>,<TOPSPIN 2.1>,
      <created by zg
	started at 2012-10-13 19:50:21.968 -0500,
	POWCHK enabled, PULCHK disabled,
       configuration hash MD5:
       6B 1B 68 BB D9 2E 58 E2 7F 35 AD 54 07 DF 0E 41
       data hash MD5: 64K
       0D 0C 70 1C 0D CD E6 FD 4A 98 61 E9 ED A2 2F A3>)
(   2,<2012-10-13 19:51:31.234 -0500>,<Administrator>,<TOPSPIN>,<proc1d>,<TOPSPIN 2.1>,
      <Start of raw data processing
       efp LB = 0 FT_mod = 6 PKNL = 1 PHC0 = 0 PHC1 = 0 SI = 32K 
       data hash MD5: 32K
       30 B2 9C 5C 16 90 57 7C 19 27 AE C9 92 56 B8 B8>)
(   3,<2012-10-13 19:51:31.671 -0500>,<Administrator>,<TOPSPIN>,<proc1d>,<TOPSPIN 2.1>,
      <pk PHC0 = 181.4832 PHC1 = 0 
       data hash MD5: 32K
       9C DB F3 C0 6E 22 75 25 09 79 21 0E 36 F4 06 84>)
(   4,<2012-10-13 19:51:31.781 -0500>,<Administrator>,<TOPSPIN>,<proc1d>,<TOPSPIN 2.1>,
      <abs ABSG = 1 
       data hash MD5: 32K
       39 25 D3 ED 65 67 4E C8 02 37 9D 04 DA 3E 3D 02>)
(   5,<2012-10-13 19:51:31.812 -0500>,<Administrator>,<TOPSPIN>,<proc1d>,<TOPSPIN 2.1>,
      <abs ABSG = 2 
       data hash MD5: 32K
       6B 80 C7 1E F0 C7 1F 39 62 3C A9 B5 07 13 80 28>)
(   6,<2012-10-13 19:51:31.843 -0500>,<Administrator>,<TOPSPIN>,<proc1d>,<TOPSPIN 2.1>,
      <abs ABSG = 3 
       data hash MD5: 32K
       FA EE 11 AD 95 4F C3 79 A1 D0 AE D8 8B 87 DE D2>)
(   7,<2012-10-13 19:51:31.875 -0500>,<Administrator>,<TOPSPIN>,<proc1d>,<TOPSPIN 2.1>,
      <abs ABSG = 4 
       data hash MD5: 32K
       2F E2 2D A3 4F BA 8A 3F 7B 96 FA 28 9B A8 A6 AE>)
(   8,<2012-10-13 19:51:31.890 -0500>,<Administrator>,<TOPSPIN>,<proc1d>,<TOPSPIN 2.1>,
      <abs ABSG = 5 
       data hash MD5: 32K
       C3 1D A0 62 EB 08 89 48 43 82 D3 26 A4 C9 FC 5E>)
(   9,<2012-10-13 19:51:35.515 -0500>,<Administrator>,<TOPSPIN>,<audit>,<TOPSPIN 2.1>,
      <user comment:
       ICON-NMR User ID: COFFEE
       data hash MD5: 32K
       C3 1D A0 62 EB 08 89 48 43 82 D3 26 A4 C9 FC 5E>)
$$ ##END=
$$ 
$$ $$ hash MD5
$$ [...]
##$TP= (0..7)
150 150 150 150 150 150 150 150
##$TP07= 0
##$TPNAME0= <>
##$TPNAME1= <>
##$TPNAME2= <>
##$TPNAME3= <>
##$TPNAME4= <>
##$TPNAME5= <>
##$TPNAME6= <>
##$TPNAME7= <>
##$TPOAL= (0..7)
0.5 0.5 0.5 0.5 0.5 0.5 0.5 0.5
##$TPOFFS= (0..7)
0 0 0 0 0 0 0 0
##$TUNHIN= 0
##$TUNHOUT= 0
##$TUNXOUT= 0
##$USERA1= <user>
##$USERA2= <user>
##$USERA3= <user>
##$USERA4= <user>
##$USERA5= <user>
##$V9= 5
##$VALIST= <valist>
##$VCLIST= <CCCCCCCCCCCCCCC>
##$VD= 0
##$VDLIST= <DDDDDDDDDDDDDDD>
##$VPLIST= <PPPPPPPPPPPPPPP>
##$VTLIST= <TTTTTTTTTTTTTTT>
##$WBST= 2048
##$WBSW= 25
##$XGAIN= (0..3)
0 0 0 0
##$XL= 0
##$YL= 0
##$YMAX_a= 497718
##$YMIN_a= -638196
##$ZGOPTNS= <>
##$ZL1= 120
##$ZL2= 120
##$ZL3= 120
##$ZL4= 120
##$ABSF1= 14.98509
##$ABSF2= -5.573092
##$ABSG= 5
##$ABSL= 3
##$ALPHA= 0
##$AQORDER= 0
##$ASSFAC= 0
##$ASSFACI= 0
##$ASSFACX= 0
##$ASSWID= 0
##$AUNMP= <proc_prof1d_extract_pilot.lims>
##$AXLEFT= 0
##$AXNAME= <>
##$AXNUC= <1H>
##$AXRIGHT= 0
##$AXTYPE= 0
##$AXUNIT= <>
##$AZFE= 0.1
##$AZFW= 0.1
##$BCFW= 0
##$BC_mod= 0
##$BYTORDP= 0
##$COROFFS= 0
##$CY= 15
##$DATMOD= 1
##$DC= 0
##$DFILT= <>
##$DTYPP= 0
##$F1P= 0
##$F2P= 0
##$FCOR= 0.5
##$FTSIZE= 32768
##$FT_mod= 6
##$GAMMA= 0
##$GB= 0
##$INTBC= 1
##$INTSCL= 1
##$ISEN= 128
##$LB= 0
##$LEV0= 0
##$LPBIN= 0
##$MAXI= 10000
##$MC2= 0
##$MEAN= 0
##$ME_mod= 0
##$MI= 0
##$NCOEF= 0
##$NC_proc= -8
##$NLEV= 6
##$NOISF1= 0
##$NOISF2= 0
##$NSP= 0
##$NTH_PI= 0
##$NZP= 0
##$OFFSET= 14.98509
##$PC= 1
##$PHC0= 181.4832
##$PHC1= 0
##$PH_mod= 1
##$PKNL= yes
##$PPARMOD= 0
##$PPDIAG= 0
##$PPIPTYP= 0
##$PPMPNUM= 2147483647
##$PPRESOL= 1
##$PSCAL= 4
##$PSIGN= 0
##$PYNMP= <proc.py>
##$REVERSE= no
##$SF= 400.02
##$SI= 32768
##$SIGF1= 0
##$SIGF2= 0
##$SINO= 400
##$SIOLD= 32768
##$SPECTYP= <>
##$SREGLST= <1H.CDCl3>
##$SSB= 0
##$STSI= 32768
##$STSR= 0
##$SW_p= 8223.68421052631
##$SYMM= 0
##$S_DEV= 0
##$TDeff= 65536
##$TDoff= 0
##$TI= <>
##$TILT= no
##$TM1= 0
##$TM2= 0
##$TOPLEV= 0
##$USERP1= <user>
##$USERP2= <user>
##$USERP3= <user>
##$USERP4= <user>
##$USERP5= <user>
##$WDW= 1
##$XDIM= 32768
##$YMAX_p= 447379299
##$YMIN_p= -750118
##$CURPLOT= <Network HP LaserJet P1505>
##$CURPRIN= <$Network HP LaserJet P1505>
##$DFORMAT= <normdp>
##$LAYOUT= <+/1D_H.xwp>
##$LFORMAT= <normlp>
##$PFORMAT= <normpl>
##$SURQMSG= 1
$$ End of Bruker specific parameters
$$ ---------------------------------
##NTUPLES= NMR SPECTRUM
##VAR_NAME=  FREQUENCY,     SPECTRUM/REAL,   SPECTRUM/IMAG
##SYMBOL=    X,             R,               I
##VAR_TYPE=  INDEPENDENT,   DEPENDENT,       DEPENDENT
##VAR_FORM=  AFFN,          ASDF,            ASDF
##VAR_DIM=   32768,         32768,           32768
##UNITS=     HZ,            ARBITRARY UNITS, ARBITRARY UNITS
##FACTOR=    0.250966925370066, 1,           1
##FIRST=     8223.43324360094, 83485,        47408
##LAST=      0,             -219205,         109750
##MIN=       0,             -750118,         0
##MAX=       8223.43324360094, 447379299,    0
$$ Real data points
##PAGE= N=1
##DATA TABLE= (X++(R..R)), XYDATA
$$ [...]
$$ plain form
19547 -151245 40773 381954 -94420 319521 130867 -281112 15335 -76130 -74884 -166151 -108575
19536 -108575 -156480 -62588 -553660 571 -106638 -150219 -423229 109447 134618 145723 -109384
19524 90715 33173 147568 -251257 123457 -199947 64668 512685 -288525 188929 -126523
19513 88927 10596 -252384 66816 18776 24939 191632 -124368 -126688 305636 174534 -43512
19501 189804 -197472 -44699 -319435 -197514 -42889 -301762 -145566 -239162 -94805 -45901
19490 -291470 -404631 -196192 -41812 243051 16490 -124046 -223642 -194066 220814 -105394
19479 -290982 -141576 -180200 -28853 -79900 -231752 7149 -164971 31812 96228 -233084 -1397
19467 106455 -48076 -51869 -227820 -176000 -83702 -204424 36894 -184306 392453 50327 -124287
$$ packed form
19547a51245D0773L41181i4420C19521A30867b81112A5335g6130J246r1267N7576
19536a08575m7905f2588m91072E71a06638m3581k73010A09447K5171J1105a09384
19524I0715C3173J14395b51257A23457a99947F4668M48017b88525A88929a26523
19513H8927A0596b52384F6816A8776O163J66693a24368k320C05636j31102d3512
19501A89804a97472d4699k74736J21921d2889k58873a45566r3596i4805d5901
19490b91470j13161a96192d1812B43051A6490a24046r9596K9576B20814a05394
19479b90982a41576l8624b8853n1047j51852G149a64971C1812O4416b33084a397
19467A06455d8076l793j75951N1820h3702j20722C6894a84306C92453E0327a24287
$$ plain form
19455 26456 54205 -138613 -185391 29502 -311634 86417 -25247 100864 -41844 -98661 122285
19443 43663 -505888 -289520 -110522 53237 -3370 -182369 -71699 -215928 217644 -264716
19432 -70591 -85651 81347 40016 -32152 -105557 37981 -165681 -27201 71043 -69412 -123328
19421 -123328 -381309 -350886 -140398 -136265 10662 -48332 -4744 -38568 192233 79836 101521
19410 101521 -48135 68517 -225132 -215883 122011 25725 -65829 161818 -233750 -23163 -222671
19399 -222671 147030 -299834 -494340 211608 -1826 60540 -82462 30408 57951 108947 37438
19387 150754 -337501 -37821 43809 -351780 237598 -194438 -64046 -302194 -229830 200256
19376 224352 99400 -34872 -176623 -221016 -26887 102141 109399 -92576 -169328 -136824 -297787
$$ packed form
19455B6456K7749a38613m6778B9502c11634H6417b5247A00864d1844n6817A22285
19443D3663e05888K16368a10522E3237c370j78999g1699j44229B17644b64716
19432g0591j5060H1347D0016c2152p3405C7981a65681b7201G1043f9412n3916
19421a23328k57981L0423a40398M133A0662d8332d744l3824A92233G9836K1685
19410A01521d8135F8517b25132R249A22011B5725f5829A61818b33750b3163j99508
19399b22671A47030b99834j94506B11608a826F0540h2462C0408K7543N0996C7438
19387A50754c37501c7821D3809c51780B37598a94438f4046k38148P2364B00256
19376B24352I9400c4872j41751m4393b6887A02141P258i2576p6752L2504j60963
$$ plain form
19365 -297787 -6118 -90989 156561 -26117 -186491 -21429 -483249 197118 -294943 52160 -54034
19353 -207681 129471 -36227 -231540 170270 -182457 -288551 -41302 191020 178373 -47223
19342 -110663 -379272 145718 -173062 -287373 349993 17754 10099 -85959 -64514 -142354 -117422
19331 -117422 264406 -64317 15488 7611 -175683 135196 -87104 160468 103092 -174668 -264521
19320 -264521 297645 -2881 -200378 23440 91829 -331930 81715 -71530 -176613 -64988 -34480
19309 -34480 -462675 105465 5253 75721 56105 -7791 48378 -77279 -122595 39968 465399
19298 465399 27852 -238092 -241603 -8766 -155999 29406 -231182 104840 23167 -197278 201444
19286 -10770 -137324 194208 -203798 216684 10429 131067 214947 -84099 -305507 196364
$$ packed form
19365b97787f118q4871A56561b6117j60374b1429m61820A97118b94943E2160e4034
19353b07681A29471c6227j95313A70270a82457j06094d1302A91020j2647d7223
19342a10663k68609A45718a73062j14311C49993A7754p655h5959K1445p7840K4932
19331a17422B64406f4317A5488G611a75683A35196h7104A60468n7376a74668q9853
19320b64521B97645b881j97497B3440O8389c31930H1715g1530j05083f4988L0508
19309c4480m28195A05465E253P0468j9616g791D8378g7279m5316C9968M25431
19298D65399B7852b38092l511h766j47233B9406b31182A04840B3167a97278B01444
19286a0770j26554A94208b03798B16684A0429J20638Q3880h4099k21408A96364
$$ plain form
19275 -49292 -115265 -21026 119520 -155858 -64901 199693 -195064 -178331 206742 4664 108437
19264 108437 -5342 33214 -150136 2018 -106678 20915 -456006 -117534 -49616 145883 23467
19252 -33912 107701 -101876 -101351 107708 -122385 -121784 -70809 -87107 -19646 -201827 -181183
19241 -181183 24246 156842 -173614 -175506 234288 -338243 63240 -198261 176206 34431
19230 90670 129080 -482323 -318909 173260 -168837 -76232 -85006 -44325 -357650 -175332 -180001
19219 -180001 -36659 225125 -134283 39898 3848 -110865 -160699 -98882 -265902 -277971 -23038
19207 37923 -233862 -85431 7694 178294 -25280 -405654 -436497 -384077 -253842 -40586 29919
19195 -377519 15868 -229942 177934 -290882 -351267 219302 -90775 -294339 -409832 -156965
$$ packed form
19275d9292o5973b1026A19520a55858f4901A99693a95064J6733B06742D664J03773
19264A08437e342C3214a50136B018a06678B0915d56006a17534d9616A45883B3467
19252c3912A07701a01876N25A07708a22385O01N0975j6298a9646j82181K0644
19241a81183B4246J32596a73614j892B34288c38243F3240a98261A76206C4431
19230I0670L8410d82323J63414A73260a68837g6232q774M0681l13325a75332m669
19219a80001c6659B25125a34283C9898C848a10865m9834O1817j67020j2069b3038
19207C7923b33862h5431G694J70600b5280l80374l0843N2420J30235d0586B9919
19195c77519A5868b29942A77934b90882o0385B19302i0775k03564j15493a56965
$$ plain form
19184 -77011 11854 -217716 -130513 154801 57421 -314698 -4208 -148540 78341 -134703 -89239
19173 -89239 263734 64301 97729 -196294 -190150 199706 74204 -18422 3762 -16884 -262271
19162 -262271 -9744 291072 -213562 -272051 -173541 -110961 -148560 70112 -126547 89392 24219
19150 42426 -118114 -117552 266519 -159068 52800 -129137 -76515 229944 177718 -390782 -71547
19138 -227975 -26210 -279755 223128 52041 -240438 -292616 -111349 -133233 -101236 -154349 102348
19126 -92152 -55778 90662 143362 -31002 114940 179712 -74952 -76644 -68235 -213950 -98146 50866
19113 31194 334320 22304 -92853 -301936 -310421 -89308 219639 18182 85966 70997 222106
19102 222106 -169886 89507 -177023 -123820 146123 -186590 -229090 225600 -187993 64669
$$ packed form
19184g7011A1854b17716Q7203A54801E7421c14698d208j44332G8341a34703M5464
19173h9239B63734F4301L3428a96294O144A99706G4204a8422C762a6884k45387
19162b62271i744B91072b13562n8489R8510O2580l7599G0112a26547H9392B4219
19150D2426a18114N62B66519a59068E2800a29137N2622B29944n2226c90782g1547
19138b27975b6210k53545B23128E2041b40438n2178a11349k1884L1997n3113A02348
19126i2152L6374I0662N2700c1002A14940O4772g4952j692Q409j45715i8146E0866
19113C1194L03126B2304i2853k09083q485h9308B19639A8182O7784j4969J51109
19102B22106a69886H9507a77023N3203A46123a86590m2500B25600a87993F4669
$$ plain form
19091 -66481 -100142 -146223 98660 -358548 166415 -89251 40823 -44839 -264540 -138764 -475505
19080 -475505 210375 -29103 -196554 -109110 -15809 -46383 209986 -105141 -231399 -53205
19069 -128430 -98199 -19318 -51443 174791 -61691 -80433 -35998 68909 109206 256634 -173846
19057 -31170 375442 -148621 -24502 162331 -126688 212337 -46680 -165273 62652 -140306
19046 245639 -201043 -77604 -359895 -389250 115840 -38324 20826 -73107 439800 -167228
19035 4260 -57833 177492 182694 59792 161341 21454 161887 38346 45196 459483 134160
19023 305215 10338 -75219 -152600 32909 -11445 -8477 111854 -6502 150442 272902 309097
19012 309097 -64419 -52329 229924 131607 -29114 331766 242155 -154455 41123 -62774 -15042
$$ packed form
19091f6481l3661m6081I8660c58548A66415h9251D0823d4839k19701J25776l36741
19080d75505B10375b9103j67451Q7444a5809l0574B09986a05141j26258e3205
19069a28430L0231a9318l2125A74791f1691j8742c5998F8909M0297J47428a73846
19057c1170C75442a48621b4502A62331a26688B12337d6680j18593F2652a40306
19046B45639b01043g7604k82291k9355A15840c8324B0826g3107D39800a67228
19035D260e7833A77492N202E9792J01549B1454J40433C8346O850M14287A34160
19023C05215A0338g5219p7381C2909a1445K968A11854f502A50442J22460L6195
19012C09097f4419J2090B29924r8317b9114C31766q9611a54455D1123f2774a5042
$$ plain form
19000 11352 -88288 -62353 -307489 -350880 333634 -54303 -231025 997 -98864 -67087 35319
18988 -139364 -155745 -418190 -63566 27932 19963 -57175 -80023 -391073 9845 -160708 -113456
18977 -113456 -22183 -72063 31124 -155908 8211 109190 183665 34783 185247 -555682 52162
18965 -161851 -239390 -272438 173140 -56575 -64507 40568 70558 -311081 -73178 -424148 -122553
18953 -290139 -136849 -192860 -130567 69728 -219280 77697 -16146 189981 104365 -228812 131517
18941 50099 -82453 7813 -16033 16646 -68994 99692 -102557 135471 -13364 98732 -157381
18929 -181120 157931 -177950 87259 -42901 303783 230658 -114386 -396117 2479 -323547
18918 -68278 152342 55282 -24880 -168690 -280098 -11417 -16162 -50170 -52945 -170091 -227615
$$ packed form
19000A1352h8288K5935k45136m3391C33634e4303j76722I97i8864L1777C5319
18988a39364j6381k62445f3566B7932p969e7175k2848l11050I845a60708M7252
18977a13456b2183m9880C1124a55908H211J00979P4475C4783J50464e55682E2162
18965a61851p7539l3048A73140e6575p932D0568K9990c11081g3178l50970a22553
18953b90139a36849n6011O2293F9728b19280G7697a6146A89981q5616b28812A31517
18941E0099h2453G813a6033A6646f8994I9692a02557A35471a3364I8732a57381
18929a81120A57931a77950H7259d2901C03783p3125a14386k81731B479c23547
18918f8278A52342E5282b4880j43810j11408a1417m745l4008k775j17146n7524
$$ plain form
18907 -227615 -200982 -28179 321037 -183781 99982 -35672 198406 -234920 -12566 230476
18896 -98299 1223 -78241 -312051 -9301 -138044 140442 -314804 -345807 -60017 12306 -71482
18884 125389 151527 -175097 97010 -120057 417940 86069 -234936 171090 -323245 91871
18873 -20410 -410009 117264 -100225 -26564 159451 -186603 161336 63533 -126457 -238438
18863 -238438 -74107 -207769 87300 -215739 -96194 -14599 -148352 304376 356359 156473
18852 -257665 422170 36173 -133394 -225042 -45812 74611 -359577 -83141 -171000 -65541 -30276
18840 195668 -141292 201130 -322935 122476 -315176 70169 -141553 125337 810 77388
18830 77388 -150780 -19064 61690 -271942 -297774 169484 -219036 -103293 73649 50190 9236
$$ packed form
18907b27615K6633b8179C21037a83781I9982c5672A98406b34920a2566B30476
18896i8299A223g8241k33810i301j28743A40442c14804l1003f0017A2306g1482
18884A25389K6138a75097I7010a20057D17940H6069b34936A71090c23245I1871
18873b0410l89599A17264a00225b6564A59451a86603A61336F3533a26457j11981
18863b38438g4107j33662H7300b15739i6194a4599j33753C04376N1983A56473
18852b57665D22170C6173a33394r1648d5812G4611c59577h3141q7859f5541c0276
18840A95668a41292B01130c22935A22476c15176G0169a41553A25337H10P6578
18830G7388a50780a9064F1690b71942k5832A69484b19036a03293G3649k3459I236
$$ plain form
18818 110206 161720 4626 -272624 -215445 198606 190499 -6870 -318319 8290 172074 153023
18807 153023 71521 -161909 219863 134314 -208347 65021 -170769 -119223 213418 -210782
18796 -44691 133625 -41123 113384 -148767 -116580 -123483 -149696 31402 20026 -85751 -120399
18785 -120399 -389635 -173309 -335230 229451 233771 105179 114692 -205935 -60804 -48365 251731
18773 -12400 1451 -166900 -399006 -169000 -207703 161910 -31350 -31271 -90878 24846 -136434
18761 -69220 -11205 271759 -130266 -218072 -26310 -367532 -178346 -207414 15531 -181404 -241365
18750 -241365 -197193 -351333 72925 -348748 -283347 91152 -145371 -75505 -207506 152662
18739 -47791 -32056 -203121 275872 -330677 -152416 -14808 45636 -21258 -216105 -183223 -322225
$$ packed form
18818A10206N1514D626b72624N7179A98606q107f870l11449H290J63784j9051
18807A53023G1521a61909B19863q5549b08347F5021a70769N1546B13418b10782
18796d4691A33625d1123A13384a48767L2187o903k6213C1402j1376h5751l4648
18785a20399k69236a73309j61921B29451M320A05179R513b05935f0804J2439B51731
18773a2400A451a66900k32106a69000l8703A61910c1350P9n9607B4846a36434
18761f9220a1205B71759a30266q7806b6310l41222a78346k9068A5531a81404n9961
18750b41365M4172j54140G2925c48748O5401I1152a45371O9866j32001A52662
18739d7791J5735j71065B75872c30677a52416a4808D5636b1258j94847L2882j39002
$$ plain form
18728 -322225 -207964 -9681 -132728 -154590 66653 -303372 -198642 314546 -356340 -15083
18717 -178487 -167366 96805 -77616 7854 -68968 4560 17055 36879 -148702 208267 55221
18705 166598 -57318 -26454 -149813 -143488 -262734 90563 -171931 8382 -140569 153414 -57330
18693 -119648 -22744 -127712 2806 -191748 27784 -108504 -270465 -230438 -98969 11518 -101420
18681 -89238 154642 289344 -298533 324641 129861 164746 -7262 -102917 -26620 -332375 368142
18669 -283535 -144791 -108803 -240979 209024 -235828 -136758 -162056 66345 -70880 -75029 -253906
18658 -253906 -202742 -25369 148147 37860 36741 177308 -18207 -98637 -217745 -141751 3705
18646 -33454 -114774 -231545 142318 -12779 10825 1628 -55545 116856 59056 -47140 154614
$$ packed form
18728c22225J14261i681j23047k1862F6653c03372J04730C14546c56340a5083
18717a78487J1121I6805g7616G854f8968D560J2495J9824a48702B08267E5221
18705A66598e7318b6454j23359O325j19246I0563a71931H382a40569A53414e7330
18693a19648b2744j04968B806a91748B7784a08504j61961M0027i8969A1518a01420
18681h9238A54642J34702b98533C24641A29861L4885g262r5655b6620l05755C68142
18669b83535J38744L5988j32176B09024b35828R9070k5298F6345g0880m149j78877
18658b53906N1164b5369A48147C7860j119J40567a8207q0430j19108P5994C705
18646c3454q1320j16771A42318a2779A0825A628e5545A16856n7800d7140A54614
$$ plain form
18634 217015 -152242 -280995 -85175 -38940 27134 -212790 467095 -2171 -120502 -166564 58121
18622 -55091 41369 -121656 115107 139143 -25404 -128122 53601 -17219 -628266 -143662 -43991
18610 -431362 -336976 -75174 145542 -400316 -27828 114548 22897 221050 150616 166246 -222714
18598 85465 53669 -172308 -232066 -77253 -171192 -532896 -69889 278517 18486 -640428 -106902
18586 -31765 -67917 7799 -20078 -82016 25499 -260695 14887 -78207 207435 1464 -179384
18574 14538 -227109 -263680 -257949 36525 -424551 254132 -122847 -48642 -157480 -159121 157236
18562 -114651 -64043 -227681 -111925 42940 129476 -14038 29754 63617 55858 -246399 175671
18550 -10989 -198363 -104168 17354 -67633 12445 25610 100642 -190638 -134951 262588 -189142
$$ packed form
18634B17015a52242j28753h5175c8940B7134b12790D67095b171j18331m6062E8121
18622e5091D1369a21656A15107K4036b5404j02718E3601a7219o11047a43662d3991
18610d31362R4386g5174A45542d00316b7828A14548B2897J98153p0434J5630b22714
18598H5465l1796a72308n9758g7253r3939l61704f9889B78517A8486f40428a06902
18586c1765l6152G799b0078o1938B5499b60695A4887g8207B07435A464a79384
18574A4538b27109l6571N731C6525d24551B54132a22847d8642j08838j641A57236
18562a14651N0608j63638a11925D2940Q6536a4038B9754L3863p759b46399A75671
18550a0989j87374R4195A7354f7633A2445J3165P5032a90638N5687B62588a89142
$$ plain form
18538 123462 -60965 -172281 -14158 325363 -130467 200374 -180645 -34677 -136070 287499
18527 -97618 32035 181324 311896 43518 265346 26039 66801 315365 -130035 -45799 62782
18515 -34597 93222 140094 -170365 281382 44653 -157881 -108293 163693 -229097 32268 -179814
18503 79211 -14328 165999 3577 300539 73393 26522 -126245 -65725 96888 -18368 200893
18491 161502 -1220 -130917 -28920 -243705 -266144 -143615 33330 -62335 150042 172382 14313
18479 216210 -319219 105794 121315 -223300 27951 -135054 48526 -52658 -46963 -102063 141315
18467 42983 -218101 221695 8310 -181082 -104906 -67663 -86298 -153318 26139 -66715 -55012
18456 -55012 -86626 116132 -83592 -41735 -43983 98158 24476 14389 -273958 248194 -62751
$$ packed form
18538A23462f0965j11316a4158C25363a30467B00374a80645c4677j01393B87499
18527i7618C2035J49289J30572D3518K21828B6039M0762K48564a30035d5799F2782
18515c4597I3222M6872a70365B81382D4653a57881M9588A63693b29097C2268a79814
18503G9211a4328A65999C577K96962G3393B6522a26245O0520I6888a8368B00893
18491A61502a220j29697b8920k14785k2439J22529C3330f2335A50042K2340A4313
18479B16210c19219A05794J5521b23300B7951a35054D8526e2658N695n5100A41315
18467D2983b18101B21695H310a81082P6176L7243j8635o7020B6139f6715J1703
18456e5012l1614A16132h3592d1735k248I8158B4476j0087b73958B48194f2751
$$ plain form
18444 131282 -139035 -309178 -226772 -408819 86258 50955 -115718 195126 -665 176627 -2358
18432 -81076 123472 -123817 -127737 141499 -378644 -202162 -388431 -872 -128406 -63521 -165107
18421 -165107 -9355 194121 -103981 -147522 -320423 121487 -88435 -446433 74994 -384291
18410 -121176 -294467 146518 5563 -148160 -90023 -30253 -153586 -268735 52575 23626 253974
18399 253974 -53675 -309275 -153156 85224 100156 -216135 -105139 -148005 -98380 -38837 -130346
18388 -130346 -45115 -479477 223565 -162195 287833 57316 -253262 21400 -30062 -216115
18378 -216115 40374 -38383 -48168 -68839 -236901 -339572 87550 -494252 112924 -327610 158481
18366 11432 -63048 -70209 -75955 21612 80552 63228 116792 -115121 210730 -255865 -248539 -121423
$$ packed form
18444A31282a39035j70143Q2406j82047H6258l5303a15718A95126f65A76627b358
18432h1076A23472a23817l920A41499c78644J76482j86269h72j27534f3521j01586
18421a65107i355A94121a03981m3541j72901A21487h8435l57998G4994c84291
18410a21176j73291A46518E563a48160N8137c0253j23333j15149E2575B3626K30348
18399B53974e3675k55600a53156H5224J4932b16135a05139m2866M9625c8837r1509
18388a30346d5115m34362B23565a62195B87833E7316b53262B1400c0062j86053
18378b16115D0374c8383r785k0671j68062j02671H7550d94252A12924c27610A58481
18366A1432f3048p161n746B1612N8940j7324N3564a15121B10730b55865P326a21423
$$ plain form
18353 -29577 -132768 18639 -125601 -188917 -37040 -80440 335022 162935 -291811 -86485 -10557
18341 -165989 -114807 52070 -239901 -13984 114636 -8309 -47826 -220845 -375887 -298938 -154907
18330 -154907 -55973 272593 -40761 185012 -148334 -108714 244820 161169 -131751 -189776
18320 -189776 -263301 -38514 127440 -57106 320042 -238946 -9110 -248625 60128 -177464 205863
18308 -194854 -89058 -164026 -31874 96129 -57225 187249 61968 -161059 -243050 -240308 -269264
18297 -269264 -20481 -244173 -59669 -139269 52722 30824 -72234 -63625 31187 17858 -78846
18285 93905 150150 309362 -138362 -283220 -63802 -131777 -128210 -291219 -127789 133418 50825
18273 -14765 183395 289977 53558 -87146 11760 -183521 23307 11521 109421 -218520 11944
$$ packed form
18353b9577j03191A8639a25601o3316c7040m3400C35022A62935b91811h6485a0557
18341a65989N1182E2070b39901a3984A14636h309l9517j73019j55042P6949J44031
18330a54907e5973B72593d0761A85012a48334L9620B44820q3651a31751n8025
18320a89776p3525c8514A27440e7106C20042b38946i110k39515F0128a77464B05863
18308a94854h9058p4968c1874I6129e7225A87249F1968a61059q1991K742k8956
18297b69264b0481k23692e9669p9600E2722k1898g2234Q609C1187j3329g8846
18285I3905N6245J59212a38362j44858f3802o7975L567j63009a27789A33418E0825
18273a4765A83395J06582E3558h7146A1760a83521B3307A1521R7900b18520A1944
$$ plain form
18261 -509329 226152 -13365 -124044 -152892 61953 -2861 51919 -141154 -230196 -61050 -242453
18250 -242453 339060 -51456 116701 -261712 -192494 191197 -209229 212632 -49525 -66631
18240 -66631 72114 -55944 -127883 249372 -9255 -559520 -8086 -196932 -78390 -8977 327800
18228 -10668 -105995 -40677 228709 -24262 432902 159106 -124388 -163450 163843 -270513
18217 -65182 -215791 -147304 -127154 100738 20648 80636 -172640 124672 -291323 58535 -75551
18205 -231717 11698 -103578 -44588 -13252 118902 -25298 56836 -122000 46249 -52348 158522
18193 -147753 -126490 -99821 112873 -56100 97184 -448500 123051 -42263 123025 -138887
18182 102322 8406 316977 -271062 213174 -231508 31658 101356 148830 223109 -188818 -184696
$$ packed form
18261e09329B26152a3365j10679k8848F1953b861E1919a41154q9042f1050j81403
18250b42453C39060e1456A16701b61712O9218A91197b09229B12632d9525j7106
18240f6631G2114e5944p1939B49372i255n50265h086j88846g8390h977C27800
18228a0668r5327d0677B28709b4262D32902A59106a24388l9062A63843b70513
18217f5182j50609O8487K0150A00738B0648N9988a72640A24672b91323E8535g5551
18205b31717A1698a03578d4588a3252A18902b5298E6836a22000D6249e2348A58522
18193a47753K1263K6669A12873e6100I7184d48500A23051d2263A23025a38887
18182A02322H406L08571b71062B13174b31508C1658O9698M7474P4279a88818M122
$$ plain form
18171 -184696 -287848 -56816 229957 19100 78137 -7390 -51979 269486 139086 51440 292049
18160 292049 -53451 -48537 -155071 -52067 44217 -22983 -14759 -41601 63996 -108731 22418
18148 115691 5996 128210 2530 167631 -93332 -38238 -58356 -193849 -177770 -14164 -326721
18137 -326721 -79737 -253625 226570 98533 56403 23136 5685 -312839 133775 -43599 129535
18125 -90722 -92594 11631 64916 94611 256389 43943 -128895 -238969 -337830 -183940 39095
18113 -30208 -8111 43790 63317 -15824 -272857 -11104 -210332 -219780 4110 -140745 -189951 -77360
18100 -280461 450735 56059 -116146 -350368 265939 169500 364449 93688 -285863 -209242
18090 -209242 -252736 -82804 175162 22923 -218067 -399261 24905 -29249 -136138 21648 -254426
$$ packed form
18171a84696j03152e6816B29957A9100N9037g390m4589B69486j30400E1440K40609
18160B92049e3451M914j06534e2067D4217b2983Q224k6842F3996a08731B2418
18148A15691E996J22214B530J65101i3332c8238k0118j35493J6079a4164l12557
18137c26721g9737j73888B26570I8533m2130B3136E685c12839A33775d3599A29535
18125i0722j872A1631N3285K9695J61778D3943a28895j10074r8861J53890C9095
18113c0208h111D3790J9527a5824k57033a1104j99228r448D110a40745m9206g7360
18100b80461D50735E6059a16146k34222B65939r6439J94949I3688b85863P6621
18090b09242m3494h2804A75162B2923b18067j81194B4905b9249j06889B1648b54426
$$ plain form
18078 285342 -54725 -135107 -111012 -224937 -164918 -14795 -156929 154902 80944 -82287 -203370
18067 -203370 -70456 -223892 -511324 136389 91763 -172018 -84493 -110485 121829 103959
18057 103959 -69530 144390 349662 119566 -340259 164061 278945 -119286 -175223 78938
18046 -206718 -289230 47877 -23499 -1280 -92865 46833 -215268 107842 13721 198710 -78242
18034 -351255 -333689 -216666 105967 85309 153522 107157 -161934 -247208 -145622 348091
18023 -21258 -2200 -113948 31585 -222678 -41081 80909 -274091 114650 -157205 197902 -262757
18011 -448951 312287 155441 -18423 -13934 165534 -86296 -76349 -179169 -56222 148972 -135075
17999 53822 7608 348830 42884 141914 -8643 -102712 -40775 -116921 -427848 481411 -271601
$$ packed form
18078B85342e4725q0382K4095j13925O0019a4795j42134A54902p3958h2287j21083
18067b03370g0456j53436k87432A36389m4626a72018h4493k5992A21829j7870
18057A03959f9530A44390K05272A19566c40259A64061J14884a19286n5937G8938
18046b06718q2512D7877b3499a280r1585D6833b15268A07842A3721J84989g8242
18034c51255J7566J17023A05967k0658O8213m6365a61934q5274J01586C48091
18023b1258b200j11748C1585b22678d1081H0909b74091A14650a57205A97902b62757
18011d48951C12287A55441a8423M489A65534h6296R947j02820e6222A48972a35075
17999E3822G608L41222D2884R9030h643r4069d0775p6146l10927D81411b71601
$$ plain form
17987 -96608 86278 -301835 -10031 70254 235691 37059 16434 -118038 41654 160095 -326120
17975 55089 -35069 260150 -200332 -242595 67957 127170 264813 -131706 -293113 127454
17964 -56950 -114603 387004 127402 217816 -4720 -76502 -129015 -74793 -294231 -80597 -25608
17952 -210731 53364 509347 118249 -140231 -155160 127012 -112681 -449893 79096 -38173
17941 -148440 77589 126993 40630 25639 -293408 241450 -150504 222736 9061 186909 21182
17929 11145 5642 -43772 68394 -152676 35351 210112 379239 138142 -225602 -54511 -22829
17917 -88981 160893 131895 6301 117087 -97151 123911 86458 -235559 131562 81147 -86609
17905 -104705 6473 -126751 -209188 -146082 -226250 230185 -189064 -162011 363133 -206424 -97460
$$ packed form
17987i6608H6278c01835a0031G0254J65437C7059A6434a18038D1654J18441c26120
17975E5089c5069B60150b00332m2263F7957N9213J37643a31706j61407A27454
17964e6950n7653C87004A27402R0414d720p1782n2513N4222k19438h0597b5608
17952b10731E3364M55983A18249a40231j4929A27012a12681l37212G9096c8173
17941a48440G7589M9404D0630j4991b93408B41450a50504B22736I061J77848B1182
17929A1145n503d3772F8394a52676C5351J74761J69127A38142b25602e4511b2829
17917h8981A60893k8998F301J10786i7151A23911l7453b35559A31562n0415h6609
17905a04705F473a26751q2437O3106q0168B30185a89064K7053C63133b06424i7460
$$ plain form
17893 146386 -111274 201542 93808 82823 21766 77111 -188804 -60928 -23255 187256 -327437
17881 -141185 189599 -294876 -33306 -306292 99925 -118643 -73974 107527 -417923 -114763
17870 -222927 -193436 -125223 31116 -329617 -868 -181205 -84112 -94436 -33345 -74395 -183292
17859 -183292 -163110 -272032 -254786 55128 -74819 63317 -78609 -66790 -60575 122588 -11596
17847 249627 80266 157103 -120450 -155311 -140327 38888 -94849 42906 11950 -79851 46884
17835 49076 -58263 -216069 148022 323888 243345 -12117 -188339 -92558 78620 -53523 115715
17823 -33897 50018 -57527 -211282 91386 77126 -69521 -358524 8251 170663 72357 -116751
17811 28474 -177597 19726 18742 14005 -121763 155537 147619 37938 166251 -229254 191798
$$ packed form
17893A46386a11274B01542I3808j0985B1766N5345a88804f0928b3255A87256c27437
17881a41185A89599b94876c3306k72986I9925a18643M4669A07527d17923a14763
17870b22927K9491O8213C1116c29617h68j80337h4112j0324c3345m1050j08897
17859a83292K0182j08922J7246E5128g4819F3317g8609J1819O215A22588a1596
17847B49627H0266P6837a20450l4861J4984C8888i4849D2906A1950g9851D6884
17835D9076e8263j57806A48022J75866q0543a2117j76222i2558G8620e3523A15715
17823c3897E0018e7527j53755I1386j4260f9521k89003H251J62412G2357a16751
17811B8474a77597A9726r84m737a21763A55537p918C7938J28313b29254A91798
$$ plain form
17799 4163 -214061 -132655 -422209 -256613 140709 -81190 -128168 12532 -277696 -67826 176842
17787 102327 197498 -139248 74881 -37899 -81266 -56286 104178 32733 -71544 136688 69776
17776 69776 57793 66979 -184389 -10644 162550 -309218 -297329 131116 -69154 258744 -158709
17764 152363 -41555 109419 145908 374591 10458 -53593 -117131 107040 -42543 98513 -196300
17752 -97806 -39731 -74122 14882 -158180 468591 237220 -34542 -127906 1810 120142 -176690
17740 7257 94459 455509 -16825 -222264 357594 142839 184446 39587 213340 16981 -171537
17728 220673 330738 -146602 53826 117274 92629 -179098 -212060 120957 -253383 9654 78936
17717 78936 21664 316876 -112848 97782 59487 -173835 114119 51311 10001 -140568 215718
$$ packed form
17799D163b14061Q1406k89554J65596A40709h1190m6978A2532b77696f7826A76842
17787A02327R5171a39248G4881c7899m3367K4980A04178C2733g1544A36688o6912
17776F9776j1983R186a84389a0644A62550c09218J1889A31116f9154B58744a58709
17764A52363d1555A09419L6489K28683A0458e3593o3538A07040d2543I8513a96300
17752i7806c9731l4391A4882a58180D68591k31371c4542r3364A810J18332a76690
17740G257Q7202L61050a6825k05439C57594A42839M1607C9587J73753A6981a71537
17728B20673J10065a46602E3826O3448k4645a79098l2962A20957b53383I654O9282
17717G8936B1664K95212a12848I7782l8295a73835A14119E1311A0001a40568B15718
$$ plain form
17705 -7220 -98706 317205 -239000 47707 295631 9034 -43195 -14758 -11018 248449 -24402
17693 -170594 -180324 -50820 100881 171723 -358027 -163870 42832 458061 188361 -57396 -281702
17682 -281702 -226719 -303854 -218328 262272 353472 -82938 254536 140632 -412512 182733
17671 127279 127489 29307 -303503 141387 131577 214753 36018 25992 88616 -104165 41190
17659 125613 -154944 -255277 300752 -161911 -53344 23755 43857 196462 -12924 -58648
17649 -58648 200801 -108847 127868 -80978 -294845 -151274 -62358 -64119 127817 -117528
17638 20961 90642 169442 135454 146173 -373762 -67497 172487 207676 -144251 102678 -67694
17626 -15000 7867 104115 226139 174954 -198065 20234 -99365 -73871 -112913 -237503 108105
$$ packed form
17705g220r1486C17205b39000D7707K47924I034d3195a4758L740B48449b4402
17693a70594r730e0820A00881P0842c58027a63870D2832M15229A88361e7396k24306
17682b81702N4983p7135Q5526B62272R1200h2938B54536j13904d12512A82733
17671A27279K10B9307c03503A41387r810Q3176C6018j0026O2624a04165D1190
17659A25613a54944j00333C00752a61911e3344B3755K0102J52605a2924m5724
17649e8648B00801a08847A27868h0978k13867J43571f2358j761A27817a17528
17638B0961O9681P8800l3988J0719c73762f7497A72487L5189a44251A02678f7694
17626a5000G867R6248J22024n1185a98065B0234i9365K5494l9042j24590A08105
$$ plain form
17614 164746 -220517 311413 -48840 -110747 267753 402141 -261858 201925 222030 -157694
17603 -93095 62685 -135773 15543 -73421 -96340 18996 -55902 59961 82063 -58662 -203088
17592 -203088 225443 -255209 188081 70486 368853 84646 176427 -26405 121175 -15078
17581 42260 64487 -4014 -48055 229592 -169781 -41618 160891 -11408 240968 -89577 36241
17569 -256738 -153111 132681 -160136 -71538 -285212 123976 -394406 -101178 -45614 -120525
17559 -120525 180016 101904 25238 -117541 158789 27998 107376 172890 26780 194046 -154317
17547 434290 -169409 202914 38141 52197 11946 370508 -151621 242940 -361782 169621
17536 -210361 337226 -85494 172890 -6636 -68317 -25892 41747 474773 361544 205669 91399
$$ packed form
17614A64746b20517C11413d8840o1907B67753J34388b61858B01925K0105a57694
17603i3095F2685a35773A5543g3421k2919A8996e5902E9961K2102e8662j44426
17592b03088B25443b55209A88081G0486K98367H4646R1781b6405A21175a5078
17581D2260K2227d014m4041B29592a69781d1618A60891a1408B40968h9577C6241
17569b56738J03627A32681a60136g1538k13674A23976c94406a01178d5614p4911
17559a20525A80016p8112B5238a17541A58789B7998P9378O5514B6780J67266a54317
17547D34290a69409B02914C8141J4056A1946L58562a51621B42940c61782A69621
17536b10361C37226h5494A72890f636o1681b5892D1747M33026j13229j55875I1399
$$ plain form
17524 -6133 79420 172333 -7188 -7745 -23294 113070 173639 10274 -163663 309327 -13840 -241233
17512 -241233 -59055 44814 -149997 125975 114197 224123 194798 157520 154410 -76821 73628
17500 124328 -37397 133615 -11319 28356 211100 432632 224287 96524 57425 -239843
17489 150017 259191 -4180 525047 96192 -112924 106040 -8428 -70809 -87277 -52994 110397
17477 96444 153623 96553 255239 113859 100096 -198972 462624 -96547 -13843 -50798 52180
17465 184977 -165511 80623 -293010 259263 -52916 137710 6421 223422 287195 37589 383991
17454 383991 227240 84000 46922 197030 443663 336630 499338 51743 545435 -75257
17443 309446 54915 190998 129125 -216213 129480 293921 126615 383077 235151 329190
$$ packed form
17524f133G9420R2913g188n57j5549A13070O0569A0274a63663C09327a3840k27393
17512b41233e9055D4814a49997A25975j1778J09926k9325l7278l110g6821G3628
17500A24328c7397A33615a1319B8356J82744K21532k08345I6524l9099b39843
17489A50017J09174d180E25047I6192a12924A06040h428o2381j6468L4283A10397
17477I6444N7179n7070J58686A13859j3763a98972D62624i6547a3843l6955E2180
17465A84977a65511H0623b93010B59263e2916A37710F421K17001O3773C7589L46402
17454C83991j56751H4000l7078J50108K46633j07033J62708E1743M93692g5257
17443C09446E4915J36083o1873b16213A29480J64441A26615K56462j47926R4039
$$ plain form
17433 329190 249346 367645 187131 -15828 285840 70818 -169728 543335 233121 -5407
17422 50794 166491 479627 217686 183076 442533 176406 171882 426914 45148 265463
17412 265463 447739 278650 -12854 230350 -8113 44761 25747 391544 234606 -26414 77955
17400 183489 76010 201132 -20352 232480 80246 289368 -57675 289584 179014 401445
17390 401445 -147675 319298 179414 10836 207848 315621 362955 249463 93625 -68728
17379 -112519 233223 59732 84464 89891 146893 219671 -149013 96024 -247819 253170 -271209
17367 -25423 194579 328706 497166 251377 -152233 301840 338124 6643 44209 -77599 329835
17355 152617 408937 235898 209922 -42296 124569 39541 332202 -26456 259188 30556
$$ packed form
17433C29190p9844J18299j80514a5828B85840G0818a69728E43335B33121e407
17422E0794J15697L13136B17686l4610K59457A76406m524K55032D5148K20315
17412B65463J82276j69089a2854B30350h113D4761j9014L65797j56938b6414G7955
17400A83489G6010J25122b0352B32480H0246K09122e7675B89584j10570K22431
17390D01445a47675C19298j39884A0836J97012J07773M7334j13492I3625f8728
17379a12519B33223E9732K4732N427N7002P2778a49013I6024b47819B53170b71209
17367b5423A94579J34127J68460k45789a52233C01840L6284F643L7566g7599C29835
17355A52617K56320j73039k5976d2296A24569C9541K92661b6456B59188C0556
$$ plain form
17344 386128 295673 258395 125520 292113 49016 362268 411893 509760 393709 322174 147793
17332 -14687 406812 431639 -15303 92188 309596 33931 290093 -13195 130350 124385 297679
17321 297679 205500 245168 -160809 302168 270168 228390 -126315 55102 -145972 -145328 199970
17309 -200442 -30224 174450 -12223 62623 355955 270033 37750 107048 365783 84926 -182872
17297 -119255 -87590 106596 162393 2647 67679 349403 109570 199598 129431 162143 -121512
17285 -26473 258190 104673 49380 360189 -30787 103415 126464 415952 370504 36864 198912
17274 198912 -520 134628 9357 261987 204488 477766 346604 -93058 78742 56603 332071
17263 332071 -48579 -264142 -19807 24457 -36072 105080 320443 170958 544471 71927
$$ packed form
17344C86128r0455l7278A25520J66593D9016L13252M9625R7867j16051p1535A47793
17332a4687D06812K4827a5303I2188K17408C3931K56162a3195A30350n965J73294
17321B97679r2179L9668a60809C02168l2000m1778a26315E5102a45972O44A99970
17309b00442c0224A74450a2223F2623K93332q5922C7750O9298K58735H4926a82872
17297a19255L1665A06596N5797B647O5032K81724A09570R0028p0167L2712a21512
17285b6473B58190A04673D9380L10809c0787A03415K3049K89488m5448C6864J62048
17274A98912e20A34628I357K52630n7499K73278j31162i3058G8742k2139K75468
17263C32071d8579k15563a9807B4457c6072A05080K15363j49485L73513G1927
$$ plain form
17252 14349 444361 353763 6907 298167 408202 266510 280932 243002 373121 154253 -43456
17240 77566 146286 -117959 112365 109494 89620 208690 10238 55754 146289 321347 304855
17229 304855 213923 290236 24179 306537 -139051 240398 274830 -48410 157393 51793 165956
17218 165956 281034 -22089 -12339 343565 293111 286415 -13519 163109 227431 283246 182072
17207 182072 -37428 289441 -9527 380678 87591 140843 413636 107231 229086 147922 233173
17196 233173 188464 305120 233641 84804 112305 65902 144816 361756 -107502 161364 273178
17185 273178 126841 368938 453765 68531 150135 235061 192410 569092 444544 198608
17174 250052 270230 273585 380521 373288 124723 239252 294994 -2827 366456 185394 477430
$$ packed form
17252A4349M30012r0598F907K91260J10035j41692J4422l7930J30119A54253d3456
17240G7566O8720a17959A12365k871j9874J19070A0238M5516R0535J75058j6492
17229C04855r0932P6313B4179K82358a39051B40398L4432d8410A57393E1793J14163
17218A65956J15078b2089R750C43565n0454o696a3519A63109O4322N5815j01174
17207A82072c7428B89441i527C80678H7591N3252K72793A07231J21855q1164Q5251
17196B33173m4709J16656p1479H4804K7501m6403P8914K16940a07502A61364J11814
17185B73178A26841K42097Q4827F8531Q1604Q4926m2651L76682j24548A98608
17174B50052K0178L355J06936p233A24723J14529N5742b827C66456j81062K92036
$$ plain form
17163 477430 119338 298144 162372 86011 -53458 209024 178139 429037 471222 179309
17152 298211 24239 -829 254100 83448 340960 54208 440534 448086 412215 253111 -44824
17140 267488 623952 61547 314344 192930 34673 507735 413919 265002 311777 247749
17130 247749 510304 193942 309709 231350 377345 381718 387415 362324 516103 736735 449217
17119 449217 554897 609403 220449 485588 299647 129195 528706 241916 622552 -52627
17108 293204 491641 725951 410117 42060 257280 596474 249241 261384 268327 25513
17097 503383 458342 531854 470133 283693 -141646 155328 246833 362655 846247 444973
17087 444973 410256 504195 479881 139776 437383 361714 429377 345548 400194 424266 592215
$$ packed form
17163D77430A19338J78806j35772p6361e3458B09024l0885K50898M2185A79309
17152B98211B4239h29B54100H3448K57512E4208L86326P552l5871j59104d4824
17140B67488L56464F1547K52797j21414C4673M73062r3816j48917M6775o4028
17130B47749K62555A93942J15767p8359J45995M373N697k5091J53779K20632k87518
17119D49217J05680N4506B20449K65139j85941A29195L99511B41916L80636e2627
17108B93204J98437K34310l15834D2060K15220L39194B49241J2143O943B5513
17097E03383m5041P3512o1721j86440a41646A55328R1505J15822M83592m01274
17087D44973l4717R3939k4314A39776K97607p5669O7663q3829N4646K4072J67949
$$ plain form
17076 592215 324226 427656 277988 710928 303656 515284 507533 439868 551251 531380
17066 531380 356513 338191 550064 611002 381275 682526 478833 495640 383470 192188
17056 192188 594893 512202 611520 739200 679358 471135 511013 442906 547238 725083
17046 725083 371540 390986 475205 322695 554138 857532 654974 585410 444453 588309
17036 588309 583284 537235 646080 401233 540028 460310 728512 544636 398289 572162
17026 572162 481716 486120 639903 681412 835858 550608 771829 387294 528650 771786
17016 771786 502649 766038 620045 672623 736805 387488 827321 861984 748006 505281
17006 505281 722980 557182 779302 557468 537905 899987 653901 759011 701794 810551
$$ packed form
17076E92215k67989J03430j49668M32940C03656K11628p751o7665J11383j9871
17066E31380j74867j8322K11873O0938k29727L01251k03693J6807j12170j91282
17056A92188M02705q2691R9318J27680n9842k08223L9878o8107J04332J77845
17046G25083l53543J9446Q4219j52510K31443L03394k02558o9564j40957J43856
17036E88309n025m6049J08845k44847J38795p9718K68202j83876j46347J73873
17026E72162r0446M404J53783M1509J54446k85250K21221l84535J41356K43136
17016G71786k69137K63389j45993N2578O4182l49317M39833L4663j13978k42725
17006E05281K17699j65798K22120k21834j9563L62082k46086J05110n7217J08757
$$ plain form
16996 810551 595598 1021414 955722 687911 770526 734303 931240 794610 782503 958791
16986 958791 722535 631197 1091367 961521 751498 798295 544429 713922 982022 1218070
16976 1218070 842644 1186269 962652 778221 816198 1145030 1251872 1105879 1100272 849851
16966 849851 1210324 970898 1083192 498026 863331 1158491 824901 913358 1163877 784166
16956 784166 1027991 1246739 1103162 1276763 1126002 974347 1241328 971284 990889 1287636
16946 1287636 1112330 1148233 1257714 1374088 1175847 1298508 909669 1243871 1030990 1433435
16936 1433435 1277620 1279596 1097876 1539761 1348477 1338328 1393880 1106632 1424187 1358136
16926 1358136 1321128 1773535 1482375 1464052 1575391 1412705 1612856 1478049 1313113 1495167
$$ packed form
16996H10551k14953M25816o5692k67811Q2615l6223J96937j36630j2107J76288
16986I58791k36256r1338M60170j29846k10023M6797k53866J69493K68100K36048
16976A218070l75426L43625k23617j84431L7977L28832J06842j45993n607k50421
16966H49851L60473k39426J12294D98026L65305K95160l33590Q8457K50519l79711
16956G84166K43825K18748j43577J73601j50761j51655K66981k70044J9605K96747
16946A287636j75306L5903J09481J16374j98241J22661l88839L34202k12881M02445
16936A433435j55815J976j81720M41885j91284j0149N5552k87248L17555o6051
16926A358136l7008M52407k91160j8323J11339j62686K00151j34807j64936J82054
$$ plain form
16916 1495167 1242737 1643552 1839312 1490086 1672873 1554072 1811477 1575842 1792823
16907 1792823 1729237 1521311 1532269 1801591 1774275 1918899 1881619 1834702 1772150 1907626
16897 1907626 2040326 1862062 1938729 1938183 1869648 2039394 1934992 2555316 2185244 2223102
16887 2223102 2175890 2118011 2103459 2263080 2581519 2265155 2037532 2394458 2193174 2313848
16877 2313848 2278380 2434709 2026019 2445617 2395119 2869116 2383533 2530195 2598306 2858221
16867 2858221 2973478 2816990 3005742 2656585 2855668 2680362 3195316 2766254 2966232
16858 2966232 2830683 3215023 3232796 3254424 3297194 2933651 3143355 3204161 3425699 3622605
16848 3622605 3587363 3450619 3713361 3703073 3593741 4063817 3926798 3972815 3961457 4420338
$$ packed form
16916A495167k52430M00815J95760l49226J82787j18801K57405k35635K16981
16907A792823o3586k07926J0958K69322k7316J44624l7280m6917o2552J35476
16897A907626J32700j78264P6667n46o8535J69746j04402O20324l70072L7858
16887B223102m7212n7879j4552J59621L18439l16364k27623L56926k01284J20674
16877B313848l5468J56329m08690M19598n0498M73997m85583J46662O8111K59915
16867B858221J15257j56488J88752l49157J99083j75306N14954m29062J99978
16858B966232j35549L84340J7773K1628M2770l63543K09704O0806K21538J96906
16848C622605l5242j36744K62742j0288j09332M70076j37019M6017j1358M58881
$$ plain form
16838 4420338 3992775 4036486 4363785 4420250 4332843 4823996 4699522 4909276 4731398 4783761
16828 4783761 4747172 5028400 5248373 5044540 5410093 5887601 5180749 5548381 5781811 5575736
16818 5575736 5954461 6088071 6105860 6195443 6350486 6583651 6927660 6749664 7303394 6929623
16808 6929623 7408931 7428517 7547173 7838756 7919104 8389419 8592177 8510457 8912570 9108626
16798 9108626 9147988 9495659 9662325 10219522 10246177 10622602 11127333 10848645 11121458 11675140
16788 11675140 12004544 12175957 12752648 13027241 13239811 13622241 14376343 14630956 15133952
16779 15133952 15508632 16656919 16572145 17312934 17867055 18378544 18969684 19554829 20280922
16770 20280922 20886472 21720766 22822315 23421748 24379530 25456243 26166129 27250976 28337132
$$ packed form
16838D420338m27563M3711L27299N6465q7407M91153j24474K09754j77878N2363
16828D783761l6589K81228K19973k03833L65553M77508p06852L67632K33430k06075
16818E575736L78725J33610J7789Q9583J55043K33165L44009j77996N53730l73771
16808F929623M79308J9586J18656K91583Q0348M70315K02758q1720M02113J96056
16798I108626L9362L47671J66666N57197K6655L76425N04731k78688K72813N53682
16788A1675140L29404J71413N76691K74593K12570L82430P54102K54613N02996
16779A5133952L74680J148287q4774P40789N54121N11489N91140N85145P26093
16770B0280922O05550Q34294J101549N99433R57782J076713P09886J084847J086156
$$ plain form
16761 28337132 29402760 30688640 32044609 33557755 34723666 36539445 38004066 39998659
16753 39998659 41669551 43673572 45934065 48224685 50952404 53344408 56034955 58732615
16745 58732615 61752120 64794313 67939919 72012192 75824390 80192736 84511866 88309391
16737 88309391 93277654 98263613 103342900 108863815 114482966 119493053 125611102 131142104
16729 131142104 136660874 142414116 147839877 153161470 157610815 161814585 166009622 168745831
16721 168745831 171369977 172452086 173295616 172801555 171464755 169193995 166243134 162538842
16713 162538842 157835663 153267244 148060081 142207807 136306519 130713471 125300051 119576070
16705 119576070 113784212 108454105 103192600 97963770 93300982 88790772 84348727 79979878
$$ packed form
16761B8337132J065628J285880J355969J513146J165911J815779J464621J994593
16753C9998659J670892K004021K260493K290620K727719K392004K690547K697660
16745E8732615L019505L042193L145606M072273L812198M368346M319130L797525
16737H8309391M968263M985959N079287N520915N619151N010087O118049N531002
16729A31142104N518770N753242N425761N321593M449345M203770M195037K736209
16721A68745831K624146J082109Q43530m94061j336800k270760k950861l704292
16713A62538842m703179m568419n207163n852274n901288n593048n413420n723981
16705A19576070n791858n330107n261505n228830m662788m510210m442045m368849
$$ plain form
16697 79979878 76409597 72615552 68822633 65629767 62654500 59386995 56828487 54193567
16689 54193567 51704658 49159223 46999516 45198738 42845140 41260810 39683478 37848446
16681 37848446 35976565 34461495 33164792 31814834 30849011 29240688 28398353 27271789
16673 27271789 25897535 25171114 24021878 23300879 22398239 21336379 20965329 20446138 19382573
16664 19382573 18588471 18206900 17429949 17284701 16464312 15753415 15338594 14806251 14482829
16655 14482829 14264678 13696899 13582231 12997932 12554195 12057626 11776243 11428787 11141747
16646 11141747 10817876 10331664 10084300 10066891 9713064 9530988 9050806 9207394 8400805
16637 8400805 8939488 8406102 8252992 7956217 7423189 7310734 7294910 7314691 7182945 6843610
$$ packed form
16697G9979878l570281l794045l792919l192866k975267l267505k558508k634920
16689E4193567k488909k545435k159707j800778k353598j584330j577332j835032
16681C7848446j871881j515070j296703j349958r65823j608323q42335j126564
16673B7271789j374254p26421j149236p20999r02640j061860l71050n19191j063565
16664A9382573p94102l81571p76951j45248q20389p10897m14821n32343l23422
16655A4482829k18151n67779j14668n84299m43737m96569k81383l47456k87040
16646A1141747l23871m86212k47364j7409l53827j82076m80182J56588q06589
16637H400805N38683n33386j53110k96775n33028j12455j5824J9781j31746l39335
$$ plain form
16627 6843610 6883015 6424617 6672875 6122914 6120080 5687800 5843218 5657586 5691634 5283003
16617 5283003 5121754 5212317 5102790 5028145 5033787 5043747 4719200 4718765 4610052 4783932 4684547
16606 4684547 4111187 4381851 4129946 3871137 4145970 4035963 3865113 4052210 4023406 3716925
16596 3716925 3588104 3565225 3547103 3398433 3411108 3289300 3493214 2979935 3160706 3274049
16586 3274049 3164558 3079029 2739872 3027761 2803712 2943948 2743612 2824805 2542262 2687762
16576 2687762 2739017 2724792 2731702 2455450 2723958 2490806 2247980 2647588 2446262 2157260
16566 2157260 2420689 2313096 2157406 2392979 2184098 2066034 2197749 2192336 2220195 2120803
16556 2120803 1970385 2004692 2039987 1792652 2054374 2040919 1764598 1856622 1924821 1547075
$$ packed form
16627F843610L9405m58398K48258n49961k834m32280J55418j85632L4048m08631
16617E283003j61249R0563j09527p4645N642R960l24547m35j08713J73880r9385
16606D684547n73360K70664k51905k58809K74833j10007j70850J87097k8804l06481
16596C716925j28821k2879j8122j48670J2675j21808K03914n13279J80771J13343
16586C274049j09491q5529l39157K87889k24049J40236k00336Q1193k82543J45500
16576B687762N1255j4225O910k76252K68508k33152k42826L99608k01326k89002
16566B157260K63429j07593j55690K35573k08881j18064J31715n413K7859r9392
16556B120803j50418L4307L5295k47335K61722j3455k76321R2024O8199l77746
$$ plain form
16546 1547075 1762116 1762977 1826511 1566870 1804595 1954271 1704757 1850715 1840106 1917179
16536 1917179 1705984 1515131 1519628 1457511 1392723 1407964 1652662 1669853 1418967 1344295 1254908
16525 1254908 1391711 1546787 1498112 1332941 1362412 1463803 1263713 1245089 1551805 1437842
16515 1437842 1303041 1659357 951778 1430146 1084783 1148633 983170 1282168 1246031 1230670
16505 1230670 1093064 1079925 1002335 1025737 1103553 907665 1120220 989242 1119636 1180992
16495 1180992 980600 819080 752647 973292 816182 1166945 737848 1107335 906283 875301
16485 875301 864969 1177346 918342 924525 766900 902100 1009242 1060542 772178 806120
16475 806120 905825 935384 993828 764692 684077 770088 475440 870376 438410 1169464
$$ packed form
16546A547075K15041Q61O3534k59641K37725J49676k49514J45958j0609P7073
16536A917179k11195j90853M497o2117o4788J5241K44698J7191k50886p4672q9387
16525A254908J36803J55076m8675j65171K9471J01391k00090j8624L06716j13963
16515A437842j34801L56316p07579M78368l45363O3850j65463K98998l6137j5361
16505A230670j37606j3139p7590K3402P7816j95888K12555j30978J30394O1356
16495A180992k00392j61520o6433K20645j57110L50763m29097L69487k01052l0982
16485H75301j0332L12377k59004O183j57625J35200J07142N1300k88364L3942
16475H06120R9705K9559N8444k29136q0615Q6011k94648L94936m31966P31054
$$ plain form
16465 1169464 1171841 1025581 765449 532548 390959 411189 963132 713930 905801 665661
16455 665661 714025 987842 616142 502607 1034903 604750 853541 683303 651959 719156
16445 719156 836639 432624 517907 742883 788857 679376 441545 824942 885402 715384
16435 715384 782039 546074 530909 377655 618530 403973 827189 597797 643154 570049
16425 570049 818250 724958 511812 382410 836574 501604 526996 104359 588642 385606
16415 385606 812832 230650 520919 482267 59450 222644 634950 317521 482197 570509
16405 570509 240972 707899 424195 542933 354239 282993 599972 372578 408365 892840
16395 892840 200634 493820 298773 332417 675493 455424 667555 562206 443070 218500
$$ packed form
16465A169464K377j46260k60132k32901j41589K0230N51943k49202J91871k40140
16455F65661M8364K73817l71700j13535N32296m30153K48791j70238l1344O7197
16445G19156J17483m04015Q5283K24976M5974j09481k37831L83397O0460j70018
16435G15384O6655k35965j5165j53254K40875k14557M23216k29392M5357p3105
16425E70049K48201r3292k13146j29402M54164l34970K5392A04359M84283k03036
16415C85606M27226B30650K90269l8652E9450J63194M12306l17429J64676Q8312
16405E70509B40972M66927k83704J18738j88694p1246L16979k27394L5787M84475
16395H92840B00634K93186j95047L3644L43076k20069K12131j05349j19136B18500
$$ plain form
16384 452476 482445 456124 470487 698771 564253 77649 235251 325943 550349 473398 358677
16373 358677 42950 265499 409879 137589 135267 388034 137575 516803 598374 207884
16362 167834 425131 305551 145992 444052 342011 323771 92530 355265 461425 262525
16352 262525 443812 413643 277095 170391 7814 220022 366468 457117 115989 306627
16342 306627 240949 361942 361087 106358 144112 467240 71712 485784 321876 40147 331788
16331 331788 -25222 71792 254457 482722 201626 32724 350352 408122 237702 85848
16320 455985 125303 -41097 214515 278511 -252109 227718 -27419 426364 -47179 41296
16309 273701 -4844 29987 54510 13006 278605 357779 -187336 408611 465834 295327 330780
$$ packed form
16384D52476K9969k6321J4363K28284j34518G7649J57602R0692K24406p6951j14721
16373C58677D2950K22549J44380A37589k322K52767A37575L79228Q1571B07884
16362A67834K57297j19580A45992K98060j02041j8240I2530K62735J06160j98900
16352B62525J81287l0169j36548j06704G814K12208J46446R0649A15989J90638
16342C06627o5678J20993q55A06358L7754L23128G1712M14072j63908D0147K91641
16331C31788b5222G1792J82665K28265B01626C2724L17628N7770j70420H5848
16320D55985A25303d1097B14515O3996b52109B27718b7419D26364d7179D1296
16309B73701d844B9987K4523A3006K65599P9174a87336D08611N7223j70507L5453
$$ plain form
16298 330780 255073 203317 90461 51206 485273 127699 439543 437393 251882 180966 395575
16287 395575 -122703 384234 538406 211854 39189 248879 67191 -5896 275586 -45099
16276 173547 405471 79476 221693 -195091 68253 423266 186936 178317 29079 318617
16266 318617 4843 317307 -425 90799 79831 -5517 -12562 -83111 260747 96101 348512 409529
16254 409529 220994 247121 372385 216714 211054 198060 157405 68023 230687 322393 -106966
16242 96128 139204 111605 313682 141662 529486 303397 162462 -75139 230327 120618
16232 120618 255835 18827 405686 -127453 218710 151561 13877 -185172 40667 95062
16222 95062 160464 -163604 185453 30559 41100 303095 224626 -45992 200315 244597 -24540
$$ packed form
16298C30780p5707n1756I0461l9255M34067A27699L11844k150j85511p0916K14609
16287C95575a22703C84234J54172B11854C9189K09690F7191e896B75586d5099
16276A73547K31924G9476J42217a95091F8253L55013A86936q619B9079K89538
16266C18617D843L12464d25I0799j0968e517p045p0549B60747I6101K52411O1017
16254D09529j88535K6127J25264j55671n660j2994m0655F8023J62664R1706a06966
16242I6128M3076k7599K02077A41662L87824k26089j40935g5139B30327j09709
16232A20618J35217A8827L86859a27453B18710o7149A3877a85172D0667N4395
16222I5062O5402a63604A85453C0559J0541K61995p8469d5992B00315M4282b4540
$$ plain form
16210 -119379 60408 2641 61650 340065 277857 -201305 344244 70904 85387 138427 -114628
16198 -52295 109183 76384 257944 172339 7102 159450 171188 -39963 175514 78228 -18509
16186 206435 -82093 -74398 -139574 55219 69297 509797 13466 -169298 189126 198583 117462
16175 117462 133513 -61838 -106052 163555 -112706 528106 380777 34141 30701 160471 -53349
16163 -18495 273133 49446 105003 105304 -89390 -4076 -226112 -168830 4002 -52816 125683 -86264
16150 173632 -37163 176849 211681 605688 26218 371193 64828 -105334 3995 290498 58012
16138 -27439 -203215 158871 33327 -44370 7879 83545 -38172 149632 162094 50149 212733
16127 212733 122645 -71497 -50765 397663 -66591 49503 -22295 95210 25962 75613 -298636
$$ packed form
16210a19379F0408B641N9009K78415o2208b01305C44244G0904J4483N3040a14628
16198e2295A09183l2799J81560q5605G102J52348J1738c9963A75514G8228a8509
16186B06435h2093P695o5176E5219J4078M40500A3466a69298A89126R457q1121
16175A17462J6051f1838m4214A63555a12706E28106j47329C4141l440J29770e3349
16163a8495B73133D9446N5557L01h9390d076k22036N7282D002e2816A25683h6264
16150A73632c7163A76849L4832L94007B6218L44975F4828a05334C995K86503E8012
16138b7439j75776A58871C3327d4370G879P5666c8172A49632J2462E0149J62584
16127B12733r0088g1497K0732C97663f6591D9503b2295I5210B5962M9651b98636
$$ plain form
16115 286116 -75980 3068 46128 94598 -137216 -133111 61894 214573 41493 -89027 173026
16103 -54688 185473 267289 404407 315588 218581 38666 172089 -64836 -51881 60267 -282773
16091 99081 -115265 225195 94917 -67899 -122277 564 -221719 135508 8869 110972 -83008
16079 77966 110540 -166882 -114001 -212587 172375 15000 -194659 -29974 -140286 1552 75375
16068 75375 63168 -200151 -53543 51036 -58096 -17212 180956 -337361 361254 149405 -160281
16056 322128 -415405 76935 -160008 -15242 88058 103309 -224247 61345 9288 696 -348216
16044 -187050 8552 -26187 -154828 34349 176031 -54518 82967 54778 -271003 -225028 34361
16032 88564 62958 -382264 23674 221081 322533 -66320 199609 -117133 119976 136540
$$ packed form
16115B86116g5980C068M3060M8470a37216M105F1894J52679D1493h9027A73026
16103e4688A85473Q1816J37118q8819r7007C8666J33423f4836J2955F0267b82773
16091I9081a15265B25195I4917f7899n4378E64b21719A35508H869J02103h3008
16079G7966L2574a66882N2881r8586A72375A5000a94659b9974j10312A552P3823
16068G5375j2207b00151e3543E1036e8096a7212A80956c37361C61254A49405a60281
16056C22128d15405G6935a60008a5242H8058J5251b24247F1345I288F96c48216
16044a87050H552b6187j28641C4349J41682e4518H2967k8189b71003M5975C4361
16032H8564k5606c82264B3674J97407J01452f6320A99609a17133A19976J6564
$$ plain form
16022 136540 179874 -160238 -57947 29335 -60577 -181250 -117545 -41463 77694 178517 106564
16011 106564 -105599 81135 -88104 230330 -208968 -35176 -378266 -322597 -17714 363372
16000 211725 -109137 -177848 -619 71665 55946 139230 34681 -34124 102279 -42989 373028
15988 -132379 438359 -48147 -124373 94622 242210 413743 332264 -132264 37574 131135 282410
15977 282410 103313 -191264 66741 -106878 -51342 6859 -28545 -156088 240458 -136138
15966 -212694 23387 165766 85487 108501 -124729 -255294 1076 -266321 314118 48379 38569
15955 38569 186095 -93822 -143501 92921 -190009 -271984 -153255 141037 -197239 18507 -185956
15943 68597 222688 178305 29673 -321899 1836 133900 149550 -7375 703 33823 -172997 5703
$$ packed form
16022A36540M3334a60238e7947B9335f0577j20673O3705d1463G7694J00823p1953
16011A06564a05599H1135h8104B30330b08968c5176l43090N5669a7714C63372
16000B11725a09137o8711f19G1665j5719Q3284C4681c4124A02279d2989C73028
15988a32379D38359d8147p6226I4622J47588J71533q1479a32264C7574R3561J51275
15977B82410A03313a91264F6741a06878e1342F859b8545j27543B40458a36138
15966b12694B3387J42379q0279K3014a24729j30565A076b66321C14118D8379r810
15955C8569J47526i3822m9679I2921a90009q1975J18729A41037a97239A8507a85956
15943F8597J54091m4383B9673c21899A836J32064J5650g375G03L3120a72997E703
$$ plain form
15930 210075 -290432 -181009 -17453 44058 69561 -46932 -251897 -368123 -340685 42058 -217375
15918 278144 -203804 -81839 -236661 -12328 42946 104351 -315254 9370 -13547 -127331 -49744
15906 125336 -193152 -8915 -178337 118285 -133188 -163277 -119318 -117071 -49940 -240225 -78521
15894 1653 -231371 -415700 -27097 -59846 205211 37225 -182551 149673 -49149 61062 23449
15882 177648 -18175 -161154 -38249 -434963 -184615 -123451 -60461 174513 134768 5353 -233043
15870 19998 -130184 173958 196698 168230 63793 44655 151578 -336499 -29739 145157 86635
15859 86635 -283696 -312874 -8493 -8657 -129349 -562566 76446 36747 -224233 -160799 -109207
15848 -109207 149334 -169072 67943 -38269 -32556 249969 -191614 5559 -51219 -19834 -209771
$$ packed form
15930B10075b90432J09423a7453D4058K5503d6932k04965j16226K7438D2058b17375
15918B78144b03804h1839j54822a2328D2946O1405c15254I370a3547j13784d9744
15906A25336a93152h915j69422A18285a33188l0089M3959K247d9940j90285g8521
15894A653b31371j84329b7097l2749B05211C7225a82551A49673d9149F1062B3449
15882A77648a8175j42979c8249l96714a84615O1164f0461A74513l9745E353b33043
15870A9998a30184A73958K2740k8468F3793j9138J06923c36499b9739A45157n8522
15859H6635b83696k9178h493j64j20692m33217G6446C6747b24233O3434N1592
15848a09207A49334a69072F7943c8269N713B49969a91614E559e1219a9834j89937
$$ plain form
15837 -209771 220754 40318 31022 90452 -413645 518929 -187674 355428 107184 -215014
15826 189904 -192296 128727 56579 -119605 -32453 -284212 142147 -54616 39197 499691
15816 499691 82348 145982 -128984 96040 -41531 -176371 83478 24764 -98543 -111312 -397269
15805 -397269 -106660 -69973 -68621 -53790 -295893 -257805 167630 217840 -195870 -58336 175108
15793 81082 -425829 57068 -75390 102100 378745 20658 79601 -105919 -62912 -140346 75875
15781 201313 -79726 -73724 -45734 119388 -109074 -111564 -183683 -104878 97537 51178 -112622
15769 -24090 -116306 42133 36008 -322726 -163575 18771 -346935 63281 -40331 -49065 -174227
15758 -174227 168588 29070 53686 150799 221550 -245995 -194575 -11688 186687 46579 -7332
$$ packed form
15837b09771B20754D0318r296N9430d13645E18929a87674C55428A07184b15014
15826A89904a92296A28727E6579a19605c2453k51759A42147e4616C9197M60494
15816D99691H2348O3634a28984I6040d1531j34840H3478B4764i8543j2769k85957
15805c97269a06660L6687J352J4831k42103L8088A67630N0210a95870e8336A75108
15793H1082d25829E7068g5390A02100K76645B0658N8943a05919M3007p7434G5875
15781B01313g9726O002K7990A19388a09074k490p2119P8805I7537m6359a12622
15769b4090r2216D2133o125c22726J59151A8771c46935F3281d0331q734j25162
15758a74227A68588B9070K4616R7113P0751b45995N1420a1688A86687D6579g332
$$ plain form
15746 -63615 108768 -395899 -74366 -97522 59470 118582 26605 96688 -76996 -234000 43359
15734 246357 -99685 66927 -63361 69157 10584 89435 -78632 -340620 -224699 2311 74773
15723 74773 -296861 22063 15354 3768 47655 -74204 125712 -310614 -106285 -33161 -33734 -15419
15710 -129218 125673 73 -237507 178097 -385029 221413 227793 -25839 -117961 221398 59842
15698 220061 -87949 -129818 -207754 -297494 87852 120577 322947 196131 -137110 -109908 -142176
15687 -142176 83088 -408089 220512 -36782 92098 106392 -73499 -176587 -34999 134857 -61096
15675 23825 -76250 -19348 -256645 196661 214794 -245047 42964 -40285 45902 -4374 -192156
15664 -192156 -214015 -42175 123963 -45705 59071 79054 -414465 59116 -221397 -181848 -67609
$$ packed form
15746f3615A08768c95899g4366k3156E9470N9112B6605P0083g6996j57004D3359
15734B46357i9685F6927f3361F9157A0584P8851g8632k61988J15921B311P2462
15723G4773b96861B2063o709C768M3887g4204A25712c10614a06285c3161n73a5419
15710a29218A25673G3b37507A78097c85029B21413O380b5839r2122B21398E9842
15698B20061h7949m1869p7936q9740H7852L2725K02370j26816a37110K7202l2268
15687a42176H3088d08089B20512c6782I2098J4294g3499j03088c4999A34857f1096
15675B3825g6250a9348k37297A96661J8133b45047D2964d0285D5902d374j87782
15664a92156k1859d2175A23963d5705E9071J9983d14465E9116b21397L9549f7609
$$ plain form
15652 200418 145494 -44785 260710 159882 -40828 270594 194042 -293715 -102825 -154553
15642 -154553 -28272 132104 216800 79716 24958 -111825 -145810 -73383 -100235 -36964 -226046
15631 -226046 -389090 4750 -78549 217265 278069 -130404 112028 78715 -49425 -28415 -255907
15620 -255907 -70706 -315637 314230 318370 -103098 9591 214176 -67237 -315564 -214811 -165988
15609 -165988 -145209 -74992 -358725 20246 -176027 91256 149075 -340651 -117114 -249109
15599 -249109 -399921 -132160 -360414 43115 -91610 -47990 -213675 -38182 38740 -80578 235687
15587 -149202 22270 -31931 -189703 255959 248106 19977 -117328 -131728 70057 -81667 -161001
15576 -161001 -5441 35711 76503 -383078 -30202 -145992 232830 -331565 86654 137961 -2561
$$ packed form
15652B00418n4924d4785B60710j00828d0828B70594p6552b93715a02825n1728
15642a54553b8272A32104Q4696G9716B4958a11825l3985P2427k6852c6964j89082
15631b26046j63044D750g8549B17265O0804a30404A12028l3313d9425K1010k27492
15620b55907g0706k44931C14230M140a03098I591K04585f7237k48327J00753M8823
15609a65988K0779P0217k83733B0246a76027I1256N7819c40651a17114j31995
15599b49109j50812a32160k28254D3115i1610M3620j65685c8182C8740h0578B35687
15587a49202B2270c1931j57772B55959p853A9977a17328j4400G0057h1667p9334
15576a61001e441C5711M0792c83078c0202j15790B32830c31565H6654N1307b561
$$ plain form
15564 -278559 206643 -332373 72160 146733 -161640 79706 118455 218985 -263887 -30098
15553 -399120 -339354 149170 -143136 -14043 -236059 -141752 51610 -218356 55875 272218
15543 272218 -39523 148793 217638 -54342 171213 -79197 -93099 168161 1728 -238027 -171968
15532 -171968 -366693 16867 -244364 288606 159931 -132247 -115516 179540 -42146 122850
15521 -143607 120864 -218798 -5288 54701 -102473 160418 265169 164023 75138 -46896
15510 -303886 103422 -134346 -184404 124295 -236263 -103412 273106 -154373 -77598 244367
15499 -296187 -128291 -287913 77058 -98580 10118 227674 -24558 -65590 -245372 -75302 -253197
15488 -253197 239040 -49248 -255438 -251496 -141422 -219702 125037 -193121 -78841 -427989
$$ packed form
15564b78559B06643c32373G2160P4573a61640G9706L8749J00530b63887c0098
15553c99120N9766A49170a43136a4043k22016R4307E1610b18356E5875K16343
15543B72218c9523A48793O8845e4342A71213g9197j3902A68161A728b38027O6059
15532a71968j94725A6867b44364B88606j28675a32247J6731A79540d2146A22850
15521a43607A20864b18798e288E4701a02473A60418J04751j01146G5138d6896
15510c03886A03422a34346n0058A24295b36263a03412B73106a54373P6775B44367
15499b96187a28291j59622G7058i8580A0118K17556b4558m1032j79782g5302j77895
15488b53197B39040d9248k06190L942J10074p8280A25037a93121g8841l49148
$$ plain form
15478 -427989 73995 373121 106820 36511 230955 -72831 275048 -89352 -41785 -72433 82618
15466 49119 -2173 205467 -138236 -124914 -144571 41723 -91313 132395 -80448 54270 -278545
15454 130505 141466 128348 -199335 164404 70815 217111 -166169 142822 4870 -328932
15443 -128385 210911 125616 -163735 151918 -67439 5971 -118744 -88619 185192 149048 -520860
15431 23963 117433 -40296 -280743 -316343 -108357 22763 -52207 39934 -43685 204733 -116811
15419 65576 12263 117163 -109395 307539 -169064 -95496 -212031 -157133 -11013 152981
15408 74973 -91575 -4085 -87374 43023 351469 60617 -347543 14694 -82053 -202073 -259130
15397 -259130 179109 -6141 -117110 -211718 156435 42978 -46906 123585 102954 -413601 -68490
$$ packed form
15478d27989G3995K99126A06820C6511J94444g2831B75048h9352d1785l0648H2618
15466D9119b173B05467a38236J3322j9657D1723i1313A32395h0448E4270b78545
15454A30505J0961j3118a99335A64404G0815J46296a66169A42822D870c28932
15443a28385B10911q5295a63735A51918f7439E971a18744L0125A85192l6144e20860
15431B3963R3470d0296k40447l5600a08357B2763e2207C9934d3685B04733a16811
15419F5576A2263J04900a09395C07539a69064P3568j16535N4898a1013A52981
15408G4973i1575d085q3289D3023L08446F0617c47543A4694h2053j20020n7057
15397b59130A79109f141j10969r4608A56435D2978d6906A23585k0631d13601f8490
$$ plain form
15385 80954 119582 -4919 -156323 -301729 289206 113613 -70119 -247825 81159 -244915 228692
15373 -173510 262813 101271 333284 -134225 239709 -67477 363 -158916 287579 107415
15362 76182 41293 139933 -302380 218884 -2088 67856 -62094 147057 -385733 -108557 262196
15350 71218 -90217 101026 -246478 -193184 -161036 -62048 99986 65508 126219 17534 105626
15339 105626 275321 -75734 57911 -273364 -4739 208159 572524 -58611 -456428 -252859
15329 -252859 -443989 85364 84617 69325 -100392 42134 42982 -233784 80973 -242761 -31358
15317 -111888 -64736 46944 160602 294895 -270899 -29860 -150382 192893 63992 -96691
15306 110076 -133985 166379 122501 172340 213079 90598 182648 79296 71099 23477 267564
$$ packed form
15385H0954L8628d919j51404j45406B89206A13613g0119j77706H1159b44915B28692
15373a73510B62813A01271K32013a34225B39709f7477C63a58916B87579A07415
15362G6182l4889R8640c02380B18884b088F7856f2094A47057c85733a08557B62196
15350G1218i0217A01026b46478N3294L2148f2048I9986l4478O0711A7534Q8092
15339A05626J69695g5734E7911b73364d739B08159L64365e8611l97817K03569
15329b52859j91130H5364p47j5292a00392D2134Q48b33784H0973b42761c1358
15317a11888M7152D6944J13658J34293b70899b9860j20522A92893F3992i6691
15306A10076a33985A66379m3878M9839M0739I0598R2050G9296q197B3477K44087
$$ plain form
15295 267564 -22493 -35483 -18695 -20488 25612 -71255 19918 124014 292285 -15745 -2187
15283 -183563 -161054 -159936 49240 20136 -48269 266899 137682 -170651 86588 343066 -125590
15271 274113 64827 152072 -101865 1995 -292966 144695 -166715 424499 133884 126167 -23193
15259 43357 -91963 258962 -158559 271962 -58987 12368 366643 381500 441895 339081 792746
15248 792746 906094 701303 753253 413917 236767 268167 429264 181006 186051 131724
15238 131724 209718 -131890 321292 104227 -76527 -118062 19694 179228 195602 273329 -179379
15226 -271078 190032 -160563 -81700 338848 121424 61212 306969 -73364 12773 160826
15216 160826 -94648 380003 25034 36605 47812 -267553 473480 90683 23664 138534 -11323
$$ packed form
15295B67564b2493j2990J6788j793B5612g1255A9918J04096J68271a5745b187
15283a83563K2509J118D9240B0136d8269B66899j29217a70651H6588K56478a25590
15271B74113F4827Q7245a01865A995b92966A44695a66715D24499A33884p717b3193
15259D3357i1963B58962a58559B71962e8987A2368L54275J4857O0395j02814M53665
15248G92746J13348k04791N1950l39336j77150L1400J61097A81006N045n4327
15238A31724P7994a31890C21292A04227g6527m1535A9694J59534J6374P7727a79379
15226b71078A90032a60563P8863C38848A21424o0212K45757g3364A2773J48053
15216A60826i4648C80003B5034J1571J1207b67553D73480I0683B3664J14870a1323
$$ plain form
15204 163026 6920 92384 -475515 -117890 153544 215239 133897 390229 125479 30034 86006
15193 86006 304379 99609 -64703 195562 47403 80546 -95136 160204 150958 197255 277447
15182 277447 249019 -12081 244319 -368311 153007 61773 338018 153791 51781 -228108
15171 -58111 -24880 124298 -256309 110350 27009 -210272 118016 -204029 -119418 231068
15160 96141 54843 167672 312815 -32233 -71273 -255417 132465 201572 99827 30524 261948
15149 261948 178642 -114522 74036 53658 -78307 353697 102021 -105472 -297024 36206
15138 243752 312462 -45072 30927 129835 442394 66393 156059 -54566 -113735 -86720 82161
15126 63797 62709 237092 2224 12545 498019 265075 32150 282027 88671 217224 2588
$$ packed form
15204A63026F920Q5464d75515a17890A53544O1695q1342K56332A25479C0034N5972
15193H6006K18373I9609f4703A95562D7403L3143i5136A60204r246M6297Q0192
15182B77447k8428a2081B44319c68311A53007F1773K76245A53791E1781b28108
15171e8111b4880A24298b56309A10350B7009b10272A18016b04029Q4611B31068
15160I6141m1298J12829J45143c2233l9040j84144A32465O9107I9827C0524K31424
15149B61948q3306a14522G4036k0378g8307C53697A02021a05472j91552C6206
15138B43752O8710d5072C0927R8908L12559F6393Q9666e4566n9169K7015H2161
15126F3797j088J74383B224J0321M85474k32944C2150K49877H8671J28553B588
$$ plain form
15114 -104525 127506 -51451 302585 -113372 89292 69745 25298 89469 208612 -16007 333080
15102 314301 148578 -123006 -168265 50040 198138 76113 -286512 191032 75229 -185387
15091 328889 144478 -28050 28179 290541 126649 -40410 -238953 -17444 321910 396731
15081 396731 -98035 437580 318707 551015 -35637 25347 -17731 -226410 52888 272031
15071 272031 71302 89127 205467 361289 176333 -9816 -143430 125171 18522 458706
15061 458706 531680 329559 102296 -62490 188182 57665 380010 -63127 517817 56120
15050 -146226 21800 274876 -35206 180029 389432 -178221 99457 -35724 58447 235229
15040 235229 73025 425261 138230 312110 -304048 62361 68182 290311 -48826 225914
$$ packed form
15114a04525A27506e1451C02585a13372H9292j9547B5298O4171J19143a6007C33080
15102C14301A48578a23006m5259E0040J48098G6113b86512A91032G5229a85387
15091C28889A44478b8050B8179K62362A26649d0410j98543a7444C21910P4821
15081C96731i8035D37580j18873K32308c5637B5347a7731k08679E2888K19143
15071B72031G1302J7825J16340J55822A76333i816j33614A25171A8522M40184
15061D58706P2974k02121A02296f2490A88182E7665L22345f3127E17817E6120
15050a46226B1800K53076c5206A80029K09403a78221I9457c5724E8447J76782
15040B35229G3025L52236A38230J73880c04048F2361N821K22129d8826B25914
$$ plain form
15029 321764 204878 213123 202003 336073 457007 27276 132310 168223 312655 31769 287837
15018 287837 352169 720897 285388 -92276 130853 -73021 78179 415756 -34836 110939
15007 -33128 85890 -61817 60502 222183 -3135 390656 485445 199947 198782 154895 101137
14996 101137 84392 265909 278146 207292 290698 291108 315655 159326 203959 -122599 59909
14984 333544 250736 69294 212368 422591 224723 375813 116435 311342 90174 441644
14974 441644 273702 244236 572313 112678 178493 340510 256210 115348 435359 336318
14964 336318 -167256 67791 361419 43891 200816 58568 189137 144345 229467 288986 298794
14953 298794 237928 318916 -9479 242933 324972 533497 118698 325040 424970 231555 82938
$$ packed form
15029C21764j16886Q245j1120J34070J20934B7276J05034L5913J44432C1769K56068
15018B87837O4332L68728B85388i2276A30853g3021G8179L37577c4836A10939
15007c3128H5890f1817F0502J61681c135C90656R4789A99947j165m3887n3758
14996A01137j6745J81517J2237p0854Q3406M10K4547j56329M4633a22599E9909
14984C33544q2808F9294J43074K10223j97868J51090A16435J94907I0174L51470
14974D41644j67942k9466L28077A12678O5815J62017q4300A15348L20011r9041
14964C36318a67256F7791K93628D3891J56925E8568J30569m4792Q5122N9519R808
14953B98794o0866Q0988i479B42933Q2039K08525A18698K06342R9930j93415H2938
$$ plain form
14941 104102 438974 516353 531404 423764 171679 249200 30942 484032 87666 228485
14931 228485 64797 77727 139907 123938 55386 88697 94151 -136815 293046 373715 425405
14920 425405 366745 176349 485384 250711 297619 364592 484794 508201 405517 14671
14909 115048 430429 204175 190413 536570 181382 91488 334901 340993 117087 373847
14899 373847 279105 189913 532317 430713 279164 222613 265590 427304 360383 638299
14889 638299 420080 465598 391570 210357 208471 378277 364856 410574 524207 79968 335588
14878 335588 48186 378661 188971 92085 314224 204046 523380 110872 379571 332041
14868 332041 589433 246988 431005 208238 -150860 219809 462718 441085 490221 580980
$$ packed form
14941A04102L34872P7379J5051j07640A71679P7521C0942M53090H7666J40819
14931B28485F4797J2930O2180j5969E5386L3311N454a36815B93046Q0669N1690
14920D25405n8660A76349L09035k34673M6908O6973J20202K3407j02684A4671
14909A15048L15381B04175j3762L46157A81382q9894K43413O092A17087K56760
14899C73847r4742q9192L42404j01604j51549n6551M2977J61714o6921K77916
14889F38299k18219M5518p4028j81213j886J69806j3421M5718J13633G9968K55620
14878C35588D8186L30475A88971I2085K22139j10178L19334A10872K68699m7530
14868C32041K57392B46988J84017B08238a50860B19809K42909k1633M9136R0759
$$ plain form
14858 580980 499667 482710 515177 457571 322279 588813 240143 451488 178862 413329
14848 413329 544182 179770 411694 395126 302731 465962 662955 585625 349289 524489
14838 524489 533375 608719 273186 444991 573826 554657 169445 609362 406760 459133
14828 459133 310953 390338 619039 318511 372960 645469 473333 589759 559359 41785
14817 587204 150043 143213 566598 351867 533535 660084 505190 442635 469878 675866
14807 675866 487944 272017 508146 242875 403251 324762 391522 636932 260918 247014
14797 247014 702026 323223 180217 251760 588387 657682 263209 523922 742412 508551
14787 508551 599226 496623 536914 542316 450557 632465 716836 864198 403285 445350 780217
$$ packed form
14858E80980q1313j6957L2467n7606j35292K66534B40143K11345A78862K34467
14848D13329J30853A79770K31924j6568r2395J63231J96993p7330k36336J75200
14838E24489Q886P5344B73186J71805J28835j9169A69445M39917k02602N2373
14828D59133j48180P9385K28701l00528N4449K72509j72136J16426l0400D1785
14817E87204A50043o830M23385k14731J81668J26549j54894o2555K7243K05988
14807F75866j87922k15927K36129B42875J60376p8489O6760K45410B60918j3904
14797B47014M55012C23223j43006P1543L36627O9295B63209K60713K18490k33861
14787E08551R0675j02603M0291N402r1759J81908Q4371J47362D03285M2065L34867
$$ plain form
14776 780217 493218 311282 604731 577130 363194 488662 519781 378321 567479 527066
14766 527066 565782 688438 198623 608583 768863 302841 663579 533467 435005 593316
14756 593316 353690 746242 647879 693281 789327 704335 683876 644110 1023700 255649 846901
14745 846901 810825 565613 881944 790754 863603 953529 567717 690006 827684 968012
14735 968012 607884 376793 776979 906847 655135 536901 436120 755853 448610 1047630
14725 1047630 743492 461919 519049 673969 994769 203823 677821 904950 959959 918544
14715 918544 685930 1159791 701565 1009884 930520 718316 783495 794126 983806 966254
14705 966254 797744 563392 986540 999130 929008 1030489 872417 817616 751488 814980
$$ packed form
14776G80217k86999j81936K93449k7601k13936J25468L1119j41460J89158m0413
14766E27066L8716J22656A98623M09960J60280C02841L60738j30112r8462J58311
14756E93316k39626L92552r8363M5402R6046q4992k0459l9766L79590B55649N91252
14745H46901l6076k45212L16331r1190P2849Q9926l85812J22289J37678J40328
14735I68012l60128k31091M00186J29868k51712j18234j00781L19733l07243N99020
14725A047630l04138k81573N7130J54920L20800B03823M73998K27129N5009m1415
14715I18544k32614M73861m58226L08319p9364k12204O5179J0631J89680j7552
14705I66254j68510k34352M23148J2590p0122J01481j58072n4801o6128O3492
$$ plain form
14695 814980 908755 766093 1038979 820660 712387 748212 985180 751956 577637 826666
14685 826666 512095 892658 744771 916246 783742 1103367 1180380 833927 1028715 727245
14675 727245 1121574 990771 730137 901874 1002908 1123587 998228 927930 1322407 1204294
14665 1204294 1168023 898827 1159176 1005047 1145408 1452899 1147434 840797 900981 1302642
14655 1302642 1007825 1424177 810930 1173145 1218142 1211335 1190811 1128354 1358462 1264462
14645 1264462 1321946 1219224 1323895 1068050 1117316 1372047 1425706 1352125 1449107 1177641
14635 1177641 1391358 1384536 1478888 1373932 977998 1424631 1132918 1513458 1279620 1137250
14625 1137250 1445525 1137865 1228245 1471780 1084636 1470814 1125225 1145138 1423732 1559333
$$ packed form
14695H14980R3775j42662K72886k18319j08273L5825K36968k33224j74319K49029
14685H26666l14571L80563j47887J71475j32504L19625P7013l46453J94788l01470
14675G27245L94329j30803k60634J71737J01034J20679j25359p0298L94477j18113
14665A204294l6271k69196K60349j54129J40361L07491l05465l06637O0184M01661
14655A302642k94817M16352o13247L62215M4997o807k0524o2457K30108r4000
14645A264462N7484j02722J04671k55845M9266K54731N3659p3581R6982k71466
14635A177641K13717o822R4352j04956l95934M46633k91713L80540k33838j42370
14625A137250L08275l07660R0380K43535l87144L86178l45589J9913K78594J35601
$$ plain form
14615 1559333 1246554 1478523 991447 1600395 1443354 1572996 1414902 1649604 1118176
14606 1118176 1516589 1652215 1705390 1535809 1637245 1678609 1508825 1770477 1506977 1465647
14596 1465647 1698718 1405778 1604926 1622721 1673797 1919694 1866996 1576634 1722529 1905408
14586 1905408 1920418 1467699 1700486 1534969 1818456 1875741 1993273 2113460 2298677 2248112
14576 2248112 2244591 2299353 1981693 1975687 2267281 2074189 2412482 2375865 2197509 2384626
14566 2384626 2900564 2455100 2843071 2600659 2616189 3084211 3163064 3061268 3343426 3329340
14556 3329340 3978042 4365132 4305959 4774849 5111637 5849407 7059533 9064285 12740394
14547 12740394 20333896 28744589 32553006 18157580 8765846 5322522 4058494 3534843
$$ packed form
14615A559333l12779K31969m87076O08948j57041J29642j58094K34702n31428
14606A118176L98413J35626N3175j69581J01436M1364j69784K61652k63500m1330
14596A465647K33071k92940J99148J7795N1076K45897n2698k90362J45895J82879
14586A905408J5010m52719K32787j65517K83487N7285J17532J20187J85217n0565
14576B248112l521N4762l17660o006K91594j93092L38293l6617j78356J87117
14566B384626N15938m45464L87971k42412J5530M68022P8853j01796K82158j4086
14556C329340O48702L87090n9173M68890L36788P37770J210126K004752L676109
14547A2740394P593502Q410693L808417j4395426H765846l443324j264028n23651
$$ plain form
14539 3534843 3029831 2880929 3139673 2597492 2857383 2304131 2475635 2636218 2753936
14530 2753936 2028367 2433970 2301367 2502387 2688513 2310683 2828893 2474696 2493215 2651140
14520 2651140 2580419 2630386 2677023 2572534 3021515 2636630 2741084 2892151 2666582 2562433
14510 2562433 2767747 2978712 3150759 2962166 3039180 2705811 3073826 2764509 2935167 3097018
14500 3097018 3015511 3041178 3064203 3330573 3439434 3079580 3463420 3414075 3182437 3531889
14490 3531889 3507219 3286172 3488098 3653462 3590568 3499990 3735071 3731171 3710838 3892945
14480 3892945 3569686 3798322 3949986 3791783 3860650 3927966 4412577 3805640 4116312 3995148
14470 3995148 4079412 4284213 4479384 4143815 4601983 4452720 4728814 4605649 4611230 4470658
$$ packed form
14539C534843n05012j48902K58744n42181K59891n53252J71504J60583J17718
14530B753936p25569M05603j32603K01020J86126l77830N18210l54197J8519J57925
14520B651140p0721M9967M6637j04489M48981l84885J04454J51067k25569j04149
14510B562433K05314K10965J72047j88593P7014l33369L68015l09317J70658J61851
14500C097018q1507K5667K3025K66370J08861l59854L83840m9345k31638L49452
14490C531889k4670k21047K01926J65364o2894r0578K35081l900k0333J82107
14480C892945l23259K28636J51664j58203O8867O7316M84611o06937L10672j21164
14470C995148Q4264K04801J95171l35569M58168j49263K76094j23165N581j40572
$$ plain form
14460 4470658 5116553 4425659 5180718 4823703 4617919 5153485 5342210 4868318 5052341
14451 5052341 5273528 5224239 5385131 5474234 5515283 5499095 5930568 5716990 5629697 5762518
14441 5762518 5889390 5826613 6240158 6148586 6233334 6327896 6501839 6434700 6611638 6625757
14431 6625757 6909903 6815991 6910350 6970159 7018519 7451753 7397731 7353088 7552532 7750397
14421 7750397 7656310 7667193 7871886 8014934 8347042 8026727 8410487 8270146 8645429 8961275
14411 8961275 8909356 8905126 9011587 9236877 9451541 9441534 9642150 9932706 9840420 10140952
14401 10140952 10521109 10355601 10646974 10646139 11297619 11206679 11361029 11647493 11973796 11531152
14391 11531152 11977095 12605362 12591095 12805824 13164845 13253454 13491317 13514530 13618893 14067223
$$ packed form
14460D470658O45895o90894P55059l57015k05784N35566J88725m73892J84023
14451E052341K21187m9289J60892Q9103M1049j6188M31473k13578q7293J32821
14441E762518J26872o2777M13545r1572Q4748R4562J73943o7139J76938J4119
14431F625757K84146r3912R4359N9809M8360M33234n4022m4643J99444J97865
14421G750397r4087J0883K04693J43048L32108l20315L83760j40341L75283L15846
14411H961275n1919m230J06461K25290K14664j0007K00616K90556r2286L00532
14401A0140952L80157j65508K91373q35O51480r0940J54350K86464L26303m42644
14391A1531152M45943O28267j4267K14729L59021Q8609K37863K3213J04363M48330
$$ plain form
14381 14067223 14343603 14924713 15012875 15003668 15470792 15723456 15930013 16703535 16442119 17115234
14371 17115234 17335570 17775295 18115390 18440674 19040889 19344948 19503287 20158358 20529375
14362 20529375 21081461 21287921 22055678 22054723 23071377 23519994 23799053 24783349 24724334 26028780
14352 26028780 26357336 27072517 27277461 28431835 29223379 29473986 30606452 31162451 32447062
14343 32447062 32633804 33927663 34896183 35652548 36611903 37790269 38901042 40011102 41365071
14334 41365071 42221253 43724449 45007296 46593187 47991276 49246941 51090165 52635818
14326 52635818 54077224 56299757 58129765 60236155 62579534 64269362 66965799 69321281
14318 69321281 72083205 74773092 77377057 81008002 84080574 87426882 90892820 94915098
$$ packed form
14381A4067223K76380N81110Q8162r207M67124K52664K06557P73522k61416O73115
14371A7115234K20336M39725L40095L25284O00215L04059J58339O55071L71017
14362B0529375N52086K06460P67757r55J016654M48617K79059R84296n9015J304446
14352B6028780L28556P15181K04944J154374P91544K50607J132466N55999J284611
14343C2447062J86742J293859R68520P56365R59355J178366J110773J110060J353969
14334D1365071Q56182J503196J282847J585891J398089J255665J843224J545653
14326E2635818J441406K222533J830008K106390K343379J689828K696437K355482
14318F9321281K761924K689887K603965L630945L072572L346308L465938M022278
$$ plain form
14310 94915098 98971116 103186882 107611622 112587900 117501958 123278624 128307471 134725219
14302 134725219 140973908 147678818 154705308 162065530 170196083 178598133 187250687 197102190
14294 197102190 207216878 217889635 229383528 241151278 253149513 264832545 276770070
14287 276770070 289046295 300219133 312097089 323432405 334526752 346073931 356256979
14280 356256979 366403665 376150232 386537215 397518705 408293948 419562801 430394851
14273 430394851 439709501 445217950 447379299 447124208 447141155 446458935 440783454 430807044
14265 430807044 417979680 404369517 390431409 376880142 363794415 349948721 337678632
14258 337678632 324681537 312580322 300595179 287846900 275735540 263967141 252832630
$$ packed form
14310I4915098M056018M215766M424740M976278M914058N776666N028847O417748
14302A34725219O248689O704910P026490P360222Q130553Q402050Q652554R851503
14294A97102190J0114688J0672757J1493893J1767750J1998235J1683032J1937525
14287B76770070J2276225J1172838J1877956J1335316J1094347J1547179J0183048
14280C56256979J0146686R746567J0386983J0981490J0775243J1268853J0832050
14273D30394851R314650N508449K161349k55091J6947o82220n675481r976410
14265D30807044j2827364j3610163j3938108j3551267j3085727j3845694j2270089
14258C37678632j2997095j2101215j1985143j2748279j2111360j1768399j1134511
$$ plain form
14251 252832630 241986126 231277175 221323320 211597507 202166005 193408355 184990887 177588966
14243 177588966 169911245 163069493 156310565 149873529 143589134 137576796 132051060 126934664
14235 126934664 121717594 116856791 112218173 108032640 104266701 100224473 96301438 92748767
14227 92748767 88883048 85793403 82766874 79689880 77048083 73921441 71328951 69111763
14219 69111763 66646183 64548139 62265572 60360294 58371926 56434871 54953995 53201248
14211 53201248 51434027 49649396 48175244 46999439 45742076 44544270 42767498 41490484
14203 41490484 40145186 38967906 38084524 37485648 36227059 35292022 34029777 33188904 32253150
14194 32253150 31510730 30730628 29961930 29161672 27978636 27715030 26987754 26084425 25475525
$$ packed form
14251B52832630j0846504j0708951r953855r725813r431502q757650q417468p401921
14243A77588966p677721o841752o758928o437036o284395o012338n525736n116396
14235A26934664n217070m860803m638618m185533l765939m042228l923035l552671
14227I2748767l865719l089645l026529l076994k641797l126642k592490k217188
14219F9111763k465580k098044k282567j905278j988368j937055j480876j752747
14211E3201248j767221j784631j474152j175805j257363j197806j776772j277014
14203D1490484j345298j177280q83382n98876j258589r35037j262245q40873r35754
14194C2253150p42420p80102p68698q00258j183036k63606p27276r03329o08900
$$ plain form
14185 25475525 24863131 24484573 23663354 23429898 22920596 22247521 21690905 21194363 21265436
14176 21265436 20485077 20124989 19745455 19347867 18742037 18263870 17818246 17715399 17404000
14167 17404000 17003638 16431858 16636075 16227516 15862095 15462960 15030698 15270458 14771826
14158 14771826 14717653 14079323 13907633 13713196 13450970 13188064 13244365 12914879 12275160 12403309
14148 12403309 11942539 11854857 11741421 11536706 11334823 11296044 11185454 10757696 10838361 10495443
14138 10495443 10380633 10198008 10030414 9964442 9663903 9532692 9400560 9468004 9143885 9255652
14128 9255652 8902911 8794005 8815036 8332623 8648778 8472972 8316142 8309624 7952743 7630649
14118 7630649 7677841 7603949 7608444 7460962 7320395 7595029 7374427 7200335 7166245 7084527
$$ packed form
14185B5475525o12394l78558q21219k33456n09302o73075n56616m96542P1073
14176B1265436p80359l60088l79534l97588o05830m78167m45624j02847l11399
14167A7404000m00362n71780K04217m08559l65421l99135m32262K39760m98632
14158A4771826n4173o38330j71690j94437k62226k62906N6301l29486o39719J28149
14148A2403309m60770q7682j13436k04715k01883l8779j10590m27758Q0665l42918
14138A0495443j14810j82625j67594o5972l00539j31211j32132O7444l24119J11767
14128I255652l52741j08906K1031m82413L16155j75806j56830o518l56881l22094
14118G630649M7192p3892M495j47482j40567K74634k20602j74092l4090q1718
$$ plain form
14108 7084527 6857798 6767407 6913979 6739098 6491458 6548591 6462408 6195292 6237261 6334461
14098 6334461 6215337 5817688 5991238 5703179 5958830 5579039 5612128 6035333 5817099 5474365
14088 5474365 5684804 5429914 5369662 5114992 5257038 5303013 4807281 5114168 5045352 4815510
14078 4815510 4751140 4719814 4758160 4775593 4640494 4951802 4486942 4498798 4421063 4262993
14068 4262993 4438595 4386821 4291855 4610579 4446802 4163981 4148311 4111102 4169909 4187476
14058 4187476 4147374 4133597 3918207 4096274 3819849 3905287 3663497 4057960 3722661 3705850
14048 3705850 3580030 3293845 3543226 3600835 3453881 3487925 3741971 3648700 3582691 3629474
14038 3629474 3042542 3514370 3044596 3174886 2988775 3375438 3198265 3280376 3124661 3399112
$$ packed form
14108G084527k26729r0391J46572j74881k47640N7133q6183k67116M1969R7200
14098F334461j19124l97649J73550k88059K55651l79791L3089M23205k18234l42734
14088E474365K10439k54890o0252k54670J42046M5975m95732L06887o8816k29842
14078D815510o4370l1326L8346J7433j35099L11308m64860J1856p7735j58070
14068D262993J75602n1774r4966L18724j63777k82821j5670l7209N8807J7567
14058D187476m0102j3777k15390J78067k76425Q5438k41790L94463l35299j6811
14048C705850j25820k86185K49381N7609j46954L4044K54046r3271o6009M6783
14038C629474n86932M71828m69774J30290j86111L86663j77173Q2111j55715K74451
$$ plain form
14028 3399112 2831154 2917036 2806859 2915133 2640645 2794306 2876933 2680374 3178974 2975625
14018 2975625 2838732 3027986 2441019 2912854 2667303 2533307 2611782 2515761 2771964 2544501
14008 2544501 2275192 2729123 2665938 2706553 2720264 2305225 2459969 2416935 2625797 2726756
13998 2726756 2571205 2588962 3140018 2918305 3171742 3232108 3368347 4099981 4437249 5768708
13988 5768708 8709225 14929630 24234956 32772120 22135398 13016987 8624965 6606914
13980 6606914 5499784 4869589 4296797 3886273 3906414 3780745 3233341 3280427 3006527 3304697
13970 3304697 2789154 3060777 2663910 2526597 2843800 2685650 2334005 2583342 2546643 2355187
13960 2355187 2236333 2306265 2348589 2224238 2426824 2173082 1921803 2173760 2083035 1965055
$$ packed form
14028C399112n67958Q5882j10177J08274k74488J53661Q2627j96559M98600k03349
14018B975625j36893J89254n86967M71835k45551j33996P8475r6021K56203k27463
14008B544501k69309M53931o3185M0615J3711m15039J54744m3034K08862J00959
13998B726756j55551J7757N51056k21713K53437O0366J36239P31634L37268J331459
13988E768708K940517O220405R305326Q537164j0636722r118411m392022k018051
13980F606914j107130o30195n72792m10524K0141j25669n47404M7086k73900K98170
13970C304697n15543K71623l96867j37313L17203j58150l51645K49337l6699j91456
13960B355187j18854O9932M2324j24351K02586k53742k51279K51957r0725j17980
$$ plain form
13950 1965055 2369052 1936247 2130404 1910798 2030454 1777444 1767879 1720483 2173615 1894159
13940 1894159 1899250 1890997 1687330 1714874 1591802 1588035 1796478 1792805 1705231 1599401 1705838
13929 1705838 1398591 1652344 1679276 1709542 1323204 1509542 1348156 1486325 1522536 1717640
13919 1717640 1763226 1947591 1480649 1797411 1803218 1370874 1428000 1199433 1467294 1689132
13909 1689132 1424373 1716824 1457874 1684900 1174554 1479894 1227549 1453167 1269872
13900 1269872 1477127 1187482 1106775 1386947 1139263 1308173 1187360 1367415 1431049 1549264
13890 1549264 1542745 1115943 1510919 1174060 1224822 1136024 1412828 1218159 1587014 1612482
13880 1612482 1126669 1270776 1099315 1423455 1486661 1054132 1147643 979302 925361 1276038
$$ packed form
13950A965055M03997m32805J94157k19606J19656k53010r565m7396M53132k79456
13940A894159N091q253k03667K7544j23072l767K08443l673q7574j05830J06437
13929A705838l07247K53753K6932L0266l86338J86338j61386J38169L6211J95104
13919A717640M5586J84365m66942L16762N807m32344N7126k28567K67861K21838
13909A689132k64759K92451k58950K27026n10346L05340k52345K25618j83295
13900A269872K07255k89645q0707K80172k47684J68910j20813J80055O3634J18215
13890A549264o519m26802L94976l36859N0762q8798K76804j94669L68855K5468
13880A612482m85813J44107j71461L24140O3206m32529R3511j68341n3941L50677
$$ plain form
13870 1276038 1255093 1220273 1166579 1322968 1202058 1056463 949388 925814 1105627 1403009
13860 1403009 713529 1292319 1317899 1110914 858861 1220470 981043 1186513 1069798 1110334
13850 1110334 1065094 1020348 1091792 1118873 956630 912870 1171540 1346617 1203501 837258
13840 837258 831265 534301 1042043 1004651 847965 871851 858313 910759 763648 1122369 1018186
13829 1018186 1104777 1156603 1010297 965525 1144016 902183 721679 938340 949368 1142371
13819 1142371 830336 896157 902967 948089 735936 1022972 1091297 693695 1008688 751786
13809 751786 1017211 811451 884521 903113 786568 720760 950541 838687 811459 683578
13799 683578 983403 952899 591831 1019276 822752 823313 712418 604859 956667 672648
$$ packed form
13870A276038k0945l4820n3694J56389j20910j45595j07075k3574J79813K97382
13860A403009o89480N78790K5580k06985k52053L61609k39427K05470j16715M0536
13850A110334m5240m4746P1444K7081j62243m3760K58670J75077j43116l66243
13840H37258n993k96964N07742l7392j56686K3886j3538N2446j47111L58721j04183
13829A018186Q6591N1826j46306m4772J78491k41833j80504K16661J1028J93003
13819A142371l12035O5821O810M5122k12153K87036O8325l97602L14993k56902
13809G51786K65425k05760P3070J8592j16545o5808K29781j11854k7228j27881
13799F83578K99825l0504l61068M27445j96524N61j10895j07559L51808k84019
$$ plain form
13789 672648 1055473 717793 725123 650798 676029 974180 649902 875652 710215 678293
13779 678293 635700 803085 742810 990797 879128 709471 789220 1027345 615957 514603
13769 514603 986821 577359 697860 576426 682077 1048551 856622 680344 589207 638690
13759 638690 833779 650573 836387 550370 554700 558713 777311 685454 810713 777751 493141
13748 493141 785364 725128 746692 681253 777498 628752 608699 656277 682816 608226 616433
13737 616433 876670 504535 756655 880118 451418 659636 485973 542472 442237 630556
13727 630556 788350 682702 566309 891623 253628 631284 787672 619925 954215 293803
13716 419074 645850 197759 516945 799611 588642 362850 866926 350266 460911 701855
$$ packed form
13789F72648L82825l37680P330p4325K5231K98151l24278K25750j65437l1922
13779F78293m2593J67385o0275K47987j11669j69657P9749K38125m11388j01354
13769E14603M72218m09462J20501j21434J05651L66474j91929j76278r1137M9483
13759F38690J95089j83206J85814k86017M330M013K18598r1857J25259l2962k84610
13748D93141K92223o0236K1564o5439R6245j48746k0053M7578K6539p4590Q207
13737F16433K60237l72135K52120J23463m28700K08218j73663N6499j00235J88319
13727F30556J57794j05648j16393L25314B53628L77656J56388j67747L34290B93803
13716D19074K26776A97759L19186K82666k10969k25792N04076C50266J10645K40944
$$ plain form
13706 701855 711101 356588 327545 522441 473343 529450 701971 596354 535031 645536 669738
13695 669738 253045 770727 600462 594755 584442 658873 114067 596869 460256 432840
13685 432840 524656 771689 361555 408621 290160 796729 215421 405577 616122 602937
13675 602937 437204 280957 432113 665033 761065 667099 413705 781429 37596 479438
13665 479438 437561 450898 611438 143935 410669 640557 295789 302957 64762 563291
13655 563291 433745 595072 423582 478231 9294 700933 600684 480664 313658 546422
13645 546422 204860 228206 248865 641007 278097 523424 756962 564264 72489 732325
13635 732325 676668 454392 496055 454912 477072 232975 505044 591539 262499 334649 548094
$$ packed form
13706G01855R246l54513k9043J94896m9098N6107J72521j05617o1323J10505K4202
13695F69738B53045N17682j70265n707j0313P4431A14067M82802j36613k7416
13685D32840R1816K47033C61555M7066j18461N06569B15421J90156K10545j3185
13675F02937j65733j56247J51156K32920R6032r3966k53394L67724C7596M41842
13665D79438m1877J3337J60540A43935K66734K29888B95789P168F4762M98529
13655E63291j29546J61327j71490N4649I294O91639j00249j20020j67006K32764
13645E46422B04860K3346K0659L92142B78097K45327K33538j92698G2489O59836
13635G32325n5657k22276M1663m1143K2160B32975K72069Q6495B62499P2150K13445
$$ plain form
13624 548094 460728 440059 108436 511823 170840 558606 419235 603335 364030 529468
13614 529468 452759 254992 567072 572490 131407 297751 138542 427245 433854 459330 331777
13603 331777 459431 456185 224784 498310 302607 238344 756184 516279 273149 257627
13593 257627 533319 423819 330975 474186 347250 390973 302332 319187 587137 446750
13583 446750 318811 568905 424107 438700 211831 393542 547700 466416 389155 15770
13572 335588 290218 470195 80282 28859 482791 315764 287354 75199 287826 162782
13562 162782 450819 365333 358454 270034 405751 251461 36502 374925 527608 298938
13552 298938 448611 405720 430273 55585 261271 394857 34793 389046 460328 161632
$$ packed form
13624E48094q7366k0669A08436M03387A70840L87766j39371J84100k39305J65438
13614E29468p6709j97767L12080N418A31407J66344A38542K88703O609K5476j27553
13603C31777J27654l246B24784K73526j95703o4263N17840k39905k43130j5522
13593B57627K75692j09500r2844J43211j26936M3723q8641J6855K67950j40387
13583D46750j27939K50094j44798J4593B11831J81711J54158q1284p7261A5770
13572C35588m5370J79977H0282B8859M53932j67027k8410G5199K12627j25044
13562A62782K88037q5486o879q8420J35717j54290C6502L38423J52683k28670
13552B98938J49673m2891K4553E5585K05686J33586C4793L54253P1282A61632
$$ plain form
13541 194295 274723 206391 160191 356869 276862 106852 312621 259493 763612 294751
13530 309727 894623 323079 138298 503619 366687 213363 305741 446958 426861 293236
13520 293236 317740 595927 457821 250625 326482 312268 132492 420074 5653 211951
13510 211951 153525 285001 225392 531700 608059 551671 429411 147925 383961 353927
13500 353927 86874 -15678 121221 227556 147279 357891 495485 180032 158380 -117943
13489 273720 456990 203712 376762 423530 270956 669112 445215 162114 211091 374846
13479 374846 337063 158209 415588 250891 404611 163590 124513 133592 371467 184376
13468 441328 298283 393252 243783 319424 333527 232994 121308 372439 306689 224978
$$ packed form
13541A94295Q0428o8332m6200J96678q0007A06852K05769n3128N04119B94751
13530C09727N84896C23079A38298L65321j36932j53324R2378J41217k0097j33625
13520B93236K4504K78187j38106k07196P5857j4214A32492K87582E653K06298
13510B11951n8426J31476n9609L06308P6359n6388j22260A47925K36036l0034
13500C53927H6874a5678A21221J06335q0277K10612J37594A80032k1652a17943
13489B73720J83270B03712J73050M6768j52574L98156k23897A62114M8977J63755
13479C74846l7783A58209K57379j64697J53720A63590l9077R079K37875A84376
13468D41328j43045R4969j49469P5641J4103j00533j11686K51131o5750q1711
$$ plain form
13458 224978 349778 476010 159792 161982 204780 247228 136314 310897 215008 327543
13448 327543 250693 275627 298469 232562 221359 50191 187520 163602 202610 29767 372492
13437 372492 -13811 226610 276590 294701 344573 460141 350362 310071 237173 172401 149894
13426 149894 21739 267599 324184 407157 413809 149954 441231 183258 67371 225188 49766
13414 225152 110671 353901 -200505 233534 303442 183108 256143 169122 150494 88715
13404 88715 386659 349990 239124 143467 -8296 -192247 151517 19151 62936 -161631 106328
13392 -40417 226356 87622 -7312 82950 40253 562082 237932 247689 120119 449359 311199
13381 311199 548298 59894 -20380 329195 249609 -14639 -61288 205166 -28894 212959 187905
$$ packed form
13458B24978J24800J26232A59792K190M2798M2448j10914J74583r5889J12535
13448C27543p6850K4934K2842o5907j1203E0191J37329k3918L9008B9767L42725
13437C72492a3811B26610M9980J8111M9872J15568j09779m0291p2898o4772k2507
13426A49894B1739K45860N6585Q2973O652A49954K91277A83258F7371J57817D9766
13414B25152A10671K43230b00505B33534O9908j20334P3035q7021j8628o1779
13404H8715K97944l6669j10866r5657h296j83951A51517A9151M3785a61631A06328
13392d0417B26356H7622g312H2950D0253N21829B37932R757A20119L29240j38160
13381C11199K37099E9894b0380C29195p9586a4639m6649B05166b8894B12959k5054
$$ plain form
13370 187905 250316 111759 99960 299868 406297 -204779 569098 427413 62963 236893
13360 236893 164112 300888 277889 2102 181968 522975 110962 195745 -124463 208378
13349 93947 422181 335078 129308 45778 308649 490000 401400 277855 198515 307835
13339 307835 290000 153029 162543 383932 70450 168029 349243 228667 357218 639293
13329 639293 148995 258230 134976 221054 225468 308861 203968 242584 295132 113788 -76731
13317 262738 232962 337636 33567 250725 272308 115610 605243 51467 302496 140771
13306 260071 4313 318891 -24530 389922 162216 281559 221627 116351 -5018 213015 320193
13295 320193 223578 152728 -175539 -24127 88591 330248 292797 205097 306692 287968 84532
$$ packed form
13370A87905O2411A11759j1799J99908J06429b04779E69098j41685F2963J73930
13360B36893p2781J36776k2999B102J79866L41007A10962Q4783a24463B08378
13349I3947L28234q7103A29308D5778K62871J81351q8600j23545p9340J09320
13339C07835j7835j36971R514K21389G0450R7579J81214j20576J28551K82075
13329F39293A48995J09235j23254Q6078M414Q3393j04893L8616N2548A13788g6731
13317B62738k9776J04674C3567K17158K1583A15610M89633E1467K51029A40771
13306B60071D313L14578b4530C89922A62216J19343n9932j05276e018B13015J07178
13295C20193r6615p0850a75539b4127H8591K41657l7451q7700J01595j8724H4532
$$ plain form
13283 184638 279355 188801 112690 -114276 117711 254767 296422 -45681 151870 152200 250998
13272 250998 247151 -60526 199096 86459 164617 65275 -115072 211669 260694 8797 20510
13261 20510 -1015 184374 -242814 128055 438779 163669 -21990 235155 -101552 224143
13250 -47078 194358 108874 -367561 43616 -152105 207069 215562 277267 281472 -254018 70276
13238 -244284 243591 150472 89224 269346 133268 19687 -9904 -32896 157230 92098 242170
13227 242170 33886 80080 137499 161408 -294183 -112130 -32346 446686 113516 44823 123504
13216 123504 374961 259876 -54915 -42898 -155852 256144 202840 137024 237870 80801
13205 -1198 194326 159810 166468 427194 79815 144159 -25234 167985 -35295 99359 66229
$$ packed form
13283A84638R4717r0554p6111a14276A17711J37056M1655d5681A51870L30R8798
13272B50998l847f0526A99096H6459P8158F5275a15072B11669M9025H797J1713
13261B0510a015A84374b42814A28055L10724A63669b1990B35155a01552B24143
13250d7078A94358q5484c67561D3616a52105B07069Q493O1705M205b54018G0276
13238b44284B43591r3119o1248J80122A33268A9687i904k2992A57230o5132J50072
13227B42170C3886M6194N7419K3909b94183a12130c2346D46686A13516D4823P8681
13216A23504K51457j15085e4915J2017j12954B56144n3304o5816J00846H0801
13205a198A94326l4516O658K60726G9815O4344b5234A67985c5295I9359l3130
$$ plain form
13194 66229 -7547 39326 -130212 77701 75019 75801 -22516 65947 136074 -64544 272276 51465
13181 58421 253892 235197 58390 313122 96290 68795 4493 151117 119170 219393 44168
13169 321089 243893 -71277 211191 153042 -207095 162615 -20355 71271 95290 -100512 93841
13157 -167241 242906 -110247 161134 161219 127315 218576 71588 275587 -1906 64816 -123663
13145 231096 -84081 94757 192879 113421 -210920 162240 47581 63603 -44415 -17220 50734
13133 446911 35643 341980 275784 -303479 -61584 -88344 -72397 327913 106715 234449
13123 234449 -6222 -156626 164203 144623 -171421 225854 107465 -5415 65423 118160 150211
13112 150211 235066 98567 -108700 -182285 200291 -309025 -4810 170123 92735 86126 37344
$$ packed form
13194F6229g547C9326a30212G7701k682P82b2516F5947P0127f4544B72276E1465
13181E8421J95471j8695E8390K54732I6290k7495D493J46624l1947J00223D4168
13169C21089p7196g1277B11191n8149b07095A62615b0355G1271K4019a00512I3841
13157a67241B42906a10247A61134Q5l3904R1261G1588K03999a906F4816a23663
13145B31096h4081I4757R8122p9458b10920A62240D7581J6022d4415a7220E0734
13133D46911C5643L06337o6196c03479f1584k6760J5947C27913A06715J27734
13123B34449f222j50404A64203j9580a71421B25854A07465e415F5423N2737L2051
13112A50211Q4855I8567a08700p3585B00291c09025d810A70123p7388o609C7344
$$ plain form
13100 -108 87223 205107 317712 -213626 41262 144203 147687 113938 84984 296165 -138719
13088 -139277 193991 76880 -17358 258146 215888 132067 166786 -25697 170980 53658 -85369
13076 216481 156639 -51172 -149867 57849 -94634 534299 133689 174716 86703 440482 275314
13065 275314 -118914 227693 27378 289412 114553 377948 75231 229291 368041 -201312
13054 -52007 305984 37893 418111 -93978 -39380 87559 168086 115528 229398 -43087 207369
13042 42735 42776 -5380 131873 -117208 267996 174386 222118 218399 15854 44390 -11498 94991
13029 385744 259602 340109 237062 7179 59504 -137266 309112 91360 -25551 35909 202235
13018 202235 -37089 126577 -13682 215030 315842 347072 142529 118591 263059 21822
$$ packed form
13100a08H7223J17884J12605b13626D1262J02941L484l3749k8954K11181a38719
13088a39277A93991G6880a7358B58146m2258q3821L4719b5697A70980E3658h5369
13076B16481n9842e1172r8695E7849i4634E34299A33689M1027H6703L53779j65168
13065B75314a18914B27693B7378K62034A14553K63395G5231J54060J38750b01312
13054e2007C05984C7893L80218i3978c9380H7559Q0527n2558J13870d3087B07369
13042D2735M1e380A31873a17208B67996r3610M7732l719A5854K8536a1498I4991
13029C85744j26142Q0507j03047G179N2325a37266C09112I1360b5551C5909J66326
13018B02235c7089A26577a3682B15030J00812L1230A42529k3938J44468B1822
$$ plain form
13007 91504 -54442 -36449 437736 78326 278938 -169325 -50511 99351 145463 385110 86737
12995 -2763 -59045 -42440 235764 181749 79350 -72044 137005 158948 -272149 146651 375221
12984 375221 126853 -107184 185594 157347 124394 125364 74240 137399 211744 -29112 188341
12972 133852 215757 170514 -161253 173972 -57412 71446 299282 315870 -342165 3424 123716
12961 123716 259571 -248302 -80807 250608 450889 -209417 -149502 -214576 -262350 104619
12950 -137456 45895 -74120 230239 26605 -253587 -63175 156651 8315 301224 38237 84104
12939 84104 -25057 -430460 269686 -434363 267197 -279029 -47564 82522 -158735 -212016
12929 -212016 162909 -72299 -137882 -151837 202948 341893 -4313 139012 282150 -12880 -23074
$$ packed form
13007I1504e4442J7993D37736G8326K00612a69325e0511I9351M6112K39647H6737
12995b763n6282J6605B35764n4015G9350g2044A37005K1943b72149A46651K28570
12984C75221A26853a07184A85594k8247l2953R70n1124O3159P4345b9112A88341
12972A33852Q1905m5243a61253A73972e7412G1446K27836J6588c42165C424J20292
12961A23716J35855b48302h0807B50608K00281b09417N9915o5074m7774A04619
12950a37456D5895g4120B30239B6605b53587f3175A56651H315K92909C8237M5867
12939H4104b5057m05403B69686d34363B67197b79029d7564H2522a58735n3281
12929b12016A62909g2299o5583j3955B02948J38945d313A39012J43138a2880j0194
$$ plain form
12918 -23074 216809 359144 197739 -189822 76909 30324 243161 -160461 -192251 10911
12907 -204398 58683 123469 -40424 2725 -19005 8667 -143840 297204 62526 -236695 -191739
12896 -191739 282594 319144 -144785 156950 135518 75370 55799 -58091 124940 292201
12886 292201 189522 231630 143299 -378823 192473 121293 46261 -2892 49204 170730 62458
12874 -216285 -67203 157612 -29452 135455 85455 -202743 -149616 139620 282390 223690
12864 223690 252392 -29510 -276049 -120728 -144014 418179 109771 65595 5442 -34568 90712
12852 17388 45593 -87278 367386 20286 38077 -65650 -137992 242776 37432 238240 370466
12841 370466 120078 -15429 147333 -51188 -39785 -296826 -17241 154891 -198806 97751
$$ packed form
12918b3074B16809J42335j61405a89822G6909C0324K12837a60461l1790A0911
12907b04398E8683O4786d0424B725a9005H667a43840B97204F2526b36695M4956
12896a91739B82594L6550a44785A56950k1432o0148j9571e8091A24940J67261
12886B92201j02679M2108q8331c78823A92473p1180D6261b892D9204J21526F2458
12874b16285f7203A57612b9452A35455n0000b02743N3127A39620J42770n8700
12864B23690K8702b9510k46539a20728k3286D18179A09771m4176E442c4568I0712
12852A7388K8205h7278C67386B0286J7791f5650p2342B42776C7432K00808J32226
12841C70466A20078a5429A47333e1188J1403k57041a7241A54891a98806I7751
$$ plain form
12830 48396 -15854 -306873 -16005 -15125 72917 -103491 141012 11574 -138791 -209906 6040
12818 108287 -32428 -65786 57569 -7392 148493 -351778 186602 -122238 210573 58019 -67003
12806 260630 -34638 -378612 17097 -2696 8924 -77614 101880 288049 -165069 109184 -270908
12794 130289 80371 130563 -557932 409325 -79864 -63415 42596 -314259 -236457 -250259 -423273
12783 -423273 -156203 145233 42368 -64748 68720 164683 197019 189887 341285 129200 308966
12772 308966 -29528 68623 -40536 -67592 68845 275246 -235072 -77043 290490 151319 197413
12761 197413 329244 125582 -113872 108145 246814 12521 -144679 280925 -171393 -57509
12750 481208 179042 39040 60130 -142547 103632 -177726 368950 251502 52168 5861
$$ packed form
12830D8396a5854k91019a6005Q80G2917a03491A41012A1574a38791p1115F040
12818A08287c2428l3358E7569g392A48493c51778A86602a22238B10573E8019f7003
12806B60630c4638l43974A7097b696H924g7614A01880J86169a65069A09184b70908
12794A30289m9918N0192e57932D09325g9864J6449D2596c14259P7802j3802j73014
12783d23273a56203A45233D2368f4748F8720R5963L2336p132J51398A29200J79766
12772C08966b9528F8623d0536k7056F8845K06401b35072g7043B90490j39171M6094
12761A97413J31831A25582a13872A08145J38669A2521a44679B80925a71393e7509
12750D81208A79042C9040K1090a42547A03632a77726C68950j17448E2168E861
$$ plain form
12739 -67100 88214 63543 384988 -456817 270215 136351 458487 315509 314881 1215 -319466
12727 460225 -125292 147024 143925 -77000 -149126 10051 -103602 25838 -267265 7060 -157460
12715 47410 263987 -185168 328271 -104178 317181 93960 140892 822979 445738 301447
12705 301447 -2039 207662 245684 45711 221204 187570 -89658 154393 246474 176592 162596
12694 162596 219806 160517 70584 349533 -235506 -74539 107540 -189525 149398 -15457
12683 90109 187142 214167 -142674 -36055 181428 68323 198989 254442 198028 120223 -47184
12671 71075 30104 41234 -89587 319280 51561 -29503 -28455 40420 30946 -61763 200441 73570
12658 -74204 196421 318045 293251 -56997 269002 148266 193499 -28584 127807 -7549 -50510
$$ packed form
12739f7100H8214k4671L21445d56817B70215j33864L22136j42978o28A215c19466
12727D60225a25292A47024l099g7000p2126A0051a03602B5838b67265G060a57460
12715D7410K16577a85168C28271a04178C17181I3960M6932O82087l77241j44291
12705C01447b039B07662L8022D5711J75493l3634h9658A54393R2081o9882j3996
12694A62596N7210n9289G0584K78949b35506g4539A07540a89525A49398a5457
12683I0109R7033K7025a42674c6055A81428F8323J30666N5453n6414p7805d7184
12671G1075C0104J1130h9587C19280E1561b9503J048D0420r474f1763B00441G3570
12658g4204A96421J21624k4794e6997B69002j20736M5233b8584A27807g549m2961
$$ plain form
12647 -50510 41916 207260 -74378 -221713 -47134 -132248 -402287 -108751 115153 279085
12637 279085 283415 269079 170289 307076 258760 63836 237097 182328 -136591 327791 112832
12625 309307 432959 17666 47179 291034 35353 136854 195450 152218 8318 -6489 59794
12613 464621 -15571 47714 -100939 17982 -79500 -290517 -40670 120805 116570 383865 71921
12601 181812 335049 -134551 -161476 -5330 407538 -16779 -174264 -159507 -61151 -213528 53226
12589 -92588 -87507 -155085 123238 254938 -181215 -238841 242837 -156333 -135447 447017 -79995
12577 70541 123738 2135 196091 -167668 43372 157341 -157959 121743 -96331 -70480 33452
12565 169349 266803 -28477 36295 52890 109854 86797 9665 180098 -52579 -222048 80850
$$ packed form
12647e0510D1916J65344g4378j47335d7134q5114k70039a08751A15153J63932
12637B79085M330j4336r8790J36787m8316F3836J73261n4769a36591C27791A12832
12625C09307J23652A7666K9513K43855C5353J01501N8596m3232H318f489E9794
12613D64621a5571D7714a00939A7982g9500k11017d0670A20805m235K67295G1921
12601A81812J53237a34551k6925e330D07538a6779j57485J4757f1151j52377E3226
12589i2588N081o7578A23238J31700a81215n7626B42837a56333K0886D47017g9995
12577G0541N3197B135J93956a67668D3372J13969a57959A21743i6331K5851C3452
12565A69349R7454b8477C6295J6595N6964k3057I665J70433e2579j69469H0850
$$ plain form
12553 30457 65203 -80347 -195723 -111345 78864 26437 11237 -202714 262364 165557 -106361
12541 -3850 190294 -583238 325677 -170556 288886 -18738 127010 -162010 409529 6583
12530 492459 -1624 57964 31392 46605 -111678 -69524 63756 90705 -306043 -201614 -174863
12519 -174863 12334 95294 35900 -178687 52642 142489 56458 164024 100387 -8956 -209202
12508 -209202 -123647 68393 148812 -125867 222059 50908 214309 -8272 42315 116846 198415
12497 198415 -159459 96522 432399 -21640 21465 -241518 238251 191736 69192 -2320 99557
12485 38267 -67621 315267 287816 -117527 59238 83675 -257018 -79289 -66664 251836 -89729
12473 8936 -166087 56326 48180 18699 127720 99546 -33017 38923 187131 137408 -26685
$$ packed form
12553C0457L4746h0347j15376Q4378G8864B6437A1237b02714B62364r6807a06361
12541c850A90294e83238C25677a70556B88886a8738A27010a62010D09529F583
12530D92459a624E7964k6572J5213a11678M2154F3756K6949c06043J04429K6751
12519a74863A2334Q2960C5900a78687E2642Q9847E6458J07566o3637h956k00246
12508b09202Q5555F8393Q0419a25867B22059E0908J63401h272D2315P4531Q1569
12497A98415a59459I6522L35877b1640B1465b41518B38251m6515F9192b320I9557
12485C8267f7621C15267k7451a17527E9238K4437b57018g9289J2625B51836h9729
12473H936a66087E6326q146A8699J09021k8174c3017C8923J48208m9723b6685
$$ plain form
12461 181579 -2063 -62950 -82581 -242599 -261443 2838 -100677 191769 -111486 37786 -5749
12449 -187599 -16162 174198 210502 11535 116279 56935 146346 217668 -202665 -34335 23745
12437 -220663 -79096 134738 -53375 30724 -44130 -112319 37160 52569 -210169 218276 -133072
12425 61424 -14414 -121681 69 87470 -51851 -58724 -71266 -53517 445985 37522 156711 -122450
12412 -182302 -26689 46957 402228 -503740 -24326 119802 38338 -21235 -99946 109792 7907
12400 -82088 216015 -56096 210885 65463 168213 103825 284409 149036 -20881 -302976
12390 -302976 -104229 68877 -145406 121900 -121195 -80788 -49356 -90931 32257 -70802 -48206
12379 -48206 69008 -158923 45325 -288 -22683 220768 -165506 60443 203463 -37249 59739
$$ packed form
12461A81579b063o0887j9631j60018j8844B838a00677A91769a11486C7786e749
12449a87599a6162A74198L6304A1535J04744E6935Q9411P1322b02665c4335B3745
12437b20663g9096A34738e3375C0724d4130o8189C7160J5409b10169B18276a33072
12425F1424a4414j07267F9Q7401e1851o873j2542J7749D45985C7522J19189a22450
12412a82302b6689D6957L55271e03740b4326A19802C8338b1235p8711A09792G907
12400h2088B16015e6096B10885F5463J02750o4388J80584j35373b0881k82095
12390c02976a04229F8877a45406A21900a21195M0407L1432m1575C2257g0802K2596
12379d8206F9008a58923D5325b88k2395B20768a65506F0443J43020c7249E9739
$$ plain form
12367 -229737 76640 88497 310299 11147 107562 43465 5114 48329 136767 -176869 90537
12355 -117078 176590 -23868 -99118 -70942 138055 -128607 166868 -140509 133193 -130993
12344 -247491 -412156 -233799 -141913 -52788 -31228 -365760 -29484 -180508 -28516 -131951
12334 -131951 17792 144967 220737 77048 -57840 309619 -93320 -157620 33217 -380516 -153082
12322 45064 26573 142598 250091 272222 -160124 74364 -53241 -22447 92505 -45733 59023
12310 7938 -162837 97070 64836 -53073 -60728 -2099 242090 15 -6677 110817 114377 -97338 286047
12296 180981 -91028 -34581 -23314 349830 -283557 -34455 47303 84426 -38619 53492 -126766
12284 190457 150180 364631 -101182 -124354 40114 -223238 -1458 -41830 108286 247730 394878
$$ packed form
12367b29737G6640J1857K21802A1147R6415D3465E114M3215Q8438a76869I0537
12355a17078A76590b3868p5250K8176A38055a28607A66868a40509A33193a30993
12344b47491j64665J78357R1886e2788K1560l34532b9484j51024b8516j03435
12334a31951A7792J27175P5770G7048e7840C09619i3320o4300C3217c80516a53082
12322D5064j8491J16025J07493K2131a60124G4364e3241b2447I2505d5733E9023
12310G938a62837I7070l2234e3073p655b099B42090A5f677A10817L560i7338B86047
12296A80981i1028c4581J1267C49830b83557c4455D7303L7123c8619E3492a26766
12284A90457m0277K14451a01182k3172D0114b23238a458m0372A08286J39444J47148
$$ plain form
12273 394878 160519 -281645 192633 58716 89407 58359 315903 111815 63594 -96411
12262 19284 -117570 215262 -109610 -74677 -45550 -145379 231611 203398 324212 -64284 -97868
12251 -97868 202980 -222264 -218259 94332 233676 264553 -99062 -71310 -52590 25896 253670
12240 253670 20959 -121771 220661 39283 126520 29875 178203 101871 9901 332708 164712
12228 57939 -72669 253477 92197 140983 134028 255941 316596 44038 58815 215762 -76405
12216 353140 302813 245176 560081 230041 9414 200854 100051 43086 241055 86958 74340
12205 74340 340409 -74954 -134184 370774 375545 110505 87718 262453 -31616 63433 42795
12194 42795 117408 292469 210963 -67685 247801 -39042 -132075 306865 91197 153692 285613
$$ packed form
12273C94878A60519b81645A92633E8716L0691l1048K57544A11815m8221i6411
12262A9284a17570B15262a09610L4933K9127r9829B31611k8213J20814f4284l3584
12251i7868B02980b22264M005I4332J39344L0877i9062K7752J8720B5896K27774
12240B53670B0959a21771B20661C9283Q7237B9875J48328p6332I901L22807A64712
12228E7939g2669B53477I2197M8786o955J21913O0655D4038J4777J56947g6405
12216C53140n0327n7637L14905B30041I414J91440A00051D3086J97969H6958j2618
12205G4340K66069g4954n9230C70774M771A10505k2787J74735c1616F3433k0638
12194D2795P4613J75061q1506f7685B47801c9042r3033C06865I1197O2495J31921
$$ plain form
12183 285613 -88500 -227975 75739 72428 -3125 184743 381721 59090 161922 173718 190896
12172 190896 47913 436246 100349 189935 104945 -83058 159790 392921 253278 -128172
12161 -51 41394 305794 -50580 -168087 111524 104165 83548 -170056 157227 51761 103774
12150 103774 -224752 130825 -397602 109665 -99812 68733 188549 128334 158142 -267365
12139 -199362 -15703 -193986 474559 -133859 172378 112745 121764 160135 244292 226246 -30878
12127 276638 85945 256846 62034 136027 91476 -101460 631259 22917 109366 174791 -99708
12115 120459 -148162 -62230 195520 -173818 259044 111597 -171661 135336 -335054 48136
12104 -230050 44436 -26561 224503 -198220 158707 29699 -94880 -145020 -50867 104307 11743
$$ packed form
12183B85613h8500j39475G5739l311c125A84743J96978E9090J02832J1796J7178
12172A90896D7913L88333A00349Q9586q4990h3058A59790K33131j39643a28172
12161e1D1394K64400e0580j17507A11524p359k0617a70056A57227E1761N2013
12150A03774b24752A30825c97602A09665i9812F8733J19816o0215K9808b67365
12139a99362a5703j78283D74559a33859A72378n9633R019L8371Q4157j8046c0878
12127B76638H5945J70901F2034P3993m4551a01460F31259B2917Q6449O5425i9708
12115A20459a48162f2230A95520a73818B59044A11597a71661A35336c35054D8136
12104b30050D4436b6561B24503a98220A58707B9699i4880n0140e0867A04307A1743
$$ plain form
12092 -49286 135288 12086 -203547 -7730 88765 -73181 -317668 -63225 256688 28026 -163433
12080 -35667 -155377 -93487 3671 66277 220100 290535 523139 1198783 349868 412272 224764
12069 224764 293593 -35371 -132825 81864 226489 195895 130348 66237 -82422 -12264 -253546
12058 -253546 -142044 -98263 293025 1227 26172 -18940 333933 99933 -331339 -210852 -149227
12047 -149227 -185916 188641 71851 -132381 57827 -196298 -86307 -113319 -59235 -126616 103416
12035 343538 68502 -122132 309533 103261 -48564 2170 7939 -347109 -140262 -85395 -225011
12024 -225011 266543 -117914 -93130 270906 72683 -195072 46035 -146733 152904 247964
12014 247964 88671 49154 27989 -175694 66531 28345 115486 33881 -39919 9623 -94690
$$ packed form
12092d9286A35288A2086b03547g730H8765g3181k44487f3225B56688B8026a63433
12080c5667j19710O1890C671O2606J53823P0435K32604O75644C49868O2404j87508
12069B24764O8829c5371r7454H1864J44625l0594o5547o4111h2422a2264k41282
12058b53546J11502M3781B93025A227K4945a8940C33933I9933c31339J20487O1625
12047a49227l6689A88641G1851a32381E7827a96298h6307k7012N4084o7381A03416
12035C43538F8502a22132C09533A03261d8564B170N769c47109a40262N4867j39616
12024b25011B66543a17914K4784B70906G2683a95072D6035a46733A52904R5060
12014B47964H8671l9517k1165a75694F6531B8345Q7141C3881c9919I623i4690
$$ plain form
12002 -193401 -250529 -18001 17110 -59387 40246 -102326 77847 -102072 120620 -35544 -37795
11991 -37795 -180828 -165463 -225500 -101127 -87442 -93833 335602 -338973 7860 -130920 104916
11979 125740 6772 185827 219392 248404 -264358 246430 -46934 -365825 -272629 -107444 157004
11967 27910 -30457 367053 155711 -76892 31053 120069 -415971 85903 254976 208104 -456458
11955 -304610 191026 25036 -178119 143462 -128690 110263 -228161 -408738 150507 -183172
11944 -231636 -78477 102843 32645 -97371 186788 -56313 -22588 -87485 160409 -97540 -136195
11933 -136195 -61817 150053 56500 -18405 282205 -62912 186343 198603 -420442 -231830
11923 -231830 -204618 74485 124053 -85827 298996 38763 -196367 221953 80845 -156749 251394
$$ packed form
12002a93401n7128a8001A7110e9387D0246a02326G7847a02072A20620c5544k251
11991c7795j43033J5365o0037a01127J3685o391C35602c38973G860a30920A04916
11979A25740F772J79055L3565K9012b64358B46430d6934l18891R3196a07444A57004
11967B7910c0457C67053A55711g6892C1053Q9016d15971H5903J69073m6872d56458
11955c04610A91026B5036a78119A43462a28690A10263b28161j80577A50507a83172
11944b31636g8477A02843C2645i7371A86788e6313b2588o4897A60409i7540l8655
11933a36195f1817A50053E6500a8405B82205f2912A86343J2260d20442J88612
11923b31830K7212G4485M9568h5827B98996C8763a96367B21953H0845a56749B51394
$$ plain form
11911 -3988 184180 22396 246960 176892 -90220 -182389 203594 46239 -164836 111900 70184
11900 70184 41519 98971 -246314 93802 -156683 -132895 173490 24943 -112051 -2729 229055
11888 100305 -1486 -2711 53996 -16321 53838 -251888 -11885 171003 -467608 -295006 52050
11876 133763 -32776 -155283 164409 175110 -218376 -5567 -318585 -276418 73447 -8681 -191099
11865 -191099 60561 -11789 -219276 -350562 28877 -386233 116164 17854 110809 -305711
11854 -294777 -327056 140331 5144 -4267 -340106 -223093 -275695 -25826 -24929 -333377 -56517
11842 -88000 -60822 2729 171409 32078 195803 -48790 -221190 -57324 -84283 163011 -7537
11830 -64604 -206251 10403 359643 -162404 -172288 60339 34714 192144 -262094 88736 176598
$$ packed form
11911c988A84180B2396K24564p0068i0220r2169B03594D6239a64836A11900m1716
11900G0184k8665N7452b46314I3802a56683K3788A73490B4943a12051b729B29055
11888A00305a486j225E3996a6321E3838b51888a1885A71003d67608J72602E2050
11876A33763c2776j22507A64409J0701b18376e567l13018M2167G3447h681j82418
11865a91099F0561a1789k07487j31286B8877c86233A16164A7854R2955c05711
11854b94777l2279A40331E144d267l35839J17013n2602b5826Q97l08448e6517
11842h8000K7178B729J68680C2078J63725d8790j72400e7324k6959A63011g537
11830f4604j41647A0403L49240a62404r884F0339k5625J57430b62094H8736Q7862
$$ plain form
11819 176598 207702 -133213 -298802 -72240 -164116 213402 100275 -130864 -309477 -23906
11808 273667 -194458 -283252 -80140 284992 301432 -15919 61072 -38518 -331999 -282458 159266
11796 -6919 96789 80162 -239445 -171634 78292 179174 117868 -233593 -161143 333515 -240655
11784 105684 -70895 -158586 44362 14497 139327 80013 296696 -2047 -119124 -67237 113736
11772 -105606 -216715 65470 82333 61372 -127098 -206077 -122164 -244522 226909 -222182
11761 -12069 -143485 285718 -270888 191748 328868 -126064 29347 -148077 104166 -21303
11750 -81743 88338 -79925 19486 -153661 -308140 -38004 48700 -54668 -3474 -212079 -203222
11739 -203222 -56731 -274091 -70736 180063 -92551 165356 122526 267538 -287098 -144545
$$ packed form
11819A76598L1104a33213j65589g2240r1876B13402A00275a30864j78613b3906
11808B73667a94458q8794h0140B84992J6440a5919F1072c8518k93481M9541A59266
11796f919I6789j6627b39445O7811G8292J00882o1306b33593P2450C33515b40655
11784A05684g0895q7691D4362A4497J24830n9314K16683b047j17077N1887A13736
11772a05606j11109F5470J6863k0961a27098p8979Q3913j22358B26909b22182
11761a2069j31416B85718b70888A91748J37120a26064B9347a48077A04166b1303
11750h1743H8338g9925A9486a53661j54479c8004D8700e4668c474k08605Q857
11739b03222e6731k17360g0736A80063i2551A65356m2830J45012b87098J42553
$$ plain form
11729 -144545 -92524 -185779 76394 -197102 -86555 -226731 176906 245346 -73630 -278572 80432
11717 142022 -3149 -174732 -35812 7692 -59116 161206 -80226 114324 141573 390005 -146946
11705 -168245 60107 98434 63533 60610 249560 -46600 -102478 -124890 -140026 23383 74673
11694 74673 377490 -144326 -258002 31105 162490 -93996 -95585 -61993 -55111 -162841 -119579
11683 -119579 -201959 -27571 -3605 202835 -92499 39612 -103704 285275 36397 52605 11103
11671 -144975 -128901 -58350 5682 -325331 296405 233610 57020 233244 110752 161839 40715
11659 16711 -307867 -210785 -120336 123932 46274 -24576 -306224 194517 96278 69068 -80954
11647 263309 -106205 16147 102731 -31625 27756 207152 266934 24997 -102351 64907 61742
$$ packed form
11729a44545N2021r3255G6394a97102h6555j40176A76906O8440g3630k04942H0432
11717A42022c149j71583c5812G692e9116A61206h0226A14324K7249K48432a46946
11705a68245F0107L8327l4901k923J88950d6600n5878k2412j5136B3383N1290
11694G4673L02817a44326j13676C1105J31385i3996j589L3592O882j07730M3262
11683a19579q2380b7571c605B02835i2499C9612a03704B85275C6397J6208A1103
11671a44975J6074e8350E682c25331B96405o2795E7020J76224A10752N1087D0715
11659A6711c07867R7082R0449A23932D6274b4576k81648A94517I6278k7210h0954
11647B63309a06205A6147Q6584c1625B7756J79396N9782B4997a02351F4907l165
$$ plain form
11636 61742 146811 114388 287929 118479 -13 213654 147254 236299 -112767 -10151 -116693
11625 -116693 78180 25165 90106 268054 -188253 -115693 276468 193465 65126 -288403 -149237
11614 -149237 -144303 -259310 268008 -131500 189971 249656 -552256 160466 47983 -193914
11603 -31988 244445 -61168 391129 385079 148747 38641 162569 378883 34658 39939 225775
11592 225775 -58873 60521 -70140 -241154 200800 25504 56092 -42915 150899 -31402 99185
11580 -290325 77972 -92815 315443 -165998 194204 117037 1129 105276 215079 29372 51373
11569 51373 174968 69878 -258281 313407 115607 175581 10638 -163673 -75488 50066 278573
11558 278573 271538 193392 -54878 -170607 71084 -14559 -171382 319321 162219 -80464 72123
$$ packed form
11636F1742Q5069l2423J73541A18479a3B13654o6400Q9045a12767a0151j06542
11625a16693G8180B5165O4941J77948a88253P2560B76468q3003F5126b88403J39166
11614a49237M934j15007B68008a31500A89971N9685e52256A60466D7983a93914
11603c1988B44445f1168C91129o050A48747C8641J23928K16314C4658N281J85836
11592B25775e8873F0521g0140j71014B00800B5504L0588d2915A50899c1402I9185
11580b90325G7972i2815C15443a65998A94204p7167A129J04147J09803B9372K2001
11569E1373J23595F9878b58281C13407A15607N9974A0638a63673g5488E0066K28507
11558B78573p035p8146e4878j15729G1084a4559j56823C19321j57102h0464G2123
$$ plain form
11546 -75072 -181882 -97064 258785 343459 11270 -256962 231025 -131276 -290568 264409
11535 88935 -45682 233967 279003 22901 294423 -94565 299893 68531 -172702 155794 205143
11524 205143 65211 236997 4288 158262 -42151 192047 390838 -164257 128551 272670
11514 272670 229757 53490 139454 36379 10188 98030 323384 -119120 69305 132315 203058
11503 203058 -103536 -39441 96052 229997 83725 1115 394216 296812 -6304 -86861 24165
11491 197988 -113049 -285529 -93555 266213 502287 -241319 208862 189100 323643 130240
11480 74542 104513 307206 -21924 97898 35048 187613 -158014 452611 14572 -2510 175806
11468 12511 -195176 342138 -96450 -76114 196538 -2605 183063 -60644 365909 85186 116532
$$ packed form
11546g5072j06810Q4818B58785Q4674A1270b56962B31025a31276j59292B64409
11535H8935d5682B33967M5036B2901K71522i4565B99893F8531a72702A55794M9349
11524B05143F5211J71786D288J53974d2151A92047J98791a64257A28551J44119
11514B72670m2913E3490Q5964C6379A0188Q7842K25354a19120F9305O3010P0743
11503B03058a03536c9441I6052J33945H3725A115L93101r7404f304q0557B4165
11491A97988a13049j72480i3555B66213K36074b41319B08862j9762J34543A30240
11480G4542K9971K02693b1924I7898C5048J52565a58014D52611A4572b510A75806
11468A2511a95176C42138i6450K0336A96538b605A83063f0644C65909H5186L1346
$$ plain form
11457 116532 -123837 248148 31340 220030 45356 142240 116284 160019 -25 237688 -15871
11445 97204 196884 467619 -159881 -72866 105940 114541 15183 122503 57818 88773 66395
11434 66395 156566 -147345 -291425 -294304 -109156 90163 -56001 153381 -364748 455026 -185798
11422 114110 29169 189745 -32699 90270 -327757 -195159 -32469 206115 -445233 -745 -98444
11411 -98444 246481 -67209 -491933 -61849 338177 35105 395335 -248910 -43320 -383535
11401 -383535 -430176 79864 -15354 -105090 88031 -101388 -120619 74778 12877 -26133 -58963
11390 -58963 320900 53179 -46794 104018 25647 233797 154787 78880 -124448 194574 72839
11378 203241 -69595 234544 108076 -191623 272808 23292 132654 117560 203948 167382
$$ packed form
11457A16532a23837B48148C1340J88690D5356R6884k5956M3735b5B37688a5871
11445I7204R9680K70735a59881g2866A05940Q601A5183J07320E7818L0955k2378
11434F6395R0171a47345j44080k879a09156I0163e6001A53381c64748D55026a85798
11422A14110B9169J60576c2699I0270c27757J32598c2469B06115d45233g45r7699
11411i8444B46481f7209m24724f1849C38177C5105L60230b48910d3320l40215
11401c83535m6641G9864a5354q9736H8031a01388j9231G4778A2877b6133l2830
11390e8963C20900E3179d6794A04018B5647K08150p9010p5907a24448A94574G2839
11378B03241f9595B34544A08076a91623B72808B3292J09362j5094Q6388l6566
$$ plain form
11368 167382 -222681 33029 159167 15732 -181082 -144077 -311760 -129949 112248 47066
11357 -329730 -151789 -269604 150991 -238554 -69232 182528 220423 194981 246647 151040
11347 151040 96797 330140 211979 -47762 -148543 -104956 -66759 -254573 226141 208951
11337 208951 236825 -150316 -186865 -155835 53848 -45539 -21143 167474 182604 -549785 -144416
11325 -282999 -243422 -204990 432149 -163044 -237835 -31525 217583 -155810 27725 -53000 -170997
11314 -170997 53565 104665 188763 36232 -170431 207870 282916 15335 56090 -136498 93378
11302 266567 -97886 160618 -252508 -33561 259774 236772 -47727 -134530 -45402 2994 -6052
11290 2801 -78747 -129577 -196090 -400665 -219596 -163560 -106638 -466510 -28423 42685 154006
$$ packed form
11368A67382b22681C3029J26138A5732a81082L7005j67683a29949A12248D7066
11357c29730a51789j17815A50991b38554f9232A82528L7895k5442N1666r5607
11347A51040n4243K33343j18161d7762j00781M3587L8197j87814B26141j7190
11337B08951K7874a50316l6549L1030E3848d5539b1143A67474J5130e49785a44416
11325b82999L9577L8432D32149a63044p4791c1525B17583a55810B7725e3000j17997
11314a70997E3565N1100Q4098C6232a70431B07870P5046A5335M0755a36498I3378
11302B66567i7886A60618b52508c3561B59774k3002d7727q6803d5402B994f052
11290B801g8747n0830o6513k04575J81069N6036N6922l59872b8423D2685J11321
$$ plain form
11279 154006 -258263 -51780 77646 -159228 -199660 -68269 123237 188534 57793 -121776 242215
11267 -117094 129438 41515 -115378 -71197 -84935 292383 97946 -105802 -137694 18615 -76433
11255 33831 134044 128539 4443 -362016 -149876 74005 37113 109573 -175188 -50205 64909
11243 166662 86211 107393 -101154 -112907 106396 -36397 -302645 -15792 83769 -94674 176471
11231 -504981 -187081 89697 -236382 94892 140347 -183702 104915 119647 5158 -17168 -125151
11220 -125151 -2593 -124090 -238640 -149757 74458 109135 166147 -17926 228420 -234572 21231
11208 167704 87466 -524462 362284 22384 32646 -279849 -98804 55016 -80538 -200156 -124360
11197 -124360 -187361 -62473 -324709 -125038 33630 -194541 50803 -301852 74677 -84451 -62118
$$ packed form
11279A54006b58263e1780G7646a59228m0432f8269A23237O5297E7793a21776B42215
11267a17094A29438D1515a15378M4181j3738B92383I7946a05802l1892A8615g6433
11255C3831J00213n505D443c62016a49876G4005l6892P2460a75188e0205F4909
11243A66662q0451K1182a01154j1753A06396c6397k66248a5792H3769i4674A76471
11231e04981a87081H9697b36382I4892M5455a83702A04915J4732E158a7168j07983
11220a25151b593j21497j14550Q8883G4458L4677N7012a7926B28420b34572B1231
11208A67704q0238e24462C62284B2384J0262b79849i8804E5016h0538j19618P5796
11197a24360o3001f2473k62236a25038C3630a94541E0803c01852G4677h4451K2333
$$ plain form
11186 -62118 -89725 -287606 -293264 -74261 -220417 236215 -331004 -242587 -2489 37331 68138
11175 68138 330994 -293404 114935 41772 -145091 55503 -245426 -91931 346801 -63722
11164 -65101 133251 -63136 -75581 22378 -138037 -77827 -158579 426577 -100768 -311565 24908
11152 -158134 203279 178442 -135457 71562 -48136 211213 -2513 -46503 176769 24674 -254662
11140 -327949 31239 202955 -54920 48421 -194915 120285 -293456 75184 160790 -129453
11129 93373 340623 75900 64793 -234737 -42622 238964 200013 288840 -24508 -299357 131187
11117 73725 -132288 8921 -144036 198901 -111516 188569 -27887 -23614 27100 -45519 67400
11105 -42190 49961 361113 310964 -91500 49236 227197 167742 188733 318352 264653 63601
$$ packed form
11186f2118k7607j97881n658g4261j46156B36215c31004Q8417b489C7331L0807
11175F8138K62856b93404A14935D1772a45091E5503b45426i1931C46801f3722
11164f5101A33251f3136j2445B2378a38037O0210q0752D26577a00768k10797B4908
11152a58134B03279k4837a35457G1562d8136B11213b513m3990A76769B4674b54662
11140c27949C1239J71716e4920D8421a94915A20285b93456G5184Q5606a29453
11129I3373K47250G5900j1107b34737d2622B38964l8951Q8827b4508k74849A31187
11117G3725a32288H921a44036A98901a11516A88569b7887M273B7100d5519F7400
11105d2190D9961L11152n0149i1500D9236J77961n9455K0991J29619n3699F3601
$$ plain form
11093 331932 -25166 296342 277390 170790 184448 -12442 221709 235989 226934 223490 380117
11082 380117 -14922 160390 123968 230723 232221 84485 199015 163517 244747 339512 723402
11071 723402 447355 135513 252440 328937 492556 224238 8923 345451 434192 203142
11060 649812 796801 706787 318282 721067 631180 596228 455972 180176 734557 463392
11050 463392 709626 486047 638292 976934 644745 506817 727074 309023 554162 602103
11040 602103 545069 820096 569668 957612 859670 501458 520410 631236 525579 408353
11030 408353 814388 891136 664279 450683 891668 644769 270405 607190 614469 720114
11020 720114 518230 447420 588570 846455 675393 690464 555077 487222 515316 462379
$$ packed form
11093C31932b5166B96342j8952j06600J3658a2442B21709J4280r055l444J56627
11082C80117a4922A60390l6422J06755J498H4485J14530l5498Q1230R4765L83890
11071G23402k76047A35513J16927P6497J63619B24238H923L36528Q8741B03142
11060F49812J46989r0014C18282M02785q9887l4952j40256A80176N54381k71165
11050D63392K46234k23579J52245L38642l32189j37928K20257C09023K45139M7941
11040F02103n7034K75027k50428L87944r7942l58212J8952J10826j05657j17226
11030D08353M06035P6748k26857k13596M40985k46899B70405L36785P279J05645
11020G20114k01884p0810J41150K57885j71062J5071j35387o7855K8094n2937
$$ plain form
11010 462379 576354 836946 648196 629367 618206 626581 771391 611766 435827 733147
11000 733147 828126 550204 816612 675151 718551 777112 485735 928667 550865 955653
10990 955653 736387 883007 795482 598690 615989 950000 872379 900779 1245452 1055303
10980 1055303 861904 1547619 1163246 1660073 1537922 2101003 2187322 2613346 2164781 2380921
10970 2380921 2356098 2105282 2028626 1977183 1991616 1957698 1545543 1603835 1716974 1629238 1375767
10959 1375767 1465633 1728391 1735839 1652013 1468195 1453068 1170340 878728 1355894 849082
10949 849082 863767 727600 467754 464157 278949 132884 132202 313566 -77216 220829 154643
10938 154643 155749 464940 17858 365398 121121 113936 203115 274755 185835 121311 67942
$$ packed form
11010D62379J13975K60592j88750j8829j1161Q375J44810j59625j75939K97320
11000G33147R4979k77922K66408j41461M3400N8561k91377M42932l77802M04788
10990I55653k19266J46620q7525j96792J7299L34011p7621K8400L44673j90149
10980A055303j93399O85715l84373M96827j22151N63081Q6319M26024m48565K16140
10970B380921k4823k50816p6656n1443J4433l3918m12155N8292J13139q7736k53471
10959A375767Q9866K62758P448q3826j83818j5127k82728k91612M77166n06812
10949H49082J4685j36167k59846l597j85208A32884o82J81364g7216B20829o6186
10938A54643J106L09191A7858L47540A21121p185Q9179P1640q8920o4524n3369
$$ plain form
10927 67942 209390 100415 54580 59445 83412 48421 -43688 -54053 25697 34553 317905
10916 317905 245107 -350523 -26732 288315 131909 -23199 -124917 98887 113810 -59915 -23030
10904 -96216 82526 -22197 -87558 388452 -92635 -108324 9939 109279 286907 38028 -69534
10892 63024 161237 72848 -94047 116935 29548 15930 -14022 150448 52812 136009 -108999
10880 -473027 5795 -225418 -274915 -19292 21794 -167478 -43139 -221977 176575 -16178 -70225
10869 -70225 134269 -75372 45888 321900 -38067 -217347 -10487 17908 -98737 65648 30581
10857 -70470 54746 230061 -61675 155809 144479 381533 170452 -164741 -198238 -271371 -294031
10846 -294031 90328 226417 125158 -54610 -359824 46036 -127520 -82133 -398569 -204802
$$ packed form
10927F7942J41448A00415m5835M865K3967l4991d3688j0365B5697Q856K83352
10916C17905p2798c50523b6732B88315A31909b3199j01718I8887J4923e9915b3030
10904i6216H2526b2197o5361C88452i2635j5689I939R9340J77628C8028f9534
10892F3024R8213G2848i4047A16935B9548j3618a4022A50448E2812Q3197a08999
10880d73027E795b25418m9497a9292B1794a67478d3139j78838A76575a6178n4047
10869g0225A34269g5372D5888K76012c8067j79280a0487A7908i8737F5648C0581
10857g0470E4746J75315f1675A55809j1330K37054A70452a64741l3497p3133k2660
10846b94031I0328J36089j01259e4610l05214D6036a27520M5387l16436J93767
$$ plain form
10836 -204802 -32645 -40383 -154576 110342 245508 -47406 -119687 -146878 -204083 -38954 -145806
10825 -145806 -36137 -323819 -170336 -297581 -268814 173274 90443 -190251 -33625 -187795
10815 -187795 44983 150555 -85161 103933 116381 -1842 -242043 -443818 203283 10573 -170538
10803 -21457 -147744 106142 -168303 85473 57440 312273 -109789 70021 -83462 52336 116651
10792 116651 -334632 49205 133451 -221968 -138561 -96958 -82083 -33339 -152663 -215318 -214341
10781 -214341 63762 -163603 -10282 -82425 -72133 249635 100703 100264 -39265 193700 76120
10769 269420 193848 244863 141896 163545 -52076 37332 86549 136749 -6798 -539159 36821
10757 309239 -115415 33159 78943 -87249 -44805 -31084 -179085 81708 137311 -133145 -102253
$$ packed form
10836b04802c2645p738j14193A10342J35166d7406p2281k7191n7205c8954j06852
10825a45806c6137k87682J53483j27245K8767A73274q2831a90251c3625j54170
10815a87795D4983J05572h5161A03933J2448a842k40201k01775B03283A0573a70538
10803b1457j26287A06142a68303H5473k8033K54833a09789G0021h3462E2336O4315
10792A16651c34632D9205Q4246b21968Q3407M1603J4875c3339j19324o2655R77
10781b14341F3762a63603a0282p2143J0292B49635A00703m39c9265A93700G6120
10769B69420p5572N1015j02967K1649e2076C7332M9217N0200f798n32361C6821
10757C09239a15415C3159M5784h7249M2444J3721j48001H1708N5603a33145L0892
$$ plain form
10746 -102253 -339481 -96334 20953 -155626 -127634 -196286 -152238 -290629 83240 25547 -34405
10734 255801 50404 -131989 68142 -8624 180233 -69336 28593 188055 -110273 -80045 -145098
10723 -145098 -75819 -385078 -162081 -425814 -169631 146069 -247243 -179625 -195352 161492
10712 -140036 -270036 124262 -124320 -430232 -128899 -354203 -200918 224445 -129630 63804
10701 -72396 -143460 -237942 172946 127267 98425 -186329 19916 146092 67619 -5350 -124445
10690 -124445 -325032 14807 -123226 -165846 123969 -179846 171131 -55415 -146048 -271829
10680 -271829 -63157 -232748 -113793 11576 226346 -271789 -98931 -41876 264214 11567
10669 -22941 -206239 12261 31226 -278066 68594 -20130 -202534 92664 257368 13004 292582
$$ packed form
10746a02253k37228i6334B0953a55626K7992o8652M4048j38391H3240B5547c4405
10734B55801E0404a31989F8142h624A80233f9336B8593J59462a10273L0228o5053
10723a45098O9279l09259a62081k63733a69631A46069b47243O7618j5727A61492
10712a40036j30000A24262a24320l05912a28899k25304J53285B24445a29630F3804
10701g2396p1064r4482A72946m5679k8842a86329A9916J26176F7619e350j19095
10690a24445k00587A4807a23226m2620A23969a79846A71131e5415r0633j25781
10680b71829f3157j69591a13793A1576K14770b71789i8931d1876B64214A1567
10669b2941j83298A2261J8965b78066F8594b0130j82404I2664J64704A3004K79578
$$ plain form
10658 292582 44815 90191 306987 178304 -56312 -65608 -137122 -70531 -131970 -331236 -117214
10646 -167 131148 129412 -9172 -268336 -144866 -200483 -83374 -224345 -34477 -378427 108194
10634 -18119 160061 -241831 51596 102783 -354036 33148 -12686 -85779 48000 -218715 -328433
10623 -328433 257412 -52189 108708 16771 -140999 -179538 -169592 -150287 -237948 -102775 -133311
10612 -133311 153143 181486 62033 -113501 -150108 -217390 455807 -48604 -51327 -204765 252598
10600 -181565 -404982 -13698 -15981 24143 8848 -215448 73533 96746 -179873 136290 59748
10588 -251744 312682 -66865 -18068 -137806 301765 -145852 -102375 138505 -146466 -203760
10578 -203760 154769 17562 273984 -100222 -61140 -165243 -244394 -365984 -41901 -105037
$$ packed form
10658B92582D4815M5376K16796j28683e6312r296p1514O6591o1439j99266a17214
10646a67A31148j736i172k59164J23470n5617h3374j40971c4477l43950A08194
10634a8119A60061b41831E1596N1187c54036C3148a2686p3093D8000b18715j09718
10623c28433B57412e2189A08708A6771a40999l8539R946J9305q7661a02775l0536
10612a33311A53143K8343F2033a13501l6607o7282D55807d8604k723j53438B52598
10600a81565k23417a3698k283B4143H848b15448G3533K3213a79873A36290E9748
10588b51744C12682f6865a8068j19738C01765a45852M3477A38505a46466n7294
10578b03760A54769A7562K56422a00222L9082j04103p9151j21590d1901o3136
$$ plain form
10568 -105037 80056 -71375 -74140 -152739 -153443 22240 220581 -481591 -273217 139133 -102425
10556 149379 440335 140561 129661 143160 93559 20532 -15411 -30315 -225700 -170536 56410
10544 -156538 -404722 -859 -44911 96464 -414242 -158380 -28695 -215431 -124589 375263 282329
10533 282329 -330270 -171584 -73556 92069 -229359 4898 71687 53937 -53794 -128685 -76397
10522 -76397 341221 -85201 -143015 -132726 330213 285199 147916 -313396 73680 -133303 -184188
10511 -184188 -74115 -384961 383176 1757 151288 -464187 103159 -269040 -75803 306322
10500 -77634 -204874 191438 -227959 -382203 29324 -4035 -333816 8465 240101 97517 -254802
10488 -171622 144671 315354 -221883 200969 -70722 175083 367839 706762 305433 209097
$$ packed form
10568a05037H0056g1375k765p8599p04B2240J98341d81591K08374A39133a02425
10556A49379K90956A40561j0900J3499m9601B0532a5411j4904j95385N5164E6410
10544a56538k48184h59m4052I6464d14242a58380b8695j86736R0842C75263r2934
10533B82329c30270J58686g3556I2069b29359D898O6789j7750e3794p4891N2288
10522g6397C41221h5201n7814J0289C30213m5014j37283c13396G3680a33303n0885
10511a84188g4115l10846C83176A757J49531d64187A03159b69040g5803C06322
10500g7634j27240A91438b27959j54244B9324d035l29781H465K31636I7517b54802
10488a71622A44671J70683b21883B00969g0722A75083J92756L38923C05433r6336
$$ plain form
10478 209097 86555 204762 75573 148464 -109012 -20044 11823 125670 289022 -166417
10467 -425923 109627 12031 -289725 -434546 -157251 134122 -146286 108092 -293036 -268552
10457 -268552 -146286 -51800 124625 119393 80934 219117 157207 -137059 -275427 43020 -28733
10445 194995 -45532 -82964 60932 -100890 130578 -289938 262031 35062 -195533 -34406
10434 146995 188818 -47623 302082 -71666 -232209 -191909 28661 -111061 -88131 37250 -17179
10422 -219947 85789 -37065 156314 240144 -39178 -100388 -53086 -120869 -55551 -206024 24820
10410 142848 146771 -13302 116287 264606 -160925 142080 -89486 156950 -221317 -123951
10400 -123951 -76790 107285 -120 -100183 -145403 16719 249567 57139 -98788 -22347 54010
$$ packed form
10478B09097H6555J18207G5573P2891a09012b0044A1823J13847J63352a66417
10467d25923A09627A2031b89725j44821a57251A34122a46286A08092b93036K4484
10457b68552J22266e1800A24625n232l8459J38183o1910a37059j38368D3020b8733
10445A94995d5532l7432F0932a00890A30578b89938B62031C5062a95533c4406
10434A46995M1823d7623C02082g1666j60543M0300B8661a11061K2930C7250a7179
10422b19947H5789c7065A56314Q3830c9178o1210M7302o7783e5551j50473B4820
10410A42848L923a3302A16287J48319a60925A42080h9486A56950b21317R7366
10400a23951M7161A07285a20j00063m5220A6719K32848E7139i8788b2347E4010
$$ plain form
10388 268997 342406 233656 119057 -174378 157371 -121740 69063 -17501 183069 -92023
10377 99404 225150 290167 378669 27315 130271 214056 248823 449101 2847 556033 422172
10366 422172 353214 573319 423852 295808 196725 392392 -86874 36397 181703 147703
10356 147703 545316 253128 440329 269705 261564 498460 232905 337147 108323 479256
10346 479256 -17254 308011 127871 197346 334203 142865 319276 446051 -33137 208898
10335 234236 442951 -44036 42496 59106 107669 472644 -128347 225157 36796 -100571
10324 66441 132060 123599 268429 -79760 148297 125179 -27358 351313 -11015 231485 -127139
10312 157515 -38299 -248946 207567 -160605 -227750 -50032 -77322 -213351 108160 -115102
$$ packed form
10388B68997P3409j08750j14599a74378A57371a21740F9063a7501A83069i2023
10377I9404J25746O5017Q8502B7315J02956Q3785L4767K00278B847N53186j33861
10366D22172o8958K20105j49467j28044r9083J95667h6874C6397J45306l4000
10356A47703L97613B53128J87201j70624q141K36896B32905J04242A08323L70933
10346D79256a7254C08011A27871O9475J36857A42865J76411J26775c3137B08898
10335B34236K08715d4036D2496J6610M8563L64975a28347B25157C6796a00571
10324F6441O5619q461J44830g9760A48297k3118b7358C51313a1015B31485a27139
10312A57515c8299k10647B07567a60605o7145e0032k7290j36029A08160a15102
$$ plain form
10301 255005 -295277 449519 -119531 -93478 -60502 85792 -152213 -91707 -79851 351015
10290 -102137 -161391 -187989 110659 73438 -18570 -83777 -100926 -53559 22536 41337 -69234
10278 -4140 -91186 76598 271797 183979 205796 -140715 -234381 79272 140102 56458 17254
10266 124494 118889 238818 -27017 -263467 118258 342330 315963 274484 307469 379118 283616
10255 283616 118568 379346 169835 291747 63534 42303 18679 262104 -51218 -100768
10245 -100768 74956 -195953 126231 -186653 -152041 -179125 1548 -184122 -393836 367521
10234 148996 -329558 15550 147532 165393 -118130 -165131 132909 -69155 -23216 4406 -235779
10222 -250574 -140839 35501 -28255 -27293 -55486 113371 -234011 -10885 -209764 4256 -183359
$$ packed form
10301B55005b95277D49519a19531K6053L2976H5792a52213O0506J1856C51015
10290a02137n9254k6598A10659l7221a8570o5207j7149M7367B2536J8801f9234
10278d140q7046G6598J95199q7818K1817a40715r3666G9272O0830E6458A7254
10266A24494n605J19929b7017k36450A18258K24072k6367m1479L2985P1649r5502
10255B83616A18568K60778A69835J21912F3534k1231A8679K43425e1218m9550
10245a00768G4956a95953A26231a86653L4612k7084A548a84122k09714C67521
10234A48996c29558A5550J31982J7861a18130m7001A32909f9155b3216D406b35779
10222b50574J09735C5501b8255R62k8193A13371b34011a0885j98879D256a83359
$$ plain form
10210 -264452 -280442 8198 -70345 119682 -296528 70174 -319150 -18243 212612 25410 16155
10199 16155 -21853 -83693 -239855 -181806 86239 -121826 -21106 128085 242682 -39407 -114616
10188 -114616 -77314 -30325 -143971 12591 71081 -154088 104810 -78364 -180182 -18307 18743
10176 76427 -100748 235418 -163323 -152174 -83488 -203015 33655 79951 73413 163169 -221857
10164 -63384 59937 -157308 -319402 14869 -418456 74677 -251097 -131020 60471 -234528
10153 -17595 -215781 149703 -139169 -385641 100267 66702 -211541 -162890 -157993 -76813 -46600
10142 -46600 -10250 157168 64796 -228921 98053 -156306 199123 -27340 -272170 168617
10131 355152 32444 236229 -26940 -93671 -154342 -186618 3370 -90109 6823 178115 425327
$$ packed form
10210b64452j5990H198g0345A19682b96528G0174c19150a8243B12612B5410r255
10199A6155b1853o1840j56162N8049H6239a21826b1106A28085J14597c9407p5209
10188a14616L7302c0325j13646A2591N8490a54088A04810g8364j01818a8307A8743
10176G6427a00748B35418a63323J1149O8686j19527C3655M6296o538Q9756b21857
10164f3384E9937a57308j62094A4869d18456G4677b51097J20077F0471b34528
10153a7595j98186A49703a39169k46472A00267l3565b11541M8651M897g6813L0213
10142d6600a0250A57168F4796b28921I8053a56306A99123b7340k44830A68617
10131C55152C2444K03785b6940o6731o0671l2276C370i0109F823J71292K47212
$$ plain form
10120 425327 -274303 -53201 -73148 -88749 -175980 -216709 46411 -494704 -136999 -138548 -384336
10109 -384336 -116022 -255935 -52569 27882 -285344 146201 -141777 -260400 -421711 -305532
10099 -305532 -225039 -79144 -306293 235142 -174181 59102 -17052 -126116 -305900 -24269
10088 79067 -22794 -247480 208258 -334568 -46633 31259 -121786 -254279 154468 -77964
10077 -248572 -262556 -68809 256301 -442217 25172 -183880 244994 248060 -85352 -204338 -319538
10066 -319538 -290815 -205065 40326 -16454 327926 111624 72635 -365677 151311 32932 -16177
10054 -74649 -464826 -296652 -96759 -229556 -61389 -394060 -1352 126562 459740 -246184
10043 52070 -352903 12405 -408766 -39606 203604 -81814 -109386 -58678 -84879 176426 119905
$$ packed form
10120D25327b74303e3201j9947j5601q7231m0729D6411d94704a36999j549k45788
10109c84336a16022j39913e2569B7882b85344A46201a41777j18623j61311J16179
10099c05532Q0493g9144k27149B35142a74181E9102a7052j09064j79784b4269
10088G9067b2794k24686B08258c34568d6633C1259a21786j32493A54468g7964
10077b48572j3984f8809B56301d42217B5172a83880B44994L066h5352j18986j15200
10066c19538K8723Q5750D0326a6454C27926A11624l8989c65677A51311C2932a6177
10054g4649l90177J68174i6759j32797f1389l32671a352A26562L33178b46184
10043E2070c52903A2405d08766c9606B03604h1814k7572N0708k6201A76426n6521
$$ plain form
10032 119905 -131184 -30191 101294 40648 -304208 -113573 -117021 151780 195156 -136189
10021 205687 -16828 79760 -263706 -295378 66940 63297 196686 -30737 82195 7967 -472865
10009 14944 -398561 10653 -56421 -121004 134231 -41035 68080 125276 -112950 201760 16222
9997 -155048 -79747 -277069 -21885 2818 56828 -302293 -336072 116433 -101126 -2920 -138030
9986 -138030 -40376 110319 44116 -13717 -332856 1035 -3682 107417 -208861 220746 -154233
9974 -62838 -95737 -177570 -54098 36309 -81041 113082 -31139 -90176 66659 220735 55125
9962 -263836 27640 -184509 -126372 76505 117356 -21844 -333420 200543 29995 125089 20464
9950 77000 128795 -363676 -10704 -151988 239866 183652 -193717 93039 -249114 -486682 -290461
$$ packed form
10032A19905a31184c0191A01294D0648c04208a13573l448A51780M3376a36189
10021B05687a6828G9760b63706l1672F6940l643J33389c0737H2195G967d72865
10009A4944c98561A0653e6421o4583A34231d1035F8080N7196a12950B01760A6222
9997a55048P5301j97322b1885B818N4010c02293l3779A16433a01126b920j35110
9986a38030d0376A10319D4116a3717l19139A035c682A07417b08861B20746a54233
9974f2838l2899q1833e4098C6309h1041A13082c1139n9037F6659J54076E5125
9962b63836B7640a84509N8137G6505M0851b1844l11576B00543B9995R5094B0464
9950G7000N1795c63676a0704j41284B39866n6214a93717I3039b49114k37568J96221
$$ plain form
9939 -290461 -230908 -150359 -239082 34490 35970 -59668 147900 -410781 110088 -37192 13363
9927 -148990 45764 -187208 -102770 -104531 -20826 -27321 -147429 -1282 -82432 -110881 -333467 82976
9914 -156765 38766 -200209 -418381 -144943 16638 -69882 -238476 224566 -47453 21656 -156874
9902 -419510 114117 84067 -230058 -361690 -34283 -149593 -194650 -40601 -125083 -4837 5630
9890 -350492 -227748 235913 202172 -324960 -74257 -83539 -10999 -303161 134916 -116490 274841
9878 306765 92839 -291003 -167265 -55310 -186377 -7830 -155418 270738 -265857 -102449
9867 136448 -163014 29602 -189162 34594 -6399 165826 -87650 -58126 120410 -164576 -63358
9855 195908 -136724 274698 91652 86100 127011 -20177 -446661 -184999 -220597 51486 -128387
$$ packed form
9939b90461N9553Q0549q8723C4490J480e9668A47900d10781A10088c7192A3363
9927a48990D5764a87208Q4438j761b0826o495j20108a282q1150k8449k22586H2976
9914a56765C8766b00209k18172a44943A6638f9882j68594B24566d7453B1656a56874
9902d19510A14117l0050b30058j31632c4283j15310m5057d0601q4482d837E630
9890c50492J22744B35913l3741c24960g4257r282a0999k92162A34916a16490B74841
9878C06765I2839b91003J23738e5310j31067g830j47588B70738b65857a02449
9867A36448a63014B9602a89162C4594f399A65826h7650K9524A20410a64576f3358
9855A95908a36724B74698I1652n552M0911b0177m26484a84999l5598E1486a28387
$$ plain form
9843 -298114 -142085 -314206 -30955 -188124 -115356 47493 74458 -11227 130250 170576 -115184
9831 -128463 -500135 -93827 -78473 -180823 -238825 104167 -70166 -321958 211577 -95219 159081
9819 35488 4903 -138443 -28517 31838 -408932 37329 -87160 -284644 -421523 37250 633470
9808 633470 73177 237179 -303591 -55468 -21386 -471290 -184650 -142591 93473 98857 -245691
9796 -260169 -287620 -27966 -190373 -210099 270173 42837 -196967 -48196 -424177 -183450 -398643
9785 -398643 -27913 -441148 -338931 203617 -170255 -22808 -5063 -228307 313118 66825 88145
9774 88145 160455 149283 -92416 -156149 -141098 -101346 56313 35307 -149853 -277254 -209351
9763 -209351 -108495 278906 -239551 -1874 -119437 -36498 212568 28440 -35365 -107146 272197
$$ packed form
9843b98114a42085j72121c0955j57169P2768D7493K6965a1227A30250M0326a15184
9831a28463l71672i3827J5354j02350n8002A04167g0166k51792B11577i5219A59081
9819C5488D903a38443b8517C1838d08932C7329h7160j97484j36879C7250N96220
9808F33470G3177J64002c03591e5468b1386m49904a84650M2059I3473N384b45691
9796b60169k7451b7966j62407j9726B70173D2837a96967d8196l75981a83450k15193
9785c98643b7913m13235J02217B03617a70255b2808e063k23244C13118F6825K1320
9774H8145P2310j1172i2416o3733J5051L9752E6313k1006a49853j27401O7903
9763b09351J00856B78906b39551a874j17563c6498B12568B8440c5365p1781B72197
$$ plain form
9751 258343 -34970 -40794 6974 259543 -43389 -457316 -286747 230737 -69457 -116758 -164194
9740 -164194 -475469 265369 -194755 183754 -65902 48204 61197 -60580 77684 -171809 126540
9728 -115708 -7086 -337000 -260094 -6517 -191915 75634 -107118 -80717 -89294 -173233 -190855 139815
9715 239685 143707 31227 -393933 361246 -109860 32813 62779 26594 -106978 -122442 5590
9703 124921 -397379 -118589 -39926 87516 44475 -218487 71365 -100095 99975 73973 -125511
9691 -13446 -85483 -192079 166567 52727 4794 10312 -163628 18859 -8897 100030 20142 -52159
9678 -236104 -197867 -240677 15778 -327803 -102686 -305412 65892 249679 240008 -151916 -236057
9667 -236057 10671 -143795 1555 -199222 148251 -227171 63326 134606 -280448 -266720 -20169
$$ packed form
9751B58343c4970n824F974K52569d3389m13927J70569B30737f9457m7301m7436
9740a64194l11275B65369a94755A83754f5902D8204J2993f0580G7684a71809A26540
9728a15708g086l29914P6906f517j85398G5634a07118K6401q577q3939j7622A39815
9715B39685r5978C1227c93933C61246a09860C2813K9966B6594a06978j5464E590
9703A24921c97379a18589c9926H7516m3041b18487G1365a00095I9975k6002a25511
9691a3446p2037j06596A66567E2727D794N518a63628A8859h897A00030B0142e2159
9678b36104L8237m2810A5778c27803a02686k02726F5892J83787r671a51916q4141
9667b36057A0671a43795A555a99222A48251b27171F3326P1280b80448J3728b0169
$$ plain form
9655 96755 -218698 -158679 -221464 -296748 -69801 33721 183504 -75847 -175228 80553 -188541
9643 40961 300523 63581 -115294 -372389 -424570 -68422 -133492 -323318 105632 -105826 -124520
9632 -124520 -191825 -110864 56832 270492 -101991 19327 -89278 201827 32049 -180147 -393433
9621 -393433 -17689 -245695 -161932 -18557 -31749 -23123 79395 65090 -179521 -189329 -191100 114663
9608 221019 -38400 2285 12513 -29196 -88545 -56759 55985 -219643 -243302 48271 -134245
9596 165134 -176888 -23728 -352027 58453 -219543 73838 43648 -192191 -72120 -420124 -76509
9584 -187045 -62652 -331960 -111740 103814 -396869 49396 -87834 -223190 -116294 -241244
9574 -241244 -18883 16278 -160420 -185828 -99956 -354159 88381 -245031 104460 -59539 -72423
$$ packed form
9655I6755b18698O0019o2785p5284f9801C3721J49783g5847r9381H0553a88541
9643D0961K59562F3581a15294k57095n2181f8422o5070j89826A05632a05826j8694
9632a24520o7305Q0961E6832K13660a01991A9327h9278B01827C2049a80147k13286
9621c93433a7689k28006Q3763a8557j3192Q626G9395j4305a79521r808j771A14663
9608B21019c8400B285J0228b9196n9349L1786E5985b19643k3659D8271a34245
9596A65134a76888b3728l28299E8453b19543G3838l0190a92191g2120l48004g6509
9584a87045f2652k69308a11740A03814c96869D9396h7834j35356J06896j24950
9574b41244a8883A6278a60420k5408Q5872k54203H8381b45031A04460e9539j2884
$$ plain form
9563 -72423 -147885 -61742 -123048 -502853 -89683 -22175 140253 -18792 -77038 -287146 -189965
9552 -189965 -202668 -77272 -129244 97768 -54076 -22966 10275 9844 52813 16340 12646 88151
9540 88151 -320684 18718 76329 -8161 -101920 95329 -362498 89823 35491 -94263 209599
9528 -82271 -328194 4126 50015 -27528 18176 -545263 -133746 -295712 135684 -124383 -159747
9517 -159747 -540646 -437894 -8745 -49650 -204609 159458 71914 -109954 -270647 -62148 -170592
9506 -170592 11943 -170785 164202 -77793 48981 -248516 -47541 -133561 150200 28165 195415
9495 195415 -305226 -5627 -123497 -99919 46654 -53167 -265856 -118632 -223993 52483 -16337
9483 131933 22843 120113 168902 65298 90600 -299615 64468 -80258 -163000 -78465 -131490
$$ packed form
9563g2423p5462f1742o1306l79805h9683b2175A40253a8792n8246k10108R7181
9552a89965j2703g7272n1972I7768e4076b2966A0275m31M2969A6340l694P5505
9540H8151c20684A8718N7611h161r3759I5329c62498H9823C5491i4263B09599
9528h2271k45923D126M5889b7528A8176e45263a33746j61966A35684a24383l5364
9517a59747l80899J02752h745m0905j54959A59458G1914a09954j60693f2148j08444
9506a70592A1943a70785A64202g7793D8981b48516d7541q6020A50200B8165J67250
9495A95415c05226e627j17870K3578D6654e3167k12689a18632j05361E2483a6337
9483A31933B2843R7270M8789F5298K5302b99615F4468h0258q2742g8465n3025
$$ plain form
9472 -131490 -41764 -44297 -195836 -265085 -406631 74945 -94876 64409 21768 -93194 48393
9460 175756 209223 -126496 87787 -12051 107806 -223626 272886 -31410 67755 -149095 -281150
9449 -281150 321506 -21504 122191 -45950 -72284 160531 320772 -30215 -13258 213997 30920
9437 -365403 -123393 -75675 83715 -292374 -24658 10862 56927 226606 4214 -155530 -207274
9426 -207274 -29481 117106 -8015 -130720 225467 154941 20205 -429796 -268455 -232808 -96117
9414 -49504 -162710 -234924 -209594 -106101 126455 260181 260212 -8357 -187014 -32664 -288821
9403 -288821 -213773 -232400 153570 -246132 46425 18950 -56660 -69603 -30729 -259424 396640
9391 141215 129252 -351609 -451331 49178 319131 20585 58708 58106 90800 326395 -113875
$$ packed form
9472a31490d1764k533j51539o9249j41546G4945i4876F4409B1768i3194D8393
9460A75756L3467a26496H7787a2051A07806b23626B72886c1410F7755a49095j32055
9449b81150C21506b1504A22191d5950k6334A60531J60241c0215a3258B13997C0920
9437c65403a23393M7718H3715b92374b4658A0862M6065J69679D214a55530n1744
9426b07274b9481A17106h015j22705B25467p0526B0205d29796J61341L5647i6117
9414d9504j13206p2214K5330J03493A26455J33726L1h357j78657c2664k56157
9403b88821P5048j8627A53570b46132D6425A8950e6660j2943c0729k28695C96640
9391A41215j1963c51609r9722D9178K69953B0585L8123o02L2694K35595a13875
$$ plain form
9379 290426 -163765 251339 133913 87079 145494 -96641 -222496 99141 -70366 -96967 -65843
9368 -65843 -214168 -82847 106850 -310175 -219992 310664 -13807 -105512 23673 -5970 101173
9356 -249832 19255 -64779 -137397 85500 132237 -183034 161222 -215807 221140 -279710 69187
9344 -19571 -220649 -193430 -237454 -191740 160440 30020 -221126 -34360 -230335 -75992 -188362
9333 -188362 -89012 43831 193039 -103633 -380231 -363201 -77404 -146828 -48541 133468 -377123
9321 -102588 115497 -24597 120640 -242459 -74029 -119997 -137285 -228801 97445 -202712 -214201
9310 -214201 -141693 46474 -184798 65329 -288943 -461386 143700 69778 -23697 435639 149411
9298 -54699 34203 -428598 -6663 29459 -359351 -81253 -258906 -173879 184709 -359629 276428
$$ packed form
9379B90426a63765B51339j17426m6834N8415i6641j25855I9141g0366k6601L1124
9368f5843j48325h2847A06850c10175R0183C10664a3807r1705B3673e970A01173
9356b49832A9255f4779p2618H5500M6737a83034A61222b15807B21140b79710F9187
9344a9571k01078K7219m4024M5714A60440C0020b21126c4360j95975g5992j12370
9333a88362h9012D3831J49208a03633k76598J7030g7404o9424d8541A33468c77123
9321a02588A15497b4597A20640b42459g4029m5968j7288r1516I7445b02712j1489
9310b14201P2508D6474a84798F5329b88943j72443A43700F9778b3697D35639A49411
9298e4699C4203d28598f663B9459c59351h1253j77653Q5027A84709c59629B76428
$$ plain form
9286 42762 -332336 109652 -309143 -230554 325930 83228 -217148 -141300 -215914 -308975 -154855
9275 -154855 -328331 -78238 118687 -253112 -108532 -131672 -12635 -77656 -201436 129132
9264 -184685 -199964 -443572 50260 -319787 67936 -60311 -192681 -92185 24997 110388 31592
9252 -102655 4235 28931 -355054 32443 135981 62103 154695 54534 -235128 -121384 -98712
9241 -98712 93113 -113016 29268 -628949 14995 -329430 -7949 -45312 -176298 -230039 -91253
9229 -276296 -47264 -262822 676 112905 -296476 -164060 -233766 -123217 -88595 122630 113941
9218 113941 -547581 36886 -166648 -5149 -81752 -58630 68559 225 -13512 -237520 91444 -162673
9205 -103983 -13159 -106174 153224 -301142 90612 -174921 -28313 137019 -278647 69364 28728
$$ packed form
9286D2762c32336A09652c09143P8589C25930H3228b17148P5848p4614r3061J54120
9275a54855j73476g8238A18687b53112a08532k3140a2635o5021j23780A29132
9264a84685j5279k43608E0260c19787F7936f0311j32370i2185B4997Q5391C1592
9252a02655D235K4696c55054C2443J03538F2103R2592E4534b35128J13744K2672
9241i8712I3113a13016B9268f28949A4995c29430g949l7363j30986n3741i1253
9229b76296d7264k15558F76J12229b96476J32416o9706J10549L4622A22630q689
9218A13941e47581C6886a66648e149p6603K3122F8559B25a3512k24008I1444a62673
9205a03983a3159r3015A53224c01142I0612a74921b8313A37019b78647F9364B8728
$$ plain form
9193 -89927 -92697 -290155 -89438 -183981 67063 -2555 -178348 805 69444 -257187 -47025 -266155
9181 -266155 -69126 226016 9072 -125881 -243577 -157091 -432258 140009 -45519 -194547 24399
9169 121571 274345 284743 -123020 297674 -46304 -73489 65639 -36654 20585 -260754 162244
9157 -102962 -119874 -108134 -258397 118916 -268996 228902 3592 -102873 -90650 95651 -375367
9145 114150 311410 167998 56947 -211694 29308 -71248 99991 121832 -7230 -486317 -26090
9133 193759 -149121 304901 -415444 -75321 -372671 -17477 -124513 14060 82902 60518 114539
9122 114539 -275934 113389 -36833 -75912 88147 178017 -120439 449323 -220194 96477 -199244
9110 -201403 221059 -16721 -308 -145443 57913 -77761 19022 -103096 120586 39291 -91485
$$ packed form
9193h9927k770j97458h9438r4543F7063b555j75793H05O8639b57187d7025k19130
9181b66155f9126B26016I072a25881j17696Q6486k75167A40009d5519j49028B4399
9169A21571J52774J0398a23020B97674d6304k7185F5639c6654B0585b60754A62244
9157a02962j6912J1740j50263A18916b68996B28902C592a02873J2223I5651c75367
9145A14150J97260j43412E6947b11694B9308g1248I9991K1841g230m79087b6090
9133A93759a49121C04901d15444g5321k97350a7477j07036A4060O8842k2384N4021
9122A14539b75934A13389c6833l9079H8147Q9870a20439D49323b20194I6477a99244
9110b01403B21059a6721c08j45135E7913g7761A9022a03096A20586C9291i1485
$$ plain form
9098 29950 -90156 -58592 -38289 155594 -130357 -122490 -183922 7107 -69712 -154202 48763 206383
9086 206383 -174713 -57493 -117538 -285261 -194832 434448 -70370 7658 -65364 311420 -73799
9074 43769 -143645 -34494 -56663 159855 305462 -92736 -182928 -114705 8400 98840 219252
9063 219252 -199088 -100395 91268 -49440 -149765 -329723 -204825 -117042 -95273 125497 44835
9051 -409469 -434572 -362213 -85132 -196663 104247 -84057 -5989 229405 -54786 -221087 71001
9039 -92044 73503 39351 -34505 56830 169756 -242364 -23054 -253793 -188913 194853 -127484
9027 -115092 42358 125830 293811 -358865 92682 -294258 25707 -229185 11364 58053 232621
9016 232621 143661 163084 -185865 -18582 -319071 -202895 -425807 -9148 -152577 -95510 -153169
$$ packed form
9098B9950i0156L1564K0303A55594a30357P867o1432G107f9712q4490D8763J57620
9086B06383a74713e7493o0045j67723R0429D34448g0370G658f5364C11420g3799
9074D3769a43645c4494k2169A59855J45607i2736r0192O8223H400R0440J20412
9063B19252a99088R8693I1268d9440j00325j79958J24898Q7783K1769A25497D4835
9051d09469k5103P2359h5132j11531A04247h4057e989B29405e4786j66301G1001
9039i2044G3503l4152c4505E6830J12926b42364b3054k30739O4880A94853a27484
9027a15092D2358Q3472J67981c58865I2682b94258B5707b29185A1364M6689J74568
9016B32621q8960J9423a85865a8582l00489J16176k22912i148j43429N7067n7659
$$ plain form
9005 -153169 -239665 -87106 -236298 -57427 -42187 -147522 107957 -414278 -138129 177590
8994 130572 -41277 35079 -227190 -173893 -263615 -70946 -274993 27018 117859 -50369 -33571
8983 -33571 111408 58646 -83206 -134030 -47389 -670630 -242808 54462 -49857 -88524 143138
8971 -3764 38304 355043 -293950 54805 -241274 -125898 -331420 -183146 -157388 -17168 14603
8959 -155466 -256239 382366 42337 36277 -154342 -294433 -240158 -123671 143780 155546 -388461
8947 -141084 93483 -144543 -116211 -300903 -193790 190609 22251 -40770 368861 -113280
8936 142794 -105002 263701 337816 166057 208227 263751 -83913 319300 534518 423805
8926 423805 697679 901346 1863645 4041566 7230495 7682790 2594537 1084539 446235
$$ packed form
9005a53169q6496h7106j49192e7427J5240j05335A07957d14278a38129A77590
8994A30572d1277C5079b27190N3297q9722g0946k04047B7018R0841e0369J6798
8983c3571A11408n2762h3206n0824d7389o23241b42808E4462d9857l8667A43138
8971c764C8304L16739b93950E4805b41274J15376k05522J48274K5758a7168A4603
8959a55466j00773C82366D2337o060a54342j40091N4275J16487A43780J1766c88461
8947a41084I3483a44543K8332j84692J07113A90609B2251d0770C68861a13280
8936A42794a05002B63701P4115A66057M2170N5524h3913C19300K15218j10713
8926D23805K73874K03667R62299K177921L188929M52295B594537A084539D46235
$$ plain form
8916 482240 136276 618660 32340 -36488 271546 -34269 -32160 406443 139483 351765 -223996
8904 -153256 -208614 -75884 69979 -75979 132765 259571 214360 98907 51540 98965 116377
8893 116377 78224 -202310 55622 301449 -118762 -108545 200605 55143 36431 -38885 -19172
8881 -87789 -79994 -127303 266645 -72041 -118842 -14618 113599 247118 286231 81298 260369
8870 260369 -37963 -176967 -123064 -116869 -143645 15687 67886 -50482 -171889 -274960 459809
$$ packed form
8916D82240A36276M82384C2340c6488B71546c4269K109D06443A39483K12282b23996
8904a53256n5358g5884F9979g5979A32765J26806m5211I8907m7367M7425J7412
8893A16377l8153b02310E5622K45827a18762J0217B00605E5143j8712c8885a9172
8881h7789P795m7309B66645g2041m6801a4618A13599J33519L9113H1298J79071
8870B60369c7963j39004N3903O195k6776A5687N2199e0482j21407j03071D59809
$$ [...]
##END NTUPLES=NMR SPECTRUM
##END=
