
##TITLE=AC1240__6608823_S6ZJg1XapZ
##JCAMPDX= 6.0         $$ Bruker NMR JCAMP-DX V2.0
##DATA TYPE= NMR SPECTRUM
##DATA CLASS= NTUPLES
##ORIGIN= BRUKER
##OWNER= Administrator
$$ 1.72 TOPSPIN		Version 2.1
$$ 2012-08-01 19:05:48.406 -0500  Administrator@TOPSPIN
$$ Compression mode = diff/dup
##.OBSERVE FREQUENCY= 400.02188249412
##.OBSERVE NUCLEUS= ^1H
##.ACQUISITION MODE= SIMULTANEOUS (DQD)
##.ACQUISITION SCHEME= undefined
##.AVERAGES= 8
##.DIGITISER RES= 22
##SPECTROMETER/DATA SYSTEM= spect
##.PULSE SEQUENCE= zg30
##.SOLVENT NAME= COFFEE_meoh
##.SHIFT REFERENCE= INTERNAL, COFFEE_meoh, 1, 14.98509
##AUDIT TRAIL= $$ (NUMBER, WHEN, WHO, WHERE, PROCESS, VERSION, WHAT)
$$ ##TITLE= Audit trail, TOPSPIN		Version 2.1
$$ ##JCAMPDX= 5.01
$$ ##ORIGIN= Bruker BioSpin GmbH
$$ ##OWNER= Administrator
$$ $$ C:\Bruker\TOPSPIN/data/COFFEE/nmr/AC1240__6608823_S6ZJg1XapZ/10/pdata/1/auditp.txt
$$ ##AUDIT TRAIL=  $$ (NUMBER, WHEN, WHO, WHERE, PROCESS, VERSION, WHAT)
(   1,<2012-08-01 19:05:39.671 -0500>,<Administrator>,<TOPSPIN>,<go>,<TOPSPIN 2.1>,
      <created by zg
	started at 2012-08-01 19:04:33.265 -0500,
	POWCHK enabled, PULCHK disabled,
       configuration hash MD5:
       6B 1B 68 BB D9 2E 58 E2 7F 35 AD 54 07 DF 0E 41
       data hash MD5: 64K
       CA 1B 74 07 23 6D 99 C4 B5 F3 3E 8D 97 B9 6C 76>)
(   2,<2012-08-01 19:05:44.281 -0500>,<Administrator>,<TOPSPIN>,<proc1d>,<TOPSPIN 2.1>,
      <Start of raw data processing
       efp LB = 0 FT_mod = 6 PKNL = 1 PHC0 = 0 PHC1 = 0 SI = 32K 
       data hash MD5: 32K
       2A 31 4A 65 46 3B FD CB 60 72 DE 00 DD DB 1D 01>)
(   3,<2012-08-01 19:05:44.562 -0500>,<Administrator>,<TOPSPIN>,<proc1d>,<TOPSPIN 2.1>,
      <pk PHC0 = 176.0669 PHC1 = 0 
       data hash MD5: 32K
       C1 03 65 55 38 51 23 79 1D 59 FE B3 17 F4 8C 9B>)
(   4,<2012-08-01 19:05:44.640 -0500>,<Administrator>,<TOPSPIN>,<proc1d>,<TOPSPIN 2.1>,
      <abs ABSG = 1 
       data hash MD5: 32K
       5C DB 0D 70 49 ED 9A C5 C8 D5 6F DE 4A 0F B4 A8>)
(   5,<2012-08-01 19:05:44.687 -0500>,<Administrator>,<TOPSPIN>,<proc1d>,<TOPSPIN 2.1>,
      <abs ABSG = 2 
       data hash MD5: 32K
       9C BA 36 80 B7 2E 93 1A A1 5B F4 81 E4 5D 4D 2E>)
(   6,<2012-08-01 19:05:44.718 -0500>,<Administrator>,<TOPSPIN>,<proc1d>,<TOPSPIN 2.1>,
      <abs ABSG = 3 
       data hash MD5: 32K
       3D 50 6B 4C C0 2D 53 ED 89 DE 80 04 17 7E B2 C8>)
(   7,<2012-08-01 19:05:44.750 -0500>,<Administrator>,<TOPSPIN>,<proc1d>,<TOPSPIN 2.1>,
      <abs ABSG = 4 
       data hash MD5: 32K
       A3 88 AE EC 17 A2 CC EB 15 89 26 18 EE 5F 3A A5>)
(   8,<2012-08-01 19:05:44.796 -0500>,<Administrator>,<TOPSPIN>,<proc1d>,<TOPSPIN 2.1>,
      <abs ABSG = 5 
       data hash MD5: 32K
       4F 27 B9 A5 45 3C CD B1 0A A0 BD D4 03 88 AD 70>)
$$ ##END=
$$ 
$$ $$ hash MD5
$$ $$ 13 C6 41 A8 77 F2 36 5A 1C 1B C0 A9 AA 1A D8 68
##$RELAX= 
##$RELAX= 
##$RELAX= 
##$RELAX= 
##$RELAX= 
##$RELAX= 
##$RELAX= 
$$ Bruker specific parameters
$$ --------------------------
##$DU= <C:\Bruker\TOPSPIN>
$$ [...]
150 150 150 150 150 150 150 150
##$TP07= 0
##$TPNAME0= <>
##$TPNAME1= <>
##$TPNAME2= <>
##$TPNAME3= <>
##$TPNAME4= <>
##$TPNAME5= <>
##$TPNAME6= <>
##$TPNAME7= <>
##$TPOAL= (0..7)
0.5 0.5 0.5 0.5 0.5 0.5 0.5 0.5
##$TPOFFS= (0..7)
0 0 0 0 0 0 0 0
##$TUNHIN= 0
##$TUNHOUT= 0
##$TUNXOUT= 0
##$USERA1= <user>
##$USERA2= <user>
##$USERA3= <user>
##$USERA4= <user>
##$USERA5= <user>
##$V9= 5
##$VALIST= <valist>
##$VCLIST= <CCCCCCCCCCCCCCC>
##$VD= 0
##$VDLIST= <DDDDDDDDDDDDDDD>
##$VPLIST= <PPPPPPPPPPPPPPP>
##$VTLIST= <TTTTTTTTTTTTTTT>
##$WBST= 1024
##$WBSW= 4
##$XGAIN= (0..3)
0 0 0 0
##$XL= 0
##$YL= 0
##$YMAX_a= 474819
##$YMIN_a= -618535
##$ZGOPTNS= <>
##$ZL1= 120
##$ZL2= 120
##$ZL3= 120
##$ZL4= 120
##$ABSF1= 14.98509
##$ABSF2= -5.573092
##$ABSG= 5
##$ABSL= 3
##$ALPHA= 0
##$AQORDER= 0
##$ASSFAC= 0
##$ASSFACI= 0
##$ASSFACX= 0
##$ASSWID= 0
##$AUNMP= <proc_prof1d_extract_pilot.lims>
##$AXLEFT= 0
##$AXNAME= <>
##$AXNUC= <1H>
##$AXRIGHT= 0
##$AXTYPE= 0
##$AXUNIT= <>
##$AZFE= 0.1
##$AZFW= 0.1
##$BCFW= 0
##$BC_mod= 0
##$BYTORDP= 0
##$COROFFS= 0
##$CY= 15
##$DATMOD= 1
##$DC= 0
##$DFILT= <>
##$DTYPP= 0
##$F1P= 0
##$F2P= 0
##$FCOR= 0.5
##$FTSIZE= 32768
##$FT_mod= 6
##$GAMMA= 0
##$GB= 0
##$INTBC= 1
##$INTSCL= 1
##$ISEN= 128
##$LB= 0
##$LEV0= 0
##$LPBIN= 0
##$MAXI= 10000
##$MC2= 0
##$MEAN= 0
##$ME_mod= 0
##$MI= 0
##$NCOEF= 0
##$NC_proc= -8
##$NLEV= 6
##$NOISF1= 0
##$NOISF2= 0
##$NSP= 0
##$NTH_PI= 0
##$NZP= 0
##$OFFSET= 14.98509
##$PC= 1
##$PHC0= 176.0669
##$PHC1= 0
##$PH_mod= 1
##$PKNL= yes
##$PPARMOD= 0
##$PPDIAG= 0
##$PPIPTYP= 0
##$PPMPNUM= 2147483647
##$PPRESOL= 1
##$PSCAL= 4
##$PSIGN= 0
##$PYNMP= <proc.py>
##$REVERSE= no
##$SF= 400.02
##$SI= 32768
##$SIGF1= 0
##$SIGF2= 0
##$SINO= 400
##$SIOLD= 32768
##$SPECTYP= <>
##$SREGLST= <1H.CDCl3>
##$SSB= 0
##$STSI= 32768
##$STSR= 0
##$SW_p= 8223.68421052631
##$SYMM= 0
##$S_DEV= 0
##$TDeff= 65536
##$TDoff= 0
##$TI= <>
##$TILT= no
##$TM1= 0
##$TM2= 0
##$TOPLEV= 0
##$USERP1= <user>
##$USERP2= <user>
##$USERP3= <user>
##$USERP4= <user>
##$USERP5= <user>
##$WDW= 1
##$XDIM= 32768
##$YMAX_p= 464306466
##$YMIN_p= -725201
##$CURPLOT= <Network HP LaserJet P1505>
##$CURPRIN= <$Network HP LaserJet P1505>
##$DFORMAT= <normdp>
##$LAYOUT= <+/1D_H.xwp>
##$LFORMAT= <normlp>
##$PFORMAT= <normpl>
##$SURQMSG= 1
$$ End of Bruker specific parameters
$$ ---------------------------------
##NTUPLES= NMR SPECTRUM
##VAR_NAME=  FREQUENCY,     SPECTRUM/REAL,   SPECTRUM/IMAG
##SYMBOL=    X,             R,               I
##VAR_TYPE=  INDEPENDENT,   DEPENDENT,       DEPENDENT
##VAR_FORM=  AFFN,          ASDF,            ASDF
##VAR_DIM=   32768,         32768,           32768
##UNITS=     HZ,            ARBITRARY UNITS, ARBITRARY UNITS
##FACTOR=    0.250966925370066, 1,           1
##FIRST=     8223.43324360094, 93717,        -353393
##LAST=      0,             -76933,          -54832
##MIN=       0,             -725201,         0
##MAX=       8223.43324360094, 464306466,    0
$$ Real data points
##PAGE= N=1
##DATA TABLE= (X++(R..R)), XYDATA
$$ [...]
$$ plain form
19489 41236 31923 -115364 1413 -227728 -105429 -164045 -153819 18121 -248532 118948 37744
19477 160304 -162828 88475 -176214 -43152 28591 -175133 -221077 -9067 -79802 -150848 -125984
19466 -125984 -86343 -94955 128568 77185 -17480 -253348 -146835 18448 305814 -174777 203793
19454 -190930 -124188 23208 -119640 -146560 -165832 -301410 -176560 -26384 -343217 126608
19443 -138402 -93302 -218224 182293 -37697 -22217 122550 -398798 -78976 175772 -89214
19432 -91166 -114910 31285 -236665 47083 -278192 -89895 -115720 94360 -221600 14662 -23632
19420 76659 40466 -31429 -108437 85174 -234309 110300 72910 -221174 152295 -89873 16347
19408 -292322 -263741 86070 265210 -316805 34508 -46442 -42577 -159819 -353146 -203476 -67389
$$ packed form
19489D1236r313a15364A413b27728a05429n8616J0226A8121b48532A18948C7744
19477A60304a62828H8475a76214d3152B8591a75133m5944i067p0735p1046K4864
19466a25984L9641q612A28568n1383a7480k35868J06513A8448K87366a74777B03793
19454a90930O6742B3208a19640k6920j9272j35578J24850b6384l16833A26608
19443a38402M5100j24922A82293c7697J5480A22550c98798g8976A75772h9214
19432i1166k3744C1285b36665D7083b78192h9895k5825I4360b21600A4662b3632
19420G6659l6193c1429p7008H5174b34309A10300l7390b21174A52295h9873A6347
19408b92322K8581H6070J79140c16805C4508d6442L865j17242j93327J49670f7389
$$ plain form
19396 27252 -252116 -28636 -378486 114182 107723 213369 -433812 -249646 105807 -222692
19385 134610 -114885 -305590 -172248 147868 -174575 -347865 178852 -185298 -139412 -80573
19375 -80573 4583 -183495 12890 -34349 -323913 138192 -357565 48371 -137084 -19229 -201953
19364 -201953 -247116 -241130 19290 -41918 -633078 -26811 220773 182763 -75840 105220 -11434
19352 -137467 61109 -329655 145303 -262015 -140923 109284 -106827 -211314 -325565 -26511
19341 -31993 -148211 92999 -100263 -60233 139740 -493884 -171170 147681 152520 -10900 84443
19329 132400 -267283 -155723 135975 -90516 -115773 -270317 -483567 123000 132496 -264113
19318 -35060 -291922 81445 -224344 -242220 -89977 189151 -14976 -14265 152108 82126 -110582
$$ packed form
19396B7252b52116b8636l49850A14182o459J05646d33812J84166A05807b22692
19385A34610a14885j90705J33342A47868a74575j73290A78852a85298M5886N8839
19375h0573D583a83495A2890c4349k89564A38192c57565D8371a37084a9229j82724
19364b01953m5163N986A9290d1918n91160b6811B20773l8010g5840A05220a1434
19352a37467F1109c29655A45303b62015J21092A09284a06827j04487j14251b6511
19341c1993j16218I2999a00263M0030A39740d93884a71170A47681M839a0900H4443
19329A32400b67283J11560A35975i0516k5257j54544k13250A23000R496b64113
19318c5060k56862H1445b24344j7876h9977A89151a4976P11A52108o9982a10582
$$ plain form
19306 -142017 -118666 -337912 -144093 -505095 -141238 56392 20700 -156234 -10116 -156426
19296 -156426 -66446 47034 -235143 137417 115651 -297767 -154303 -109486 -124553 -107875 -61466
19285 -61466 56270 -346215 34655 -328120 -41749 -79252 154290 -250611 -76003 131280 -236675
19273 -385841 -88307 -154569 -30729 -15213 23013 89669 -17108 -179551 -57283 -140245 -99750
19262 -99750 -137809 -98262 -60623 49360 -386115 42197 -67790 -104694 -113267 95555 -203805
19250 -67825 32503 -10682 128 50363 109248 33092 29260 -77047 -357218 -185390 -20033 -23291
19238 -23291 344 88295 5408 -314560 -46675 -152941 66112 -15579 -154684 115419 64765
19227 64765 100902 141301 140959 -155472 -50762 -106433 28503 -251435 -55751 -160593 49109
$$ packed form
19306a42017K3351k19246a44093l61002a41238E6392B0700a56234a0116j46310
19296a56426f6446D7034b35143A37417k1766b97767J43464M4817j5067J6678M6409
19285f1466E6270c46215C4655c28120d1749l7503A54290b50611g6003A31280b36675
19273c85841h8307o6262c0729a5213B3013O6656a7108j62443e7283q2962M0495
19262i9750l8059L9547L7639D9360c86115D2197f7790l6904q573I5555b03805
19250f7825C2503a0682A28N0235N8885C3092l832g7047k80171J71828b0033l258
19238b3291C44Q7951E408c14560d6675j06266F6112a5579j39105A15419n0654
19227F4765L6137M0399l42a55472e0762n5671B8503b51435e5751j04842D9109
$$ plain form
19215 79859 -515639 112783 -165906 -50686 -6153 -10390 -213100 -559334 59943 -193211 132547
19203 -105813 -7326 -152640 18006 -152261 -103809 -252051 -280873 -156940 10723 143597 -153518
19191 120319 168161 -175626 24973 112644 -185281 104141 161363 -205224 13043 -156496
19180 86010 82306 -140435 406238 -34917 -161995 -236168 152373 -3754 36577 -140291 88620
19168 -74289 -63032 -188657 485584 -107959 -12735 -159371 -289165 -211726 -100605 -419574
19158 -419574 -43074 -85792 267728 88279 -85129 -139491 177306 -103305 80608 -167273 235340
19146 156342 -90549 -58720 66630 -275102 62948 -41185 28211 411429 -125355 -265758 -8643
19134 -75291 -165883 18708 -313529 108530 -16253 43765 -63708 -185591 -76527 130962 -100611
$$ packed form
19215G9859e15639A12783a65906e0686f153m237k02710l46234E9943a93211A32547
19203a05813g326j45314A8006a52261M8452j48242k8822J23933A0723J32874a53518
19191A20319M7842a75626B4973Q7671a85281A04141N7222b05224A3043a56496
19180H6010l704a40435D06238c4917j27078p4173A52373c754C6577a40291H8620
19168g4289J1257j25625D85584a07959a2735j46636j29794P7439a00605l18969
19158d19574d3074m2718B67728H8279h5129n4362A77306a03305H0608a67273B35340
19146A56342i0549L1829F6630b75102F2948d1185B8211L83218a25355j40403h643
19134g5291r0592A8708c13529A08530a6253D3765f3708j21883g6527A30962a00611
$$ plain form
19122 67484 -118492 -48317 -125647 72383 -230819 -286899 -40880 -156537 94007 108307 -143462
19110 67401 -84050 -306387 53155 -14553 -1716 -76641 103198 -81050 -51562 -60699 232170
19098 -123014 73725 -179431 -220348 13700 -12013 -48791 -119772 -95406 -166262 276213 -78306
19086 213232 177921 38504 -243072 -263951 -65362 -135525 -102561 13682 -632581 -458819 96814
19074 122403 220223 9118 -72857 132187 -182495 -26250 -158102 -111461 -119933 81351 -250518
19062 294435 101658 -58967 -122447 -38686 307126 -50779 -74386 -64878 -130222 4183 -12076
19050 -268865 -251794 119094 -50134 35423 183114 171380 87390 -29025 -670 65598 -40223
19038 292945 -255001 -338328 -341287 78837 -180230 -229170 -315904 43437 207972 123259 190490
$$ packed form
19122F7484a18492d8317p7330G2383b30819n6080d0880j15657I4007J4300a43462
19110F7401h4050k22337E3155a4553a716p4925A03198h1050K9488r137B32170
19098a23014G3725a79431m0917A3700a2013l6778p0981K4366p0856B76213g8306
19086B13232l5311C8504b43072k0879f5362p0163L2964A3682f32581J73762I6814
19074A22403R7820I118g2857A32187a82495b6250j31852M6641q472H1351b50518
19062B94435A01658e8967o3480c8686C07126e0779k3607R508o5344D183a2076
19050b68865J7071A19094e0134C5423J47691j1734q3990b9025f70F5598d0223
19038B92945b55001q3327k959G8837a80230m8940q6734D3437J64535q4713O7231
$$ plain form
19027 190490 -356060 29876 9670 122025 73315 -228790 -125077 -186204 -28390 -83604 -145628
19016 -145628 -159472 -311345 -441927 -294991 -141140 -68579 -104611 -282749 -193203 13742
19005 226306 305705 -382368 86124 -288520 85158 46316 -105581 18161 119641 -23019 226168
18993 -25544 46393 -339414 156542 29636 37097 21071 87680 -29317 -287294 71082 217503
18982 217503 -175429 -57996 -44189 17832 -82957 -46319 -290544 116163 8484 288212 424518
18971 424518 305149 379359 -31236 42691 16618 33293 73040 -278184 -324180 -294841 -284470
18960 -284470 133430 -127195 11769 -362179 -414794 -371405 -315527 149083 52111 -124772
18949 -68727 -84920 -20770 -355377 25629 124267 144744 -115786 -108921 -437896 -405796 -158278
$$ packed form
19027A90490c56060B9876I670J12355m8710b28790J03713o1127b8390n5214o2024
19016a45628j3844j51873j30582J46936a41140f8579l6032j78138Q9546A3742
19005B26306P9399c82368H6124b88520H5158l8842a05581A8161J01480b3019B26168
18993b5544D6393c39414A56542B9636P461j6026O6609b9317k57977G1082J46421
18982B17503a75429e7996J3807A7832h2957L6638k44225A16163H484K79728J36306
18971D24518j19369P4210c1236D2691A6618J6675L9747b78184m5996K9339J0371
18960b84470A33430a27195A1769c62179n2615M3389N5878A49083E2111a24772
18949f8727j6193b0770l34607B5629R8638K0477a15786O865l28975L2100a58278
$$ plain form
18937 -72495 -144603 -8995 195570 -7132 199920 346740 -133324 223051 -133306 77742 -144125
18925 -83230 72776 62550 -206076 -186701 -161301 -17840 197133 -21308 -128714 -138734 225226
18913 -182162 256174 159289 -60479 86910 352551 181204 726813 445854 -38235 90068
18902 64610 -449993 97510 42716 230329 -48883 -97901 42897 -273890 31424 -48916 -64200
18891 -64200 -93268 -39940 129049 -131853 -135532 338955 -59497 -209963 -22581 122853 -110664
18879 94326 -141831 -127613 -8860 67883 -219343 -108789 31154 189959 -309321 -145117 80198
18867 -114341 -358165 -111773 -47263 -325393 262057 -428489 -156624 -38725 54753 -204026
18856 158844 -177154 -102785 110361 983 -278786 -100759 -149737 308110 -3152 74668 -57036
$$ packed form
18937g2495p2108h995A95570g132A99920J46820a33324B23051a33306G7742a44125
18925h3230G2776j0226b06076J9375K5400a7840A97133b1308j07406j0020B25226
18913a82162B56174r6885f0479H6910K65641j71347N45609k80959c8235I0068
18902F4610d49993I7510D2716J87613d8883m9018D2897b73890C1424d8916j5284
18891f4200k9068c9940A29049a31853l679C38955e9497j50466b2581A22853a10664
18879I4326a41831J4218h860F7883b19343a08789C1154J58805c09321a45117H0198
18867a14341k43824a11773d7263k78130B62057d28489a56624c8725E4753b04026
18856A58844a77154P4369A10361I83b78786a00759m8978C08110c152G4668e7036
$$ plain form
18844 -87607 -100400 -38827 67931 344795 -169311 70691 49533 2127 -76612 276352 79805
18832 -154518 -233797 -192264 13875 15426 -179334 48924 -48199 -93177 -4531 220431 -102064
18820 16964 -77562 61975 195450 12591 -91896 -171358 202700 88488 -52622 313722 27453
18808 22331 433578 382271 -179620 -3808 38924 -430148 46839 -14723 -112556 125058 -277056
18796 73802 90525 -237563 20392 412238 -83011 -55864 216339 -77330 -206485 133139 -144127
18784 15673 12249 -47344 -64693 83984 -52108 -124526 -183116 173207 282970 112366 -357058
18772 133089 -129899 23513 -226249 -197488 -367356 202759 -109676 94737 -273563 -98640
18761 -98634 19610 -41949 -143897 -171463 -411117 54734 -212484 -171826 -33200 -137269 -251061
$$ packed form
18844h7607j2793c8827F7931K76864a69311G0691k1158B127g6612B76352G9805
18832a54518p9279M1533A3875J551a79334D8924d8199m4978d531B20431a02064
18820A6964g7562F1975J33475A2591i1896p9462B02700H8488e2622C13722B7453
18808B2331M11247n1307a79620c808C8924d30148D6839a4723r7833A25058b77056
18796G3802J6723b37563B0392L91846h3011K7147B16339g7330j29155A33139a44127
18784A5673l424d7344j7349H3984e2108p2418n8590A73207J09763A12366c57058
18772A33089a29899B3513b26249K8761j69868B02759a09676I4737b73563i8640
18761i8634A9610d1949j01948k7566k39654E4734b12484M0658c3200j04069j13792
$$ plain form
18750 -251061 45999 -147001 62527 -123206 -54804 -79157 52433 20565 73823 786 141918
18739 141918 -116652 -192930 -226522 102419 -7551 -163589 75070 -264337 389475 396623 174274
18727 -248829 35945 75240 25384 105504 199285 -108958 -153277 -203770 -4721 -61527 142705
18715 -90297 -266198 81827 99612 -313625 -376359 -62134 -126713 -213895 -185730 -1876 -419649
18704 -419649 189189 -233166 -59804 34722 41211 -149749 -48109 333713 -22229 53132 -26344
18692 111458 -192885 72148 -252966 -160667 -103172 -53018 -63517 67743 -73633 -91010 -296219
18681 -296219 -56516 -220755 148188 -222312 -310196 48579 100661 -124626 -155362 -306490
18671 -306490 -89372 -188616 -210951 -253319 150433 -102495 211440 -86972 11075 38703 -211743
$$ packed form
18750b51061D5999a47001F2527a23206e4804k4353E2433B0565N3258G86J41132
18739A41918a16652p6278l3592A02419g551j56038G5070b64337C89475P148A74274
18727b48829C5945L9295B5384Q0120R3781a08958m4319n0493d721n6806A42705
18715i0297j75901H1827J7785c13625o2734f2134o4579q7182K8165a876m17773
18704d19649A89189b33166e9804C4722O489a49749d8109C33713b2229E3132b6344
18692A11458a92885G2148b52966R2299N7495N0154j0499F7743g3633j7377k05209
18681b96219e6516j64239A48188b22312q7884D8579N2082a24626l0736j51128
18671c06490h9372r9244k2335m2368A50433a02495B11440h6972A1075K7628b11743
$$ plain form
18659 64410 -36040 -115580 -113190 -159407 -226923 -207349 -18852 320478 407510 158267 -423246
18647 -89159 -142542 -140103 -16267 -263314 -118189 96512 -327620 250915 138165 -212158 -196583
18636 -196583 -64890 -309359 -29733 -164971 135277 6361 -21099 -9432 128125 102647 22103
18624 53538 228750 -472482 -413612 34749 -72335 -161590 -378441 -207112 99067 112214 -155400
18612 404218 9343 102314 -160223 -68966 35239 -151020 -23807 36710 -324584 3310 -139 271092
18599 84145 -374519 12094 -138206 120818 -54076 -59707 -213450 36884 -157144 -362871 -101114
18587 -47347 -116132 36673 -237721 -219860 -194272 84625 -145660 -162326 -83389 219026 12575
18575 35492 116981 150713 -11443 124567 171966 -124810 -275391 -45633 70010 -194871 -176614
$$ packed form
18659F4410c6040p9540K390m6217o7516J9574a8852C20478Q7032A58267d23246
18647h9159n3383K439a6267k47047a18189I6512c27620B50915j12750b12158J5575
18636a96583f4890k44469b9733j35238A35277F361b1099i432A28125k5478B2103
18624E3538J75212d72482N8870C4749g2335q9255k16851J71329I9067J3147a55400
18612D04218I343R2971a60223f8966C5239a51020b3807C6710c24584C310a39B71092
18599H4145c74519A2094a38206A20818e4076n631j53743C6884a57144k05727a01114
18587d7347o8785C6673b37721J7861K5588H4625a45660j6666P8937B19026A2575
18575C5492Q1489L3732a1443A24567M7399a24810j50581d5633G0010a94871J8257
$$ plain form
18564 -176614 -66752 -239042 49720 -14211 -151561 -45003 65651 -252305 -136212 -136940 312274
18552 -144727 284789 -140060 76698 -102187 -379517 -277856 169172 -50264 23361 -58563
18541 -41975 -148501 277196 37947 14220 50641 -243915 2447 -299301 131695 124276 -323964
18529 51745 74523 -17495 90540 -276938 132000 -199193 196101 113482 138889 31400 26650
18518 26650 37031 -259764 -166000 -75172 68441 -304860 -177688 -140426 -201827 -131956 258634
18506 -111170 154301 75687 -25596 -48800 52222 -92024 117891 64710 183664 -229422 90706
18494 -307801 178929 -16608 -177815 35631 121038 178619 -316547 207009 -283154 -149852
18484 -149852 25918 249300 242512 24978 136269 -208917 -209707 90278 -87379 -110113 -41930
$$ packed form
18564a76614f6752j72290D9720a4211j37350d5003F5651b52305J16093p28C12274
18552a44727B84789a40060G6698a02187k77330J01661A69172e0264B3361e8563
18541d1975j06526B77196C7947A4220L6421b43915B447b99301A31695p419c23964
18529E1745K2778a7495I0540b76938A32000a99193A96101q2619K5407C1400m750
18518B6650J0381b59764R3764g5172F8441c04860J27172L7262o1401O9871B58634
18506a11170A54301G5687b5596k3204E2222i2024A17891n3181J18954b29422I0706
18494c07801A78929a6608j61207C5631Q5407N7581c16547B07009b83154J33302
18484a49852B5918K23382o788B4978J11291b08917p90I0278h7379k2734d1930
$$ plain form
18472 248576 11499 238108 242586 -75741 -220984 143396 -88001 -408167 -96009 17517 -405722
18460 72890 -8365 -169860 -177421 -75277 -186992 224478 -206378 -72442 -245094 196206 -161655
18448 -55203 -143945 -74710 76177 78662 38612 -93122 -132657 124570 109033 162604 -405130
18436 -481671 -102256 37765 -124248 -239418 149942 -136888 49264 55719 133782 194061 -101184
18424 11781 -24487 -5016 -76919 232071 230848 -237407 153513 -98653 19995 203128 -4959
18412 -69141 -308075 -260892 -194273 71779 -146474 -308426 150933 -2969 -256888 127191 -55434
18400 -5138 263435 -28976 61655 102897 -40714 -84262 188275 -56506 -259111 29432 389 259385
18388 259385 -42906 -378275 -182854 32589 -168871 144599 -7516 -207274 -75788 113081
$$ packed form
18472B48576A1499K26609M478g5741j45243A43396h8001l20166i6009A7517d05722
18460G2890h365j61495p561g5277j11715B24478b06378g2442j72652A96206a61655
18448e5203q8742O9235G6177K485C8612i3122l9535A24570j5537N3571d05130
18436d81671a02256C7765a24248j15170A49942a36888D9264O455P8063O0279a01184
18424A1781b4487e016p1903B32071j223b37407A53513i8653A9995J83133d959
18412f9141k38934M7183O6619G1779a46474j61952A50933b969k53919A27191e5434
18400e138B63435b8976F1655M1242d0714m3548A88275e6506k02605B9432C89K58996
18388B59385d2906l35369a82854C2589a68871A44599g516j99758g5788A13081
$$ plain form
18377 317243 -322533 -206433 -313011 16782 -438915 -70743 -291468 -183235 44280 17661
18366 66464 -167392 -38736 199130 13196 -309697 155686 -252139 -24991 242183 -48238
18355 -114078 10893 67116 -157639 98222 -185732 -87902 -128193 -132672 -31986 -342860 25405
18343 -120279 248416 131336 81813 -207900 187686 -195711 -130285 125090 -38806 -59645
18333 -59645 -106741 -321143 205292 128312 -8856 -14013 -52481 79442 -157863 292231 -297733
18321 135330 -22439 -282865 63419 193393 -111074 -4562 127702 -70677 -242969 -37869 -102310
18310 -102310 -57648 78255 -160073 -57664 -250944 16373 164832 -182399 97027 32178 265445
18299 265445 -56452 50371 -31779 356902 -247799 91692 135834 -168068 19532 -131832 91368
$$ packed form
18377C17243c22533J16100j06578A6782d38915g0743k20725J08233D4280A7661
18366F6464a67392c8736A99130A3196c09697A55686b52139b4991B42183d8238
18355a14078A0893N6223a57639I8222a85732h7902m0291m479c1986l10874B5405
18343a20279B48416j17080m9523b07900A87686a95711O5426A25090c8806k0839
18333e9645m7096k14402B05292p6980h856n157l8468G9442a57863B92231b97733
18321A35330b2439k60426F3419J29974a11074d562A27702g0677j72292c7869o4441
18310a02310M4662G8255a60073e7664j93280A6373J48459a82399I7027C2178K33267
18299B65445e6452E0371c1779C56902b47799I1692M4142a68068A9532a31832I1368
$$ plain form
18287 -32759 73672 -157632 -295728 88476 -260721 61730 146731 -397210 -192655 57597 -46846
18275 78667 -232386 -161708 -14452 221718 215057 -3082 194688 309410 82757 -142463 -82117
18264 -82117 -133801 -328436 -15414 -37195 38771 -55515 138423 355165 -374803 -82871 239131
18252 -193304 124017 -177595 -45447 -18350 -154655 -110606 -87930 -29090 36816 -56234 -94037
18241 -94037 -68941 -48717 -70814 -83876 -35892 53475 -176506 -56398 215490 -67383 -56727
18230 -56727 -211085 126267 337324 -15790 -205565 36824 -43691 -118107 135543 -81365 41559
18218 96727 -291888 -113567 -116681 -239663 -164689 -349304 -102126 3227 66337 71583 299080
18207 299080 181006 46545 16 297695 58488 55176 23473 12481 -392922 -79722 -64992 2392
$$ packed form
18287c2759G3672a57632j38096H8476b60721F1730Q5001c97210a92655E7597d6846
18275G8667b32386P0678a4452B21718o661c082A94688J14722H2757a42463O0346
18264h2117n1684j94635a5414k1781C8771e5515A38423K16742c74803h2871B39131
18252a93304A24017a77595d5447a8350j36305M4049K2676b9090C6816e6234l7803
18241i4037K5096K0224k2097j3062c5892E3475a76506e6398B15490f7383J0656
18230e6727j54358A26267K11057a5790j89775C6824d3691p4416A35543h1365D1559
18218I6727b91888a13567l114j22982P4974j84615a02126C227O3110N246K27497
18207B99080j18074D6545A6K97679E8488l312B3473j0992c92922g9722J4730B392
$$ plain form
18194 159435 191060 -162216 131207 55643 -16663 -53123 98026 227801 107787 58464 -158261
18182 229964 253169 118697 26844 -240435 -487947 -10953 -389379 -8558 95111 9837 -169285
18170 17049 -49181 158149 -347085 22256 -63965 -172217 -432678 -151927 -86689 -600 -2912
18159 -2912 -335368 88989 -139178 8911 -138871 10648 20494 -157996 241835 42431 321012
18148 321012 34563 -157106 62844 -21929 -218353 -155278 231728 -98694 -35616 185656 26176
18136 121528 102444 -171578 -122273 976 96701 -32563 -258687 -187764 31924 -334987 -113747
18124 -189110 -144348 262504 -146321 18967 -312820 1227 138862 159568 -155249 -48388 148889
18112 -40808 -56288 213075 50438 147026 -186990 5678 -69430 48719 -56900 -32208 214518
$$ packed form
18194A59435L1625a62216A31207E5643a6663l6460I8026J29775A07787m9323a58261
18182B29964K3205A18697B6844b40435k47512a0953l78426h558I5111I837a69285
18170A7049d9181A58149c47085B2256f3965j08252k60461a51927O5238f00k312
18159b912l32456H8989a39178H911a38871A0648R846a57996B41835D2431K78581
18148C21012C4563a57106F2844b1929j96424O3075B31728i8694c5616A85656B6176
18136A21528j9084a71578M9305I76R5725c2563k26124P0923C1924c34987a13747
18124a89110M4762B62504a46321A8967c12820A227J37635K0706a55249d8388A48889
18112d0808j5480B13075E0438R6588a86990E678f9430D8719e6900K4692B14518
$$ plain form
18100 74780 232885 -51934 17114 -323063 -141578 -234072 -126515 45663 215931 133720 291619
18089 291619 -136245 -142740 100113 85344 219363 -107230 -143473 -185678 135671 -108611
18078 67374 132159 282175 -291278 -37859 -132286 161576 96457 54289 -144332 -60460 89077
18066 -90618 -26026 30971 -229347 56906 69299 248881 21592 -197679 156770 855 110625
18055 110625 167191 -374974 -185394 -21511 -1727 -240365 112867 -170012 138370 216455
18045 216455 -39860 -32931 98053 68944 226905 84359 -305490 142168 168143 50184 38350
18034 38350 155123 33401 -106234 -221994 -352247 -421034 206700 -54949 -96954 246382
18023 -30943 -113508 -269329 -84319 -121388 276344 13710 -144305 42896 -74573 195151 -49881
$$ packed form
18100G4780J58105e1934A7114c23063a41578r2494J07557D5663J70268q2211J57899
18089B91619a36245o495A00113j4769J34019a07230l6243m2205A35671a08611
18078F7374O4785J50016b91278c7859r4427A61576o5119m2168a44332f0460H9077
18066i0618b6026C0971b29347E6906J2393J79582B1592a97679A56770H55J09770
18055A10625N6566c74974a85394b1511a727k38638A12867a70012A38370P8085
18045B16455c9860O929I8053k9109J57961H4359c05490A42168K5975E0184j1834
18034C8350J16773C3401a06234j15760j30253o8787B06700e4949m2005B46382
18023c0943q2565j55821h4319l7069B76344A3710a44305D2896g4573A95151d9881
$$ plain form
18011 -273898 -28606 -17272 175422 42846 445716 81409 224206 270548 -70420 77659 -80898
17999 95891 261142 263267 317110 24696 -70625 -330228 5581 94885 -216262 -2423 -12040 232607
17986 36410 -164734 -348421 -29279 103138 -176281 185668 -79869 149332 -191048 5744
17975 -93695 -77256 101205 171078 -221981 175631 -11470 106165 97860 -14586 -212490 356204
17963 -44774 165016 25473 -27624 47335 -56510 66262 -123744 -86611 -17226 -23083 -32318 415856
17950 351305 80517 334533 -164669 -48181 47878 168426 313257 -8281 -82186 278342 266151
17939 266151 -207433 238779 301611 52664 -61161 -157947 -26030 464278 36681 195708 -131052
17927 -176910 83515 -21502 -3287 43758 218279 -182811 -198361 -84970 -143152 -172894 212664
$$ packed form
18011b73898b8606J1334A75422D2846M02870H1409J42797M6342g0420G7659h0898
17999I5891J65251K125N3843B4696g0625k59603E581Q9304b16262b423r617B32607
17986C6410a64734j83687b9279A03138a76281A85668g9869A49332a91048E744
17975i3695J6439A01205O9873b21981A75631a1470A06165q305a4586j97904C56204
17963d4774A65016B5473b7624D7335e6510F6262a23744L7133a7226n857r235D15856
17950C51305H0517K54016a64669d8181D7878J20548J44831h281p3905B78342j2191
17939B66151b07433B38779O2832E2664f1161r6786b6030D64278C6681J59027a31052
17927a76910H3515b1502c287D3758J74521a82811j5550h4970n8182k9742B12664
$$ plain form
17915 3697 141025 203644 -204269 175043 409941 338386 -51020 -223645 187628 -50307 -149809
17904 -149809 -26787 73273 -185517 49320 58047 -75830 -218862 286686 -53167 107472 14508
17892 -111064 43140 225953 -204290 -16325 308654 79039 307217 -47743 93205 282886
17882 282886 237077 -150906 -234518 250392 -208295 -25127 130364 41600 -60473 -377807
17872 -377807 162709 188037 -21174 -19704 -188336 -146403 194048 159766 253909 -310482 -74782
17860 218874 -140898 319862 30425 -162218 341811 283168 141336 -91655 -19683 202330
17849 306119 -267233 -103392 7816 -56533 -25468 -222786 23245 -72814 -178357 -83499 -107535
17838 -107535 314077 77022 45821 271078 81901 -379775 40741 -180702 392637 58871
$$ packed form
17915C697J37328O2619b04269A75043K34898p1555e1020j72625A87628e0307r9502
17904a49809b6787G3273a85517D9320Q727g5830j43032B86686e3167A07472A4508
17892a11064D3140J82813b04290a6325C08654G9039K28178d7743I3205J89681
17882B82886m5809a50906q3612B50392b08295b5127A30364D1600f0473l17334
17872c77807A62709K5328b1174J470j68632M1933A94048l4282R4143c10482g4782
17860B18874a40898C19862C0425a62218C41811n8643A41336i1655a9683B02330
17849C06119b67233a03392G816e6533b5468j97318B3245g2814j05543h3499k4036
17838a07535C14077G7022l1201K25257H1901c79775D0741a80702C92637E8871
$$ plain form
17827 9435 60574 -343909 -197644 -33513 15646 -163435 -228782 -48558 -68697 -185309 321047
17815 49029 -199476 112640 -79806 180698 -110245 194177 363618 264801 -19602 16475
17804 165617 354688 226411 -78244 -8207 30804 -170573 191010 167119 163105 -4961 303510
17792 157279 110819 -69124 -42409 214005 318590 221379 197184 -97040 -101034 -3208 -20401
17781 -20401 -49987 -123879 402369 -179404 66795 414138 -74627 130273 -190232 -461446
17771 -461446 -130405 210229 -56688 -195895 48374 -68921 347897 2415 329607 164541
17760 39011 -123063 -23487 -99691 -51867 83596 -191385 -60482 -245295 510782 178754 160476
17749 160476 339380 78545 418707 106659 -238491 -59051 97654 116035 138983 278900
$$ packed form
17827I435N1139c43909J46265c3513A5646a63435o5347d8558k0139j16612C21047
17815D9029a99476A12640g9806A80698a10245A94177J69441r8817a9602A6475
17804A65617J89071j28277g8244h207C0804a70573A91010k3891m014d961C03510
17792A57279m6460f9124K6715B14005J04585r7211k4195i7040l994c208j7193
17781b0401k9586p3892D02369a79404F6795L47343g4627A30273a90232k71214
17771d61446a30405B10229e6688j39207D8374f8921C47897B415L27192A64541
17760C9011a23063b3487p6204M7824H3596a91385f0482j84813E10782A78754j8278
17749A60476J78904G8545L40162A06659b38491e9051I7654J8381K2948J39917
$$ plain form
17739 278900 -11489 -58336 80518 251859 56737 110170 11224 -51516 272408 -95881 86153
17727 242035 213640 64772 -46484 65468 135761 -230234 66614 351691 40562 369163 122394
17715 36802 162431 220064 213224 -146197 -69784 -164119 -201464 216834 97231 -128446 -28203
17703 329640 80677 15243 151213 117162 -150282 -24314 376883 113469 173426 217849 174788
17692 174788 398051 50340 -404800 19308 -189912 368774 13193 263628 -31706 118436
17681 349454 -132446 175946 4022 418118 20746 -175620 -11972 -23949 163867 113843 345069
17670 345069 274546 -612 95089 121424 10882 26024 35106 121490 25232 -185855 38144 161865
17658 161865 -70716 202891 179333 -24381 114268 -169307 -268656 18429 -20805 306414 60659
$$ packed form
17739B78900a1489m6847H0518J71341E6737N3433A1224e1516B72408i5881H6153
17727B42035k8395F4772d6484F5468P0293b30234F6614K85077D0562L28601A22394
17715C6802J25629N7633o840a46197f9784r4335l7345B16834I7231a28446b8203
17703C29640H0677A5243J35970l4051a50282b4314C76883A13469N9957M4423m3061
17692A74788K23263E0340d04800A9308a89912C68774A3193K50435c1706A18436
17681C49454a32446A75946D022M14096B0746a75620a1972j1977A63867n0024K31226
17670C45069p0523f12I5089K6335A0882J5142R082Q6384B5232a85855C8144J23721
17658A61865g0716B02891k3558b4381A14268a69307r9349A8429b0805C06414F0659
$$ plain form
17646 485182 -8576 323139 236093 99569 3229 -195295 -27518 97340 265380 219504 133389
17635 133389 -17297 327404 -1800 -143285 289536 -96485 -50715 33862 -32015 310111 267773
17624 267773 370806 138907 81703 243434 189219 218285 132018 29286 -309669 64919 -39201
17612 324913 150954 118674 -63219 703 52090 199190 104926 -123335 176426 57237 -2529
17600 -255465 93088 146633 139181 91929 140026 297043 96265 312853 -166240 46164 126128
17589 126128 215983 -194835 55522 -29423 -145012 307621 157857 -75857 136612 268426
17579 268426 89668 115806 -388634 -207745 -93196 -19249 38369 -35505 99661 396594 431098
17568 431098 336158 243213 130179 48378 -181911 174014 -20983 273215 65072 298228
$$ packed form
17646D85182h576C23139q7046I9569C229a95295b7518I7340J68040m5876q6115
17635A33389a7297C27404a800j41485B89536i6485M5770C3862c2015C10111m2338
17624B67773J03033A38907n7204J61731n4215K9066q6267B9286c09669F4919c9201
17612C24913A50954l2280f3219G03N1387J47100r4264a23335A76426E7237b529
17600b55465I3088N3545p452m7252M8097J57017I6265K16588a66240D6164P9964
17589A26128Q9855a94835E5522b9423j15589C07621j49764g5857A36612J31814
17579B68426H9668K6138c88634J80889i3196a9249C8369c5505I9661K96933L4504
17568D31098r4940r2945j13034D8378a81911A74014b0983B73215F5072K33156
$$ plain form
17558 298228 -256416 -55716 -83860 -230205 154331 70086 308969 265056 335836 117262
17547 266443 321109 21335 13759 171161 -75112 260090 88932 124562 345778 372809 191260
17536 191260 389991 220894 153188 -56284 301695 31986 680350 432756 78864 268704
17526 268704 165407 508097 864656 1122722 1015219 1037025 897131 231850 359076 404243
17516 404243 284127 408965 312164 637617 501164 588994 701715 1302568 1320422 919931
17506 919931 944775 577855 444395 725328 465039 206503 284624 298024 359400 399788
17496 399788 133509 401389 119460 461148 166134 508961 290251 325610 521180 112455
17485 577401 467027 154792 403798 389988 310475 396415 27188 588308 315813 111732
$$ packed form
17558B98228b56416e5716k8144j46345A54331G0086K38883m3913P0780A17262
17547B66443N4666B1335p576J57402g5112B60090H8932L5630K21216K7031j81549
17536A91260J98731j69097o7706e6284C01695C1986O48364k47594G8864J89840
17526B68704j03297L42690L56559K58066j07503K1806j39894B31850J27226M5167
17516D04243j20116J24838r6801L25453j36453Q7830J12721O00853J7854m00491
17506I19931K4844l66920j33460K80933k60289B06503P8121J3400O1376M0388
17496C99788A33509K67880A19460L41688A66134L42827k18710L5359J95570A12455
17485E77401j10374A54792K49006j3810p9513Q5940B7188N61120k72495A11732
$$ plain form
17474 477301 307203 132450 240766 512665 40958 150222 206437 244096 228807 199001
17464 199001 415982 -216885 -49618 236632 138332 -159456 526729 109840 468567 160618
17453 226224 390962 -26598 170218 394062 287274 451280 576808 753670 565395 82337
17442 627573 290517 180395 616602 135083 184997 589513 191444 681646 582827 126268
17431 112399 254888 404084 219929 310311 132442 436971 246179 207773 291784 511291
17421 511291 143139 511838 378999 469367 325917 102213 564998 724139 648830 239875
17410 388438 508106 158655 392188 133674 392248 392959 328273 124029 315230 228059
17400 228059 273258 178464 -53956 96144 41446 301854 108204 489710 21013 324052 156868
$$ packed form
17474D77301j70098A32450J08316K71899D0958J09264N6215L7659j5289k9806
17464A99001K16981b16885d9618B36632r8300a59456E26729A09840L58727A60618
17453B26224J64738b6598A70218K23844j06788J64006J25528J76862j88275H2337
17442F27573B90517j10122M36207A35083M9914M04516A91444M90202r8819A26268
17431A12399J42489J49196j84155R0382A32442L04529j90792l8406Q4011K19507
17421E11291A43139L68699j32839R0368j43450A02213M62785J59141p5309B39875
17410C88438J19668A58655K33533A33674K58574P11o4686A24029J91201q7171
17400B28059M5199r4794e3956I6144D1446K60408A08204L81506B1013L03039A56868
$$ plain form
17388 410944 456478 288060 279951 266539 548836 251085 479571 294305 374612 36062 41146
17377 41146 160208 418243 178300 104020 218425 218678 446378 232109 333783 322748 340299
17366 340299 526586 87399 140473 -170567 145245 256707 283466 145642 15890 399163
17356 399163 243180 348782 45042 38744 286827 197203 246259 380253 276307 309585 438245
17345 438245 182934 325392 333135 -33027 -19699 372250 174929 321452 529625 263511
17334 241030 142234 359403 84108 312954 459970 459022 564172 8449 -145312 71217 149151
17323 149151 15772 439404 329459 330456 356013 439286 250783 232967 394915 -84341 227026
17311 338500 404890 222345 381952 391948 268190 395728 340462 226251 270487 297197 283549
$$ packed form
17388D10944M5534j68418q109j3412K82297B51085K28486j85266Q0307C6062N084
17377D1146J19062K58035A78300p4280J14405K53K27700k14269J01674j1035J7551
17366C40299J86287H7399N3074a70567A45245J11462K6759j37824A5890L83273
17356C99163j55983J05602D5042o298K48083q9624M9056J33994j03946L3278J28660
17345D38245A82934J42458P743c3027J3328C72250A74929J46523K08173B63511
17334B41030r8796K17169H4108K28846J47016r48J05150H449a45312G1217P7934
17323A49151A5772M23632j09945R97K5557Q3273j88503j7816J61948h4341B27026
17311C38500O6390j82545J59607R996j23758J27538n5266j14211M4236K6710j3648
$$ plain form
17300 283549 12468 281177 181762 428936 225032 277227 61576 233819 311989 -59033 202400
17288 271689 199978 439452 178141 210191 241605 252171 117326 301221 108837 286257
17278 286257 410372 42335 345616 349467 144859 192519 260830 491406 179416 107181 278359
17267 278359 159651 212591 391476 320750 287683 112214 445265 35775 129786 531008
17257 531008 170556 32520 237398 289980 147195 128674 184266 314353 418709 599765
17247 599765 -118453 465962 313668 357321 216744 444260 93322 607543 624738 490008
17237 490008 486166 397795 494570 480426 468754 331160 513555 515736 89481 251716 537064
17226 537064 587190 424781 537562 254077 527196 544110 191526 482690 219970 566919
$$ packed form
17300B83549A2468K68709r9415K47174k03904N2195F1576J72243P8170e9033B02400
17288B71689p1711K39474A78141L2050L1414J0566A17326J83895A08837J77420
17278B86257J24115D2335L03281L851A44859M7660O8311K30576A79416p2235J71178
17267B78359j18708N2940J78885p0726l3067A12214L33051C5775R4011M01222
17257E31008A70556C2520K04878N2582j42785j8521N5592J30087J04356J81056
17247E99765a18453D65962j52294M3653j40577K27516I3322N14221J7195j34730
17237D90008l842q8371R6775j4144j1672j37594J82395K181H9481J62235K85348
17226E37064N0126j62409J12781B54077K73119J6914A91526K91164B19970L46949
$$ plain form
17216 566919 335219 162286 214324 280753 258107 383350 130351 592285 442841 559738
17206 559738 393450 352290 175349 384878 263869 529398 436502 584196 522558 529499
17196 529499 326276 278345 134566 352980 249474 588336 334747 422557 68946 686717
17186 686717 385153 509177 336916 318254 660145 492311 713615 307220 443030 634579
17176 634579 288326 683777 321201 559559 454410 159959 116629 376484 510095 360021
17166 360021 225714 436606 376861 574234 669435 240457 325680 451520 385779 756962
17156 756962 245826 431467 648010 211036 605130 766589 634604 565953 426355 573914
17146 573914 384685 616555 376042 513076 764418 464251 643611 497446 414556 674725
$$ packed form
17216E66919k31700A62286N2038O6429k2646J25243A30351M61934j49444J16897
17206E59738j66288m1160A75349K09529j21009K65529r2896J47694o1638O941
17196E29499k03223m7931A34566K18414j03506L38862k53589Q7810F8946O17771
17186F86717l01564J24024j72261j8662L41891j67834K21304C07220J35810J91549
17176F34579B88326L95451C21201K38358j05149A59959m3330K59855J33611j50074
17166C60021j34307K10892n9745J97373R5201B40457Q5223J25840o5741L71183
17156G56962B45826J85641K16543B11036L94094J61459j31985o8651j39598J47559
17146E73914j89229K31870k40513J37034K51342l00167J79360j46165q2890K60169
$$ plain form
17136 674725 608124 450597 581640 661835 684517 460747 736237 739048 503806 767963
17126 767963 678467 370047 679356 502617 537053 507844 610068 526216 728122 809737
17116 809737 605152 505703 304301 850387 390412 502171 674631 640066 549579 738275
17106 738275 749005 383288 663832 451164 813435 702434 717216 525325 855536 577275
17096 577275 491038 519454 733181 683932 576412 837217 604946 795951 902629 918155
17086 918155 1003214 615590 542059 860569 1085057 891861 611063 661991 537030 686598
17076 686598 1061017 726175 705674 620606 676217 606776 437365 504670 788700 876008 790509
17065 790509 544363 1002802 1176071 881178 711408 939421 788015 1015177 936202 870736
$$ packed form
17136F74725o6601j57527J31043Q0195K2682k23770K75490K811k35242K64157
17126G67963q9496l08420L09309j76739L4436k9209J02224q3852K01906Q1615
17116H09737k04585r9449k01402N46086C90412J11759J72460l4565r0487J88696
17106G38275J0730l65717K80544k12668L62271j11001J4782j91891L30211k78261
17096E77275q6237K8416K13727m9249j07520K60805k32271J91005J06678J5526
17086I18155Q5059l87624p3531L18510K24488j93196k80798N0928j24961J49568
17076F86598L74419l34842k0501q5068N5611o9441j69411O7305K84030Q7308q5499
17065G90509k46146M58439J73269k94893j69770K28013j51406K27162p8975o5466
$$ plain form
17055 870736 711493 641376 971450 652924 1033250 528291 529544 1130658 1000713 1106608
17045 1106608 873136 1055962 1001117 967283 1059469 1203313 723853 788440 1080970 1064368
17035 1064368 1014549 928794 921761 726049 924121 999101 771478 752091 1086428 878642
17025 878642 829350 953649 996802 1129669 964590 1058818 1035205 1368386 1051244 884543
17015 884543 1089911 1294691 1076120 1191547 1050227 1312467 1349740 869194 1326228 909779
17005 909779 1020354 1231528 917900 997455 1025597 1182656 1241778 1224852 1104241 901890
16995 901890 1240489 1227731 1511461 1445718 851122 1389116 1435909 989549 1111929 1374087
16985 1374087 1441698 1147457 1453773 1478887 1379940 1174693 1527270 1373273 1373500 1786149
$$ packed form
17055H70736j59243p0117L30074l18526L80326n04959J253O01114j29945J05895
17045A106608k33472J82826n4845l3834R2186J43844m79460O4587K92530j6602
17035A064368m9819q5755p033j95712J98072P4980k27623j9387L34337k07786
17025H78642m9292J24299M3153J32867j65079R4228k3613L33181l17142j66701
17015H84543K05368K04780k18571J15427j41320K62240L7273m80546M57034m16449
17005I09779J10575K11174l13628P9555K8142J57059N9122j6926j20611k02351
16995I01890L38599j2758K83730o5743n94596N37994M6793m46360J22380K62158
16985A374087O7611k94241L06316K5114r8947k05247L52577j53997K27M12649
$$ plain form
16975 1786149 1591601 1092076 1120891 1401218 1772814 1579524 1637898 1526095 1747356 1703271
16965 1703271 1733137 1516357 1475565 1541140 1915031 1604881 1923817 1563898 1652556 1474514
16955 1474514 1652611 1702534 1661090 1525114 1665228 1461992 1607835 1936840 1755763 1633827
16945 1633827 1890254 2170692 1898359 1915041 1664669 1921744 1883351 1736853 2103317 1805714
16935 1805714 1976985 2144313 1957595 2113816 2125340 2068009 1957324 2012651 2305716 2470061
16925 2470061 2320464 2168805 2143116 2216800 2300054 2307697 1989510 2025664 2405695 2253139
16915 2253139 2674443 2489195 2568020 2320525 2723592 2473946 2705466 2828309 2404109 2766957
16905 2766957 2785097 2663689 3225177 2921232 2926582 2575737 2625490 2823403 2790903 3381625
$$ packed form
16975A786149j94548m99525K8815K80327L71596j93290N8374j11803K21261m4085
16965A703271K9866k16780m0792O5575L73891l10150L18936l59919Q8658j78042
16955A474514J78097M9923m1444j35976J40114k03236J45843L29005j81077j21936
16945A633827K56427K80438k72333J6682k50372K57075l8393j46498L66464k97603
16935A805714J71271J67328j86718J56221J1524n7331j10685N5327K93065J64345
16925B470061j49597j51659k5689P3684Q3254P643l18187L6154L80031j52556
16915B253139M21304j85248P8825k47495M03067k49646K31520J22843m24200L62848
16905B766957J8140j21408N61488l03945N350l50845M9753J97913l2500N90722
$$ plain form
16895 3381625 2935770 2688123 3064874 2980226 3210883 3212047 3302498 3211666 3278084 3054017
16885 3054017 3432000 3376945 3214874 3455626 3663629 3730196 3521171 3746108 3758986 3940682
16875 3940682 3731250 3717299 3457347 3964359 4020143 4341924 3836771 3982912 4381509 4289099
16865 4289099 4309422 4659066 4549381 4439175 4709984 4380865 4524969 4712404 4808384 4938287
16855 4938287 4458865 4933971 5097683 5215034 5331939 5586561 5626829 5336373 5591338 5660752
16845 5660752 5880370 5737861 5706052 6048225 6063587 6007777 6371934 6109644 6489965 6492461
16835 6492461 6804400 6624108 6812527 6903247 7315779 7299259 7431849 7430615 7322960 7784151
16825 7784151 7708039 7812726 8394430 8491167 8248993 8616012 8946000 8787045 9178871 9380699
$$ packed form
16895C381625m45855k47647L76751q4648K30657J164R0451r0832O6418k24067
16885C054017L77983n5055j62071K40752K08003O6567k09025K24937J2878J81696
16875C940682k09432j3951k59952N07012N5784L21781n05153J46141L98597r2410
16865D289099K0323L49644j09685j10206K70809l29119J44104J87435R5980J29903
16855D938287m79422M75106J63712J17351J16905K54622M0268k90456K54965O9414
16845E660752K19618j42509l1809L42173J5362n5810L64157k62290L80321K496
16835F492461L11939j80292J88419R0720M12532j6520J32590j234j07655M61191
16825G784151p6112J04687N81704R6737k42174L67019L29988j58955L91826K01828
$$ plain form
16815 9380699 9659574 9514073 10060172 10333834 11105476 10674939 10856185 10806865 11253847 11450311
16805 11450311 11599013 11886310 12327680 12336852 12617518 13367322 13514816 13683878 13875902 13952926
16795 13952926 14783462 14920207 15436847 15603734 16094749 16441623 17137729 16982370 18039992
16786 18039992 18193028 18992027 19365862 19835959 20143430 20798296 21516812 22377725 22787966
16777 22787966 23121521 24105955 24771893 25309666 26267930 27104579 27804622 28714949 29457410
16768 29457410 30706586 31729826 32527458 33527846 34868694 36169511 37114527 38416800
16760 38416800 39782249 40837003 42399327 43866671 45557562 47090605 48847137 50663606
16752 50663606 52746310 54304268 56487746 58204158 60638265 62565392 65339873 67601274
$$ packed form
16815I380699K78875j45501N46099K73662P71642m30537J81246m9320M46982J96464
16805A1450311J48702K87297M41370R172K80666P49804J47494J69062J92024P7024
16795A3952926Q30536J36745N16640J66887M91015L46874O96106j55359J057622
16786A8039992J53036P98999L73835M70097L07471O54866P18516Q60913M10241
16777B2787966L33555R84434O65938N37773R58264Q36649P00043R10327P42461
16768B9457410J249176J023240P97632J000388J340848J300817R45016J302273
16760C8416800J365449J054754J562324J467344J690891J533043J756532J816469
16752E0663606K082704J557958K183478J716412K434107J927127K774481K261401
$$ plain form
16744 67601274 70134023 72576272 75130841 77767518 80281191 83451042 85973680 88849904
16736 88849904 91568417 94344479 97154132 99934239 102706789 105233672 107738518 110066852
16728 110066852 112296182 113970818 116084123 117571391 118589393 119648301 120296580 120390503
16720 120390503 120725602 120392753 119683761 118496650 117360180 116050245 114015588 112273331
16712 112273331 109944042 107704003 105269484 102651309 99968630 97033952 94062348 91228539
16704 91228539 88448382 85504418 83005807 79714609 77059525 74348658 71729796 68999069
16696 68999069 66405936 64233885 62174511 59921257 57236212 55435601 53261511 51109995
16688 51109995 49712215 47978264 46185349 44369619 42938192 41469622 39993392 38565947
$$ packed form
16744F7601274K532749K442249K554569K636677K513673L169851K522638K876224
16736H8849904K718513K776062K809653K780107K772550K526883K504846K328334
16728A10066852K229330J674636K113305J487268J018002J058908O48279R3923
16720A20390503L35099l32849p08992j187111j136470j309935k034657j742257
16712A12273331k329289k240039k434519k618175k682679k934678k971604k833809
16704I1228539k780157k943964k498611l291198k655084k710867k618862k730727
16696F8999069k593133k172051k059374k253254k685045j800611k174090k151516
16688E1109995j397780j733951j792915j815730j431427j468570j476230j427445
$$ plain form
16680 38565947 37207362 36074425 34577006 33629586 32538317 31669266 30551898 29640347
16672 29640347 28672354 27888224 26805804 26121921 25187327 24417309 23914929 23362350 22461151
16663 22461151 21612131 21355085 20908857 20033908 19277815 18742395 18628734 18073454 17326434
16654 17326434 16963924 16569548 16011795 16113295 14976402 14915853 14477956 14245869 13586442
16645 13586442 13885995 13223515 13130707 12576689 12135306 11861421 11717846 11640997 11589595 11147517
16635 11147517 10596768 10731960 10388018 10367606 10044671 9611128 9525113 9434985 9298543 9343182
16625 9343182 8618854 8973290 8307111 8335373 8382490 8219307 7746572 7566290 7395922 7253211
16615 7253211 7289939 7599871 6972922 6962177 6724401 6465367 6391746 6589163 6545141 6418533
$$ packed form
16680C8565947j358585j132937j497419r47420j091269q69051j117368r11551
16672B9640347r67993p84130j082420o83883r34594p70018n02380n52579r01199
16663B2461151q49020k57046m46228q74949p56093n35420j13661n55280p47020
16654A7326434l62510l94376n57753J01500j136893o0549m37897k32087o59427
16645A3586442K99553o62480r2808n54018m41383k73885j43575p6849n1402m42078
16635A1147517n50749J35192l43942k0412l22935m33543q6015r0128j36442M4639
16625I343182p24328L54436o66179K8262M7117j63183m72735j80282j70368j42711
16615G253211L6728L09932o26949j0745k37776k59034p3621J97417m4022j26608
$$ plain form
16605 6418533 6309062 6188862 5987842 5749661 5894548 5800893 5380773 5628535 5779131 5153873
16595 5153873 5199182 5035234 5079281 4885083 5109547 5102160 4660996 4852014 4631749 4426519
16585 4426519 4695882 4360401 4357779 4164890 4437236 4214912 4250380 4038385 4281477 4068246
16575 4068246 3856118 3894840 4020712 3932875 3597916 3530143 3651016 3657646 3711820 3151069
16565 3151069 3657762 3279523 3329013 3019161 3682916 3362927 3241129 3257665 2904519 3257322
16555 3257322 3076488 3145785 3004612 2917371 2754986 2941594 3051082 2782457 3136760 2869924
16545 2869924 2930338 2920118 2885778 2690704 2529994 2669534 2849121 2625681 2450584 2546557
16535 2546557 2468353 2794112 2397036 2286249 2264488 2181490 2408704 2512099 2243400 2080163
$$ packed form
16605F418533j09471j20200k01020k38181J44887r3655m20120K47762J50596o25258
16595E153873M5309j63948M4047j94198K24464p387m41164J91018k20265k05230
16585D426519K69363l35481k622j92889K72346k22324L5468k11995K43092k13231
16575D068246k12128L8722J25872q7837l34959o7773J20873O630N4174n60751
16565C151069N06693l78239M9490l09852O63755l19989j21798J6536l53146L52803
16555C257322j80834O9297j41173q7241j62385J86608J09488k68625L54303k66836
16545B869924O0414j0220l4340j95074j60710J39540J79587k23440j75097R5973
16535B546557p8204L25759l97076j10787k1761q2998K27214J03395k68699j63237
$$ plain form
16525 2080163 2303554 2186335 2227590 2043791 1840046 1959899 2205743 2351756 2031763 1925602
16515 1925602 1953063 1880822 2158128 1835752 1901527 1846576 2029103 1872054 1641499 1836618
16505 1836618 1685187 1901028 1764653 1768610 1658757 1953134 1649538 1764455 1628236 1884153
16495 1884153 1622388 1765708 1539223 1707488 1765021 1907787 1806323 1667473 1277335 1428860
16485 1428860 1348028 1341599 1606191 1477644 1590497 1456687 1569406 1779838 1492606 1356929
16475 1356929 1181799 1580512 1584329 1649876 1209766 1509267 1168691 1452502 1384991 1106075
16465 1106075 1512650 1093641 1518452 1409851 1131948 1217068 1230058 1222707 1320686 1374777
16455 1374777 1236694 1079282 1505833 1149304 1095132 1083979 1104767 1064794 946650 941241
$$ packed form
16525B080163K23391j17219M1255j83799k03745J19853K45844J46013l19993j06161
16515A925602K7461p2241K77306l22376O5775n4951J82527j57049k30555J95119
16505A836618j51431K15841j36375L957j09853K94377l03596J14917j36219K55917
16495A884153k61765J43320k26485J68265N7533J42766j01464j38850l90138J51525
16485A428860q0832o429K64592j28547J12853j33810J12719K10432k87232j35677
16475A356929j75130L98713L817O5547m40110K99501l40576K83811o7511k78916
16465A106075M06575m19009M24811j08601k77903Q5120J2990p351R7979N4091
16455A374777j38083j57412M26551l56529n4172j1153K0788l9973j18144n409
$$ plain form
16445 941241 994245 1121835 991223 1229489 1231794 974466 959865 1315342 1030990 999173
16435 999173 1054285 1072529 1131510 967855 805573 976528 910211 886405 897181 1146108 1080783
16424 1080783 809187 802446 692667 1129626 918806 1169069 824750 794950 780599 687070
16414 687070 1036014 1143974 833192 537898 991557 986965 939353 923571 861826 1031075
16404 1031075 851944 761771 830576 1003982 1071516 867810 797584 451406 1057857 1178350
16394 1178350 755631 972922 895349 1078465 478376 663161 639871 442695 917950 976819
16384 976819 816311 689445 575395 500815 711526 623591 557438 864363 817852 705869
16374 705869 743660 705177 813378 714717 631404 1121175 757406 630317 720438 557581
$$ packed form
16445I41241N3004J27590j30612K38266K305k57328j4601L55477k84352l1817
16435I99173N5112J8244N8981j63655j62282J70955o6317k3806J0776K48927o5325
16424A080783k71596o741j09779M36959k10820K50263l44319k9800j4351r3529
16414F87070L48944J07960l10782k95294M53659m592m7612j5782o1745J69249
16404A031075j79131r0173O8805J73406O7534k03706p0226l46178O06451J20493
16394A178350m22719K17291p7573J83116D78376J84785k3290j97176M75255N8869
16384I76819j60508j26866j14050p4580K10711q7935o6153L06925m6511j11983
16374G05869L7791l8483J08201r8661q3313M89771l63769j27089R0121j62857
$$ plain form
16364 557581 785395 693789 760496 746080 423657 679638 391477 485069 272509 416375
16354 416375 374000 770491 320240 854060 577981 377526 623359 1060761 393638 683121
16344 683121 354409 538351 478902 697811 517811 461531 847526 525032 604763 579178
16334 579178 424324 460230 127023 619231 764189 584023 694588 237211 643259 843568
16324 843568 330582 325781 687545 789855 475302 603683 566235 668944 274231 653092
16314 653092 455458 690810 325310 700443 398922 270361 308422 559390 845355 534245
16304 534245 234785 592966 511197 746134 99284 522139 380838 311052 538419 586117
16294 586117 380611 589001 391221 503990 359054 290904 530399 495416 396199 -78431
$$ packed form
16364E57581K27814r1606O6707j4416l22423K55981k88161R3592k12560J43866
16354D16375m2375L96491C20240N33820k76079k00455K45833M37402C93638K89483
16344F83121l28712J83942n9449K18909j80000n6280L85995l22494P9731k5585
16334E79178j54854L5906A27023M92208J44958j80166J10565B37211M06048K00309
16324H43568C30582m801L61764J02310l14553J28381l7448J02709B74231L78861
16314F53092j97634K35352C25310L75133l01521j28561L8061K50968K85965l11110
16304E34245B34785L58181q1769K34937I9284M22855j41301o9786K27367M7698
16294E86117k05506K08390j97780J12769j44936o8150K39495l4983r9217g8431
$$ plain form
16283 293505 385221 401806 410839 73526 510564 321560 426830 220429 427637 473965 455071
16272 455071 505946 477645 281751 647388 80866 143940 396613 579392 231125 275414
16262 275414 191952 255479 204185 275125 134276 657286 373803 421258 487341 540803 195458
16250 354756 312648 139642 304171 275332 356124 269588 73625 572937 -6069 316846 213761
16239 213761 600836 232547 392951 116207 94259 268600 370656 466219 270827 596829
16229 596829 201114 352113 133282 346953 365507 329877 90417 525611 388023 346990
16219 346990 370665 313045 117018 88963 450208 315073 567986 345565 168127 316261
16209 316261 -37425 188251 526481 274496 455274 403623 325474 244377 378802 208413
$$ packed form
16283B93505R1716J6585R033G3526M37038j89004J05270k06401K07208M6328j8894
16272D55071N0875k8301j95894L65637H0866O3074K52673J82779B31125M4289
16262B75414q3462O3527n1294P0940A34276N23010k83483M7455O6083N3462A95458
16250C54756m2108A39642J64529k8839Q0792q6536G3625M99312f069C16846j03085
16239B13761L87075B32547J60404A16207k1948J74341J02056R5563j95392L26002
16229E96829B01114J50999A33282K13671J8554l5630I0417M35194j37588m1033
16219C46990K3675n7620A17018k8055L61245j35135K52913k22421A68127J48134
16209C16261c7425A88251L38230k51985J80778n1651p8149q1097J34425j70389
$$ plain form
16199 208413 228088 -62417 65899 261070 145161 445809 228160 196438 196320 145263 62873
16187 192451 499506 189640 184084 182667 72810 369301 85502 531932 189380 109774 148514
16176 148514 40640 190367 580983 526505 663583 381674 7646 283252 176427 244501
16166 244501 366925 414408 68014 257098 560223 57648 -12147 148537 303911 -112988
16155 -3041 73389 201945 8197 45339 -66256 -116494 77596 -114114 264256 444985 91710
16143 433299 -18413 118558 229346 95015 3973 220820 66602 96687 52635 105544 40303
16131 301371 263987 318304 -17301 38120 254614 69304 135856 133344 -85827 94861 228459
16120 228459 409367 113104 102000 -135619 9908 4672 22517 161510 105549 373530 215750
$$ packed form
16199B08413J9675f2417F5899J95171j15909L00648k17649l1722j18n1057F2873
16187A92451L07055A89640n556j417G2810K96491H5502M46430A89380p9606L8740
16176A48514D0640J49727L90616n4478J37078k81909G646K75606j06825O8074
16166B44501J22424M7483F8014J89084L03125E7648a2147A48537J55374a12988
16155c041G3389J28556H197L7142f6256n0238G7596a14114B64256J80729I1710
16143D33299a8413A18558J10788I5015C973K16847F6602L0085m4052N2909D0303
16131C01371l7384N4317a7301C8120K16494F9304O6552k512h5827I4861J33598
16120B28459J80908A13104j1104a35619I908D672J7845J38993n5961K67981j57780
$$ plain form
16109 215750 109793 41359 -39910 167490 108117 138080 252872 139291 -116545 86078
16098 -27229 193540 228876 -18648 -16815 223152 212541 318255 42481 -69959 322870 194533
16087 194533 160205 4854 174182 -43624 -63997 284882 -92007 242687 -129988 469497 206502
16075 173373 198829 34746 -68613 503927 48961 -34387 76151 321637 118304 -92306 -109354
16064 -109354 -212238 3742 -49549 115176 121884 -279308 -128762 -215610 220220 243408 47601
16052 273528 -64493 -459288 -40388 123471 -38033 445980 254269 26218 -277279 149302
16041 54900 203993 -21106 71688 444156 -161456 55404 237527 134948 -58922 -98000 -73913
16030 -73913 -269788 251554 57171 241123 266217 119705 207196 50200 200749 -54557 302352
$$ packed form
16109B15750j05957D1359c9910A67490n9373K9963J14792j13581a16545H6078
16098b7229A93540L5336a8648J833B23152j0611J05714D2481f9959C22870j28337
16087A94533l4328D854J69328d3624k0373B84882i2007B42687a29988D69497B06502
16075A73373K5456C4746f8613E03927D8961c4387G6151K45486A18304i2306j7048
16064a09354j02884C742d9549A15176O708b79308a28762q6848B20220K3188D7601
16052B73528f4493l94795d0388A23471c8033D45980j91711B6218b77279A49302
16041E4900J49093b1106G1688L72468a61456E5404J82123j02579e8922l9078K4087
16030g3913j95875B51554E7171J83952K5094A19705Q7491E0200J50549e4557C02352
$$ plain form
16018 -30450 -92462 21437 186339 264459 156671 -113801 128013 141520 14983 62626 243755
16007 243755 59938 105798 -27500 -8362 290502 -198488 73284 -169148 -249318 72467 -420040
15995 228592 59971 3187 191990 -186612 71245 -58912 159637 402522 264294 1141014
15985 1141014 966455 1646634 1057594 783058 757496 602425 306938 238029 99529 303635
15975 303635 -37007 188095 -268251 -178465 229676 -183660 161118 101184 -377730 140130
15964 301461 -100884 -358932 -73533 -216484 -118435 -50887 288078 -109622 -61251 -248416
15954 -248416 60672 -33863 165654 -109109 250523 -349091 -162739 -212486 66593 -54088
15943 68734 -155991 3705 236702 153118 152926 -70540 147569 132861 189752 -69152 92338 -57239
$$ packed form
16018c0450o2012B1437J64902P8120j07788a13801A28013J3507A4983M7643J81129
16007B43755E9938M5860b7500h362B90502a98488G3284a69148q0170G2467d20040
15995B28592E9971C187J88803a86612G1245e8912A59637K42885j38228Q76720
15985A141014j74559O80179n89040k74536k5562j55071k95487o8909I9529K04106
15975C03635c7007A88095b68251Q9786B29676a83660A61118n9934c77730A40130
15964C01461a00884k58048g3533j42951R8049e0887B88078a09622M8371j87165
15954b48416F0672c3863A65654a09109B50523c49091a62739m9747F6593e4088
15943F8734a55991C705K32997q3584j92g0540A47569j4708N6891f9152I2338e7239
$$ plain form
15930 -127675 65087 36511 -114204 74677 58890 -128126 -166823 -31212 -188253 -96969 -151106
15919 -151106 139863 -21369 -95307 111192 -142189 -76985 -169135 -238092 -27373 -164195 -234557
15908 -234557 77328 59862 -57180 -47293 35413 -65234 -35511 -213533 -156084 442804 -29719
15896 21026 16570 -5199 163943 -110080 -296413 -165197 61683 70746 239502 -483207 -44069
15884 116369 128092 -136903 -70845 -313486 -119070 19120 -48303 258903 115843 -115476
15873 -79143 -1075 24713 -142431 -268197 1000 -138066 47585 25004 26236 269834 -35394
15861 -90219 19707 -233427 -78154 26678 180355 -51787 34680 25668 133818 -208795 60359
15849 -36680 9777 27078 448583 262548 -95396 192476 114961 -29455 -123540 -122017 61006
$$ packed form
15930a27675F5087k8576a14204G4677j5787a28126l8697c1212j57041R1284n4137
15919a51106A39863b1369p3938A11192a42189O5204r2150o8957b7373j36822p0362
15908b34557G7328j7466e7180R887C5413f5234K9723j78022N7449D42804b9719
15896B1026m456e199A63943a10080j86333J31216F1683R063J68756d83207d4069
15884A16369J1723a36903O6058k42641a19070A9120d8303B58903A15843a15476
15873g9143a075B4713a42431j25766A000a38066D7585k2581J232K43598c5394
15861i0219A9707b33427g8154B6678J53677e1787C4680r012J08150b08795F0359
15849c6680I777J7301M21505j86035i5396A92476p7515b9455r4085J523F1006
$$ plain form
15837 83854 257382 -378218 264361 408494 25143 107917 -201317 -249542 -8066 -178852 30233
15825 41389 -415804 -22357 -29478 -89870 -270240 12899 -12937 -294654 -189190 -196038 -65573
15813 -80473 261898 152178 -80049 56116 -84101 144811 174160 100473 26154 -316181 -6664
15801 -64432 -46705 16545 -79698 -69320 135852 147380 -140901 -36298 171354 104423 -63316
15789 169911 -177725 -293641 182059 10753 -124800 174137 -183731 -96075 21653 -139934
15778 47507 -24683 152208 198024 138497 -352893 5237 37665 193275 317855 -170223 -277035
15767 -277035 69372 -326341 -124325 -33702 -21135 -103176 5893 9950 -61329 -31062 -106272
15756 -106272 207526 159646 26922 -8752 -165464 -46893 16505 54528 -99266 70791 -118307
$$ packed form
15837H3854J73528c78218B64361J44133B5143Q2774b01317m8225h066j70786C0233
15825D1389d15804b2357p121o0392j80370A2899a2937k81717J05464o848f5573
15813h0473B61898j09720h0049E6116h4101A44811K9349p3687B6154c16181f664
15801f4432J7727A6545g9698J0378A35852J1528a40901c6298A71354o6931f3316
15789A69911a77725j15916A82059A0753a24800A74137a83731Q7656B1653a39934
15778D7507b4683A52208M5816n9527c52893E237L2428J55610J24580a70223j06812
15767b77035F9372c26341a24325c3702J2567q2041E893M057f1329L0267p5210
15756a06272B07526m7880B6922h752j56712d6893A6505L8023i9266G0791a18307
$$ plain form
15744 -75965 -19738 150226 178495 -198285 63691 -367991 165990 140560 -192495 -219689 60793
15732 93690 -145149 -117166 84591 -271067 126340 80621 -46950 -259922 64376 359590 -91735
15720 -132100 19092 75502 -157590 -307362 -60015 182706 -88439 -123274 201503 -2549 -270564
15709 -270564 97687 4944 31213 -147299 -12527 41285 -466344 -67311 113022 386650 -241644
15697 10113 72547 -65887 -142170 73016 -192737 397828 186491 36564 -17749 247841 38752
15685 -7662 -95961 170311 -62013 172429 -136708 63426 9517 36905 109579 -166820 -68773
15673 -114632 345137 51391 -95500 231513 136816 -118221 -235318 15168 -257848 28420
15662 -111972 -85376 -272957 -8345 -73108 -42898 118400 -214198 -153763 -164134 -123475 26595
$$ packed form
15744g5965a9738A50226K8269a98285F3691c67991A65990k5430a92495k7194F0793
15732I3690a45149K7983H4591b71067A26340m5719d6950k12972F4376K95214i1735
15720a32100A9092N6410a57590j49772f0015A82706h8439l4835B01503b549k68015
15709b70564I7687D944K6269a47299a2527D1285d66344f7311A13022K73628b41644
15697A0113O2434f5887p6283G3016a92737C97828A86491C6564a7749B47841C8752
15685g662q8299A70311f2013A72429a36708F3426I517K7388P2674a66820f8773
15673a14632C45137E1391i5500B31513r4697a18221j17097A5168b57848B8420
15662a11972K6596j87581h345o4763L0210A18400b14198O0435j0371M0659B6595
$$ plain form
15650 -207472 -269549 -72261 -95328 112477 150862 -158655 -1190 130506 8214 170068 -37301
15638 -168952 -301862 4246 1209 36376 235480 -177536 -172585 -40523 -30762 -130438 -220688 -342056
15626 -342056 -46135 188818 199272 5381 11842 -132883 -3619 -153027 114932 -6713 -171726
15615 -171726 -211506 -291317 -15094 -289045 -180654 130768 -71140 41321 -190621 -169088 -42924
15603 119405 -113868 260872 -73195 -39521 -117493 237056 -57120 -264638 48578 28840 33645
15592 33645 -201726 11400 190838 39830 288618 -399788 -126339 -217027 -24225 80336 -327322
15580 -153114 -91050 -145304 106697 -28620 53019 159951 -14665 37136 -182981 53149 -24974
15568 50220 -153854 202729 -99814 -182869 -422278 -101069 32394 -42521 -244367 -248692 69330
$$ packed form
15650b07472o2077g2261k3067A12477L8385a58655a190A30506H214J61854c7301
15638a68952j32910D246A209L5167J99104a77536M951d0523R761r9676r0250j21368
15626c42056d6135A88818J0454E381O461a32883c619j49408A14932f713j65013
15615a71726l9780p9811a5094k73951J08391A30768g1140D1321a90621K1533d2924
15603A19405a13868B60872g3195L3674p7972B37056e7120k07518D8578j9738M805
15592C3645b01726A1400J79438C9830K48788c99788a26339r0688b4225H0336c27322
15580a53114O2064n4254A06697b8620E3019J06932a4665C7136a82981E3149b4974
15568E0220a53854B02729i9814q3055k39409a01069C2394d2521k01846m325F9330
$$ plain form
15556 -102391 -267306 111941 -314037 -127630 -247735 -243453 -54049 -388772 -120583 150117
15545 -18145 206743 31872 89635 -119009 72036 252780 353091 10647 163287 -342841
15534 829 278554 31669 292002 478 -112030 193955 -263940 119845 -36238 -74403 -160310
15523 -160310 -13970 144918 -131917 112123 -159571 210927 -25182 111184 373025 157614
15512 -14867 314519 -45653 191956 242111 -107229 264172 164990 -36719 -216078 257202
15501 -60154 -4366 262787 209070 120026 154963 320138 105247 148183 267543 478841 283589
15490 283589 139545 60285 292161 276847 75624 22229 -305001 38179 312685 -270186
15479 400963 126539 187859 307697 276260 176540 671156 623186 589350 695981 196096
$$ packed form
15556a02391j64915A11941c14037a27630j20105M282e4049l34723a20583A50117
15545a8145B06743C1872N7763a19009G2036J80744J00311A0647J52640c42841
15534H29K77725C1669K60333D78a12030A93955b63940A19845c6238l8165q5907
15523a60310a3970A44918a31917A12123a59571B10927b5182A11184K61841A57614
15512a4867C14519d5653A91956N0155a07229B64172r9182c6719j79359B57202
15501f0154d366B62787n3717q9044L4937J65175A05247M2936J19360K11298j95252
15490B83589A39545F0285K31876j5314G5624B2229c05001C8179K74506b70186
15479D00963A26539O1320J19838l1437r9720M94616m7970l3836J06631A96096
$$ plain form
15468 191796 414878 286239 84925 -218450 233135 -124830 -72345 269471 -1370 -193780
15458 -193780 -131040 282950 -130039 8973 -89736 169124 84616 89859 234655 274642 190242
15447 190242 140965 35593 153166 -41186 499010 803857 1225049 1315089 917661 561677
15437 561677 183067 87758 497535 453111 397793 196904 78932 48424 335627 201777
15427 201777 -127428 -251965 85122 170267 156647 6498 99951 110492 -26353 -69328 -47312
15416 -47312 348825 184579 -254452 -113126 255902 30726 -146751 -122073 -46324 266035
15405 13761 115362 -64910 124942 -8207 122019 26946 -237902 -382294 -27698 -357067 -153255
15393 180484 -50031 -107993 15173 250950 -156309 331256 -315201 -86483 19104 -145409
$$ packed form
15468A91796K23082j28639H4925b18450B33135a24830N2485B69471a370j92410
15458a93780O2740B82950a30039H973h9736A69124q4508N243J44796L9987q4400
15447A90242m9277C5593J17573d1186D99010L04847M21192R0040l97428l55984
15437E61677A83067H7758M09777m4424n5318A96904G8932l0508K87203j33850
15427B01777a27428j24537H5122Q5145j3620F498R3453J0541b6353m2975K2016
15416d7312C48825j64246b54452a13126B55902C0726a46751K4678d6324B66035
15405A3761J01601f4910A24942h207A22019B6946b37902j44392b7698l29369a53255
15393A80484e0031n7962A5173K35777a56309C31256c15201h6483A9104a45409
$$ plain form
15382 174351 241174 177943 -340816 -41885 75845 143193 240623 177013 413626 91755 371229
15371 371229 268941 -15107 195344 -59924 302001 334084 89633 186686 262709 117500 313392
15360 313392 -60359 -106624 220543 2925 376400 13273 -134446 222776 249065 564914 -136799
15348 321838 124844 236860 74530 -111438 369706 140043 61136 337780 433599 245264
15338 245264 216855 -28803 325413 -43800 410132 239711 61316 418920 256852 -96915
15327 235649 353705 274354 -135506 277655 157347 41579 180239 -122628 242126 250821
15317 250821 225244 49848 -77513 465248 -559 109901 197774 -137374 181342 80394 142939
15306 142939 192178 -28337 -107543 79723 -170959 -77947 52088 7957 214610 91375 -25044
$$ packed form
15382A74351O6823o3231c40816d1885G5845O7348R7430o3610K36613I1755K79474
15371C71229j02288a5107A95344e9924C02001L2083H9633R7053P6023A17500J95892
15360C13392f0359m6265B20543B925L73475A3273a34446B22776K6289L15849a36799
15348C21838A24844J12016G4530a11438C69706A40043F1136K76644R5819j88335
15338B45264k8409b8803C25413d3800D10132j70421F1316L57604j62068i6915
15327B35649J18056p9351a35506B77655j20308D1579J38660a22628B42126Q695
15317B50821k5577D9848g7513D65248e59A09901Q7873a37374A81342H0394O2545
15306A42939M9239b8337p9206G9723a70959g7947E2088G957K06653I1375b5044
$$ plain form
15294 202039 70358 316146 -43037 4230 453486 -159582 -132531 -106557 -122427 65475 -22799
15282 100404 111650 -56625 1315 71132 -124151 -195011 -149116 -187053 131290 -40982 70825
15270 -203392 157332 350545 171899 16625 159013 20264 -10019 -68578 50229 233104
15260 233104 132722 -185244 -107765 39850 152056 -47760 -8962 -54970 191706 -272828 59771
15248 -48519 55056 178303 237164 212571 427400 1436970 1973789 1301826 2092503 980189
15237 345805 164305 152248 307997 -85364 -26034 152000 20025 328330 -30646 64380 97651
15226 97651 246956 185565 87190 -204708 70954 96050 325563 537611 145580 27006 22992
15215 22992 270840 -2473 -42919 44492 -474864 -4420 -56909 -106390 -171913 173384 209035
$$ packed form
15294B02039G0358K45788d3037D230M49256a59582K7051K5974j5870F5475b2799
15282A00404J1246e6625A315O9817a24151p0860M5895l7937A31290d0982G0825
15270b03392A57332J93213A71899A6625J42388B0264a0019n8559E0229J82875
15260B33104j00382a85244P7479C9850J12206d7760h962m6008A91706b72828E9771
15248d8519E5056J23247N8861k4593K14829J009570N36819o71963P90677I80189
15237C45805A64305j2057J55749h5364b6034A52000B0025L08305c0646F4380L3271
15226I7651J49305o1391H7190b04708G0954K5096K29513K12048A45580B7006m014
15215B2992K47848b473m0446D4492d74864d420n2489m9481o5523A73384L5651
$$ plain form
15204 209035 -84682 281802 47030 89857 -3328 102671 218219 152030 276525 -198197 312447
15192 -46597 95939 75698 272376 -141629 157898 305056 154624 224014 445974 320141
15182 320141 89790 -197646 -265582 -106033 168793 -247469 65618 75387 97976 54998 -29972
15170 -259237 492299 171743 72775 -216426 -59500 -162056 166677 219697 22676 2949 -27266
15158 160040 22427 323086 10101 101085 134549 33296 180310 187239 185320 247219 66146
15146 137365 -51102 -37489 315292 236640 27354 506263 381786 -87001 190492 208020 531000
15135 531000 -247342 264742 214095 345793 330868 -120685 196260 350020 377615 147910
15124 223780 -118714 180436 115529 227996 38596 580883 432376 600316 90986 371374
$$ packed form
15204B09035h4682B81802D7030M2827c328A02671J15548o6189J24495a98197C12447
15192d6597I5939k0241J96678a41629A57898J47158j50432O9390K21960j25833
15182C20141H9790a97646o7936a06033A68793b47469F5618R769K2589m2978b9972
15170b59237D92299A71743G2775b16426e9500j02556A66677N3020B2676B949b7266
15158A60040B2427L00659A0101R0984L3464C3296J47014O929j919O1899F6146
15146A37365e1102J3613C15292p8652B7354M78909j24477h7001A90492J7528L22980
15135E31000b47342B64742n0647J31698j4925a20685A96260J53760K7595A47910
15124B23780a18714A80436o4907J12467C8596N42287j48507J67940I0986K80388
$$ plain form
15114 371374 458173 316122 -20716 -51948 37039 208585 178369 346687 -56557 -80584 10303
15102 -357005 141116 -67753 156288 3892 273701 362160 -215148 89601 180700 -229056 -33592
15090 155557 -17257 47860 2640 91832 132671 208541 191051 199896 279687 397749 66683 339472
15078 339472 366357 306069 383727 231335 271305 293299 201458 -10580 -144965 169695 -66581
15066 153323 462579 215772 310044 199049 287013 186883 529773 477494 73043 435001
15056 435001 252749 342615 438102 11545 547633 292554 360206 155672 236947 233811 134801
15045 134801 250535 353528 344814 396355 405482 368807 174409 681947 296255 391934 -313337
15033 627787 595407 760495 677217 690249 926037 941781 313146 602259 677661 510308
$$ packed form
15114C71374Q6799j42051b0716l1232C7039J71546l0216J68318e6557k4027A0303
15102c57005A41116f7753A56288C892K69809Q8459b15148H9601R1099b29056c3592
15090A55557a7257D7860B640Q9192M0839P5870j7490Q845P9791J18062F6683K72789
15078C39472K6885o0288P7658j52392L9970K1994r1841a0580j34385A69695f6581
15066A53323L09256B15772R4272j10995Q7964j00130L42890n2279G3043L61958
15056D35001j82252Q9866R5487A1545N36088k55079O7652A55672Q1275l136r9010
15045A34801J15734J02993q714N1541R127l6675A74409N07538B96255R5679c13337
15033F27787l2380J65088q3278J3032K35788J5744C13146K89113P5402j67353
$$ plain form
15023 510308 312848 23318 461868 282436 335391 517529 565001 525855 178698 367632
15013 367632 300150 347093 319674 706074 728670 440087 574292 252713 693069 520827
15003 520827 385843 604163 122189 317810 760336 501910 499626 292982 370165 409751
14993 409751 165973 397429 184389 610119 760494 345027 799101 295304 305407 601761
14983 601761 421432 674890 471479 1030384 824706 800300 613645 356340 553660 634473
14973 634473 754227 715001 570776 709140 400329 546643 512268 332940 129625 380773
14963 380773 63229 490443 403831 54831 545286 463922 261148 355341 556914 440761
14953 440761 400284 198955 74038 537554 248795 220560 281423 384148 442725 623933
$$ packed form
15023E10308j97460B3318M38550j79432N2955J82138M7472l9146A78698J88934
15013C67632o7482M6943k7419L86400K2596k88583J34205B52713M40356j72242
15003E20827j34984K18320A22189J95621M42526k58426k284k06644P7183L9586
14993D09751A65973K31456A84389M25730J50375C45027M54074B95304J0103K96354
14983F01761j80329K53458k03411N58905k05678k4406j86655k57305J97320Q0813
14973F34473J19754l9226j44225J38364l08811J46314l4375j79328A29625K51148
14963C80773F3229M27214q6612E4831M90455q1364k02774R4193K01573j16153
14953D40761m0477A98955G4038M63516B48795k8235O0863J02725N8577J81208
$$ plain form
14943 623933 787477 895547 631698 699475 469853 416851 294703 79275 569349 665737
14933 665737 620775 629944 1082529 987648 1036284 1141294 1212203 1284739 1629168 1302404 1459109
14922 1459109 1559216 1301982 1039745 1296006 1854659 2140852 2283051 2100841 2112142 1295242
14912 1295242 1325611 998726 957281 892434 463043 762810 829037 702772 668236 478165
14902 478165 702492 145884 362367 625119 274745 424180 281044 403218 280169 486121
14892 486121 258943 457464 394835 387186 480548 159947 698579 637920 793982 893789 961710
14881 961710 962986 743002 790507 864534 747555 710066 481846 544249 356725 419037 483747
14870 483747 -87686 550473 205766 482343 887280 1010678 579130 617085 834926 467976
$$ packed form
14943F23933J63544J08070k63849O7777k29622n3002j22148G9275M90074R6388
14933F65737m4962R169M52585r4881M8636J05010P0909P2536L44429l26764J56705
14922A459109J00107k57234k62237K56261N58653K86193J42199j82210J1301q16900
14912A295242L0369l26885m1445o4847m29391K99767O6227j26265l4536j90071
14902D78165K24327A45884K16483K62752B74745J49435j43136J22174j23049K05952
14892D86121k27178J98521o2629p649R3362A59947N38632o0659J56062R9807O7921
14881I61710J276k19984M7505P4027j16979l7489k28220O2403j87524O2312O4710
14870D83747h7686E50473B05766K76577M04937J23398m31548L7955K17841l66950
$$ plain form
14860 467976 925489 673893 510019 365515 360856 500904 541698 715344 454397 660290
14850 660290 269869 381411 608244 426762 468924 1039012 809755 1225542 885568 872968
14840 872968 954772 1050219 1283833 878451 1168571 1129373 902844 513394 458479 739720
14830 739720 442762 371863 390285 330092 217459 942016 389303 477674 585568 617442
14820 617442 697841 361849 593771 872809 582058 618069 571507 807296 682225 821771
14810 821771 407795 763373 887918 865027 846484 988389 1133553 997030 1089386 839798
14800 839798 806879 648730 394399 670692 368103 450419 551259 545403 314204 797047
14790 797047 645656 649435 607939 988910 648465 407942 421879 476441 753633 873202
$$ packed form
14860D67976M57513k51596j63874j44504m659J40048M0794J73646k60947K05893
14850F60290B69869J11542K26833j81482M2162N70088k29257M15787l39974j2600
14840H72968Q1804R5447K33614m05382K90120l9198k26529l89450n4915K81241
14830G39720k96958p0899J8422o0193j12633P24557C89303Q8371J07894L1874
14820F17442Q0399l35992K31922K79038k90751L6011m6562K35789j25071J39546
14810H21771D07795L55578J24545k2891j8543J41905J45164j36523R2356k49588
14800H39798l2919j58149k54331K76293l02589Q2316J00840n856k31199M82843
14790G97047j51391L779m1496L80971l40445k40523J3937N4562K77192J19569
$$ plain form
14780 873202 799786 958328 627760 887300 767629 1074385 791779 1000912 1030387 946153
14770 946153 545598 869767 533568 608542 337448 777365 465376 529986 601613 690840
14760 690840 849775 633756 632124 431871 562041 600406 746629 796587 715840 772701 421985
14749 421985 564675 544382 678229 909277 821862 688032 839880 480737 595422 724863
14739 724863 581874 343653 1049533 490868 991029 475344 1058827 911728 1384239 925078
14729 925078 1107980 1266730 1734788 1961849 1851092 1692027 1568784 1093125 859708 1393992
14719 1393992 1131463 754268 990313 977053 894010 854927 987926 1106331 779307 1025031
14709 1025031 931821 872068 1018047 756328 1294155 1030193 1207644 1491664 1639113 1900591
$$ packed form
14780H73202p3416J58542l30568K59540j19671L06756k82606K09133K9475q4234
14770I46153m00555L24169l36199P4974k71094M39917l11989O4610P1627Q9227
14760F90840J58935k16019j632k00253J30170L8365J46223M9958q0747N6861l50716
14749D21985J42690k0293J33847K31048q7415j33830J51848l59143J14685J29441
14739G24863j42989k38221P05880D90868N00161D75344N83483j47099M72511m59161
14729I25078J82902J58750M68058K27061j10757j59065j23243m75659k33417N34284
14719A393992k62529l77195K36045j3260q3043l9083J32999J18405l27024K45724
14709A025031r3210n9753J45979k61719N37827k63962J77451K84020J47449K61478
$$ plain form
14699 1900591 1640255 1554639 1704440 1154147 1138439 975607 923163 1032854 949964 892961
14689 892961 1068711 927290 840015 826532 961328 773550 916914 1144081 985920 866945
14679 866945 1202382 1223551 1328152 1086312 984420 879124 1088349 928220 1068892 941453
14669 941453 1049525 684546 1111814 1004544 1312916 675091 1204284 857931 983410 1385089
14659 1385089 909363 996320 307840 959840 1089019 1013497 1018909 1093466 1496926 1405676
14649 1405676 1330699 832941 1239010 1341620 1184349 1205488 1187318 1202492 1475995 1283207
14639 1283207 1396276 1506253 951982 1053029 1310178 1140194 1258029 1512130 1343957
14630 1343957 1023960 1078951 1266168 1449733 1132738 1532033 1160407 1556022 1352841 1617242
$$ packed form
14699A900591k60336q5616J49801n50293j5708j62832n2444J09691q2890n7003
14689H92961J75750j41421q7275j3483J34796j87778J43364K27167j58161j18975
14679H66945L35437K1169J04601k41840j01892j05296K09225j60129J40672j27439
14669I41453J08072l64979M27268j07270L08372o37825N29193l46353J25479M01679
14659A385089m75726Q6957C07840O52000J29179p5522N412P4557M03460r1250
14649A405676p4977m97758M06069J02610j57271K1139j8170J5174K73503j92788
14639A283207J13069J09977n54271J01047K57149j69984J17835K54101j68173
14630A343957l19997N4991J87217J83565l16995L99295l71626L95615k03181K64401
$$ plain form
14620 1617242 1408092 1062044 1740323 1347884 1519206 1135910 1436123 1605109 1523497 1541981
14610 1541981 1593368 1597698 1392610 1534342 1498513 1563102 1581732 1364351 1300184 1557137 1827015
14599 1827015 1320005 1577357 1456367 1687247 1528940 1774842 1577140 1730903 1753574 2010203
14589 2010203 1565109 1691318 1734155 1978806 2193650 1675459 1844216 1713772 1982726 1992748
14579 1992748 1783998 1976106 1929467 1948131 1891717 1982823 1839834 1998194 2163716 2297467
14569 2297467 2220524 2130308 2487457 2376475 2394399 2308594 2302889 2578830 2365317 2429282 2712515
14558 2712515 3003108 2995965 3475234 2987544 3255083 3620337 3860880 4447569 5318908 7046001
14548 7046001 10403490 18250550 39123113 47624392 19568268 7748400 3980474 3184030
$$ packed form
14620A617242k09150l46048O78279l92439J71322l83296L00213J68986q1612J8484
14610A541981N1387M330k05088J41732l5829O4589J8630k17381o4167K56953K69878
14599A827015n07010K57352j20990K30880j58307K45902j97702J53763K2671K56629
14589B010203m45094J26209M2837K44651K14844n18191J68757j30444K68954J0022
14579A992748k08750J92108m6639J8664n6414R1106j42989J58360J65522J33751
14569B297467p6943r0216L57149j10982J7924q5805n705K75941k13513O3965K83233
14558B712515K90593p143M79269m87690K67539L65254K40543N86689Q71339J727093
14548G046001L357489P847060K0872563Q501279A9568268G748400l767926p96444
$$ plain form
14540 3184030 2704678 3688874 5958994 3339063 2281388 2167654 2187294 1992677 2005277
14531 2005277 1781099 1953094 2023076 2249775 2111990 2319346 2246964 2562591 2372409 2371852
14521 2371852 2286509 2606842 2579962 2396767 2074849 2805347 2577287 2410579 2616367 2877063
14511 2877063 2488602 2834270 2484486 2890942 2643536 2840008 2944096 2737510 3173709
14502 3173709 2972964 2588563 2907269 2977843 3332907 3194018 3149688 3352103 3287317 3359176
14492 3359176 3422464 3274565 3222858 3449573 3394779 3574007 3495177 3583236 3662323 3564930 4052540
14481 4052540 3832661 3727694 3757526 3969570 3824027 3884507 4150737 4158460 4196424 4166719
14471 4166719 4154055 4191154 4133474 4358006 4182449 4690743 4495877 4683174 5015936 4505223
$$ packed form
14540C184030m79352R84196K270120k619931j057675j13734J9640j94617J2600
14531B005277k24178J71995O9982K26699j37785K07356p2382L15627j90182n57
14521B371852q5343L20333k6880j83195l21918P30498k28060j66708K05788K60696
14511B877063l88461L45668l49784M06456k47406J96472J04088k06586M36199
14502C173709k00745l84401L18706P0574L55064j38889m4330K02415o4786P1859
14492C359176O3288j47899n1707K26715n4794J79228p8830Q8059P9087r7393M87610
14481D052540k19879j04967K9832K12044j45543O0480K66230P723L7964k9705
14471D166719j2664L7099n7680K24532j75557N08294j94866J87297L32762n10713
$$ plain form
14461 4505223 4636694 5217459 4469205 4720825 4813853 4746223 5302543 4552942 4742397 5258822
14451 5258822 5014055 5136333 5504130 5474236 5348255 5757876 5946342 5576225 5910827 5567289
14441 5567289 6064089 5800874 6204328 6203809 5877938 6600364 6177897 6833897 6700436 6993553
14431 6993553 6774353 6953318 6923064 7240256 7324367 7199782 7400936 7665853 7597512 8187853
14421 8187853 7854022 8413717 8309873 8584669 8608313 8940495 8738032 8574599 8561570 8820209
14411 8820209 8741885 9073056 9370465 9360184 9537567 9824112 10009777 10262885 10117972 10573199
14401 10573199 10442800 10418846 10390179 10761075 10835376 11097467 11286471 11576018 11518218 11820633
14391 11820633 11949297 12326620 12443214 12666707 13189563 13014469 13542736 13538047 14130094 14468879
$$ packed form
14461D505223J31471N80765p48254K51620R3028o7630N56320p49601J89455N16425
14451E258822k44767J22278L67797k9894j25981M09621J88466l70117L34602l43538
14441E567289M96800k63215M03454n19l25871P22426m22467O56000j33461K93117
14431F993553k19200J78965l0254L17192Q4111j24585K01154K64917o8341N90341
14421H187853l33831N59695j03844K74796K3644L32182k02463j63433j3029K58639
14411H820209p8324L31171K97409j0281J77383K86545J85665K53108j44913M55227
14401A0573199j30399k3954k8667L70896P4301K62091J89004K89547n7800L02415
14391A1820633J28664L77323J16594K23493N22856j75094N28267m689N92047L38785
$$ plain form
14381 14468879 14691859 15184757 15205380 15459532 15604176 16055705 15929824 16167614 16596834
14372 16596834 17282678 17138984 17905097 18380806 18559345 18990090 19416089 20089061 20273237
14363 20273237 20804006 21362394 21467527 22174010 22210022 23180295 23414537 23881981 24881791
14354 24881791 24965910 25977990 26340168 27014725 27639530 28508463 28892309 29870905 30663918
14345 30663918 30943459 32196374 32977939 33945927 34889807 35682535 36737374 37684428 38974576
14336 38974576 40036910 41064481 42451868 43686241 44738257 46353590 47730150 48891643
14328 48891643 50632799 52445765 54118770 56088030 57886607 60080160 62049627 64073314
14320 64073314 66835965 68993604 71745877 74089148 76761156 79344762 82660467 85874438
$$ packed form
14381A4468879K22980M92898K0623K54152J44644M51529j25881K37790M29220
14372A6596834O85844j43694P66113M75709J78539M30745M25999O72972J84176
14363B0273237N30769N58388J05133P06483L6012R70273K34242M67444R99810
14354B4881791Q4119J012080L62178O74557O24805Q68933L83846R78596P93013
14345C0663918K79541J252915P81565R67988R43880P92728J054839R47054J290148
14336C8974576J062334J027571J387387J234373J052016J615333J376560J161493
14328D8891643J741156J812966J673005J969260J798577K193553J969467K023687
14320F4073314K762651K157639K752273K343271K672008K583606L315705L213971
$$ plain form
14312 85874438 89519475 93166072 96849618 101405049 105665798 110262653 115093247 120360475
14304 120360475 125796319 131561589 137815785 144058127 151061940 158457771 166012145 174151092
14296 174151092 182679570 191830203 201497806 212080697 222197900 233951045 245761803
14289 245761803 258539550 271324786 285107423 298992443 313162103 328210480 343343863
14282 343343863 358230259 373488198 388220158 403109569 416844577 429767527 441378875
14275 441378875 451191065 458644826 462677714 464306466 464233297 462853678 459743301 454877662
14267 454877662 448918468 440790403 430329840 418173912 404758340 389928215 374453512
14260 374453512 358427338 342326739 326457685 311080760 295387753 280813798 266415053
$$ packed form
14312H5874438L645037L646597L683546M555431M260749M596855M830594N267228
14304A20360475N435844N765270O254196O242342P003813P395831P554374Q138947
14296A74151092Q528478R150633R667603J0582891J0117203J1753145J1810758
14289B45761803J2777747J2785236J3782637J3885020J4169660J5048377J5133383
14282C43343863J4886396J5257939J4731960J4889411J3735008J2922950J1611348
14275D41378875R812190P453761M032888J628752p3169j379619l110377m865639
14267D54877662n959194q128065j0460563j2155928j3415572j4830125j5474703
14260C74453512j6026174j6100599j5869054j5376925j5693007j4573955j4398745
$$ plain form
14253 266415053 253035302 239948004 227593313 215864895 206344656 196535618 186258452
14246 186258452 176750335 168149010 160377293 152821771 145553027 138840376 132429235 126338540
14238 126338540 121203201 116009497 110759929 105972812 101167319 97406649 93530029 90034106
14230 90034106 86417191 82679272 79886175 76536343 74032324 70898457 68297613 66032371
14222 66032371 63515772 61643924 59567209 57561999 55635984 53664347 52160745 50431667
14214 50431667 49153085 47774974 46276878 44793278 43222092 41857615 40761746 40417408
14206 40417408 39190470 38148423 36433733 35733424 34728858 33764167 33675383 32298964 31458484
14197 31458484 30381984 29538416 28871125 28606503 27540072 26894597 26303232 25493126 25147340
$$ packed form
14253B66415053j3379751j3087298j2354691j1728418r520239r809038j0277166
14246A86258452r508117q601325p771717p555522p268744o712651o411141o090695
14238A26338540n135339n193704n249568m787117m805493l760670l876620l495923
14230I0034106l616915l737919k793097l349832k504019l133867k600844k265242
14222F6032371k516599j871848k076715k005210j926015j971637j503602j729078
14214E0431667j278582j378111j498096j483600j571186j364477j095869l44338
14206D0417408j226938j042047j714690p00309j004566r64691q8784j376419q40480
14197C1458484j076500q43568o67291k64622j066431o45475n91365q10106l45786
$$ plain form
14188 25147340 24246627 23811920 23236184 22795868 22292590 21964389 21585216 20933902 20413975
14179 20413975 19959516 19582706 18998542 18730569 17969771 17995505 17572954 17397513 16771439
14170 16771439 16592431 16037974 16475913 15677554 15660684 15415665 14674299 14884397 14558960
14161 14558960 14070350 13939469 13819954 13528300 13304577 12963550 12783736 12569577 12460977
14152 12460977 11900246 12130139 12063859 11700827 10876435 11105376 10892446 10831295 10992199 10425375
14142 10425375 10286380 10312832 9870003 10194629 9832243 9588556 9336484 9503079 9380288
14133 9380288 8994293 9227807 9107557 8492618 8725471 8453220 8012269 7808770 8163406
14124 8163406 8221135 7805232 8072229 7574400 7247253 7455929 7123058 7233299 7223921 7030998
$$ packed form
14188B5147340r00713m34707n75736m40316n03278l28201l79173o51314n19927
14179B0413975m54459l76810n84164k67973p60798K5734m22551j75441o26074
14170A6771439j79008n54457M37939p98359j6870k45019p41366K10098l25437
14161A4558960m88610j30881j19515k91654k23723l41027j79814k14159j08600
14152A2460977n60731K29893o6280l63032q24392K28941k12930o1151J60904n66824
14142A0425375j38995K6452m42829L24626l62386k43687k52072J66595j22791
14133I380288l85995K33514j20250o14939K32853k72251m40951k03499L54636
14124H163406N7729m15903K66997m97829l27147K08676l32871J10241r378j92923
$$ plain form
14114 7030998 6804433 6634012 6701116 6804584 6480060 6680087 6487942 6201053 6405792 6289844
14104 6289844 5930379 6274897 6105073 6137220 5968740 5981684 5856737 5910069 5417059 5503156
14094 5503156 5270052 5603003 5241689 5233891 5211876 5230100 4952347 5220966 4995791 4738015
14084 4738015 4980550 5130601 4614137 5170566 4510589 4570204 4404055 4597093 4395829 4849094
14074 4849094 4260907 4413259 4329383 4239573 4128942 4416209 4014165 4062830 3913349 3658694
14064 3658694 3882875 4015133 4082192 4341173 4345618 4323869 4034018 3856536 3951126 3644268
14054 3644268 3776753 3797467 3511601 3356143 3493679 3588256 3444839 3307261 3524880 3199606
14044 3199606 3352414 3422305 3264950 3257914 3198131 3030266 3415327 3282170 3082725 2874671
$$ packed form
14114G030998k26565j70421O7104J03468l24524K00027j92145k86889K04739j15948
14104F289844l59465L44518j69824L2147j68480J2944j24947N3332m93010Q6097
14094E503156k33104L32951l61314p798k2015J8224k77753K68619k25175k57776
14084D738015K42535J50051n16464N56429o59977N9615j66149J93038k01264M53265
14074D849094n88187J52352q3876q9810j10631K87267m02044M8665j49481k54655
14064C658694K24181J32258O7059K58981M445k1749k89851j77482R4590l06858
14054C644268J32485K0714k85866j55458J37536R4577j43417j37578K17619l25274
14044C199606J52808O9891j57355p036n9783j67865L85061j33157j99445k08054
$$ plain form
14034 2874671 2903073 3104507 3317602 3079417 3062372 2751506 2777962 3005268 2846636 2906187
14024 2906187 2772470 2714244 2828205 2454746 2681281 2506885 2774778 2592472 2283778 2705042
14014 2705042 2317914 2818900 2106978 2378722 2288817 2735576 1952392 2003436 2404010 2187969
14004 2187969 2282741 2291478 2444807 2206347 2030814 2151783 2396461 2158094 2222375 1945937
13994 1945937 1838736 1963627 2160809 2189663 2552242 3487030 5555045 10789738 29109599
13985 29109599 51620205 27104660 13089058 7818383 5908553 4759440 4138114 3169078
13977 3169078 3158491 2919937 2944118 2801242 2657637 2707876 2295787 2262233 2204118 2151437
13967 2151437 2328985 2208771 2260351 2418361 2419244 2193944 2469817 2020613 2282369 1823910
$$ packed form
14034B874671K8402K01434K13095k38185j7045l10866K6456K27306j58632N9551
14024B906187j33717n8226J13961l73459K26535j74396K67893j82306l08694M21264
14014B705042l87128N00986p11922K71744q9905M46759p83184N1044M00574k16041
14004B187969R4772Q737J53329k38460j75533J20969K44678k38367O4281k76438
13994A945937j07201J24891J97182K8854L62579R34788K068015N234693J8319861
13985B9109599K2510606k4515545A3089058n270675j909830j149113o21326r69036
13977C169078j0587k38554K4181j42876j43605N0239m12089l3554n8115n2681
13967B151437J77548j20214N1580J58010Q83k25300K75873m49204K61756m58459
$$ plain form
13957 1823910 1780405 2135531 2047277 1987637 1871881 1798474 1623569 1928867 2201986 1616379
13947 1616379 1905682 1806758 1534204 1913214 1896768 1827309 1567959 1680052 1985353 1795863
13937 1795863 1646884 1660568 1806309 1602699 1787481 1957139 1434256 1672818 1391264 1583655
13927 1583655 1600801 1694101 1405737 1592714 1170586 1492506 1679589 1627224 1332221 1506872
13917 1506872 1432034 1515406 1196877 1348954 1457164 1423525 1469080 1317836 1377484 1070191
13907 1070191 1297866 1257678 1752077 1253303 1521112 1062301 1283637 1309945 1380142 1129763
13897 1129763 1250368 1540202 1345849 1323042 824088 1108333 1297146 1214589 1155873 1188657
13887 1188657 1059069 1512446 1324757 1088069 971492 1320356 947579 1009524 1442349 1230945
$$ packed form
13957A823910m3505L55126q8254n9640j15756p3407j74905L05298K73119n85607
13947A616379K89303r8924k72554L79010j6446o9459k59350J12093L05301j89490
13937A795863j48979J3684J45741k03610J84782J69658n22883K38562k81554J92391
13927A583655J7146R3300k88364J86977m22128L21920J87083n2365k95003J74651
13917A506872p4838Q3372l18529J52077J08210l3639M5555j51244N9648l07293
13907A070191K27675m0188M94399m98774K67809m58811K21336K6308P0197k50379
13897A129763J20605K89834j94353k2807m98954K84245J88813q2557n8716L2784
13887A188657j29588M53377j87689k36688j16577L48864l72777O1945M32825k11404
$$ plain form
13877 1230945 917545 1164940 1270530 1044707 1196507 1340180 1165695 1121369 904539 1500477
13867 1500477 1251862 1115042 1174404 1047126 1131090 1116249 1221382 1096023 1014504 1050853
13857 1050853 1366880 1282549 991948 805088 906226 1107158 966721 1180616 1104703 1243480
13847 1243480 748471 1051634 849096 1126315 1229611 886815 968832 682915 938075 556961
13837 556961 943079 840881 916131 921716 920285 991487 701086 830332 1017957 944289 845285
13826 845285 977402 583272 1129778 1018685 889787 497725 934003 1029636 1066953 894027
13816 894027 840859 864548 859313 854950 973524 758593 690733 688019 662715 833496 495791
13805 495791 873184 868559 865358 547123 1131806 1023067 596146 331980 431812 365609 1043832
$$ packed form
13877A230945l13400K47395J05590k25823J51800J43673j74485m4326k16830N95938
13867A500477k48615j36820N9362j27278Q3964j4841J05133j25359q1519L6349
13857A050853L16027q4331k90601j86860J01138K00932j40437K13895p5913J38777
13847A243480m95009L03163k02538K77219J03296l42796Q2017k85917K55160l81114
13837E56961L86118j02198P5250N585j431P1202k90401J29246J87625p3668r9004
13826H45285J32117l94130N46506j11093j28898l92062M36278R5633L7317j72926
13816H94027n3168K3689n235m363J18574k14931o7860k714k5304J70781l37705
13805D95791L77393m625l201l18235N84683j08739m26921k64166R9832o6203O78223
$$ plain form
13794 1043832 768896 818809 733794 624423 681137 546065 736221 754810 644496 694006
13784 694006 700450 700841 765780 773724 490824 1057450 861635 405322 574641 341804 539429
13773 539429 755294 704082 579542 422362 714746 686628 879478 581954 650532 683025
13763 683025 713663 864323 681098 568763 469235 647602 1095394 515741 743502 641109
13753 641109 864171 588688 465566 571072 739243 709465 663550 415476 699421 450157
13743 450157 584025 345221 900358 619684 592581 663384 618341 657554 518814 207879
13732 445359 551873 538400 683112 631043 388715 806276 331822 887502 489822 677405
13722 677405 509317 728031 685012 772277 510623 447924 470468 693663 389362 586979
$$ packed form
13794A043832k74936M9913q5015j09371N6714j35072J90156J8589j10314M9510
13784F94006O444L91O4939P944k82900N66626j95815D05322J69319k32837J97625
13773E39429K15865n1212j24540j57180K92384k8118J92850k97524O8578L2493
13763F83025L0638J50660j83225j12335r9528J78367M47792E15741K27761j02393
13753F41109K23062k75483j23122J05506J68171k9778m5915k48074K83945k49264
13743D50157J33868k38804N55137k80674k7103P0803m5043L9213j38740B07879
13732D45359J06514j3473J44712n2069k42328M17561C31822N55680l97680J87583
13722F77405j68088K18714m3019Q7265k61654o2699K2544K23195l04301J97617
$$ plain form
13712 586979 405661 332570 789837 561874 493636 794740 502084 441732 475869 647696
13702 647696 616266 546808 559131 517909 680324 250983 283822 599303 257510 398973
13692 398973 429064 224607 366855 804560 469161 334739 674488 312881 631317 356884
13682 356884 629028 614796 465760 338029 697433 383194 376775 263745 599373 550447
13672 550447 397862 494181 390942 592581 301410 491220 543152 298941 325843 180241
13662 180241 412794 367072 718794 315618 308030 643110 217324 510363 472029 618338
13652 618338 283725 377157 447720 294193 610365 496655 176700 674557 -212158 420379
13641 472874 115287 666875 562114 -15515 256147 466806 170470 279424 386571 53127
$$ packed form
13712E86979j81318p3091M57267k27963o8238L01104k92656o0352L4137J71827
13702F47696l1430o9458J2323m1222J62415B50983L2839L15481B57510J41463
13692C98973L0091k04457J42248M37705l35399j34422L39749C12881L18436k74433
13682C56884K72144j4232j49036j27731L59404l14239o419j13030L35628m8926
13672E50447j52585R6319j03239K01639k91171J89810N1932k44211K6902j45602
13662A80241K32553m5722L51722C15618p588L35080B17324K93039l8334J46309
13652F18338B83725R3432P0563j53527L16172j13710A76700M97857b12158D20379
13641D72874A15287N51588j04761a5515B56147K10659A70470J08954J07147E3127
$$ plain form
13630 105207 255958 263677 552730 421505 634696 811074 106322 289668 78383 114517
13620 114517 323567 122038 431821 307280 408097 592752 94653 439915 638771 558593
13610 558593 271819 365106 123395 481240 183598 194024 170007 249444 198562 215739 64609
13598 493764 199085 302675 471140 556171 424152 406392 177969 442502 443448 203416
13587 155837 439783 379416 662132 -132685 317785 49881 219626 51582 102107 189972
13577 189972 702959 379866 364113 412256 555510 307845 -187029 505956 351254 360228
13567 360228 329449 469395 398563 206214 353204 660918 154223 51399 228644 270397
13557 270397 352117 148 264067 443837 -80588 654667 55720 272885 332911 24647 251772
$$ packed form
13630A05207J50751P719K89053j31225K13191J76378A06322J83346G8383L6134
13620A14517K09050A22038L09783j24541J00817J84655I4653L45262J98856q0178
13610E58593B71819R3287A23395L57845A83598J0426k4017P9437n0882J7177F4609
13598D93764A99085J03590J68465Q5031j32019j7760A77969K64533R46B03416
13587A55837K83946o0367K82716a32685C17785D9881J69745E1582N0525Q7865
13577A89972N12987l23093j5753M8143J43254k47665a87029E05956j54702Q974
13567C60228l0779J39946p0832j92349J46990L07714A54223E1399J77245M1753
13557B70397Q1720A48K63919J79770h0588F54667E5720K17165O0026B4647K27125
$$ plain form
13546 251772 502893 692231 66112 330370 -69517 285727 592198 114228 582419 369002
13536 369002 515286 318145 491593 91933 158245 234883 92701 517601 477636 385746 351829
13525 351829 378957 175519 53641 428058 108146 390663 227074 185745 306875 194587
13515 194587 200627 405171 433802 562156 295563 125296 383955 12949 222137 331530
13505 331530 276215 510527 -34513 202432 25105 551637 377094 73313 79962 -20548 166765
13493 -73044 238257 372231 240640 120173 189961 267680 -94846 158721 -62072 304873
13482 133597 466988 403900 148356 209443 159741 194403 10589 514499 -121238 231228
13471 113978 72790 380095 123348 106694 308759 118338 134747 22900 115282 14425 209155
$$ packed form
13546B51772K51121J89338F6112K64258f9517B85727L06471A14228M68191k13417
13536C69002J46284j97141J73448I1933O6312P6638I2701M24900l9965r1890l3917
13525C51829K7128A75519E3641L74417A08146K82517j63589m1329J21130j12288
13515A94587O040K04544K8631J28354k66593A25296K58659A2949K09188J09393
13505C31530n5315K34312c4513B02432B5105N26532j74543G3313O649b0548A66765
13493g3044B38257J33974j31591A20173O9788P7719i4846A58721f2072C04873
13482A33597L33391o3088A48356O1087m9702L4662A0589N03910a21238B31228
13471A13978m1188L07305A23348j6654K02065A18338J6409B2900R2382A4425J94730
$$ plain form
13460 209155 317418 86108 182812 358731 18005 58299 403227 484783 191272 47105 175581
13449 175581 461999 240391 336820 146421 214689 30270 384748 474467 112871 533458
13439 533458 212071 53283 247505 16960 72537 482336 231107 25847 164159 296546
13429 296546 88630 109610 -117397 10825 164924 198425 79773 440205 112443 107602 269398
13418 269398 21536 301835 172208 323580 429534 -3695 64934 312954 258055 -225852
13407 75818 -24558 -98406 125718 287916 35591 7897 472481 303846 341339 203077 195487
13396 195487 433578 360741 111581 141958 159978 73998 300816 97132 299485 -93479 381544
13384 231627 301184 13031 109745 194241 71212 194756 304603 -49169 91504 136212 243969
$$ packed form
13460B09155J08263H6108R6704J75919A8005M0294L44928Q1556A91272D7105J28476
13449A75581K86418k21608R6429A46421O8268C0270L54478Q9719A12871M20587
13439E33458B12071E3283J94222A6960N5577M09799B31107B5847J38312J32387
13429B96546H8630K0980a17397A0825J54099L3501G9773L60432A12443m841J61796
13418B69398B1536K80299j29627J51372J05954c695F4934K48020n4899b25852
13407G5818b4558p3848A25718J62198C5591G897M64584j68635L7493j38262p590
13396A95487K38091p2837A11581L0377J8020G3998K26818I7132K02353i3479C81544
13384B31627O9557A3031R6714Q4496G1212J23544J09847d9169I1504M4708J07757
$$ plain form
13373 243969 64219 214493 99947 286941 433989 11370 -258695 377438 715058 370738
13363 370738 359756 168634 336511 -87004 282058 321506 123909 204089 -4803 387031 333231
13352 333231 253062 362514 236635 217489 69888 463737 403541 227438 527032 9300 297416
13341 297416 459479 262072 488691 126207 26130 42371 134851 375984 81421 84043 11858
13329 -32902 358039 152255 -83442 131192 177303 108947 293450 69327 384897 485353
13319 485353 166616 221016 345978 462426 217342 -45609 154809 217746 176097 372981
13309 372981 414679 225965 342225 254598 56351 233751 164223 293723 188276 -147879
13298 60789 -10919 468887 107560 310073 -52081 -25035 38174 260230 375600 272734
$$ packed form
13373B43969F4219J50274I9947J86994J47048A1370b58695C77438L37620l44320
13363C70738j0982A68634J67877h7004B82058L9448A23909Q0180d803C87031n3800
13352C33231q0169J09452j25879j9146F9888L93849o0196j76103K99594I300K88116
13341B97416J62063j97407K26619A26207B6130J6241R2480K41133H1421K622A1858
13329c2902C58039A52255h3442A31192M6111o8356J84503F9327L15570J00456
13319D85353A66616N4400J24962J16448B17342d5609A54809O2937m1649J96884
13309C72981M1698j88714J16260q7627E6351J77400o9528J29500j05447a47879
13298F0789a0919D68887A07560K02513e2081b5035C8174K22056J15370j02866
$$ plain form
13288 272734 47678 302214 223601 189152 -28922 386689 83706 458540 -116893 272977
13277 488710 249863 305817 -170737 110346 -44229 466148 248013 130702 -51462 270823
13266 293409 214468 -94980 79755 281998 397235 -127318 -268825 -130762 -123337 -148202 153087
13254 30814 -171227 83865 248957 220249 -95000 219839 52944 5621 104440 -141250 143409
13242 -48242 -283842 265097 301345 -17616 248165 10361 -146514 -42339 -345313 146889
13231 -259396 309198 101399 71814 444892 -101453 422498 -38935 -96051 -150505 -102669
13221 -102669 304506 250794 -89177 515874 -129585 -149904 119883 -18871 2629 183188 287887
13210 287887 228595 106705 -121616 75624 142446 -179557 -14989 43010 185299 -357016
$$ packed form
13288B72734D7678K54536p8613l4449b8922C86689H3706L74834a16893B72977
13277D88710k38847N5954a70737A10346d4229D66148k18135j17311e1462B70823
13266B93409p8941i4980G9755K02243J15237a27318j41507a30762P425k4865A53087
13254C0814a71227H3865J65092k8708i5000B19839E2944E621R8819a41250A43409
13242d8242k35600B65097L6248a7616B48165A0361a46514d2339l02974A46889
13231b59396C09198A01399k9585L73078a01453D22498c8935n7116n4454M7836
13221a02669C04506n3712h9177E15874a29585k0319A19883a8871B629J80559J04699
13210B87887n9292A06705a21616G5624O6822a79557a4989D3010J42289c57016
$$ plain form
13199 45481 -60187 175503 138771 178949 186116 12100 13565 1951 144186 -121421 115172
13187 229509 358349 5198 29156 128490 -193802 258934 310137 156692 70183 322442 149522
13175 -27728 426456 -131674 282960 -196544 370029 -101516 53740 -57790 143506 129864
13165 129864 -311331 -224814 8767 190624 128150 65346 93816 103888 -63131 -169874 184648
13153 176493 174290 277296 241011 7004 -244434 -303475 22416 70812 183685 -72639 4073
13141 -44580 -141377 78894 162035 150175 332987 182957 20576 -31442 176327 32127 -150091
13129 -210066 89098 -224737 -127910 80798 -184733 97401 -119782 148641 -73542 -127883 106370
13117 -31008 9281 158183 -11893 -51910 199030 86736 16450 96769 2447 47957 127817 156634
$$ packed form
13199D5481f0187A75503l6732M0178P167A2100J465A951J42235a21421A15172
13187B29509J28840E198K3958R9334a93802B58934N1203j53445G0183K52259A49522
13175b7728D26456a31674B82960a96544C70029a01516E3740e7790A43506j3642
13165A29864c11331Q6517H767J81857o2474o2804K8470J0072f3131j06743A84648
13153A76493k203J03006l6285G004b44434n9041B2416M8396J12873g2639D073
13141d4580r6797G8894Q3141j1860J82812j50030B0576c1442A76327C2127a50091
13129b10066H9098b24737R6827H0798a84733I7401a19782A48641g3542n4341A06370
13117c1008I281J48902a1893m0017A99030H6736A6450Q0319B447M5510P9860K8817
$$ plain form
13105 156634 -159855 344014 -52733 58213 106512 -230177 282932 236312 65418 -24876 -64123
13094 -64123 -80738 98036 222411 9245 186255 79808 194901 457275 170813 328447 11090
13082 -58674 -65263 34615 307513 -69240 110446 60882 176520 53265 170391 233975 68381
13070 71265 48484 173479 20911 -115626 171730 189014 -14522 125806 366813 309119 38248
13058 -93578 -39851 -175670 64998 -10752 -160036 209362 236752 -21570 221023 237239 128706
13047 128706 204451 242016 -217965 -185111 101424 22575 -128421 -18507 115673 -79488 249560
13035 46555 -127935 -57356 288577 -182464 320596 -176403 238511 -84090 21018 373257
13025 373257 93181 -50473 334823 178506 77854 -119715 -212061 -266321 194932 2013 -236147
$$ packed form
13105A56634a59855C44014e2733E8213M8299b30177B82932m6620F5418b4876l9247
13094f4123j6615I8036J24375I245J77010G9808J15093K62374A70813J57634A1090
13082e8674o589C4615K72898f9240A10446m9564J15638E3265J17126O3584F8381
13070G1265k2781J24995B0911a15626A71730J7284a4522A25806K41007n7694C8248
13058i3578c9851j35819F4998a0752j49284B09362K7390b1570B21023J6216j08533
13047A28706P5745L7565b17965L2854A01424B2575a28421a8507A15673g9488B49560
13035D6555a27935e7356B88577a82464C20596a76403B38511h4090B1018L52239
13025C73257I3181e0473C34823j56317G7854a19715r2346n4260A94932B013b36147
$$ plain form
13013 317795 264924 73562 306428 246781 152526 155289 129949 48781 228302 374200 355035
13002 355035 215309 -120906 68042 278619 -130261 -27842 150007 126290 -182967 -88527
12991 131562 30999 175858 -13682 -161087 -370015 20797 330797 151410 287644 22005
12980 -204892 137551 149077 -79002 -175580 136494 72280 203224 345284 191311 -18160
12969 -301713 117348 -6206 -6455 100853 -91227 171347 155799 -86715 -148993 -182445 347245
12957 -261662 -129266 -10387 -122023 -29759 -149071 -122554 151335 145678 -330533 156610
12946 94830 424580 5861 90391 -67079 358057 -122688 -30180 -47617 -110510 -51624 145864
12934 -229241 129336 243511 -182997 376533 -152417 77655 249407 19186 -43721 153625
$$ packed form
13013C17795n2871G3562K32866n9647r4255K763k5340D8781J79521J45898j9165
13002C55035j39726a20906F8042K10577a30261b7842A50007k3717a82967h8527
12991A31562C0999J44859a3682j47405k08928B0797L10000A51410J36234B2005
12980b04892A37551J1526g9002r6578A36494o4214J30944J42060j53973a8160
12969c01713A17348f206k49A00853i1227A71347j5548h6715o2278l3452C47245
12957b61662a29266a0387j11636b9759j19312K6517A51335n657c30533A56610
12946I4830L29750E861Q4530f7079C58057a22688c0180j7437o2893e1624A45864
12934b29241A29336J14175a82997C76533a52417G7655J71752A9186d3721A53625
$$ plain form
12923 -44158 -41649 220598 -167120 -97042 104092 83185 -63109 15290 -11619 181581 10429
12911 -45950 5811 45852 86373 -112807 -54465 166086 -24976 271538 -172785 23902 -92883
12899 -316958 -161997 41980 -74286 -83153 -55512 66310 -4632 -98840 30184 90720 36946 187761
12887 187761 300615 33854 88906 84952 -152885 -27572 301154 -212189 95378 122849 -75167
12875 -34403 126870 46809 -80121 -106359 372350 81449 44115 -89750 93893 242986 -93673
12863 141592 33633 286084 -137604 284377 -330389 349472 -227095 126761 91116 293406
12853 293406 -415738 143607 136033 -143031 10371 -223290 -31825 -97968 185588 98527 -143096
12841 -73142 -47575 -143794 126509 -220390 53214 111279 63358 167445 -56835 -44207 107864
$$ packed form
12923d4158K509B20598a67120P0078A04092k0907f3109A5290a1619A81581A0429
12911d5950E811M0041M0521a12807e4465A66086b4976B71538a72785B3902i2883
12899c16958J54961D1980g4286q867K7641F6310d632r4208C0184O0536C6946J50815
12887A87761J12854C3854N5052l954a52885b7572C01154b12189I5378K7471g5167
12875c4403A26870D6809h0121k6238C72350H1449l7334h9750I3893J49093i3673
12863A41592C3633K52451a37604B84377c30389C49472b27095A26761l5645K02290
12853B93406d15738A43607p574a43031A0371b23290c1825o6143A85588q7061a43096
12841g3142K5567r6219A26509b20390E3214N8065m7921J04087e6835J2628A07864
$$ plain form
12829 -11231 -124448 -35243 -46351 93138 186828 -126101 -141638 14690 -104979 325095 182594
12818 182594 180083 -227304 124594 -417390 57991 -208770 -84812 -26708 197756 -228797
12807 -50032 -245364 -53721 -398650 -34698 -143565 -85806 39073 -5750 -250905 -62132 -136743
12796 -136743 229016 -69612 19595 -16956 -133231 -356020 -14197 60533 199943 -286114
12785 -274636 -34360 158924 -63714 182262 -93687 990 66259 -22219 43294 -115462 -122837
12774 -122837 -166482 198578 34643 -259348 -62741 86593 -194823 -247266 -24289 20226 189968
12763 189968 8988 -10789 148800 -5443 -45065 -62961 -61903 121406 -222231 -190250 -74575
12751 9855 151762 -248964 240643 -147144 -63744 -97214 287785 -133109 60685 71478 -50342
$$ packed form
12829a1231j13217c5243j1108I3138R3690a26101j5537A4690a04979C25095j42501
12818A82594k511b27304A24594d17390E7991b08770h4812b6708A97756b28797
12807e0032j95332e3721l44929c4698j08867N7759C9073e750k45155f2132p4611
12796a36743B29016f9612A9595a6956j16275k22789a4197F0533J39410b86114
12785b74636c4360A58924f3714A82262i3687I90O5269b2219D3294a15462p375
12774a22837m3645A98578C4643b59348f2741H6593a94823n2443b4289B0226J69742
12763A89968H988a0789A48800e443l9622j7896J058A21406b22231L1981g4575
12751I855J41907b48964B40643a47144f3744l3470B87785a33109F0685J0793e0342
$$ plain form
12739 -87730 38745 43251 306605 -45777 241576 98325 -1636 48568 86638 -195564 54315
12727 -72453 -123170 -92875 -10833 240967 245707 -110411 -171554 230770 -112891 -28229 192084
12715 62997 125819 201936 142128 89133 212227 -14853 31768 -318442 529591 98009 156164
12704 156164 217619 -308800 20083 109171 406413 74533 -291413 197996 -257467 465971
12693 118942 -94718 183010 94255 -49817 -127550 30378 -154720 -7634 -209069 182473 25104
12681 195985 -57897 -17322 170444 203763 -14424 104820 269652 136489 89853 256481
12671 256481 -122038 -16515 -51751 -92640 90251 2676 105264 354138 -32195 90733 207704
12660 207704 -142654 211075 -171882 -65542 47628 -326613 -109960 2415 48935 310538
$$ packed form
12739h7730C8745M506K63354d5777B41576I8325a636D8568L8070a95564E4315
12727g2453n0717L0295a0833B40967M740a10411o1143B30770a12891b8229A92084
12715F2997O2822P6117n9808n2995J23094a4853C1768c18442E29591I8009N8155
12704A56164O1455c08800B0083Q9088K97242G4533b91413A97996b57467D65971
12693A18942i4718A83010q8755d9817p7733C0378a54720g634k01435A82473B5104
12681A95985e7897a7322A70444L3319a4424A04820J64832j33163m6636J66628
12671B56481a22038a6515l5236m0889I0251B676J02588K48874c2195I0733J16971
12660B07704a42654B11075a71882f5542D7628c26613a09960B415M6520K61603
$$ plain form
12650 310538 76438 193052 146892 -42295 -103611 291279 235178 59684 -371623 -77734 84915
12638 -142479 -217035 -77993 133127 140313 -32343 144718 -218822 52197 -39845 86330 149156
12627 149156 114021 140271 1717 214524 445607 170688 50004 -137264 238249 174845 -16353
12615 -10069 99853 -132228 55890 -23607 -113831 168253 343801 351081 15315 285415 -178711
12603 -111109 -10453 259634 14930 -148672 313931 2518 69722 32262 227532 -48120 323629
12591 58097 -208316 402968 211352 135861 -32321 -109423 337171 11700 -172385 -43581 197392
12579 -44469 174280 -180418 21133 217712 -108515 76314 26869 1193 72328 -231722 78460
12567 -166832 220311 -30307 95379 -80161 124977 20739 -169848 -298541 -43387 -181728
$$ packed form
12650C10538G6438J16614m6160d2295o1316B91279n6101E9684c71623g7734H4915
12638a42479p4556g7993A33127P186c2343A44718b18822E2197c9845H6330O2826
12627A49156l5135K6250A717K12807K31083A70688E0004a37264B38249o3404a6353
12615a0069I9853a32228E5890b3607r0224A68253J75548P280A5315K70100a78711
12603a11109a0453B59634A4930a48672C13931B518O7204C2262J95270d8120C23629
12591E8097b08316D02968j91616p5491c2321p7102C37171A1700a72385d3581A97392
12579d4469A74280a80418B1133J96579a08515G6314B6869A193P1135b31722G8460
12567a66832B20311c0307I5379h0161A24977B0739a69848j28693d3387j38341
$$ plain form
12557 -181728 -136670 -75166 188807 52862 326080 -325226 283743 -124389 -437617 -56722
12546 -92391 -180774 -140582 -131346 -134001 149362 -291804 147785 -30904 -57506 -99699 -310207
12535 -310207 152279 140923 -149305 -83752 -94816 -345714 -131885 119407 -361044 -59990
12524 26995 -169355 -208008 -83195 87179 -98491 -345982 -275094 65782 102976 -174610 -24499
12512 -163444 -208620 -121373 64579 -88113 22220 -148496 28804 175457 49707 -33667 -57973
12501 -57973 92720 9929 15379 172352 -340357 -146843 -55260 -46453 -90514 298635 38991
12489 -217830 -12851 -257321 -25713 51349 70670 -263576 6337 22324 199745 -65872 -5651
12477 -11139 -80016 -91060 85196 21711 -225084 4216 62531 287504 21148 282093 -87994
$$ packed form
12557a81728M5058O1504A88807E2862K73218c25226B83743a24389l13228e6722
12546i2391q8383M0192R236k655A49362b91804A47785c0904k6602m2193k10508
12535c10207A52279j1356a49305O5553j1064k50898a31885A19407c61044e9990
12524B6995a69355l8653h3195H7179i8491k47491P0888F5782L7194a74610b4499
12512a63444m5176Q7247F4579h8113B2220a48496B8804J46653D9707c3667k4306
12501e7973I2720I929N450J56973c40357a46843e5260Q807m4061B98635C8991
12489b17830a2851k44470b5713E1349J9321b63576F337J5987J77421f5872e651
12477a1139o8877j1044H5196B1711b25084D216N8315K24973B1148K60945h7994
$$ plain form
12465 -120433 -114535 121413 -22719 149839 29987 -53299 320949 25309 109797 111489 -311084
12453 101365 -22277 106065 -93667 177878 109943 -395558 346968 -164516 -81180 126711
12442 26287 17013 -265985 38068 -405011 -96038 194826 98009 15847 152384 -338098 -31727
12430 205005 -172476 55186 -80292 -110445 -209165 -210855 103823 -264127 -110918 97285 41786
12418 -67672 -154603 4152 106090 -43094 52074 -84093 -291201 224295 -186911 20797 211574
12407 211574 -303515 199714 -19206 -44014 -219791 -152090 -8602 -103008 -85766 -26512 -115496
12396 -115496 318496 -88202 107348 118671 -92981 169553 94208 -326261 199774 142770
12386 142770 -145410 22095 55471 244104 224886 127481 278463 156633 -12493 152536
$$ packed form
12465a20433N898A21413b2719A49839B9987e3299C20949B5309Q4488J692c11084
12453A01365b2277A06065i3667A77878o7935c95558C46968a64516h1180A26711
12442B6287r274b65985C8068d05011i6038A94826r6817A5847J36537c38098c1727
12430B05005a72476E5186h0292l0153r8720j690A03823b64127a10918I7285D1786
12418f7672q6931D152J01938d3094E2074h4093k07108B24295a86911B0797J90777
12407B11574c03515A99714a9206k4808j75777O7701h602r4406J7242b6512q8984
12396a15496C18496h8202A07348J1323i2981A69553p5345c26261A99774n7004
12386A42770a45410B2095L3376J88633j9218r7405J50982j21830a2493A52536
$$ plain form
12375 -410064 240164 100360 -8870 120341 216461 174010 311382 257803 -35429 233602 309105
12364 309105 -21595 -59160 112247 119157 -13081 -128340 -22589 -319189 82485 -54610 -18762
12352 -154077 2214 -72099 -41241 -154330 152599 86380 -74101 39806 157019 -153695 1973
12340 100926 -152005 -24163 228069 -26962 130069 22857 -39247 162607 76853 31220 119739
12329 119739 81569 -250455 -44555 277715 -140947 218014 34959 236098 11180 226895
12319 226895 26844 197901 214668 346226 -45740 99764 590397 89611 70557 184123 110831
12308 110831 118321 222961 -40527 19097 -130947 160655 146846 303665 -472481 65783 90485
12297 90485 -132615 177656 -166645 -2191 76941 57803 56639 217055 80976 -2288 -61955
$$ packed form
12375d10064B40164A00360h870A20341R6120m2451J37372n3579c5429B33602P5503
12364C09105b1595l7565A12247O910a3081j15259b2589k96600H2485e4610a8762
12352a54077B214g2099L0858j13089A52599o6219g4101C9806J17213a53695A973
12340A00926a52005b4163B28069b6962A30069B2857c9247A62607G6853C1220Q8519
12329A19739l8170b50455d4555B77715a40947B18014C4959K01139A1180K15715
12319B26895B6844J71057J6767J31558d5740I9764M90633H9611j9054J13566p3292
12308A10831P490J04640d0527A9097a30947A60655j3809J56819d72481F5783K4702
12297I0485a32615A77656a66645b191G6941j9138j164J60416H0976b288n9667
$$ plain form
12286 -61955 63961 43516 175990 220545 48579 125872 -49279 79220 30972 51185 277190
12275 277190 216084 47217 108396 -116804 -13157 88425 38877 202402 4846 24905 325685
12264 325685 30114 378057 161301 610072 83193 240010 -133032 259025 87665 -237542
12253 -21623 274223 -4235 114689 240357 121290 226607 205068 308127 161944 -220690
12242 81814 -134278 112352 -123522 45801 167984 160508 -208704 92527 -133237 54043 424609
12231 424609 220876 -20100 178858 -54287 -67677 16321 79776 120354 396420 38196 312775
12220 312775 167058 307749 140722 -7376 299662 200237 223752 43320 -79091 -159715 180425
12208 266508 110316 -137314 358882 -259429 68611 382602 173921 -409432 255990 421997
$$ packed form
12286f1955F3961k0445J32474M4555D8579P7293d9279G9220C0972K0213K26005
12275B77190o1106D7217O1179a16804a3157H8425C8877J63525D846K0059L00780
12264C25685C0114L47943A61301M48771H3193J56817a33032B59025H7665b37542
12253b1623B74223d235A14689J25668j19067J05317k1539J03059j46183b20690
12242H1814a34278A12352a23522D5801J22183p476b08704I2527a33237E4043L70566
12231D24609k03733b0100A78858e4287j3390A6321O3455M0578K76066C8196K74579
12220C12775j45717J40691A40722g376B99662r9425K3515D3320g9091q0624A80425
12208B66508A10316a37314C58882b59429F8611L13991A73921d09432B55990J66007
$$ plain form
12198 421997 -64599 79725 459523 -156141 186411 129387 154080 52919 469219 119736
12187 117166 489237 84711 122466 344932 -58193 -192337 206604 -153078 265639 111477
12176 -8023 56007 182890 320175 119003 343210 77391 80084 119533 356567 137276 -93503
12164 124668 68926 59839 135373 14538 236317 138049 56339 124762 184001 191037 74592 -277967
12151 -3464 267954 272635 40877 -79521 -2730 -104009 116110 208992 169689 -8539 -73127 128425
12138 -86575 -154599 22435 121470 120879 91713 98844 63176 263620 22344 100061 -92233 112004
12125 58661 113516 154409 280457 -22722 316835 205902 -166034 130068 211591 -400132
12114 188047 67164 136915 218686 -100491 234109 18885 79345 310813 -18777 -33659 -229339
$$ packed form
12198D21997f4599G9725L79798a56141A86411n7024K4693E2919M16300A19736
12187A17166L72071H4711L7755K22466e8193j34144B06604a53078B65639A11477
12176h023E6007J26883J37285A19003K24207G7391K693L9449K37034A37276i3503
12164A24668n5742r087P5534A4538K21779r8268E6339O8423N9239P036G4592b77967
12151c464B67954M681D0877g9521b730j01279A16110R2882l9303h539o4588A28425
12138h6575o8024B2435R9035n91k9166P131l5668K00444B2344P7717i2233A12004
12125E8661N4855M0893J26048b2722C16835j10933a66034A30068Q1523d00132
12114A88047F7164O9751Q1771a00491B34109A8885O0460K31468a8777j4882j95680
$$ plain form
12103 -229339 132930 -12216 -21989 205406 -15824 -84893 -22557 -61300 116473 389686 33260
12091 86030 246768 220129 154060 -178599 -123645 157022 71710 355415 178853 71614 94525
12080 94525 -212258 285151 309404 -148076 351557 186217 -158518 -50191 314994 -55146
12069 -183991 120524 239732 -72211 295221 136682 -30768 212079 -23504 288941 -149533
12058 269968 225474 -83402 142182 93988 125173 -25122 284370 68468 270750 155942 -7631
12046 -17875 209530 -73972 -72548 231653 -223114 111324 -281740 -286506 -727 278454 -9483
12034 62990 203334 134915 -139619 124191 -88986 -141643 -55299 197151 213598 165517 76521
12022 85235 -62684 252658 -41053 96679 -12409 200654 -77951 48576 102422 48336 2143
$$ packed form
12103b29339A32930a2216r773B05406a5824o9069b2557l8743A16473K73213C3260
12091H6030J60738k6639o6069a78599N4954A57022G1710K83705j76562G1614K2911
12080I4525b12258B85151K4253a48076C51557j65340a58518e0191C14994e5146
12069a83991A20524J19208g2211B95221A36682c0768B12079b3504B88941a49533
12058B69968m4494h3402A42182m8194L1185b5122B84370F8468K02282j14808g631
12046a7875B09530g3972J424B31653b23114A11324b81740m766g27B78454i483
12034F2990J40344o8419a39619A24191h8986n2657e5299A97151J6447m8081G6521
12022H5235f2684B52658d1053I6679a2409B00654g7951D8576N3846D8336B143
$$ plain form
12010 143091 -115389 28974 -22962 106 -50746 -94592 53820 47999 80779 -99630 -97485 277879
11997 40572 48780 143168 -374181 -378156 92238 -91858 -413656 195073 100850 158653 -60881
11985 -40449 -93337 149253 -134900 91401 -296034 -242235 82234 -173169 -194037 57539 243570
11974 243570 230379 -120993 106299 -211100 13330 32803 80627 -283013 178404 -105059
11963 150965 157038 30985 -20603 -38517 -126071 9121 101374 49314 1085 51205 -487928 -35503
11950 278592 -144642 -246774 191768 134409 -34931 -54026 417618 -82584 161820 -194612
11939 -183928 -25478 -184333 -40140 4208 -84916 214212 -128469 205033 126849 70563 274536
11928 274536 -53126 279 -240479 -14309 65008 -300899 -221318 -242797 195057 -118247 271584
$$ packed form
12010A43091a15389B8974b2962A06e0746m3846E3820n821L2780i9630K145B77879
11997D0572Q208R4388c74181l975I2238i1858l21798A95073r4223N7803f0881
11985d0449n2888A49253a34900I1401b96034N3799H2234a73169k0868E7539J86031
11974B43570j3191a20993A06299b11100A3330J9473M7824b83013A78404a05059
11963A50965O073C0985b0603j7914q7554I121R2253D9314A085N0120d87928c5503
11950B78592a44642j02132A91768n7359c4931j9095D17618h2584A61820a94612
11939a83928b5478j58855d0140D208h4916B14212a28469B05033p8184n6286K03973
11928B74536e3126B79b40479a4309F5008c00899P9581k1479A95057a18247B71584
$$ plain form
11916 -21943 284599 -8251 41954 -208483 10586 -135966 133039 -191407 158987 -14278 368612
11904 80306 57838 -208629 -129115 120981 17868 306320 -34727 -293884 45631 -93369 -22384
11892 -205734 -110496 -50650 -214652 108461 -179145 55483 71730 -139552 -110105 -32344 -198659
11881 -198659 168908 -101132 265612 307214 191438 -250941 -5777 -11696 -234902 -275661 469177
11869 -146522 -284695 116845 196188 -249974 -142422 101543 -268825 57484 -255993 48898
11858 106416 187679 -53313 -120814 63058 273305 -141051 -48233 -60879 67997 84249 -52914
11846 8709 147131 7139 70318 108338 -88019 -186686 85183 -6136 200218 -40790 -226992 76272
11833 -330300 -49883 210015 -10532 -71872 80347 20476 -27184 60425 55096 -159174 9882
$$ packed form
11916b1943B84599h251D1954b08483A0586a35966A33039a91407A58987a4278C68612
11904H0306k2468b08629P9514A20981A7868K88452c4727k59157D5631i3369b2384
11892b05734R5238e0650j64002A08461a79145E5483J6247a39552K9447c2344j66315
11881a98659A68908a01132B65612M1602j15776b50941e777n919k23206m0759D69177
11869a46522j38173A16845P9343b49974J07552A01543b68825E7484b55993D8898
11858A06416Q1263e3313o7501F3058K10247a41051d8233j2646F7997J6252e2914
11846H709J38422G139O3179L8020h8019r8667H5183f136B00218d0790j86202G6272
11833c30300d9883B10015a0532o1340H0347B0476b7184F0425n329a59174I882
$$ plain form
11821 -77535 -221185 -23096 142306 -64769 -54743 -43205 278965 -199545 173741 -45919 22981
11809 -12661 -40498 78306 146342 7259 328565 167938 -143291 -273692 -133812 232422 -293580
11797 149965 -3678 117627 268072 113966 127331 -45666 -1016 -229039 -34747 -200157 -419935
11786 -419935 -394128 -44142 8614 -300044 -44144 -140148 -95029 -129464 50696 -326399 198645
11774 112757 123248 187188 96073 -257132 107825 -60387 -81124 -189190 -27402 316296 186371
11763 186371 44374 182770 213878 -23978 85875 -54941 -342075 -376273 -31674 32713 -171263
11751 -3807 -67115 -149100 14282 100309 -499262 -154512 18573 180326 131516 -117363 84881
11739 139380 -119569 -46319 85785 113647 -6098 -144956 292593 -83664 -312108 219871 -183506
$$ packed form
11821g7535j43650b3096A42306f4769J0026J1538B78965a99545A73741d5919B2981
11809a2661k7837G8306O8036G259L21306j60627a43291j30401a33812B32422b93580
11797A49965c678A17627J50445A13966J3365d5666a016k28023c4747j65410k19778
11786d19935K5807d4142H614c00044d4144r6004M5119l4435E0696c26399A98645
11774A12757J0491O3940r1115b57132A07825f0387k0737j08066b7402C16296j29925
11763A86371D4374J38396L1108b3978H5875e4941k87134l4198c1674C2713a71263
11751c807o3308q1985A4282Q6027d99262a54512A8573J61753m8810a17363H4881
11739A39380a19569d6319H5785K7862f098j38858B92593h3664k28444B19871a83506
$$ plain form
11727 -10796 -200393 -34377 -61219 112473 -246106 -109192 -7474 196955 -167793 -63648 52921
11715 17525 29376 113773 -106636 -178370 -90560 -237790 243253 -53185 -310297 74758 74118
11704 74118 -108327 13498 199857 164318 -105767 -41211 183568 257800 195438 -9845 -224325
11693 -224325 -26242 -10284 159702 -152428 44453 50818 129346 -206190 240813 -249949 163684
11681 20131 -111373 -83573 -37726 15751 102457 -130322 -171473 178884 4346 -54540 -191865
11670 -191865 -146175 39069 1045 -103482 403134 17575 295863 -120818 -190801 -221365 -79932
11658 78580 -65052 161377 -91247 -103942 234387 -345258 -21049 -187498 -180385 -92843 -68846
11647 -68846 89489 95029 -23848 -235686 44597 -60810 -147479 224737 -111807 286069 105202
$$ packed form
11727a0796j89597c4377k6842A12473b46106a09192g474A96955a67793f3648E2921
11715A7525J1851Q4397a06636p1734Q7810j47230B43253e3185k57112G4758o40
11704G4118a08327A3498J86359l5539a05767d1211A83568P4232o2362i845k14480
11693b24325b6242a0284A59702a52428D4453O365P8528b06190B40813b49949A63684
11681B0131a11373K7800c7726A5751Q6706a30322m1151A78884D346e4540j37325
11670a91865M5690C9069A045a03482D03134A7575K78288a20818o9983l0564g9932
11658G8580f5052A61377i1247j2695B34387c45258b1049j66449P113Q7542K3997
11647f8846H9489N540b3848k11838D4597f0810q6669B24737a11807B86069A05202
$$ plain form
11635 9907 -139797 -101418 28852 36894 44062 -136760 -220804 -18119 34248 -195803 217223
11623 406370 189400 -146106 69770 152451 -234065 -104695 183147 154682 -91083 41486
11612 285892 106321 -98133 -102718 118569 430391 50138 -159593 -82111 185443 -148462
11601 -330313 32536 174070 210663 -214321 -10171 -301470 563005 243468 242784 82172 -374310
11589 -25162 -138111 177308 294877 8880 39410 -91647 147507 116864 380337 178543 -110621
11577 90674 185747 195077 -191866 134040 101286 -451995 36849 -6140 148103 63330 29328
11565 -56688 96540 360219 -63055 14508 -102207 344507 200012 338007 -48752 153516
11554 -71772 65789 -21384 224281 -46060 -122876 84844 152569 168490 81810 92718 -93114
$$ packed form
11635I907a39797L8379B8852Q042P168a36760q4044a8119C4248a95803B17223
11623D06370A89400a46106F9770Q2681b34065a04695A83147k8465i1083D1486
11612B85892A06321i8133m585A18569L11822E0138a59593P7482A85443a48462
11601c30313C2536J41534L6593b14321a0171k91299E63005B43468o84H2172c74310
11589b5162j12949A77308J17569H880L0530i1647A47507l0643K63473A78543a10621
11577I0674R5073R330a91866A34040l2754d51995C6849f140A48103F3330B9328
11565e6688I6540K63679f3055A4508a02207C44507j44495J37995d8752A53516
11554g1772F5789b1384B24281d6060p6816H4844O7725J5921H1810J0908i3114
$$ plain form
11542 128125 152888 316119 299030 -159442 -228847 93183 308892 121303 46500 293674
11532 293674 79284 85257 -24913 316564 -101276 296932 -97806 286863 26295 -91183 272138
11520 54586 -266236 -16812 44597 -1182 126033 -284389 345888 -276848 54574 -72944 -177725
11509 -177725 238226 114985 212579 68290 44089 -38070 -72959 161479 -57328 299172 97037
11497 86132 103002 -23407 185864 356615 34993 43224 133762 305540 -259950 -291412 43195
11485 363823 329968 318899 -51370 198663 232439 222254 327186 254529 386704 216489 135877
11474 135877 264198 98557 -172195 371787 63146 420274 323795 312048 78436 200113
11464 200113 -30316 174418 278053 309343 117812 161513 375962 -6359 128814 -7618 324329
$$ packed form
11542A28125K4763J63231j7089a59442o9405I3183K15709A21303D6500K47174
11532B93674G9284N973b4913C16564a01276B96932i7806B86863B6295i1183B72138
11520E4586b66236a6812D4597a182A26033b84389C45888b76848E4574g2944j04781
11509a77725B38226A14985R7594F8290k4201c8070l4889A61479e7328B99172I7037
11497H6132J6870b3407A85864J70751C4993Q231R0538J71778b59950l1462D3195
11485C63823l3855j1069e1370A98663L3776j0185J04932p2657J32175j70215q0612
11474A35877J28321I8557a72195C71787F3146L57128r6479j1747G8436J21677
11464B00113c0316A74418J03635L1290A17812M3701K14449f359A28814g618C24329
$$ plain form
11452 -114727 98061 101895 80710 5855 -38572 -44015 -176507 249234 -205221 43646 142209
11441 142209 183098 149963 281956 230063 151117 -37191 220698 -6376 207510 -142038 65297
11429 316453 177521 69926 109243 99899 -22296 -267867 -17039 -40003 -322200 82607 -3948
11417 88161 -64175 51918 -45415 -40744 -8338 55195 -4413 225387 71155 157185 84490 -11839
11404 13175 -215998 136396 40177 -66947 51334 -253435 -96574 -29203 61284 367084 -60339
11392 -158581 242080 232974 -185761 -139067 -169550 -321463 165703 19290 -193593 -24864 189481
11380 -106112 13633 113112 226076 -95490 415133 411638 155061 -203759 97287 -132719 46212
11368 98784 257982 -181810 -197764 -321015 -71037 -163090 77750 47946 -294035 -374351 -45922
$$ packed form
11452a14727I8061L834k1185E855c8572n443j32492B49234b05221D3646R8563
11441A42209M0889l3135J31993n1893p8946c7191B20698f376B07510a42038F5297
11429C16453j38932F9926L9317r344b2296k45571a7039k2964k82197H2607c948
11417H8161f4175E1918d5415M671h338E5195d413B25387G1155Q6030p2695a1839
11404A3175b15998A36396D0177f6947E1334b53435i6574b9203F1284L05800f0339
11392a58581B42080r106a85761M6694l0483j51913A65703A9290a93593b4864A89481
11380a06112A3633R9479J12964i5490D15133l495A55061b03759I7287a32719D6212
11368I8784J59198a81810j5954j23251g1037r2053G7750k9804b94035q0316d5922
$$ plain form
11356 -37492 -145061 -244968 72836 95994 -57402 14532 -326792 22634 -149783 52686 -20901
11344 12396 68588 23962 88742 -183614 -78086 -299974 134540 -238171 37968 13902 40448
11333 40448 147736 119586 21537 -73632 18608 84211 -290609 83436 -175169 21053 39923
11322 39923 -140026 -17893 -119080 -22920 255057 -38228 -73155 223524 -198063 16758 248916
11311 248916 -2095 16619 28027 86669 -3143 -103959 -136130 -318938 -247529 31141 -29067
11299 -26711 27203 5900 16048 176331 185443 89542 116811 -70012 -188864 154272 -317776
11287 -118160 21012 18738 -126153 59855 201954 -101211 -6818 59715 -62471 -12007 133517
11275 -161486 139024 -142139 -131542 16989 -168344 72150 -90697 242434 191124 38477 -230430
$$ packed form
11356c7492j07569r9907G2836K3158e7402A4532c26792B2634a49783E2686b0901
11344A2396N6192B3962O4780a83614g8086k21888A34540b38171C7968A3902K6546
11333D0448J07288k8150B1537g3632A8608O5603b90609H3436a75169B1053J8870
11322C9923a40026a7893j01187b2920B55057c8228l4927B23524a98063A6758K32158
11311B48916b095A6619J1408N8642c143j00816l2171j82808P1409C1141b9067
11299b6711B7203E900J0148J60283R112H9542K7269g0012j18852A54272c17776
11287a18160B1012k274a26153E9855J42099a01211f818E9715f2471a2007A33517
11275a61486A39024a42139J0597A6989a68344G2150i0697B42434n1310C8477b30430
$$ plain form
11263 123458 -96277 -200235 -186751 10382 -91028 85172 -33548 -141247 41528 -283028 -65661
11251 323520 34826 -18847 202382 114773 -20688 -195274 51568 -215980 -167132 -118951 -288365
11240 -288365 120439 -75968 -309521 -251004 96150 225834 -227686 -21963 154915 104575
11230 104575 -29384 66430 -3844 -60634 -124933 -135429 92274 -241965 -22277 -139406 -173821
11219 -173821 -314392 -88346 155733 21356 -85186 211552 -151925 72408 -342074 41971
11208 10669 -109922 -194712 -382606 110989 -35496 41797 -97738 -178089 -83515 -129543 -127033
11197 -127033 -140708 -178849 -132040 -114093 -235380 -234136 -36856 -8644 -274042 -332894 97554
11185 9 -266982 -242258 129634 -46867 -149931 -123246 -67437 213579 -22609 -113030 -421657
$$ packed form
11263A23458i6277j03958J3484A0382i1028H5172c3548j07699D1528b83028f5661
11251C23520C4826a8847B02382q7609b0688j74586E1568b15980M8848M8181j69414
11240b88365A20439g5968k33553N8517I6150J29684b27686b1963A54915n0340
11230A04575b9384F6430c844n6790o4299j0496I2274b41965b2277j17129l4415
11219a73821j40571h8346A55733B1356h5186B11552a51925G2408c42074D1971
11208A0669a09922q4790j87894A10989c5496D1797i7738q0351h3515m6028K510
11197a27033j3675l8141M6809J7947j21287J244c6856h644k65398n8852I7554
11185Ib66982K4724A29634d6867j03064K6685N5809B13579b2609r0421l08627
$$ plain form
11174 -421657 -180328 -366860 -149454 -91549 -182763 150588 152525 -152701 92515 -289146
11163 -118395 241854 -263559 128574 -28815 -336692 -45026 -76345 -88030 -76543 -16017 -20675
11152 -20675 110668 -187563 56257 352608 -271290 121789 140462 -227853 2874 -105138
11141 -175042 -31691 20395 -122010 -181644 -5264 -173152 138869 -226787 476834 -70391 48431
11129 47923 -297605 18950 139040 33204 153746 -91907 -211684 39472 -3480 89009 -342997
11117 108927 218193 127627 -185492 11567 -278940 187696 232896 171116 20698 168435
11107 168435 240357 38040 270609 -83051 297603 55408 -10080 316188 288587 -143770 142568
11095 205311 217107 320309 317843 433689 283733 399344 153943 9932 142661 104227 96676
$$ packed form
11174d21657a80328j86532a49454N7905r1214A50588J937a52701I2515b89146
11163a18395B41854b63559A28574b8815l07877d5026l1319j1685J1487a6017m658
11152b0675A10668a87563E6257K96351b71290A21789J8673b27853B874a05138
11141a75042c1691B0395a22010n9634e264j67888A38869b26787D76834g0391D8431
11129D7923b97605A8950J20090C3204J20542i1907j19777C9472c480H9009c42997
11117A08927J09266r0566a85492A1567b78940A87696M5200o1780B0698J47737
11107A68435P1922C8040K32569h3051B97603E5408a0080C16188k7601a43770A42568
11095B05311J1796J03202k466J15846j49956J15611A53943I932J32729l8434p551
$$ plain form
11084 96676 336324 281561 72963 174142 -14263 97815 321438 250695 208594 169981 205035
11073 205035 375434 180524 65156 460071 299557 370093 105221 206522 301277 284088
11063 284088 311280 231323 97317 415236 414835 393993 681985 539158 606562 806305 527978
11052 527978 567094 990884 767015 707436 949467 863184 356788 778070 907757 885830
11042 885830 871849 762299 687074 872262 348385 538074 540497 673803 646398 777155
11032 777155 547997 855428 528528 268504 954294 499616 531587 373333 641277 968071
11022 968071 676238 565847 761825 628305 1041784 516588 739401 420956 745071 129334
11011 442064 858748 401134 640623 689049 734526 639184 637249 496913 477019 554715 731987
$$ packed form
11084I6676K39648n4763G2963J01179a4263I7815K23623p0743m2101l8613L5054
11073B05035J70399A80524F5156L94915j60514P0536A05221J01301R4755j7189
11063B84088K7192p9957I7317L17919m01k0842K87992j42827O7404J99743k78327
11052E27978L9116M23790k23869n9579K42031q6283C56788M21282J29687k1927
11042H85830j3981j09550p5225J85188C48385J89689K423J33306k7405J30757
11032G77155k29158L07431l26900k60024O85790m54678L1971j58254K67944L26794
11022I68071k91833j10391J95978j33520M13479E16588K22813l18445L24115A29334
11011D42064M16684D01134K39489M8426M5477r5342j935j40336j9894P7696J77272
$$ plain form
11000 731987 705757 534241 336433 552274 653812 733933 408400 493436 894993 681565
10990 681565 766319 870248 904363 400993 971880 629155 1021829 536581 656518 1137248
10980 1137248 1167489 815116 1214310 1226964 1377631 1534677 1939371 1330842 1986528 2051265
10970 2051265 2411253 2414490 2415006 2810263 2538263 2461341 2422689 2523224 2125376 1966082 1524241
10959 1524241 1202210 1287833 1762298 1379113 1324085 1526747 1296627 1519179 1448942 1558330
10949 1558330 1014375 1311685 899879 625973 820778 593596 389265 608950 275379
10939 161149 262360 60430 189745 203290 3024 -36681 581407 28388 22533 115667 -46950
10927 303450 -373779 290728 -124017 4493 101810 -219695 -141786 -83562 -241965 -222609 -327661
$$ packed form
11000G31987k6230j71516j97808K15841J01538Q0121l25533Q5036M01557k13428
10990F81565Q4754J03929L4115D00993N70887l42725L92674m85248J19937M80730
10980A137248L0241l52373L99194J2654J50667J57046M04694o08529O55686O4737
10970B051265L59988L237N16L95257k72000p6922l8652J00535l97848j59294m41841
10959A524241l22031Q5623M74465l83185n5028K02662k30120K22552p0237J09388
10949A558330n43955K97310m11806k73906J94805k27182k04331K19685B75379
10939A61149J01211F0430J29315J3545C024c6681E81407B8388n855R3134d6950
10927C03450c73779B90728a24017D493R7317b19695P7909N8224j58403J9356j05052
$$ plain form
10916 -327661 -195374 -346949 362413 181301 144281 -104205 54757 12389 169559 -138725
10905 69556 -41062 -208552 -74035 -18314 -67651 -25919 75671 -188327 106243 -14359 5325
10893 35161 12220 138813 -239936 -474435 20111 60059 299156 182535 93969 356844
10883 356844 -118474 -384884 -291507 -54808 -395610 -308722 307184 307286 73000 -173017 48899
10871 41503 -326203 -57171 -59487 213591 -52385 6405 -198233 -725201 157425 -206660 -240371
10860 -240371 -128699 171740 120084 -92537 -41299 133228 108097 12776 362411 102475
10849 -232256 -277210 -64048 -9840 -41476 -93805 11195 227529 -121345 81734 187439 15189
10837 -205404 58781 -54736 67084 128195 -112103 87908 42923 13593 -286848 -29207 24100
$$ packed form
10916c27661J32287j51575C62413j81112l7020a04205E4757A2389J57170a38725
10905F9556d1062j67490g4035a8314m9337b5919G5671a88327A06243a4359E325
10893C5161A2220J26593b39936k34499B0111L9948K39097j16621q8566K62875
10883C56844a18474k66410R3377e4808l40802Q6888C07184J02G3000a73017D8899
10871D1503c26203e7171k316B13591e2385F405a98233n26968A57425b06660l3711
10860b40371J11672A71740n1656i2537d1299A33228k5131A2776L49635A02475
10849b32256m4954f4048i840l1636n2329A1195K16334a21345H1734J05705A5189
10837b05404E8781e4736F7084O1111a12103H7908D2923A3593b86848b9207B4100
$$ plain form
10825 -69543 -322467 -99100 65097 -120001 -18787 279899 130657 196548 -121353 -88898 -106412
10814 -106412 -904 63480 -68216 40919 -339390 -103779 -116480 -325292 -240389 156608 -16737
10802 -191084 -267490 56208 -149459 -218901 -109618 -170761 -253120 -115966 195351 117814 -148291
10790 -350897 9206 57227 -84846 9221 185324 -107790 145344 -258064 306299 73656 138385
10779 138385 -154313 -239354 -280041 -498607 213339 168799 -278087 -174039 -224351 -48144
10768 12927 -140445 26332 -255851 -73090 177121 -370186 -199591 -50546 100588 33242
10757 89425 -87865 -347204 -98367 -65817 30895 -65138 -195252 -149793 -135289 -101365 -178729
10746 -178729 -33238 441973 -147391 -57451 50654 34101 640 -282896 -185173 142654 -137088
$$ packed form
10825f9543k52924i9100F5097a20001a8787B79899A30657O5891a21353L2455j7514
10814a06412i04F3480f8216D0919c39390a03779j2701k08812Q4903A56608a6737
10802a91084p6406E6208a49459o9442J09283o1143q2359a15966A95351p7537a48291
10790c50897I206M8021h4846I221J76103a07790A45344b58064C06299G3656O4729
10779A38385a54313q5041m0687k18566B13339m4540b78087J04048n0312d8144
10768A2927a40445B6332b55851g3090A77121c70186J70595e0546A00588C3242
10757H9425h7865k59339i8367L2550C0895f5138j30114M5459J4504L3924p7364
10746a78729c3238D41973a47391e7451E0654j6553F40b82896R7723A42654a37088
$$ plain form
10734 142663 -80040 -77020 113617 139981 -238253 255981 181492 -55767 -95060 -209223 64027
10722 -185633 8702 278898 59084 -323009 -147405 62557 -328691 -154840 -228755 -278807 241194
10710 178202 -137493 -10493 -274961 -58082 160106 352446 -117965 267347 -207477 200401
10699 -195944 199910 75906 -114393 339802 -191951 82109 -251564 -40150 -195369 -290031
10689 -290031 51001 86636 -195643 70818 -59890 -374463 332951 -290018 -53522 -187143
10679 -187143 45620 -183253 -39880 153426 -139346 -307868 19149 -73840 43444 -223728
10668 -46077 -118001 -126017 -123571 -145145 -187434 61304 -72270 56814 248594 -268968 -251465 -99102
10655 -124499 28429 -31786 70928 67462 -134772 -228640 -146089 -81687 -421312 -6637 -179773
$$ packed form
10734A42663h0040L020A13617K6364b38253B55981p4489e5767l9293j14163F4027
10722a85633H702K70196E9084c23009a47405F2557c28691a54840p3915n0052B41194
10710A78202a37493a0493k64468e8082A60106J92340a17965B67347b07477B00401
10699a95944A99910G5906a14393C39802a91951H2109b51564d0150j55219r4662
10689b90031E1001L5635a95643G0818e9890l14573C32951b90018e3522j33621
10679a87143D5620a83253c9880A53426a39346j68522A9149g3840D3444b23728
10668d6077p1924q016K446k1574m2289F1304g2270E6814J91780b68968J7503i9102
10655a24499B8429c1786G0928l466a34772r3868Q2551O4402l39625f637j73136
$$ plain form
10644 -179773 -155018 -131574 -63799 -71765 53943 -150655 198987 -258576 186498 -179508 -43855
10632 124044 -103812 -162512 42897 -330329 -13122 -118446 507767 -259633 61573 60201 -319610
10620 192752 -190307 -154704 -227131 -49162 25364 -182774 -34232 14749 -396549 202744 -147571
10608 408619 25442 -273519 -154644 -160361 -27776 -163801 16420 -172537 -134504 15016 33000
10597 33000 271751 -340963 -60185 -354010 348088 150988 -54433 24574 -32899 -163879
10587 -163879 -73330 6418 -245064 162875 26950 -64862 51535 -226379 -43627 103339 -56402
10575 -64548 -125765 55751 -446854 -3331 108654 283015 144232 -242355 84722 -62443 109681
10563 143121 -162846 104919 78795 -305651 -83133 178785 152070 -104605 -246217 -167028
$$ packed form
10644a79773K4755K3444f3799p966E3943a50655A98987b58576A86498a79508d3855
10632A24044a03812n8700D2897c30329a3122j05324E07767b59633F1573j372c19610
10620A92752a90307L5603p2427d9162B5364a82774c4232A4749c96549B02744a47571
10608D08619B5442b73519J18875n717b7776j36025A6420a72537L8033A5016J7984
10597C3000K38751c40963f0185k93825C48088A50988e4433B4574c2899j30980
10587a63879g3330F418b45064A62875B6950f4862E1535b26379d3627A03339e6402
10575f4548o1217E5751d46854c331A08654J74361j38783b42355H4722f2443A09681
10563A43121a62846A04919k6124c05651h3133A78785k6715a04605j41612P9189
$$ plain form
10553 -167028 -12309 -169241 154277 264135 -258889 -184468 -82110 180802 352762 -212746
10542 189840 -19433 -73950 79269 -382316 129704 -23830 14991 -101924 -1990 -88412 -139607
10531 -139607 -303773 31587 -56310 -403220 64323 -103541 -32143 47408 79177 71625 -127378
10519 -133499 -120473 31229 -55874 -8190 -198996 -282867 134783 -63292 -23811 280243 -225688
10507 43657 24685 -12979 -44158 -28988 -14598 -191280 -95015 192098 -324185 188939 113266
10496 113266 213347 103302 33246 -161092 139879 53046 -48057 159389 -74692 -87138
10486 -87138 -51174 -77440 -145851 -208479 -229512 192189 34419 -151760 405794 478283 332544
10475 332544 460449 350866 175029 602058 405667 -88511 -6429 252009 165905 -343593
$$ packed form
10553a67028a2309j56932A54277J09858b58889P4421h2110A80802J71960b12746
10542A89840a9433n4517G9269c82316A29704b3830A4991a01924a990q6422n1195
10531a39607j64166C1587e6310l46910F4323a03541c2143D7408L1769p552a27378
10519a33499J3026C1229e5874h190j90806q3871A34783f3292b3811B80243b25688
10507D3657j8972a2979l1179J5170J4390j76682i5015A92098c24185A88939p5673
10496A13266J00081A03302C3246a61092A39879E3046d8057A59389g4692j2446
10486h7138L5964k6266o8411o2628k1033A92189C4419a51760D05794P2489j45739
10475C32544J27905j09583A75029M27029j96391h8511f429B52009q6104c43593
$$ plain form
10464 -160999 -92712 -184622 66478 95770 -295864 -230795 -218102 -104101 130843 157950 -243551
10452 -4936 76029 -457949 -196193 -275898 -58661 -172396 -339882 -175376 -290 134477 216908
10441 216908 278062 -228449 173483 -132487 -130117 61776 -37637 -261242 -259263 33579 -17380
10429 -4584 38038 -9819 -30708 -297783 -7816 -7692 199309 -311402 165576 240275 167988 128380
10417 128380 137399 -225742 333 -135572 -110931 152493 -151032 80427 201999 -300337 73806
10405 -80380 128843 143684 -64699 -158331 -35330 186472 -111942 84143 256575 32055 55997
10394 55997 159672 -298560 221352 -37983 206257 57409 -51613 -85209 -254791 -153769
10384 -153769 -39574 173279 168608 126554 -94820 334304 7047 117381 -234898 220674 -63580
$$ packed form
10464a60999O8287r1910F6478K9292b95864O5069J2693a04101A30843K7107b43551
10452d936G6029d57949a96193p9705e8661j13735j67486J64506b90A34477Q2431
10441B16908O1154b28449A73483a32487K370F1776c7637k23605J979C3579a7380
10429d584C8038i819k0889k67075g816J24A99309c11402A65576P4699p2287l9608
10417A28380R019b25742C33a35572K4641A52493a51032H0427J21572c00337G3806
10405h0380A28843J4841f4699r3632c5330A86472a11942H4143J72432C2055K3942
10394E5997J03675b98560B21352c7983B06257E7409e1613l3596j69582J01022
10384a53769c9574A73279m671m2054i4820C34304G047J10334b34898B20674f3580
$$ plain form
10372 307612 504476 370897 205046 91883 378942 47052 154778 272559 621480 409227
10362 409227 322977 365695 125725 222419 155800 326079 649172 319335 120497 322978
10352 322978 160766 109224 443717 354962 372695 339151 356030 395994 -37748 403358 269037
10341 269037 599486 418935 -17653 -53592 189533 50015 241379 -69274 -200664 -49522
10330 142862 504431 138349 125128 473327 -143226 100232 205672 -157750 141578 256669
10320 256669 341171 357051 276818 102333 293526 229513 396822 121887 -177023 85211
10309 -16466 19674 -169420 230476 -121977 133676 -114615 134740 175665 73679 137176
10299 137176 -83950 -131718 5794 -99287 338204 62930 -234617 83703 208649 -75833 16568
$$ packed form
10372C07612J96864j33579j65851I1883K87059D7052J07726J17781L48921k12253
10362D09227q6250M2718A25725R6694o6619J70279L23093C19335A20497K02481
10352C22978A60766n1542L34493q8755J7733l3544J6879L9964c7748D03358j34321
10341B69037L30449j80551a7653l5939A89533E0015J91364f9274j31390d9522
10330A42862L61569A38349j3221L48199a43226A00232J05440a57750A41578J15091
10320B56669Q4502J5880q0233A02333J91193o4013J67309A21887a77023H5211
10309a6466A9674a69420B30476a21977A33676a14615A34740M0925G3679O3497
10299A37176h3950m7768E794i9287C38204F2930b34617H3703J24946g5833A6568
$$ plain form
10287 359092 -142044 -162226 -93509 -122553 -75030 -114790 -261204 -507282 -307621 29889 -52175
10275 -177886 121828 -284843 -243146 115406 -317075 -238337 280326 -401106 226172 280214
10265 280214 -134022 87717 -348220 -168176 -72610 3778 108611 -71115 -190161 111083
10254 468048 269753 379916 499312 -25056 16871 232649 -61469 -580813 -14077 196562
10243 80007 586 -85051 -6496 -317456 -271042 -160577 -177539 132283 32880 31666 -241271 -54670
10230 13470 92790 -488990 74610 -179559 -116533 158763 -278371 -130186 182813 -319091
10219 -71772 544351 -103756 -33414 -145475 -97652 -54096 160936 -57870 202522 152238 227631
10208 227631 -23276 -339782 96872 43240 -149118 69432 230954 -90425 179835 -68019 -196849
$$ packed form
10287C59092a42044k0182O8717k9044M7523l9760j46414k46078J99661B9889e2175
10275a77886A21828b84843M1697A15406c17075P8738B80326d01106B26172N4042
10265B80214a34022H7717c48220a68176g2610C778J04833g1115j19046A11083
10254D68048j98295J10163J19396b5056A6871K15778f1469n19344a4077A96562
10243H0007E86h5051f496l10960M6414J10465j6962A32283C2880j214b41271e4670
10230A3470P9320d88990G4610a79559O3026A58763b78371a30186A82813c19091
10219g1772E44351a03756c3414j12061M7823M3556A60936e7870B02522n0284P5393
10208B27631b3276l16506I6872D3240a49118F9432J61522i0425A79835f8019j28830
$$ plain form
10197 -196849 160071 -272292 -236728 -15461 -74426 198321 -64283 -234156 17740 29070 -86449
10185 -496638 284615 -412329 126520 185398 47470 -316135 -305536 -60014 -155595 -82152 -288062
10174 -288062 10809 -82997 -91601 221034 -145995 74211 -120392 -243450 -89803 -426445 151804
10162 -159592 -283939 8043 237364 38314 -10710 -342342 -16009 108790 -204407 -443717
10152 -443717 -242762 -121768 155574 153081 -19830 5114 -30938 23652 -42966 128129 -36252
10140 -182385 -179480 -46947 193155 -179808 -213432 222591 151364 78561 -54595 -135096 -163216
10129 -163216 51820 -102619 -50863 -232935 -467505 -194472 279786 -288371 -155189 -385484
10119 -385484 -111908 -249509 -145953 -209084 184326 -134042 -349600 -165996 -175607 -213597
$$ packed form
10197a96849A60071b72292L5564a5461n8965A98321f4283j69873A7740J1330h6449
10185d96638B84615d12329A26520N8878D7470c16135J0599f0014r5581P3443k05910
10174b88062A0809h2997q604B21034a45995G4211a20392j23058h9803l36642A51804
10162a59592j24347H043K29321C8314a0710l31632a6009A08790b04407k39310
10152d43717K00955J20994A55574k493a9830E114c0938B3652d2966A28129c6252
10140a82385K905d6947A93155a79808l3624B22591p1227p2803e4595q0501k8120
10129a63216E1820a02619e0863j82072k34570a94472B79786b88371J33182k30295
10119c85484a11908j37601J03556o3131A84326a34042k15558a65996r611l7990
$$ plain form
10109 -213597 -17422 -298112 10169 129080 -90186 -114867 -208812 -129518 -93947 -270323 -156921
10098 -156921 -103255 132140 -84368 -176621 83532 160673 -27013 -121162 -112620 -2083 -277692
10087 -277692 -95807 122605 -13327 -210603 128110 -75524 -7820 207352 125546 -135063 1466
10075 -160037 129406 -131050 158359 87643 108779 -80071 -43489 -346561 -345935 -20374 -416067
10064 -416067 5048 183526 -130578 211946 -111659 116446 -54641 -425313 50082 10957
10053 381590 190664 -272116 -283771 -195609 92545 -165088 -185419 -514049 -98811 -152293 -81781
10042 -81781 196987 103086 54551 -79095 -221660 -448527 -192671 -216676 -71724 -46640 -55473
10031 -55473 -207287 33369 203482 16924 -264176 53073 23995 193897 -21516 -56827 118341
$$ packed form
10109b13597a7422k80690A0169J18911i0186k4681r3945P9294L5571j76376J13402
10098a56921N3666A32140h4368r2253H3532P7141b7013r4149Q542b083k75609
10087b77692i5807A22605a3327j97276A28110g5524g820B07352q1806a35063A466
10075a60037A29406a31050A58359p0716K1136h0071L6582l03072O26b0374l95693
10064d16067E048J78478a30578B11946a11659A16446e4641l70672E0082A0957
10053C81590A90664b72116j1655Q8162I2545a65088k0331l28630i8811n3482P0512
10042h1781A96987r3901m8535g9095j42565k26867a92671k4005g1724K5084q833
10031e5473j51814C3369J70113A6924b64176E3073B3995J69902b1516l5311A18341
$$ plain form
10019 -212097 -62923 -71999 -36361 -14216 -10159 -111218 -121044 -334760 186505 -116065 30807
10007 1944 -67473 78875 27408 -124809 -37495 37327 241965 -114118 -133641 -15834 271196
9995 55487 125768 -149284 32321 -70217 221649 -173250 88770 -261725 -292978 57691 35809
9984 35809 -363380 293493 93098 36369 -48254 19573 -376805 -168536 -356172 68567 -139174
9972 681 -118819 -130776 -176052 95683 -201558 -16550 206624 -159331 233436 -99488 115189
9960 42967 -296040 -61023 93721 -192902 -59068 -95345 -36281 -173418 -188446 -5089 -89671
9949 -89671 -119764 -346201 -139790 199677 113842 -25301 -61880 -110222 313535 -237696 -46385
9937 286424 42107 16771 79386 255073 -13288 85523 -311887 -48689 -122533 -138900 -154681
$$ packed form
10019b12097f2923r076L5638a4216M057j01059r826k13716A86505a16065C0807
10007A944f7473G8875B7408a24809c7495C7327K04638a14118j9523a5834B71196
9995E5487P0281a49284C2321g0217B21649a73250H8770b61725l1253E7691k1882
9984C5809c63380B93493I3098C6369d8254A9573c76805a68536j87636F8567a39174
9972F81a18819j1957m5276I5683b01558a6550B06624a59331B33436i9488A15189
9960D2967b96040f1023I3721a92902e9068l6277c6281j37137j5028e089q4582
9949h9671l0093k26437a39790A99677q5835b5301l6579m8342C13535b37696d6385
9937B86424D2107A6771O2615J75687a3288H5523c11887d8689p3844j6367j5781
$$ plain form
9926 -154681 99885 119180 -370332 43905 -134607 -100818 -234942 299507 -21398 7447 -200896
9914 -413016 -157299 99398 38843 66136 -29537 -136122 9156 -122027 11389 -206608 -290350
9903 -290350 -201578 -373625 201245 315470 -56612 25677 -115033 -164956 93699 -126529 -92762
9892 -92762 -91186 22245 -98798 -98060 139969 -285365 -126389 -6575 132839 -193675 -275879 -98754
9879 53401 -106715 -149779 -126513 272176 -130338 -164128 -292700 -488201 -125977 -18859 92283
9867 -172326 -263713 28965 -280863 -228175 -64559 107384 53543 -311512 -4376 -1099 -397139
9856 -397139 -291603 -98614 285177 -121400 -94589 -270298 -58903 -41544 -171358 -178940 -54508
9844 -133554 137009 -310383 -202472 32483 435402 191390 -16178 -24227 -277301 -210094 263495
$$ packed form
9926a54681I9885J9295c70332D3905a34607L3789j34124B99507b1398G447b00896
9914d13016a57299I9398C8843K7293b9537j06585I156a22027A1389b06608q3742
9903b90350Q8772j72047B01245J14225e6612B5677a15033m9923I3699a26529L3767
9892i2762J576B2245i8798P38A39969b85365a26389f575A32839a93675q2204i8754
9879E3401a06715m3064K3266B72176a30338l3790j28572j95501a25977a8859I2283
9867a72326r1387B8965b80863N2688f4559A07384E3543c11512d376a099l96040
9856c97139J05536i8614B85177a21400K6811j75709e8903J7359j29814p582e4508
9844a33554A37009c10383J07911C2483M02919A91390a6178q049k53074O7207B63495
$$ plain form
9832 141500 -166583 36698 -433277 5981 -259857 -131332 50113 -205955 89611 -520787 -101678
9820 -228231 -144945 -112362 40674 -59663 -104634 -382964 1962 -140772 106294 -352370 -84010
9808 -29553 4089 -110161 -364032 -243576 119587 -230956 -234500 5619 189840 12415 229831
9797 229831 -255427 66806 -130145 -35041 247583 -297854 -101754 -77392 10357 -162778
9786 -274803 -148210 -27390 -161264 -150100 -137259 152336 -78821 -184083 -108454 34051 8636
9774 -185766 -86792 10705 -206253 -208741 -166504 -254251 -98789 -36920 -172189 -6874 -72175 -76893
9762 -76893 -208772 -197340 87716 -157827 -226108 -356389 -56668 158329 142029 -331884 -343955
9751 -343955 -145460 64980 -414822 102730 -403457 -107356 -332721 -211968 -87432 -205520
$$ packed form
9832A41500a66583C6698d33277E981b59857J28525E0113b05955H9611e20787a01678
9820b28231Q3286L2583D0674e9663m4971k78330A962a40772A06294c52370h4010
9808b9553D089a10161k53871J20456A19587b30956l544E619J84221A2415K17416
9797B29831b55427F6806a30145c5041B47583b97854a01754K4362A0357a62778
9786b74803J26593b7390j33874J1164J2841A52336g8821j05262P5629C4051H636
9774a85766h6792A0705b06253k488M2237q7747i8789c6920j35269f874o5301m718
9762g6893j31879J1432H7716a57827o8281j30281e6668A58329j6300c31884j2071
9751c43955a45460F4980d14822A02730d03457a07356k25365J20753h7432j18088
$$ plain form
9741 -205520 196976 -164997 -131386 134401 276468 9645 -151494 -54297 148753 -34432 -153069
9730 -153069 -210443 -183209 42108 -20452 -172353 -118143 82321 47449 -148463 -134775 97042
9718 -257160 102781 183721 -253654 30694 253578 -270617 -206248 158773 182325 -329000
9707 -132632 -195926 -202070 246513 -64841 -23616 258703 -225296 -199349 99558 -87136 -226992
9696 -226992 -9016 -79803 64790 -366458 -164849 -22610 -105420 76913 -73006 -205608 -252291
9685 -252291 -78601 108605 -148986 -187795 -243615 -107479 -186536 38657 275843 -15308 -135737
9674 -135737 -141968 8071 22116 -230027 -304685 -67010 224005 -19596 64818 -180823 -131842
9663 -131842 19840 -76533 -239146 -75451 222508 -119462 -59367 14919 112654 -140475 42382
$$ packed form
9741b05520A96976a64997L3611A34401J42067I645a51494e4297A48753c4432j18637
9730a53069n7374K7234D2108b0452j51901N4210H2321l4872a48463J3688I7042
9718b57160A02781Q0940b53654C0694K22884b70617O4369A58773K3552c29000
9707a32632o3294o144B46513f4841b3616B58703b25296K5947I9558h7136j39856
9696b26992i016p0787F4790c66458a64849b2610q2810G6913g3006j32602m6683
9685b52291g8601A08605a48986l8809n5820a07479p9057C8657K37186a5308j20429
9674a35737o231H071J4045b30027p4658f7010B24005a9596F4818a80823M8981
9663a31842A9840g6533j62613g5451B22508a19462e9367A4919R7735a40475D2382
$$ plain form
9651 -115831 86526 -158999 -123175 -272050 -59133 -352355 214103 -339083 -46597 180380
9640 -330280 -86406 -205353 -65867 -85399 280547 292350 -82552 -75688 -190045 -342974 -377777
9629 -377777 189682 -5011 157523 88557 -283724 262424 -250864 -242794 -161313 -291856 -287777
9618 -287777 119817 103761 294654 250615 231938 -173803 -122975 -22130 -152650 180955 -569599
9606 -304808 35157 116451 -167900 187068 13826 -45340 23925 231199 -181679 -230961 126705
9594 114676 -91817 -151292 -370581 -250409 -108065 -42229 -139184 79784 -110829 416477 24917
9582 59780 -323590 78867 -124954 99080 -119457 -82825 72030 -369001 107237 -235529 -306447
9571 -306447 112625 -30374 -230 24834 -68502 237584 -235503 197787 -31111 -185545 -35466
$$ packed form
9651a15831H6526a58999L5824j48875e9133k93222B14103c39083d6597A80380
9640c30280h6406j18947f5867j9532B80547J1803h2552O864j14357j52929l4803
9629c77777A89682e011A57523o8966b83724B62424b50864Q070Q1481j30543M079
9618b87777A19817j6056J90893m4039j8677a73803N0828b2130j30520A80955e69599
9606c04808C5157Q1294a67900A87068A3826d5340B3925K07274a81679m9282A26705
9594A14676i1817n9475k19289J20172a08065d2229r6955G9784a10829D16477B4917
9582E9780c23590G8867a24954I9080a19457L6632G2030c69001A07237b35529p0918
9571c06447A12625c0374b30B4834f8502B37584b35503A97787c1111j54434c5466
$$ plain form
9559 -371999 307699 -206660 -41541 364316 60392 23998 -250062 76619 -425617 -72062 160709
9547 278869 -455075 -157529 -366530 -189930 -127667 -36164 -345139 -63268 -128472 -38163 117596
9535 21390 121237 63793 -81201 -8990 -68574 -225519 -163716 -164562 -22909 126912 -73584 163951
9522 -372339 -178551 -72629 130982 -63036 -90904 -299053 147697 -326894 -366170 128565
9511 44009 397798 -20944 78098 84843 -14582 87315 -133652 -61841 -206077 -403149 151362
9499 -33909 -77080 6424 -224836 -148269 -569705 -39266 -74045 51475 -150618 -252350 -62072
9487 6080 -120675 83325 -453923 32464 134262 335694 -192478 -66210 -84755 -392821 -27182
9475 -38000 -92549 331467 -54289 174334 197921 31803 -308179 124945 57389 53842 -25187
$$ packed form
9559c71999C07699b06660d1541C64316F0392B3998b50062G6619d25617g2062A60709
9547B78869d55075a57529k09001J76600O2263c6164l08975f3268o5204c8163A17596
9535B1390R9847n7444h1201h990n9584j56945O1803q46b2909A26912g3584A63951
9522c72339a78551g2629A30982f3036k7868k08149A47697c26894l9276A28565
9511D4009L53789b0944G8098O745a4582H7315a33652f1841j44236j97072A51362
9499c3909m3171F424b24836P6567m21436c9266l4779E1475a50618j01732f2072
9487F080a20675H3325d53923C2464J01798K01432a92478f6210j8545l08066b7182
9475c8000n4549C31467e4289A74334K3587C1803c08179A24945E7389l547b5187
$$ plain form
9463 -8313 -74472 -16458 -185910 49162 143500 -25363 28613 -190677 174779 -48103 -180090
9452 -180090 -152394 213886 -218657 -24101 -255592 -82640 -117303 -410922 30989 -431452 -122359
9440 100679 229499 249593 -65246 3169 87474 -41626 -263905 5610 -80389 90224 -115900
9428 38102 -92182 -117267 -267886 -55021 -260709 -160253 -294052 -184959 5977 96800 203900
9417 203900 -110271 -209348 -263408 -257592 14055 -153896 106034 52869 8380 -229531 10890
9405 66034 311893 91559 -506286 -60327 -229303 -19752 -19982 -18283 -22789 87639 -183452 -94126
9393 -94126 -267606 -35932 -421926 -97483 -98197 -353617 46876 122115 -182332 -277296 -138618
9381 -200086 -3497 -248082 -259159 -141288 35806 -107429 17513 -100562 -670687 137963 126391
$$ packed form
9463h313o6159a6458j69452D9162R4338b5363B8613a90677A74779d8103j31987
9452a80090K7696B13886b18657b4101k31491h2640l4663k93619C0989d31452a22359
9440A00679J28820K0094f5246C169Q4305d1626k22279E610h0389I0224a15900
9428C8102i2182k5085j50619e5021k05688J00456j33799J09093E977R0823J07100
9417B03900a10271r9077n4060N816A4055a53896A06034E2869H380b29531A0890
9405F6034K45859I1559e06286f0327j68976a9752k30J699m506H7639a83452Q9326
9393i4126j73480c5932l85994i7483p14k55420D6876P5239a82332r4964a38618
9381b00086c497k44585j1077J17871C5806a07429A7513a00562n70125A37963j1572
$$ plain form
9370 126391 -1918 252309 -145898 155666 116881 79555 -398227 -351226 -65141 18694 76801
9359 76801 -159203 -225874 -86431 -169134 -95981 -276798 -31000 -30324 191355 202700 -59499 43232
9346 -157251 125837 -113367 -145145 299636 -135365 -65350 144474 -351135 -47192 -70821
9336 -70821 -254404 142886 -378140 -96915 -198117 -54131 33385 -327924 121301 317669
9326 317669 293492 33674 -86811 -158890 77244 4368 -256085 -329538 -194520 -237025 129375
9314 -214703 183118 39451 -3797 -18234 -278905 -21105 -16849 33499 153939 -22012 -228757
9303 -228757 -179281 -213510 -8898 -531343 51214 -140539 31534 -69664 169827 -80014 207849
9291 -71372 42097 30215 264047 13463 325223 -186994 36778 -307769 93236 -171850 -78539
$$ packed form
9370A26391a918B52309a45898A55666l8785l7326c98227M7001f5141A8694N8107
9359G6801a59203o6671h6431q2703P3153j80817c1000O76A91355J1345e9499D3232
9346a57251A25837a13367l1778B99636a35365f5350A44474c51135d7192k3629
9336g0821j83583A42886c78140i6915j01202e4131C3385c27924A21301J96368
9326C17669k4177C3674h6811p2079G7244D368b56085p3453J35018m2505A29375
9314b14703A83118C9451c797j4437k60671b1105M256C3499J20440b2012k06745
9303b28757M9476l4229h898n22445E1214a40539C1534f9664A69827h0014B07849
9291g1372D2097j1882K33832A3463L11760a86994C6778c07769I3236a71850g8539
$$ plain form
9279 -289316 -68992 57641 -288878 -90458 -353899 -190939 -23329 -73579 -334368 -121415 23451
9267 -232318 7418 184464 -219348 -351664 158065 13334 176430 -127418 -319222 28585
9256 172056 94897 -258230 55214 -228898 -325694 -89311 -202056 -131285 -3079 121442 -131528
9244 -17546 68113 -196877 87660 15018 -138129 -51638 -315126 -200374 -165940 54300 67737
9233 67737 -258006 -27543 242941 138758 -17998 214763 -80225 -21465 -63326 -115700 62457
9221 148420 35768 -213563 74278 114622 -241258 -17202 -202919 -220753 22737 101020 -260546
9209 -251731 -159552 -99278 -72637 -162484 -353382 275984 -189604 13739 50182 -3300 19829
9197 -324960 134038 -113057 -84670 29938 163370 -83599 51148 -171568 -264352 -331476 -39543
$$ packed form
9279b89316f8992E7641b88878i0458k63441J62960b3329n0250k60789a21415B3451
9267b32318G418J77046b19348j32316A58065A3334J63096a27418j91804B8585
9256A72056p7159b58230E5214b28898r6796h9311j12745P0771c079A21442a31528
9244a7546F8113a96877H7660A5018a38129e1638k63488J14752L4434E4300J3437
9233F7737b58006b7543B42941j04183a7998B14763h0225b1465m1861n2374F2457
9221A48420C5768b13563G4278M0344b41258a7202j85717j7834B2737P8283b60546
9209b51731R2179O0274K6641q9847j90898B75984a89604A3739L6443c300A9829
9197c24960A34038a13057K8387B9938J33432h3599E1148a71568r2784o7124c9543
$$ plain form
9185 60107 -172390 -151199 -128201 129441 92736 -144449 -128782 -132695 -403263 -298597 -53088
9173 -54275 -281318 -275334 78223 4797 -94317 -132681 78178 -36847 -197032 -153482 17407 -43744
9160 99825 -185775 -438770 -183863 75505 -182317 -76406 55877 77786 -137314 85644 -7584
9148 129814 -8776 -90458 -102662 -164474 -74244 59437 430744 -56320 -21786 -240477 -96412
9136 194636 43039 -182219 67100 -275372 -165710 -317484 230120 -95260 -242702 146861
9125 2593 29094 139635 -185855 30379 -238758 -240709 -293526 397945 -53968 51471 58620 81236
9113 81236 -191002 -254912 -105401 -253585 -213056 25453 -47048 -25007 166188 -441852 178347
9101 -227822 -59506 -64075 -81443 -358807 -107179 -65366 -4678 36288 -153494 -33020 5547 -338980
$$ packed form
9185F0107a72390K1191K2998A29441l6705a44449J5667l913k70568J04666e3088
9173e4275k27043N984G8223D797i4317l8364G8178c6847j60185M3550A7407d3744
9160I9825a85775k52995a83863G5505a82317g6406E5877K1909a37314H5644g584
9148A29814h776q1682j2204o1812g4244E9437L71307e6320b1786k18691i6412
9136A94636D3039a82219F7100b75372J09662j51774B30120i5260j47442A46861
9125B593K6501J10541a85855C0379b38758j951n2817C97945e3968E1471P149K2616
9113H1236a91002o3910a05401j48184M0529B5453d7048K2041A66188d41852A78347
9101b27822e9506m569j7368k77364a07179M1813d678C6288a53494c3020E547c38980
$$ plain form
9088 -65748 202049 -146459 -11799 -186250 -102474 21147 330956 -228649 -55891 -274087 -13659
9076 -207730 43399 -48112 -68930 -57803 -205244 71782 8177 21701 236342 -232584 -292716
9065 -292716 110366 198983 47100 -378723 -116841 -379263 4146 -197992 409993 -130971
9054 -46122 -139668 -144592 46395 1400 18604 -28707 -151332 -44179 -207075 122379 15008 -364130
9041 -74665 36420 -161226 -161450 16389 -155660 212479 -194661 -183510 411204 -97483 66079
9029 -182825 -221583 50308 -3407 -205925 42530 -316374 -23638 90606 -240264 -8197 92480
9017 -50898 353986 -421124 -3405 -183188 -284167 -208429 -51548 -169596 144858 -26926 21520
9005 431008 -158415 -45749 -100921 72099 37431 -120900 -153235 -13335 46209 258758 6550
$$ packed form
9088f5748B02049a46459a1799j74451Q3776B1147L09809b28649e5891k18196a3659
9076b07730D3399d8112k0818J1127j47441G1782H177J3524K14641b32584o0132
9065b92716A10366Q8617D7100c78723a16841k62422D146a97992D09993a30971
9054d6122r3546m924D6395A400J7204b8707j22625d4179j62896A22379A5008c64130
9041g4665C6420a61226k24A6389a55660B12479a94661J1151D11204i7483F6079
9029a82825l8758E0308c407k02518D2530c16374b3638I0606b40264h197I2480
9017e0898C53986d21124c405j79783j00979P5738e1548j18048A44858b6926B1520
9005D31008a58415d5749n5172G2099l4668a20900l2335a3335D6209K12549F550
$$ plain form
8993 235526 -43375 -86573 -318288 136900 -81055 44477 25543 -87552 -224652 283 -105617
8981 -56588 -23126 141654 160294 156379 2355 -276801 161718 -124454 128945 65731 -55732
8969 14956 -233772 128023 73233 -81852 -92493 -194688 -312141 -349647 221824 -28325 -209622
8958 -209622 -202089 424067 -101426 -164967 68241 -241990 335298 -169016 166025 105899 -230703
8946 -42076 64474 31931 164817 -24109 -78265 -35493 -415656 -39910 15558 -42225 -54182
8935 -54182 246021 -25362 177060 395071 24631 53134 43900 20003 -133790 -342004 -157674
8923 305101 832046 860718 2083382 6882573 16650174 4618005 1069605 612873 138607
8913 41678 135158 23051 11202 -218139 234442 -256651 -172212 489433 159008 211273 -67327
$$ packed form
8993B35526d3375m3198k31715A36900h1055D4477j8934h7552j37100B83a05617
8981e6588b3126A41654J8640l915B355b76801A61718a24454A28945o3214e5732
8969A4956b33772A28023n4790h1852j0641j02195j17453l7506B21824b8325j81297
8958b09622P533D24067a01426o3541F8241b41990C35298a69016A66025o0126b30703
8946d2076F4474C1931J32886b4109n4156c5493l80163c9910A5558d2225j1957
8935e4182B46021b5362A77060K18011B4631K8503r234B0003a33790k08214a57674
8923C05101N26945K8672J222664M799191R767601D618005A069605m56732A38607
8913D1678R3480B3051A1202b18139B34442b56651Q4439D89433A59008N2265f7327
$$ plain form
8901 295814 -234698 -22808 209838 112203 52781 102629 -322437 38642 164264 15264 32000
8890 32000 -32537 40314 -164403 -388185 -156351 123243 -219356 -99633 148734 -25409 -148037
8879 -148037 -301583 -40715 34535 -108445 314154 26246 163241 -235549 -18612 35066 95322
8868 95322 -62239 10603 -234441 -84901 326817 -321950 -125020 -185490 -452849 291287 165900
8857 165900 126352 14926 -479041 -103410 -131680 -64446 -165124 -136082 -142326 -211193 8178
$$ packed form
8901B95814b34698b2808B09838r7635E2781M9848c22437C8642J25622A5264J6736
8890C2000c2537D0314a64403k23782a56351A23243b19356i9633A48734b5409j22628
8879a48037j53546d0715C4535a08445C14154B6246J36995b35549a8612C5066O0256
8868I5322f2239A0603b34441h4901C26817c21950a25020o0470k67359B91287j25387
8857A65900l9548A4926d79041a03410k8270f4446j00678K9042o244o8867H178
$$ [...]
##END NTUPLES=NMR SPECTRUM
##END=
