
##TITLE=AC1240__6608823_S6ZJg1XapZ
##JCAMPDX= 6.0         $$ Bruker NMR JCAMP-DX V2.0
##DATA TYPE= NMR SPECTRUM
##DATA CLASS= NTUPLES
##ORIGIN= BRUKER
##OWNER= Administrator
$$ 1.72 TOPSPIN		Version 2.1
$$ 2012-08-01 19:19:16.265 -0500  Administrator@TOPSPIN
$$ Compression mode = diff/dup
##.OBSERVE FREQUENCY= 400.02188249412
##.OBSERVE NUCLEUS= ^1H
##.ACQUISITION MODE= SIMULTANEOUS (DQD)
##.ACQUISITION SCHEME= undefined
##.AVERAGES= 64
##.DIGITISER RES= 22
##SPECTROMETER/DATA SYSTEM= spect
##.PULSE SEQUENCE= noesygpps1d.comp
##.SOLVENT NAME= COFFEE_meoh
##.SHIFT REFERENCE= INTERNAL, COFFEE_meoh, 1, 14.96231
##AUDIT TRAIL= $$ (NUMBER, WHEN, WHO, WHERE, PROCESS, VERSION, WHAT)
$$ ##TITLE= Audit trail, TOPSPIN		Version 2.1
$$ ##JCAMPDX= 5.01
$$ ##ORIGIN= Bruker BioSpin GmbH
$$ ##OWNER= Administrator
$$ $$ C:\Bruker\TOPSPIN/data/COFFEE/nmr/AC1240__6608823_S6ZJg1XapZ/12/pdata/1/auditp.txt
$$ ##AUDIT TRAIL=  $$ (NUMBER, WHEN, WHO, WHERE, PROCESS, VERSION, WHAT)
(   1,<2012-08-01 19:19:10.796 -0500>,<Administrator>,<TOPSPIN>,<go>,<TOPSPIN 2.1>,
      <created by zg
	started at 2012-08-01 19:07:40.593 -0500,
	POWCHK enabled, PULCHK disabled,
       configuration hash MD5:
       6B 1B 68 BB D9 2E 58 E2 7F 35 AD 54 07 DF 0E 41
       data hash MD5: 64K
       51 D0 1B 1C 2D 56 68 FF 99 AC 13 8D AB 9E C4 4D>)
(   2,<2012-08-01 19:19:14.031 -0500>,<Administrator>,<TOPSPIN>,<proc1d>,<TOPSPIN 2.1>,
      <Start of raw data processing
       efp LB = 0.3 FT_mod = 6 PKNL = 1 PHC0 = 0 PHC1 = 0 SI = 128K 
       data hash MD5: 128K
       15 CA 7E E8 E5 48 65 44 2C F6 1C B8 B2 9D A8 BF>)
(   3,<2012-08-01 19:19:15.062 -0500>,<Administrator>,<TOPSPIN>,<proc1d>,<TOPSPIN 2.1>,
      <pk PHC0 = -1.543579 PHC1 = 0 
       data hash MD5: 128K
       5F 00 A7 0E FA 9C 1A 53 D6 CD 25 C8 FB 22 93 3E>)
(   4,<2012-08-01 19:19:15.906 -0500>,<Administrator>,<TOPSPIN>,<proc1d>,<TOPSPIN 2.1>,
      <abs ABSG = 1 
       data hash MD5: 128K
       88 C0 35 4F BA C9 41 CC 7A 66 4B 3A B6 09 2E 39>)
(   5,<2012-08-01 19:19:16.000 -0500>,<Administrator>,<TOPSPIN>,<proc1d>,<TOPSPIN 2.1>,
      <abs ABSG = 2 
       data hash MD5: 128K
       56 BD A3 17 37 9F 62 AC A5 42 E2 E6 39 86 4A 2A>)
(   6,<2012-08-01 19:19:16.062 -0500>,<Administrator>,<TOPSPIN>,<proc1d>,<TOPSPIN 2.1>,
      <abs ABSG = 3 
       data hash MD5: 128K
       6B 25 02 CB 6B 29 24 FF 64 91 BF DC FA 92 4F 63>)
(   7,<2012-08-01 19:19:16.125 -0500>,<Administrator>,<TOPSPIN>,<proc1d>,<TOPSPIN 2.1>,
      <abs ABSG = 4 
       data hash MD5: 128K
       34 3F 8E 54 CC 85 FD CC 37 FB A1 FC 7A 0B 18 D6>)
(   8,<2012-08-01 19:19:16.187 -0500>,<Administrator>,<TOPSPIN>,<proc1d>,<TOPSPIN 2.1>,
      <abs ABSG = 5 
       data hash MD5: 128K
       F2 42 B6 62 28 CE 90 9A 3B D4 AD FE 89 ED 00 DC>)
$$ ##END=
$$ 
$$ $$ hash MD5
$$ $$ 84 F4 4C B2 3F 5A BB 85 2E 5C 85 2C 22 61 FE 48
##$RELAX= 
##$RELAX= 
##$RELAX= 
##$RELAX= 
##$RELAX= 
##$RELAX= 
##$RELAX= 
##$RELAX= 
$$ Bruker specific parameters
$$ [...]
##$TP07= 0
##$TPNAME0= <>
##$TPNAME1= <>
##$TPNAME2= <>
##$TPNAME3= <>
##$TPNAME4= <>
##$TPNAME5= <>
##$TPNAME6= <>
##$TPNAME7= <>
##$TPOAL= (0..7)
0.5 0.5 0.5 0.5 0.5 0.5 0.5 0.5
##$TPOFFS= (0..7)
0 0 0 0 0 0 0 0
##$TUNHIN= 0
##$TUNHOUT= 0
##$TUNXOUT= 0
##$USERA1= <user>
##$USERA2= <user>
##$USERA3= <user>
##$USERA4= <user>
##$USERA5= <user>
##$V9= 5
##$VALIST= <valist>
##$VCLIST= <CCCCCCCCCCCCCCC>
##$VD= 0
##$VDLIST= <DDDDDDDDDDDDDDD>
##$VPLIST= <PPPPPPPPPPPPPPP>
##$VTLIST= <TTTTTTTTTTTTTTT>
##$WBST= 1024
##$WBSW= 4
##$XGAIN= (0..3)
0 0 0 0
##$XL= 0
##$YL= 0
##$YMAX_a= 16036868
##$YMIN_a= -10010359
##$ZGOPTNS= <>
##$ZL1= 120
##$ZL2= 120
##$ZL3= 120
##$ZL4= 120
##$ABSF1= 14.96231
##$ABSF2= -5.595872
##$ABSG= 5
##$ABSL= 3
##$ALPHA= 0
##$AQORDER= 0
##$ASSFAC= 0
##$ASSFACI= 0
##$ASSFACX= 0
##$ASSWID= 0
##$AUNMP= <proc_prof1d_extract.lims>
##$AXLEFT= 0
##$AXNAME= <>
##$AXNUC= <1H>
##$AXRIGHT= 0
##$AXTYPE= 0
##$AXUNIT= <>
##$AZFE= 0.1
##$AZFW= 0.1
##$BCFW= 0
##$BC_mod= 0
##$BYTORDP= 0
##$COROFFS= 0
##$CY= 15
##$DATMOD= 1
##$DC= 0
##$DFILT= <>
##$DTYPP= 0
##$F1P= 0
##$F2P= 0
##$FCOR= 0.5
##$FTSIZE= 131072
##$FT_mod= 6
##$GAMMA= 0
##$GB= 0
##$INTBC= 1
##$INTSCL= 1
##$ISEN= 128
##$LB= 0.3
##$LEV0= 0
##$LPBIN= 0
##$MAXI= 10000
##$MC2= 0
##$MEAN= 0
##$ME_mod= 0
##$MI= 0
##$NCOEF= 0
##$NC_proc= -2
##$NLEV= 6
##$NOISF1= 0
##$NOISF2= 0
##$NSP= 0
##$NTH_PI= 0
##$NZP= 0
##$OFFSET= 14.96231
##$PC= 1
##$PHC0= -1.543579
##$PHC1= 0
##$PH_mod= 1
##$PKNL= yes
##$PPARMOD= 0
##$PPDIAG= 0
##$PPIPTYP= 0
##$PPMPNUM= 2147483647
##$PPRESOL= 1
##$PSCAL= 4
##$PSIGN= 0
##$PYNMP= <proc.py>
##$REVERSE= no
##$SF= 400.020009111272
##$SI= 131072
##$SIGF1= 0
##$SIGF2= 0
##$SINO= 400
##$SIOLD= 131072
##$SPECTYP= <>
##$SREGLST= <1H.CDCl3>
##$SSB= 0
##$STSI= 131072
##$STSR= 0
##$SW_p= 8223.68421052631
##$SYMM= 0
##$S_DEV= 0
##$TDeff= 65536
##$TDoff= 0
##$TI= <>
##$TILT= no
##$TM1= 0
##$TM2= 0
##$TOPLEV= 0
##$USERP1= <user>
##$USERP2= <user>
##$USERP3= <user>
##$USERP4= <user>
##$USERP5= <user>
##$WDW= 1
##$XDIM= 131072
##$YMAX_p= 454613344
##$YMIN_p= -86332
##$CURPLOT= <Network HP LaserJet P1505>
##$CURPRIN= <$Network HP LaserJet P1505>
##$DFORMAT= <normdp>
##$LAYOUT= <+/1D_H.xwp>
##$LFORMAT= <normlp>
##$PFORMAT= <normpl>
##$SURQMSG= 1
$$ End of Bruker specific parameters
$$ ---------------------------------
##NTUPLES= NMR SPECTRUM
##VAR_NAME=  FREQUENCY,     SPECTRUM/REAL,   SPECTRUM/IMAG
##SYMBOL=    X,             R,               I
##VAR_TYPE=  INDEPENDENT,   DEPENDENT,       DEPENDENT
##VAR_FORM=  AFFN,          ASDF,            ASDF
##VAR_DIM=   131072,        131072,          131072
##UNITS=     HZ,            ARBITRARY UNITS, ARBITRARY UNITS
##FACTOR=    0.0627417313425164, 1,          1
##FIRST=     8223.62146879497, 2688,         -60572
##LAST=      0,             4208,            -60809
##MIN=       0,             -86332,          0
##MAX=       8223.62146879497, 454613344,    0
$$ Real data points
##PAGE= N=1
##DATA TABLE= (X++(R..R)), XYDATA
$$ [...]
64444 76886 76758 76655 76675 77043 77641 77931 77685 77362 77446 77836 78229 78627 78967 78780 77844 76826 76594 77152 77783
64425 77783 77982 77650 76737 75372 74096 73299 72722 72165 72303 73909 76543 78911 80394 81333 81948 82029 81710
64408 81710 81566 81745 81812 81615 81526 81644 81537 80920 79985 78947 77937 77341 77466 77815 77521 76530 75536 74715 73547
64389 73547 72056 71189 71564 72730 74047 75451 76913 77994 78441 78573 78643 78510 78252 78357 78856 79050 78576
64372 78576 77974 77700 77363 76602 75962 76127 76883 77670 78655 80390 82628 84297 84641 83862 82733 81980 81935 82349
64354 82349 82619 82419 82030 81854 81912 81995 81999 81854 81459 80962 80850 81435 82437 83244 83438 83024 82444 82355 83059 84098
64334 84098 84792 85147 85761 86877 88073 88910 89242 88875 87668 86181 85431 85765 86654 87829 89781 92782 96239
64317 96239 99536 102650 105394 106842 106418 105016 104162 104328 104771 104742 104120 103104 102001 101341 101612 102743 104156
64300 104156 105310 106034 106464 106858 107338 107720 107849 108084 108989 110424 111511 111831 112130 113433 115846 118663 121283
64283 121283 123575 125637 127691 130073 132960 136160 139373 142486 145505 148368 150929 152906 153918 153882 153277
64268 153277 152587 151548 149556 146739 143901 141414 139018 136747 135076 133879 132337 130431 129480 130421 132273
64253 132273 133144 132179 129842 126894 124004 121877 120863 120587 120594 121048 122259 123863 125242 126487 128245 130705
64237 130705 133314 135432 136886 138022 139553 142131 145750 149805 153932 158343 163063 167431 170842 173490
64223 173490 175848 177862 179164 179652 179336 178039 175783 173023 170034 166545 162548 158912 156464 154909 153305
64208 153305 151177 148506 145185 141406 138187 136566 136430 136936 137812 139338 141308 143039 144458 146242 148744
64193 148744 151503 154005 156197 158060 159321 159857 159931 159780 159382 158770 158240 158054 158164 158293 158143 157593 156862
64176 156862 156383 156315 156359 156208 155923 155687 155527 155569 156214 157672 159615 161643 163777 166194 168862 171819 175344
64159 175344 179451 183710 188038 193113 199394 206288 213044 220009 228185 237873 248652 260396 273284
64146 273284 286838 299854 311475 321660 330532 337813 343020 345723 345645 342911 338082 331573 323305 313433
64132 313433 302986 293033 283544 273965 264708 257057 251530 247228 242972 238332 233373 228234 223310 219236
64118 219236 216337 214456 213422 213197 213509 213887 214219 214812 215834 217168 218858 221110 223774 226394 228936
64103 228936 231882 235408 239068 242579 246406 251229 257175 263927 271277 279338 288430 298901 310826 323739
64089 323739 336894 349858 362591 374869 385991 395186 402047 406489 408580 408609 407026 404126 399862
64076 399862 394059 386676 377838 367823 357165 346651 337161 329325 323176 318079 313298 308803 305294
64063 305294 303203 301943 300519 298684 297183 296901 298077 300282 302909 305673 308810 312821 318022 324436
64049 324436 332022 340688 350098 359871 370073 381131 393194 406011 419462 433660 448400 463210
64037 463210 478183 494004 510702 527035 541551 553712 563596 571313 577263 582244 586652 590159 592785
64024 592785 595528 599223 603506 607720 612056 616823 621330 624651 626928 628724 629586 628555 625788 622370
64010 622370 618720 614502 609980 606121 603217 600657 598306 597022 597552 599898 603979 609956 617687 626713
63996 626713 637023 649032 662641 677209 692618 709543 728485 749373 772300 797794 826105
63985 826105 856959 890198 925917 963872 1003655 1045656 1091010 1140294 1193108 1249189 1309089
63974 1309089 1373475 1442565 1516640 1596441 1682753 1776312 1878493 1991401 2117080 2257354
63964 2257354 2414855 2593530 2797792 3031889 3300562 3609855 3966957 4379762 4856633
63955 4856633 5405566 6032454 6739783 7526524 8388506 9318917 10309471 11351637 12436096
63946 12436096 13550221 14675846 15789048 16861447 17862295 18761618 19533918 20160541
63938 20160541 20629636 20934541 21071663 21038394 20832273 20452699 19904286 19199223 18357443
63929 18357443 17405339 16373281 15291598 14186528 13078830 11985275 10920541 9897985
63921 9897985 8929965 8027762 7200217 6451851 5782691 5189880 4668805 4213205 3815913
63912 3815913 3470363 3170882 2911662 2686673 2490885 2320469 2171580 2040210 1923582
63903 1923582 1820366 1728860 1646225 1570178 1500217 1436293 1377378 1322265 1270669 1222410 1176322
63892 1176322 1131042 1086230 1042085 998324 954654 911670 870274 830681 792807 757110 724039
63881 724039 693074 663248 634388 607117 581978 559221 538964 520830 503825 487400 472221
63870 472221 459146 447830 437112 426462 416247 406891 398555 391385 385330 379888 374715 370229 367001
63857 367001 364881 363414 362771 363471 365393 367860 370589 373878 377905 382422 387076 391475 395095 397640 399381
63842 399381 400672 401302 400658 398222 393448 385696 375036 362832 350736 339206 327644 315834 304420
63829 304420 293927 284037 274072 263751 253306 243255 234208 226663 220779 216300 212594 208845 204587
63816 204587 200142 196192 192784 189260 185353 181712 178987 176909 174763 172311 169763 167343 165390 164437
63802 164437 164524 164734 164038 162402 160633 159346 158598 158279 158309 158513 158657 158540 157979 157008 156161 156086 156615 156751 155836
63783 155836 154233 152595 151120 149804 148659 147286 145023 142048 139547 138214 137431 136604 136293 136975 137576
63768 137576 136595 134239 132211 131544 131792 132207 132589 132905 132969 132705 132144 131225 130088 129343 129457 130165 131095 132527
63750 132527 134769 137232 139089 140515 142258 144232 145660 146536 147821 150077 152899 155890 159300 163425
63736 163425 168149 173344 179117 185437 192113 199231 207074 215552 224350 233659 244096 255732 267809
63723 267809 279501 290334 299687 306515 309925 309742 306357 300403 292615 283684 274169 264743 256287 249300
63709 249300 243342 237527 231513 225601 220065 214866 209927 205188 200494 195813 191386 187319 183321 179242
63695 179242 175484 172344 169450 166483 163985 162617 162045 161559 161484 162893 166045 170201 174901 180320 186293
63680 186293 192120 197674 203725 210820 218715 227250 236893 247998 260186 272889 285725 297895 307914
63667 307914 314619 318026 318681 316519 310897 301575 289335 275705 262197 249592 237832 226725 216637
63654 216637 208199 201447 195704 190351 185267 180587 176477 173216 171027 169802 169315 169650 170929 172737 174372
63639 174372 175670 177002 178520 180069 181905 184799 189133 194407 199938 205644 211888 218896 226549 234574
63625 234574 242876 251834 262149 274180 287696 302536 319122 337746 357805 378529 400182 423601
63613 423601 448580 473598 497212 518796 537695 552592 562221 566230 565117 559940 552305 543992 536147
63600 536147 529111 523100 518458 515058 512016 508287 503105 495775 485695 472968 458607 443798 429274
63587 429274 415394 402306 389793 377464 365401 354273 344610 336292 328874 322068 315795 310112 305182
63574 305182 301075 297621 294814 293179 293224 294649 296683 299176 302713 307726 314207 322300 332314 343941
63560 343941 356290 369102 383268 399800 418868 440250 464041 490335 518553 547540 576009
63549 576009 602546 625503 643433 655705 662662 665443 665755 665405 665701 667288 670548 675885 683526 693129
63535 693129 703539 712841 718929 720402 716853 708172 694038 674465 650401 623121 593388 561847
63523 561847 529834 498896 469695 442140 416365 392667 370778 350325 331982 316941 305124
63512 305124 295012 285522 276914 269553 262994 256924 251971 248733 246751 245150 243748 242844 242384 241991 241546
63497 241546 241313 241767 243532 247042 251988 257494 263139 269397 276947 286067 296855 309397 323449 338454
63483 338454 354074 370152 386071 400807 413779 424872 433434 438124 438236 434457 427918 419167 408458
63470 408458 396302 383256 369790 356762 345336 335916 327781 320269 313745 308924 305838 303952 302676
63457 302676 301257 298855 295446 292169 290144 289234 288441 287107 285316 283505 282202 281843 282491 284001 286545
63442 286545 290505 295835 302250 310192 320645 333567 347503 361361 375754 391837 409658 428557
63430 428557 448537 470218 493762 518751 544993 572765 602366 633899 667192 701465 735257
63419 735257 766865 794422 815476 827632 830477 826251 817832 806596 792960 778184 764284 752299
63407 752299 741717 731621 721486 710707 698178 682777 664017 642217 618338 593505 568343
63396 568343 542831 517062 491890 468499 447543 429050 412921 399081 387310 377274 368685 361336
63384 361336 355207 350639 348099 347632 348904 351797 356488 362897 370672 379773 390376 402124 414405 427610
63370 427610 443044 461116 480701 501006 523033 548264 576691 607164 638952 671837 705029
63359 705029 736948 765829 789827 807057 816513 818747 815019 806273 793617 779101 764855 751743
63347 751743 739749 729226 720619 713225 705380 695913 684467 670592 653631 633676 611746 588803
63335 588803 565300 541707 518667 496458 474967 454354 435136 417504 401171 386055 372609
63324 372609 361282 352022 344410 337977 332342 327278 322661 318327 314282 311151 309907 310782 312917 315419
63310 315419 318181 321206 323889 325693 326945 328046 328405 327127 324456 321564 319084 316702 313989 310804
63296 310804 307025 302816 299039 296569 295245 294209 293158 292455 292205 292117 292192 292648 293181 293211 292925 293178 294226
63279 294226 295345 295874 295932 295991 296377 297311 298777 300283 301357 302303 303820 305890 307773 309103 310228 311406
63263 311406 312500 313657 315475 318122 320940 323246 325128 327190 329951 333611 337977 342450 346548 350543
63249 350543 355249 361133 368019 375577 383613 391938 400480 409572 419670 430843 443077 456936 473217
63236 473217 491824 511557 531255 550810 571071 593165 617870 645140 674119 703820 733651
63225 733651 763096 791373 818021 843484 868365 892316 914421 934598 953895 973420 993627
63214 993627 1014522 1035859 1057090 1077596 1096821 1113593 1125734 1131194 1129433 1120952 1105810 1083637
63202 1083637 1055000 1021630 985157 946572 906969 867802 830124 794450 761521 732328 707168
63191 707168 685513 667095 652305 641366 633970 629943 629401 631951 636654 643102 651685 662416 674406
63178 674406 686933 700195 714519 729610 745125 761225 777933 794636 810940 827471 845066
63167 845066 863406 881015 896386 908789 918220 924999 929207 930355 927768 921302 911268 897686 880264
63154 880264 859262 835806 811113 785996 761230 737680 715670 694798 674719 655650 637926
63143 637926 621699 607371 595572 586263 578440 571232 564804 559698 555812 552594 549866 547877 546734
63130 546734 546275 546351 546911 547932 549479 551631 554172 556581 558510 560091 561685 563584 566015 569065 572492
63115 572492 575917 579246 582685 586360 590330 594817 599980 605473 610738 615679 620543 625187 629125 632290
63101 632290 635150 638026 640901 643850 646950 649781 651761 653047 654344 655780 656737 656900 656615 656114 655342
63086 655342 654744 655218 656935 659095 661216 663757 667106 670935 675106 680246 686796 694307 702332 711213 721298
63071 721298 732163 743415 755621 769545 784966 801026 817412 834527 852829 872570 893784
63060 893784 916079 938923 962657 988674 1018081 1050781 1086404 1125368 1168156 1214173 1262414
63049 1262414 1312857 1366149 1422050 1479245 1536746 1594572 1652781 1710518 1766394 1819475 1869773
63038 1869773 1918054 1965305 2012214 2059066 2106084 2153650 2202117 2251621 2302030 2352538 2401088
63027 2401088 2444673 2480537 2506803 2521828 2523673 2510851 2483347 2442535 2390274 2328342 2258322
63016 2258322 2181709 2100366 2017070 1935079 1856793 1783213 1714893 1652826 1597952 1550389 1509803
63005 1509803 1476239 1450042 1431181 1419096 1413011 1412112 1415706 1423497 1435465 1451239 1469985 1491022
62993 1491022 1514059 1538570 1563530 1588140 1612285 1635988 1658973 1681070 1702376 1722621 1741032
62982 1741032 1757198 1771218 1782377 1788545 1787741 1779633 1764641 1742283 1711637 1673051 1628254 1578830
62970 1578830 1525560 1469268 1411385 1353440 1296550 1241528 1188986 1139300 1092861 1050289 1011976
62959 1011976 977613 946586 918702 893991 872052 852197 834206 818399 804905 793266 782807
62948 782807 773145 764329 756656 750237 744626 739057 733128 726901 720314 713090 705435 698143 691575 685146
62934 685146 678266 671125 663974 656333 647807 639213 631999 626673 622520 618620 614505 610045 605423 601099
62920 601099 597282 593610 589843 586508 584278 583040 582203 581510 580822 579523 577088 574025 571366 569307 567261
62905 567261 565161 563697 563165 562966 562587 562328 562723 563797 565268 566965 568678 569906 570177 569586 568766 568261
62889 568261 567824 566406 563120 558284 553180 548698 544754 541204 538619 537480 537193 536656 535525 534248 533157
62874 533157 532291 531916 532415 533652 535097 536581 538363 540435 542291 543408 543560 542759 541360 540082 539420 539053
62858 539053 538226 536621 534517 532306 530251 528443 526591 524187 521349 519080 518086 517751 517020 515903 515248
62843 515248 515351 515785 516517 518111 520628 523151 524696 525005 524341 523220 522475 522867 524264 525667 526285 526227 526068
62826 526068 526236 526918 528074 529323 530135 530257 529746 528709 527457 526728 527192 528670 530313 531542 532309 532513
62810 532513 531885 530653 529791 530236 532125 534895 537923 540991 544453 548968 554843 561655 568708 575782 583220
62795 583220 591499 601023 612106 624773 638745 653929 670695 689376 709834 731994 756409 783751
62783 783751 814048 847091 883348 923826 969184 1019616 1075461 1137214 1205007 1278697 1358391
62772 1358391 1444255 1535868 1632324 1732740 1835871 1939191 2039135 2132404 2216590 2289581 2349099
62761 2349099 2393045 2419806 2428133 2417274 2387505 2340311 2278035 2203477 2119488 2028458 1932264
62750 1932264 1832956 1733056 1634675 1538799 1446047 1357613 1274633 1197079 1124386 1056935 995814
62739 995814 941054 891206 844922 802133 763405 728865 698038 670164 644511 620886 599834
62728 599834 581816 566345 552540 540311 530117 521721 514159 506967 500470 494815 489712 485311 482314
62715 482314 480867 480265 480166 481290 484501 489820 496692 504560 512999 521989 532345 545150 560528 577722
62701 577722 596601 618129 642983 670630 700420 732837 768944 809145 853087 900368 950782
62690 950782 1004124 1060102 1118070 1176609 1233856 1288469 1339705 1386312 1426088 1457113 1478790
62679 1478790 1491135 1493597 1485310 1466222 1437281 1399667 1354402 1302708 1246323 1187293 1127520 1068433
62667 1068433 1010952 955761 903510 854571 808827 766110 726747 691237 659415 630453 603723
62656 603723 579169 556838 536621 518576 502964 489694 478101 467340 456732 445895 435022
62645 435022 424926 416208 408405 400560 392596 385363 379349 374098 369018 363974 358889 353609 348484 344355
62631 344355 341533 339300 336771 333828 330989 328788 327477 326885 326445 325739 325059 325019 325753 327031 328933 331631
62615 331631 334742 337814 341332 346138 351849 357066 361384 365978 371789 378299 384743 391518 399652 409656
62601 409656 421538 435240 450382 466300 482923 501121 521710 544734 570141 598479 630431
62590 630431 666297 706279 750504 798317 848404 900118 953752 1008788 1062670 1112133 1155088
62579 1155088 1190533 1217512 1235263 1243887 1243861 1235076 1217175 1190665 1157100 1118361 1076231 1032280
62567 1032280 987579 942671 898164 854947 813567 774006 736599 702518 672646 646376 622174
62556 622174 599049 576997 556415 537626 520663 505037 490022 475454 461760 448946 436278
62545 436278 423436 411223 400425 390599 380774 370893 361783 354059 347743 342684 338689 335472 332946
62532 332946 331337 330683 330666 331285 333098 336261 339971 343480 347072 351406 356482 362047 368527 376611 386216
62517 386216 396604 407360 418684 430988 444811 460836 479438 500439 523715 549610 578306
62506 578306 609257 641769 675556 710133 744212 776434 806193 833015 855640 872475 882579
62495 882579 885598 881337 870243 853762 833265 809091 781571 752460 724055 697047 670410 643459
62483 643459 616975 592160 569461 548725 529785 512584 497229 484092 473475 465077 458164 452274
62471 452274 447444 443833 441456 440221 439976 440624 442345 445315 449082 452734 455979 459481 463796 468699 473992
62456 473992 480114 487211 494454 501234 508402 517215 527573 538295 548794 559360 570065 580450 590168
62443 590168 598960 606097 610717 612615 611886 608029 600315 588986 575227 560079 544156 528194 512807
62430 512807 497767 482499 467367 453625 442045 432370 424122 417118 411163 406059 402007 399344 397907
62417 397907 397331 397792 399618 402322 405021 407828 411866 417719 424755 432112 439619 447565 456302 466131 476846
62402 476846 487394 496751 505119 513394 521503 528339 533399 537290 540268 541462 540165 536917 532567 527038
62388 527038 519834 511295 502560 494593 487831 482493 478565 475575 472896 470429 468782 468813 471082 475686 482479
62373 482479 491408 502611 516176 532069 550450 571868 596883 625715 658459 695355 736521 781675
62361 781675 830467 882829 938658 997418 1058341 1120528 1182370 1241276 1294490 1339895 1375686
62350 1375686 1400054 1412138 1412947 1404558 1388604 1366123 1338270 1306113 1269967 1229866 1186580 1141433
62338 1141433 1095414 1049340 1004525 962302 923103 886954 854480 826220 801158 777273 753594
62327 753594 730619 708803 687976 668376 650822 635437 621312 607931 595949 586210 578900 573939
62315 573939 571193 569997 569463 569539 570746 572602 573554 572905 571590 570371 568465 564788 559516 553475 546844
62300 546844 539448 531677 524155 516922 509777 503038 497223 492350 488186 484832 482470 480868 479693 479015
62286 479015 479069 479912 481780 485263 490569 496942 503417 509843 516712 524316 532651 541863 552182 563482
62272 563482 575383 587736 600686 614395 629005 644782 662134 681605 703920 729795 759562
62261 759562 793200 830705 872043 916861 964826 1016235 1071441 1129268 1186613 1240020 1287140
62250 1287140 1326363 1355871 1374020 1380418 1376104 1362778 1342256 1316224 1285677 1250490 1210063 1164694
62238 1164694 1116175 1066968 1018867 972503 928080 886397 848847 816286 788282 763890 742924
62227 742924 725934 713056 703500 696219 690522 685940 682104 678998 676863 675608 674640 673442 671975 670470
62213 670470 669169 668391 668391 669048 669942 670795 671548 672116 672533 673258 674863 677487 681050 685868 692413 700543 709671
62196 709671 719763 731548 745656 762077 780502 800683 822538 846503 873606 904352 937478
62185 937478 970520 1001525 1029478 1053311 1071838 1084944 1093804 1099497 1102341 1102934 1102836 1103630 1106081 1110746
62171 1110746 1118667 1130914 1147973 1170025 1197150 1228849 1263923 1301202 1339679 1377580 1412054
62160 1412054 1440444 1461521 1475349 1482723 1485105 1484234 1481053 1475393 1466989 1456202 1443378 1428252 1410597
62147 1410597 1391038 1370819 1351245 1333591 1318868 1307296 1298457 1292153 1288441 1286765 1285972 1285514 1285660
62134 1285660 1286211 1286160 1285251 1284790 1286107 1289116 1293206 1298608 1305831 1314488 1323785 1333715 1344890 1357585 1371793
62119 1371793 1387726 1405377 1424004 1442939 1462613 1483886 1506607 1529680 1552419 1575094 1598207
62108 1598207 1621849 1645873 1670288 1695495 1722237 1750971 1781209 1812008 1843399 1876656 1912778
62097 1912778 1951449 1992000 2034533 2079172 2124663 2168607 2209007 2245276 2278319 2310287 2343796
62086 2343796 2380705 2421687 2467001 2516677 2569397 2622150 2672149 2718745 2762836 2805070 2845495
62075 2845495 2884355 2922068 2958680 2994277 3029751 3066300 3104351 3143712 3184497 3227068 3271247
62064 3271247 3316375 3362007 3407692 3452098 3493078 3528734 3558158 3581448 3599596 3614046 3625660
62053 3625660 3634123 3638710 3639225 3635775 3628177 3616419 3601325 3583940 3564560 3543154 3520492 3497929
62041 3497929 3476178 3455141 3434927 3416205 3399415 3384269 3370178 3356703 3343589 3330868 3318994
62030 3318994 3308476 3299280 3290804 3282347 3273446 3264067 3254770 3246380 3239124 3232388 3225634 3219163 3213652 3209316
62016 3209316 3205961 3203464 3201796 3200922 3201048 3202528 3205216 3208464 3212084 3216659 3222515 3229109 3235999 3243640
62002 3243640 3252589 3262627 3273347 3284765 3296481 3306924 3314324 3317787 3316568 3309068 3293755 3270530
61990 3270530 3240143 3202942 3159479 3111904 3063267 3015468 2968916 2923826 2880582 2838953 2798273
61979 2798273 2758514 2720223 2683491 2648033 2614175 2582617 2553249 2525247 2498361 2472999 2449057
61968 2449057 2425796 2403026 2381282 2360706 2340820 2321650 2303942 2287901 2272673 2257506 2242660
61957 2242660 2228784 2216058 2204276 2193105 2182108 2171194 2161243 2153495 2148070 2143728 2139367 2135175
61945 2135175 2132162 2131204 2132667 2136260 2141013 2146032 2151482 2158322 2167029 2177240 2188711 2201776 2216646
61932 2216646 2233056 2251029 2271246 2294196 2319425 2346211 2374623 2405533 2439802 2477934 2520448
61921 2520448 2568320 2622904 2685462 2756958 2838502 2931902 3039284 3162171 3301629 3459594
61911 3459594 3639303 3843998 4076009 4337853 4633582 4968191 5346372 5772767 6252806
61902 6252806 6791922 7393769 8059395 8786367 9565683 10377709 11190641 11962155 12642568
61893 12642568 13179836 13528121 13657763 13561249 13252736 12763573 12136188 11416641 10647254
61884 10647254 9862541 9089141 8346869 7648896 7002306 6410076 5872961 5389998 4958505
61875 4958505 4574608 4233780 3931134 3662042 3422793 3210248 3020966 2851525 2699714
61866 2699714 2564488 2444517 2337603 2241752 2155946 2079548 2011711 1951745 1899362 1854205 1815672
61855 1815672 1783436 1757494 1737480 1722454 1711491 1703859 1698588 1694671 1691883 1690657 1690884 1691431 1691002
61842 1691002 1688887 1684843 1679025 1672252 1665595 1659486 1653779 1648717 1645113 1643525 1644041 1646948 1652667 1660753
61828 1660753 1669768 1678524 1686807 1694723 1701994 1708112 1712568 1714795 1714477 1712007 1708172 1703577 1699021 1695953
61814 1695953 1695457 1697027 1699583 1703569 1710734 1721952 1736819 1755528 1779338 1808620 1842114 1879017
61802 1879017 1920425 1967687 2020563 2078177 2140873 2209953 2286211 2369715 2460537 2558849 2664872
61791 2664872 2779520 2904702 3042326 3193468 3359139 3541417 3743290 3967853 4218162
61782 4218162 4497379 4808614 5155267 5542192 5976148 6464762 7015543 7636282 8335697
61773 8335697 9123037 10007265 10996498 12096701 13308971 14626319 16030403 17487294 18943116
61764 18943116 20323345 21538790 22497452 23119379 23351554 23178590 22624523 21744988 20614590
61755 20614590 19314680 17923113 16506236 15114777 13784451 12538783 11391334 10347377
61747 10347377 9406156 8563113 7811121 7141512 6545641 6015896 5545289 5126858 4754179
61738 4754179 4422055 4126157 3862292 3626417 3415053 3225394 3055253 2902913 2766569
61729 2766569 2643949 2533056 2433117 2343822 2263690 2190243 2121871 2058257 1998858 1942399 1888304
61718 1888304 1837048 1788396 1740878 1693955 1649335 1608845 1572128 1537620 1504768 1473982 1445339
61707 1445339 1418703 1394450 1372749 1352660 1333130 1314292 1296703 1279935 1263197 1246802 1231637
61696 1231637 1217497 1203216 1188268 1173145 1158357 1144101 1130748 1118620 1107345 1096271 1085350
61685 1085350 1074895 1064798 1054755 1044925 1035541 1026278 1016884 1007971 1000212 993147 985862 978508 972045
61672 972045 966626 961389 955851 950457 945675 941368 937155 932649 927347 920949 913809 906528 899247 891873
61658 891873 884710 878202 872350 867046 862677 859703 857971 857196 857727 859938 863131 866008 868137 870130 872461
61643 872461 874922 877111 878718 879487 879673 880360 882519 885850 889308 892584 896255 900665 905605 911140 917826
61628 917826 925893 934835 943887 952345 959449 964529 967339 967797 965606 960665 953632 945414 936240 925925
61614 925925 914856 903986 893811 883943 873751 862990 851955 841429 832261 824491 817133 809287
61602 809287 801138 793374 786134 779173 772610 766699 761226 755970 751546 748966 748476 749505 751521 754228
61588 754228 757243 760354 763939 768482 773952 780276 787935 797242 807460 817669 828216 840294 854294
61575 854294 869586 885752 903042 921734 942056 964659 990147 1018104 1047455 1077719 1109003
61564 1109003 1140901 1172451 1203214 1233346 1262610 1290344 1316538 1341906 1366692 1390392 1412846
61553 1412846 1434579 1455724 1475527 1493403 1509758 1525291 1540038 1553325 1564116 1571171 1573484 1570957
61541 1570957 1564335 1554441 1541807 1526971 1510514 1492789 1474123 1455202 1436739 1418929 1401888 1386401
61529 1386401 1373398 1362827 1353960 1346895 1342814 1342657 1346340 1353501 1364195 1378619 1396897 1419472 1447165
61516 1447165 1480573 1519883 1565380 1617638 1677174 1744500 1820592 1906807 2004228 2113646 2236204
61505 2236204 2373535 2527189 2698373 2888240 3097841 3327632 3577150 3844575 4125675
61496 4125675 4412988 4696319 4963820 5202501 5399116 5542799 5627897 5654217 5624979 5545338
61486 5545338 5422393 5264995 5082588 4884257 4678434 4472366 4271450 4079406 3898949
61477 3898949 3731938 3579350 3442003 3321070 3217157 3129244 3055496 2994879 2947162 2911894
61467 2911894 2888571 2877392 2878430 2890245 2910710 2939071 2975663 3019592 3068364 3120130 3174689
61456 3174689 3231743 3289658 3346610 3401699 3454244 3503242 3548461 3591104 3632584 3673457 3714228
61445 3714228 3756296 3801156 3849180 3899810 3952412 4006342 4060731 4114708 4167477 4217882 4264466
61434 4264466 4306212 4342638 4372969 4395921 4410512 4416400 4413248 4400604 4378707 4348625 4311367 4267740
61422 4267740 4219358 4168789 4118121 4068108 4019174 3972496 3929591 3891510 3858882 3832150 3811339
61411 3811339 3796134 3786412 3782094 3782345 3785650 3790782 3796874 3802494 3805723 3805448 3801498 3793232 3779289 3759420
61397 3759420 3735582 3710516 3686168 3664110 3646547 3635941 3634168 3642691 3663097 3696983 3745871 3811582
61385 3811582 3896025 4000305 4124773 4270275 4438521 4630810 4847259 5087485 5350779 5634739
61375 5634739 5934385 6242939 6552322 6852159 7129464 7370736 7564573 7702811 7781056 7799641
61365 7799641 7763417 7679329 7554037 7393559 7203629 6989143 6753868 6501695 6237734 5967607
61355 5967607 5696269 5428053 5166897 4915555 4675222 4446747 4231725 4031733 3847273
61346 3847273 3678233 3524701 3386487 3262540 3151771 3053978 2969264 2897253 2837691 2790996
61336 2790996 2757170 2734722 2721782 2717831 2723360 2738211 2761246 2791338 2827698 2869380 2915360 2965027
61324 2965027 3017877 3072771 3127968 3181817 3233073 3280955 3325232 3365943 3402818 3435583 3464981
61313 3464981 3492533 3518873 3543331 3565667 3586977 3607891 3626981 3642056 3652142 3657034 3655801 3647292
61301 3647292 3631642 3609894 3582376 3548714 3509228 3465120 3417317 3366039 3311371 3253485 3192599
61290 3192599 3129629 3066593 3005529 2947282 2892107 2840945 2795065 2754860 2720064 2690912 2667980
61279 2667980 2651029 2638890 2630330 2624154 2618744 2612547 2605041 2596479 2586870 2575920 2563653 2550269 2535720
61266 2535720 2520235 2504913 2490983 2478906 2469029 2462487 2460256 2461792 2465923 2472908 2484544 2502614
61254 2502614 2528602 2564655 2613239 2675532 2751177 2839663 2940914 3054536 3179564 3314789
61244 3314789 3457953 3604351 3747168 3879178 3993030 4080265 4132121 4142512 4109820 4036038
61234 4036038 3925613 3785461 3624460 3451546 3274285 3098985 2930727 2772512 2625233
61225 2625233 2489126 2364676 2251892 2149822 2057577 1975215 1902985 1840252 1785671 1737905
61215 1737905 1695701 1657787 1623335 1592337 1565232 1542405 1524114 1510435 1501079 1495634 1494069 1496533
61203 1496533 1502678 1511849 1523979 1539583 1558604 1579904 1602041 1623894 1644294 1661813 1675405 1684893
61191 1684893 1690582 1692837 1692155 1689009 1683338 1674611 1662584 1647579 1630012 1610249 1588888 1566446 1542642
61178 1542642 1516876 1489686 1462845 1437515 1413075 1388289 1362928 1337532 1312150 1286222 1259532
61167 1259532 1232578 1205917 1179578 1153144 1126160 1098450 1070268 1042241 1015167 989866 966951
61156 966951 946482 927996 911189 896344 883591 871893 859367 844739 827983 809606 789949
61145 789949 769437 748953 729548 711952 696449 682998 671381 661417 653040 646064 640153 635327
61133 635327 632188 631246 632323 635058 639546 645806 653063 660411 667968 676512 686232 696780 708290 721104
61119 721104 734501 746892 757614 767511 777560 787985 798981 811071 824128 837007 848847 859907
61107 859907 870530 880063 887478 892431 895003 894976 892091 886702 879695 871958 864120 856282 847851 838217
61093 838217 827813 817801 808570 799372 789693 779936 770329 760212 749078 737387 725631 713512
61081 713512 700884 688614 677550 667405 657622 648600 640998 634424 628092 622332 618250 616044 614790
61068 614790 613816 613332 613652 614630 615928 617223 618270 619333 621241 624329 627624 629864 631043 632155 633730
61053 633730 635543 637468 639645 641909 644027 646382 649487 652952 655966 658753 662471 667587 673347 679008
61039 679008 684672 690808 697884 706509 717006 728705 740608 752781 766081 780548 795293 810102
61027 810102 825791 842672 859914 876759 893127 908749 923199 937231 952437 968898 984794
61016 984794 999244 1013884 1030577 1049276 1069516 1092403 1119425 1150539 1185161 1223868 1267325
61005 1267325 1314581 1364081 1415307 1467886 1520647 1573913 1631488 1697905 1774778 1862363 1963233
60994 1963233 2080872 2215338 2363774 2524894 2700018 2891141 3102916 3346507 3636570
60985 3636570 3984052 4396686 4886376 5470265 6166035 6997174 8007201 9260387 10826277
60976 10826277 12774595 15176829 18054731 21254441 24359924 26804473 28167455 28421986
60968 28421986 27915079 27127620 26460782 26190856 26487500 27341211 28447266 29245851 29187417
60959 29187417 28032387 25936086 23283205 20457170 17722026 15226741 13041692 11178505
60951 11178505 9609117 8294305 7201055 6299054 5555218 4939659 4431469 4013735 3667430
60942 3667430 3374438 3122733 2904500 2712086 2539266 2383545 2243478 2115600 1996781
60933 1996781 1887262 1788350 1699076 1617882 1545264 1481343 1422479 1363716 1303583 1243683 1184953
60922 1184953 1127469 1072902 1023679 979921 939844 902876 869818 840325 812837 786906 763364
60911 763364 742309 723132 706291 692830 682129 672145 661882 651848 642299 632980 624436 617631
60899 617631 612228 607039 602044 598305 596097 594908 595018 597192 600989 605163 609578 614882 620586 625540
60885 625540 630135 635880 642746 649062 654101 658673 662901 665561 666100 665375 663874 661038 656799 652055 647098
60870 647098 641232 634362 627290 620104 612016 603277 595551 589819 585518 582180 580221 579557 579176 578774 579295
60855 579295 581174 583557 585898 588928 593446 599547 607491 617750 629710 641926 654307 668542 685678
60842 685678 704800 724595 744412 762965 777932 788247 795576 802438 809971 818235 827204 836236 843767
60829 843767 848759 851645 853171 853368 852400 851177 850214 848940 846975 844966 843376 841624 839323 837183 835680
60814 835680 833922 830840 826534 821496 815492 808217 800126 791640 782388 772120 761523 751284 741194
60801 741194 731030 721509 713467 706888 701418 697023 693398 689759 686078 683648 683583 685526 688590 692690
60787 692690 698133 704816 712604 721706 731928 742403 752766 763694 775605 787851 799970 812616
60775 812616 826246 839895 852318 863574 874458 885058 894814 903391 910762 917031 922768 928728 934671
60762 934671 939402 942560 945271 948306 950804 951753 951618 951404 951089 950064 948326 946214 943735 941045 938821
60747 938821 937374 936228 935236 934995 935377 934850 932291 928288 923658 917982 910841 903272 896495 890253 883812
60732 883812 877594 872317 867432 862094 856928 853235 851024 849385 848273 848297 849152 849810 850078 850582 851435 852233
60716 852233 853123 854621 856461 857696 857817 856857 854700 851208 846779 841923 836668 831058 825658 820734 815703
60701 815703 810331 805655 802628 800612 798487 796483 795490 795139 794065 791742 788750 785463 781632 776909 770736
60686 770736 762208 751249 739414 728284 717582 706239 694727 684698 676550 668975 661030 653245
60674 653245 646451 640709 635724 631485 628294 626700 627245 629745 633102 636385 639615 642976 646148 649212
60660 649212 653198 658578 664021 667938 670491 672806 674991 676498 677793 680005 683242 686783 690634 695367
60646 695367 700709 705757 710369 714932 719037 721910 723990 726602 730163 734169 738778 744840 752308 760066
60632 760066 767551 775352 784142 794108 805324 817567 829950 841902 854213 867783 881760 894412
60620 894412 905588 916590 927701 937619 945453 951528 955880 957666 956683 954099 951097 947887 944500 941457
60606 941457 939190 937723 937196 937714 938432 937694 934326 928122 919179 907752 894685 880927 866687 852054
60592 852054 838185 826610 817505 809980 803984 800441 799482 800044 801497 804187 808059 812065 815418 818250
60578 818250 820672 822324 823202 823840 824352 824299 823844 824014 825510 828159 831652 835861 840311 844368 848065 851798
60562 851798 855255 857665 858971 859530 858805 855815 850930 845737 840987 836142 831157 827112 824595 822947 821771
60547 821771 821908 824274 828879 835567 844687 856492 870860 888158 909511 935902 967846 1006013 1050925
60534 1050925 1101559 1155200 1208829 1259507 1303371 1335865 1353778 1356222 1343586 1317153 1280303
60523 1280303 1238505 1196862 1158214 1123965 1095542 1074183 1060221 1053377 1053128 1058244 1066741 1076918
60511 1076918 1088001 1099529 1110843 1121482 1131405 1140640 1149439 1158867 1170466 1185334 1204285 1228703
60499 1228703 1260093 1298896 1344999 1399413 1464182 1540604 1628928 1729775 1844208 1972104 2112138
60488 2112138 2264095 2430053 2613268 2817791 3049920 3318289 3631217 3994133 4408286
60479 4408286 4867722 5354107 5834959 6269331 6617180 6846034 6933909 6871348 6663564 6330780
60469 6330780 5905328 5425501 4927761 4440577 3982687 3564834 3191601 2862569 2574479
60460 2574479 2323930 2107932 1922576 1763071 1625555 1507473 1405932 1317344 1239219 1170817
60450 1170817 1111386 1059186 1012894 972510 938090 908807 883827 862703 844257 826543 808692
60439 808692 791486 775447 759841 744286 729741 716862 704863 693068 682242 673214 665463 658179
60427 658179 651599 646181 641522 637163 633389 630265 626996 623298 620287 618968 618884 619292 620512 622971 625961
60412 625961 628544 630838 633367 636024 638631 641566 644924 648060 650879 654373 658822 662757 665006 666619
60398 666619 669356 673228 677092 680845 685448 691211 697407 703336 708751 713592 718157 723094 728431 733109
60384 733109 736100 737392 737326 735839 733052 729775 726668 723639 720524 717487 714388 710966 708071 707251 708441
60369 708441 709628 709554 709172 709572 710301 710901 712206 714582 716624 717342 718104 720553 724042 727073 730041 734475
60353 734475 740541 747320 754635 762620 770404 777320 784690 794272 805461 816075 825500 835032 845433
60340 845433 856109 866539 876616 885612 892527 897540 901718 905433 908555 911964 917346 925544 936514
60327 936514 950681 968845 990678 1014489 1038301 1060037 1077116 1087409 1090589 1087390 1077882 1061785
60315 1061785 1040191 1015582 990218 965553 942833 922885 905482 890076 876922 866464 858155
60304 858155 851094 845375 841515 839079 837149 835652 834871 834247 833141 832209 832505 833753 835021 836502 838862
60289 838862 841403 842819 843409 844605 846591 848401 850224 853401 857920 862006 864650 866735 869185 871719
60275 871719 874001 876437 879179 881724 884182 887755 893346 900593 908630 916933 925303 934048 944289 957057
60261 957057 972049 988276 1005797 1025508 1047378 1070425 1094684 1121800 1153293 1189339 1229484
60250 1229484 1273438 1320979 1372298 1428673 1491745 1561918 1638539 1721620 1812215 1910994 2017688
60239 2017688 2132048 2254001 2382472 2515169 2649862 2784765 2917445 3044431 3162420
60230 3162420 3269153 3363032 3442843 3507938 3557852 3591673 3608580 3608839 3593461 3563312 3519822
60219 3519822 3466268 3406847 3344481 3280803 3218174 3160081 3109345 3067336 3035268 3014861 3007337
60208 3007337 3012939 3031890 3064828 3112054 3173427 3249183 3339846 3445095 3563571 3693584 3832788
60197 3832788 3977208 4121926 4262860 4396685 4519240 4625734 4712982 4780046 4826385 4850745
60187 4850745 4852352 4831794 4790065 4727848 4646408 4548501 4438089 4319887 4199172 4080849 3968401
60176 3968401 3864463 3772262 3695278 3635452 3592978 3567916 3560829 3571762 3599978 3644893 3706025
60165 3706025 3781744 3869190 3965461 4067542 4171009 4270274 4360605 4438877 4502491 4549130 4577938
60154 4577938 4589575 4584796 4564236 4529763 4484646 4432154 4375346 4318296 4265850 4221692 4187988
60143 4187988 4167007 4161377 4172440 4200144 4245156 4309387 4393928 4498308 4622743 4769522 4941303
60132 4941303 5139448 5364868 5618904 5902275 6214257 6553592 6918730 7306189 7709946
60123 7709946 8123414 8540872 8956118 9361204 9747752 10108564 10437061 10726357 10970204
60114 10970204 11164125 11304727 11388787 11413905 11379240 11284752 11130707 10919075 10654981 10346179
60104 10346179 10001781 9631944 9247666 8859745 8478101 8112088 7770212 7458797 7181768
60095 7181768 6942171 6742875 6585369 6469223 6393614 6358316 6362363 6402779 6475471 6576408
60085 6576408 6701033 6843408 6996862 7154723 7309699 7453530 7578356 7678182 7748773 7787325
60075 7787325 7793153 7767924 7714279 7634521 7530827 7405684 7261402 7099863 6923294 6734586
60065 6734586 6536539 6331721 6123393 5915594 5711960 5515535 5329929 5159205 5005940
60056 5005940 4870655 4753730 4656585 4580401 4525228 4491268 4479592 4490444 4522257 4573664 4645390
60045 4645390 4738718 4852818 4984584 5130128 5285001 5443588 5599594 5747068 5880485 5994578
60035 5994578 6085058 6149154 6185029 6191381 6168024 6115939 6036303 5930408 5801040 5652825 5490675
60024 5490675 5319042 5143090 4968913 4801473 4643491 4497202 4365701 4251341 4154259 4074003
60014 4074003 4011573 3968346 3944060 3937604 3949241 3980530 4032459 4105010 4198279 4312848 4449160
60003 4449160 4607232 4786465 4984701 5197619 5419451 5643714 5862904 6068737 6254018
59994 6254018 6414044 6545869 6647179 6716482 6753221 6756632 6725322 6658903 6559236 6429470 6273099
59983 6273099 6095072 5902709 5704168 5506554 5316179 5139218 4980585 4842827 4727308
59974 4727308 4635714 4569349 4527880 4510132 4515435 4543098 4591364 4658174 4742197 4841887 4954245
59963 4954245 5075718 5203575 5335147 5466490 5593225 5712225 5821250 5917598 5998527 6062698
59953 6062698 6110223 6141833 6158973 6163920 6158638 6144164 6122303 6097169 6073853 6056358 6048109 6053707
59941 6053707 6078582 6127467 6204487 6314032 6459933 6644198 6868041 7133625 7443275 7797254
59931 7797254 8193702 8630114 9102863 9604795 10124311 10646476 11153730 11625769 12040604
59922 12040604 12376952 12616314 12744852 12755965 12651862 12441886 12139335 11760263 11323801
59913 11323801 10850825 10360908 9870444 9392735 8938176 8514152 8125835 7777281 7471136
59904 7471136 7207814 6986256 6805618 6665531 6565211 6503557 6480061 6494552 6545987 6632370
59894 6632370 6751737 6902364 7081902 7286719 7511560 7748918 7988874 8220169 8431235
59885 8431235 8610046 8744322 8823452 8840395 8791569 8676272 8497648 8263526 7984792 7672737
59875 7672737 7338258 6992135 6644117 6301775 5971233 5658444 5368350 5103192 4863075
59866 4863075 4648069 4458619 4294200 4152920 4032520 3930767 3845034 3772412 3710057 3654669
59856 3654669 3602199 3549260 3494679 3438846 3382072 3324719 3268432 3215977 3169835 3131674 3102655
59845 3102655 3083142 3072274 3068544 3070227 3074528 3077165 3074021 3062778 3042186 3010902 2968639 2917793
59833 2917793 2862385 2805589 2749369 2695766 2646967 2604403 2568984 2541794 2523375 2512816 2508678
59822 2508678 2510134 2516110 2524456 2533826 2545856 2563860 2589913 2624696 2669131 2723735 2786471 2853384
59810 2853384 2921670 2990623 3059711 3127435 3192159 3252338 3305722 3349759 3383062 3405447 3416905
59799 3416905 3418018 3411258 3400313 3388020 3376096 3366560 3361874 3363807 3373638 3393405 3425512 3471256
59787 3471256 3531197 3606839 3700551 3814153 3949304 4109253 4298712 4522110 4783413 5087300
59777 5087300 5438398 5838663 6285833 6772545 7283116 7789494 8251977 8626481 8874497
59768 8874497 8972052 8915995 8724667 8430760 8070475 7676337 7275328 6888221 6528472 6203122
59758 6203122 5915621 5667149 5456114 5279008 5132767 5015247 4923725 4855024 4807382 4780425
59748 4780425 4773040 4783143 4809839 4853865 4915418 4993427 5087528 5198875 5328260 5475161 5639584
59737 5639584 5823434 6029221 6258592 6512747 6793212 7101769 7440795 7813925 8225141
59728 8225141 8677015 9171013 9709271 10293993 10924480 11596034 12301641 13032456 13775936
59719 13775936 14515557 15233911 15915771 16548940 17125348 17643656 18110535 18538732 18944372
59710 18944372 19345394 19759805 20203237 20687616 21221080 21806834 22441041 23112638 23805233
59701 23805233 24498007 25165483 25779532 26313825 26746772 27061802 27248347 27304530 27238056 27063929
59691 27063929 26802103 26476562 26113431 25737770 25372241 25038110 24754940 24538235 24398968
59682 24398968 24346182 24388629 24533541 24786051 25151086 25634394 26240641 26971571 27826109 28799837
59672 28799837 29882244 31054337 32287898 33544055 34771017 35905140 36877080 37619518
59664 37619518 38074017 38198601 37975601 37414927 36550732 35435408 34133896 32716515 31250183
59655 31250183 29792575 28391279 27083797 25895282 24836638 23905143 23084751 22344823
59647 22344823 21641865 20927903 20161973 19319074 18394715 17404554 16377848 15346945 14339527
59638 14339527 13376756 12473602 11638201 10872453 10175258 9544752 8977460 8467831 8010459
59629 8010459 7601435 7236531 6910037 6617016 6355146 6122726 5916450 5732813 5570346
59620 5570346 5428627 5306181 5200897 5111383 5036238 4972968 4919096 4873356 4834292 4798579 4762158
59609 4762158 4722182 4676592 4622894 4558971 4484462 4400182 4307063 4206740 4102156 3996205 3890545
59598 3890545 3786682 3687103 3594119 3508543 3430578 3360987 3300312 3248129 3204193 3169139 3142963
59587 3142963 3124145 3111546 3105814 3107568 3115521 3127909 3144530 3165763 3190646 3217429 3245036 3272589
59575 3272589 3298725 3322947 3346575 3370828 3395140 3419013 3444340 3474114 3509764 3551457 3600005
59564 3600005 3656551 3721207 3793841 3875616 3968171 4072040 4187582 4316703 4461937 4624408
59554 4624408 4804254 5002271 5219474 5455760 5710645 5984553 6277520 6587086 6908999
59545 6908999 7239271 7573896 7907469 8234166 8549709 8850679 9132918 9393033 9631002
59536 9631002 9848332 10042964 10208110 10337243 10429351 10489322 10524908 10544057 10553821 10560452 10570226
59525 10570226 10589979 10626559 10686038 10773358 10891375 11038816 11209321 11392923 11577718 11749683
59515 11749683 11892732 11991221 12032742 12008313 11911411 11738690 11491336 11174688 10797042 10369609
59505 10369609 9906245 9421128 8926523 8433178 7951487 7490568 7056679 6653781 6284923
59496 6284923 5951865 5654205 5390373 5158854 4957476 4782755 4631695 4503481 4397918
59487 4397918 4313173 4246738 4197737 4166393 4152006 4153503 4171424 4207332 4261538 4333239 4422540
59476 4422540 4530500 4657481 4803344 4969113 5156541 5365956 5596076 5845760 6114101
59467 6114101 6398492 6693892 6993885 7290899 7575364 7836166 8062392 8244037 8371845
59458 8371845 8438448 8440114 8376668 8250214 8065253 7829614 7553540 7247522 6921662 6586144
59448 6586144 6250263 5920686 5601679 5296771 5008978 4739877 4490037 4260286 4051313
59439 4051313 3862322 3691460 3537385 3399161 3275088 3163263 3063177 2975300 2899181 2833342
59429 2833342 2776837 2729383 2690029 2657229 2630385 2609978 2596037 2587726 2584475 2586251 2592547 2602281
59417 2602281 2614954 2630932 2650458 2673414 2700394 2733069 2772586 2817210 2861379 2897789 2922020
59406 2922020 2936102 2946949 2960979 2981080 3008552 3045742 3095515 3159738 3239203 3332959 3436148
59395 3436148 3540849 3642088 3742578 3850033 3971196 4110276 4271112 4457439 4671423
59386 4671423 4914732 5191013 5505143 5860328 6258036 6700372 7190085 7727992 8311875
59377 8311875 8937071 9595648 10274898 10958684 11630656 12275402 12878370 13428148 13919508
59368 13919508 14352468 14728630 15050260 15322208 15551547 15744169 15902933 16028594 16120194
59359 16120194 16174164 16184930 16146867 16054749 15903487 15690296 15417827 15093851 14728263 14331952
59349 14331952 13917319 13496284 13076427 12660150 12247125 11835514 11421447 11000479 10570673
59340 10570673 10132995 9689152 9241437 8794660 8355593 7929836 7521011 7132956 6770134
59331 6770134 6435184 6128099 5848382 5596167 5370843 5170509 4993382 4838197 4703171
59322 4703171 4586317 4486821 4404247 4336566 4281095 4237314 4206337 4187549 4178295 4177256 4185582 4204028
59310 4204028 4231307 4265965 4307488 4354713 4405153 4456753 4508385 4557975 4602249 4639162 4668739
59299 4668739 4690844 4704145 4708088 4704017 4693473 4677132 4656273 4633589 4611727 4592420 4577633 4569992
59287 4569992 4571503 4583320 4607122 4645119 4698328 4766479 4849972 4950335 5068464 5203958 5356232
59276 5356232 5524553 5706905 5900262 6101225 6303835 6497102 6667842 6806943 6911276
59267 6911276 6980170 7013328 7012459 6981452 6923613 6841269 6738940 6623952 6502629 6378235 6253548
59256 6253548 6132554 6018072 5910201 5808702 5714701 5628600 5548464 5472117 5399039 5329026
59246 5329026 5260922 5194048 5129131 5066822 5007249 4951996 4904416 4866910 4839993 4825075 4825819 4845485
59234 4845485 4885188 4946117 5031241 5143481 5284492 5456870 5665360 5914081 6204218 6535645
59224 6535645 6908363 7320297 7765127 8233495 8714114 9191958 9647481 10059956 10410832
59215 10410832 10683473 10862721 10937609 10903679 10761594 10515524 10174698 9754657 9274665 8754424
59205 8754424 8213561 7671174 7142838 6638628 6165133 5727639 5328971 4968308 4643497
59196 4643497 4353488 4097101 3871191 3671930 3496669 3342973 3207351 3086675 2979580
59187 2979580 2884978 2800588 2724410 2656107 2595390 2540601 2490543 2446102 2408321 2376323 2348800
59176 2348800 2326094 2309039 2297091 2289290 2285713 2286380 2290102 2296128 2305625 2319970 2338898 2361753 2388982
59163 2388982 2420767 2455695 2492601 2532431 2576733 2625655 2678894 2736981 2799965 2866350 2935002
59152 2935002 3006546 3081242 3157146 3232124 3305898 3378166 3446393 3507602 3560826 3605726 3640385
59141 3640385 3662795 3673360 3673768 3664561 3645905 3619581 3588142 3553112 3515892 3479235 3445790 3416235
59129 3416235 3390726 3371096 3359768 3357724 3365391 3384257 3415676 3459299 3514653 3583060 3666038 3763088
59117 3763088 3873051 3996299 4133530 4283732 4445631 4620018 4808473 5010922 5226649
59108 5226649 5456488 5701555 5960541 6230251 6507566 6788531 7066398 7332748 7579554
59099 7579554 7797942 7976305 8102754 8169623 8174169 8116368 7998755 7827757 7612368 7361138
59089 7361138 7081732 6782253 6470558 6152562 5833065 5517606 5211629 4918363 4639324
59080 4639324 4376125 4130014 3900544 3686796 3489219 3308389 3142822 2990020 2848971
59071 2848971 2719678 2601070 2491489 2390563 2298651 2215075 2138760 2069724 2007967 1951742
59061 1951742 1899010 1849932 1805983 1767266 1732638 1701736 1674899 1651725 1631435 1613920 1598828
59050 1598828 1584579 1569934 1555298 1540738 1524186 1503769 1480658 1457344 1434366 1411093 1388427
59039 1388427 1368076 1350078 1333651 1319669 1309755 1303624 1299741 1298001 1299514 1304516 1312715 1324719 1340772
59026 1340772 1358990 1377298 1396156 1416827 1437873 1456054 1469948 1480052 1486159 1487517 1485158 1481374
59014 1481374 1477177 1472649 1469122 1468439 1470553 1474354 1480401 1490386 1504403 1521032 1539442 1558977 1577499
59001 1577499 1592817 1605145 1615660 1623356 1626012 1623613 1618108 1610427 1600446 1589290 1578886 1569738 1561639
58988 1561639 1555782 1553423 1553299 1553301 1553891 1556865 1561676 1566337 1571258 1578560 1587979 1597091 1605589 1615834 1628969
58973 1628969 1643788 1659746 1677902 1698494 1720500 1744024 1770437 1799866 1831052 1863624 1898009
58962 1898009 1933389 1968499 2004161 2042066 2081382 2119520 2155902 2191773 2226647 2258615 2288268
58951 2288268 2318875 2352307 2388001 2426089 2468213 2514899 2565355 2620246 2681512 2749197 2821727
58940 2821727 2899648 2985733 3080967 3183791 3293752 3412555 3540993 3678381 3825835 3986772
58930 3986772 4163292 4355210 4563373 4790689 5039086 5308830 5601745 5921836 6271680
58921 6271680 6651431 7062571 7509547 7996485 8525179 9097463 9716526 10384386 11100367
58912 11100367 11862769 12668977 13512404 14381283 15260729 16132946 16974636 17757307 18451667
58903 18451667 19030190 19466637 19738373 19832210 19746652 19488570 19071002 18514549 17846343 17094596
58893 17094596 16285229 15443087 14591797 13750112 12930941 12145052 11402708 10710406 10069253
58884 10069253 9478287 8936810 8442498 7990706 7577577 7201354 6859337 6546483 6258429
58875 6258429 5992997 5747314 5516635 5297908 5091781 4899312 4719330 4550708 4394487
58866 4394487 4251692 4121197 4001350 3891542 3790849 3697507 3611100 3533012 3463506 3400749
58856 3400749 3343681 3293151 3249200 3210189 3175947 3148794 3129962 3117832 3111173 3111163 3118558 3131756
58844 3131756 3149544 3173170 3203964 3241416 3285186 3336443 3395626 3461444 3533525 3613451 3701710
58833 3701710 3796496 3897104 4005821 4124920 4254599 4395367 4549568 4718823 4902797 5102124
58823 5102124 5319675 5557392 5815100 6094333 6400241 6737654 7108226 7513440 7957343
58814 7957343 8444072 8975530 9553626 10181673 10860918 11588069 12358124 13166375 14004613
58805 14004613 14857468 15704397 16522516 17285327 17962113 18522574 18941683 19199865 19282953
58796 19282953 19186016 18915904 18488108 17923034 17246181 16487404 15675433 14833698 13982353
58787 13982353 13140637 12324096 11541905 10799742 10103076 9455139 8854425 8297513 7782866
58778 7782866 7309652 6875202 6476430 6111901 5779934 5476368 5196413 4936958 4695322
58769 4695322 4468147 4253676 4052867 3866260 3692056 3529114 3378835 3241716 3114891
58760 3114891 2995650 2884717 2783455 2690603 2604561 2526306 2457068 2395441 2339561 2289837 2246790
58749 2246790 2208583 2173405 2141917 2114705 2089722 2065036 2041686 2021041 2001760 1982096 1962701
58738 1962701 1944361 1925500 1904859 1884087 1864682 1844940 1822996 1800342 1779143 1758582 1737038
58727 1737038 1715393 1694824 1673713 1650125 1625104 1600245 1574388 1546053 1516689 1488037 1458648
58716 1458648 1426638 1393560 1361953 1331356 1300527 1271277 1246033 1223554 1201090 1179025 1159443
58705 1159443 1141754 1123736 1105536 1088879 1073559 1058286 1043647 1030788 1018522 1005109 991574
58694 991574 980073 970394 961115 952583 945701 939534 933231 928408 926523 925936 924700 923910 924849 925240 922157
58679 922157 916443 910397 903380 893864 883767 876311 871197 866084 861305 858961 858731 858615 858517 859395 860441
58664 860441 860857 862735 868269 875693 881692 885955 889478 890556 886955 880329 874124 868659 862529 857068
58650 857068 854876 855507 857108 860777 868642 879148 888966 898311 909754 923121 936329 950032 966580
58637 966580 985353 1003872 1022624 1044246 1068931 1095279 1124602 1159644 1199891 1242899 1289474
58626 1289474 1342893 1403783 1470416 1543293 1624890 1715645 1814815 1924533 2048585 2188008 2342354
58615 2342354 2514126 2707040 2920748 3151894 3399223 3662503 3937081 4214307 4486237
58606 4486237 4744619 4976260 5165296 5300569 5376740 5389877 5338257 5227632 5070110 4877090
58596 4877090 4657447 4421529 4180838 3942859 3710758 3488173 3279583 3086060 2905627
58587 2905627 2738140 2585573 2447850 2323002 2211103 2113441 2028341 1952543 1886080 1830877
58577 1830877 1785226 1744724 1708055 1676665 1649571 1623901 1599847 1579369 1560518 1538847 1514012
58566 1514012 1489236 1464800 1438185 1410258 1384833 1361941 1337816 1311673 1286251 1261471 1234196
58555 1234196 1204878 1177954 1154772 1132438 1110498 1092338 1078784 1066559 1054377 1044606 1037637 1030617
58543 1030617 1023006 1017487 1014154 1009715 1003663 999225 996843 992734 985318 977112 968903 958145 944731
58530 944731 932280 921913 910607 897354 885002 874249 861889 846932 832584 820184 806982
58519 806982 791983 778173 766855 755442 743021 732483 724962 717657 709331 702617 698873 696040 693386
58506 693386 692937 694470 694722 693313 693768 696949 699363 699783 701397 705321 708160 708410 709286 712709 716283 718690
58490 718690 722327 728106 733293 736937 741828 748758 754568 758167 762695 769371 775029 778146 781484 786399
58476 786399 790340 792379 795348 800071 803347 803914 804496 805714 804054 798111 790703 782770 771738 758054
58462 758054 746392 737870 728018 715168 703774 696510 690275 683197 678324 676857 674816 670182 666488
58449 666488 665695 664376 660726 658398 659511 660707 660033 660866 665040 669063 671252 675632 684501 694023 701514
58434 701514 710065 721478 731585 737244 741218 745529 746931 743754 740393 740103 740110 738567 739311 744654 750442
58419 750442 753520 757364 765076 773580 780066 787339 797337 806165 811080 815775 823241 830087 833443 836684
58405 836684 842692 848231 850649 853280 858349 861407 858770 853722 849494 843082 832183 821290 814475 808735
58391 808735 800687 793144 788921 785011 779145 775229 775962 777058 775119 774008 777007 780114 779825 780111 784704
58376 784704 789974 792554 796461 805244 814617 820466 826705 837502 849166 857630 866441 879317 892173
58363 892173 900664 908220 918513 927613 931943 936252 945070 953997 958320 962377 971231 980941 986634 992399
58349 992399 1003271 1014913 1021297 1025258 1031393 1035976 1034332 1030951 1031741 1033277 1030257 1026502 1027869 1031348
58335 1031348 1031986 1033568 1041389 1051431 1057850 1064246 1076315 1090350 1100468 1110247 1125528 1142586 1155246
58322 1155246 1166899 1183577 1201909 1215921 1228940 1246619 1265083 1278284 1290172 1307178 1325631
58311 1325631 1339156 1351320 1368101 1385147 1395702 1403831 1416353 1429125 1435264 1439602 1450657 1465376
58299 1465376 1476184 1486027 1501801 1519951 1533412 1545879 1564360 1584760 1599772 1613722 1634423
58288 1634423 1657988 1677186 1696757 1724306 1754224 1777467 1799195 1829523 1864882 1896102 1926744
58277 1926744 1965263 2007245 2044086 2081063 2127638 2178021 2220983 2260699 2307706 2357661 2399965
58266 2399965 2439157 2486250 2536981 2580648 2622295 2673516 2729495 2778468 2825893 2885301 2953203
58255 2953203 3017478 3082442 3160279 3245689 3325074 3403054 3493333 3591343 3683238 3773845 3877517
58244 3877517 3989485 4095394 4200995 4322392 4455170 4584115 4714995 4864542 5027615
58235 5027615 5187650 5350935 5535975 5737841 5938984 6146221 6379391 6632705 6886731
58226 6886731 7149397 7444113 7766811 8097727 8445979 8837152 9266522 9712155 10184478
58217 10184478 10712958 11294163 11906164 12564069 13305224 14130351 15019336 15994560 17105051
58208 17105051 18359505 19743588 21292298 23072888 25110211 27409662 30041275 33116087
58200 33116087 36697865 40838141 45684164 51446455 58282641 66343833 75927858 87468139
58192 87468139 101431141 118431203 139441374 165682539 198286260 238124658 285392053
58185 285392053 338095840 390222169 432159992 454613344 453407042 431122842 394589365
58178 394589365 351069347 306111603 263325843 224749687 191159566 162507125 138419831
58171 138419831 118426160 101950689 88387691 77246298 68153993 60767236 54783101
58164 54783101 50006445 46321684 43632170 41889120 41129609 41429184 42858884 45459818
58156 45459818 49039484 52837098 55557522 56035939 53972463 49979456 44990781 39741883
58148 39741883 34692695 30129347 26176143 22806505 19949539 17563274 15594001 13947433
58140 13947433 12546504 11365668 10380535 9537600 8799764 8170520 7646818 7192400 6779103
58131 6779103 6411194 6088580 5786421 5490038 5211953 4957311 4708495 4459323 4229020
58122 4229020 4027293 3838947 3656498 3494845 3360261 3237015 3117872 3016671 2937430 2860856
58112 2860856 2774614 2688791 2609397 2524809 2430897 2342433 2266873 2192330 2113148 2042086 1985375
58101 1985375 1930328 1869651 1814514 1771693 1730462 1683915 1641527 1609064 1576879 1539217 1505009
58090 1505009 1478866 1451110 1416938 1386140 1363745 1340072 1309993 1283167 1264955 1245489 1218097
58079 1218097 1190990 1170418 1149227 1122287 1096816 1077460 1056972 1031362 1008838 994301 980085
58068 980085 961180 944732 935440 926323 912922 902152 898213 894017 885473 880041 882019 883081 876515
58055 876515 867612 861163 851900 836423 821767 813026 804531 791948 781041 775995 771022 762018 754727
58042 754727 752904 750158 742072 734933 733819 733253 728399 724562 726830 730755 731858 734161 740792 746142
58028 746142 745739 744292 745950 746227 741432 736417 735036 732575 725656 720039 720490 722169 720113 717975 719251
58013 719251 719066 713049 705676 701529 696841 687829 678905 674280 669753 661132 652791 649483 647485 642171
57999 642171 636775 635345 634412 629949 625461 624954 624813 620734 615905 614306 612658 607126 601455 600376 601197
57984 601197 599881 599184 602751 607106 607581 606594 608274 610393 609327 607657 609274 612117 613001 614371 618990
57969 618990 623145 622419 619182 617406 615301 610168 605199 604118 603989 600663 596499 595484 595477 592541 588357
57954 588357 586182 583932 578419 572063 568359 565046 558878 552856 551558 553295 553968 554748 558887 564645 568477
57939 568477 571682 577068 582431 584051 583343 583566 583335 579865 575183 572535 569835 563100 553390 544149 534834
57924 534834 523289 511337 501953 493924 485150 477958 475319 475066 473779 473039 475908 480638 483965 487403
57910 487403 494125 502712 509963 516785 525479 534487 541713 549584 560627 571437 577355 579913 583307 586834
57896 586834 587386 586288 586786 587431 584707 579762 575957 572197 565294 556614 549826 544161 536404 527528 520940
57881 520940 516131 510359 504727 502271 501795 499769 496694 495548 495750 494728 493706 495858 500351 504210 508358
57866 508358 515786 525375 533544 540536 549125 558683 566451 573133 581250 589505 594744 598036 602798 608287
57852 608287 610952 610850 610702 610004 606242 600650 596545 593031 586604 577990 571166 566389 560470 553282 547773
57837 547773 543939 538825 532320 527125 523305 518436 512721 508304 504026 496699 487267 479856 474899 468913
57823 468913 460990 453781 447913 441072 432926 425715 419681 412911 405802 400721 397314 393069 388255 385356
57809 385356 383982 381526 378539 378120 380189 381696 382402 385054 389912 394513 398940 405920 415470 424708 433052
57794 433052 442283 451297 456393 457315 457737 459248 460052 460049 461838 465867 469656 472532 476208 480146 481467 480155
57778 480155 479324 479584 478101 473984 469553 465497 459844 452705 447073 443783 440421 436267 433613 433191 432951
57763 432951 432347 433240 435655 437308 438199 440925 445477 448584 449316 450596 454023 457900 461480 466378 472464
57748 472464 477172 480259 484612 491027 496892 501337 506788 513808 519371 522244 525394 530875 536688 540896
57734 540896 544698 549297 553582 557067 561390 567070 572282 576496 581664 588361 594601 600013 607252 617710
57720 617710 629726 642507 657719 675532 693194 709436 726382 745243 764072 781697 799923
57709 799923 819770 839363 857821 877646 901101 927608 956605 989487 1026795 1066949 1109794
57698 1109794 1158002 1213102 1273373 1337488 1406867 1482812 1564942 1654379 1754990 1869603 1998308
57687 1998308 2142162 2304887 2489030 2693985 2919481 3167029 3435498 3718494 4007862
57678 4007862 4296008 4572739 4823959 5036747 5203678 5321520 5390433 5417462 5417408 5407058 5399122
57667 5399122 5399333 5401328 5380905 5302523 5140139 4893529 4584732 4243197 3895987 3564662 3262570
57656 3262570 2993975 2758444 2555241 2382317 2234832 2108431 2002116 1915281 1844377 1785323
57646 1785323 1736916 1699036 1669748 1647013 1631236 1623378 1622427 1627138 1638315 1657051 1682694 1714671
57634 1714671 1754304 1802848 1859992 1926155 2003734 2094168 2196467 2310684 2439947 2586763
57624 2586763 2750115 2928475 3122566 3332344 3553804 3781156 4008970 4229122 4428432
57615 4428432 4592819 4712154 4779325 4788312 4737307 4631816 4481462 4295379 4082860 3855318
57605 3855318 3623552 3394335 3172109 2961754 2766759 2586918 2420984 2269710 2133605
57596 2133605 2010083 1896167 1792103 1699226 1616231 1540703 1472502 1412414 1359142 1310704 1267221
57585 1267221 1229341 1195511 1163692 1134157 1107857 1083799 1060872 1040354 1023669 1009397 995428
57574 995428 982234 971089 961032 950778 941790 936109 932745 929438 926370 924906 924410 923721 924240 927987
57560 927987 933941 939785 946043 954989 966551 978756 991318 1005395 1020649 1035837 1051631 1069781
57548 1069781 1090155 1111519 1134382 1160244 1188955 1219774 1254051 1293941 1339402 1389341 1444713
57537 1444713 1507453 1577392 1653371 1736547 1829541 1933170 2047065 2172604 2311976 2465028
57527 2465028 2629965 2806078 2992230 3182989 3369382 3542998 3696468 3820892 3906715 3947777
57517 3947777 3942378 3891338 3798201 3670914 3519853 3353749 3179447 3004371 2835621 2676651
57507 2676651 2527740 2389725 2264650 2153067 2053625 1965363 1888002 1820278 1760501 1708463
57497 1708463 1664415 1626740 1593260 1564280 1541645 1525264 1513214 1504748 1500418 1499824 1502063 1507987
57485 1507987 1519113 1534656 1552513 1572837 1597829 1628325 1663492 1703592 1750153 1803565 1863320
57474 1863320 1930418 2006883 2093205 2189067 2296165 2417291 2552809 2700871 2860642 3032010
57464 3032010 3211910 3393771 3570438 3734636 3876701 3985469 4052507 4073704 4047484 3974847
57454 3974847 3861462 3716629 3549287 3366946 3177768 2990171 2809671 2638424 2478041
57445 2478041 2330344 2195562 2072668 1961772 1863692 1777316 1700078 1630938 1570233 1516922
57435 1516922 1468970 1426217 1389714 1358403 1329735 1303521 1281703 1264175 1248317 1232970 1219350
57424 1219350 1207611 1196141 1184951 1176158 1170133 1164563 1158426 1153550 1150992 1149036 1146161 1143110 1140731
57411 1140731 1138499 1136479 1136097 1137698 1139799 1141871 1145360 1150898 1156972 1162394 1167695 1173226 1178393 1183605
57397 1183605 1190355 1198505 1206152 1212991 1220963 1230686 1240198 1248395 1256672 1265869 1274583 1282101 1290109 1299711
57383 1299711 1309398 1317742 1325664 1334221 1342551 1349921 1357589 1366740 1376509 1385802 1395225 1405494 1415730
57370 1415730 1424940 1433627 1442583 1451718 1461196 1471861 1483409 1494119 1503568 1513524 1524945 1536353 1546592
57357 1546592 1556891 1568519 1580501 1591579 1602585 1614915 1628144 1640978 1653236 1665365 1677268
57346 1677268 1689072 1701812 1715966 1730477 1744314 1757888 1771996 1786638 1801679 1817321 1833242
57335 1833242 1848726 1864190 1880918 1898799 1916195 1932523 1948859 1965448 1981015 1995394 2010369
57324 2010369 2026902 2043875 2060732 2078861 2099054 2119920 2140245 2160644 2181512 2201786 2221295
57313 2221295 2241999 2265094 2289078 2312380 2335775 2360352 2385271 2409469 2433710 2458935 2484433
57302 2484433 2509513 2535272 2562823 2591402 2620015 2649243 2679788 2711049 2742923 2777090 2814560
57291 2814560 2853689 2892688 2932451 2974849 3019807 3066177 3114057 3164118 3215820 3268185 3321202
57280 3321202 3374722 3427177 3477020 3524107 3568079 3606838 3638354 3662600 3680118 3690273 3692718
57269 3692718 3689103 3681512 3670553 3656708 3641985 3628363 3615999 3604737 3595909 3590783 3588705 3588647 3591188
57256 3591188 3597054 3605232 3614532 3625630 3639546 3655467 3672087 3689724 3709114 3729543 3750335 3772769
57244 3772769 3798192 3825395 3852076 3877870 3903798 3929916 3955812 3982393 4010855 4040607 4070314
57233 4070314 4100162 4131084 4162671 4193917 4225224 4257555 4290316 4321985 4352178 4381316 4409119
57222 4409119 4435283 4460808 4486876 4513177 4538940 4564558 4590548 4616198 4641109 4666867 4695124
57211 4695124 4725195 4755493 4786115 4817854 4849965 4881290 4912541 4945030 4978077 5010132 5041631
57200 5041631 5074252 5107991 5141391 5174048 5206582 5238666 5269458 5299606 5330554 5362126 5392752
57189 5392752 5421675 5449053 5474498 5497617 5519448 5541360 5562975 5582995 5601438 5619095 5635583
57178 5635583 5650092 5663418 5677136 5691328 5705103 5718692 5732787 5746521 5758356 5768529 5778493
57167 5778493 5788482 5797761 5806661 5816048 5825257 5832834 5838912 5844627 5849604 5852305 5852473 5851032 5847950 5842441
57153 5842441 5834912 5826486 5816988 5805693 5793661 5782992 5774075 5765932 5759060 5755437 5755687 5758575 5763322
57140 5763322 5770251 5779092 5788787 5799064 5810190 5821127 5829807 5835119 5836856 5834102 5825851 5813066 5797986
57127 5797986 5781413 5762608 5741684 5720030 5698531 5677372 5657557 5640633 5626887 5615423 5605663
57116 5605663 5597042 5587865 5576518 5563490 5550514 5538550 5528887 5525530 5533980 5557871 5598734 5658262
57104 5658262 5738461 5840447 5965984 6120169 6310637 6545132 6832428 7184765 7616444 8140680
57094 8140680 8770655 9522741 10415291 11464509 12684073 14086919 15682109 17468002 19429300
57085 19429300 21538203 23754860 26029745 28311303 30547401 32667893 34563779 36097297
57077 36097297 37148283 37657320 37627768 37095174 36101820 34695184 32937173 30905770 28686340
57068 28686340 26360565 23999768 21664017 19403881 17260650 15264674 13435092 11781900
57060 11781900 10307459 9006513 7867601 6876489 6018366 5277696 4638682 4087093 3610532
57051 3610532 3196982 2835230 2517263 2238255 1993640 1777981 1586999 1418374 1269660
57042 1269660 1137388 1018963 913459 819806 736078 661161 595072 536879 484273 435929 392366
57031 392366 353855 319409 288395 261101 237174 215518 196193 180281 167514 156338 146653 139940
57019 139940 136221 133584 131357 131025 133312 137123 142230 150273 162284 177984 198269 225589 261354
57006 261354 306219 363715 440478 542613 675151 842938 1042487 1248057 1412975 1494450
56996 1494450 1479508 1386602 1246759 1087118 926820 778039 646625 534224 441198 366765
56986 366765 307914 261179 225232 199780 182784 170783 160843 149995 134192 110696 81051 49487
56974 49487 18964 -9387 -34250 -54167 -69116 -79774 -85730 -86332 -82626 -76410 -67903 -56172 -41146
56961 -41146 -23351 -2242 23395 53888 88889 128018 169275 207537 236663 253026 256208 247704
56949 247704 230725 210039 189587 170452 152407 136426 124031 115224 109023 105290 104304 105439 108133
56936 108133 113528 123422 138246 157675 182468 213875 251536 292849 333272 366034 383497 381562
56924 381562 362642 332992 297989 261173 225850 194722 168273 145565 126321 110679 97781
56913 97781 86512 77015 69784 63952 58203 52655 48159 44543 41277 38998 38526 39034 39037 38523 38461 38947
56897 38947 39570 40846 43480 46967 50674 55533 62978 73054 85369 100998 121543 147045 176399
56884 176399 208556 241084 268683 285872 291068 286402 274487 257588 238950 222006 208070 196780
56872 196780 188575 184791 185659 190280 198430 210574 226499 245933 270306 302028 342284 391312 450355
56859 450355 520847 600768 682519 754254 803218 820313 804619 763827 708925 648575 588665
56848 588665 534255 488732 452085 422972 402083 391228 390058 396517 410194 432704 465337 509043
56836 509043 566469 641309 735485 848592 978115 1115648 1242528 1334024 1371630 1351903 1284766
56825 1284766 1186318 1073244 959420 853551 759272 677782 609771 555244 513350 483121 463571
56814 463571 453358 451763 459925 479776 512054 556873 615848 691403 782893 883407 979420 1053158
56802 1053158 1088333 1077984 1028085 952389 863934 771909 683636 604952 538036 481700 434597
56791 434597 396466 366654 343994 328369 320358 319335 324160 335641 356001 385922 424323 470531
56779 470531 523299 576800 620345 643826 642838 619159 578706 529254 477494 426788 378436 334449
56767 334449 297114 266350 240140 217676 199724 185789 173602 161930 151617 143378 136775 131707
56755 131707 128572 126469 123519 119551 116352 114763 113688 112341 111254 110571 109538 108213 107563 107406 106467
56740 106467 104841 104123 104545 104390 102853 101155 100087 98738 96489 94137 92291 90612 89296 89185 89812
56725 89812 89542 88297 87897 88990 89899 89384 88331 87774 87342 86554 85715 84678 82625 79837 77747 76629
56709 76629 75172 72889 70816 69343 67664 65991 65851 67371 68599 68399 67722 67265 66363 65173 65381 67479
56693 67479 69677 70740 71646 73205 74353 74193 73673 73802 74184 74523 75627 77666 79396 80303 81522 83499
56677 83499 84822 84661 84362 85282 86894 88281 89648 91136 91998 92171 92867 94548 96055 96708 97375 98607
56661 98607 99730 100593 102003 103570 103483 101485 99566 98664 97266 94584 92391 92039 92201 91389 90353 90193
56645 90193 90324 90189 90825 92811 94637 94924 94451 94315 94115 93556 93751 95144 96150 95634 94751 94624 94272 92683
56627 92683 90907 90163 89840 89207 89153 90256 91116 90544 89530 89162 88609 87184 86329 87352 89061 89878 90471
56610 90471 92094 94049 95122 95897 97372 98757 98851 98265 98232 98521 98420 98319 98515 98057 96591 95658 96271 96940
56592 96940 96084 94617 94126 94276 94200 94628 96392 98340 98999 98844 98952 99048 98851 99542 101776 104030 105073 106118
56574 106118 108295 110042 109646 108525 109285 112069 115462 119318 124013 128379 131193 133453 136676 140343 143429
56559 143429 146873 151846 157154 161163 164798 169764 175199 179080 181705 184776 188163 190578 192383 194707
56545 194707 196638 196311 194146 192197 190922 189169 186724 184297 181637 178035 174008 170329 166340 161426
56531 161426 156959 154378 152594 149886 147142 146478 147710 148967 149819 150985 151842 150953 148350 144827 140034
56516 140034 133769 128012 124869 123478 121647 119448 118450 118533 118428 118377 119277 120137 119433 118132 118356 119921 121098
56499 121098 121896 123456 125123 125346 124817 125590 127651 129356 130527 132034 133163 132628 131566 132230 134250 135354
56483 135354 135254 135597 136660 137426 138469 141350 145444 148632 150909 154093 158272 161822 164762 168711 173576
56468 173576 177493 180149 183117 186916 190747 195009 201048 208333 214757 219746 224416 228908 232296 234747
56454 234747 237028 238341 237550 235896 235467 235633 234197 231429 229556 228819 227490 225270 223184 220638 216354
56439 216354 211829 210018 210713 210976 209942 209346 209454 208559 206700 205816 205824 204422 201272 198652 197396 195823
56423 195823 193189 190719 188720 186175 183555 182508 182391 180716 177351 174648 173143 170961 167883 166064
56409 166064 166097 166219 166061 167337 170057 171952 172449 173443 175299 175983 175063 174719 175708 176157 175370 175041 175526 174790
56391 174790 172332 170474 170347 170180 169005 168596 170265 172941 175699 179047 182599 184758 185816 188138 192258
56376 192258 196054 198594 201318 204588 206760 207738 209767 213532 217008 219227 221519 224071 225156 224964 226300
56361 226300 230067 233842 236210 238643 241696 243397 243047 242784 243695 244122 243433 243617 245375 246472 245854 245682
56345 245682 247422 249576 251122 253530 257423 260842 262764 264886 268160 271136 273462 277289 283300 289040
56331 289040 293129 297509 303640 310199 316496 324307 334170 343606 351186 358844 368131 377755 386786 396476
56317 396476 406896 415631 421992 428600 436598 443261 446725 449066 452122 454170 453507 451622 450093 447865
56303 447865 444291 441389 440518 440130 439154 439053 440295 440605 439239 439189 442600 447654 452462 458151 465562 472880
56287 472880 479331 487411 498746 511531 524618 540011 558645 577968 596658 617462 642300 668820
56275 668820 695119 723595 756629 792648 830064 871124 918165 969990 1025696 1088213 1160326
56264 1160326 1240810 1328210 1424760 1533057 1652642 1783453 1928624 2090039 2264930 2450569
56254 2450569 2648185 2858242 3075928 3295507 3515095 3732658 3941089 4131961 4300787
56245 4300787 4444430 4557072 4633571 4673859 4680016 4652470 4593132 4508533 4405353 4286157 4153534
56234 4153534 4014388 3875338 3737370 3599514 3464113 3333783 3206866 3080833 2956833
56225 2956833 2836227 2716388 2594893 2474315 2357838 2243636 2128723 2014897 1905621
56216 1905621 1800359 1697278 1598319 1506315 1420185 1338086 1262099 1194648 1133570 1075925 1023267
56205 1023267 977935 937648 899313 864609 836053 811031 785677 761410 741510 724365 706353
56194 706353 688587 674627 664045 654150 645460 639660 634889 628794 623506 621890 621888 620343 619175 621666
56180 621666 625900 628323 630679 636837 645668 653703 661992 673625 687172 699279 711114 725542 740591
56167 740591 752538 762744 774541 785987 792808 795983 799359 802237 801536 798875 798236 798795 797288 795257
56153 795257 796744 800963 804429 808182 815786 826520 837721 851462 871541 896340 922190 951336
56141 951336 989026 1035376 1088076 1150573 1229242 1324595 1433335 1556552 1696949 1849535 2003380
56130 2003380 2151092 2289094 2411580 2513706 2599581 2678682 2755518 2829872 2903442 2976358
56120 2976358 3039224 3078725 3090746 3080387 3051944 3008272 2957039 2906209 2853452 2789147 2708753
56109 2708753 2613644 2502686 2374053 2234421 2095948 1964561 1840368 1727503 1632742 1555342
56099 1555342 1488816 1431957 1387883 1353584 1321450 1290430 1264970 1243830 1220977 1196645 1176300
56088 1176300 1159385 1140438 1120586 1106207 1096727 1085554 1072705 1064509 1061117 1056523 1050839 1050025 1053379
56075 1053379 1053940 1051690 1053744 1060977 1067186 1072025 1081726 1096180 1108377 1117645 1130458 1147160 1161059
56062 1161059 1171708 1185709 1203300 1217722 1229000 1244544 1264875 1282698 1297383 1315979 1338444
56051 1338444 1356598 1369500 1385180 1405346 1423276 1438642 1459022 1484688 1507470 1526904 1551638
56040 1551638 1582535 1610622 1634348 1662342 1696317 1728105 1756626 1790727 1831886 1871337 1907588
56029 1907588 1949271 1997348 2042612 2084307 2132632 2189049 2243058 2292434 2347148 2409066 2467846
56018 2467846 2521578 2581080 2648890 2714821 2777223 2847037 2925488 3000078 3068509 3143838 3229842
56007 3229842 3314712 3395595 3485147 3586699 3687763 3785706 3894498 4018159 4143550 4267600
55997 4267600 4404615 4558113 4713574 4868246 5038871 5230075 5425360 5619930 5831024
55988 5831024 6064557 6304401 6546783 6811299 7104857 7410131 7723465 8067197 8449798
55979 8449798 8852598 9271834 9733170 10247868 10797669 11381234 12030135 12759538 13551817
55970 13551817 14410482 15378786 16482026 17707435 19067215 20622350 22416752 24453778
55962 24453778 26770288 29464493 32618076 36272444 40524783 45562436 51559398 58642535
55954 58642535 67022409 77061147 89177173 103854181 121852948 144263815 172230737
55947 172230737 206716651 248322480 296342510 346913490 392162485 422531386 431449320
55940 431449320 418592020 389095553 350048582 307538156 265749919 227227542 193193163
55933 193193163 163870156 138976087 118100020 100754520 86359302 74372206 64393281
55926 64393281 56093393 49139323 43254724 38272698 34063560 30471378 27365354 24685285
55918 24685285 22384547 20380820 18603131 17033636 15661328 14440536 13331135 12334691
55910 12334691 11455004 10662984 9932584 9272516 8690815 8163658 7668669 7215050 6812429
55901 6812429 6442059 6086264 5756063 5463175 5193080 4931071 4687771 4474163 4276898
55892 4276898 4082007 3898827 3737621 3586755 3434268 3289970 3164505 3047525 2927424
55883 2927424 2812633 2713039 2619530 2521798 2428134 2348379 2274661 2197630 2124905 2065339 2011184
55872 2011184 1953479 1899571 1858179 1821967 1781477 1741713 1708849 1674939 1632166 1588690 1554745
55861 1554745 1526084 1496283 1472128 1461171 1456039 1445841 1431548 1416371 1393372 1357287 1317231
55850 1317231 1283458 1252308 1217466 1184531 1160474 1139750 1115063 1091648 1077041 1066531 1052477
55839 1052477 1038534 1031068 1025489 1014459 1001096 991087 980089 961741 940130 921797 903245 878690
55827 878690 852528 831876 814075 793471 773294 758875 746092 728337 708440 692372 677724
55816 677724 659668 641827 629949 620975 609285 597669 591358 587419 580926 575605 577416 583273 586872
55803 586872 590093 597870 607227 612216 614707 619651 624435 623419 618355 614035 608121 595586 579061 564701
55789 564701 551823 536349 520404 508615 498805 486132 472862 464539 459975 454481 449535 449703 452863
55776 452863 452559 447360 439594 428149 411163 392765 378580 367354 354906 342945 335805 331989 327316
55763 327316 323086 322619 323003 318929 311790 306561 302582 295856 287595 282052 278423 273104 267376 264751 263317
55748 263317 258890 253137 250431 249208 244703 237803 232925 229383 223184 215309 210000 206818 202480 198570
55734 198570 199185 202667 203912 203311 205314 209554 211554 211056 211620 212831 210671 204981 199254 193846 186467
55719 186467 178389 173004 169260 163587 157244 154658 155495 155493 154125 154426 156288 157059 157811 161870 168095 172728
55703 172728 176868 184743 195328 203075 206481 208695 210223 208534 204719 203146 204260 204629 204191 206525
55689 206525 211736 215923 218049 220776 224164 225115 223470 222383 222262 220545 217644 216899 218382 218863 218123
55674 218123 219090 221543 221996 220120 219077 219179 217488 214132 212680 213665 213870 212665 212882 214735 215059 213500
55658 213500 213404 215554 216915 216613 217420 220179 222434 223598 225905 229206 230335 228671 226843 224950 219736
55643 219736 210687 201487 194053 186475 178103 171318 166696 161468 154372 147383 141389 134810 127590 121885
55629 121885 117800 112994 107314 103069 100162 95954 90623 87427 86864 85831 83465 82410 83195 82904 80765
55614 80765 79604 80187 79492 76355 73656 72995 72252 70332 69377 70203 70236 68161 66234 65996 65941 65222 65402 66744
55596 66744 66940 65251 63846 63659 63154 62400 63767 67172 69350 69439 70512 73830 76495 76798 76995 78511
55580 78511 79098 77364 75679 75915 76475 76143 76844 79890 83304 85546 88384 93527 99807 106051 113452 122830
55564 122830 132672 141836 150950 159392 164396 164931 163030 159635 152998 142971 132856 124785 117040 108132
55550 108132 99773 93505 88042 82382 78043 75869 74062 71622 70318 71005 71504 70441 69730 70920 72570
55535 72570 73578 75593 79500 82977 84191 84712 86179 87347 87064 87056 88968 91575 93517 95843 99285 101919
55519 101919 102163 101250 100300 97877 93078 88124 85097 82801 79464 75870 73128 70078 65671 61450 58946
55504 58946 56921 53725 50092 47249 44620 41773 40082 40085 39621 37041 33813 31655 29572 26212 22605
55489 22605 20014 17478 13981 10731 8808 6940 4065 1757 1602 2433 2576 2562 3222 3523 2765 2585 4249
55472 4249 6203 6764 6942 8091 9169 8957 8627 9429 10070 9130 7998 8660 10474 11725 12425 13108 12964
55455 12964 11656 10927 11892 12829 12120 11089 11343 11634 10266 8386 7920 8262 7979 7830 9004 10238 9836
55438 9836 8935 9654 11455 12266 11881 11371 10551 8835 7363 7545 8627 9172 9637 11069 12697 13295 13529
55421 13529 14489 15349 14952 14277 14819 15925 16115 15678 15582 15362 14466 14141 15558 17570 18626 19243 20284 20721
55403 20721 19683 18786 19628 20771 20106 18475 17977 18333 18040 17595 18370 19640 19841 19559 20247 21170 20731 19656
55385 19656 19765 20654 20665 20140 20641 21855 22274 22084 22374 22398 20640 17764 15589 13926 11344 8185 5843
55368 5843 3855 784 -2683 -4615 -5110 -5768 -6464 -5766 -4072 -3262 -3525 -3405 -2672 -2250 -1675 396 3232 4538
55350 4538 3909 3146 3114 2904 2171 1788 2054 2406 2872 3797 4448 4048 3714 5091 7518 8891 8854 8750 8862
55331 8862 8274 7164 6704 6782 6187 4953 4272 4268 3971 3232 2595 1709 40 -1360 -1060 312 1082 1312 2216 3451
55311 3451 3649 3143 3438 4312 4205 3258 3225 4377 5173 5125 5423 6503 7329 7364 7177 7006 6661 6662 7486 8014
55291 8014 6907 5102 4688 5681 6314 6103 6065 6193 5399 3935 3356 3976 4688 5246 6386 7780 8245 7921
55273 7921 7957 8237 7846 7408 8346 9950 9994 8309 7023 7170 7722 8164 9258 10872 11719 11766 12461 14115
55255 14115 15366 15655 15961 16733 17287 17505 17937 18090 16900 15009 14169 14322 13734 12117 11014 10933 10838 10732
55237 10732 11924 14207 15530 15122 14382 14145 13667 12919 13168 14509 15392 15366 15757 16900 17363 16741 16485 16937
55219 16937 16297 13873 11779 11874 13269 14367 15213 16240 16636 15691 14271 13469 13114 12796 13069 14528 16799
55202 16799 19233 21495 23019 23253 22859 23181 24259 24903 24871 25085 25479 24787 22849 20963 19475 17268 14308
55185 14308 12335 12110 12140 11139 9706 8579 7213 5190 3152 1327 -1135 -4356 -6984 -8125 -8360
55170 -8360 -8090 -6770 -4586 -2974 -2494 -1984 -645 862 2149 3904 6079 7366 7487 7968 9505 10632
55154 10632 10237 9445 9625 10390 10972 11810 13255 14253 13857 12789 12179 11968 11676 11523 11739 11914 11944 12393 13232
55135 13232 13587 13335 13396 13867 13673 12709 12393 13228 13859 13560 13636 15129 17059 18276 19266 20715 21975 22400
55117 22400 22670 23436 24090 24129 24278 25047 25601 25193 24294 23389 22253 21403 22306 24958 27103 27295 26955 27996
55099 27996 30197 32441 34700 37086 38608 38704 38583 39349 40269 40532 41154 43266 45897 47418 47994 48680 49168
55082 49168 48451 46855 45573 44832 44183 43931 44720 46291 47988 49797 51698 52841 52659 51984 51828 51859 51282
55065 51282 50281 49377 48235 46402 44432 43171 42686 42801 43668 44865 45116 44012 42877 42854 43271 43005 42183
55048 42183 41344 40199 38530 37109 36421 35671 34317 33304 33422 33770 33280 32575 32745 33478 33929 34344 35203
55031 35203 35755 34973 33122 31050 28946 27083 26528 27619 28944 29405 30110 32534 35934 38452 39806 41032
55015 41032 42365 43231 43720 44396 45119 45455 45641 45891 45628 44687 44302 45438 47080 47650 47164 46509 45682 44395
54997 44395 43464 43868 45217 46663 48322 50212 50923 49300 46574 44927 44639 44491 44153 44309 45056 46046 47617
54980 47617 50017 52106 52630 52184 52238 52880 53255 53503 54330 55299 55490 55372 56108 57498 58446 59063 60408 62576
54962 62576 64854 67345 70633 74256 77399 80708 85548 91833 98446 105450 113992 124354 136049 149533
54948 149533 165781 184308 203439 222299 240507 256148 266283 269688 267275 259841 247483 231407
54936 231407 214232 197797 182117 166762 151823 137360 123513 111378 102269 95877 90551 85501
54924 85501 81333 78360 75935 73631 71714 70290 69265 69176 70724 73572 76887 80861 86273 92776 99318
54909 99318 106150 114707 125519 137920 151808 167833 185578 203215 219279 233180 243795 249316
54897 249316 248988 243615 234041 220646 204566 187780 171484 155744 141028 128518 118404 109459
54885 109459 100909 93422 87639 83030 78888 75307 72520 70215 68163 66628 65693 64894 63919 62989 62347
54870 62347 62003 61955 61930 61061 58769 55810 53491 52055 50846 49749 49225 49156 49004 48924 49383 49879 49489 48632
54852 48632 48640 49517 49731 48501 46826 45886 45748 45982 46238 45880 44261 41728 39348 37519 35912 34720 34646
54835 34646 35569 36514 37093 37717 38345 38432 38259 38946 40791 42824 44148 44620 44176 42835 41446 41153 42003 43272
54817 43272 44958 47513 50309 52133 53196 54859 57268 59114 60029 61320 63839 66893 69825 72959 76403
54802 76403 79620 82878 87563 94329 102403 111350 122027 135091 150038 166371 184242 203158 221444
54789 221444 237694 251440 261767 266882 265944 260065 250741 238581 224261 209303 194938 181313
54777 181313 168550 157352 147959 139796 132809 127779 124681 122241 119879 118518 118582 118778 117936 116628 115814
54762 115814 115360 115168 116468 120476 126749 134110 142331 151803 162521 174571 188712 205392 223974
54749 223974 243905 265503 288432 310454 328998 343167 352906 357176 354596 345416 331394 313981
54737 313981 293834 271938 249960 229384 210899 194516 179732 165946 153199 142131 132920 124894
54725 124894 117614 111479 106675 102389 97857 93466 90065 87814 86375 85522 84840 83520 81256 78756 76766
54710 76766 75248 74024 73372 73285 73007 72102 71249 71204 71705 72164 72668 73482 74334 75022 76025 77638 79187 79902
54692 79902 79961 79908 79758 79458 79428 79812 79913 79250 78475 78349 78596 78700 79023 80018 81102 81526 81814 83062 85219
54673 85219 87314 89104 91289 94238 97587 101105 104940 108926 112492 115426 118122 121021 124234 127665
54659 127665 131060 134028 136340 138061 139252 139988 140787 142397 144758 146911 148433 150283 153557 158056 162783
54644 162783 167361 172273 178146 185525 194986 206770 220504 235617 251636 267709 282400 294467
54632 294467 303287 308172 308076 302589 292627 279513 264014 246924 229814 214271 200737 188778 178047
54619 178047 168359 159419 151259 144573 139923 136960 135011 133983 133991 134520 134705 134214 133302 132224 131074 129941
54603 129941 128826 127650 126506 125455 123963 121230 117390 113590 110519 107606 104081 100043 96002 92189
54589 92189 88844 86335 84419 82135 79058 75903 73382 71351 69629 68624 68395 68047 67019 66076 66082 66544
54573 66544 66332 65204 63693 62135 60679 59658 59088 58341 57108 56070 55948 56573 57570 59098 61048 62435
54557 62435 62629 62421 62791 63331 63034 61997 61214 61180 61739 62799 64148 65035 64998 64737 65239 66516 67994 69575
54539 69575 71393 73168 74823 77132 80758 85273 90079 95543 102087 108948 115122 120948 127375 134226
54525 134226 140539 146139 151386 155696 157810 157362 154917 150685 144567 137325 130294 123890 117592 111349
54511 111349 105762 100857 95930 90800 86143 82406 79332 76681 74553 72848 71239 69752 68715 68178
54497 68178 67999 68273 68960 69392 68973 68096 67557 67406 67266 67342 68050 68972 69343 69423 70229 71924 73521 74220 74195
54478 74195 74072 74453 75847 78215 80682 82416 83586 84748 85746 86101 86102 86408 86874 86769 85945 84840 83617
54461 83617 82322 81447 81290 81079 79963 78493 77877 78068 77917 77069 76255 75807 75269 74550 74144 74067 73811 73416
54443 73416 73379 73400 72505 70590 68630 67179 65838 64451 63614 63607 63866 63844 63512 62841 61803 60979 61120 61908 62203
54424 62203 61713 61358 61755 62443 62920 63395 64181 65257 66726 68774 70917 72200 72436 72373 72507 72715 73225 74797
54406 74797 77508 80372 82660 84748 87294 90406 93967 97952 102071 105823 109289 113147 117656 122260
54392 122260 126333 129554 131536 132021 131639 131473 131588 130892 128749 125838 123075 120543 117861 114880 111651
54377 111651 108336 105340 102911 100567 97706 94760 92783 91815 90766 89141 87764 87369 87480 87224 86403
54362 86403 85322 84255 83520 83396 83641 83697 83575 83841 84634 85506 86312 87345 88408 88790 88458 88392 89411 91558
54344 91558 94804 99310 104607 109545 113558 117193 120961 124546 127538 130089 132331 133861 134261 133506 131623
54329 131623 128665 125163 121819 118614 115076 111384 108139 104974 100755 95485 90588 86880 83630 80330
54315 80330 77882 76969 76521 75082 72888 71347 71027 71235 71205 70730 69838 68595 67111 65287 62844 59940
54299 59940 57338 55612 54618 53980 53503 52918 51949 50922 50529 50620 50124 48644 47262 47076 47714 47980 47328 46058
54281 46058 44606 43379 42872 43353 44629 46423 48565 50652 52138 53046 53935 54950 55581 55621 55523 55554 55440
54264 55440 55237 55581 56555 57242 57000 56413 56411 57203 58644 60782 63358 65461 66384 66304 65642 64464 62978 61854
54246 61854 61463 61471 61634 62198 63087 63630 63688 64005 64742 64686 62925 60474 59207 59750 61292 62816 63607 63136 61501
54227 61501 59641 58370 57535 56775 56445 56979 57873 58240 58018 57872 58188 58913 59981 61236 62248 62881 63712
54210 63712 65294 67323 69056 70195 70867 71158 71167 71109 70997 70634 70177 70060 70054 69332 67900 66978 67254 67650 66686
54191 66686 64311 61613 59470 58283 58247 58907 59080 58188 57099 56829 57066 56901 56289 55795 55521 55394 55883 57332
54173 57332 59032 60063 60639 61481 62316 62241 61294 60475 60301 60414 60531 60780 61127 61358 61605 62118 62642 62751 62594
54154 62594 62581 62641 62539 62548 62884 62881 61744 59854 58254 57046 55478 53560 52378 52596 53659 54763 55724 56505
54136 56505 56646 55645 53586 51148 49216 48426 48738 49474 50032 50362 50551 50388 49833 49382 49355 49179 48111 46377
54118 46377 44912 44212 44109 44437 45189 46095 46664 46632 46055 45258 44919 45673 47183 48157 47862 46997 46552 46563 46688
54099 46688 47156 48169 49073 49249 49213 49745 50515 50740 50665 51059 51659 51520 50699 50211 50433 50853 51265 51843 52080
54080 52080 51102 49237 47908 47723 47949 48125 48818 50257 51516 51824 51739 52239 53352 54384 54996 55406 55894
54063 55894 56593 57599 58961 60620 62339 63580 63779 63139 62807 63685 65395 67044 68547 70351 72209 73358
54047 73358 73812 74469 75930 78105 80832 83901 86522 87925 88564 89696 91687 93877 96168 99397 103761
54032 103761 108168 111798 115302 119747 125229 131209 137449 143891 150181 155978 161368 166540 171450 176109
54018 176109 180689 184989 188397 190731 192644 194780 196945 198465 198928 198308 196787 194762 192650 190449 187872
54003 187872 184994 182255 179604 176254 171635 166230 161118 156968 153665 150660 147521 144356 141667 139532
53989 139532 137240 134191 130902 128412 126878 125593 124359 123850 124405 125320 125753 125606 125177 124588 123990 123787
53973 123787 124192 124934 125683 126452 127392 128572 130083 131906 133589 134534 134735 134741 134842 134859 134820 135123 135793 136139 135438
53954 135438 133536 130595 126894 123114 120329 119278 119881 121603 123958 126614 129375 132177 134854 137073
53940 137073 138903 141272 145145 150342 155758 160636 164993 168931 172381 175463 178190 179806 179388 177271
53926 177271 174953 173427 172535 172160 172864 174748 176722 177686 177912 178656 180922 184997 190577 196773 202477 207255
53910 207255 211611 216207 221328 227163 233826 240756 246902 251964 256772 261894 266570 269612 270814 270859 270302
53895 270302 269264 267728 265621 262854 259689 256701 254078 251376 248208 244615 240430 234999 228121 220734
53881 220734 213998 208079 202431 196912 191954 187822 184214 180559 176424 171783 167176 163323 160367 157757
53867 157757 155036 152267 149452 146128 142017 137611 133571 129863 126039 122170 118957 116970 116104 115737 115184
53852 115184 114102 112655 111164 109572 107494 104931 102598 101306 101165 101482 101338 100278 98669 97307 96492
53837 96492 95702 94510 93397 93005 92956 92351 91307 90898 91397 91657 90665 88878 87526 87350 88403 90302 92108
53820 92108 92718 92066 91381 91765 93029 94399 95673 96987 98055 98487 98602 99212 100689 102724 104827 106711
53804 106711 108467 110649 113846 117849 121675 124802 127970 132305 137983 144171 149938 154774 158578 161638
53790 161638 164503 167539 170719 173933 177178 180258 182738 184450 185704 186808 187793 188712 189692 190460 190401 189392
53774 189392 188080 187013 185918 184182 181631 178627 175823 173908 173037 172356 170716 167993 165104 162664 160477
53759 160477 158432 156856 155637 154028 151813 149658 147806 145578 142863 140918 140663 141192 141134 140691 141034 142211
53743 142211 142979 142485 141017 139219 137463 135903 134406 132550 130284 128248 126851 125585 123984 122715 122710
53728 122710 123660 124357 124210 123458 122235 120569 119087 118560 118771 118897 118995 119993 122039 123995 124955 125320 125918
53711 125918 126796 127515 128085 129005 130595 132691 134961 137259 139668 142201 144562 146405 147875 149488 151343
53696 151343 152982 154385 156497 160136 164816 169323 173153 176658 180132 183549 187079 191007 195083 198621
53682 198621 201281 203217 204494 205032 205172 205661 206900 208611 210336 211834 212938 213476 213432 212898 211821 210108
53666 210108 207922 205670 203748 202520 202265 202787 203329 203303 202934 202820 203101 203433 203519 203209 202355 201084 199973
53649 199973 199418 199046 198289 197306 196724 196659 196665 196575 196710 197190 197653 197746 197500 197087 196560 195962 195442 195266 195767 197006
53629 197006 198326 198691 197917 197254 198178 200779 203782 205992 207327 208602 210713 213897 217500 220613 223090
53614 223090 225620 228679 232014 235416 239231 243571 247748 251223 254490 258224 262134 265562 268742 272485
53600 272485 276941 281621 286392 291503 296801 301834 306644 311690 317098 322706 328564 334587 340006 344121
53586 344121 347389 350900 354932 358993 362945 367003 370762 373474 375281 377043 378795 379565 378935 377716 376782
53571 376782 376276 376267 377090 378509 379416 378978 377481 375699 374102 372912 372206 371564 370310 368468 366865 366030 365618
53554 365618 365199 364871 364757 364582 364177 363874 364019 364632 365728 367365 369167 370494 371363 372507 374228 375976
53538 375976 377419 379080 381350 383663 385366 386815 388862 391631 394511 397140 399770 402817 406527 411012
53524 411012 416270 422258 429070 436794 445096 453365 461540 470364 480538 491957 504026 516347 528785
53511 528785 541259 553896 567169 581546 597179 614102 632378 651757 671553 691278 711272
53500 711272 732408 755256 779721 805295 831459 857955 884836 912189 939757 967006 993587
53489 993587 1019559 1045174 1070703 1096472 1122750 1149437 1176030 1202016 1227212 1251775 1276026
53478 1276026 1300253 1324603 1349279 1374762 1401330 1428142 1453450 1476312 1497734 1519379 1541468
53467 1541468 1562625 1581634 1598471 1613672 1627537 1640176 1651751 1662371 1672096 1680978 1688697 1694299
53455 1694299 1696776 1695809 1691552 1684037 1673524 1661108 1648054 1634577 1620057 1604290 1587616 1569951
53443 1569951 1550736 1529946 1508099 1485159 1460506 1434277 1407690 1381619 1355772 1329647 1303400
53432 1303400 1277337 1251483 1226206 1202514 1181123 1161793 1144048 1127892 1113461 1100589 1089101
53421 1089101 1078897 1069447 1060037 1050931 1043484 1038572 1035610 1033655 1032727 1033425 1035928 1040067 1045865 1053426
53407 1053426 1062717 1073971 1087760 1104164 1122390 1141723 1162335 1184664 1208532 1233420 1259117
53396 1259117 1285637 1313027 1341753 1372713 1406327 1442109 1479619 1519223 1561384 1605862 1652285
53385 1652285 1700960 1752325 1806030 1861277 1917775 1975670 2034870 2094995 2155748 2216808 2277698
53374 2277698 2338235 2398720 2459238 2519129 2577578 2634231 2688733 2740202 2787788 2831252 2870382
53363 2870382 2904379 2932643 2955775 2975047 2991090 3003735 3012681 3017502 3017244 3010943 2998602 2981139
53351 2981139 2959476 2934187 2905729 2874309 2839449 2800243 2756128 2707218 2654170 2598095 2540287
53340 2540287 2481655 2422682 2364157 2307335 2252826 2199854 2147372 2095479 2045009 1996093 1948004
53329 1948004 1900307 1853350 1807637 1763385 1720749 1679944 1641083 1604208 1569439 1536828 1506376
53318 1506376 1478527 1454185 1433688 1416037 1399670 1383669 1367698 1351270 1333987 1316351 1299587
53307 1299587 1284556 1271302 1259509 1248861 1239137 1230483 1223436 1218257 1214447 1211399 1209134 1207843 1207161
53294 1207161 1206704 1206999 1209022 1212953 1218215 1224650 1232756 1242768 1254401 1267679 1283213 1301385 1321847
53281 1321847 1344115 1368152 1394145 1422079 1451635 1482154 1512576 1541784 1569161 1594739 1618974
53270 1618974 1642567 1666110 1689327 1710882 1729428 1744780 1757621 1768437 1777307 1784432 1790071 1794016
53258 1794016 1795739 1795013 1791798 1785789 1776814 1765514 1752775 1738482 1721706 1702121 1680350 1656764
53246 1656764 1630956 1602861 1573511 1544079 1514693 1484744 1453999 1422943 1392288 1362537 1333795
53235 1333795 1305712 1277754 1249724 1221918 1194721 1168342 1142932 1118621 1095338 1072891 1051322
53224 1051322 1030813 1011174 991841 972552 953730 936005 919641 904602 890892 878596 867663
53213 867663 857817 848597 839456 829892 819519 808039 795361 781859 768323 755365 742975 730730
53201 730730 718235 705171 691320 676906 662668 649252 636761 625134 614467 604497 594280 583096
53189 583096 571361 559930 548734 536913 524146 510973 497801 484471 471004 457925 445536
53178 445536 433496 421541 410095 399756 390531 381905 373458 365150 357237 350054 343724 337973 332373
53165 332373 326743 321132 315555 310041 304769 299731 294476 288655 282788 277869 274209 271157 268008 264681
53151 264681 261400 258232 255151 252208 249486 247064 244999 243055 240642 237501 234341 232255 231466 231113 230255
53136 230255 228642 226558 224455 222785 221657 220630 219328 218219 218138 219038 219933 220136 219883 219540 218987 218220
53120 218220 217870 218556 220062 221596 222563 222876 222895 223343 224885 227365 229743 231204 232094 233458 235764 238399
53104 238399 240299 240823 240024 238328 236069 233369 230361 227263 224128 220740 216994 213162 209566 206202 203037
53089 203037 200331 198233 196288 193830 190756 187456 184213 181180 178666 176757 174819 172108 168798 165730
53075 165730 163247 160987 158749 156655 154417 151431 147906 145065 143797 143723 143895 143784 143276 142337 141147 140122
53059 140122 139487 139138 138982 138978 138861 138453 138216 138683 139247 138553 136375 134107 132890 132239 131144 129643 128467
53042 128467 127837 127529 127608 128194 128798 128700 127786 126418 124744 122788 120960 119794 119276 118985 118782 118849 119196 119556
53024 119556 119728 119652 119281 118624 117768 116700 115377 114139 113478 113182 112343 110676 109180 108838 109255 109366 108990
53007 108990 108788 109054 109545 110298 111583 112997 113652 113484 113508 114448 115818 116719 116876 116483 115612 114358 113193
52990 113193 112644 112731 113115 113689 114659 116075 117566 118586 118847 118521 118109 118072 118568 119537 120927 122701 124688
52973 124688 126706 128829 131266 133863 136065 137602 139050 141357 144868 149134 153662 158482 163707 168923
52959 168923 173449 177141 180401 183294 185224 185784 185554 185490 185733 185584 184645 183414 182517 181768 180318 177588
52943 177588 173871 170090 167060 164879 162946 160590 157682 154659 152067 150240 149233 148814 148574 148228 147742
52928 147742 147128 146355 145597 145197 145102 144792 144161 144047 145228 147263 149072 150400 151799 153326 154331 154634 154882
52911 154882 155398 155596 155003 154059 153373 152931 152666 153150 154897 157336 159225 159908 159661 159010 158252 157601 157330 157680
52893 157680 158748 160312 161782 162634 163029 163618 164649 165745 166734 168051 169911 171655 172483 172393 171963 171580
52877 171580 171400 171705 172667 173949 175015 175632 175776 175405 174824 174881 176072 177653 178319 177728 176729 176064 175478 174320
52859 174320 172596 171071 170513 171030 172097 173164 174238 175766 177988 180590 183116 185513 188152 191453 195572
52844 195572 200254 204919 209141 213128 217464 222318 227203 231529 234969 237240 238050 237509 236119 234111 231265
52829 231265 227646 223994 220985 218485 215950 213230 210674 208725 207626 207134 206343 204265 200882 197164 193839
52814 193839 190752 187653 184792 182269 179582 176530 173857 172144 170675 168389 165537 163384 162474 162153 161703
52799 161703 161000 159987 158367 156065 153539 151425 150174 149850 149854 149151 147351 145369 144370 144288 144046 143052 141658
52782 141658 140244 138802 137576 137202 137768 138335 137833 136074 133630 131080 128690 126533 124599 122795 120911
52767 120911 118647 115894 113119 111175 110447 110448 110574 110816 111234 111232 110186 108569 107553 107416 107197 106086 104384
52750 104384 102741 101167 99301 97245 95499 94242 93110 91745 90334 89439 89318 89511 89275 88445 87569 87107
52734 87107 86853 86450 86098 86318 87167 88087 88443 87958 86812 85631 85127 85432 85935 86007 85588 84795 83521 81851
52716 81851 80396 79539 78752 77333 75509 74129 73519 73355 73382 73549 73651 73647 74136 75706 77963 80023 81828
52699 81828 84028 86697 89187 91342 93797 96881 100154 103293 106530 109857 112692 114757 116529 118386
52685 118386 119997 120976 121413 121372 120565 119055 117606 116742 115967 114507 112331 109909 107392 104630 101675 98678
52669 98678 95513 92030 88510 85447 83070 81367 80349 79864 79376 78361 76867 75368 74162 73227 72593
52654 72593 72526 73244 74520 75611 75683 74467 72552 70920 70230 70610 71864 73560 75078 76027 76568 76967 76935
52637 76935 75947 74108 72179 70786 70150 70507 71995 74006 75413 75742 75518 75187 74452 73061 71561 70692
52621 70692 70489 70544 70720 71096 71549 71881 72119 72236 71855 70782 69618 69310 70134 71518 72777 73723 74519 75290
52603 75290 75957 76362 76601 77206 78729 80998 83059 84071 84077 83740 83537 83432 83156 82559 81754 81104 80997 81560
52585 81560 82657 84125 85851 87633 89224 90565 91768 92882 93881 94868 95975 97063 97841 98244 98436 98468
52569 98468 98371 98548 99598 101613 104066 106452 108704 110898 112942 114693 116074 117085 117969 119251 121156
52554 121156 123116 124408 125103 125768 126437 126712 126800 127416 128533 129270 129351 129639 130701 131855 132390 132824 134062
52537 134062 135907 137264 137411 136358 134445 132379 131268 131727 133139 134442 135387 136388 137510 138425 139165
52522 139165 140064 140973 141297 140822 139923 138959 138077 137558 137649 137893 137345 135765 134146 133681 134463 135425 135416 134155 132285
52503 132285 130701 129823 129484 129385 129497 129989 131010 132624 134649 136426 137135 136633 135768 135550 136164 137053 137748
52486 137748 138312 139040 140033 141079 141886 142476 143276 144618 146260 147713 148969 150370 151775 152580 152737 153026
52470 153026 153902 154810 155173 155443 156413 157967 159225 159729 159783 159804 159939 160181 160365 160166 159595 159307 159944 161305
52452 161305 162647 163644 164588 165821 167419 169245 170857 171605 171373 170951 171163 171883 172524 173196 174507 176342
52436 176342 177794 178469 178997 179860 180463 179968 178613 177594 177737 178709 179579 179915 180114 180719 181562 181849 181075 179625
52418 179625 178343 177780 177914 178216 177820 176134 173647 171639 170665 169836 168173 166212 165359 165866 166454 166021 164897
52401 164897 164088 163939 164015 163931 163829 164118 164995 166238 167430 168348 169050 169539 169644 169377 169094 169049 169110 169219 169741
52382 169741 170896 172205 173072 173691 174748 176396 178123 179533 180670 181594 182283 182963 184037 185601 187442
52367 187442 189456 191625 193689 195432 197231 199690 202676 205326 207140 208507 210013 211744 213531 215411
52353 215411 217520 219804 222041 224052 225890 227932 230621 233803 236655 238639 240242 242193 244262 245656
52339 245656 246430 247598 249738 252334 254686 256704 258574 260361 262258 264536 266932 268760 269961 271375
52325 271375 273590 276191 278594 280935 283555 286200 288464 290641 293461 297217 301709 306766 312254 317760
52311 317760 322905 327891 333277 339293 345812 352900 360890 369887 379665 390102 401341 413390 425975
52298 425975 438998 452872 468089 484488 501243 517715 534172 551436 569853 588942 608165
52287 608165 627592 647367 666859 685065 701892 718377 735464 753082 770614 787677 803997
52276 803997 819064 832524 844664 855978 866368 875248 882343 887929 892294 895404 897241 898051 897987 896727
52262 896727 893730 888948 883115 877216 871711 866399 861016 855713 850784 846178 841648 837349 833912 831834
52248 831834 831086 831418 832785 835323 839127 844223 850605 858197 866884 876636 887457 899172 911440 923987
52234 923987 936650 949257 961708 974128 986593 998688 1009711 1019422 1028222 1036440 1043747 1049543
52222 1049543 1053609 1056148 1057353 1057150 1055280 1051565 1046218 1039881 1033053 1025430 1016165 1004918 992355 979447
52208 979447 966598 953615 940145 925872 910657 894880 879430 864979 851435 838426 826131
52197 826131 815231 806055 798161 790817 783655 776833 770778 765859 762087 759062 756266 753434 750600 747829
52183 747829 745085 742386 739942 737947 736246 734359 731943 729165 726468 724063 721900 720107 719006 718520
52169 718520 717969 716818 715281 713734 711857 708990 705237 701525 698507 695965 693428 690753 687929 684938
52155 684938 682135 680220 679353 678683 677239 675037 672885 671311 670101 668732 666788 664022 660442 656474 652746
52140 652746 649568 646749 644011 641375 638973 636623 633890 630745 627820 625637 623651 620709 616622 612705
52126 612705 610205 608702 606745 603754 600429 597470 594892 592702 591281 590728 590641 590984 592474 595537 599571
52111 599571 603812 608419 613999 620520 627459 634778 642980 652252 662213 672600 683719 696098 710033
52098 710033 725529 742422 760535 779894 800749 823238 847143 872087 897728 923587 948943
52087 948943 973227 996375 1018528 1039619 1059508 1078308 1096215 1113122 1128657 1142433 1154031
52076 1154031 1162981 1169128 1172864 1174699 1174789 1173153 1170050 1165714 1159875 1152053 1142273 1131140 1119287 1107100
52062 1107100 1094853 1082647 1070294 1057704 1045406 1034257 1024581 1015974 1008049 1000948 995026 990365
52050 990365 986786 984071 982053 980714 980360 981454 984078 987792 992250 997822 1005231 1014590 1025013 1035329
52036 1035329 1044993 1054165 1063106 1071869 1080509 1089132 1097517 1105055 1111379 1116733 1121368 1124937 1127025 1127935
52022 1127935 1128231 1127602 1125056 1120296 1114041 1106757 1097973 1087321 1075414 1063045 1050133 1036167 1021166
52009 1021166 1005432 988725 970526 950942 930663 910146 889441 868662 847991 827294 806251
51998 806251 784800 763034 740853 718224 695576 673399 651737 630628 610676 592350 574910
51987 574910 556925 537870 518446 499371 480776 462804 445811 429684 413940 398843 385503
51976 385503 374302 364046 353412 342603 332778 324391 316887 309717 302802 296116 289586 283421 277959
51963 277959 273054 268162 263140 258497 254685 251480 248276 244726 240904 237086 233622 230851 228885 227401
51949 227401 225822 223793 221425 219010 216579 213891 210904 208031 205792 204272 203146 202149 201300 200692 200348
51934 200348 200303 200615 201139 201531 201535 201128 200271 198778 196607 194136 191902 190102 188516 186890 185250 183790 182567
51917 182567 181389 180027 178468 176885 175366 173800 172128 170588 169498 168844 168293 167636 167016 166594 166162 165254
51901 165254 163609 161447 159256 157372 155814 154485 153372 152483 151660 150692 149621 148714 148057 147404 146579 145766
51885 145766 145161 144563 143683 142735 142335 142732 143444 143789 143590 143216 143072 143134 143029 142541 142015 142054 142776 143627 144176
51866 144176 144795 146145 148081 149592 149975 149730 150038 151575 153998 156441 158279 159480 160460 161707 163534
51851 163534 166034 169112 172462 175635 178307 180436 182068 183081 183278 182709 181763 180949 180600 180670 180730 180262 179136
51834 179136 177750 176618 175940 175611 175461 175344 175170 175062 175350 176218 177457 178657 179528 179988 180206 180624 181615
51817 181615 182923 183856 184198 184490 185116 185646 185552 184985 184215 182864 180613 178290 177217 177516 178030 177930 177421
51800 177421 176811 175962 175027 174679 175011 175053 174102 172815 172306 172704 173375 174083 175091 176423 177805 179228 180854
51783 180854 182446 183518 184034 184418 184926 185522 186278 187273 188160 188459 188355 188574 189327 190022 190280 190567 191380 192389
51765 192389 193034 193599 194936 197196 199555 201396 203165 205673 208978 212490 216015 220119 225315 231326 237464
51750 237464 243550 250175 258117 267723 278686 290143 301001 310472 318359 324635 328771 329889 327784
51737 327784 323525 318722 314283 310189 306300 302937 300488 298805 297387 296112 295425 295662 296417 296846 296495
51722 296495 295638 294864 294633 295154 296204 296864 295934 293119 289606 286913 285180 283112 279712 275547 272024 269803
51706 269803 268401 267146 265995 265271 265039 265039 265082 265189 265373 265584 265920 266615 267605 268417 268772 269033 269640 270314 270517
51687 270517 270675 272139 275558 280017 284372 288925 294950 302733 310738 316756 319388 318583 315420 311535 308264
51672 308264 305987 304409 303387 303204 304159 306221 309064 312111 314687 316484 317759 318743 319113 318488 317114
51657 317114 315362 312821 308796 303596 298355 293425 287947 281373 274495 268444 263432 259064 255200 251778
51643 251778 248356 244558 240723 237451 234813 232526 230571 228948 227107 224336 220676 216912 213715 211260
51629 211260 209568 208642 208174 207593 206570 205243 203965 203077 202843 203267 203940 204310 204112 203427 202451 201394 200405
51612 200405 199392 198069 196460 195149 194771 195402 196689 198317 200039 201532 202648 203623 204630 205267 204985
51597 204985 203936 202922 202532 202773 203576 205188 207868 211503 215665 219934 224154 228515 233385 238940 245054
51582 245054 251556 258334 265005 270887 275687 279889 283959 287434 289427 289862 289494 288708 287090 284356 281017
51567 281017 277687 274290 270461 266382 262723 259887 257751 256105 255010 254667 255151 256335 258015 260074 262545
51552 262545 265586 269414 274223 279938 285914 291124 294976 297920 300945 304463 307911 310436 311708 312055
51538 312055 312063 312146 312294 312192 311739 311357 311593 312449 313463 314415 315595 317293 319438 321917 324802 327991 330816
51521 330816 332398 332359 331043 329111 327036 324875 322404 319529 316568 313948 311599 308809 304808 299394 292994
51506 292994 286428 280630 276200 272880 269677 265820 261556 257786 255035 253014 251135 249141 247263 245943
51492 245943 245478 245733 246141 246146 245736 245477 245943 247208 248885 250513 251830 252776 253500 254420 256071 258682 261890
51475 261890 265083 268116 271574 276179 282009 288443 294826 300950 306923 312808 318632 324610 331109 338252
51461 338252 345629 352521 358477 363680 368677 373739 378555 382583 385619 387884 389626 390817 391324 391240 390894
51446 390894 390556 390320 390340 391000 392546 394470 395618 395234 393840 392711 392454 392398 391507 389448 386524 382911 378448
51429 378448 373094 367123 360834 354361 347842 341503 335437 329557 323851 318500 313641 309176 304943 300971
51415 300971 297446 294570 292508 291352 291046 291454 292561 294538 297497 301249 305309 309135 312410 315308 318446
51400 318446 322356 326844 331091 334467 337062 339171 340445 339965 337182 332519 326902 320926 314604 307797
51386 307797 300585 293177 285649 277951 270150 262505 255242 248320 241547 234924 228752 223306 218486 213919
51372 213919 209426 205210 201554 198455 195646 192868 189953 186756 183260 179703 176372 173271 170267 167599
51358 167599 165817 164961 164211 162803 161091 160141 160276 160579 160043 158748 157622 157314 157661 158065 158053 157485 156573
51341 156573 155795 155680 156533 158215 160188 161812 162842 163674 164983 167089 169711 172311 174439 175839 176570
51326 176570 177152 178359 180649 183953 188023 192716 197787 202757 207257 211403 215593 220013 224409 228216
51312 228216 230829 232001 232076 231567 230409 228004 224192 219808 215851 212393 208739 204441 199715 194903 189986
51297 189986 184718 179029 173260 168119 164186 161250 158397 155142 152188 150541 150066 149602 148560 147718 148055
51282 148055 149338 150350 150268 149352 148389 147881 147828 147908 147633 146542 144566 142260 140420 139278 138237 136586 134427
51265 134427 132591 131724 131735 132172 132705 133119 133198 132966 132773 132879 133141 133354 133622 134148 134858 135457 135626 134977 133279
51246 133279 131067 129559 129387 129755 129469 128548 128028 128335 128732 128468 127655 126711 125683 124593 123905 124101 125003
51229 125003 125930 126349 126117 125370 124532 124223 124767 125742 126300 125969 125095 124505 124811 125994 127576 129183 130828
51212 130828 132623 134400 135820 136769 137362 137695 137940 138609 140187 142334 143877 143929 142822 141652 141058 140773
51196 140773 140328 139816 139667 139837 139675 138865 138146 138511 139760 140485 139809 138575 138298 139330 140600 140935 140085
51179 140085 138610 137335 136889 137285 137970 138560 139300 140391 141277 141280 140705 140501 140954 141482 141618 141346 140470 138645
51161 138645 136222 134145 132731 131406 129927 128864 128459 127991 126988 126176 126323 126829 126387 124627 122279 120107
51145 120107 118483 117688 117764 118228 118659 119366 120820 122667 124127 125179 126466 128118 129564 130642 131960 133853
51129 133853 135745 136956 137530 137765 137523 136558 135231 134247 133785 133336 132424 131094 129542 127622 125020 121890
51113 121890 119067 117443 117199 117777 118508 119087 119480 119743 120021 120473 120993 121268 121260 121334 121710 122072 122091 122120 122943 124945
51093 124945 127778 130749 133202 134692 135207 135317 135867 137416 139992 143081 145678 146756 146141 144791 143683
51078 143683 142611 140649 137775 135324 134621 135671 137496 139277 140751 141881 142733 143619 144872 146387 147654
51063 147654 148344 148638 148883 149143 149281 149310 149419 149649 149889 150255 151155 152692 154298 155408 156316 157816 159935
51046 159935 161655 162179 161979 162144 163017 164049 164774 165370 166185 167160 167873 167980 167553 167112 167305 168280 169427 169938
51028 169938 169645 169171 169304 170401 172257 174248 175586 175734 174758 173248 171902 171201 171307 172083 173246 174682
51012 174682 176527 178837 181327 183652 185823 188099 190538 192958 195322 197924 201129 205019 209285 213375
50998 213375 216889 220008 223406 227564 232271 237028 241827 247220 253696 261224 269417 277881 286399 295039
50984 295039 304133 313989 324677 336275 349260 364329 381804 401475 423116 446935 473431 502969
50972 502969 535693 571756 611499 655353 703554 756054 812713 873484 938140 1005919 1075771
50961 1075771 1147104 1219885 1293744 1367243 1438341 1505280 1566691 1621119 1667108 1703796 1731022
50950 1731022 1748806 1757135 1756335 1747289 1731155 1709104 1682478 1652934 1622187 1591653 1562349 1534958
50938 1534958 1509848 1487023 1466081 1446252 1426618 1406406 1385014 1361813 1336208 1308017 1277508
50927 1277508 1244760 1209257 1170407 1128323 1083775 1037530 990093 942012 894107 847389 802900
50916 802900 761435 723129 687537 654451 624444 598197 575546 555650 537965 522517 509308
50905 509308 498106 488821 481576 476299 472705 470690 470245 470920 471977 473281 475460 478878 482920 486611
50891 486611 489590 492150 494618 497043 499353 501514 503614 505860 508363 510961 513546 516527 520554 525751
50877 525751 531698 538240 545749 554313 563278 572092 581207 591653 603936 617903 633460 650889 670429
50864 670429 692043 715732 741828 770862 803401 840106 881807 929358 983479 1044823 1114211
50853 1114211 1192690 1281235 1380308 1489824 1609566 1739437 1879073 2027432 2183085 2344819
50843 2344819 2511514 2681338 2851352 3017881 3176826 3323461 3452505 3559101 3639991 3693949
50833 3693949 3721387 3723706 3702844 3661227 3601996 3529065 3446675 3358987 3270298 3185255 3108071
50822 3108071 3041251 2985359 2939938 2903985 2875342 2850305 2824481 2794004 2756042 2708781 2651450
50811 2651450 2584081 2506915 2420207 2324720 2221955 2113627 2001366 1887250 1774060 1664409
50801 1664409 1559911 1461682 1371213 1289977 1218336 1155512 1100690 1053539 1013706 980490 953380
50790 953380 932455 917880 909205 905441 905743 909726 917102 927138 938650 950579 962459 974136 985152
50777 985152 994695 1002120 1007101 1009255 1008194 1004221 998467 991832 984111 974608 963260 950657 937200
50764 937200 922886 907850 892603 877675 863429 850191 838120 827052 816952 808591 803248 801643
50752 801643 803517 808291 815725 825881 838995 855598 876332 901263 929588 960239 992720 1027401
50740 1027401 1065298 1107602 1155091 1207873 1265895 1329712 1400373 1478540 1564147 1657029 1757165
50729 1757165 1863870 1975131 2088223 2200679 2310236 2414204 2509610 2593978 2665389 2721755
50719 2721755 2760583 2779783 2778447 2756819 2715995 2658115 2586607 2505837 2420365 2334479 2252027
50708 2252027 2176082 2108533 2050071 2000589 1959546 1926088 1899142 1877472 1859441 1842634 1823991
50697 1823991 1800515 1769936 1730892 1683073 1627472 1566104 1500850 1432674 1362362 1291889 1224313
50686 1224313 1162076 1105812 1055051 1009575 969631 935282 906275 882582 864512 852111 844813
50675 844813 841959 843499 850023 862138 879888 902733 929968 961066 995500 1032279 1069892 1106876
50663 1106876 1142323 1175754 1206720 1234804 1259903 1282224 1302000 1319338 1334270 1346819 1357129
50652 1357129 1365694 1373357 1380822 1388273 1395739 1403720 1413156 1424853 1439339 1457193 1479035 1505011 1534699
50639 1534699 1567733 1604223 1644289 1687440 1732621 1778700 1824709 1869855 1913464 1954683 1992091
50628 1992091 2024031 2049772 2070083 2086131 2097996 2104890 2106872 2105675 2103614 2102234 2102492 2105742 2113873
50615 2113873 2128383 2149651 2176947 2208691 2242648 2276329 2307557 2334704 2356580 2372391 2381834
50604 2381834 2384815 2380987 2369785 2350972 2324716 2290845 2248355 2196055 2133739 2062566 1984531 1901841
50592 1901841 1816621 1730815 1646149 1564167 1486095 1412482 1343151 1277811 1216651 1160141 1108399
50581 1108399 1061087 1017888 978770 943805 912984 886149 862927 842867 825981 812908 804038
50570 804038 798604 795289 793789 795061 799770 807178 816059 826235 838640 854139 872782 894066 917452
50557 917452 942636 969717 999133 1031214 1065847 1102785 1142171 1184436 1229684 1277298 1326080
50546 1326080 1374596 1421510 1465888 1507275 1545498 1580573 1612926 1643496 1673413 1703617 1734876
50535 1734876 1767981 1803684 1842500 1884628 1929970 1978252 2029441 2084163 2143382 2207499 2276091
50524 2276091 2348746 2425631 2506804 2591286 2677429 2764038 2850569 2936216 3019202 3096934 3166477
50513 3166477 3225026 3270572 3302311 3320026 3322959 3309738 3279686 3233869 3174580 3104036 3023991
50502 3023991 2936550 2844966 2753423 2666074 2586443 2517557 2462052 2421587 2396225 2384860 2386359
50491 2386359 2399861 2423888 2455968 2493644 2535182 2578488 2619608 2653267 2674883 2681395 2670260
50480 2670260 2638900 2585956 2512666 2422506 2319734 2208513 2092832 1976295 1861635 1750675
50470 1750675 1644806 1545361 1453501 1369925 1294712 1227337 1166894 1112519 1063812 1020866 983809
50459 983809 952244 925234 901980 882448 867187 856513 850137 847533 848284 851892 857709 865483 875717
50446 875717 889056 905426 924141 944702 967118 991543 1018012 1046485 1076736 1108183 1140236
50435 1140236 1172795 1206157 1240465 1275529 1311037 1346537 1381307 1414710 1446636 1477187 1506128
50424 1506128 1533265 1559186 1584713 1609493 1631999 1651346 1668456 1685017 1702006 1719879 1739549
50413 1739549 1762257 1788594 1818287 1850886 1886109 1923460 1961982 2000489 2037853 2073160 2105889
50402 2105889 2135828 2162528 2184984 2202235 2214118 2220934 2222222 2216298 2201214 2175920 2140378 2094909
50390 2094909 2039869 1975942 1904473 1827369 1746837 1665274 1585198 1508872 1437827 1372887 1314751
50379 1314751 1264355 1222488 1189382 1165023 1149766 1144107 1147721 1159097 1176279 1197719 1222231 1248351
50367 1248351 1273910 1296084 1311869 1318957 1316456 1304754 1284654 1256965 1222976 1184743 1144388 1103139
50355 1103139 1061362 1019424 978171 938609 901454 867104 835884 808065 783609 761990 742500
50344 742500 724838 709254 695972 684652 674676 665779 658085 651738 646960 644285 644092 645825 648404
50331 648404 651652 656744 664854 675910 689000 703434 718867 734897 751268 768279 786353 805307
50319 805307 824563 843965 863852 884341 905038 925533 945849 966391 987704 1010139 1033392
50308 1033392 1056412 1078061 1097815 1115618 1131314 1144721 1156092 1166009 1174758 1182173 1187946 1191636
50296 1191636 1192527 1190115 1184881 1178095 1170760 1163103 1154998 1146210 1136023 1123236 1106868 1086638 1062672
50283 1062672 1035346 1005678 975286 945447 916477 888335 861408 836212 812668 790238 768636
50272 768636 747900 727879 708235 689053 671049 654999 641203 629571 619971 612345 606617 602548
50260 602548 599669 597444 595641 594462 594122 594451 595148 596245 597916 599871 601468 602555 603714 605378 607106
50245 607106 608132 608354 608260 607994 607007 604793 601607 598230 595197 592366 589122 584918 579778 574353 569368
50230 569368 564998 560932 557044 553677 551074 548819 546202 543104 540258 538591 538445 539479 541148 543194
50216 543194 545765 549177 553617 559021 565120 571455 577453 582667 586977 590444 593037 594748 595833 596503
50202 596503 596331 594559 591246 587619 584822 582687 580213 576855 572790 568290 563618 559399 556239 553870
50188 553870 551344 548210 544865 541634 538242 534460 530538 526533 521793 515719 508676 501702 495595 490666
50174 490666 487028 484607 483080 482218 482161 483007 484390 485790 487071 488285 489158 489144 487886 485333 481575 476844
50158 476844 471430 465368 458475 450996 443833 437724 432503 427677 423358 420019 417642 415787 414358 413540
50144 413540 413016 412073 410615 409363 408729 408109 406734 404792 403274 402943 403786 405343 407284 409653 412614 416003
50128 416003 419293 422232 425349 429477 434791 440661 446413 451856 457058 462086 467082 472254 477610 482984
50114 482984 488383 493935 499404 504182 507954 511029 513833 516399 518593 520515 522396 524299 526081 527454
50100 527454 528047 527766 527219 527390 528634 530386 532129 534158 536945 540200 543299 546436 550587 556213 562654
50085 562654 569101 575609 582693 590266 597573 604199 610695 617991 626469 635811 645627 655919 666933 678787
50071 678787 691329 704242 717144 729646 741410 752228 762115 771437 780776 790456 800248 809876 819680
50058 819680 830266 841390 851779 860417 867499 873696 879046 883286 886878 890826 895439 900050 903922
50045 903922 906766 908323 908307 907045 905442 903991 902355 900289 898300 897003 896402 896395 897482 900437 905640 913308
50029 913308 924012 938340 956380 978169 1004423 1036051 1072923 1113599 1156144 1198578 1238605
50018 1238605 1273833 1302777 1325386 1342448 1354940 1364133 1371796 1379751 1389295 1401142 1415515 1431831
50006 1431831 1448333 1462339 1470952 1471569 1462120 1441431 1409653 1368212 1319156 1264528 1206316 1146700
49994 1146700 1087906 1031556 978350 928588 882859 841823 805339 772328 741824 713815 688713
49983 688713 666292 645765 626840 610018 595651 583188 571746 561123 551797 544057 537549 531705
49971 531705 526340 521710 518177 515886 514540 513389 511634 509075 506275 503895 501883 499507 496214 492239
49957 492239 488260 484627 481144 477561 474050 471062 468767 466741 464280 461081 457561 454469 452267 450970
49943 450970 450479 450745 451574 452626 453804 455432 457840 461015 464887 469696 475690 482646 490104 498073 507084
49928 507084 517540 529286 541850 554740 567564 580263 593349 607536 623041 639594 657222
49917 657222 676656 698741 723792 751732 782659 817018 855408 898399 946430 999770 1058528
49906 1058528 1122432 1190136 1258868 1325342 1387256 1443636 1493935 1537699 1575463 1609273 1641591
49895 1641591 1673971 1707071 1741378 1777104 1813510 1848772 1880382 1905327 1920317 1922631 1911003
49884 1911003 1885605 1847539 1798667 1741489 1678465 1611468 1542195 1472611 1404264 1337355 1271246
49873 1271246 1205875 1142075 1080654 1022014 966724 915634 869107 826765 788283 753829 723476
49862 723476 696688 672774 651391 632354 615416 600575 588086 577776 568746 560136 551797 543844
49850 543844 535966 527737 519303 511165 503416 495691 487811 480003 472493 465231 458029 450722 443268 435979
49836 435979 429513 424243 419745 415291 410868 407244 404907 403339 401588 399333 397085 395446 394419 393495
49822 393495 392307 391042 390192 389987 390286 390986 392289 394348 396936 399716 402739 406344 410653 415472 420650
49807 420650 426157 431752 436963 441661 446418 452046 458895 466758 475297 484321 493749 503634 514284 526225
49793 526225 539965 555854 574186 595263 619384 646915 678401 714411 755087 799881 847775
49782 847775 897578 947810 996410 1040889 1079036 1109573 1132371 1148357 1159280 1167354 1174864 1183917
49770 1183917 1196170 1212208 1230886 1249567 1265293 1275704 1278753 1272031 1253166 1221193 1177361 1124494
49758 1124494 1065717 1003769 941115 880203 823302 771925 726367 685979 650140 618886 592459
49747 592459 570406 551534 534796 519879 506838 495546 485718 477254 470207 464531 460038 456515 453766
49734 453766 451640 450133 449241 448663 447871 446741 445866 445957 446993 448210 448747 448105 446216 443548 441065 439550
49718 439550 438779 437683 435487 432377 429033 425925 423410 422057 422230 423381 424255 424031 422954 421773 420876
49703 420876 420268 420098 420657 421812 422903 423483 423948 425045 426844 428560 429493 429857 430521 432057 434259 436454
49687 436454 438077 439046 439755 440754 442255 443974 445544 446996 448586 450179 451127 450995 450206 449754 450291 451673
49671 451673 453329 454858 456249 457695 459353 461254 463285 465203 466690 467553 467986 468540 469639 471070 472132
49656 472132 472424 472330 472518 473119 473661 473773 473590 473412 473307 473226 473172 473035 472526 471638 471027 471452 472835 474218 474792
49637 474792 474670 474579 475102 476329 477983 479655 481120 482580 484401 486466 488054 488667 488793 489491 491288 493813
49621 493813 496522 499408 502857 507015 511571 516101 520482 524933 529717 534828 540015 545064 549997 555002
49607 555002 560316 566205 572842 580151 587941 596342 605862 616742 628406 639870 650706 661373 672661
49594 672661 684965 698049 711298 724223 736965 750257 764692 780123 796020 812319 829538
49583 829538 848119 868038 889150 911495 935171 960150 986380 1013775 1042023 1070689 1099657
49572 1099657 1129244 1159741 1191066 1222972 1255316 1288055 1321281 1355359 1390647 1426907 1463290
49561 1463290 1499105 1534257 1568753 1602237 1634403 1665475 1695814 1725252 1753186 1779116 1802688
49550 1802688 1823471 1841197 1856105 1868607 1878688 1886081 1890898 1893576 1894209 1892499 1888481 1882836 1876322
49537 1876322 1869283 1861870 1854325 1846820 1839360 1832099 1825552 1820217 1816161 1813178 1811308 1811014 1812905 1817302
49523 1817302 1823988 1832407 1842232 1853699 1867278 1883120 1901071 1920936 1942271 1963990 1984851 2004554
49511 2004554 2023752 2042717 2060527 2076016 2088988 2099791 2108023 2112518 2112688 2109230 2103253 2095133 2084447
49498 2084447 2070628 2053351 2032562 2008446 1981313 1951316 1918413 1882819 1845359 1807067 1768411
49487 1768411 1729137 1688896 1647866 1606751 1566355 1527225 1489484 1452815 1416697 1380870 1345601
49476 1345601 1311429 1278731 1247636 1218178 1190256 1163502 1137580 1112746 1089763 1069010 1049864
49465 1049864 1031249 1012659 994467 977442 962244 949190 938019 927875 917924 908072 898881 890827
49453 890827 883931 878009 872827 867979 863103 858370 854316 851037 848025 845039 842592 841167 840441 839827 839414
49438 839414 839729 840788 842058 843347 845110 847806 851446 855915 861256 867541 874806 883257 893124 904301
49424 904301 916611 930603 947376 966967 987155 1004436 1016337 1022768 1025522 1026932 1028855 1032248
49412 1032248 1037262 1043651 1051167 1059631 1068912 1079130 1090808 1104491 1120119 1136934 1154068 1171081
49400 1171081 1187963 1204801 1221642 1238513 1255313 1271662 1286996 1300991 1313875 1326186 1338204
49389 1338204 1349737 1360567 1370965 1381528 1392526 1403601 1414175 1424053 1433611 1443526 1454328 1466029
49377 1466029 1478141 1490175 1502157 1514518 1527565 1541333 1555907 1571390 1587444 1603356 1618950
49366 1618950 1635018 1652367 1670761 1689441 1708515 1729062 1751719 1775790 1800091 1824201 1848552
49355 1848552 1873655 1899710 1926785 1954915 1983991 2013826 2044400 2075972 2108987 2143911 2181037
49344 2181037 2220296 2261382 2304148 2348743 2395239 2443338 2492669 2543263 2595461 2649362 2704505
49333 2704505 2760090 2815476 2870544 2925610 2980840 3035714 3089409 3141797 3193575 3245025 3295076
49322 3295076 3342254 3386320 3428188 3468221 3505427 3538626 3567664 3593008 3614732 3632546 3646443
49311 3646443 3656623 3662951 3665160 3663546 3658868 3651483 3641147 3627864 3612469 3596135 3579662 3563471
49299 3563471 3547909 3533217 3519452 3506803 3495841 3487063 3480232 3474539 3469553 3465809 3464306 3465560 3469279
49286 3469279 3474967 3482604 3492517 3504640 3518198 3532377 3547068 3562669 3579314 3596696 3614519 3632454
49274 3632454 3649507 3664087 3675100 3682506 3686463 3686483 3681974 3673091 3660234 3643015 3620655 3593303 3561968
49261 3561968 3527097 3488252 3445518 3400247 3353815 3306474 3258135 3209481 3161396 3113779 3066033
49250 3066033 3018476 2972303 2928151 2885628 2844297 2804238 2765419 2727451 2690465 2655555 2623708
49239 2623708 2594641 2567094 2539966 2512787 2485443 2457996 2430721 2404004 2378143 2353322 2329566
49228 2329566 2306656 2284371 2262955 2243018 2224801 2207948 2192190 2177893 2165527 2154936 2145526
49217 2145526 2136924 2129100 2122058 2115836 2110648 2106640 2103594 2101157 2099147 2097401 2095634 2093908 2092940 2093451
49203 2093451 2095374 2098136 2101455 2105267 2109201 2112967 2117241 2123332 2131763 2141802 2152499 2163513 2174754
49190 2174754 2185927 2196897 2207958 2219424 2231372 2244008 2257672 2272167 2286713 2301115 2316389
49179 2316389 2333615 2352537 2371983 2391336 2410945 2431312 2452616 2474922 2498171 2521839 2545176
49168 2545176 2567967 2590751 2614220 2638721 2664237 2690466 2716944 2743468 2770347 2797820 2825305
49157 2825305 2851833 2877336 2903006 2930103 2958772 2988213 3017602 3046544 3075021 3103364 3132254
49146 3132254 3162450 3194250 3227028 3259144 3288489 3313543 3334174 3351426 3366651 3380955 3395161
49135 3395161 3409697 3424390 3438823 3453000 3467361 3482060 3496658 3510682 3524029 3536692 3548569
49124 3548569 3559838 3570981 3582011 3592099 3600472 3607420 3613894 3620375 3626666 3632561 3638074 3643049 3647178
49111 3647178 3650533 3653538 3656223 3658017 3658573 3658412 3658430 3658986 3659789 3660518 3661284 3662491 3664379 3666742 3669169 3671733
49095 3671733 3675328 3680950 3688540 3696931 3705110 3713118 3721425 3729840 3737672 3744823 3752031 3759909 3768218 3776354
49081 3776354 3784140 3791768 3799288 3806527 3813381 3819833 3825748 3831044 3835941 3840606 3844529 3846777 3847084 3846224
49067 3846224 3844961 3843001 3839443 3833928 3826739 3817878 3806852 3793620 3779096 3764205 3748767 3731779
49055 3731779 3712616 3691540 3669124 3645679 3621359 3596461 3571392 3546488 3522000 3498134 3474906
49044 3474906 3451993 3428936 3405644 3382714 3361108 3341389 3323306 3306250 3290017 3274904 3261075
49033 3261075 3248199 3235874 3224097 3213116 3203097 3194215 3186829 3181172 3176983 3173833 3171710 3170916 3171354
49020 3171354 3172349 3173287 3174207 3175655 3178200 3182085 3187028 3192326 3197421 3202457 3207970 3213963 3219685 3224534 3228792
49005 3228792 3233111 3237595 3241800 3245460 3248682 3251346 3252745 3252124 3249435 3245322 3240373 3234552 3227423 3218869
48991 3218869 3209308 3199152 3188335 3176669 3164494 3152460 3140592 3128037 3113993 3098555 3082319
48980 3082319 3065463 3047628 3028507 3008059 2986216 2962892 2938444 2913777 2889777 2866775 2844626
48969 2844626 2823056 2801785 2780591 2759454 2738534 2717881 2697324 2676919 2657429 2640025 2625310
48958 2625310 2612725 2601152 2590150 2580459 2573204 2568724 2566343 2565224 2565133 2566303 2568856 2572677 2577722 2584181
48944 2584181 2592216 2601670 2612083 2622994 2634345 2646649 2660587 2676320 2693314 2711072 2729913 2750712
48932 2750712 2773827 2798569 2823927 2849674 2876537 2905231 2935513 2966408 2997387 3029018 3062107
48921 3062107 3096387 3130618 3164173 3198002 3233582 3271270 3310251 3349942 3390805 3433722 3479049
48910 3479049 3526491 3575502 3625576 3676470 3728361 3781668 3836580 3892964 3950689 4009745 4069915
48899 4069915 4130680 4191649 4252900 4314699 4377112 4439982 4502994 4565502 4626603 4685719 4743019
48888 4743019 4798961 4853438 4905571 4954288 4998948 5039444 5075876 5108192 5136115 5159506 5178698
48877 5178698 5194232 5206129 5213683 5216107 5213298 5205740 5193862 5177687 5157024 5131911 5102855 5070672
48865 5070672 5035881 4998232 4957073 4912273 4864583 4814991 4764049 4711909 4658563 4603758 4547129
48854 4547129 4488826 4429779 4370899 4312320 4253858 4195922 4139379 4084651 4031592 3980188 3930749
48843 3930749 3883295 3837388 3792798 3749951 3709548 3672139 3638130 3607690 3580409 3555563 3532987
48832 3532987 3513279 3496851 3483227 3471671 3462082 3454763 3449634 3446315 3444925 3446255 3451016 3459206 3470159
48819 3470159 3482900 3496549 3510865 3526600 3544981 3566548 3590559 3615661 3641067 3667122 3694809
48808 3694809 3724743 3756574 3789335 3822382 3855872 3890252 3925495 3961092 3996715 4032547 4068911
48797 4068911 4105766 4142590 4178599 4213168 4246264 4278456 4310215 4341273 4371060 4399850 4428957
48786 4428957 4459468 4491159 4523006 4554438 4585630 4616821 4648022 4679409 4711328 4743645 4775536
48775 4775536 4806233 4835712 4864318 4891981 4918175 4942466 4964705 4984725 5002144 5016489 5027258
48764 5027258 5033871 5035795 5032724 5024484 5010798 4991409 4966440 4936364 4901580 4862273 4818753 4771671
48752 4771671 4721758 4669459 4614927 4558215 4499412 4438773 4376793 4314094 4251254 4188879 4127698
48741 4127698 4068283 4010788 3955382 3902888 3854389 3810018 3768766 3729898 3694076 3662577 3635808
48730 3635808 3613194 3594242 3579002 3567568 3559749 3555304 3553985 3555292 3558654 3563951 3571403 3580849 3591592
48717 3591592 3603133 3615623 3629401 3644446 3660591 3677920 3696584 3716343 3736621 3756984 3777466
48706 3777466 3798432 3820066 3841834 3862511 3881094 3897801 3913949 3930790 3948739 3967757 3988065
48695 3988065 4010158 4034404 4060910 4089643 4120481 4153317 4188239 4225451 4264869 4306082 4348877
48684 4348877 4393559 4440516 4489702 4540775 4593478 4647543 4702415 4757418 4812072 4865931 4918228
48673 4918228 4968091 5015088 5059197 5100174 5137194 5169234 5195652 5216411 5231885 5242435 5247953
48662 5247953 5247778 5241201 5228029 5208598 5183362 5152721 5117114 5076882 5031980 4982248 4928237 4871514
48650 4871514 4813753 4755507 4696099 4634755 4571632 4507703 4443872 4380426 4317211 4254038 4190823
48639 4190823 4127598 4064578 4002113 3940433 3879535 3819483 3760645 3703393 3647616 3592789 3538506
48628 3538506 3484775 3431897 3380286 3330363 3282279 3235731 3190300 3145983 3103134 3061955 3022480
48617 3022480 2985009 2949910 2916840 2884707 2852813 2821580 2791777 2763432 2736000 2709204 2683140
48606 2683140 2657816 2633259 2610012 2588878 2569980 2552517 2535611 2519037 2503044 2487771 2473104
48595 2473104 2458900 2445181 2432174 2420237 2409653 2400480 2392652 2386190 2381172 2377560 2375161 2373724 2372989
48582 2372989 2372757 2373123 2374549 2377524 2382160 2388179 2395191 2402908 2411304 2420712 2431571 2443891 2457220 2471316
48568 2471316 2486467 2502751 2519228 2534405 2547455 2558653 2568767 2578357 2587524 2595808 2602485 2607529
48556 2607529 2612216 2618156 2625611 2633356 2640305 2646597 2652865 2659071 2664670 2669514 2674019 2678577 2683190 2687619
48542 2687619 2691651 2695286 2698814 2702503 2706109 2709029 2711208 2713554 2717022 2721515 2726157 2730537 2735137 2740492
48528 2740492 2746470 2752692 2759359 2767236 2776852 2787968 2799894 2812197 2824959 2838460 2852781 2867794
48516 2867794 2883385 2899541 2916230 2933396 2951150 2969854 2989920 3011501 3034459 3058546 3083613
48505 3083613 3109616 3136501 3164232 3192983 3223228 3255420 3289561 3325177 3361683 3398584 3435347
48494 3435347 3471431 3506633 3541098 3574719 3606673 3635772 3661171 3682594 3700178 3714378 3725730
48483 3725730 3734327 3739624 3741149 3739241 3734764 3728206 3719421 3708181 3694595 3679108 3662458 3645450 3628308
48470 3628308 3610366 3590847 3569840 3547963 3525260 3501119 3475275 3448130 3419918 3390289 3358948
48459 3358948 3326086 3291847 3256014 3218584 3180100 3141087 3101702 3062280 3023633 2986246 2949646
48448 2949646 2913173 2877028 2842103 2809078 2778233 2749845 2724119 2700776 2679124 2658606 2639172
48437 2639172 2621359 2606088 2593867 2583945 2574827 2566045 2558781 2554151 2551476 2549119 2546532 2544512 2543684
48424 2543684 2543882 2545017 2547485 2551394 2556223 2561645 2568001 2575551 2583847 2592287 2600837 2609751 2618923 2628002
48410 2628002 2636990 2646393 2656809 2668465 2681013 2693710 2705995 2717958 2730061 2742489 2755013 2767436
48398 2767436 2779653 2791330 2802071 2812090 2822132 2832409 2842088 2850256 2856978 2862977 2868558 2873326
48386 2873326 2876775 2878668 2878926 2877637 2875194 2872065 2868384 2864043 2859249 2854649 2850762 2847517 2844567 2841871
48372 2841871 2839754 2838420 2837681 2837309 2837510 2838810 2841504 2845449 2850439 2856453 2863337 2870521 2877475 2884337 2891737
48357 2891737 2900032 2909094 2918792 2929184 2940093 2950991 2961619 2972406 2983939 2996266 3008997 3021838
48345 3021838 3034610 3046854 3057860 3067192 3074962 3081470 3086759 3090538 3092519 3092811 3092024 3090845 3089421 3087266
48331 3087266 3083919 3079585 3074960 3070488 3065979 3060896 3054859 3047924 3040502 3033006 3025419 3017301 3008351 2998922
48317 2998922 2989750 2981241 2973253 2965569 2958280 2951494 2944912 2938016 2930753 2923845 2918256 2914373 2911799 2909994
48303 2909994 2908914 2908933 2910250 2912713 2916223 2920884 2926566 2932651 2938703 2945165 2952912 2962030 2971501 2980244
48289 2980244 2988012 2995022 3001103 3005675 3008362 3009106 3007708 3003691 2996734 2986936 2974523 2959590 2942214
48276 2942214 2922462 2900091 2874656 2846354 2816546 2786932 2758106 2729297 2699557 2668894 2638057
48265 2638057 2607565 2577329 2547082 2516846 2486870 2457320 2428173 2399441 2371358 2344266 2318305
48254 2318305 2293335 2269209 2245997 2223778 2202332 2181360 2161013 2141903 2124372 2107942 2091747
48243 2091747 2075398 2059170 2043382 2027912 2012519 1997471 1983562 1971369 1960582 1950281 1939870
48232 1939870 1929579 1919993 1911322 1903359 1895952 1889147 1882824 1876532 1869771 1862235 1853822 1844666 1835205 1825837
48218 1825837 1816406 1806424 1795874 1785355 1775173 1764783 1753574 1741787 1730062 1718308 1705689 1691670
48206 1691670 1676497 1660599 1644097 1627068 1609765 1592274 1574302 1555709 1536999 1518962 1501898
48195 1501898 1485444 1469116 1452862 1437038 1421966 1407571 1393518 1379756 1366854 1355660 1346548
48184 1346548 1339043 1332142 1325098 1318066 1312060 1308077 1306061 1304854 1303340 1301392 1299581 1298341 1297849 1298449
48170 1298449 1300544 1304050 1308425 1313290 1318590 1324194 1329847 1335595 1341703 1348025 1354022 1359603 1365368 1371669
48156 1371669 1377968 1383537 1388354 1392861 1397293 1401791 1406829 1412771 1419120 1424792 1429188 1432556 1435434 1438249
48142 1438249 1441366 1444926 1448476 1451319 1453501 1455998 1459682 1464372 1469187 1473535 1477437 1481119 1484695 1488250
48128 1488250 1491987 1496125 1500664 1505287 1509570 1513507 1517828 1523579 1531171 1539853 1548330 1555913 1563072 1570848
48114 1570848 1579762 1589261 1598225 1605986 1612809 1619341 1625775 1631720 1636811 1641142 1645072 1648815 1652435 1656048
48100 1656048 1659838 1663851 1667945 1671961 1675942 1680167 1684980 1690590 1697049 1704462 1713056 1722866 1733416 1744034
48086 1744034 1754638 1765931 1778634 1792722 1807655 1823257 1840017 1858551 1878969 1900819 1923474
48075 1923474 1946707 1971170 1998250 2029204 2064496 2104271 2149032 2198589 2249678 2295450 2328620
48064 2328620 2345617 2347642 2338419 2321943 2302068 2282421 2265278 2250741 2237801 2226086 2216051 2207746
48052 2207746 2200248 2192533 2184356 2176021 2167602 2158671 2148685 2137537 2125802 2114364 2103546 2092591 2080271
48039 2080271 2066089 2050737 2035383 2020785 2007054 1993819 1980404 1966153 1950893 1935002 1918878
48028 1918878 1902474 1885461 1867666 1849134 1829946 1810192 1789984 1769237 1747509 1724300 1699541
48017 1699541 1673671 1647285 1620816 1594457 1568112 1541394 1513909 1485675 1457161 1428942 1401496
48006 1401496 1375366 1351121 1328859 1307855 1287109 1266345 1246248 1227599 1210441 1194303 1178965
47995 1178965 1164591 1151174 1138317 1125760 1113742 1102612 1092311 1082522 1073158 1064387 1056330 1049071
47983 1049071 1042886 1037962 1033820 1029438 1024250 1018789 1014067 1010458 1007490 1004695 1002336 1001074 1000982 1001075 999973
47968 999973 997015 992687 987998 983605 979546 975521 971157 966118 960320 954089 947912 941948 935885 929280
47954 929280 921879 913660 904796 895664 886734 878290 870333 862698 855166 847470 839467 831433 824078 818079
47940 818079 813577 810164 807382 805159 803698 802965 802475 801800 801195 801388 802695 804731 807138 810194 814400
47925 814400 819823 826231 833534 841572 849734 857407 864783 872694 881664 891569 902111 912995 923676
47912 923676 933571 942665 951319 959353 965902 970320 972626 972927 971172 967789 963805 959806 955317 949675
47898 949675 942945 935456 927065 917641 907802 898354 889248 879857 870115 860663 851951 843912 836527 830057
47884 830057 824643 820174 816582 813735 811058 807904 804486 801924 801192 802352 804815 807866 810877 813682
47870 813682 816940 821571 827535 833721 839393 845304 852774 862009 871870 881185 889755 898031 906314 914480
47856 914480 922189 929047 934610 938494 940629 941366 941202 940375 938814 936503 933686 930458 926253 920059 911328
47841 911328 900610 889247 878446 868603 859326 850003 840376 830650 821189 812250 803976 796385 789207
47828 789207 782003 774689 767750 761729 756696 752513 749390 747636 746903 746223 744987 743538 742653 742770 743885
47813 743885 745767 747966 749876 751187 752191 753308 754431 755089 755273 755726 757231 759801 762815 765778 768694
47798 768694 771647 774389 776601 778412 780374 782852 785704 788618 791581 794864 798765 803527 809321 816072
47784 816072 823417 831072 839212 848324 858715 870264 882617 895441 908512 921661 934684 947379
47772 947379 959772 972257 985248 998647 1011911 1024669 1036875 1048280 1058292 1066735 1074233 1081319
47760 1081319 1087495 1091746 1093665 1093431 1091034 1086397 1080201 1073599 1066891 1059245 1050058 1039887 1029649 1019522
47746 1019522 1009144 998344 987121 975306 962873 950391 938599 927634 917095 906754 896856
47735 896856 887822 880045 873871 869368 866102 863447 861148 859377 858343 858197 859267 862053 866858 873588
47721 873588 881900 891422 901883 913342 926242 941012 957546 975271 993707 1012789 1032688 1053547
47709 1053547 1075359 1097712 1119538 1139416 1156441 1170709 1182827 1193059 1201060 1206278 1208386 1207370
47697 1207370 1203468 1197078 1188587 1178181 1165885 1151853 1136533 1120550 1104469 1088691 1073409 1058500
47685 1058500 1043568 1028359 1013253 999162 986829 976306 967265 959661 953828 949925 947611 946457
47673 946457 946525 948262 951832 956857 962979 970447 979842 991244 1004033 1017683 1032358 1048377 1065322
47660 1065322 1082245 1098789 1115564 1133204 1151427 1169281 1185986 1201132 1214417 1225689 1235247
47649 1235247 1243623 1250937 1256712 1260401 1261892 1261462 1259415 1255828 1250577 1243541 1234788 1224546 1213065 1200784
47635 1200784 1188590 1177480 1167642 1158173 1148039 1137157 1126277 1116121 1106974 1098774 1091019 1082761
47623 1082761 1073374 1063322 1053639 1044643 1035746 1026527 1017311 1008473 999784 990841 981665 972480 963248 953721
47609 953721 943710 933023 921503 909421 897591 886690 876613 866711 856470 845796 834869 823943
47597 823943 813063 801783 789390 775670 761279 747124 733570 720389 707184 693641 679691
47586 679691 665768 652687 640941 630293 620331 611139 603025 595858 589151 582730 576861 571769 567456
47573 567456 563999 561550 559979 558920 558358 558762 560360 562582 564573 566128 567770 569937 572453 574993 577727
47558 577727 581176 585445 589984 594169 597871 601243 604206 606408 607637 608015 607919 607789 607767 607212 604895 600182
47542 600182 593880 587409 581270 574988 568441 562278 556708 550779 543547 535419 527614 520639 513923 506800
47528 506800 499220 491598 484469 478267 473006 468132 463014 457593 452289 447423 443016 439053 435564 432499
47514 432499 429777 427408 425339 423350 421361 419661 418502 417726 417147 417056 417786 418941 419735 420127 420970 422819
47498 422819 425208 427434 429621 432469 436152 439914 442836 444771 446469 448829 452050 455447 458036 459254
47484 459254 459099 457776 455443 452346 448942 445704 442742 439711 436239 432483 429172 426919 425625 424715 423814
47469 423814 422859 421785 420642 420000 420510 421835 422765 422796 422988 424630 427629 430915 433976 437093 440348 443401
47453 443401 446234 449300 452784 456388 459923 463396 466467 468619 470112 471966 474640 477432 479680 481883
47439 481883 485013 489137 493393 497164 500657 504406 508595 512965 517164 521167 525435 530517 536520 543167
47425 543167 550378 558395 567278 576707 586512 596877 607719 618317 628020 637106 646531 656965 668365
47412 668365 680237 691952 703031 713445 723470 732983 741203 747490 752082 755592 758133 759579 760340
47399 760340 760967 760973 758998 754492 748533 742466 736324 729203 720829 712011 703628 695755 687921 679792 671390
47384 671390 662963 654919 647712 641501 635873 630087 623764 617354 611880 608101 605919 604646 603836 603699 604546
47369 604546 606054 607442 608439 609697 612016 615398 619288 623569 628814 635406 642865 650385 657685 664890
47355 664890 671763 677620 682076 685417 688013 689786 690449 689946 688243 684930 679504 672042 663219 653606 643292
47340 643292 632331 621201 610517 600445 590711 581121 571791 562761 553680 544038 533718 523172 513131
47327 513131 504203 496632 490248 484603 479287 474128 469027 463660 457634 451099 445027 440580 438157 437185
47313 437185 436830 436721 436876 437158 437161 436720 436314 436684 438060 439986 441971 444042 446407 448739 450236 450528 450261
47296 450261 450449 451352 452267 452477 452165 452140 452731 453226 452655 450947 449023 447736 447180 447211 448113 450159 452786 454929
47278 454929 456267 457567 459646 462613 466307 470824 476121 481620 486811 491963 497646 503786 509845 515794
47264 515794 522271 529658 537558 545395 553098 560981 569231 577737 586282 594796 603459 612415 621218 628821
47250 628821 634583 639170 643934 649312 654337 657914 660060 661600 663035 664155 664503 663752 661727 658497 654559
47235 654559 650641 647133 643790 640106 635926 631562 627345 623247 619112 615112 611595 608436 604970 600911
47221 600911 596971 594146 592515 591285 589954 588846 588402 588507 588843 589464 590648 592415 594585 597239 600791
47206 600791 605640 611896 619468 628192 637805 647798 657429 666014 673409 680074 686475 692426 697212 700388
47192 700388 702170 703016 703042 702035 699915 697022 693927 690969 687907 684115 679197 673362 667128 660923 655190
47177 655190 650617 647736 646296 645496 644923 644977 646340 649440 654445 661306 669519 678245 686976 695957 705806
47162 705806 716910 729298 742808 757165 772096 787516 803453 819790 836302 852946 869701
47151 869701 886071 901183 914583 926546 937473 947393 956212 963885 970049 974069 975918 976487 976447 975315
47137 975315 972340 967893 963110 958341 952958 946743 940521 934999 929803 924236 918457 913251 908919 905107
47123 905107 901680 899137 897883 897506 897142 896418 895763 895776 896544 897717 899057 900636 902553 904760 907390 911030
47107 911030 916355 923411 931413 939320 946510 952894 958538 963334 967065 969602 970857 970556 968296 963937
47093 963937 957784 950192 941151 930514 918506 905642 892157 877890 862858 847603 832796 818754
47081 818754 805519 793073 781185 769325 757188 745278 734584 725594 717841 710561 703658 697809
47069 697809 693604 690731 688287 685980 684728 685687 688779 692670 696230 699589 703567 708584 714533 721302
47055 721302 728839 736799 744664 752293 760002 767997 776022 783615 790453 796415 801545 806133 810607 815087
47041 815087 819125 822100 823948 825384 827292 829979 833149 836596 840651 845746 851725 857871 863583 868823
47027 868823 873981 879601 886205 893973 902473 910999 919343 927959 937266 947160 957344 967756 978340
47014 978340 988760 998756 1008554 1018510 1028473 1037945 1046833 1055641 1064853 1074488 1084338 1094395 1104805
47001 1104805 1115532 1126239 1136489 1145980 1154559 1162060 1168275 1173158 1176963 1179972 1182068 1182764 1181671
46988 1181671 1178813 1174554 1169472 1164277 1159478 1154999 1150361 1145411 1140624 1136597 1133434 1130717 1127869 1124573
46974 1124573 1121168 1118666 1117975 1119065 1121273 1124436 1129083 1135332 1142337 1149271 1156274 1163883 1172052 1180403
46960 1180403 1189098 1198663 1209109 1219884 1230659 1241623 1253007 1264768 1276664 1288236 1298783 1307815
46948 1307815 1315405 1321761 1326701 1330046 1332322 1334391 1336434 1337873 1338257 1337657 1336214 1333964 1331233 1328600
46934 1328600 1326265 1323899 1321252 1318455 1315605 1312665 1309927 1308074 1307426 1307579 1308057 1308937 1310533 1312849 1315696
46919 1315696 1319071 1323105 1327830 1333322 1339816 1347414 1355773 1364307 1372631 1380703 1388713 1396999 1405991 1416069
46905 1416069 1427436 1440052 1453500 1466999 1479868 1492000 1503618 1514568 1524256 1532272 1538629 1543163
46893 1543163 1545218 1544248 1540421 1534274 1526048 1515779 1503835 1490911 1477537 1464048 1451108 1439945
46881 1439945 1431749 1426899 1424896 1425066 1427262 1431855 1439181 1449149 1461396 1475546 1491115 1507390 1523712
46868 1523712 1539851 1555809 1571319 1585879 1599263 1611563 1622616 1631834 1638903 1644368 1649202 1653982
46856 1653982 1658746 1663467 1668235 1672956 1677284 1681065 1684753 1689189 1694971 1702145 1710480 1719887 1730385 1741756
46842 1741756 1753552 1765565 1778006 1791007 1804136 1816704 1828408 1839312 1849254 1857682 1864168 1868810
46830 1868810 1872008 1874089 1875200 1875256 1873853 1870453 1864866 1857480 1849010 1840170 1831633 1823957 1817311 1811355
46816 1811355 1805615 1800014 1795018 1791326 1789443 1789434 1791065 1794275 1799511 1807520 1818708 1832692 1848464 1865059
46802 1865059 1882239 1900619 1920993 1943423 1967093 1991065 2014842 2038041 2059848 2079269 2095764
46791 2095764 2109232 2119488 2126194 2129332 2129367 2126868 2122260 2115830 2107581 2097078 2083908 2068440 2051752
46778 2051752 2034683 2017323 1999539 1981592 1963963 1946844 1930117 1913709 1897730 1882347 1867613
46767 1867613 1853354 1839213 1824931 1810622 1796634 1783142 1770069 1757344 1745071 1733474 1722902
46756 1722902 1713766 1706160 1699597 1693492 1687839 1683045 1679172 1675813 1672785 1670449 1669194 1669052 1669965 1672094
46742 1672094 1675648 1680750 1687564 1696181 1706165 1716634 1727019 1737393 1747899 1758274 1768216 1777745 1786845
46729 1786845 1795208 1802829 1810508 1819071 1828186 1836547 1843296 1848873 1854348 1860247 1866216 1871511 1875664 1878818
46715 1878818 1881650 1884923 1888952 1893477 1898188 1903362 1909799 1917939 1927259 1936872 1946685 1957457 1969577
46702 1969577 1982304 1994575 2006096 2017086 2027255 2035745 2041951 2045747 2046930 2045055 2039931 2031692 2020329
46689 2020329 2005727 1988244 1968612 1947128 1923548 1897970 1871127 1843472 1814717 1784739 1754422
46678 1754422 1724992 1696950 1670117 1644379 1619838 1596512 1574356 1553416 1533524 1514170 1495092
46667 1495092 1476752 1459747 1443911 1428517 1413242 1398428 1384410 1371046 1358085 1345719 1334610
46656 1334610 1325412 1318279 1312856 1308832 1306506 1306633 1309750 1315924 1325041 1336827 1350525 1365191 1380724
46643 1380724 1398139 1418271 1440468 1463017 1484718 1505635 1526382 1547014 1566553 1583459 1596731
46632 1596731 1606693 1614490 1620711 1624910 1626644 1626419 1625122 1622976 1619775 1615932 1612651 1611028 1611537 1614435
46618 1614435 1620153 1628996 1640803 1655144 1671769 1690685 1711850 1734912 1759328 1784741 1811023 1837782
46606 1837782 1863994 1888416 1910299 1929328 1944969 1956416 1963236 1965557 1963466 1956762 1945581 1930719
46594 1930719 1912981 1892597 1869591 1844368 1817622 1790048 1762438 1735606 1709860 1684825 1660049
46583 1660049 1635404 1610795 1586172 1562208 1540255 1520977 1503511 1486483 1469334 1452086 1434569
46572 1434569 1416778 1399530 1383696 1368962 1354233 1339154 1324287 1309899 1295544 1281141 1267613
46561 1267613 1255991 1246319 1237759 1229462 1221168 1213180 1205947 1199628 1194092 1189423 1186081 1184274 1183444 1182753
46547 1182753 1181880 1180992 1180250 1179824 1180168 1181740 1184500 1188027 1191938 1195966 1199928 1204058 1209014 1215102 1221823
46532 1221823 1228660 1235876 1243951 1252656 1261395 1270088 1278990 1287988 1296928 1306365 1317099 1329095 1341746
46519 1341746 1355074 1369761 1385997 1403164 1420760 1438859 1457585 1476912 1496986 1517941 1539340
46508 1539340 1560521 1581496 1602784 1624436 1646067 1667786 1690017 1712337 1733449 1752532 1769658
46497 1769658 1784727 1797144 1806916 1815048 1822250 1828114 1832105 1834468 1835598 1835327 1833508 1830608 1827046 1822573
46483 1822573 1816995 1810939 1805128 1799338 1792771 1785112 1776607 1767371 1757259 1746223 1734297 1721423 1707640
46470 1707640 1693164 1677866 1660986 1641773 1620247 1597020 1572728 1547923 1523178 1498732 1474203
46459 1474203 1449028 1423063 1396633 1370280 1344660 1320336 1297385 1275471 1254514 1235003 1217542
46448 1217542 1202464 1189981 1180212 1172930 1167814 1165108 1165392 1168465 1173166 1178699 1185487 1194224 1204820
46435 1204820 1216773 1229839 1243568 1256792 1268480 1278776 1288471 1297817 1306565 1314777 1322675 1329898
46423 1329898 1335804 1340466 1344576 1348316 1351061 1352344 1352517 1352300 1352213 1352608 1353809 1355995 1359233 1363759 1370002
46408 1370002 1378308 1388825 1401564 1416374 1433002 1451476 1472331 1496164 1523082 1552851 1585417
46397 1585417 1620921 1659380 1700691 1744825 1791586 1840273 1889986 1940299 1991255 2042653 2093591
46386 2093591 2142796 2189198 2232211 2271581 2306989 2337782 2363251 2383145 2397592 2406481 2409374 2406239
46374 2406239 2397825 2385008 2368189 2347633 2323865 2297190 2267304 2234147 2198967 2163931 2130742
46363 2130742 2100127 2072385 2047637 2025506 2005307 1986887 1970917 1958194 1949006 1943321 1941302 1943422
46351 1943422 1950212 1961980 1978653 1999879 2025363 2055037 2088927 2127102 2169770 2217079 2268628
46340 2268628 2323539 2381239 2441636 2504137 2567008 2628345 2687399 2744229 2798217 2847625 2890572
46329 2890572 2925849 2952755 2970820 2979991 2980660 2973233 2957803 2934308 2902885 2864139 2819214 2769483
46317 2769483 2716001 2659494 2600993 2542016 2483717 2426279 2369667 2314659 2262544 2214104 2169582
46306 2169582 2129364 2093902 2063109 2036649 2014803 1998240 1986912 1980026 1977212 1978867 1985126 1995380
46294 1995380 2009269 2027305 2049805 2075695 2103107 2131015 2159823 2190484 2223403 2258020 2293146
46283 2293146 2327706 2361397 2394631 2427903 2461312 2494496 2526590 2556344 2582803 2606047 2626835
46272 2626835 2645470 2661477 2674409 2684324 2691195 2694536 2694057 2690180 2683419 2673687 2660829 2645557 2629249
46259 2629249 2612922 2596834 2580930 2565177 2549543 2534184 2519757 2507108 2496499 2487437 2479477 2472986
46247 2472986 2468914 2467864 2469455 2472600 2476374 2480652 2485937 2492638 2500579 2509131 2517660 2525751 2533157 2539654
46233 2539654 2544903 2548462 2550007 2549525 2547061 2542334 2534877 2524627 2512123 2497935 2482160 2464635 2445469
46220 2445469 2425086 2403915 2382268 2360478 2338898 2317750 2297084 2276857 2256925 2237072 2217323
46209 2217323 2198259 2180774 2165343 2151606 2138810 2126679 2115810 2107238 2101594 2098583 2097178 2096329
46197 2096329 2095765 2096232 2098914 2104418 2112327 2121784 2132382 2144323 2157865 2172953 2189287 2206352 2223342
46184 2223342 2239627 2255533 2272166 2290058 2308417 2326171 2343332 2360611 2377964 2394387 2409231
46173 2409231 2422922 2436133 2448917 2461084 2472850 2484537 2495928 2506519 2516301 2525829 2535526 2545338
46161 2545338 2555140 2565175 2575887 2587465 2599651 2611878 2623597 2634661 2645529 2656976 2669409
46150 2669409 2682424 2695169 2707136 2718457 2729394 2739794 2749257 2757682 2765322 2772322 2778506 2783668
46138 2783668 2787800 2790929 2792978 2793973 2794157 2793761 2792766 2790975 2788134 2784053 2778961 2773732 2769255 2765363 2760921
$$ [...]
##END NTUPLES=NMR SPECTRUM
##END=
