
##TITLE=AC1241_NBUAH12031_6609960_siVZdnHOJy
##JCAMPDX= 6.0         $$ Bruker NMR JCAMP-DX V2.0
##DATA TYPE= NMR SPECTRUM
##DATA CLASS= NTUPLES
##ORIGIN= BRUKER
##OWNER= Administrator
$$ 1.72 TOPSPIN		Version 2.1
$$ 2012-08-01 23:22:53.109 -0500  Administrator@TOPSPIN
$$ Compression mode = diff/dup
##.OBSERVE FREQUENCY= 400.02188249412
##.OBSERVE NUCLEUS= ^1H
##.ACQUISITION MODE= SIMULTANEOUS (DQD)
##.ACQUISITION SCHEME= undefined
##.AVERAGES= 8
##.DIGITISER RES= 22
##SPECTROMETER/DATA SYSTEM= spect
##.PULSE SEQUENCE= zg30
##.SOLVENT NAME= COFFEE_meoh
##.SHIFT REFERENCE= INTERNAL, COFFEE_meoh, 1, 14.98509
##AUDIT TRAIL= $$ (NUMBER, WHEN, WHO, WHERE, PROCESS, VERSION, WHAT)
$$ ##TITLE= Audit trail, TOPSPIN		Version 2.1
$$ ##JCAMPDX= 5.01
$$ ##ORIGIN= Bruker BioSpin GmbH
$$ ##OWNER= Administrator
$$ $$ C:\Bruker\TOPSPIN/data/COFFEE/nmr/AC1241_NBUAH12031_6609960_siVZdnHOJy/10/pdata/1/auditp.txt
$$ ##AUDIT TRAIL=  $$ (NUMBER, WHEN, WHO, WHERE, PROCESS, VERSION, WHAT)
(   1,<2012-08-01 23:22:43.718 -0500>,<Administrator>,<TOPSPIN>,<go>,<TOPSPIN 2.1>,
      <created by zg
	started at 2012-08-01 23:21:37.234 -0500,
	POWCHK enabled, PULCHK disabled,
       configuration hash MD5:
       6B 1B 68 BB D9 2E 58 E2 7F 35 AD 54 07 DF 0E 41
       data hash MD5: 64K
       5D E0 66 0C C6 52 FC CC 3D 5E B7 B4 C6 DE 88 1D>)
(   2,<2012-08-01 23:22:48.343 -0500>,<Administrator>,<TOPSPIN>,<proc1d>,<TOPSPIN 2.1>,
      <Start of raw data processing
       efp LB = 0 FT_mod = 6 PKNL = 1 PHC0 = 0 PHC1 = 0 SI = 32K 
       data hash MD5: 32K
       18 13 5E 81 00 F2 85 A2 2C 65 2D BE 38 C2 86 44>)
(   3,<2012-08-01 23:22:48.640 -0500>,<Administrator>,<TOPSPIN>,<proc1d>,<TOPSPIN 2.1>,
      <pk PHC0 = 177.6654 PHC1 = 0 
       data hash MD5: 32K
       3B 9E A0 47 86 F9 82 4E 79 01 FE 55 85 42 D0 B2>)
(   4,<2012-08-01 23:22:48.718 -0500>,<Administrator>,<TOPSPIN>,<proc1d>,<TOPSPIN 2.1>,
      <abs ABSG = 1 
       data hash MD5: 32K
       DD EC 43 A7 65 C4 55 FC 48 94 1F 39 BC 91 B2 57>)
(   5,<2012-08-01 23:22:48.750 -0500>,<Administrator>,<TOPSPIN>,<proc1d>,<TOPSPIN 2.1>,
      <abs ABSG = 2 
       data hash MD5: 32K
       AC 56 83 26 83 92 B2 D2 CC E5 A3 2E B8 31 CF 52>)
(   6,<2012-08-01 23:22:48.859 -0500>,<Administrator>,<TOPSPIN>,<proc1d>,<TOPSPIN 2.1>,
      <abs ABSG = 3 
       data hash MD5: 32K
       8B C6 AE 41 DE AE 58 01 4D 60 2C 0C B3 58 D0 9F>)
(   7,<2012-08-01 23:22:49.046 -0500>,<Administrator>,<TOPSPIN>,<proc1d>,<TOPSPIN 2.1>,
      <abs ABSG = 4 
       data hash MD5: 32K
       17 63 D4 5C 5A 46 34 50 B6 28 16 93 97 58 DD D5>)
(   8,<2012-08-01 23:22:49.156 -0500>,<Administrator>,<TOPSPIN>,<proc1d>,<TOPSPIN 2.1>,
      <abs ABSG = 5 
       data hash MD5: 32K
       48 57 22 A6 76 75 3B 1B 6C 2A 05 1A 43 A9 13 39>)
$$ ##END=
$$ 
$$ $$ hash MD5
$$ $$ 11 C0 75 69 2C F6 4B D5 F1 EC AA A0 44 08 CD 06
##$RELAX= 
##$RELAX= 
##$RELAX= 
##$RELAX= 
##$RELAX= 
##$RELAX= 
##$RELAX= 
$$ Bruker specific parameters
$$ --------------------------
$$ [...]
##$TP= (0..7)
150 150 150 150 150 150 150 150
##$TP07= 0
##$TPNAME0= <>
##$TPNAME1= <>
##$TPNAME2= <>
##$TPNAME3= <>
##$TPNAME4= <>
##$TPNAME5= <>
##$TPNAME6= <>
##$TPNAME7= <>
##$TPOAL= (0..7)
0.5 0.5 0.5 0.5 0.5 0.5 0.5 0.5
##$TPOFFS= (0..7)
0 0 0 0 0 0 0 0
##$TUNHIN= 0
##$TUNHOUT= 0
##$TUNXOUT= 0
##$USERA1= <user>
##$USERA2= <user>
##$USERA3= <user>
##$USERA4= <user>
##$USERA5= <user>
##$V9= 5
##$VALIST= <valist>
##$VCLIST= <CCCCCCCCCCCCCCC>
##$VD= 0
##$VDLIST= <DDDDDDDDDDDDDDD>
##$VPLIST= <PPPPPPPPPPPPPPP>
##$VTLIST= <TTTTTTTTTTTTTTT>
##$WBST= 1024
##$WBSW= 4
##$XGAIN= (0..3)
0 0 0 0
##$XL= 0
##$YL= 0
##$YMAX_a= 485753
##$YMIN_a= -633217
##$ZGOPTNS= <>
##$ZL1= 120
##$ZL2= 120
##$ZL3= 120
##$ZL4= 120
##$ABSF1= 14.98509
##$ABSF2= -5.573092
##$ABSG= 5
##$ABSL= 3
##$ALPHA= 0
##$AQORDER= 0
##$ASSFAC= 0
##$ASSFACI= 0
##$ASSFACX= 0
##$ASSWID= 0
##$AUNMP= <proc_prof1d_extract_pilot.lims>
##$AXLEFT= 0
##$AXNAME= <>
##$AXNUC= <1H>
##$AXRIGHT= 0
##$AXTYPE= 0
##$AXUNIT= <>
##$AZFE= 0.1
##$AZFW= 0.1
##$BCFW= 0
##$BC_mod= 0
##$BYTORDP= 0
##$COROFFS= 0
##$CY= 15
##$DATMOD= 1
##$DC= 0
##$DFILT= <>
##$DTYPP= 0
##$F1P= 0
##$F2P= 0
##$FCOR= 0.5
##$FTSIZE= 32768
##$FT_mod= 6
##$GAMMA= 0
##$GB= 0
##$INTBC= 1
##$INTSCL= 1
##$ISEN= 128
##$LB= 0
##$LEV0= 0
##$LPBIN= 0
##$MAXI= 10000
##$MC2= 0
##$MEAN= 0
##$ME_mod= 0
##$MI= 0
##$NCOEF= 0
##$NC_proc= -8
##$NLEV= 6
##$NOISF1= 0
##$NOISF2= 0
##$NSP= 0
##$NTH_PI= 0
##$NZP= 0
##$OFFSET= 14.98509
##$PC= 1
##$PHC0= 177.6654
##$PHC1= 0
##$PH_mod= 1
##$PKNL= yes
##$PPARMOD= 0
##$PPDIAG= 0
##$PPIPTYP= 0
##$PPMPNUM= 2147483647
##$PPRESOL= 1
##$PSCAL= 4
##$PSIGN= 0
##$PYNMP= <proc.py>
##$REVERSE= no
##$SF= 400.02
##$SI= 32768
##$SIGF1= 0
##$SIGF2= 0
##$SINO= 400
##$SIOLD= 32768
##$SPECTYP= <>
##$SREGLST= <1H.CDCl3>
##$SSB= 0
##$STSI= 32768
##$STSR= 0
##$SW_p= 8223.68421052631
##$SYMM= 0
##$S_DEV= 0
##$TDeff= 65536
##$TDoff= 0
##$TI= <>
##$TILT= no
##$TM1= 0
##$TM2= 0
##$TOPLEV= 0
##$USERP1= <user>
##$USERP2= <user>
##$USERP3= <user>
##$USERP4= <user>
##$USERP5= <user>
##$WDW= 1
##$XDIM= 32768
##$YMAX_p= 459296315
##$YMIN_p= -654320
##$CURPLOT= <Network HP LaserJet P1505>
##$CURPRIN= <$Network HP LaserJet P1505>
##$DFORMAT= <normdp>
##$LAYOUT= <+/1D_H.xwp>
##$LFORMAT= <normlp>
##$PFORMAT= <normpl>
##$SURQMSG= 1
$$ End of Bruker specific parameters
$$ ---------------------------------
##NTUPLES= NMR SPECTRUM
##VAR_NAME=  FREQUENCY,     SPECTRUM/REAL,   SPECTRUM/IMAG
##SYMBOL=    X,             R,               I
##VAR_TYPE=  INDEPENDENT,   DEPENDENT,       DEPENDENT
##VAR_FORM=  AFFN,          ASDF,            ASDF
##VAR_DIM=   32768,         32768,           32768
##UNITS=     HZ,            ARBITRARY UNITS, ARBITRARY UNITS
##FACTOR=    0.250966925370066, 1,           1
##FIRST=     8223.43324360094, 250743,       -47421
##LAST=      0,             27730,           6172
##MIN=       0,             -654320,         0
##MAX=       8223.43324360094, 459296315,    0
$$ Real data points
##PAGE= N=1
##DATA TABLE= (X++(R..R)), XYDATA
$$ [...]
19482f6708m52966G4070a68601A05269h4309B86915b04616d5376q3460B49726
19471f3659F347g5323p1438k1239a6962p0605H2409a84134j00117P0851B02853
19459B25947a21547j51379j15745F6430a88233N7833A7421L1033c34389l6388
19449c70777d0522J8043A7305h431q1514I5471C8476J04618b50645J446h6146
19437E9675d9039F6190k4033a99013n0359B5365K11309J04215a55069j5680L2289
19426a38460d488B4748J2372a2839k25030l8049o2113C8067b59154b6105j91606
19415b17711O994B8298a26883d2113A50434m3311f9538r3069J1004G5554e07523
19403D895K52256A10855j225a04399B02206f6012C8704f249k9781r7518l65676
$$ plain form
19482 -66708 -519674 74070 -168601 105269 -84309 286915 -204616 -45376 -128836 249726
19471 -63659 6347 -75323 -146761 -168000 -16962 -87567 82409 -184134 -284251 -213400 202853
19459 225947 -121547 -272926 -388671 66430 -188233 -130400 17421 48454 -334389 -370777
19449 -370777 -40522 -22479 17305 -8431 -89945 95471 38476 143094 -250645 -249199 -86146
19437 59675 -49039 66190 42157 -199013 -249372 25365 236674 340889 -155069 -170749 -138460
19426 -138460 -4488 24748 37120 -12839 -237869 -275918 -338031 38067 -259154 -26105 -217711
19415 -217711 -210717 28298 -126883 -42113 150434 107123 -69538 -162607 -151603 75554 -507523
19403 4895 257151 110855 109630 -104399 202206 -66012 38704 -6249 -36030 -133548 -499224
19392d99224C0396a61172B53906B9516K1948b30268A37224F5450c02717G6336
19381C85812c35916A16916a38576j04904d3834A46567a17511A18082c7049F2620
19370A63861J21942E1539b44693b2745k6969I7887b64641b3327l07554a5922D1712
19358B9587i5112M7073A08857C7210C30f2420A10415a98542D1133a11916K6990
19347h4926A13362b03849l1566i6442b3236C9810O3893D7587b52419C3273c3764
19335I5009F336a59585q5567A09177k7912f210j66415k02053A38922b52915f1730
19323A3800d16922J83111g5224k32699J08551j86228e6376f254l0234j30977l3647
19312b01112P33O2964k74612B02985a09329A7654Q0843D5328J11382a76283j89859
$$ plain form
19392 -499224 30396 -161172 253906 29516 51464 -230268 137224 65450 -302717 76336
19381 385812 -335916 116916 -138576 -243480 -43834 146567 -117511 118082 -37049 62620
19370 163861 285803 51539 -244693 -22745 -49714 97887 -264641 -23327 -330881 -15922 41712
19358 29587 -95112 -48039 108857 37210 330 -62420 110415 -198542 41133 -111916 -84926
19347 -84926 113362 -203849 -235415 -96442 -23236 39810 103703 47587 -252419 33273 -33764
19335 95009 6336 -159585 -245152 109177 81265 -6210 -172625 -374678 138922 -252915 -61730
19323 13800 -416922 -233811 -75224 -307923 -199372 -385600 -56376 -6254 -36488 -167465 -201112
19312 -201112 -200379 -137415 -412027 202985 -109329 17654 98497 45328 156710 -176283 -366142
19301c66142B16933l9775a66447L8860D345J65022b7808j01418a9883l66008J69210
19290b16681F0015g1571j99458j11743J87019H5680a186m7690k81249D20221b45806
19278e0742A16636P4720a51466c4247j51934N0937k42536k1551a88190O9578j34666
19267b53278B4755a73608B15735c13546Q5767E2788g1990r8608c31l25654a18909
19255d7439k92154B03340J4597b58479A02032a36188r785A07618b82516I6619
19244b2998E4247d730A15651n4376c2693m8443j86772J18953j83390A68223o3225
19233A04998b22443m9482G6542f6832C9504a64907B6732J25706b0489A61431d2005
19221B02278E227J66660a67200b2477j21406L9705k13079J11029C0911L6311a7214
$$ plain form
19301 -366142 216933 177158 -166447 -127587 4345 169367 -27808 -129226 -19883 -385891 -216681
19290 -216681 60015 -71571 -271029 -382772 -195753 85680 -1186 -48876 -330125 420221 -245806
19278 -50742 116636 191356 -151466 -34247 -186181 -135244 -377780 -399331 -188190 -118612 -253278
19267 -253278 24755 -173608 215735 -313546 -227779 52788 -71990 -170598 -331 -325985 -118909
19255 -47439 -339593 203340 217937 -258479 102032 -136188 -145973 107618 -282516 96619
19244 -22998 54247 -4730 115651 61275 -32693 -81136 -267908 -148955 -332345 168223 104998
19233 104998 -222443 -271925 76542 -66832 39504 -164907 26732 152438 -20489 161431 -42005
19221 202278 5227 171887 -167200 -22477 -143883 -104178 -317257 -206228 30911 67222 -17214
19209D4248a58284g303j64741j46428B88511b46544j32971j0599C8634N5948a08584
19197b15751Q0437L8971A44383a92519C740e83019a50127e5047A11722J4881a31284
19185h4132r1481B1916b37883A42434h4926A5318K47070c50839R9008E3911d70731
19173b27708L1869P9714j56135A6763a02595l5223l35861B2130J48897a58974
19162c19454B12204a78343D9712b52771c3418B92431f6968A83489c3061A1243
19151D1395J20166o4656D1201a66475N0911j72347F8758a42659c7378q1901J5210
19140a04069j43652f7392C14605a64991j84401A28480J33347a22079j79431P7999
19130b23511O8167e0126b2329l02931A49533b53284A14642A0327j221h2022l61347
$$ plain form
19209 44248 -158284 -7303 -172044 -318472 288511 -246544 -379515 -390114 38634 94582 -108584
19197 -215751 -135314 -96343 144383 -192519 3740 -583019 -150127 -55047 111722 126603 -131284
19185 -84132 -175613 21916 -237883 142434 -84926 15318 262388 -350839 -251831 53911 -470731
19173 -227708 -195839 -116125 -272260 16763 -102595 -137818 -473679 22130 171027 -158974
19162 -319454 212204 -178343 49712 -252771 -33418 292431 -66968 183489 -33061 11243
19151 41395 161561 96905 41201 -166475 -115564 -287911 68758 -142659 -37378 -119279 -104069
19140 -104069 -247721 -67392 314605 -164991 -349392 128480 261827 -122079 -301510 -223511
19130 -223511 -155344 -50126 -22329 -325260 149533 -253284 114642 10327 9106 -82022 -443369
19119d43369B68376B5131b88086I2635L53193A3385b56873o3777J44960N892l68340
19108e38138B13137F0924a22678b7341g575F7839H526c13204a43959c2173I4191
19096A33431l0028b5893o3319j39831e4980B35969a26641D6346d6657B16115b9142
19084A2063P5212a30357j83500N9313a4735m29060F0983b10397A51170D8437g792
19072A6632b63599F7702F703g9881A30438b28945q9078a0345I4830c54396B98612
19060D8761b75697A06535L2742I532R7557f7775m6660j33869j11350D5161A3949
19048h379A31213b90642b4755j11469A1505J4366h37m08919a68923j72027J49336
19037a91614M455E4043a02731A13512e49949E7514b04971E3871a72469A71584
$$ plain form
19119 -443369 268376 25131 -288086 92635 445828 13385 -256873 -320650 -175690 -169798 -538138
19108 -538138 213137 60924 -122678 -27341 -7575 67839 8526 -313204 -143959 -32173 94191
19096 133431 103403 -25893 -89212 -229043 -54980 235969 -126641 46346 -46657 216115 -29142
19084 12063 87275 -130357 -313857 -254544 -14735 -443795 60983 -210397 151170 48437 -7792
19072 16632 -263599 67702 6703 -79881 130438 -228945 -318023 -10345 94830 -354396 298612
19060 48761 -275697 106535 139277 9532 107089 -67775 -114435 -248304 -359654 45161 13949
19048 -8379 131213 -290642 -24755 -136224 11505 25871 -837 -409756 -168923 -340950 -191614
19037 -191614 -187159 54043 -102731 113512 -549949 57514 -204971 53871 -172469 171584
19026A11402D5268a0014j3750D1511P3176i603d608C32928e46854B24413C6036
19014A73732b0955A95046e36946E2092R764A0227a10844N2018D7485b1951k92887
19003c14838Q2337A9951Q0286b31302n8641J07396J7537A56300g5896j16584B7086
18991H8446a65636k16334M3062B46167k5863H5669C187Q0196e8607n8466k06886
18980c23959I0201g5603K9074K482I5666L6569a09164C03357l0607J46132L65621
18969G84503C13953K4020a37793F2349a75544A80814K3209F9733a82907j35982
18959c18889h021l85952C9711a26111N5193B61144J1429F4J67797a13121C60943
18947a2294A70659C0810N8048a1984j29591A37789m4110h3578q5406B2844a83278
$$ plain form
19026 111402 45268 -10014 -23764 41511 114687 -9603 -4608 332928 -546854 224413 36036
19014 173732 -20955 195046 -536946 52092 61856 10227 -110844 -58826 47485 -21951 -314838
19003 -314838 -232501 19951 100237 -231302 -289943 -182547 -165010 156300 -75896 -192480 27086
18991 88446 -165636 -381970 -338908 246167 220304 85669 3187 83383 -58607 -117073 -323959
18980 -323959 90201 -75603 -46529 -44047 95666 132235 -109164 303357 272750 418882 784503
18969 784503 313953 337973 -137793 62349 -175544 180814 204023 69733 -182907 -318889
18959 -318889 -8021 -393973 39711 -126111 -70918 261144 272573 64 167861 -113121 360943
18947 -12294 170659 30810 88858 -11984 -141575 137789 93679 -83578 -168984 22844 -183278
18935b9608m8637A04152b60400H5490J22476c82425A04037g6779J4833C04835
18924G2807I695N3620a36994N2671Q189A13427c84675E9582a02610A17111a84884
18912B43809E0881a22507C47478D8730J39294M04248j34849A61150a68980g1887
18901a21623B37685E1836a04987H0110a34562A01705d70084a4502C00625P724
18891C08349b50419A86651a49841B94726F5816a06419p3005g1401j06437h3357
18880d5795p3884A84180c46612g1364k4206M5023j22384J5167k12481a49873j91384
18869c41257a8361D9698b6879q7703d5928p3217C9342b2756k51765A95405c585
18857h0456A07314a13109e1920C1299b60174A14132a55904f5632k72524a49332
$$ plain form
18935 -29608 -78245 104152 -260400 85490 207966 -382425 104037 -76779 -61946 304835
18924 72807 9695 63315 -136994 -84323 -76134 113427 -384675 59582 -102610 117111 -184884
18912 243809 50881 -122507 347478 48730 188024 592272 457423 161150 -168980 -71887
18901 -121623 237685 51836 -104987 80110 -134562 101705 -470084 -14502 300625 308349
18891 308349 -250419 186651 -149841 294726 65816 -106419 -179424 -71401 -177838 -83357
18880 -45795 -119679 184180 -346612 -71364 -95570 -50547 -172931 -157764 -370245 -149873 -341257
18869 -341257 -18361 49698 -26879 -114582 -45928 -119145 39342 -22756 -274521 195405 -3585
18857 -80456 107314 -113109 -51920 31299 -260174 114132 -155904 -65632 -338156 -149332
18846c35872B1900J77136p615b66502A48462b80661q0704J75254j8855c1301n4423
18835h5724P208G2633d71389C3707j2541N2759a22061l0547G863a69340N4617
18824a14723D9383a87315H8292a0272r7344A14463b20537A57871i2478j06929
18814a99407B44980b41547k21774e3759E3799P2729E8395L48972A60504a96336
18803a11714C84578j50643B2235k079K42309l5299a38819j3621j04941A36335
18792b43966r2831a0335D7868a83662K4309f8931F6746O1502a33541b5627D44606
18780A3232d6844j49180A78662a6883C2169c05288A40651a17619A00869b62766
18769a79005L7553b9410B9035O7619a94189g7096A1770c6826e557k7233B34500
$$ plain form
18846 -335872 21900 199036 191421 -266502 148462 -280661 -361365 -186111 -204966 -31301 -85724
18835 -85724 -78516 72633 -471389 33707 21166 73925 -122061 -152608 7863 -169340 -114723
18824 -114723 49383 -187315 88292 -10272 -107616 114463 -220537 157871 -92478 -199407
18814 -199407 244980 -241547 -463321 -53759 53799 126528 58395 407367 160504 -196336
18803 -111714 384578 233935 22235 20156 262465 227166 -138819 -152440 -257381 136335
18792 -243966 -336797 -10335 47868 -183662 -159353 -68931 66746 128248 -133541 -25627 444606
18780 13232 -46844 -196024 178662 -16883 32169 -305288 140651 -117619 100869 -262766
18769 -179005 -141452 -29410 29035 96654 -194189 -77096 11770 -36826 -5557 -32790 234500
18757F5391c63062f5000r7054j35859D1180a76791A05261n0539b1687o7760c8653
18745A0608a74389j0345N6720E4974b06862R3717E7557j4818a93560K3711p6672
18734b46521k45879D5651b03969F6901a38760H269J50780J29618c26707d1097
18723a83496e0629C6041d7371k98401B14352f0062A07245e6332l92153g5074F6633
18711e2157B3499O929q230I682O4174a62657A62989a26566k13446a05686D73053
18699I89f1769A66225c33495n736c9148j10311I6626J4328j7924d227F68b60208
18686A65410j47i5177j5869n3128q2344B02707j01198c85165n382A35751c5433
18674a41583k63217M2710a9423A52658m4915b34017i129E0894a29479q1012N7552
$$ plain form
18757 65391 -363062 -65000 -162054 -297913 41180 -176791 105261 54722 -21687 -89447 -38653
18745 10608 -174389 -184734 -128014 54974 -206862 -113145 57557 42739 -193560 -169849 -246521
18734 -246521 -492400 45651 -203969 66901 -138760 8269 159049 288667 -326707 -41097
18723 -183496 -50629 36041 -47371 -345772 214352 -60062 107245 -56332 -448485 -75074 66633
18711 -52157 23499 30428 22198 9682 73856 -162657 162989 -126566 -340012 -105686 473053
18699 989 -61769 166225 -333495 -339231 -39148 -149459 96626 110954 93030 -4227 668 -260208
18686 165410 165263 -95177 -111046 -164174 -246518 202707 101509 -385165 -390547 135751 -35433
18674 -141583 -404800 -362090 -19423 152658 107743 -234017 -9129 50894 -129479 -210491 -152939
18663a52939j05061k434H5620b59362a05562n0753O0638A8816a86546k4286J0621
18652b00211L5738b6853C28257a33303L8685D4895d41061c1122A56588k3924m8150
18641H4514a61007j37961d0482A42549a98361b7672Q132A00067c96013F6241J21459
18630A87700E3102c05275a48042k19999a54434b7362j5186n4546A70964C1084
18619a07j54425D545c65415g4427k75898D3979R471Q739b55352N0044k488a03585
18606B85151C4957a15567C533J10260b54937A22924D5994c12289B00213q9560
18596A10653b35531o6186a19313H2707R7220E7430d3182m425I340a96213g6548
18584f5026m3556q4476F4513B0227c30487a62646A43637c28950C7361h2131a6272
$$ plain form
18663 -152939 -258000 -260434 85620 -259362 -105562 -156315 -95677 18816 -186546 -210832 -200211
18652 -200211 -164473 -26853 328257 -133303 -94618 44895 -441061 -31122 156588 132664 84514
18641 84514 -161007 -298968 -40482 142549 -198361 -27672 -19540 100067 -396013 66241 187700
18630 187700 53102 -305275 -148042 -368041 -154434 -27362 -42548 -97094 170964 31084
18619 -107 -154532 4545 -365415 -74427 -350325 43979 53450 62189 -255352 -205308 -207796 -103585
18606 285151 34957 -115567 3533 113793 -254937 122924 45994 -312289 200213 110653
18596 110653 -235531 -301717 -119313 82707 179927 57430 -43182 -47607 9340 -196213 -76548
18584 -65026 -108582 -193058 64513 20227 -330487 -162646 143637 -328950 37361 -82131 -16272
18572A93295a37592j02142A66819D7520b1292C4109L4414f7013j46571P67j9125
18561b31942F1651c96883A90414a9599A66692b90348a15373K3422J2656j13369
18551a92664j3086B62836I0847c6203H4707c6777B12300c7766r0138F730K16634
18540B23364d97270D6718a52276A09697L5982n5953k7641J10314Q112a89820N1608
18529a38212f8546e44j61752a9550j96697C1747b84924O6466c723I275P6393k4973
18517F0695G522a97586M4269A17660e5341B11747g8011C55100c7952J4946I696
18505c35713f6370k1413b6812B93891a38975A4958h1757g271A21625a22882A76674
18493b51764A9274a59191b4364m68093a49193o3467A74218b5033l78554a55511
$$ plain form
18572 193295 -137592 -239734 166819 47520 -21292 34109 68523 -67013 -213584 -212817 -231942
18561 -231942 61651 -396883 190414 -19599 166692 -290348 -115373 -91951 -79295 -192664
18551 -192664 -205750 262836 90847 -36203 84707 -36777 212300 -37766 -127904 6730 223364
18540 223364 -497270 46718 -152276 109697 145679 89726 62085 172399 180511 -189820 -138212
18529 -138212 -68546 -544 -162296 -19550 -216247 31747 -284924 -218458 -3723 9275 85668 60695
18517 60695 7522 -197586 -153317 117660 -55341 211747 -78011 355100 -37952 -23006 9696
18505 -335713 -66370 -87783 -26812 293891 -138975 14958 -81757 -7271 121625 -122882 176674
18493 -251764 19274 -159191 -24364 -492457 -149193 -212660 174218 -25033 -403587 -155511
18482a83212D4700a32512j9465j8218k0217j37450o7134B07372b38356i2090K8406
18471f3684H9144c8955G9540Q2340k7073m1609L080g4739C00178b47849A64293
18459b07448K3165L8054c6991A1487d5812j58457A50708a42539E1935f6855k83145
18448c50000a36077j1865B0412K4142e32271B74929o5730L4038p3088a8631B86280
18436A99625a76277b9585q7569l06212G7098a5532E2790a37330A22688a2573l98310
18425d10883a87048A92374F52a55065A11480g2392l4639o3689A31099J43533d6608
18413b10040A63002c63328a29147j37312O5844L8371q4694A15982B970J33519
18403A36489b1619j38430F5224b25440c3549I0238b11651E6813f1789C20716j11430
$$ plain form
18482 -183212 44700 -132512 -151977 -170195 -190412 -327862 -394996 207372 -238356 -92090 -63684
18471 -63684 89144 -38955 79540 161880 134807 93198 96278 -74739 300178 -247849 164293
18459 -207448 -184283 -146229 -36991 11487 -45812 -204269 150708 -142539 51935 -66855 -350000
18448 -350000 -136077 -147942 20412 44554 -532271 274929 209199 243237 170149 -18631 286280
18436 199625 -176277 -29585 -117154 -423366 77098 -15532 52790 -137330 122688 -12573 -410883
18425 -410883 -187048 192374 652 -155065 111480 -72392 -107031 -170720 131099 274632 -46608
18413 -210040 163002 -363328 -129147 -266459 -200615 -162244 -246938 115982 2970 136489
18403 136489 -21619 -160049 65224 -225440 -33549 90238 -211651 56813 -61789 320716 209286
18392B09286m041a3104m79754i6362J6432a1440F3133a81710A44032m9699B3471
18380D7254b32696A4817a65088f5272j06124k56689g8868k16362d1722J777D1062
18368A07311b70212H6844L4320a85884I1349M9259b28721c4012j9524j42927i8126
18356a20024p845I2352J14362a66584h0473p236G5358c4816a408A58340p077F8265
18343A68041b33343B3509a40441e6116B24431d1716A01492L5628N6348b32163
18332B20320A59b03809i4867A1526J38892e546m9481A71553C5069O2974i4486
18320g7705I9822b3443B28324a60247p4914B52799A00027L699j0848C1480a10010
18308i6753B8622f8642j37037i3607a6161j44512a915C99927b16971A248a45753
$$ plain form
18392 209286 205245 -13104 -492858 -96362 -79930 -11440 63133 -181710 144032 94333 23471
18380 47254 -232696 14817 -165088 -65272 -171396 -428085 -78868 -295230 -41722 -39945 41062
18368 107311 -270212 86844 121164 -185884 91349 140608 -228721 -34012 -53536 -196463 -98126
18356 -120024 -127869 92352 206714 -166584 -80473 -87709 75358 -34816 -1408 158340 151263 68265
18343 168041 -233343 23509 -140441 -56116 224431 -41716 101492 137120 193468 -232163
18332 220320 159 -203809 -94867 11526 150418 -5546 -55027 171553 35069 98043 -94486
18320 -77705 99822 -23443 228324 -160247 -235161 252799 100027 103726 92878 31480 -110010
18308 -96753 28622 -68642 -205679 -93607 -16161 -160673 -1915 399927 -216971 1248 -145753
18296C25626H2417N8525a63565f6342o9993A87386H1551f932p7895m4769E9682
18284a19928j58053a29799I3866a1500l2468i163j6774n8775I9803Q8962M0612
18273B29377c1665o5818F5656a5783j09253b5677E0057b91109B59597a85829d5479
18261b71471G0762j2047J52555c27568D0082b6053A7669R2589L7227b27288k6077
18250b53365d6336A61261A6272a92875K445F8663a9498k1918A14332e78014a45878
18238B47013A7331a00427j14252O0835L5014B19906e6590B17345r2336L4236C8191
18226F3201J20418b14443e0288j23006G7658b52624H5650a50369n3857E356d8773
18214A32021E9734e0338k5856c5273o1313A10735L385A2256M3971B6665b0386
$$ plain form
18296 325626 82417 140942 -163565 -66342 -136335 187386 81551 -6932 -84827 -129596 59682
18284 -119928 -277981 -129799 93866 -11500 -43968 -9163 -25937 -84712 99803 188765 229377
18273 229377 -31665 -97483 65656 -15783 -125036 -25677 50057 -291109 259597 -185829 -45479
18261 -271471 70762 58715 211270 -327568 40082 -26053 17669 110258 147485 -227288 -253365
18250 -253365 -46336 161261 16272 -192875 -190430 68663 -19498 -41416 114332 -578014 -145878
18238 247013 17331 -100427 -214679 -153844 -118830 219906 -56590 217345 125009 159245 38191
18226 63201 183619 -214443 -50288 -173294 77658 -252624 85650 -150369 -204226 5356 -48773
18214 132021 59734 -50338 -76194 -35273 -96586 110735 114120 12256 56227 26665 -20386
18202b93967j20724E8066c39572f203C14677g2570k10363G901K31394c42679A48237
18190b91070E7904Q7530a28781r7401N4R5750A99848q977H8338c72305J50012
18179b22293R8507I9163R2565e463j21811k7747A53732b05525M0697K4063B07151
18167b08461d8415q3719A17501N2967a79878m3797B23140i2544B62133a94079
18156B38907p6985a16882A79184b5633A06277i2787j42579E3134D916J55640b6722
18144d9072a0415o1919C4790c55894a08901J0343D6394J12983E5199N1152J63726
18133B70077b8331B28432c9175j0029J4922l06712C1795b94939H8874A7944h9994
18121d8444A70695n2880b02357R2085L1104B85820a60144A61055o1660c18535
$$ plain form
18202 -293967 -414691 58066 -339572 -6203 314677 -72570 -282933 7901 239295 -342679 148237
18190 -291070 57904 145434 -128781 -226182 -226128 -130378 199848 190871 88338 -372305 -222293
18179 -222293 -123786 99163 191728 -5463 -127274 -155021 153732 -205525 -164828 -140765 207151
18167 -208461 -48415 -132134 117501 170468 -179878 -223675 223140 -92544 262133 -194079
18156 238907 161922 -116882 179184 -25633 106277 -92787 -235366 53134 4916 160556 -26722
18144 -49072 -10415 -72334 34790 -355894 -108901 -98558 46394 159377 55199 106351 270077
18133 270077 -28331 228432 -39175 -49204 -34282 -340994 31795 -294939 88874 17944 -89994
18121 -48444 170695 117815 -202357 -110272 -79168 285820 -160144 161055 99395 -318535
18110C70128C9453K16707h3470K6766p0363A55576R177A4333a47024B5380b76546
18098B05563a4117o5200j66013N6172n7318I7724d4745r7697a296E908L7552j2681
18086C0779b31398E088h3751j0671K7623k26771C0316b98094J1890A17711a80167
18074A0452f6482l12379A29184K0457a34518k00036C8667P2744b8005j11752A88361
18062A6449K0409a36756H5430K9869J73230J17631H1961h923j726o7297A33526
18050A60618a34460j05674H0636g4300k49298C15779e0513A26901f9589j54715
18040b24304J6752C3682a41435B5221g0630q5990A0019Q2669J51688b46934A16570
18028b66527B46570F0147d72244d6598B8506b49840K8296J03262L6322j50701
$$ plain form
18110 370128 39453 256160 -83470 -56704 -127067 155576 164753 14333 -147024 25380 -276546
18098 205563 -14117 -79317 -245330 -189158 -246476 97724 -44745 -142442 -1296 5908 43460 30779
18086 30779 -231398 5088 -83751 -94422 -66799 -293570 30316 -298094 -286204 117711 -180167
18074 10452 -66482 -378861 129184 149641 -134518 -334554 38667 111411 -28005 -139757 188361
18062 16449 36858 -136756 85430 115299 288529 406160 81961 -8923 -10649 -77946 133526
18050 160618 -134460 -240134 80636 -74300 -323598 315779 -50513 126901 -69589 -224304
18040 -224304 -207552 33682 -141435 25221 -70630 -156620 10019 92688 244376 -246934 116570
18028 -266527 246570 60147 -472244 -46598 28506 -249840 -221544 -118282 -81960 -232661
18018b32661E4779K09972b36741C48877a39713F3186b92715A62099E0957Q189
18008E9146i4273B37983L0708b16636D65567f8830A147b27928N4682B7085a02706
17996A41950F796e8004j12937A69432d5801q332D10650B43a65853m2208m0227
17985b48288b3574k3889A84020f2072H8687b2850A38870J20872j13508A1236O3799
17974G5035c729j05638p540p1599A69049A8236K42077a55870I0966M3194E020
17962b56350A625J95265A3152c7482g483I6988Q386d30937C02393a03298j97758
17951c01056Q3640K0390c8116A7339J66317e3492C30800a92508A77963a70499
17940A97828c220k43894A10489a907G2934K09599i2218j7963k98610A57310d194
$$ plain form
18018 -232661 54779 264751 -236741 348877 -139713 63186 -292715 162099 50957 59146
18008 59146 -94273 237983 268691 -216636 465567 -68830 1147 -227928 -173246 27085 -102706
17996 141950 6796 -58004 -170941 169432 -45801 -54133 410650 243 -165853 -208061 -248288
17985 -248288 -23574 -47463 184020 -62072 88687 -22850 138870 259742 146234 11236 75035
17974 75035 -3729 -109367 -116907 -188506 169049 18236 260313 -155870 90966 134160 5020
17962 -256350 1625 196890 13152 -37482 -7483 96988 105374 -430937 302393 -103298 -301056
17951 -301056 -217416 -197026 -38116 17339 183656 -53492 330800 -192508 177963 -170499
17940 197828 -3220 -247114 110489 -1907 72934 282533 -92218 -110181 -408791 157310 -4194
17928h7042j18244k07026H4570J09887Q4976B3532b50433A33366F1675N6309D5815
17916b19134D4097O4409B8384g8051A64465E7569B8250a36045j15458B4036d6075
17904B1423a07259k56729F007b66256a24236m0674O6k3726l3243g2007K6251q9789
17892a35545A14416C1059b00513B70461L5889m1171a48998A9389K96401F7661
17881A20876b54164k8417A05668k3393d0258q3642j01526d0489A82248B8782K71868
17870C00650b61432A2134N878b04520C0154a57510B53557e5470c15j95405n8343
17859b54063G6281a4283A67009A5046c0343F3956R616K63179b05995e9229D23222
17847H6616a2927E4592Q26K5083c1481C08048g9040g396B16223c11640A23245
$$ plain form
17928 -87042 -205286 -412312 84570 194457 279433 23532 -250433 133366 61675 117984 45815
17916 -219134 44097 108506 28384 -78051 164465 57569 28250 -136045 -251503 24036 -46075
17904 21423 -107259 -363988 6007 -266256 -124236 -164910 -164844 -188570 -221813 -72007 -45756 -135545
17892 -135545 114416 31059 -200513 270461 306350 265179 -148998 19389 315790 67661
17881 120876 -254164 -282581 105668 82275 -40258 -123900 -225426 -40489 182248 28782 300650
17870 300650 -261432 12134 18012 -204520 30154 -157510 253557 -55470 -315 -195720 -254063
17859 -254063 76281 -14283 167009 15046 -30343 63956 73572 336751 -205995 -59229 423222
17847 86616 -12927 54592 55418 80501 -31481 308048 -79040 -7396 216223 -311640 123245
17835d5312B20869a91938h820B24065r0707K82060A94113C4212N7136J45254f8206
17823b24495a3140D8270P4216b5102j34285L5118A46716b9949B69359j12923P6977
17812B33413a87792A85701B7212c21712B1260b36772e1186n7475H4099b10579
17801a14698A41896J792L3331K0699b33320A73762a93946b5539A02309b03429
17790a19211p7325H9027K39935a30581e255E5008K3284i7065K934A72224g8309
17778a32820A20992a67177G9438R8036a60548G0568J4320Q9797A2508L46478A76349
17766a19775b162A90235m0707J23874i0981A30677a46210G1430b28369H1365J28480
17755B09845p0372j7076E7370K0811c1197H0732a6283n2352A53743O6632A8629
$$ plain form
17835 -45312 220869 -191938 -8820 224065 133358 415418 194113 34212 91348 236602 -68206
17823 -224495 -13140 48270 122486 -25102 -159387 -124269 146716 -29949 269359 156436 233413
17812 233413 -187792 185701 27212 -321712 21260 -236772 -51186 -108661 84099 -210579
17801 -114698 141896 143688 177019 197718 -233320 173762 -193946 -25539 102309 -203429
17790 -119211 -196536 89027 328962 -130581 -5255 55008 78292 -97065 -94131 172224 -78309
17778 -132820 120992 -167177 79438 177474 -160548 70568 84888 174685 12508 358986 176349
17766 -119775 -2162 190235 149528 273402 -90981 130677 -146210 71430 -228369 81365 209845
17755 209845 139473 122397 57370 78181 -31197 80732 -16283 -68635 153743 220375 18629
17743b13019m5980A15850a2475j67592A34128h0695D8564Q8241b07778B02306
17732a0374o6991k23834c8815B24314J00068b96492b2750A67687J1149a98095
17721D07846B8717L31526j45315o0489B7522J35482j7154D5659b07247A43311
17710a29860k4820g0929B39258c32512O9463B7596J97108n3061l5711b1429n166
17699b6595B5669J58067q0993h7167H0950J32026b50952I7018a14325c5252r130
17688d4382f464j04793A12290J47188p6576R7623h0800B17738P3634G9123i907
17676B64170H3132J95290a1203j92873E0192J87698R7176l9498J6545h9527I3497
17664E64247B33970j5342e8292B92102a20942C61289F8877I261J77794N4248I4181
$$ plain form
17743 -213019 -258999 115850 -12475 -180067 134128 -80695 48564 136805 -207778 202306
17732 -10374 -77365 -301199 -38815 224314 324382 -296492 -22750 167687 178836 -198095
17721 407846 28717 360243 214928 154439 27522 163004 145850 45659 -207247 143311
17710 -129860 -154680 -70929 239258 -332512 -263049 27596 224704 171643 135932 -21429 -26595
17699 -26595 25669 183736 102743 -87167 80950 212976 -250952 97018 -114325 -35252 -44382
17688 -44382 -6464 -111257 112290 259478 182902 280525 -80800 217738 291372 79123 -9907
17676 264170 83132 278422 -11203 -204076 50192 237890 335066 295568 312113 -89527 93497
17664 564247 233970 218628 -58292 292102 -120942 361289 68877 9261 187055 241303 94181
17652G1283c2144k1377H6955d5052j1049B50777a7806k3510i737A38340a22228
17640D14691A24079e1519D37272c6483C14265A41829h0769L5365o4283C48524
17629E3197O1129A6000K45796c8425r9034B03956A969M9137J89212J77811A00441
17617a4359j7991A75307M7036a14317C42128J81417c5770B3085J93740N285O4952
17606B87062O222K11847C0407N2536J90300A5584L78688c5452j7391A79516g1867
17594B15914G355J42064N0250c2071m0476C90403C5403h5662D06984r4885e0324
17582A71461a03646A90571P6704f6507A4103b625A15515m4093N0713M73A3447
17570I0110K1084L77047d5280A51244K95738c96914E7752O00302l05536A16968
$$ plain form
17652 71283 -32144 -53521 86955 -45052 -56101 250777 -17806 -41316 -9737 138340 -122228
17640 414691 124079 -51519 437272 -36483 314265 141829 -80769 -45404 -109687 348524
17629 53197 114326 16000 261796 -38425 -137459 203956 1969 51106 240318 418129 100441
17617 -14359 -32350 175307 222343 -114317 342128 523545 -35770 23085 216825 222110 287062
17606 287062 293284 505131 30407 82943 273243 15584 394272 -35452 -52843 179516 -71867
17594 215914 7355 149419 199669 -32071 -72547 390403 35403 -85662 406984 312099 -50324
17582 171461 -103646 190571 267275 -66507 14103 -2625 115515 71422 122135 122608 13447
17570 90110 111194 488241 -45280 151244 446982 -396914 57752 658054 352518 116968
17559H9762l2689N2649d1979B12427J21631n6261j17558A7529R3059D7915L09109
17548C57024A34529J91573c78689A60660K70415o8974B5256L43806a20354B50858
17537d0114A90207K2230L1018P9030m7930a89896C99161A84443P2698K60136M0201
17526E57478B38146L94749L61021P2250k09915n0746C89815n4142j62790J97174
17516C70057J0363j69146o8859N49934j19369O738O2402k5681J95807k17431L30700
17505I25515j4823l25198A46208K6075K55016j94651h8229B71755A32370O9199
17495B01569M01230B42876A13141K71620r2251J03397B4482L26512I6129K90446
17485C86575J42226j05786g5307B31070K30911k04876j04928m0039k0896P9351
$$ plain form
17559 89762 57073 109722 -41979 212427 334058 277797 160239 17529 110588 47915 357024
17548 357024 134529 326102 -378689 160660 431075 362101 25256 369062 -120354 250858
17537 -40114 190207 212437 243455 322485 274555 -189896 399161 184443 257141 517277 557478
17526 557478 238146 632895 993916 1066166 856251 805505 389815 335673 172883 370057
17516 370057 380420 211274 142415 692349 572980 579718 642120 616439 812246 594815 925515
17505 925515 910692 585494 146208 172283 427299 232648 -88229 271755 132370 201569
17495 201569 602799 242876 113141 384761 292510 395907 24482 350994 96129 386575
17485 386575 528801 423015 -75307 231070 461981 257105 152177 112138 91242 170593
17475A70593O3122J95910k02931A07360K83383L4623K39283k75948i0767j07771
17465a98538B56865A8241K81178H5425J24510J11816f7732B58139P718L0152E1965
17453B60200r2843L23793k29881J31172j04530K98447B72712E7292M40983j70254
17443C28021p7202J66207j11206j49876J14805j08055J49577N57990j90448j94502
17433D85311m0571B00781L8277Q513j1861J0422d6344A68712L2846J39027J7003
17422C57588L3021L6739j65408q8016K4649J88896K75569A74902J30907A29326
17411A58231K14425G3245L84582A56176m4031L48586k17582D2898e581E92631
17400b0078C17159d8092B22639K02815m9516A62727o8610J31524q3291J56572
$$ plain form
17475 170593 233715 429625 226694 107360 390743 425366 664649 388701 -90767 -198538
17465 -198538 256865 18241 299419 85425 209935 321751 -67732 258139 265857 296009 51965
17453 260200 167357 491150 261269 392441 287911 586358 272712 57292 498275 328021
17443 328021 250819 417026 305820 155944 270749 162694 312271 870261 679813 485311
17433 485311 444740 200781 239058 247571 235710 246132 -46344 168712 201558 340585 357588
17422 357588 390609 427348 261940 173924 198573 387469 663038 174902 305809 129326
17411 158231 372656 73245 457827 156176 112145 460731 243149 42898 -5581 592631
17400 -20078 317159 -48092 222639 425454 375938 162727 94117 225641 142350 298922
17390B98922n8275K95234B57126k459J37472A47404n1751k1374l2006J24615K3390
17379A90278K20343l0668L1782a7792A93610R8344P824L24885A63960k6142b117
17367D7204J45379J18933J43193B07677m5496p2438J12550p7173J26868C7869
17356A41042b0383B41393A4346d0509K500G58522C66396F3674J67350q8398j9875
17345A22751J03207L7558F3767K52628M3226p5648r9640Q0309a2915r8647C46577
17333D84023A93213L03142B1617O1985J69876Q5807p5451B9042J86856K10400
17323D26298p244a3441E3137a31138A11827L7047j3874J16372J40973A63672E9863
17311C59124J12659a45308A40762J79304q5542o2699J37494q9173K13414j24501
$$ plain form
17390 298922 240647 535881 257126 254667 392139 147404 95653 74279 42273 166888 190278
17379 190278 410621 379953 411735 -17792 193610 291954 299778 624663 163960 137818 -2117
17367 47204 192583 311516 454709 207677 162181 89743 202293 125120 251988 37869
17356 141042 -20383 241393 14346 -40509 -38009 758522 366396 63674 231024 142626 122751
17345 122751 225958 263516 63767 316395 359621 283973 184333 264642 -12915 -111562 346577
17333 484023 193213 496355 21617 83602 253478 339285 263834 29042 215898 426298
17323 426298 419054 -13441 53137 -131138 111827 148874 135000 251372 392345 163672 59863
17311 359124 471783 -145308 140762 320066 234524 171825 309319 220146 433560 309059
17301C09059J67916E4385K35317K70927A02379J61577J70096g9455F9174K73413
17291C42587l5883M9373q2721J44492q3900j19692L95311j05215A03866M36246
17281E40112j67566k0982o4413J30872r2133A48966J42016q9678K32374L3996
17271D67674B13460J66601j39627A9438M88807r4161j49443K34175N8258k16670
17261C40404j25521P99Q0184l5175n818o9636I1614N12180F7131J51950a08380
17249E24781A78404J09639D2637L99879B04766J75501j38736H5014L89243q8190
17239C86067J8722m3374J16667A67385J4122K07406J29851k05842J82676J58820
17229F54418A42905R1395q946j6192K99084A54836J58311J40871M5933l7452r778
$$ plain form
17301 309059 476975 54385 289702 560629 102379 263956 434052 -79455 69174 342587
17291 342587 306704 356077 273356 417848 333948 214256 609567 504352 103866 540112
17281 540112 372546 351564 287151 418023 325890 148966 290982 201304 433678 467674
17271 467674 213460 380061 240434 19438 508245 414084 264641 498816 557074 340404
17261 340404 214883 215682 295866 260691 254873 185237 91614 603794 67131 219081 -108380
17249 524781 178404 288043 42637 442516 204766 380267 241531 85014 474257 386067
17239 386067 404789 361415 478082 167385 181507 388913 518764 312922 495598 654418
17229 654418 142905 234300 225354 209162 508246 154836 313147 454018 499951 462499 452721
17218D52721J13881e4166C14856r7209A03318i9563E63807j87664A83055L28495
17208E11550j82793E929K47088K6647K85684k10911r0706J3482J87908A67188
17197C48385Q9755A93918n9815J02205M731G1526L68890L24047C49546j64455
17187A85091A6183M09100j82838p8837k4262M68627k02153p3965J8328j47375
17177B02808J16007k5048N6746N702K91153j95680N3258O0809k27548J13359j01615
17166C49951A56458l5967M76342B60654N10210l54111N1385B13269K52151j5592
17156D49828j13384P2943j73577J77536O9257J20772K24845A72730M26904B45213
17145G33585l00667J47505k09501K46670k85454K87222k72931O4366l8515j77554
$$ plain form
17218 452721 566602 -54166 314856 217647 103318 -99563 563807 376143 183055 511550
17208 511550 328757 5929 253017 279664 565348 354437 263731 277213 465121 167188
17197 348385 438140 193918 134103 236308 241039 71526 440416 764463 349546 185091
17187 185091 16183 425283 242445 163608 139346 607973 405820 331855 350183 202808
17177 202808 318815 293767 350513 356215 647368 451688 504946 565755 338207 451566 349951
17166 349951 156458 120491 596833 260654 770864 416753 468138 213269 465420 449828
17156 449828 336444 409387 235810 413346 482603 603375 828220 172730 599634 245213
17145 733585 432918 580423 370922 617592 332138 619360 346429 410795 372280 194726
17135A94726J15916J70520K92707A36604K24208J34729r1653j73283J62190n1800
17125C40995j2985n4819Q2098J55711l5202J14916P9677J29980j10776k96008
17115C93587j47567K61930j06475J6022P7544J28368J14435o1830K19175l02107
17105E93082n6718J19469r8670n4910p4178K2473A55348K07790M30380j32195
17095F61323q1913j2150M07807k08530k83834R3268N82594D63850M34405r8325
17085G99930j06902n758K1398l36098m630J35774j37014M42413k56509J80411
17075G33015J27920l0533j11515N9459q203N4334m5906k56395L19894o2148J99733
17064I79655m24490K60516k20519M9867J25470j55131L31078N4697j86791j03074
$$ plain form
17135 194726 310642 481162 773869 136604 360812 495541 403888 230605 392795 340995
17125 340995 328010 273191 355289 511000 475798 590714 670391 800371 689595 393587
17115 393587 246020 507950 401475 417497 495041 623409 737844 676014 895189 593082
17105 593082 536364 655833 557163 502253 428075 450548 155348 363138 793518 661323
17095 661323 579410 567260 975067 766537 482703 575971 1158565 463850 898255 799930
17085 799930 693028 687270 708668 372570 367940 503714 366700 809113 552604 733015
17075 733015 860935 830402 718887 778346 770143 824477 778571 522176 842070 779922 979655
17064 979655 555165 815681 595162 645029 770499 615368 946446 1001143 814352 711278
17054G11278j80784K34888J87890j66262j01941j15818K46975j73807J01180L16267
17044A059866j36428M5700k75382K01843l00843M49578j26928M3712r0997j0112
17034H60009q4881j44260K15148j4685l0696q6004J36044n2901J2275K71166k21257
17023H59958M24368m41861j24323L07060j26962J58855l46595M09324l9459k33633
17013H46732M41297k48935k80381J51344j20142L9427J76977j86849k0003K89518
17003A088985N9297n0110m13121Q87790m19366K5452J17583j30612l3517P6064
16993A208445R2393m23363M36379j68156L5910K47810o3385m27816M3514J84481
16983A166212J50935j23751j50006M80473J55605m54610P5531M3231l64259O0898
$$ plain form
17054 711278 530494 765382 953272 787010 685069 569251 816226 642419 743599 1059866
17044 1059866 923438 969138 693756 895599 594756 1044334 917406 961118 870121 860009
17034 860009 775128 630868 846016 831331 800635 714631 850675 797774 810049 1081215 859958
17023 859958 1284326 842465 718142 1025202 898240 1057095 710500 1119824 1080365 846732
17013 846732 1288029 1039094 758713 910057 789915 829342 1006319 819470 799467 1088985
17003 1088985 1148282 1098172 685051 1572841 1153475 1178927 1296510 1165898 1132381 1208445
16993 1208445 1300838 877475 1313854 1145698 1181608 1429418 1366033 938217 981731 1166212
16983 1166212 1317147 1193396 1043390 1523863 1679468 1224858 1300389 1343620 979361 1040259
16973A040259K20773j83158K84424J14181m13576L47912J36369o7158j24214q0569
16963A275243L59064j55302n2568J25492m18213N03304k30138L90986l52494P8209
16953A523583l29360L04600J14718J39442k38463K08122j26867k12032M76361
16944A860104K7377j91530K22132k43495j3893r0736J78032j13776N1325K65983
16934A951523J97404j80115j13952l9222J61765j02198K5919K20954k86660L02862
16924B138280J29352J68328l3256l33805Q1291Q8915N4499Q5165j39608K5567
16914B264728j85558P1191K48164o0445m7329J06401j72007L08938L3916k71976
16904B296023P7104J83172J25395k70899P32445m32466j91793K10641L5824P5627
$$ plain form
16973 1040259 1261032 1077874 1362298 1476479 1062903 1410815 1547184 1480026 1355812 1275243
16963 1275243 1634307 1479005 1426437 1551929 1133716 1637020 1406882 1797868 1445374 1523583
16953 1523583 1194223 1498823 1613541 1752983 1514520 1722642 1595775 1383743 1860104
16944 1860104 1887481 1695951 1918083 1674588 1660695 1569959 1747991 1634215 1685540 1951523
16934 1951523 2148927 1968812 1854860 1815638 1977403 1875205 1901124 2122078 1835418 2138280
16924 2138280 2267632 2435960 2402704 2068899 2150190 2239105 2293604 2378769 2239161 2264728
16914 2264728 2079170 2150361 2398525 2338080 2290751 2397152 2225145 2534083 2567999 2296023
16904 2296023 2373127 2556299 2681694 2410795 3143240 2710774 2518981 2729622 2765446 2841073
16894B841073J2787q4353j397J19916K87192k06509J19600j23995r760K83599
16884C238153M3603j97457k70967M94855J43372l34087M02658j34284R6015j57610
16874C324251J70128K16951P5351q9532p9767o3562M95843M4730m40660N05479
16864D159212J28558j34393L21900k51463J84907n3684K2675Q439J50519J34475
16854D671145J32308k89030L25765K81357j98755N15243j33269k9999M0826J87449
16844E503040k60151M44843P0145k06515L80956p9483K03886j31501Q0586j14131
16834E891675P27440m9439J73031O7050n3392L13434Q4053K13627K8911K1506
16824G417896J15919j8168K64890J99710K45348L22581k33926K96701M61652R9887
$$ plain form
16894 2841073 2853860 2769507 2768110 2888026 3175218 2968709 3088309 2964314 2954554 3238153
16884 3238153 3281756 3084299 2813332 3308187 3451559 3117472 3520130 3385846 3481861 3324251
16874 3324251 3494379 3711330 3786681 3697149 3617382 3553820 4049663 4094393 3653733 4159212
16864 4159212 4287770 4153377 4475277 4223814 4408721 4355037 4377712 4386151 4536670 4671145
16854 4671145 4803453 4514423 4840188 5121545 4922790 5438033 5304764 5274765 5315591 5503040
16844 5503040 5242889 5687732 5757877 5551362 5932318 5852835 6056721 5925220 6005806 5891675
16834 5891675 6619115 6569676 6742707 6809757 6756365 7069799 7153852 7367479 7396390 7417896
16824 7417896 7533815 7515647 7780537 7980247 8225595 8548176 8314250 8610951 9072603 9172490
16814I172490k8074L94195J47968j54954N37114K82778k86972Q97450q1966j6917
16804A0863112N14855J31209K93113M32660J2138K50483O47369J8774O05725N7497
16794A3826935M23794L10170O31998N63077p9543J90954Q42386J44920N60526
16785A7415217Q10077l0286Q02419K72736P68657M70713P22148N84699Q17907
16776B2634287N71217R33815K36478R39253Q05353J165286N81183Q45003J055551
16767B9767426R44310J056090J083734Q22043J471282J071110J254667J323772
16759C8794434J387716J549152J698165J871515J445407J718924J788001J993232
16751E2246546J789477K481062K087010K269765K308994K608047K353910L510980
$$ plain form
16814 9172490 9144416 9538611 9686579 9531625 10068739 10351517 10064545 10961995 10880029 10863112
16804 10863112 11377967 11509176 11802289 12234949 12247087 12497570 13144939 13163713 13769438 13826935
16794 13826935 14250729 14560899 15192897 15755974 15676431 15867385 16709771 16854691 17415217
16785 17415217 18225294 18195008 18997427 19270163 20038820 20509533 21231681 21816380 22634287
16776 22634287 23205504 24139319 24375797 25315050 26120403 27285689 27866872 28711875 29767426
16767 29767426 30711736 31767826 32851560 33673603 35144885 36215995 37470662 38794434
16759 38794434 40182150 41731302 43429467 45300982 46746389 48465313 50253314 52246546
16751 52246546 54036023 56517085 58604095 60873860 63182854 65790901 68144811 71655791
16743G1655791K444749K784546K934897L024710L392675L317801K963183L309051
16735I5827403L406761L208538L408289L041854L046378L056326K567942L330022
16727A20893513K082351K032671J887877J750324J022078P65943M79685k47798
16719A30666644n13566l47172j403548j273727j843092k475826k176743l061215
16711A17571755k611397k995678l087885l425118l093394l504099l086156l657613
16703I2110415l317206l395876k930354l306976k771462k988163k988608k665831
16695F7745939k817024k478966k185898k245126k248137k499920j974467j811572
16687D9484829j771929k082859j712075j669705j089563j767788j422989j307916
$$ plain form
16743 71655791 74100540 76885086 79819983 82844693 86237368 89555169 92518352 95827403
16735 95827403 99234164 102442702 105850991 108892845 111939223 114995549 117563491 120893513
16727 120893513 122975864 125008535 126896412 128646736 129668814 130434757 130914442 130666644
16719 130666644 130153078 129805906 128402358 127128631 125285539 122809713 120632970 117571755
16711 117571755 114960358 111964680 108876795 105451677 102358283 98854184 95768028 92110415
16703 92110415 88793209 85397333 82466979 79160003 76388541 73400378 70411770 67745939
16695 67745939 64928915 62449949 60264051 58018925 55770788 53270868 51296401 49484829
16687 49484829 47712900 45630041 43917966 42248261 41158698 39390910 37967921 36660005
16679C6660005j024610j381442j199091j056263j299120r63334q09650j017277
16671B7909218p32700j114934p74574m38571r59985o13765q05658o00864p99072
16662B1069095q04914l88130j25330j017656l82597o68512l81516n18053j69931
16653A6612456q03803k06174l63358o05842n84952K54384l86341o00625j72427
16644A3143318l68545m17266k10754j96080j15528m44569r5813k80000l86886
16635A0627877k52510k91408k34290K20321m33699o6740q15407K64511m54379
16626H564276K45252n12066J62806k24562k86535l35545J55289j24912k39551
16617G404452r1986o2726l89293J24965k05609k25146J91591k84745k72706j70480
$$ plain form
16679 36660005 35635395 34253953 33054862 31998599 30699479 29736145 28926495 27909218
16671 27909218 27176518 26061584 25287010 24848439 23888454 23274689 22469031 21868167 21069095
16662 21069095 20264181 19876051 19750721 18733065 18350468 17681956 17300440 16782387 16612456
16653 16612456 15808653 15602479 15239121 14633279 14048327 14302711 13916370 13315745 13143318
16644 13143318 12774773 12357507 12146753 11950673 11835145 11390576 11294763 11014763 10627877
16635 10627877 10375367 10083959 9849669 10069990 9636291 9569551 8754144 9018655 8564276
16626 8564276 8809528 8297462 8460268 8235706 7949171 7613626 7768915 7644003 7404452
16617 7404452 7312466 7249740 6860447 6985412 6779803 6554657 6746248 6461503 6188797 6018317
16607F018317K23886m30690L78825l53854n328p192L248k08202k69458n8181j88260
16596E103111L30948l86906k25275J03065n4458k37695j44653L58195l56514j52356
16586D337462K56734l47305J73522k59037m0574Q0819Q9644k61945K17202m71617
16576C774905J63162j16310j65121Q384m2876j39418N34793k55258l02257l51211
16566C108793L60419l79711K95781k30107L86304l95542N3905r9091N1004p0821
16556C080934l8406q8282L1427k11387K08838J80282n26869K11904k0612j10520
16546B717309J90515n31430M29683j61530j03375k24245K67496j46535J81674
16537B619562o9031m38294J65691L89842m30456J22679l83041N23999k98955j50266
$$ plain form
16607 6018317 6242203 5811513 6190338 5836484 5831156 5823964 5827212 5619010 5349552 5291371 5103111
16596 5103111 5434059 5047153 4821878 4924943 4870485 4632790 4488137 4846332 4489818 4337462
16586 4337462 4594196 4246891 4420413 4161376 4120802 4201621 4291265 4029320 4246522 3774905
16576 3774905 3938067 3821757 3656636 3665020 3622144 3482726 4017519 3762261 3460004 3108793
16566 3108793 3469212 3089501 3385282 3155175 3541479 3145937 3199842 3100751 3151755 3080934
16556 3080934 3042528 2954246 2985673 2774286 2983124 3163406 2636537 2848441 2827829 2717309
16546 2717309 2907824 2376394 2806077 2644547 2541172 2316927 2584423 2437888 2619562
16537 2619562 2550531 2112237 2277928 2667770 2237314 2359993 1976952 2500951 2201996 2051730
16527B051730k339P6709Q5221J72904k16555M8389j74970j93363J69378j58043
16517A859061J28443j78120M38779l4495l18257N1822n1791k8056j9441r6825
16507A751120J76995m3595L8732K9538k31508k0541J7683j9966l29287N53100
16497A922271k75440m9867o6371p2946L59034k11928q5034k6508K00510P4069
16487A767790l44511J91212m8182q8082l4758O610P5723J40323r4948K9157k00181
16476A400153j62918j31362J75781M5299P8260J14285k40289Q0616P6294n0162
16466A385957O5037l60208K7158J93134O5239l22915L0136Q5091r0390j80352
16456H97887K75559J36007q1535K36177n13290L80237k12711J20118J3057j53990
$$ plain form
16527 2051730 2049391 2126100 2211321 2384225 2167670 2216059 2041089 1847726 2017104 1859061
16517 1859061 1987504 1809384 2248163 2213668 1895411 1947233 1895442 1867386 1847945 1751120
16507 1751120 1928115 1884520 1923252 1952790 1721282 1700741 1718424 1698458 1369171 1922271
16497 1922271 1646831 1596964 1530593 1457647 1816681 1604753 1519719 1493211 1693721 1767790
16487 1767790 1423279 1614491 1566309 1478227 1443469 1450079 1525802 1666125 1571177 1600334 1400153
16476 1400153 1237235 1105873 1281654 1326953 1405213 1519498 1279209 1359825 1436119 1385957
16466 1385957 1450994 1090786 1117944 1311078 1376317 1053402 1083538 1168629 1078239 897887
16456 897887 1173446 1309453 1227918 1464095 950805 1331042 1118331 1238449 1251506 1097516
16446A097516J8096L688J58555Q9252k02611k12165J87064o1097J17344l06164
16436H89478J86062n6246J34483J58160k41431j00215m2450J85941j70372j21462
16426H21948K27178L15850m21878J88060j02803m5468l73418L72412j97833J03605
16416H87653R2751r0558L97155l04885m07642L81171n9189J25721k76743J96026
16406I41460j36732J8714l9066r4861l2881M18275j98184j11236J25760j95991
16396F95258L10969j11995k10155j436K30161Q1928l66711K39597k56386J48417
16386G59647K50948j94895J21597l9857j89796K59646q5612Q7155k64019J81135
16376H85949k55194K60056j03213k62326K19729K07728j69654j17190J09013r3263
$$ plain form
16446 1097516 1115612 1119300 1277855 1367107 1164496 952331 1139395 1078298 1195642 889478
16436 889478 1075540 1019294 1153777 1311937 1070506 970291 927841 1113782 943410 821948
16426 821948 1049126 1364976 943098 1131158 1028355 982887 609469 981881 784048 887653
16416 887653 980404 889846 1287001 982116 574474 955645 896456 1022177 745434 941460
16406 941460 804728 823442 784376 689515 656634 1074909 876725 765489 891249 695258
16396 695258 1006227 894232 684077 682641 912802 994730 628019 867616 611230 759647
16386 759647 1010595 815700 937297 897440 707644 967290 881678 968833 704814 885949
16376 885949 630755 890811 787598 525272 745001 952729 783075 665885 774898 681635
16366F81635K57533M023l40031K10961j75095J54941l8709l1405j17313j09215
16356D97325J95537J0239q2652J49000j60764j29193L68823k56708R5073K00873
16346H87553D10224M81929k14510j43188P3902O2482M06673E27375j92454N6233
16336C91154J53914n9929K65883n8655j30169j07999J7042M9335M1484k10717
16326C51343R0339q2955K04738J23158j51822K83437C99974o090K70280j39969
16316E24195O0694n7956p5968Q6061P1447j46220J03922P4258j03322n8435k9476
16305D49200J45105J18364l20686j9273L31363j19725j31819J4896j09977n7036
16295C00412M38145p4028J8360k15173J59595L8082j66986j14605L2792q7610
$$ plain form
16366 681635 939168 943191 603160 814121 639026 793967 755258 723853 606540 497325
16356 497325 692862 703101 620449 769449 608685 479492 848315 591607 686680 887553
16346 887553 410224 892153 677643 534455 608357 670839 1077512 527375 334921 391154
16336 391154 545068 485139 751022 692367 562198 454199 471241 520576 562060 351343
16326 351343 441682 358727 563465 686623 534801 818238 399974 393884 664164 524195
16316 524195 584889 526933 450965 537026 608473 462253 566175 640433 537111 478676 449200
16305 449200 594305 712669 391983 372710 704073 584348 452529 467425 357448 300412
16295 300412 738557 664529 682889 467716 627311 665393 498407 383802 416594 328984
16285C28984O7087r5114M73754k59019J95362K00920k63495F1815b786F38927
16274E75219A86632K42310j74612K27733o3488A83794A8367K66058J41980J67122
16264E93527o6559j00332L6812r9965k4429k7269n0632J04315J49342j46979q665
16253C59166A38197L57499k30799j01452J23661J9963j09695M5400J67638p0170
16243C40242l1759L77843B77430j20211N18662C33513o0034K04098n4730p1221
16233C51626j34788K35482j02695j35184K61412r9525J43585A2355L86249q8266
16223C10338J17421l2011M1598A75425K62554j62504J45764j90890g3470D82153
16212D30161j15196j54882N3311K63170A61282p272J26740m9514K21149j75060
$$ plain form
16285 328984 396071 300957 774711 515692 711054 911974 648479 61815 -2786 638927
16274 575219 186632 428942 254330 482063 418575 183794 18367 284425 426405 593527
16264 593527 526968 426636 463448 363483 339054 311785 261153 365468 514810 367831 359166
16253 359166 138197 495696 264897 163445 287106 307069 197374 242774 410412 340242
16243 340242 308483 686326 277430 157219 675881 333513 273479 477577 422847 351626
16233 351626 216838 452320 349625 214441 475853 376328 519913 12355 398604 310338
16223 310338 427759 395748 437346 175425 437979 275475 421239 230349 -73470 482153
16212 430161 314965 160083 213394 476564 161282 154010 280750 231236 452385 277325
16202B77325j29184J47089N2104o1826n2942j12626M01687A44819k7808J45691
16192B62702l0819M11813B24542D7934L32899J17659A48570M9827o7311D3865
16181C60948b6534D65965j23052j64323J61191D9118a2777F27145k33172a5215
16170D05044A49259J967c5101A37588f632C06265J6778G2707K1062b05549h9939
16158A8760O7423K72071J79939j60064j60941P5276P013C8882O26600h8190f065
16146D29698k14232F0398g9750G063J63521P6248r0664L11109A27675Q0846k585
16135B05936J33550j12008q8682L94268A44163C3184c1494B41722r0489p5283
16125G5950O4142K69750a76300e2547A63441K26078K7436b0310I1434J60058A9988
$$ plain form
16202 277325 148141 295230 347334 285508 232566 119940 521627 144819 117011 262702
16192 262702 231883 643696 224542 47934 380833 498492 148570 198397 131086 43865
16181 360948 -26534 465965 342913 178590 339781 49118 -12777 627145 393973 -15215
16170 405044 149259 151226 -35101 137588 -6632 306265 323043 72707 93769 -205549 -89939
16158 18760 86183 358254 538193 378129 217188 292464 299477 38882 665482 -88190 -6065
16146 429698 215466 60398 -79750 7063 170584 246832 156168 467277 127675 208521 205936
16135 205936 339486 227478 138796 533064 144163 33184 -31494 241722 151233 75950
16125 75950 140092 409842 -176300 -52547 163441 389519 416955 -20310 91434 251492 19988
16113A73332l2056g3911B52669J33950A72842P2347H8747a07133C67831O1871
16103D29702f2904A27127K13693l8940b2011A08146J21162j4619k6632b2660j1587
16092c4247A88860a59145G3577b708A36632k1944R0828c03427C5373J44580J88948
16081C68901A36334j2725J75032j48657A095J8861e502D1449J98008J94563d7095
16069A06851L41323d2974B16701b32604a0686A97198i0250G2184d5377C4677J19942
16058A54619J2391a71067A31002L1533a2102l186E5231a15869E7217L04475C9954
16046b6663A2873a80598d3933G5796b27643B81466j24012B7395b69662C96741
16035A55963a93520C17499A20917j5508M7408g3356B81554K56238a154j09589
$$ plain form
16113 173332 141276 -73911 252669 386619 172842 245189 88747 -107133 367831 429702
16103 429702 -62904 127127 340820 301880 -22011 108146 229308 214689 188057 -22660 -34247
16092 -34247 188860 -159145 73577 -2708 136632 114688 205516 -303427 35373 179953 368901
16081 368901 136334 123609 298641 149984 1095 19956 -5502 41449 239457 434020 -47095
16069 106851 448174 -42974 216701 -232604 -10686 197198 -90250 72184 -45377 34677 154619
16058 154619 167010 -171067 131002 162535 -12102 -15288 55231 -115869 57217 361692 39954
16046 -26663 12873 -180598 -43933 75796 -227643 281466 157454 27395 -269662 396741
16035 155963 -193520 317499 120917 105409 152817 -73356 281554 537792 -1154 -110743
16025a10743C35507b32873C75223A11271K57747a04791B02929a36365A06689L31158
16015D37847c9456M181j01062j28260f2684j05345A5685d658B6944i3527b6715
16003g5368F9603a14063G8458b94417a31840A80163e3460j118k09730B52758c6719
15991B40054N2716f482A55490D9133K74916J37887M09570J94852J50742n03424
15981G13676k34923l9284A20956J83824j14550a21812B69703A08964n2625a64648
15970B83681K0473J41043A52599a78100A19720a68995H7933h4758E6780g2739
15959B658a42089d2617C53122C1213J61130q61M6161F5750a92443b514C28036
15947a66928A29341B079a31950d7629K3435B54088a95289I9566b18690d9178o6297
$$ plain form
16025 -110743 335507 -232873 375223 111271 369018 -104791 202929 -136365 106689 437847
16015 437847 -39456 -35275 -136337 -264597 -62684 -168029 15685 -4658 26944 -93527 -26715
16003 -75368 69603 -114063 78458 -294417 -131840 180163 -53460 -54578 -264308 252758 -36719
15991 240054 292770 -6482 155490 49133 324049 461936 871506 1066358 1217100 713676
15981 713676 478753 439469 120956 304780 190230 -121812 269703 108964 56339 -164648
15970 283681 304154 445197 152599 -178100 119720 -168995 87933 -84758 56780 -72739
15959 2658 -142089 -42617 353122 31213 192343 191482 237643 65750 -192443 -2514 328036
15947 -166928 129341 2079 -131950 -47629 -24194 254088 -195289 99566 -218690 -49178 -115475
15936a15475e1298j5819A44259L8793C9031a68453O7761B64935a08104j85967
15926b94071C34315d8168E2285L36695a6438A75125d447n1276k78232B60482C1078
15914b87790h049C77639j76594i1275r1818f0087j9768k29502A79021M2731p1471
15903A50281p413m1690L7889F0571O3614A0785b56598B6619h2287o6683B4233
15891a90017d0310A14672e7398B52381a72062b5456I7307K05808a36269N7508
15881g8761B76168e801m16302B7578A2526J7370b2309l12176i8728b9345A68029
15869a35027j98009e8020p8704N2517k7930j74910a10045j9573A12125f4983k47411
15858c12394Q8229O0886B67612a2926B93015e9201a2782l85298A23480k6251a80699
$$ plain form
15936 -115475 -51298 -67117 144259 183052 39031 -168453 -100692 264935 -108104 -294071
15926 -294071 334315 -48168 52285 388980 -16438 175125 -4447 -55723 -333955 260482 31078
15914 -287790 -8049 377639 201045 -91275 -183093 -60087 -79855 -309357 179021 221752 150281
15903 150281 142868 101178 139067 60571 124185 10785 -256598 26619 -82287 -148970 24233
15891 -190017 -40310 114672 -57398 252381 -172062 -25456 97307 303115 -136269 -78761
15881 -78761 276168 -5801 -422103 27578 12526 29896 -22309 -334485 -98728 -29345 168029
15869 -135027 -333036 -58020 -136724 -84207 -112137 -287047 -110045 -129618 112125 -64983 -312394
15858 -312394 -224165 -163279 267612 -12926 293015 -59201 -12782 -398080 123480 97229 -180699
15846a26934O0080F3617J46868e3558D012O4666O0425E9284K71966D2324b45566
15834E7995L6145b16417f3918j13532d1193A9385J34341A2182J04283J07533r3789
15823A30209f5269B65981A7120K3384a01736B7753a77363E6689a49487e1910j47654
15812a99564A27758e5516l40969A7950a8793G9451L3021a12277p1972G9580C0742
15800d4218l43344g9384A23855J0564o683a02924d153j98263p880b5129p7149
15789a02278F7269m538g1982B22945q7007J13131G3868M0470a17922L3351C785
15777B29456b61405f7069a3339j82916h2927A05714a27086F96J1400b22074a04917
15765a17373A78242o6616J69546j31559b12128O7765A52045b87832d2163A29960
$$ plain form
15846 -126934 -66854 63617 210485 -53558 4012 68678 129103 59284 331250 42324 -245566
15834 57995 94140 -216417 -63918 -177450 -41193 19385 153726 12182 116465 223998 130209
15823 130209 -65269 265981 17120 40504 -101736 27753 -177363 56689 -149487 -51910 -199564
15812 -199564 127758 -55516 -396485 17950 -18793 79451 112472 -112277 -184249 79580 30742
15800 -44218 -387562 -79384 123855 134419 127736 -102924 -4153 -202416 -210296 -25129 -102278
15789 -102278 67269 62731 -71982 222945 135938 249069 73868 114338 -117922 -84571 3785
15777 229456 -261405 -67069 -13339 -196255 -82927 105714 -127086 696 12096 -222074 -104917
15765 -117373 178242 111626 281172 149613 -212128 -144363 152045 -287832 -42163 129960
15754A23961e2919o2384j97661J48467j06322D9463L63667f6188h12A95254F7681
15742I0452k5731b69423B16296J5965a28834a7475j86639C1298a52274c3334M419
15731b8915A03954i0352p1139k02460c0330r6414D04620b43374c4945A33021l5655
15720I7366b29556d3473k4285j66189A9167J02654a42981A24565K4945j2132J41590
15709B78968a73885J5985B6039L1515A9881K52595b7794j24362b0618B15630a39169
15697B33200r8810a79222h6509k68112D3403d0738H8605O4891l8025f6097B06304
15685c9899j41481A95656B2151K62712l7926b32514J01792q6895f5426B36251
15674a41680L3602D4729A0986a588m2095B13385A9404j844h5932F3892J54118
$$ plain form
15754 123961 -52919 -115303 -312964 -164497 -270819 49463 413130 -66188 -812 195254 67681
15742 90452 64721 -269423 216296 232261 -128834 -17475 -204114 31298 -152274 -33334 -28915
15731 -28915 103954 -90352 -161491 -363951 -30330 -126744 404620 -243374 -34945 133021 97366
15720 97366 -229556 -43473 -67758 -233947 19167 121821 -142981 124565 149510 137378 278968
15709 278968 -173885 -157900 26039 57554 19881 272476 -27794 -152156 -20618 215630 -139169
15697 233200 134390 -179222 -86509 -354621 43403 -40738 88605 153496 115471 -66097 206304
15685 -39899 -181380 195656 22151 284863 246937 -232514 -130722 -217617 -65426 236251
15674 -141680 -108078 44729 10986 -1588 -43683 213385 19404 17560 -85932 63892 218010
15663B18010f9027I4132A8444h9029A02051B8163c4728j6065J3185B56593c54996
15651b9281f349j09176A51532p5191b29142O3457e7599o5971C6970J37841e6766
15639a9954G3618b46107I0137l2035K7106a80939e2989A63407D0933a78454A01569
15627c1982k42878A72351A1301c0774B37237b6237F0349J30220a7842P190r8319
15616a08971j15855F4677b01808g3064A47586b81767K4083M2826j6489A21030
15605b68036a3465j46946N4305B31914a9784n57n0699r3194A30836a07500b6861
15593B31034b26111F4625h8706C2126h7536B75332C4319J29344d658A08292L3488
15582A41780K27644a96782e8545k63302p377E5749L7371a52282E8589g2154J3464
$$ plain form
15663 218010 -69027 94132 18444 -89029 102051 28163 -34728 -50793 -37608 256593 -354996
15651 -29281 -6349 -115525 151532 76341 -229142 -165685 -57599 -123570 36970 174811 -56766
15639 -19954 73618 -246107 90137 58102 85208 -180939 -52989 163407 40933 -178454 101569
15627 -31982 -274860 172351 11301 -30774 237237 -26237 60349 190569 -17842 -10652 -108971
15616 -108971 -224826 64677 -201808 -73064 147586 -281767 -257684 -214858 -231347 121030
15605 -268036 -13465 -160411 -106106 231914 -19784 -20341 -71040 -164234 130836 -107500 -26861
15593 231034 -226111 64625 -88706 32126 -87536 275332 34319 163663 -4658 108292 141780
15582 141780 369424 -196782 -58545 -321847 -329224 55749 93120 -152282 58589 -72154 -58690
15571e8690I98a49294A61840b5005P31m81122c1892b468k37716B142c2293J5089
15559a7204l35595D7054c31490i0596k9953l64611A0973a02830K1128C6514a28626
15547d678C0267J30768C1676a42878c2561C5040b58349A53198g3708r0860B62852
15535A86951j8884a97747A14913j3194J23989a94017f2410l019F7908J96643D2656
15523d4901C6369H850K28136j14247O2758l2176J4448i2263M0384F042J11599
15512A17641L0509l1858K11424j27032r4200R3346a3735B32958a01226B16587
15501I5652f0674A54937I287K23429B7450a5063l5395A29561b6597D24699a41042
15489C75389A37005b28693G8616j2664a90541f7894p7567a6595E3589b43895A31135
$$ plain form
15571 -58690 998 -149294 161840 -25005 -24274 -505396 -31892 -2468 -240184 2142 -32293 -17204
15559 -17204 -352799 47054 -331490 -90596 -120549 -485160 10973 -102830 -81702 36514 -128626
15547 -4678 30267 161035 31676 -142878 -32561 35040 -258349 153198 -73708 -164568 262852
15535 186951 168067 -197747 114913 101719 225708 -194017 -62410 -65429 67908 264551 42656
15523 -44901 36369 8850 236986 122739 185497 153321 167769 -92263 -51879 6042 117641
15512 117641 148150 116292 327716 200684 106484 199830 -13735 232958 -101226 216587
15501 95652 -60674 154937 9287 232716 27450 -15063 -50458 129561 -26597 424699 -141042
15489 375389 137005 -228693 78616 65952 -190541 -67894 -145461 -16595 53589 -243895 131135
15477H0963L1509e5051B42954l9600M35748K95635k28231C11444m0463q0140a80279
15465H3049e9503A81183O7012A04870K4021l2412D7832e409D8032H175J07918
15454A16093b80752e7330B8784A3619b26371J1563J05400j87655A96591B1431
15443A12523J72341K41971J7375K79535k363k19182Q3142B96718r1144N270p7435
15432A33409a27775N226a8015k45368P5755A66439A125i4758F0816j7967a42149
15420a13831n8266A1747O2186R6375p3617L3188E5675J92138A9957R127a59682
15408h968j21783l0203B47491G9685L6324a33169n7966A20042a3440k07282E5539
15396a79828H7560a68293Q3244j56610a13369A35335b20153i003j67847a99B16337
$$ plain form
15477 80963 112472 -55051 242954 203354 639102 934737 706506 311444 270981 190841 -180279
15465 83049 -59503 181183 248195 104870 128891 96479 47832 -5409 48032 8175 116093
15454 116093 -280752 -57330 28784 13619 -226371 -214808 -109408 -297063 196591 21431
15443 112523 284864 526835 544210 823745 821382 602200 685342 296718 205574 210844 133409
15432 133409 -127775 -122549 -18015 -263383 -187628 166439 1125 -94758 60816 42849 -142149
15420 -113831 -172097 11747 73933 170308 96691 129879 55675 247813 19957 29084 -159682
15408 -8968 -130751 -160954 247491 79685 116009 -133169 -191135 120042 -13440 -220722 55539
15396 -179828 87560 -168293 -85049 -241659 -113369 135335 -220153 -9003 -176850 -199 216337
15384E70734I3101j6496a735A33612a89175b6690A87139h6230C72126e4663A91443
15372C75517D8210K55382J37744g2920B71902A34259h80A88985M3597g2702F3131
15360a12299e5666B73578A05843a56937A96479M9600o7781J82093J08723A45087
15349B26692A7251Q1237J7527O4575q4807K08892J8727j41059l0924J64371L1927
15338C47717B4856J03312o406M7776M7982a28318C31562b1034A34558N0621G1839
15326a3475D38652j49889E705a19140C63771j65913c4045B01546j671C1154K7081
15315E8235K90686A59914j3856e1825B80870J31586E6450J82846b5146p5556A16230
15303H7732f7152j14528A92823a42513N1776B01049D7364R2210N7581K55709E2252
$$ plain form
15384 570734 93101 76605 -1735 133612 -189175 -26690 187139 -86230 372126 -54663 191443
15372 375517 48210 303592 441336 -72920 271902 134259 -880 188985 232582 -72702 63131
15360 -112299 -55666 273578 105843 -156937 196479 246079 178298 360391 469114 145087
15349 226692 17251 98488 116015 180590 95783 304675 323402 182343 151419 315790 347717
15338 347717 24856 128168 121762 169538 217520 -128318 331562 -21034 134558 185179 71839
15326 -13475 438652 288763 5705 -119140 363771 197858 -34045 201546 199875 31154 58235
15315 58235 348921 159914 146058 -51825 280870 412456 56450 239296 -25146 -100702 116230
15303 87732 -67152 -181680 192823 -142513 -90737 201049 47364 139574 197155 452864 52252
15291b9322E2236J75012A9912K31512f0647n5938M2521F5689a33731j04762B05651
15279C3037J94990a12625A23176J04084D3110L800a40436N4427k9512B41659E2913
15267i6566j59788A2286L33226G0050c28217A65742m8448J74273a80718A68415
15256F3402K07605a07012E8836b3596f198j74096A17300M6932P5913l2620r4267
15245A13258J68573J011338J46353J24170Q4777p34059C46063A32696b2714D2662
15234A04342a39068j07585B5242J53120k936K40872A45720h5566D58933a2662
15223g9185B44202j07522b40949J11676A5147L69250a55356A16367N7507d3584
15212g7506K7616B44732e2630k91954B806M5942P0417J65309i9707j13647A08323
$$ plain form
15291 -29322 52236 227248 19912 251424 -60647 -116585 -74064 65689 -133731 -238493 205651
15279 33037 228027 -112625 123176 227260 43110 46910 -140436 -86009 -115521 241659 52913
15267 -96566 -256354 12286 345512 70050 -328217 165742 117294 291567 -180718 168415
15256 63402 271007 -107012 58836 -23596 -6198 -180294 117300 164232 240145 207525 113258
15245 113258 281831 1293169 1439522 1563692 1648469 914410 346063 132696 -22714 42662
15234 104342 -139068 -246653 25242 178362 175426 416298 145720 -85566 458933 -12662
15223 -79185 244202 136680 -240949 -129273 15147 384397 -155356 116367 173874 -43584
15212 -77506 -49890 244732 -52630 -344584 2806 48748 119165 284474 -99707 -213354 108323
15200A52238A2338J42151P3648C5594a04020C90864A34653j9827j0321N2368G1856
15188B17151a24707A17305a0353A40462J9671q24K1190a28501j9852A35793R4489
15177B30282r550o2374K48475B3667K0876I705c1577C19432i4607c6907H8018
15165B02819k2210q4608a13720a8451B02421b0021I768K58236b136B6098a41481
15153I8750l1863a58427A29089m1560a81575B63505b65844f4509B49762I9198
15142B13728I5852m4526L8385k6045J1370A7076L27379E4189J15414b02592A49257
15130D19664j96746R6431A4575J28480a33075B53660O5603p4743K355J34989J51450
15119E33314A26342K97902j64430A09283O4845Q110a4223r4470A81585b19290
$$ plain form
15200 152238 12338 154489 228137 35594 -104020 390864 134653 114826 104505 156873 71856
15188 217151 -124707 117305 -10353 140462 160133 159309 180499 -128501 -148353 135793 230282
15177 230282 220732 158358 406833 23667 44543 9705 -31577 319432 -94607 -36907 88018
15165 202819 180609 96001 -113720 -18451 202421 -20021 9768 268004 -2136 26098 -141481
15153 98750 66887 -158427 129089 87529 -181575 263505 -265844 -64509 249762 99198
15142 213728 95852 51326 89711 63666 75036 17076 344455 54189 169603 -202592 149257
15130 419664 222918 319349 14575 143055 -133075 253660 319263 244520 246875 381864 533314
15119 533314 126342 424244 259814 109283 174128 182238 -14223 -108693 181585 -219290
15108A87718B329J4366d3584C74844A61506A0542J71806J09645D1461b28456i0124
15096E6869J01323J26684B8438O4871a07737B91344I233J24558P2280K56541A48879
15084D2304M86067A30684K60601j67343J37080p5900G0338C1477K47111C2085
15073A07488M15061G6156L64830a12905C26084A22612J1464A2466J16654a30343
15062B25852R0551c7258E1984K64000K94102A35884K84297j21122J23685j94545
15052B28199q6388M71563k79690J86855k8572l7728k16315j1230J14905J73j34852
15041B06920J18476m1343J45435j63325J9160J78206n129B27633L16269J8617
15031E62519B08749p4413P65593D32533J34919O7383p0235k65545j30214L35865
$$ plain form
15108 187718 2329 16695 -43584 374844 161506 10542 182348 291993 41461 -228456 -90124
15096 56869 158192 284876 28438 93309 -107737 291344 9233 133791 206071 462612 148879
15084 42304 528371 130684 391285 223942 361022 285122 70338 31477 278588 32085
15073 107488 522549 76156 440986 -112905 326084 122612 134076 12466 129120 -130343
15062 225852 316403 -37258 51984 315984 610086 135884 420181 299059 422744 228199
15052 228199 141811 613374 333684 520539 491967 454239 237924 226694 341599 341772 206920
15041 206920 325396 284053 429488 266163 285323 463529 458400 227633 543902 562519
15031 562519 208749 134336 899929 432533 567452 634835 564600 299055 168841 504706
15021E04706j38074r3940L4877M58607C33444J67051j76749A21662C97K63917
15011B64314L25398j30157j80738K10679n9952j59245p4899j8097J20953M2181
15001C40437L81754l60621k3196K70055j43277J72854k48876j86046M53767B13536
14990C39706M2658M5073Q7078J6568n0115m284m6962k0242J23716K30757l7948
14979G26005m4898K18926j39968A06234L09315A23421K51422K94148j24430K48278
14969G92839l7990q7785N690A66187J7527K69588j47650L44355A08720K11411
14959C20131K95664k56206o8425O2408L28029k9334A55921J35244q4966J53617
14949C59816j14409L6581L32025k12784A30668N2725N58372j55509J10432j10753
$$ plain form
15021 504706 366632 272692 307569 766176 333444 500495 323746 121662 397 264314
15011 264314 589712 459555 278817 489496 429544 270299 195400 177303 298256 340437
15001 340437 722191 361570 338374 608429 465152 638006 389130 203084 656851 213536
14990 339706 382364 427437 514515 531083 480968 476684 429722 409480 533196 763953 726005
14979 726005 681107 900033 760065 106234 415549 123421 374843 668991 544561 792839
14969 792839 754849 667064 672754 166187 183714 453302 305652 650007 108720 320131
14959 320131 615795 359589 291164 353572 681601 652267 155921 291165 206199 359816
14949 359816 245407 281988 614013 401229 130668 183393 741765 586256 696688 585935
14939E85935K56698C44347P4033K03124q2709B22014J00966M14379q9975o7469
14929E79915L99288N7953J06126L6849M36332j01926k28355j32825K06989P958
14919A368304j50406n2631K80290N84518q0014j10879l35806m55988j36830J09663
14909A020221l14812j25220O5512r0298j72129j28566P8764C3320L69116C1985
14898F78099C32258J81460A94613M86758A43968L81217J10867B67912q0237Q5740
14888B73415K74749k67887N42705p1650r9780J03226L4605l120k89683K77825
14878G74405l5761L56725k08855l41538K64248j83885q2784Q6192N3468J276l4332
14867F49159j02688J8182J87529j63114j88446J77470J724o9856j62602K34147
$$ plain form
14939 585935 842633 344347 418380 621504 538795 222014 322980 737359 647384 579915
14929 579915 979203 1037156 1143282 1180131 1616463 1514537 1286182 1153357 1360346 1368304
14919 1368304 1217898 1165267 1445557 2030075 1950061 1839182 1503376 1047388 910558 1020221
14909 1020221 705409 580189 645701 555403 383274 254708 333472 33320 402436 31985
14898 678099 332258 513718 194613 681371 143968 525185 636052 267912 187675 273415
14888 273415 548164 280277 822982 751332 651552 754778 789383 786263 496580 774405
14878 774405 738644 1095369 886514 544976 809224 625339 542555 628747 682215 683491 649159
14867 649159 546471 564653 752182 589068 400622 578092 579816 509960 347358 581505
14857E81505j63210n6336F8749O17401B21692J68242M39319C27806j44404K57610
14847D41012J16185l6068j35272J84617R3129m6553L18905L05587l40062K86103
14837A187583k94817k9965j1879p0854C44526K02358l8442J90781l0680C22343
14826G84592M070k61073K46944C84699K04352k3361J66960q5584J08865J80817
14816I36748k94878J6897J71184k41263l0895j60934N1305J60747o6069k31297
14806C11545O34180k69204O4415J25906K98684k97364r9303k19916j91790R1049
14796D48202l2402K80805p7230L8802k81034N13849C52092J89002J58266j35021
14786E64339L89084k97203k08445K81442L0785m8032L3353A45945K25874K17159
$$ plain form
14857 581505 418295 361959 68749 686150 221692 389934 829253 327806 183402 441012
14847 441012 557197 521129 385857 570474 663603 617050 935955 1241542 901480 1187583
14837 1187583 892766 862801 850922 780068 344526 546884 508442 699223 668543 322343
14826 784592 788662 527589 774533 384699 589051 565690 732650 647066 755931 936748
14816 936748 641870 658767 829951 588688 557793 396859 448164 608911 542842 311545
14806 311545 945725 676521 740936 866842 1165526 868162 768859 548943 357153 448202
14796 448202 415800 696605 619375 658177 377143 890992 352092 541094 699360 564339
14786 564339 953423 656220 447775 729217 760002 711970 745323 145945 371819 588978
14776E88978J52052J46232Q280j31066l8418J65741M2237J34942k49529K5091
14766H44540j71668P7628j01671j14678J22370n3490Q9077j40360J62238p5684
14756F38302n1942q5738M8870N6027J20354j05193K89222p9576k31124j53507
14746D45695M1225O11526j63210k82325M25387C53476L33213M2586j61703J08664
14736F76236j32107L40458m15161N11944k5467n7986j98104J60315J35783M35166
14726A431077j5332L29500l6950l78711Q3459m75848J62335j63432J35485k37349
14716H34234M322L239n7914K61038j948J8575j27752J6306p0412p294p718M05997
14704A270673q5703m06802N49482r7822K25395K88563J70505k50094m83106K55663
$$ plain form
14776 588978 741030 887262 895542 764476 726058 891799 934036 1068978 819449 844540
14766 844540 672872 750500 648829 534151 656521 603031 692108 551748 713986 638302
14756 638302 586360 500622 549492 605519 725873 620680 909902 830326 599202 445695
14746 445695 486920 1098446 935236 652911 1078298 353476 686689 729275 567572 676236
14736 676236 544129 884587 469426 981370 955903 897917 699813 860128 995911 1431077
14726 1431077 1415745 1745245 1708295 1329584 1413043 937195 1099530 936098 1071583 834234
14716 834234 838556 841795 783881 1044919 1042971 1061546 933794 950100 879688 872394 864676 1270673
14704 1270673 1184970 778168 1327650 1229828 1455223 1743786 1914291 1664197 1181091 1436754
14694A436754k47338n63722J82300M6435J14623J26516P2207D75705L04661J01943
14684H82309q3598K31319o9678j08758J54j89526K94575J65076D94942N66960
14674A061902l49646L79629j75342K4866K44886k73567J79285J34187j48869k70462
14664H06869L98064k54732K12833k01036q8974K11315J08052m439o4967J05649
14654A228634o6935J61845K9084J47076j07036j18146k1293N3540J59538l47536
14644A118771J54732N2508l03953J4766L27221p126k52065K51878l13485L74231
14634A417478K376l1387Q3363l37479L35506p29064O56690o3276K18315p8584
14624A473938l50549K5280J26123J47939k09472Q8240J08892O9150J24791k37385
$$ plain form
14694 1436754 1189416 625694 807994 854429 969052 1095568 1167775 475705 780366 882309
14684 882309 798711 1030030 960352 851594 851748 662222 956797 1121873 494942 1061902
14674 1061902 712256 1091885 916543 941409 1186295 912728 1092013 1226200 1077331 806869
14664 806869 1204933 950201 1163034 961998 873024 1084339 1192391 1187952 1122985 1228634
14654 1228634 1161699 1323544 1352628 1499704 1392668 1274522 1253229 1306769 1466307 1118771
14644 1118771 1273503 1326011 1022058 1036824 1364045 1356919 1104854 1356732 1043247 1417478
14634 1417478 1419854 1388467 1471830 1134351 1469857 740793 1397483 1334207 1552522 1473938
14624 1473938 1123389 1148669 1274792 1422731 1213259 1301499 1410391 1479541 1604332 1366947
14614A366947j24215J28746J14863K60061l91455j95394O33495j31868k60388
14605A400792K40204Q3191j37187K00491j42756J22565k81887J89893j40895K53646
14595A788057J04489m59880L43635N9609k8259N7877k54130M99598j62346j67527
14585A781123J26496j53794J09960l16887L53267j7295r7725M40035k97059J74263
14575B102384o5212l8667J9176N9909L23622m35579J30416J55958k8235J00967
14565B324739O3794J17866P727J89340L5693j34469N8369L27448J74704j61940
14555C003271M90968J2826M35753K51884Q15639J368208J807014M424661P926701
14546B0536925J7219428M503355A9679701H370658l607357j112903O13840R21798
$$ plain form
14614 1366947 1242732 1371478 1486341 1746402 1354947 1159553 1793048 1661180 1400792
14605 1400792 1640996 1724187 1587000 1787491 1644735 1767300 1485413 1675306 1534411 1788057
14595 1788057 1892546 1432666 1776301 1835910 1807651 1865528 1611398 2110996 1948650 1781123
14585 1781123 1907619 1753825 1863785 1546898 1900165 1882870 1785145 2225180 1928121 2102384
14575 2102384 2037172 1998505 2017681 2077590 2401212 1965633 2096049 2252007 2223772 2324739
14565 2324739 2388533 2506399 2514126 2703466 2739159 2604690 2663059 2990507 3165211 3003271
14555 3003271 3494239 3507065 3942818 4194702 5010341 6378549 8185563 12610224 20536925
14546 20536925 37756353 42259708 19679701 8370658 4763301 3650398 4264238 5186036
14538E186036j971678q14680m78662M99469p10280L55094L8148J11185K75651
14529B490283k00605Q2808q1166p0710l8982J38930k3875L69705k45323K46403
14519B667468r5569j27560J14190j09890K45251j27886J91831n6908l52614P98726
14509C147039k6878L9354j10138j17156K35201k24520o6607L13968J72744k32043
14499C130964J37273m9215k62064K36828j59784J89179j74456K88442L76532M4100
14489C757799j40328J10494j81535l14913K67997L10413j65304K02831j9687N21000
14479D348767l05965k24535J58554N26575j87979l30352N5303J45124L36803k55555
14469D266740M6470K82363j67808K22114k43061l1101O86781o33676K68852M82854
$$ plain form
14538 5186036 3214358 2399678 1921016 2420485 1710205 2065299 2103447 2214632 2490283
14529 2490283 2289678 2372486 2291320 2220610 2181628 2320558 2296683 2666388 2421065 2667468
14519 2667468 2571899 2444339 2558529 2448639 2693890 2566004 2757835 2700927 2348313 3147039
14509 3147039 3120161 3159515 3049377 2932221 3167422 2942902 2876295 3190263 3363007 3130964
14499 3130964 3268237 3219022 2956958 3193786 3034002 3223181 3048725 3337167 3713699 3757799
14489 3757799 3617471 3727965 3546430 3231517 3499514 3809927 3644623 3847454 3827767 4348767
14479 4348767 4042802 3818267 3976821 4503396 4315417 3985065 4040368 4185492 4522295 4266740
14469 4266740 4313210 4595573 4427765 4649879 4406818 4375717 5062498 4428822 4697674 5180528
14459E180528N1070l7343j50338Q3772L39284j25935j31359K07000J43051o0545
14449E499185j14588K21204l8471R2962J03578K80336j23846k3260J17772K51013
14439F265885l14164M10287l2938M4371O88408r8070j24542o0013M16024k09668
14429F985580L22398l47327J67340L76855J01775L74540k45539Q6353M18739J40123
14419H380837J90013M69115j98171J50249k85619m8866M57742J595j15153K28709
14409I230451k1562N51193K48387J24682O5089L20660K65656L31030k32407K7929
14399A0911108M38204k88754J96111M53907j80981L61917K16858L18044L95478
14390A2821892l5996J17019N78652K93090k27723M69790M06592L81334j32102
$$ plain form
14459 5180528 5231598 5194255 5043917 5127689 5466973 5341038 5209679 5416679 5559730 5499185
14449 5499185 5384597 5605801 5567330 5660292 5763870 6044206 5920360 5897100 6014872 6265885
14439 6265885 5951721 6362008 6329070 6373441 7061849 6963779 6839237 6779224 7195248 6985580
14429 6985580 7307978 6960651 7127991 7504846 7606621 7981161 7735622 7821975 8240714 8380837
14419 8380837 8570850 9039965 8841794 8992043 8706424 8657558 9115300 9116895 9001742 9230451
14409 9230451 9208889 9760082 10008469 10133151 10198240 10518900 10784556 11115586 10883179 10911108
14399 10911108 11349312 11060558 11256669 11710576 11529595 11891512 12108370 12426414 12821892
14390 12821892 12785896 12902915 13481567 13774657 13546934 14016724 14423316 14804650 14672548
14381A4672548O52314J95412p971M33133N96773R1040J75322n1730Q77055p1415
14371A7562481O82343L58505L13085M71933K02741P42325L96339K70857M99901
14362B1500510N12336L06558K14504P35111O91044K79810J32797R73791M57150
14353B5803611P39891P53644O62481O47944M93907Q06881N78987O51411R34446
14344C2073203J368642M17169J082214J077987M49646J364453J027101J031070
14336C9891485J596691P61196J386448R32108J493272J446302J458427J699387
14328E0665316J473057J632119J852446K037206J917394J968367K449318J932384
14320F5927607K454513K176542K755412K471968L202419K419858L254190L418371
$$ plain form
14381 14672548 15324862 15520274 15512303 15945436 16542209 16633249 16808571 16756841 17633896 17562481
14371 17562481 18244824 18603329 18916414 19388347 19591088 20333413 20729752 21000609 21500510
14362 21500510 22012846 22319404 22533908 23269019 23960063 24239873 24372670 25346461 25803611
14353 25803611 26543502 27297146 27959627 28607571 29101478 29908359 30487346 31138757 32073203
14344 32073203 33441845 33859014 34941228 36019215 36468861 37833314 38860415 39891485
14336 39891485 41488176 42249372 43635820 44567928 46061200 47507502 48965929 50665316
14328 50665316 52138373 53770492 55622938 57660144 59577538 61545905 63995223 65927607
14320 65927607 68382120 70558662 73314074 75786042 78988461 81408319 84662509 88080880
14312H8080880L364673L966264M049535M212824M078080M587773N160685N130954
14304A22631668N470287N614847O330063O275072P071344P107965P687198Q026998
14296A76215442Q713707R119827R401060J0081491J0921534J1250993J1957685
14289B47661739J2040237J3023691J2828254J4280342J4236311J4529059J4965619
14282C43565252J4428777J4953696J4800623J4503072J3494782J2548330J1482455
14275D39776987R305122N510266K315405J467147M57170M64218j436541m529989
14267D53329785m916053o810958j0046840j1401230j2701719j4060378j4678656
14260C78713951j4861845j5456219j5529536j5060555j5346999j4634438j4636108
$$ plain form
14312 88080880 91445553 95411817 99461352 103674176 107752256 112340029 117500714 122631668
14304 122631668 128101955 133716802 140046865 146321937 153393281 160501246 168188444 176215442
14296 176215442 184929149 194048976 203450036 213531527 224453061 235704054 247661739
14289 247661739 259701976 272725667 285553921 299834263 314070574 328599633 343565252
14282 343565252 357994029 372947725 387748348 402251420 415746202 428294532 439776987
14275 439776987 449082109 454592375 456907780 458374927 458832097 459296315 457859774 453329785
14267 453329785 448413732 441602774 431555934 420154704 407452985 393392607 378713951
14260 378713951 363852106 348395887 332866351 317805796 302458797 287824359 273188251
14253B73188251j3252671j3327109j2622300j0240430j0940671j0286134j0486503
14246A92032433r400756q613655p977447p892456p389246o930808o613748n818079
14238A31396238n765105n402390n194848n290392m502911m076429m531653k996321
14230I3636189l668183m109840l085039k980415l213046k719569k866269k391293
14222F8602535k499968k260584j895420j945121k270537k315262j377009j846903
14214E2191731q64803j708667j564623j689779j308821j151793r13023r78563
14206D2011659j344075j179377j398999p89526j020360q08220p48895j138571
14198C3583636r31881r41666r24660n36085n25282q40160p87991o74017r59003
$$ plain form
14253 273188251 259935580 246608471 233986171 223745741 212805070 202518936 192032433
14246 192032433 182631677 174018022 166040575 158148119 150758873 143828065 137214317 131396238
14238 131396238 125631133 120228743 115033895 109743503 105240592 101164163 96632510 93636189
14230 93636189 89968006 85858166 82773127 79792712 76579666 73860097 70993828 68602535
14222 68602535 66102567 63841983 61946563 60001442 57730905 55415643 54038634 52191731
14214 52191731 51326928 49618261 48053638 46363859 45055038 43903245 42990222 42011659
14206 42011659 40667584 39488207 38089208 37299682 36279322 35471102 34722207 33583636
14198 33583636 32651755 31710089 30785429 30249344 29724062 28883902 28095911 27421894 26462891
14189B6462891p11096m38696n61270m37686m90525m54694q28979m62670j54834
14180B1922441l83807o81625l77261o52472N3567q07625k00719l83154o48269
14171A7841076J12494k61152m71652m87331l59253n50049N9218n45193k14463
14162A5123695l16245l55910K68056q50489j37732M3586k66033j31399j10127
14153A3267402n57785K66582l21238n17656j36488k21864Q0396p31783o6544j79873
14143A0881149P5734j38949m97838L68494n48045Q537k29427j11799k86211j00874
14133I420771J86845n42868m381K2404l43574Q8692j29531J65024m92229N8875
14123H430028j60361J04877o32182M38157l06667k60513k1664k34393L27886m21055
$$ plain form
14189 26462891 25751795 25313099 24751829 24314143 23823618 23368924 22539945 22077275 21922441
14180 21922441 21538634 20857009 20479748 19827276 19880843 19073218 18872499 18489345 17841076
14171 17841076 17953570 17692418 17220766 16733435 16374182 15824133 15883351 15338158 15123695
14162 15123695 14807450 14451540 14719596 13869107 13731375 13774961 13508928 13377529 13267402
14153 13267402 12709617 12976199 12654961 12137305 12000817 11778953 11859349 11127566 11061022 10881149
14143 10881149 10956883 10817934 10320096 10688590 10140545 10149082 9919655 9807856 9521645 9420771
14133 9420771 9607616 9064748 9060367 9082771 8739197 8827889 8698358 8863382 8371153 8430028
14123 8430028 8269667 8374544 7742362 8180519 7873852 7613339 7591675 7357282 7685168 7264113
14113G264113k188j16385J76099j67817l99588J05150k18474n961J81395o74167
14103F142177M46512l32764l660j50776L46711n96638r626j4167K13146j89931
14093E850984m33731K12215l5917K8881q8808k59692J00403j15995q9378P3046
14083E242008k24489j57374M8408j49057K36562k9048j44083j93516j83857L07891
14073D753445k91460l9531K36978l13613L26295n37266O9562J72247k61424J14043
14063D229276J38865r2756j3286j76895N1812J51611o82165L04454J19146l24231
14053C705831K7729l6977N6061L234n30835M82664Q287j35930o08518N11153m62050
14042C020649M2228L840L68621j25624O5444l21328L03029J2885l72489K09739
$$ plain form
14113 7264113 7261925 7145540 7321639 7153822 6754234 6859384 6640910 6634949 6816344 6142177
14103 6142177 6588689 6255925 6252265 6101489 6448200 5851562 5841936 5827769 6040915 5850984
14093 5850984 5417253 5629468 5593551 5622432 5533624 5273932 5374335 5258340 5168962 5242008
14083 5242008 5017519 4860145 4908553 4759496 4996058 4967010 4822927 4629411 4445554 4753445
14073 4753445 4461985 4422454 4659432 4345819 4672114 4134848 4204410 4376657 4115233 4229276
14063 4229276 4368141 4275385 4262099 4085204 4137016 4288627 3606462 3910916 4030062 3705831
14053 3705831 3733560 3696583 3752644 3755878 3225043 3707707 3715994 3580064 2971546 3482699 3020649
14042 3020649 3062877 3066717 3435338 3309714 3375158 3053830 3356859 3369744 2997255 3206994
14032C206994J32175k22280J24987m75820K73301J00154m09627L01617J3572j04000
14022B941073k4637k04317m948J48118R4912j78969r3849m5972Q8134m25520p793
14011B286232O2048L76895n98784K97072R717r948P8272O7697k53774Q2266O7396
14000B465089l29387J81154Q956j22812J0271j15637k65357O09937k33377L22549
13990B531386M46774J492468K675900O273711J6417979J4782638j7812046j3096721
13982A3712089n351300k512942j113700o22700l01534l75859K8984k35964k66969
13973B960105j04540l53232j37613K82777m9542P8241j82276j90966n97921N43931
13963B248964R1970m28994M1400K69724k23518K17045J56684q5833k58369P2306
$$ plain form
14032 3206994 3339169 3116889 3241876 2766056 3039357 3139511 2729884 3031501 3045073 2941073
14022 2941073 2916436 2712119 2707171 2855289 2950201 2771232 2677383 2631411 2719545 2294025 2286232
14011 2286232 2348280 2725175 2126391 2423463 2433180 2423232 2501504 2569201 2315427 2397693 2465089
14000 2465089 2135702 2316856 2325812 2203000 2213271 2097634 1832277 2442214 2208837 2531386
13990 2531386 2978160 4470628 7146528 13420239 29838218 44620856 26808810 13712089
13982 13712089 8360789 5847847 4734147 4111447 3809913 3434054 3463038 3227074 2960105
13973 2960105 2855565 2502333 2364720 2647497 2597955 2676196 2493920 2302954 1705033 2248964
13963 2248964 2340934 1911940 1953340 2223064 1999546 2216591 2373275 2287442 2029073 2101379
13953B101379n0402J58190p4628l13099K51759l64511K10237J60427k07829j67680
13943A703843k26425N02165j23k34735j74760J95621l75250N99690l02801N3546
13933A740771K714m1830J37740L7773j76397j84789N162j29687J53185k12268
13923A332374J2835M18174m06975j84231N30409m8037r8269k3055k53439J52054
13913A431840K45660j76449J8734l53153k2345N63381j41300N297j43071j26594
13903A302000J58247J59406j54274k12317L64243l93741M2115P7500J26539M6040
13893A515758j74027J5148j3946j64093L11067N1046k37233j9327j52032N8562
13883A190923P1802P1603m7034k39763L07070j38525r8419J69986R1656l38382
$$ plain form
13953 2101379 2050977 2209167 2134539 1821440 2073199 1708688 1918925 2079352 1871523 1703843
13943 1703843 1477418 1979583 1979460 1744725 1569965 1765586 1390336 1990026 1687225 1740771
13933 1740771 1743485 1701655 1839395 1877168 1700771 1515982 1521144 1391457 1544642 1332374
13923 1332374 1345209 1763383 1356408 1172177 1702586 1654549 1556280 1533225 1279786 1431840
13913 1431840 1677500 1501051 1519785 1166632 1144287 1707668 1566368 1571665 1428594 1302000
13903 1302000 1460247 1619653 1465379 1253062 1617305 1223564 1265679 1343179 1469718 1515758
13893 1515758 1341731 1356879 1342933 1178840 1489907 1540953 1303720 1284393 1132361 1190923
13883 1190923 1262725 1334328 1287294 1047531 1354601 1216076 1117657 1287643 1379299 1040917
13873A040917k4699K60122j64357J9063k46085J72735M3006k7487Q9755k35498
13863I27472N56950o98348L42201m3364J02320q6895J09936j19670M9104K73434
13853A413140l99310J10326k37238P2378N1901j07352K52657Q591l1144j34093
13843I99856j2583j95721K00479K40775l73432M59759n96857J9282M00484j54983
13833I87059L1233n472K57119l47717L12093l19603p4738p1400K39369l64377
13823F43566N01520J01700m56956O7769L72877m90801K08897J09341j97387Q866
13813H69392Q6767k45091J49591n0369N6909j97651O5510J22279q6506K25675
13803I96506l03601K51494J1981j18729j57456m3366J97790K57582k69052j45600
$$ plain form
13873 1040917 1016218 1276340 1111983 1131046 884961 1057696 1100702 1073215 1162970 927472
13863 927472 1484422 786074 1128275 1084911 1187231 1100336 1210272 1090602 1139706 1413140
13853 1413140 1013830 1124156 886918 959296 1011197 903845 1156502 1165093 1133949 999856
13843 999856 987273 791552 992031 1232806 859374 1319133 722276 741558 1142042 987059
13833 987059 1018292 1012820 1269939 922222 1234315 914712 839974 768574 1007943 643566
13823 643566 1145086 1246786 789830 857599 1230476 739675 948572 1057913 860526 869392
13813 869392 956159 711068 860659 810290 867199 669548 735058 857337 770831 996506
13803 996506 692905 944399 956380 837651 680195 636829 834619 1092201 823149 677549
13793F77549j85501L97816j63026j83558J58911o0573K92761m8831N5820j23296
13783H18072l01122L43076o5580M5372C80602K76767L50688m34799n7831J3378
13773E28805K26729P7935L23205m47828C38760J01677L95038O6611k26001j15004
13763E61081r87L44894m17932L21987k03071j06674N2521n6170R4584K98228C65396
13751H90288j58608O4610k75238J41772o3146k69652K59385n1721K97976j68519
13741F67147k889J27651k05258L50662k31972j32252J22704j3687k43671j3027
13731D25408L39602j84246j52246J24310L18080n4661Q2620r0567l29570M36061
13721I14791m44417N49114D01984O2910L56628k87863l9570B43159L60222j42160
$$ plain form
13793 677549 492048 889864 726838 543280 702191 641618 934379 885548 941368 818072
13783 818072 516950 860026 794446 839818 380602 657369 1008057 573258 515427 528805
13773 528805 755534 833469 1156674 708846 338760 440437 835475 902086 676085 561081
13763 561081 560094 904988 487056 809043 605972 499298 551819 495649 590233 888461 365396
13751 890288 731680 796290 521052 662824 599678 330026 589411 537690 835666 667147
13741 667147 664258 791909 586651 937313 705341 573089 695793 682106 438435 425408
13731 425408 765010 580764 428518 552828 870908 816247 898867 808300 478730 914791
13721 914791 470374 1019488 401984 464894 821522 533659 494089 243159 603381 461221
13711D61221J07319p5858L72997B20832J99808J09796K31961j21116j61151J14832
13701E94962J23657j79807A79833L88111R2414j46156j91272J80139K5057J75180
13691G03306k71490J38034j66034K26769P185J623k69797R7287P6542q4690J1077
13680D69812J31622r4294F5783J37182N26596k31914I7997O76552p786j23072
13670F43691p2408B60251J19985j56133P676K5167J12365k5624k559J11013J2259
13659D64400j10921Q7813K4818j52547J30559O7361K57320k27700B01410K05108
13649D06518J24461o2646R7016m3365j76226J07663B20699L62424J85695n6847
13639G11971k62535F8236M78233M5355j93433K16004J6016j15947k14826o9394
$$ plain form
13711 461221 568540 492682 865679 220832 420640 530436 762397 641281 480130 594962
13701 594962 718619 538812 179833 567944 660358 514202 322930 503069 528126 703306
13691 703306 431816 569850 403816 630585 637770 639393 369596 466883 543425 458735 469812
13680 469812 601434 507140 65783 202965 729561 497647 97997 774549 766763 643691
13670 643691 571283 260251 380236 224103 231779 256946 369311 343687 341128 452141 464400
13659 464400 353479 441292 466110 313563 444122 511483 768803 541103 201410 406518
13649 406518 530979 468333 565349 521984 345758 453421 220699 583123 768818 711971
13639 711971 449436 68236 546469 591824 398391 614395 630411 514464 299638 230244
13629B30244K6529A19089B5958K76525l5867L29262B67912J76381Q7380j96323
13619C35350K29701A63071K84726j86671j14670J16069J75603A13902J39633a3933
13608C98262j36616P3891p6069K75813k02496K27853l3874k06514l8217n5952
13598B26081P9869j05448L38363j99193J47797A88184R9682J45179M51283k99437
13588E84891B34952j09411J63381R0204p0532m3993J19167r1589A44330L11516
13578D55846A14212N76521n8990k89703J37718Q4242A89367K35370G5677P975
13568H3652J83406D5140K67382k9188E5033J44170K82630O3185A10570K07700
13558C18270P2937r8632H9279K42935j03108L3640L7974j17084Q7011J45360n4921
$$ plain form
13629 230244 256773 119089 25958 302483 266616 595878 267912 444293 531673 335350
13619 335350 565051 163071 447797 261126 146456 262525 438128 113902 253535 -13933
13608 398262 261646 335537 259468 535281 332785 560638 526764 320250 282033 226081
13598 226081 305950 200502 538865 339672 487469 188184 287866 433045 884328 584891
13588 584891 234952 125541 288922 379126 308594 264601 383768 292179 144330 455846
13578 455846 114212 690733 631743 342040 479758 564000 189367 424737 75677 83652
13568 83652 267058 45140 312522 283334 55033 199203 481833 545018 110570 318270
13558 318270 391207 292575 89279 332214 229106 262746 300720 183636 270647 416007 361086
13547C61086K60898j52683k04908K99733j71822r8186R1545A49982N60032A95890
13536C17193n2004Q6099p8886d1787C57937j25848b826D59381l9431E8211L45407
13525D03618k0345Q2745C4510K29346N421L0432J16737m6662l725G1139P6318
13514A47457N9630p7075L23955A54370B7434M11068j19195L10804A53886o1253
13504I2633L44530j60049K53744j10030r7936A31040Q0614q8248J17592R0611
13494C31609j1595G6878O9890M03726k23800P8359I4950M73923k53201n6222R4254
13483C53704b9073F28937A66898M7390J23797B3041J70818a30003A86576J56884
13473C43460J42343O5473B57299O1992R0176p5789a54067A86835l3829R9984j2128
$$ plain form
13547 361086 621984 469301 264393 564126 392304 294118 385663 149982 710014 195890
13536 317193 265189 351288 272402 -41787 357937 232089 -2826 459381 419950 58211 403618
13525 403618 383273 466018 34510 263856 269277 299709 416446 369784 366059 71139 147457
13514 147457 207087 130012 453967 154370 27434 438502 319307 630111 153886 92633
13504 92633 437163 277114 530858 420828 322892 131040 211654 123406 240998 331609
13494 331609 320014 76878 146768 550494 326694 405053 94950 568873 315672 259450 353704
13483 353704 -29073 628937 166898 214288 338085 23041 193859 -130003 186576 343460
13473 343460 485803 551276 257299 319291 409467 333678 -154067 186835 153006 252990 240862
13462B40862m0140J62004J50615k5833a2162D33479A14913K05497j18599q4415
13452A17396L0165P8040I5446P4807O9446A2880J66655E1997J782J41151K71250
13441D66180A54914P2376O8770L895G8955L6503p815M0305q461d6762B7669F794
13428A12235L07445j88439J07591J7851P2444j20009J24214a5490B65475J33856
13418C99331j39062p2021r908B1399R7842L47366b3535A20690B1352L36902A77306
13406C39345a98059A16073R6043L36928B33497J23003i1219G8930K6204a19985
13395A16097L74328A11291M4725J03227B7533N2449K28509a63115a1428j46408
13385a57836j94778I4235L22931r8631J10104b29317F49137d162o2956B46970
$$ plain form
13462 240862 200722 362726 513341 487508 -12162 433479 114913 320410 201811 117396
13452 117396 147561 225601 95446 170253 239699 12880 179535 51997 53779 194930 466180
13441 466180 154914 227290 296060 299955 78955 115458 107643 147948 139487 -46762 27669 6794
13428 112235 419680 231241 338832 356683 429127 309118 433332 -15490 265475 399331
13418 399331 260269 188248 178340 21399 119241 466607 -23535 120690 21352 358254 177306
13406 339345 -198059 116073 212116 549044 233497 356500 -91219 78930 105134 -119985
13395 116097 490425 111291 156016 259243 27533 79982 308491 -163115 -11428 -157836
13385 -157836 -352614 94235 417166 318535 428639 -229317 649137 -4162 -67118 246970
13374C52650e7376D17186p8610A06280D0396Q0099L7612p0117N74888k35872A16660
13362a37297F9817i1578k5407B02038J61197F7687L98292B09986M4912R3924b57869
13350A41964D2295L18329g0562D17335k00752j5647B1305M9848O2369J0594P6661
13339B20777K4641b58512C74395p3622F9059J91953F8563J58893K5029I1744L09333
13328D01077A01156m8730J21941L154G1756b2354A29476R4474K3883L5610i6191
13316C03023k0221K05491k41324l4546q1028F5661K94338a03738A44355K48335
13306C92690j40066k1993J30701A28525F1558M4024K3359N8154D394J34844N08008
13295F47246E3333K38882a5583A46626o7788L8852K54070H8629L5175m577E5031
$$ plain form
13374 352650 -57376 417186 338576 106280 40396 120495 158107 87990 662878 427006 116660
13362 -137297 69817 -91578 -116985 202038 363235 67687 465979 209986 254898 348822 -257869
13350 141964 42295 360624 -70562 417335 216583 200936 21305 71153 133522 144116 220777
13339 220777 245418 -258512 374395 300773 69059 261012 68563 227456 252485 91744 401077
13328 401077 101156 52426 174367 177521 71756 -22354 129476 223950 247833 283443 -96191
13316 303023 282802 488293 246969 212423 131395 65661 359999 -103738 144355 392690
13306 392690 252624 230631 361332 128525 61558 105582 128941 187095 4394 139238 647246
13295 647246 53333 292215 -15583 146626 78838 117690 371760 88629 123804 119227 55031
13283C0364J64581g8029A45611j3046e727B18775L3900c08791a43788f953C25926
13271B78018r6509A8675K74146a26694C41215B3351J24775J83282J24151a67320
13260A35185L924b46287A55883G6040K24806A34163J12508b0587A17632R312b7201
13248E22314I2993c34769A38105e9436A69805a66021I4896J08626L26057k17825
13238C11754a76927F6412M7859J45004N0762c43361a44491D9510K0350N8960f5743
13226A16662M9694e2121C92900a25198A67454o3135J177J68300j15726a88197
13215a83268A15743J0264b69103E5872f3326J3982B61237c11564A03563d9760
13204b00565C10892o5063G2638P2665b1625G5646d4456A2117J95018p4315a19629
$$ plain form
13283 30364 194945 -78029 145611 132565 -5727 218775 252675 -308791 -143788 -6953 325926
13271 278018 181509 18675 292821 -126694 341215 23351 148126 331408 455559 -167320
13260 135185 139109 -246287 155883 76040 300846 134163 246671 -20587 117632 126944 -27201
13248 522314 92993 -334769 138105 -59436 169805 -166021 94896 203522 529579 311754
13238 311754 -176927 66412 114271 259275 310037 -343361 -144491 49510 69860 128820 -65743
13226 116662 166356 -52121 392900 -125198 167454 104319 105496 273796 158070 -188197
13215 -183268 115743 126007 -269103 55872 -63326 -49344 261237 -311564 103563 -49760
13204 -200565 310892 245829 72638 145303 -21625 75646 -44456 12117 207135 132820 -119629
13192A80502b28972H1781J30328p2750A8500J13603h7676B40339H0692J39920
13182B20612B8262M01282F8169J56857b34072A93430a3808B07680c5238B43862
13171A14336a65035b1231F817J24326c21752D60531b46353E0672f7104A20129
13160I4790F808c60802G9192J43586c107A07276Q7821a8559q128A07478K49545
13149C57023j30703g1460A35996b85048D70424h7980I4250g2548j89452J02191
13139a59809A52694J52291E6717J89691a70746B84456j15456J13590a47774F7877
13128a07955B9285J14323L51617B19537G8267N2799j3290a05601B69769m2059
13118B27710M5423e0837H81d7987C21582b23927B19877G6564a8638A55972J39752
$$ plain form
13192 180502 -228972 81781 212109 139359 18500 132103 -87676 240339 80692 220612
13182 220612 28262 429544 68169 225026 -234072 193430 -13808 207680 -35238 243862
13171 114336 -165035 -21231 6817 131143 -321752 460531 -246353 50672 -67104 120129
13160 94790 6808 -360802 79192 222778 -3107 107276 195097 -18559 -26687 107478 357023
13149 357023 226320 -71460 135996 -285048 470424 -87980 94250 -72548 -262000 -159809
13139 -159809 152694 304985 56717 246408 -170746 284456 169000 282590 -147774 67877
13128 -107955 29285 143608 495225 219537 78267 131066 117776 -105601 269769 227710
13118 227710 273133 -50837 881 -47987 321582 -223927 219877 76564 -18638 155972 295724
13107B95724A42261J91424a23776A70706p0741f8160A59054a96808f7839C79181
13096a29011C8744L40442k7986a12303L6740j5202a5662B27911c2582k99330e8253
13084B35522J30149p7867d3356A15133g5012G1396J02563A2814L06168r3341A00035
13072a6642A16839M2945m5984D9650K42377f7462j3631J7456I8531Q0905R5062
13061B74498a79905C12461B0733J94161a2094C76671G4679Q5304m1103L1978a70997
13049B0143P9197J29564H0931a53328C8217a57152A06980J11638A06127L82387
13039D88514a7926A33510o1853i6566A82436J19100a26948B11001D3507A9508
13028F4867L94216f7835A87241O532a26030B00733I4216c08735I2685L74921A61535
$$ plain form
13107 295724 142261 333685 -123776 170706 99965 -68160 159054 -196808 -67839 379181
13096 -129011 38744 379186 351200 -112303 -75563 -90765 -15662 227911 -32582 -331912 -58253
13084 235522 365671 287804 -43356 115133 -75012 71396 173959 12814 318982 225641 100035
13072 -16642 116839 159784 113800 49650 292027 -67462 -81093 -63637 98531 179436 274498
13061 274498 -179905 312461 20733 214894 -12094 376671 74679 159983 118880 150858 -170997
13049 20143 99340 228904 80931 -153328 38217 -157152 106980 218618 106127 488514
13039 488514 -17926 133510 71657 -96566 182436 301536 -126948 211001 43507 19508
13028 64867 459083 -67835 187241 193773 -126030 200733 94216 -308735 92685 467606 161535
13016A66667F2449A1806N3151K3629C4623f9088D61364B4987a04888L6042r7002
13005a65848p6051A97271q3063O2540d3597I0533J43719i3723G5106L29427K3494
12994D28027a0546k1910G4339j5856A4188a4223B21375H3077B2638N0517j0722
12983F2433K51962j43771b1204k02428B38886a85960A34200D6134K82842h3605
12972I8319k3663b72114f090C68114i0321B2972N0775d08696f2502E2701J17723
12961A70424G266i8041M6075A7308a54519B895K53393j00215a8163n9032I3649
12949d87688a0589n4692F5450c8189D2990P1678r315b5148D3551J54156B550J343
12937C893N3886E037M6052d7073j63319K9963B56182A21338a50566p7536B76951
$$ plain form
13016 166667 62449 11806 64957 88586 34623 -69088 461364 24987 -104888 -68846 -165848
13005 -165848 -241899 197271 114208 176748 -43597 90533 234252 -93723 75106 404533 428027
12994 428027 -10546 -32456 74339 58483 14188 -14223 221375 83077 22638 73155 62433
12983 62433 314395 170624 -21204 -223632 238886 -185960 134200 46134 328976 -83605
12972 98319 74656 -272114 -6090 368114 -90321 22972 73747 -408696 -62502 52701 170424
12961 170424 7266 -98041 -51966 17308 -154519 2895 256288 156073 -18163 -77195 93649
12949 -487688 -10589 -65281 65450 -38189 42990 114668 105353 -25148 43551 197707 2550 3893
12937 3893 57779 5037 51089 -47073 -210392 -180429 256182 121338 -150566 -228102 276951
12925A04429o615g1773G8710K75821F4220e826l0405I0819a06005A68745a20388
12913a69333A97094I2155f6508m05991C2506C398e5338B93589g2398A31251h1540
12901d0831F9969b1755r9655A11836b1755B96916J07588d0576G4574c5355f454
12889B1152M4510J39798m7427C526e279B81631A0396L3520K16613p4402d1845
12877f9794A30925C8986K14280c4302B6873J98327a14036A41642N4941a23380
12866e2291H694J31146a26633D8987j2823L72979F5766J42596o2685f4026b3920
12854A61828h4318E4147O3651H741a9347A93723d2594B9536d8141D0466A8993
12842a33336j2219j00312B7302J70534q1138b19355h9937l18314A1954P4125A5756
$$ plain form
12925 104429 97814 -71773 78710 354531 64220 -5826 -36231 90819 -106005 168745 -120388
12913 -169333 197094 92155 -66508 -472499 32506 3398 -55338 293589 -72398 131251 -81540
12901 -40831 69969 -21755 -121410 111836 -21755 296916 404504 -40576 74574 -35355 -6454
12889 21152 65662 205460 158033 3526 -5279 281631 10396 43916 260529 186127 -41845
12877 -69794 130925 38986 253266 -34302 26873 225200 -114036 141642 196583 -123380
12866 -52291 8694 139840 -126633 48987 36164 409143 65766 208362 145677 -64026 -23920
12854 161828 -84318 54147 117798 8741 -19347 193723 -42594 29536 -48141 40466 18993
12842 -133336 -145555 -245867 27302 197836 116698 -219355 -89937 -408251 11954 86079 15756
12830B06425a17021C0113b7559k22873N9288l3154F1444c0609A13686O0210O5240
12819B39136e7756H9813J41709H8903d8921k32317B34159a83653A75331o147j3785
12808A55399F3148a46624B168K20905e7770q5786E8340g1404B24207j9183a48089
12796c61280f6610p6389E8725c77946a11677D7712H265e9805j34539A79603i0714
12784a62421A99281a97992D3100a46554B29366B1799K104b3158k41660A50587
12773D27452j33953F5850a0349A69069p5772A7653b96284f3156k70780B53821
12762C06019B5535f2259F8018b06123A01581O9189B634K20849G9034K1074a15629
12750i0319G2310B3050m06a90925p215L93a2981j20254Q057l2851l4878H4595
$$ plain form
12830 206425 -117021 30113 -27559 -250432 -191144 -224298 61444 -30609 113686 173896 239136
12819 239136 -57756 89813 231522 88903 -48921 -281238 234159 -183653 175331 169184 155399
12808 155399 63148 -146624 2168 223073 -57770 -143556 58340 -71404 224207 205024 -148089
12796 -361280 -66610 -142999 58725 -377946 -111677 47712 8265 -59805 -194344 179603 -90714
12784 -162421 199281 -197992 43100 -146554 229366 21799 23903 -23158 -264818 150587
12773 427452 293499 65850 -10349 169069 93297 17653 -296284 -63156 -333936 253821
12762 306019 25535 -62259 68018 -206123 101581 170770 2634 223483 79034 100108 -115629
12750 -90319 72310 23050 22644 -190925 -198140 -197747 -12981 -133235 -125178 -158029 -192907 84595
12737C65584b48216A98208a37998A37992k6323a38042B57855n6012h4427H5970
12726A8470f4531k08620e8887A30136a35082K51A58163a6248o4497A47932m4855
12715A03077N0154c17289A54731G0174J36180r7574n2486J10636J12814B6951
12704B79247A30261c0893A99880g4364h872j05680j21125B19617a54903A54536
12693A58702F8447a00853J7860M0757H8878J4537G455L7721J64028A6568i4903
12681C8960k277a44086H2875O3027e4438G6032f6450A11586a2435B4994D330c5913
12668B5289N01772A74272F3636J7180M2728e2512g532A89384e0597G8065n528
12657G2537A5505b5947o1521j16655A27804e426D90857j92092j21600d2437F869
$$ plain form
12737 365584 -248216 198208 -137998 137992 111669 -138042 257855 201843 -84427 85970
12726 18470 -64531 -273151 -58887 130136 -135082 -134831 158163 -16248 -80745 147932 103077
12715 103077 153231 -317289 154731 70174 206354 108780 56294 166930 279744 26951
12704 279247 130261 -30893 199880 -74364 -8872 -114552 -235677 219617 -154903 154536
12693 158702 68447 -100853 -82993 -42236 88878 103415 7455 45176 209204 16568 -94903
12681 38960 36683 -144086 82875 145902 -54438 76032 -66450 111586 -12435 24994 4330 -35913
12668 25289 527061 174272 63636 80816 123544 -52512 -7532 189384 -50597 78065 72537
12657 72537 15505 -25947 -87468 -204123 127804 -5426 490857 298765 177165 -42437 6869
12645c2915E137e2327l58586b3947B35208a15370j4019G3769a57148A09898h1919
12633a99516A53292J34557g9445B24905N9465h8034B20783l3001L3404J88001
12623D09187G8891R906J29555P4416d8308A56965J28179a29360O3091K5032B12214
12611B24709h0293F8151i1026B30196b68664C62167G1306J5194l5452j2069a08429
12599E574b95358A46780a92427c0101A29600b32181e766B41977e9711j8675B00559
12587a71795B60450a86750j2148A36876j7194b76051E0185b39347f5159A78963
12576D1323c4712C89106A32571a62787K7058A42559j9504E5010a35735n0541o6859
12565b53135J23517I6739a21519E174a1747H7647B7659b54621a02886B08089P3527
$$ plain form
12645 -32915 5137 -52327 -410913 -23947 235208 -115370 -129389 73769 -157148 109898 -81919
12633 -199516 153292 287849 -79445 224905 284370 -88034 220783 187782 221186 409187
12623 409187 78891 88797 218352 292768 -48308 156965 285144 -129360 -66269 -41237 212214
12611 224709 -80293 68151 -91026 230196 -268664 362167 71306 86500 51048 38979 -108429
12599 5574 -295358 146780 -192427 -30101 129600 -232181 -5766 241977 -59711 -78386 200559
12587 -171795 260450 -186750 -198898 136876 119682 -276051 50185 -239347 -65159 178963
12576 41323 -34712 389106 132571 -162787 -135729 142559 123055 55010 -135735 -186276 -253135
12565 -253135 -129618 96739 -121519 5174 -11747 87647 27659 -254621 -102886 208089 281616
12554B81616C0256o051Q7466J27324d3093B1194a64012F387a88624O5246K2636
12543a00742H041J84254d7526A3453J24602C6089a99273E8127N1043J07078b5819
12531A78400A4581K7415h7397K1600J6398A60699a12236b9266b476j49962c6941
12519D8982n892a4061j62721A01891b10825C24551r4561K6143e9158j15578h6992
12507a04282A08090K25017A63514g3435B37507a6428A23984A7244a09236k2423
12497a31659G1538R608L7584i7544p0507b1297B08475i8191B5982J96700p1235
12486A51447h6579n0135l39232K34289B02521A5570c7574j87667A8917J25068
12476A43985a70717m5531C21548i4468C11200A0386K2197a8671A12209j9179b90444
$$ plain form
12554 281616 30256 24205 111671 238995 -43093 21194 -164012 6387 -188624 -123378 -100742
12543 -100742 8041 192295 -47526 13453 138055 36089 -199273 58127 109170 216248 -25819
12531 178400 14581 41996 -87397 -65797 -49399 160699 -112236 -29266 -2476 -152438 -36941
12519 48982 43090 -14061 -176782 101891 -210825 324551 229990 256133 -59158 -174736 -86992
12507 -104282 108090 333107 163514 -73435 237507 -16428 123984 17244 -109236 -131659
12497 -131659 71538 81146 118730 -97544 -168051 -21297 208475 -98191 25982 222682 151447
12486 151447 -86579 -136714 -475946 -241657 202521 15570 -37574 -225241 18917 143985
12476 143985 -170717 -216248 321548 -94468 311200 10386 32583 -18671 112209 93030 -290444
12464b80694G3262d8733a1287l73161f9263O982A7981a84409E9670N9696L4948
12453A54314m2134c1925I2648a40465A47515o1986K5581g3009A20694e9941b8513
12441a99208A88807H3654a47218c2065A23064h1521F9960h8154J1372k8271a0270
12429B4210P1522a60933A24289J71161e4042b5180k93666H426K83119i9168A64636
12417c4616j28801A70877Q1513d9304j50413i6695d7534j79383F8080b65885c2206
12405I8613O3022m6344F776M2158K22376f0824j19481A49022a23206E6293b2263
12393A31629b42426f3922A42003h0065k4442A9471J76467a75948P7083I0635C2270
12381a52453A86867a52563D5329b76239B45823a04138A15738P8897l9393e6439
$$ plain form
12464 -280694 73262 -48733 -11287 -384448 -69263 -62281 17981 -184409 59670 119366 154314
12453 154314 112180 -31925 92648 -140465 147515 85529 111110 -73009 120694 -59941 -28513
12441 -199208 188807 83654 -147218 -32065 123064 -81521 69960 -88154 -76782 -105053 -10270
12429 24210 95732 -160933 124289 295450 -54042 -25180 -318846 8426 291545 -99168 164636
12417 -34616 -163417 170877 252390 -49304 -199717 -96695 -47534 -226917 68080 -265885 -32206
12405 98613 161635 115291 6776 48934 271310 -60824 -180305 149022 -123206 56293 -22263
12393 131629 -242426 -63922 142003 -80065 -104507 19471 195938 -175948 -98865 90635 32270
12381 -152453 186867 -152563 45329 -276239 245823 -104138 115738 194635 155242 -56439
12370I2196M9845G187J8273J58383g1437B94889c7427D0899a61955k69128J67119
12359b63964A48013L762c29369g9941B53417c6071D224J02230h1819E3685J0217
12348F3902a18588A7438A036M8867J42226a20515m9649j45507J48380B2862J36442
12337A59304H889L43043A66462L6024H9184a96363I601M80252a88467C44903J17652
12326D62555B18369R8014j13635C2871J20583C3495L27597J57644b0353A44899
12315B83658e0226A55656B9226J15539G0029B3458a3462B37298B9566e2397A81003
12303C82138q4132f1342E6152a27131Q033A51335f54320A23031k2235J57005a08915
12291b18757A8467d5549o5133A66623B454J1594K23592i8335B78156f1628D50525
$$ plain form
12370 92196 142041 7187 25460 183843 -71437 294889 -37427 40899 -161955 -431083 -263964
12359 -263964 148013 151775 -329369 -79941 253417 -36071 4224 106454 -81819 53685 63902
12348 63902 -118588 17438 1036 49903 192129 -120515 -170164 -315671 -167291 22862 159304
12337 159304 8889 351932 166462 202486 89184 -196363 9601 489853 -188467 344903 462555
12326 462555 218369 316383 202748 32871 153454 33495 361092 518736 -20353 144899
12315 283658 -50226 155656 29226 144765 70029 23458 -13462 237298 29566 -52397 181003
12303 382138 298006 -61342 56152 -127131 -119098 151335 -654320 123031 100796 257801 -108915
12291 -218757 18467 -45549 -110682 166623 2454 14048 237640 -98335 278156 -61628 450525
12279A42452m3730D3237L9463c257k0339C0958K23889G2488P8321E543e937A22020
12266a5702H6532J04424k4023p7662f8157B97923F5885a15710C45762A19778K1736
12255A41514J27297J11644A02544K89509p6953H9697D1890J48228O3954a00068
12244b13686C62492j35531F1513b8800p9203A89661J50459A38334J87456j49421
12234A76369N6395H5958c8918B91555A31708Q9585a84656R0037A40380A0373J66804
12223A77177K19358j26275H5529L03370A62149J91869q5703A18328a37023A28477
12212a9666F2464K27440A14337C7314O5151K07496A44558B7242f3319A68780b9813
12200G5084J80883b15766D87698j19012b5902H488K24378B2649J49077L0294p3103
$$ plain form
12279 142452 98722 43237 82700 -3257 -23596 30958 254847 72488 150809 5543 -5937 122020
12266 -15702 86532 190956 166933 89271 -68157 297923 65885 -115710 345762 119778 141514
12255 141514 268811 380455 102544 392053 315100 89697 41890 190118 254072 -100068
12244 -213686 362492 226961 61513 -28800 -108003 189661 340120 138334 325790 176369
12234 176369 232764 85958 -38918 291555 131708 221293 -184656 -94619 140380 10373 177177
12223 177177 396535 270260 85529 388899 162149 354018 268315 118328 -137023 128477
12212 -19666 62464 289904 114337 37314 102465 309961 144558 27242 -63319 168780 -29813
12200 75084 255967 -215766 487698 368686 -25902 8488 232866 22649 171726 202020 128917
12189A28917L0332J53392j42375K37774H0680B9621J94378B005J43623a75834
12178g1514b4221I3729B9500O3195K03849D3708L7042K98586I1407f9046A25159
12166D52510M7825E3097K18024B506R2024J17588j9886j1000p5173P6243q6768
12155I5534k1335J43403D9329d1107G3821O097h4249H0272d7133l0582c8682B49101
12142I6663J04563H715b00933B89194J3943G1014M190a70760C71538P8001a7225
12130b30975B40534n7389b5831B0790J84724q3874J11573b5793a1536C13709H7234
12118D34899a0303k92478A0178Q964e4082q4614I1202J11990r8084J4422D1704
12106A72575K5828i1510B78526j33511C1819L36206a01917A75853M129p8262B2698
$$ plain form
12189 128917 159249 312641 170266 408040 80680 29621 223999 2005 145628 -175834
12178 -71514 -24221 93729 29500 92695 296544 43708 80750 379336 91407 -69046 125159
12166 452510 500335 53097 271121 2506 94530 212118 192232 181232 106059 182302 95534
12155 95534 74199 217602 49329 -41107 73821 79918 -84249 80272 -47133 -77715 -38682 249101
12142 96663 201226 8715 -200933 289194 303137 71014 75204 -170760 371538 449539 -17225
12130 -230975 240534 183145 -25831 20790 205514 121640 233213 -25793 -11536 313709 87234
12118 434899 -10303 -302781 10178 19142 -54082 -138696 91202 203192 105108 119530 41704
12106 172575 198403 -91510 278526 145015 31819 368025 -101917 175853 179982 101720 22698
12094C03266A16432I527P1893a30386a727F3061K61876n5914H8077f3202A57900
12082g8529A49250P9337i1971F1442J31696H2354b73785A79258J83040f8201I7696
12070a44292D91180C8291a97829H9702J1386a37729a5504A00388J06462c3247
12059B05552E5933B7188a16396B40085A15972a68191B7837J09644G785e25324
12048a19636D827J23759b599k22520B05281r975I5385a5592I8998j1249A0104
12036G4670J4009a19421j81145l6818B9429a409F5170d738E4016K4091B3814c31125
12023A04220a9080A59309G635b69524f4213B04430E6481a31552b3699B55010a5054
12011a81182J1359A5089K04192g1040A5795f7636I2870m2894J22357q3060K6800
$$ plain form
12094 303266 116432 9527 81420 -130386 -1727 63061 324937 269023 88077 -63202 157900
12082 -78529 149250 228587 -91971 61442 193138 82354 -273785 179258 362298 -68201 97696
12070 -144292 491180 38291 -197829 89702 101088 -137729 -15504 100388 206850 -33247
12059 205552 55933 27188 -116396 240085 115972 -168191 27837 137481 7785 -525324
12048 -119636 4827 128586 -2599 -225119 205281 195306 95385 -15592 98998 87749 10104
12036 74670 88679 -119421 -300566 -337384 29429 -1409 65170 -4738 54016 78107 23814 -331125
12023 104220 -19080 159309 7635 -269524 -64213 204430 56481 -131552 -23699 255010 -15054
12011 -181182 -169823 15089 219281 -71040 15795 -67636 92870 49976 172333 89273 116073
12000A16073K7585E4878L5920n691a75588d49j01347G2838a08442A42695J30676
11989B73371a61510e9883E2698c35841A06755L9945N1612I7870a20297a822r0228
11978i2050B11043G8293m324B9482J9689a01886d7179m60416h4490A38716j0859
11967A27857B1887B476b73672A19060Q515b9553k24567e3311j02421c7305j34692
11956a71997E0687c91658H566c42311O5007J13932M1193j95807C63878l9533A32785
11944f9443A39424c51593I9869b60997D1909a88842n0975E5474O1198i6158L8963
11933e7195B5388a71994A51925b22283b9025B59121f0385n1471B72543l4695h0394
11921h5870A59796O6625K1427b43447B79972c8607G7083M8068E4418a94447j1241
$$ plain form
12000 116073 143658 54878 90798 85107 -175588 -449 -101796 72838 -108442 142695 273371
11989 273371 -161510 -59883 52698 -335841 106755 146700 198312 97870 -120297 -1822 -92050
11978 -92050 211043 78293 73969 29482 49171 -101886 -47179 -507595 -84490 138716 127857
11967 127857 21887 2476 -273672 119060 127575 -29553 -254120 -53311 -155732 -37305 -171997
11956 -171997 50687 -391658 8566 -342311 -277304 -163372 -122179 -317986 363878 324345 132785
11944 -69443 139424 -351593 99869 -260997 41909 -188842 -239817 55474 116672 -96158 -57195
11933 -57195 25388 -171994 151925 -222283 -29025 259121 -60385 -111856 272543 237848 -80394
11921 -85870 159796 226421 247848 -243447 279972 -38607 77083 125151 54418 -194447 -205688
11910b05688B02673h548I3874J27016I7579b22415b310D3883J0159b44415F4904
11898a08918e2317k71053F9989h1911B61364b05815R3311j41181I0022M0276a88148
11886a49999B10360J32002e290A6152G892e25879B95880A07108m6298M035k8331
11875C6514a37182p5917A1098K02452d696A90789H862b87930J39415j38028E3063
11863f1814r5794K8873K3577A5212a91585e4247j73809B6293b56224D4925a3896
11851a28704n3733B26840d6228k1695l22202E8711a98992g1494a2573d291C86698
11839a96346P0995k10188B33498b51459N8541P7861A20802N0855G5460d19905
11828A95821a0547k51931F3719b15339j8024h3036K3021A19456N8030a17941e0197
$$ plain form
11910 -205688 202673 -8548 93874 220890 97579 -222415 -2310 43883 54042 -244415 64904
11898 -108918 -52317 -323370 69989 -81911 261364 -205815 -112504 -253685 90022 130298 -188148
11886 -149999 210360 342362 -5290 16152 7892 -525879 295880 107108 60810 64845 36514
11875 36514 -137182 -213099 11098 213550 -4696 190789 8862 -287930 -148515 -286543 53063
11863 -61814 -157608 -128735 -105158 15212 -191585 -54247 -228056 26293 -256224 44925 -13896
11851 -128704 -182437 226840 -46228 -67923 -390125 58711 -198992 -71494 -12573 -4291 386698
11839 -196346 -125351 -335539 233498 -251459 -192918 -115057 120802 171657 75460 -419905
11828 195821 -10547 -262478 63719 -215339 -233363 -83036 -60015 119456 177486 -117941 -50197
11816c69272R8237C4060N3726d7503A01151d34448a790G289K1946a06614A97161
11804b62924B03023K1797h4346A51960b96567g0438K964I4783L8192f1653k27514
11793b89167i4298k71357D3939a61266A20117a75002N7300j46436Q7796J8720
11783a57622G7871a59648A77161b38174A03918m4369k4062J55b61970R9588B24637
11771C09021b10381A75183A2298m474b30072B6298a92596A21395a65647A01837
11760A08797R3420e8327G1351K0518a48531C4290P4094J23394j14358C5204J49697
11749A84901O6366G8906c76248a15882j66590D6731L1709d985j53595g5662J4032
11738f1630j01381L5648H6680k6674J31515K4689i1049A8457M7377J44014j00525
$$ plain form
11816 -369272 -271035 34060 87786 -47503 101151 -434448 -1790 7289 29235 -106614 197161
11804 -262924 203023 224820 -84346 151960 -296567 -70438 -67474 94783 132975 -61653 -289167
11793 -289167 -94298 -365655 43939 -161266 120117 -175002 -117702 -264138 -176342 -157622
11783 -157622 77871 -159648 177161 -238174 103918 59549 35487 35642 -261970 -162382 224637
11771 309021 -210381 175183 12298 7824 -230072 26298 -192596 121395 -165647 101837
11760 108797 202217 -58327 71351 91869 -148531 34290 108384 231778 117420 35204 184901
11749 184901 251267 78906 -376248 -115882 -282472 46731 78440 -4985 -158580 -75662 -61630
11738 -61630 -163011 -127363 86680 60006 191521 216210 -91049 18457 65834 209848 109323
11727A09323a87964A18110a78133E816a58468o734A68670a15413o5716E0492J02163
11716A52655l1273b57848B22580B2803a90879B90052E6255A8456d8473B7102a11932
11704A19322a25908j30952a20501p4910H1484c92825c5665k7533A1005k290J62384
11693A71099O979K07150A02817K17845a36136d8991B14920E9054j8919i9757A00917
11681B52711c6548p1879F6659M3504b85329A83243a83644I9914P3960Q735b120
11669B04365J65704E626a30309B42211B7603h2771B55991c7449F6215K70518c6225
11657A72139o2262a35551n0774C27993B790b71530A60292G7510P8974C514Q0616
11646H4130a61149d2958o3621C14999j44294p7355a69433A92670A995K23333m994
$$ plain form
11727 109323 -187964 118110 -178133 5816 -158468 -165202 168670 -115413 -181129 50492 152655
11716 152655 121382 -257848 222580 22803 -190879 290052 56255 18456 -48473 27102 -111932
11704 119322 -125908 -256860 -120501 -195411 81484 -392825 -35665 -63198 11005 8715 171099
11693 171099 178078 385228 102817 320662 -136136 -48991 214920 59054 40135 -99757 100917
11681 252711 -36548 -108427 66659 110163 -285329 183243 -183644 99914 173874 182609 -2120
11669 204365 370069 5626 -130309 242211 27603 -82771 255991 -37449 66215 336733 -36225
11657 172139 109877 -135551 -186325 327993 2790 -271530 160292 77510 156484 3514 84130
11646 84130 -161149 -42958 -106579 314999 170705 93350 -169433 192670 1995 225328 220334
11635B20334k5945m9262B8057f4615I7798J08087B5422J9463K3041c8576A15561
11623d1604m43765A01349R4190I1527a97590M3534e8022A45242F4016k3277g5603
11611b35668A50001b53860G7976a85224A60450a5363j51996A00522c13436a11325
11600B16328b10702R9849L5677F781i3987I2548a10667j10525f9540P2b6511A8081
11587b02833h3412A10067d01535a7036k24449A84213A9869J90974a68965A18711
11576C2464g4571A32649M9246j9949l3853K7825K5140D7239d57057I4733D630
11564C8255g2696r1130a2516A28840J66150j8666p0474P7088f4370j5220A85661
11552A46997R7751p0634h8902B31965I8353J30210J21009A41333e6726e352B00124
$$ plain form
11635 220334 194389 145127 28057 -64615 97798 205885 25422 44885 67926 -38576 115561
11623 -41604 -485369 101349 195539 91527 -197590 -154056 -58022 145242 64016 40739 -75603
11611 -235668 150001 -253860 77976 -185224 160450 -15363 -167359 100522 -313436 -111325
11600 216328 -210702 -110853 -75176 6781 -93987 92548 -110667 -221192 -69540 -69468 -26511 18081
11587 -202833 -83412 110067 -401535 -17036 -241485 184213 19869 210843 -168965 118711
11576 32464 -74571 132649 181895 161946 128093 155918 181058 47239 -457057 94733 4630
11564 38255 -72696 -163826 -12516 128840 294990 276324 205850 282938 -64370 -79590 185661
11552 146997 244748 174114 -88902 231965 98353 228563 349572 141333 -56726 -5352 200124
11540b2348B36243C7178a47245D0270g8113D0606Q8636R1240h5806r8388B09864
11528h0821E7531K8606L0442K02224h7451A52426l3153R6138p6647b75516d2390
11516b00971I2023J08273o9078a21237A21989j4781a81118j4926P0158L0674B88080
11504B70209q5441d9759B61820k216O7871b70545G8979J6417f7411D4496J87445
11493B31941l0870C2080K12658K4376a50052B67621n724a2516C1263J43034b38465
11481A12838K00080c3777C60450a52484A40104a99828B74587a0504A43648F7497
11470C88620B2231a35789A66690L6674J70215G8446J48234q0965J89290d0890
11459c2020I7438R2702M8711m3580B6049M33199a44288C9189a44265B31703J3353
$$ plain form
11540 -22348 236243 37178 -147245 40270 -78113 40606 129242 220482 -85806 -184194 209864
11528 -80821 57531 86137 116579 318803 -87451 152426 119273 215411 138764 -275516 -42390
11516 -200971 92023 200296 131218 -121237 121989 107208 -181118 -196044 -125886 -95212 288080
11504 270209 184768 -49759 261820 259604 327475 -270545 78979 95396 -67411 44496 231941
11493 231941 201071 32080 244738 269114 -150052 267621 261897 -12516 31263 174297 -238465
11481 112838 312918 -33777 360450 -152484 140104 -199828 274587 -10504 143648 67497
11470 388620 22231 -135789 166690 203364 373579 78446 226680 145715 335005 -40890
11459 -32020 97438 190140 238851 195271 26049 459248 -144288 39189 -144265 231703 245056
11448B45056I6406K95690e4345A25143N4086a86569E16200B17345j06643a65464
11437h0972j47070A53583b83574J21099G8949J05537g6682j79381k7440A80190
11426B33848J4138M9471E2770j389K2064h4507J7930p6990I0291i9872C8257b87600
11413g2900C2837J39330O1515a28164j31831j17390B38647a53095I8178q343D0334
11401a61018M9154F0245b40862B51056o7336d6736A23369e2054I3730R0850q8153
11390I6427h554D8966c7669J8816A75443a48773D263f7428B34793B2549K00833
11379B23382L3099O059a53705D04198A66995p3703C0664a36574q0936I661J21466
11368A31127E1595a28478E4439j5915d222A5981P3900h6588G138a66121A10155
$$ plain form
11448 245056 96406 392096 -54345 125143 179229 -186569 516200 217345 110702 -165464
11437 -80972 -228042 153583 -283574 -162475 78949 184486 -76682 -256063 -283503 180190
11426 233848 247986 297457 52770 51381 73445 -84507 -66577 -143567 90291 -99872 38257 -287600
11413 -72900 32837 172167 233682 -128164 -259995 -377385 238647 -153095 98178 89835 40334
11401 -161018 -111864 60245 -240862 251056 183720 -46736 123369 -52054 93730 184580 96427
11390 96427 -8554 48966 -37669 -18853 175443 -148773 4263 -67428 234793 22549 223382
11379 223382 256481 262540 -153705 404198 166995 93292 30664 -136574 -217510 9661 131127
11368 131127 51595 -128478 54439 38524 -4222 15981 89881 -86588 7138 -166121 110155
11356e4169A98915F7114a93308P7982o869o8088C1600J2871J34649c19016a04285
11344c8401k3728B11219c4748B0175a18512j68807I4604g3750A96090a18209j54179
11333b72388o9151a34897A00068K7962b8577A32250a23535c3361p5218a2449q7273
11322i9722M8239C63019A39804c76372J55567H690P2637a46482c1988B78790a65710
11310a03238b4035r3964A47773D7062b06130h6895J9667r9890O8894a9920m8053
11299f7973J0604p9219a3942j24956d4715C5267i7078k12663f1290a4919j67691
11288a82610r5989i520c993l7107a3676A73739b37916H5015b35701D4877e31399
11276i1937o5604A34835N988C6902J12025e4958l45296a56826N5371q2388D1383
$$ plain form
11356 -54169 198915 67114 -193308 -115326 -122195 -190283 31600 44471 179120 -319016 -104285
11344 -38401 -62129 211219 -34748 20175 -118512 -287319 94604 -73750 196090 -118209 -272388
11333 -272388 -341539 -134897 100068 128030 -28577 132250 -123535 -33361 -108579 -12449 -99722
11322 -99722 -51483 363019 139804 -376372 -220805 8690 81327 -146482 -31988 278790 -165710
11310 -103238 -24035 -117999 147773 47062 -206130 -86895 -67228 -167118 -98224 -19920 -67973
11299 -67973 -57369 -136588 -13942 -138898 -44715 35267 -97078 -309741 -61290 -14919 -182610
11288 -182610 -278599 -9520 -3993 -41100 -13676 173739 -237916 85015 -235701 44877 -531399
11276 -91937 -157541 134835 140823 36902 148927 -54958 -400254 -156826 -101455 -183843 41383
11264A18485a00529C8086J03021o0102e1547G7052c90769i350B2996K67355c71444
11252d70062B02970c32555I9523c7076l29978C3265a93974o7014q9802D4326K39053
11241B83379A06520a13534A94079q5547d94H194J50978E1994a98734K6141A92180
11229D32776b02647A38843h3515E7599J31239a54559j7929p3443C81319D6001
11218I0648a64513I6216a10703B79929k1570c60138O4998J44026B31385b89361
11207c17499c6815J4005l85985B54226i111C6921b54924C33662i0780j88898J1081
11196b68597F7312d02723A4583O2480h2295A06336D4656M18074b40857Q1832a3009
11184b14151g0370I3307a76674j0658a6733A40807b7935p705a4775B9972b49877
$$ plain form
11264 118485 -100529 38086 141107 81005 -51547 77052 -390769 -9350 22996 290351 -371444
11252 -470062 202970 -332555 99523 -37076 -367054 33265 -193974 -260988 -350790 44326 283379
11241 283379 106520 -113534 194079 108532 -494 8194 159172 51994 -198734 -172593 192180
11229 432776 -202647 138843 -83515 57599 188838 -154559 -172488 -245931 381319 46001
11218 90648 -164513 96216 -110703 279929 258359 -360138 -295140 -151114 231385 -289361
11207 -317499 -36815 -22810 -408795 254226 -9111 36921 -254924 333662 -90780 -279678 -268597
11196 -268597 67312 -402723 14583 77063 -82295 106336 44656 462730 -240857 -159025 -13009
11184 -214151 -70370 93307 -176674 -187332 -16733 140807 -27935 -35640 -14775 29972 -249877
11172e4186l5594k81625R7875B16075j02389D3725h9972l09544A10276b81484
11161b81219B14011a52311p8500B9438b70898C563L3243E258P0736c31136M2629
11150b88507D5902c0443b720n1139A42798c42111A21091e0495B21073a38496F3662
11138a26258B0186J58104a39544B32739d44504a65793N8396A94923n7345Q1913
11128B19491i2277j40255B6393c51332e3716p9730A59126C7397d7908p2165C1144
11116a59443m0867B90964i5148D30099f8867j4625L4898B21274e4139j2792A15972
11104D6604J09844O2109f499A27420Q5373o3137J58425k3994E6098k2914J42126
11093A75310J8167G7918a77245E3858M42924k37201k1594k2856A2921f0607B85625
$$ plain form
11172 -54186 -89780 -371405 -273530 216075 113686 43725 -89972 -399516 110276 -281484
11161 -281219 214011 -152311 -230811 29438 -270898 3563 36806 5258 75994 -331136 -288507
11150 -288507 45902 -30443 -2720 -53859 142798 -342111 121091 -50495 221073 -138496 63662
11138 -126258 20186 178290 -139544 232739 -444504 -165793 -107397 194923 137578 219491
11128 219491 -92277 -232532 26393 -351332 -53716 -133446 159126 37397 -47908 -120073 31144
11116 -159443 -200310 290964 -95148 430099 -68867 -83492 -48594 221274 -54139 -66931 115972
11104 46604 156448 218557 -6499 127420 212793 149656 308081 284087 56098 33184 175310
11093 175310 193477 77918 -177245 53858 496782 259581 237987 215131 12921 -60607 285625
11081C37777j27540M9875H2742R5899O7875c6492E32251A22851j6116Q8906J09429
11070C05070n8884q5953J55145O6174K70909A14119K87204F3559K38390n1479
11060B50470G6634M47091k7315n8922K20514j64622K42284J09802j42941j69809
11050E32716A77250P25208j50104J87159l3234k58553J11043o3143l017P2195
11040G64804m6248p4306O8031k48448M94045m74972M29526J04626j12085D27996
11029G69768j71597L28202o981j17379N5066J77541k99844j87918k0266J45684
11019F72276j42555K08095j69542K29471n316k60974j43387j12553K98310n9720
11009E14105K55687j31074k30508N8972Q6712J77313l56322K27802Q9057A41069
$$ plain form
11081 337777 210237 260112 82742 178641 246516 -36492 532251 122851 106735 195641 305070
11070 305070 246186 160233 315378 381552 652461 114119 401323 63559 301949 250470
11060 250470 76634 523725 496410 437488 658002 493380 735664 845466 702525 532716
11050 532716 177250 902458 752354 939513 906279 647726 758769 695626 692609 764804
11040 764804 718556 644250 712281 463833 957878 482906 912432 1017058 904973 427996
11029 769768 598171 926373 919392 802013 857079 1034620 734776 546858 526592 672276
11019 672276 529721 737816 568274 797745 792429 531455 388068 275515 573825 514105
11009 514105 769792 638718 408210 467182 553894 731207 374885 602687 691744 141069
10998H53951j40226q7651J5458J50960k78159n0170J76494J55146l13087N51190
10988A033906l72734Q2761j87080J01743K88656k84793R2280l7028M62685J98007
10978A378403k29813j28483J30915K03955R2475Q37012q2059J58777N06839l89392
10968B478629R4381o1879K58376n56403L46241m75598k47522j18388j9253L6705
10958A735289l22969M0847J08185j69131J15826J36113l88334K93632j52279l10065
10948A087114r1502J28866m79795k00091j20879Q5278j09702i2982C50550H9419
10937A35066J14144M98534C12015G6227K79570A55167R6094B9254A3004J10758
10927A23762b0214A27612c161j24764d5035E5575J7851j4283O8776J02318G47
$$ plain form
10998 853951 713725 626074 641532 792492 514333 464163 640657 795803 482716 1033906
10988 1033906 661172 743933 556853 658596 947252 662459 754739 717711 1180396 1378403
10978 1378403 1148590 1020107 1151022 1354977 1447452 2284464 2202405 2361182 2868021 2478629
10968 2478629 2573010 2511131 2769507 2213104 2559345 2083747 1836225 1717837 1698584 1735289
10958 1735289 1412320 1453167 1561352 1392221 1508047 1644160 1255826 1549458 1397179 1087114
10948 1087114 995612 1124478 644683 444592 323713 408991 299289 -92982 350550 89419
10937 135066 249210 747744 312015 76227 355797 155167 251261 29254 13004 123762
10927 123762 -20214 127612 -3161 -127925 -45035 55575 73426 59143 127919 230237 747
10915b63882e2757B58128B7524a33714b3712k38009n0168F5925d7622j63843O6313
10904a45152B52695G8795a37342D28757A68691B7270J04766a7079q9502r084e4823
10892a5614C9750o600a80252r0585j81725C9390j1077a72952j01632g9797q868
10881h8665c2537k09252i1840K9219j34857C98679b3387A99702i5738l07914i9439
10869b22958E665h6201C8152a02010A77153i055B16592a65035d6134q3577b9432
10857c21422J06272b459n8593B32802b51122A93093l2223a6808D3423a90004d4687
10845F8398c6312J1261n4944C3428J12583a62310C17600b6565A36401e7696b5312
10833f7415C40622p4040b49085D31132o8892b76167c9793j10117J5319o6917d6891
$$ plain form
10915 -263882 -52757 258128 27524 -133714 -23712 -261721 -311889 65925 -47622 -211465 -145152
10904 -145152 252695 78795 -137342 428757 168691 27270 132036 -17079 -106581 -115665 -54823
10892 -15614 39750 33150 -180252 -270837 -452562 39390 28313 -172952 -274584 -79797 -88665
10881 -88665 -32537 -241789 -91840 -62621 -197478 398679 -23387 199702 -95738 -403652 -99439
10869 -222958 5665 -86201 38152 -102010 177153 -9055 216592 -165035 -46134 -129711 -29432
10857 -321422 -215150 -2459 -61052 232802 -251122 193093 160870 -16808 43423 -190004 -44687
10845 68398 -36312 -25051 -79995 33428 146011 -162310 317600 -26565 136401 -57696 -25312
10833 -67415 340622 266582 -249085 431132 362240 -276167 -39793 -149910 -134591 -201508 -46891
10821c08547d5235j27666h1859L2939K2027A91995a13168I9624f3162q0905I9044
10809a92825F8708b09464B24839b8028B4733a58078E192d2076j98852C9758b35349
10797A45383J62319b0694l33176H8343e5635J7697m7966A49680a85960N310F9817
10785B7081c15975J33993A90122M0392G5151d26155N6714B25937c9787G6059J93699
10774B69758a19111B57628j701D0402K7911B5510f230l33240B49119a0711k87225
10763b97936a33585A38053a29402I9771b65131D8674a82844A85946d7990a816
10752h128C7546c6250j75627a7397k5427A68343F0894J68089A8158a26462c5362
10740A6496R3295D0674b55518j7400B48775b41592A6156b43564F0377b36704g3948
$$ plain form
10821 -308547 -45235 -172901 -81859 -48920 -26893 191995 -113168 99624 -63162 -144067 99044
10809 -192825 68708 -209464 224839 -28028 24733 -158078 5192 -42076 -240928 39758 -235349
10797 145383 307702 -20694 -353870 88343 -55635 -37938 -85904 149680 -185960 -180650 69817
10785 27081 -315975 -181982 190122 230514 75151 -426155 -369441 225937 -39787 76059 269758
10774 269758 -119111 257628 255927 40402 68313 25510 -6230 -339470 249119 -10711 -297936
10763 -297936 -133585 138053 -129402 99771 -265131 48674 -182844 185946 -47990 -1816
10752 -8128 37546 -36250 -211877 -17397 -42824 168343 60894 228983 18158 -126462 -35362
10740 16496 109791 40674 -255518 -272918 248775 -241592 16156 -243564 60377 -236704 -73948
10728C8935N5745A8715J92453e5600L075m2662B2401a42106B78329A03868h4662
10716i4505m9606j49818R2523A91046c36223B3847i8067A86188j3135c65237B19605
10704F7173b98884b4634B52294j15436a40362A88892F7143e5559k83386a55395
10693G4825f2523o8379k99783b10524h3070C99322a10405B38938a19875A34514
10682A28500A0900b08808A46827f7846A57811f7386n426k58776E8942b22884C7188
10670b87944r6642a71254A92500g4108j98657N8187D5192c9731E407L3506m07
10659C8506J53631c96907L3668a63433b4409j46323d8390C2267b35330f8623k38981
10648c07604k7381E2351K32542b22446D4002J77739B5391J15364F7603Q466k4585
$$ plain form
10728 38935 94680 18715 211168 -55600 -52525 -95187 22401 -142106 278329 103868 -84662
10716 -94505 -144111 -293929 -201406 191046 -336223 23847 -98067 186188 173053 -365237 219605
10704 67173 -298884 -24634 252294 136858 -140362 188892 67143 -55559 -338945 -155395
10693 74825 -62523 -130902 -430685 -210524 -83070 399322 -110405 238938 -119875 134514
10682 128500 10900 -208808 146827 -67846 157811 -67386 -72812 -331588 58942 -222884 37188
10670 -287944 -384586 -171254 192500 -74108 -272765 -214578 45192 -39731 5407 38913 38506
10659 38506 192137 -396907 -363239 -163433 -24409 -170732 -48390 32267 -235330 -68623 -307604
10648 -307604 -334985 52351 284893 -222446 44002 221741 25391 140755 67603 76069 51484
10637E1484b09928A21245b44401C13608b28810A78130E0097c8529q5740M1528
10627h2741j84495H8379K94371F4437b75069F6230a25047E6261b00786A30949
10616a85991O2839A92284E3541e0599K1108F6625a29145G8277B0720J17729c1947
10604A7859c74467B28152b37760Q4655E6516K47363A28538b94114B34190i7394
10593c28669M1235i9817A65828j0652c98329a52633f2017B9428d24764H5998G909
10581c47267B70408b19774B12855c0154r3786A23067b89813P5583n7044f655n8001
10570f4656G2882f4731p0479K7214k18400a34936C747J65862o8882a50557B09675
10558B35951c3333B96911o4407F7935b05558c5647A04181L19015b51740B92943
$$ plain form
10637 51484 -209928 121245 -244401 313608 -228810 178130 50097 -38529 -124269 -82741
10627 -82741 -267236 88379 382750 64437 -275069 66230 -125047 56261 -200786 130949
10616 -185991 -123152 192284 53541 -50599 -29491 66625 -129145 78277 20720 138449 -31947
10604 17859 -374467 228152 -237760 -153105 56516 303879 128538 -294114 234190 -97394
10593 -328669 -287434 -99817 165828 155176 -398329 -152633 -62017 29428 -424764 85998 7909
10581 -347267 270408 -219774 212855 -30154 -123940 123067 -289813 -214230 -271274 -6655 -64656
10570 -64656 72882 -64731 -135210 -107996 -326396 -134936 3747 169609 100727 -150557 209675
10558 235951 -33333 296911 232504 67935 -205558 -35647 104181 423196 -251740 292943
10547a24265j1076C1047N0502b78048e3271Q36j71916A67055E5614b86044A56579
10535a60919q7356A3287J38176A0963J40094G3678J58879f1070B60750i8456r2035
10524a90491K0570q4159a08492a9871k90365a47457k6056C24136f9098A15725
10513a70194M3639j61722B839a16152A33069b45936B1910D698a20588L8899k6269
10502a07958p843D2243a50916L9325E7444h6249J9728j25835A59216a1764A77328
10490d9121m5120A7330L7864g4797I7241a25903B16096g2041j60523l6807B5712
10478B122L17206M4794A61017K46204K38218h8666D8908f8421l7245A20341b50610
10466B03074D9984a005j95196M5183k9787A07405b53525F1530a02390j08020A06954
$$ plain form
10547 -124265 -135341 31047 81549 -278048 -53271 -52435 -224351 167055 55614 -286044 156579
10535 -160919 -248275 13287 151463 10963 151057 73678 232557 -61070 260750 -98456 -190491
10524 -190491 -169921 -254080 -108492 -19871 -310236 -147457 -173513 324136 -69098 115725
10513 -170194 -126555 -288277 2839 -116152 133069 -245936 21910 4698 -120588 -81689 -107958
10502 -107958 -115801 42243 -150916 -111591 57444 -86249 -66521 -192356 159216 -11764 177328
10490 -49121 -94241 17330 55194 -74797 97241 -125903 216096 -72041 -232564 -269371 25712
10478 2122 319328 364122 161017 407221 645439 -88666 48908 -68421 -105666 120341 -250610
10466 203074 49984 -1005 -196201 -151018 -180805 107405 -253525 61530 -102390 -210410 106954
10454a59019b1839B92586A38598a94575L1818B879J27568P7861B8110K56951a05299
10442b48605G7643l1503K5197b04429h9487Q829j05414l680H654b88605n8955
10431c47560a26233I5412a3840I305K87219c403j61403k26702B61511o8374A1350
10419a53774A64451F8974a79293D7189e7185k0465k832B01600B7035a34072A6566
10407d5783E1916k4250f2137l6401A2489b8520E3844J95094a38138k4742o5454
10396b28334A3124K47204a251B32727c10584J37163D19314C6172J33085d8655
10385A65362k9688B298d6831C95994j91012E2131L43344i3441D06633F5625N761
10374G1386c3273B14887o4869J9925K14073k0907A71747m0697Q7624e3852C38652
$$ plain form
10454 -159019 -21839 292586 138598 -194575 -162757 2879 130447 208308 28110 285061 -105299
10442 -248605 77643 46140 71337 -204429 -89487 -80658 -186072 -189752 8654 -288605 -347560
10431 -347560 -126233 95412 -13840 9305 296524 -3403 -164806 -391508 261511 193137 11350
10419 -153774 164451 68974 -179293 47189 -57185 -77650 -80482 201600 27035 -134072 16566
10407 -45783 51916 27666 -62137 -98538 12489 -28520 53844 248938 -138138 -162880 -228334
10396 -228334 13124 260328 -1251 232727 -310584 -173421 419314 36172 169257 -48655
10385 165362 135674 2298 -46831 395994 204982 52131 395475 -93441 406633 65625 71386
10374 71386 -33273 214887 150018 169943 384016 363109 171747 131050 218674 -53852 338652
10362D35885R5476A36540L7147L59348B16755o6516m848M8989b35868c206D67043
10350C70188I3129L70996K34710o6406j07623j43990A18835b2814D02360K12981
10340F15341k49927j47702C3855a3990D7405L27435J06433B34673l6316J48544
10330C46901b57749A03411B8206J22969f5965j77342I1348c2547j2835A53609
10319C25187h7497A84532A1807J29519R8858I9224M9974L0386C6969b9826j15941
10308a45767A52861d2368r9740J2587C63044h1788B23843a96108h6110o91j31256
10297b18057l7429g3687B96043i0213A13194c20674A20710J3281b91744e3649
10286a46707A04740K267e2811j03652J6998n5590A89529a40988m59173B32762
$$ plain form
10362 435885 531361 136540 173687 533035 216755 150239 145391 194380 -235868 -3206 467043
10350 370188 93129 464125 698835 632429 524806 380816 118835 -22814 402360 615341
10340 615341 365414 217712 33855 -13990 47405 374840 481273 234673 198357 346901
10330 346901 -257749 103411 28206 151175 -65965 -243307 91348 -32547 -45382 153609
10319 325187 -87497 184532 11807 141326 240184 99224 149198 179584 36969 -29826 -145767
10308 -145767 152861 -42368 -142108 -129521 363044 -81788 223843 -196108 -86110 -86801 -218057
10297 -218057 -255486 -73687 296043 -90213 113194 -320674 120710 133991 -291744 -53649
10286 -146707 104740 107007 -52811 -156463 -139465 -195055 189529 -140988 -600161 232762
10275B18616h1867A79149q9311a27095j72599G5018a8506q6300J8380F006a03229
10263B46993g3637k55083Q8324B51367q612a68350A84190a51133A6608J27195
10253A43803K65425j61045q3211a59748A63910L348q373a05485d56k17952O7324
10242a51084A1410K14893a13476a4974j80024P8307J0829F4881L9364d4446A72630
10230c3096B31615F5311k9500b76394a22701k42286A79485a0436B34086f4463
10219b3437l11596e9713j15681F533a04622C303J29094b27017I2341d5239J9648
10208b5591n5600d0403k17922H4108a62387k56374M2588F0833A2400a48405k43987
10197c92392l8937E8822K78458e0976a7555j33152q8427F0440b74572A64840A8029
$$ plain form
10275 218616 -81867 179149 89838 -127095 -299694 75018 -18506 -104806 -86426 6006 -103229
10263 246993 -73637 -328720 -240396 251367 242755 -168350 184190 -151133 16608 143803
10253 143803 409228 248183 164972 -159748 163910 167258 158885 -105485 -456 -218408 -151084
10242 -151084 11410 226303 -113476 -14974 -194998 -116691 -105862 64881 104245 -44446 172630
10230 -33096 231615 65311 35811 -276394 -122701 -364987 179485 -10436 234086 -64463
10219 -23437 -335033 -59713 -175394 6533 -104622 3303 132397 -227017 92341 -45239 -25591
10208 -25591 -81191 -40403 -258325 84108 -162387 -418761 -376173 60833 12400 -148405 -392392
10197 -392392 -431329 58822 337280 -50976 -17555 -150707 -239134 60440 -274572 164840 18029
10185H3802k7245A2369f2635l0857H0908a22210h890A5095c11092a07536k7835
10174a35371n3098A76019f1269k28527m7275a41841A47001a07845j41281J14597
10164a34529q5499n8240I5383K3852h084F2014a53086D9460a59736c8949A33368
10152B25888H5293c70961A46500a09302a3593k29705b8634j97572l32434A8212
10141a18107j39592a24669B64034b77300O0831f4078j16690K4694D1579b10646
10130c04913C3752J00319b05134B65499J14490a53660j35828a22667j2379O7424
10120f7622k02295g2280o6864D8798K50059b94001h5922c7982A92790b32354P0447
10109a61907A4121b27604B13076b01948H3314b43347K3367j47147a61159I1047
$$ plain form
10185 83802 56557 12369 -62635 -93492 80908 -122210 -8890 15095 -311092 -107536 -135371
10174 -135371 -188469 176019 -61269 -289796 -337071 -141841 147001 -107845 -249126 -134529
10164 -134529 -220028 -278268 95383 119235 -8084 62014 -153086 49460 -159736 -38949 133368
10152 225888 85293 -370961 146500 -109302 -13593 -243298 -28634 -226206 -558640 18212
10141 -118107 -257699 -124669 264034 -277300 -216469 -64078 -180768 -156074 41579 -210646
10130 -304913 33752 134071 -205134 265499 379989 -153660 -289488 -122667 -135046 -67622
10120 -67622 -269917 -72280 -139144 48798 298857 -294001 -85922 -37982 192790 -232354 -161907
10109 -161907 14121 -227604 213076 -201948 83314 -243347 -219980 -367127 -161159 91047
10098a47286o5429H5385B6514b74353h1681k7150r8144F0108b23218f6155j55609
10087b21764g4722I1569M0566d5663o3212A45381b67728h7444B8769b88033J15115
10076a72918m2315j18773A59992b5153B50736e6546p0165l9020L9034f340A96210
10064D4571i584E7041J80971m534b32599k68864c2032C6826a20110b3374q4001
10053a07375D6283b90078F2393b59341l4885F245e4494C5655a95995A37292h1131
10041d950j70267Q690D0095b95895d7773b2763j7653p9166A35728E271a16532
10029A19766k6047b1678k29748L5893r7822D6760d54881a60889C6815e2249C328
10017B17169a01161k5714A50746a7797j9621j28444b9384A5109a08851m500A00449
$$ plain form
10098 -147286 -212715 85385 26514 -274353 -81681 -108831 -206975 60108 -223218 -66155 -221764
10087 -221764 -74722 91569 132135 -45663 -108875 145381 -267728 -87444 28769 -288033 -172918
10076 -172918 -215233 -334006 159992 -25153 250736 -56546 -126711 -165731 -126697 -6340 196210
10064 44571 -9584 57041 238012 233478 -232599 -501463 -32032 36826 -120110 -23374 -107375
10053 -107375 46283 -290078 62393 -259341 -294226 6245 -54494 35655 -195995 137292 -81131
10041 -4950 -175217 -166527 40095 -295895 -47773 -22763 -40416 -119582 135728 5271 -116532
10029 119766 93719 -21678 -251426 -215533 -313355 46760 -454881 -160889 36815 -52249 3328
10017 217169 -101161 -126875 150746 -17797 -37418 -165862 -29384 15109 -108851 -113351 100449
10005g4476K528j8306m05810c0927A8035b61613P5351N7735k2195k48482a66865
9993a86856d0240J0355m1840F4634j944J1597b46451e2897m4005K4788B04312
9981a22927d9314I0355g4444k6143j62355P354E316d578I9732l7339a00338A74350
9968g4924H7220c55849B6597b68872Q8597g3766B26114b44992k0787H5868J82296
9957B68164A31152b16557A70076a85324A25195c17760J11017a01082L231B9409
9946A25255b30641N9715A70044c11591e454l12989B32751c38388J1164a7750j38806
9935a56556j7837A29962e8060j20547f932m2627p976m2630j70097R3923q3621
9924b59960a19272J043L494A4031b15444J06521D7553c85470a42122D0646b61656
$$ plain form
10005 -74476 -71948 -90254 -496064 -30927 18035 -261613 -186262 -128527 -150722 -399204 -166865
9993 -186856 -40240 -29885 -71725 64634 62690 74287 -246451 -52897 -96902 -72114 204312
9981 -122927 -49314 90355 -74444 -100587 -262942 -255588 5316 -4578 99732 62393 -100338 174350
9968 -74924 87220 -355849 26597 -268872 -180275 -73766 226114 -244992 -265779 85868 268164
9957 268164 131152 -216557 170076 -185324 125195 -317760 -206743 -101082 -97851 29409
9946 125255 -230641 -170926 170044 -311591 -5454 -318443 232751 -338388 -327224 -17750 -156556
9935 -156556 -174393 129962 -58060 -178607 -6932 -49559 -57535 -100165 -270262 -176339 -259960
9924 -259960 -119272 -118229 -114735 14031 -215444 -108923 47553 -385470 -142122 40646 -261656
9912f6384l5056b9600n0857H9019c4992A65378J77559a29829b6798J467A88299
9900a1020k54312C46477a30945q2847n1478J14375c4770Q531j31007B64626g7145
9888a27935j01787d6008j30639A58431a85366j31408A3979h8769A07390b74425
9877a6636I3256c9739r7724N8788A04854h328C7140f2390l02477f905A97714A9419
9864A80178c03996Q3706L4793A06119k3316c64909Q2602d7616k5239a3865C8431
9852A8866h1163l147A83778f2751k11997h9755j69491H7917b53870A87885H8333
9840b11296a1935B11673A177J73309n9805b95194a0765I0725R2229j8353d13853
9828A31567k964d40115E7932b6017B25190c30511a63158m896A60261M9897C7269
$$ plain form
9912 -66384 -101440 -29600 -80457 89019 -34992 165378 342937 -129829 -26798 -25331 188299
9900 -11020 -265332 346477 -130945 -213792 -265270 -150895 -34770 -26239 -157246 264626 -77145
9888 -127935 -229722 -46008 -176647 158431 -185366 -316774 13979 -88769 107390 -274425
9877 -16636 93256 -39739 -137463 -78675 104854 -8328 37140 -62390 -364867 -6905 197714 19419
9864 180178 -303996 -220290 -185497 106119 82803 -364909 -282307 -47616 -72855 -13865 38431
9852 18866 -81163 -84310 183778 -62751 -274748 -89755 -259246 87917 -253870 187885 88333
9840 -211296 -11935 211673 1177 174486 114681 -295194 -10765 90725 182954 164601 -413853
9828 131567 128603 -440115 57932 -26017 225190 -330511 -163158 -168054 160261 210158 37269
9816A33093b50855j7159l4371a44218L4339B9677a01069j11100m8139N3466j14667
9805c21509E7989b62468c5899j73535a9038Q166j40768B87159a64226P1987A2198
9793B69696j19551h0280j7945j1529j41800e08j28026O10j1524A17633J09931
9782B27564a57715r3584G075a71222B19348L44902G7068a34073O671o7336E9833
9770d9099J3077l00125B4808N1065f7496j55940G9555b01197f4458D8332L3429
9759H1761a23520k24652f9149p3604k03975A60523c328j01409l1622D02137h4014
9747F62028C29598d01764F6926b50418j58163a9221q8853q1118i3006A4642a5373
9735b5968k37086g3206b7355C109b36203N4813h259k24969a0375G702b62208C73354
$$ plain form
9816 133093 -250855 -268014 -302385 -144218 -109879 29677 -101069 -212169 -260308 -206842 -321509
9805 -321509 57989 -262468 -35899 -209434 -19038 -10872 -151640 287159 -164226 -92239 12198
9793 269696 150145 -80280 -98225 -109754 -251554 -508 -128534 -127924 -139448 117633 227564
9782 227564 -157715 -251299 7075 -171222 219348 564250 77068 -134073 -127402 -194738 59833
9770 -49099 -36022 -336147 24808 75873 -67496 -223436 79555 -201197 -64458 48332 81761
9759 81761 -123520 -348172 -69149 -142753 -346728 160523 -3328 -104737 -136359 402137 -84014
9747 662028 329598 -401764 66926 -250418 -408581 -19221 -108074 -189192 -93006 14642 -15373
9735 -25968 -263054 -73206 -27355 3109 -236203 -181390 -8259 -233228 -10375 7702 -262208 373354
9722C53997a03676j0951J3021A03295a40877k830D2503a2584j40391m0400p1163
9711b64538I8043a52575D4193c48147a56411J853J2582q634k8638A20593b50362
9699a43540n1887j738L6696M6814O486j39058M0488d4747B10586a36988e9237
9687b65230b5135r7788m157B7632K61038b9018j75220m0759i2143D4886a9867
9675a30953k9791A0735a18597K5266A68032c13836B00784b03408A51393a50048
9664c6045C7525b37137j83113I6039h4126k50142f4448C4501O52a57714B9296
9652g7344l6965J5086d993k19185b7726n976l42531J15729b3878A80626a52264
9640a14170F58b35518K286F3595f6079H5435l3152a10991D8739a22832d7152l34761
$$ plain form
9722 353997 -103676 -114627 -101606 103295 -140877 -143707 42503 -12584 -152975 -193375 -264538
9711 -264538 98043 -152575 44193 -348147 -156411 -154558 -141976 -150610 -179248 120593 -250362
9699 -143540 -195427 -197165 -160469 -113655 -107169 -246227 -205739 -44747 210586 -136988 -59237
9687 -265230 -25135 -122923 -127080 27632 288670 -29018 -204238 -244997 -92143 44886 -19867
9675 -130953 -160744 10735 -118597 -93331 168032 -313836 200784 -203408 151393 -150048
9664 -36045 37525 -237137 -420250 96039 -84126 -334268 -64448 34501 35153 -157714 29296
9652 -77344 -114309 -99223 -4993 -224178 -27726 -33702 -376233 -260504 -23878 180626 -152264
9640 -114170 658 -235518 -233232 63595 -66079 85435 52283 -110991 48739 -122832 -47152 -381913
9628c81913A06128b5568m7232A95969q6256c10493g2183k61513G3808L7614e4940
9616b6537o8696B8346b86477C49231h9367I0232j9555M7432a94103j2415H0992
9604c14619k6569J54560g2927j18285i2937H7393e1078g383l40627c4236j26765
9593a61001B34247a81572c0357j37898e7501c581j97063b1927I579a09020j57987
9582b67007L5446H9838D3507b41643n6452D0115J18891C1533a88824R3614k83145
9571c78355e9327b5674A01279M8644a28458a7820A37012a95047H431P8846Q9522
9560A76799b13695G8088a37848m7691O8329A96356d9501j22028A14553a56946
9549b42503F3259e0994i174r7839A20320Q3761b0442m7336p0684b8612b322B13532
$$ plain form
9628 -381913 106128 -25568 -72800 195969 109713 -310493 -72183 -333696 73808 111422 -54940
9616 -26537 -95233 28346 -286477 349231 -89367 90232 70677 118109 -194103 -206518 80992
9604 -314619 -341188 -186628 -72927 -191212 -92937 87393 -51078 -7383 -348010 -34236 -161001
9593 -161001 234247 -181572 -30357 -168255 -57501 -3581 -200644 -21927 9579 -109020 -267007
9582 -267007 -231561 89838 43507 -241643 -298095 40115 159006 31533 -188824 -95210 -378355
9571 -378355 -59327 -25674 101279 149923 -128458 -17820 137012 -195047 8431 87277 176799
9560 176799 -213695 78088 -137848 -185539 -117210 196356 -49501 -171529 114553 -156946
9549 -242503 63259 -50994 -9174 -107013 120320 204081 -20442 -67778 -138462 -28612 -2322 213532
9536H7756d04682E8597a71306J5452n7506H878a26992A82581o7272j1075A7181
9524a85441K8426B00370a12382A32038J35526a49026c6640k34409C4519b382k40849
9513b43231H9005D0262P3863b96458J29097F948J989L87091d4101A37557d802
9501d50933B3779d6664H573c829I0444j6291a10649G6668O3176o1692a25202k4731
9489a49933A77070J2644f6412o0440A63197d82968b24457i0891C28226a25517
9478A75531b14135r3846a37624A96897b21751g0705A66521A4750N6215o148a5687
9466b5282j78358f17n4282a665q6493k7016H7000d634l79565c1112q8269A25357
9453g8535k48823G7269c35880j1862N8838A67814O2610a12837J7983j8853J0611
$$ plain form
9536 87756 -404682 58597 -171306 -155854 -213360 8878 -126992 182581 115309 104234 17181
9524 -185441 -157015 200370 -112382 132038 267564 -149026 -36640 -271049 34519 -2382 -243231
9513 -243231 89005 40262 114125 -296458 -167361 6948 8937 396028 -44101 137557 -4802
9501 -450933 23779 -46664 8573 -3829 90444 74153 -110649 76668 139844 78152 -125202 -149933
9489 -149933 177070 189714 -66412 -126852 163197 -482968 -224457 -90891 328226 -125517
9478 175531 -214135 -307981 -137624 196897 -221751 -70705 166521 14750 70965 64817 -15687
9466 -25282 -203640 -617 -54899 -1665 -88158 -115174 87000 -4634 -384199 -31112 -119381 125357
9453 -78535 -327358 77269 -335880 -347742 -288904 167814 230424 -112837 -94854 -113707 -103096
9442a03096A75213l2060l215c1571o929D5481J10427a38328A04765a75124A73378
9430A6211a33798f4703k92985E8585q448K82779A43309h7725k0708m5029P0369
9419h3093C1249c1156p9973j10363c774n6359j52767A22235Q2784b40962E9328
9407a75213n2177e7657B8300c12755J35232p6828J01522D3747b49553B65394d7667
9395a28706j21669j71522B0455L17982b38359b7409j78440j17j32177f4224K2345
9384d1879A1234J94483b48837a20167A6575a19665e0921J7264j18341C4524L8319
9373G2843b07734f672l5436B33586b15083e6979p0611A74373a04340o7549j4934
9362a86823N5551N5181H1651L415a15757H8967b48535a9752j203j41464A18042
$$ plain form
9442 -103096 175213 143153 139938 -31571 -38500 45481 155908 -138328 104765 -175124 173378
9430 16211 -133798 -64703 -357688 58585 50137 332916 143309 -87725 -108433 -153462 -83093
9419 -83093 31249 -31156 -111129 -221492 -3774 -60133 -212900 122235 205019 -240962 59328
9407 -175213 -227390 -57657 28300 -312755 -177523 -254351 -152829 43747 -249553 265394 -47667
9395 -128706 -250375 -421897 20455 338437 -238359 -27409 -205849 -205966 -338143 -64224 -41879
9384 -41879 11234 205717 -248837 -120167 16575 -119665 -50921 -33657 -151998 34524 72843
9373 72843 -207734 -6672 -42108 233586 -215083 -56979 -127590 174373 -104340 -171889 -186823
9362 -186823 -131272 -76091 81651 85066 -115757 88967 -248535 -19752 -20955 -162419 118042
9350h8869r464r7034O5768B14186n0822a40111A16359a82012m5086a12716K6134
9339h6582H1984b30565N4429h1355c7719j62002B76181j07397e7875A50690a53049
9327b12578B6505a86038l81079a85565j15559j40192b19065k164f2479B14195
9316b09511d4167j30251q4392g9441j2179F9176d710j38186q8023B45442D9370
9304a48767k31878B00639c69861a8806C17322b85094A69291b12769A16681c03467
9293b70819m3216f0641M344o9r796B24300B8664c67301b8572J2956l7490C84647
9280H2380h3591k58827B21012b75316A79517e2873j24435Q7872A1221c6267k4879
9269f1146A91613a82845N7129b9060C73941c32088J14749A34649b47622A7677
$$ plain form
9350 -88869 -98333 -195367 -129599 214186 163364 -140111 116359 -182012 -227098 -112716 -86582
9339 -86582 81984 -230565 -176136 -81355 -37719 -199721 276181 168784 -57875 150690 -153049
9327 -212578 26505 -186038 -567117 -185565 -301124 -441316 -219065 -221229 -62479 214195
9316 -209511 -44167 -174418 -258810 -79441 -91620 69176 -4710 -142896 -230919 245442 49370
9304 -148767 -380645 200639 -369861 -18806 317322 -285094 169291 -212769 116681 -303467
9293 -270819 -314035 -60641 -56297 -56366 -66162 224300 28664 -367301 -28572 -15616 -53106 384647
9280 82380 -83591 -342418 221012 -275316 179517 -52873 -177308 -89436 11221 -36267 -61146
9269 -61146 191613 -182845 -125716 -29060 373941 -332088 -217339 134649 -247622 17677
9258F841c77217D28283C5574a45076K1204B9424c77313A26401b88578a09786k2978
9247a32764C615b20353r9180A11661f2747j25132C43468a06270m00036a40570
9236B53659e6081b2590E5912e0939B65377I821J7046Q1380b7399j45627d2664
9224a12994A52218J21816b63030A47275o6956n432l0197a15253A36080a53724
9213B25212H6991b11840b1928j61892A89344Q0281a11073C0816a49149N2975q9614
9202a85788M8632A61883n3821a70616q1570A15756d7425b2927o4230K4464A48504
9190h9712G0986Q8306a0507C06981g655A30016K07318g621D3088N0200g5603b8350
9177f4993j47610j01693J08418A36298n810b59960F4063K9248k7487b07632M5872
$$ plain form
9258 6841 -377217 428283 35574 -145076 -123872 29424 -377313 126401 -288578 -109786 -132764
9247 -132764 3615 -220353 -319533 111661 -62747 -187879 343468 -106270 -506306 -140570
9236 253659 -56081 -22590 55912 -50939 265377 9821 26867 108247 -27399 -173026 -42664
9224 -112994 152218 274034 -263030 147275 80319 74887 44690 -115253 136080 -153724
9213 225212 86991 -211840 -21928 -183820 189344 269625 -111073 30816 -149149 -96174 -185788
9202 -185788 -137156 161883 108062 -170616 -252186 115756 -47425 -22927 -87157 -62693 148504
9190 -89712 70986 159292 -10507 306981 -7655 130016 337334 -7621 43088 93288 -75603 -28350
9177 -64993 -212603 -314296 -205878 136298 130488 -259960 64063 93311 65824 -207632 -161760
9166a61760n7073P1471A35072F222J83547c8561k5290j94331N8853P7735d3167
9154a593k4803o2329K3718H1949a80215A23579a08767j56078A2918a35330j50244
9143b85574A18703b13243A22428p5b11246L264C7405j2159Q2640a73085J7709
9132a55376A12631a27712A7007e0239r3321k18356d426j20522C72070b36903l68308
9121f05211B20932A7781J57918e5124B42911p0511J55018e3351j68050A01604
9110f4075R307n4753E6014d0174A04672c21506a21171l04322d3500j08453k29585
9099c81538A77743a12343B4202a17786a4553a784A31919a085k22698K150d0009
9087A18036a62724A07851e9102A26287L1467c77091R7583L8175d5857a2191r8534
$$ plain form
9166 -161760 -218833 -147362 135072 6222 189769 -38561 -63851 -258182 -199329 -121594 -43167
9154 -1593 -26396 -88725 -65007 81949 -180215 123579 -108767 -264845 12918 -135330 -285574
9143 -285574 118703 -213243 122428 122353 -211246 -207982 37405 25246 107886 -173085 -155376
9132 -155376 112631 -127712 17007 -50239 -143560 -361916 -4426 -124948 372070 -236903 -605211
9121 -605211 220932 17781 175699 -55124 242911 172400 327418 -53351 -221401 101604
9110 -64075 -54768 -109521 56014 -40174 104672 -321506 -121171 -425493 -43500 -151953 -381538
9099 -381538 177743 -112343 24202 -117786 -14553 -1784 131919 -1085 -223783 -221633 -40009
9087 118036 -162724 107851 -59102 126287 157754 -377091 -279508 -241333 -45857 -12191 -110725
9076a10725A21044f4008C4780a35874F3406a90658A53154E4059c6604B21598a41674
9064a63105L5982A8888b45200R6444D5895b7644j3954m94629d7937B4122h9375
9052b21990B35389b6427j6380D8684b87052m4790g56l41937i8536k81631m1024
9041d21191J53001h646j136d046j60228c3773A8156a95994J2847h022b861k7849
9029c0710k60251g6445h765I719g0317l01581c2875k96803i2020A88894a41145
9017a48199M0427c218A1891L32414c01257H2104a32943e9798o3152k05751D8092
9005e6891C25071b21417E4757f04552a29733A11904D8942a65682N0457A04984
8994c92388B11736b2383j5968m7231K3021m5022D42138a69220d1987j40460K1824
$$ plain form
9076 -110725 121044 -64008 34780 -135874 63406 -190658 153154 54059 -36604 221598 -141674
9064 -163105 -127123 18888 -245200 -148756 45895 -27644 -41598 -536227 -47937 24122 -89375
9052 -221990 235389 -26427 -42807 48684 -287052 -331842 -756 -342693 -98536 -380167 -421191
9041 -421191 -268190 -8646 -9782 -4046 -164274 -33773 18156 -195994 -183147 -8022 -2861 -30710
9029 -30710 -290961 -76445 -8765 9719 -70317 -371898 -32875 -329678 -92020 188894 -141145
9017 -148199 -107772 -3218 11891 344305 -301257 82104 -132943 -59798 -122950 -328701 48092
9005 -56891 325071 -221417 54757 -604552 -129733 111904 48942 -165682 -115225 104984
8994 -392388 211736 -22383 -38351 -85582 -62561 -107583 442138 -169220 -41987 -182447 -160623
8983a60623N3980q0003c5407o8742j77008A27980c07708j02967h0872H0617e991
8971a81872B60498A470i211p4279A38298A6693d9455l8125o5366O0899A8975a96216
8958a54924A88520n0695a27384D1637a42855D3542a61222A39558f2388K8387l3476
8947f7477J493A24982b9257j19948n5078C4416R5635g349D8840e8185B5138K43361
8935B68499J21049i1796C9373Q6634b54521A14500b6693k94984g0926B75838C3826
8923A29403P89876K11339J804912N072949K133346B748285A090981E05462M3872
8914E49334B25652B666d0464J4007n8794D33301B0065L09386A14667J34246c65238
8902h9916a3685B42618l0950q371G3721k8271O1117f7125B36118B3425c36213
$$ plain form
8983 -160623 -106643 -186646 -35407 -104149 -281157 127980 -307708 -410675 -80872 80617 -5991
8971 -181872 260498 1470 -9211 -83490 138298 16693 -49455 -87580 -152946 -92047 18975 -196216
8958 -154924 188520 137825 -127384 41637 -142855 43542 -161222 139558 -62388 -34001 -67477
8947 -67477 -65984 124982 -29257 -149205 -204283 34416 130051 -7349 48840 -58185 25138 268499
8935 268499 389548 -91796 39373 126007 -254521 114500 -26693 -321677 -70926 275838 33826
8923 129403 919279 1130618 2935530 8008479 10141825 2748285 1090981 505462 549334
8914 549334 225652 2666 -40464 -26457 -85251 433301 20065 329451 114667 248913 -365238
8902 -89916 -13685 242618 211668 203297 73721 45450 106567 -67125 236118 23425 -336213
8890A51827M6750q1064A4318a0677b006l80817e037A63988A1223i9583n3907b5664
8877A10710a30774k27307J30619L2994F7015Q0915c1839J4669A87852p0766c85945
8865i3802A43575c80647A51468g9996L0471a7236D1913K122J2288a06858A52140
8853b9690A3253b56824h2784A3990J76c27850f6047p2419I2180c72113J73422
8842a98691f4977r2914r183p1801i8867B47799f5329j47435M8390I206f1702k7515
8830h9217j83746J7063g6530k52056a11096F9907a04533m3183I2300l4777h6197
$$ plain form
8890 151827 198577 117513 14318 -10677 -2006 -382823 -5037 163988 11223 -99583 -153490 -25664
8877 110710 -130774 -358081 -227462 -194468 67015 147930 -31839 -17170 187852 117086 -385945
8865 -93802 143575 -380647 151468 -79996 -49525 -17236 41913 44035 56323 -106858 152140
8853 -29690 13253 -256824 -82784 13990 14166 -327850 -66047 -138466 92180 -372113 -198691
8842 -198691 -64977 -157891 -167074 -238875 -98867 247799 -65329 -212764 -164374 9206 -61702 -89217
8830 -89217 -272963 -255900 -76530 -328586 -111096 69907 -104533 -147716 92300 57523 -86197
$$ [...]
##END NTUPLES=NMR SPECTRUM
##END=
