
##TITLE=AC1241_NBUAH12031_6609960_siVZdnHOJy
##JCAMPDX= 6.0         $$ Bruker NMR JCAMP-DX V2.0
##DATA TYPE= NMR SPECTRUM
##DATA CLASS= NTUPLES
##ORIGIN= BRUKER
##OWNER= Administrator
$$ 1.72 TOPSPIN		Version 2.1
$$ 2012-08-01 23:35:53.953 -0500  Administrator@TOPSPIN
$$ Compression mode = diff/dup
##.OBSERVE FREQUENCY= 400.02188249412
##.OBSERVE NUCLEUS= ^1H
##.ACQUISITION MODE= SIMULTANEOUS (DQD)
##.ACQUISITION SCHEME= undefined
##.AVERAGES= 64
##.DIGITISER RES= 22
##SPECTROMETER/DATA SYSTEM= spect
##.PULSE SEQUENCE= noesygpps1d.comp
##.SOLVENT NAME= COFFEE_meoh
##.SHIFT REFERENCE= INTERNAL, COFFEE_meoh, 1, 14.96218
##AUDIT TRAIL= $$ (NUMBER, WHEN, WHO, WHERE, PROCESS, VERSION, WHAT)
$$ ##TITLE= Audit trail, TOPSPIN		Version 2.1
$$ ##JCAMPDX= 5.01
$$ ##ORIGIN= Bruker BioSpin GmbH
$$ ##OWNER= Administrator
$$ $$ C:\Bruker\TOPSPIN/data/COFFEE/nmr/AC1241_NBUAH12031_6609960_siVZdnHOJy/12/pdata/1/auditp.txt
$$ ##AUDIT TRAIL=  $$ (NUMBER, WHEN, WHO, WHERE, PROCESS, VERSION, WHAT)
(   1,<2012-08-01 23:35:48.687 -0500>,<Administrator>,<TOPSPIN>,<go>,<TOPSPIN 2.1>,
      <created by zg
	started at 2012-08-01 23:24:18.375 -0500,
	POWCHK enabled, PULCHK disabled,
       configuration hash MD5:
       6B 1B 68 BB D9 2E 58 E2 7F 35 AD 54 07 DF 0E 41
       data hash MD5: 64K
       FF 0E D8 88 3B 14 45 D2 B6 28 B4 BF 9A 7B 45 EE>)
(   2,<2012-08-01 23:35:51.609 -0500>,<Administrator>,<TOPSPIN>,<proc1d>,<TOPSPIN 2.1>,
      <Start of raw data processing
       efp LB = 0.3 FT_mod = 6 PKNL = 1 PHC0 = 0 PHC1 = 0 SI = 128K 
       data hash MD5: 128K
       A9 C6 A0 AA D2 69 82 78 27 4E 95 9C 53 DB 06 C1>)
(   3,<2012-08-01 23:35:52.750 -0500>,<Administrator>,<TOPSPIN>,<proc1d>,<TOPSPIN 2.1>,
      <pk PHC0 = -0.04943848 PHC1 = 0 
       data hash MD5: 128K
       06 A4 D2 24 B4 E8 44 6D 09 1E 85 7C 90 A3 CE 85>)
(   4,<2012-08-01 23:35:53.593 -0500>,<Administrator>,<TOPSPIN>,<proc1d>,<TOPSPIN 2.1>,
      <abs ABSG = 1 
       data hash MD5: 128K
       CE B5 FF 2E C6 51 77 C6 B8 01 B4 C7 EC C0 72 4A>)
(   5,<2012-08-01 23:35:53.671 -0500>,<Administrator>,<TOPSPIN>,<proc1d>,<TOPSPIN 2.1>,
      <abs ABSG = 2 
       data hash MD5: 128K
       4F C8 C7 A0 AC 1F 4B 24 68 5E 9C 58 06 E2 0C D8>)
(   6,<2012-08-01 23:35:53.734 -0500>,<Administrator>,<TOPSPIN>,<proc1d>,<TOPSPIN 2.1>,
      <abs ABSG = 3 
       data hash MD5: 128K
       E0 76 F6 45 51 CE 6F 47 70 64 C5 95 11 73 25 30>)
(   7,<2012-08-01 23:35:53.812 -0500>,<Administrator>,<TOPSPIN>,<proc1d>,<TOPSPIN 2.1>,
      <abs ABSG = 4 
       data hash MD5: 128K
       83 9A E8 4A 43 93 9B AB CB EF 7D 2B 89 EE 80 08>)
(   8,<2012-08-01 23:35:53.875 -0500>,<Administrator>,<TOPSPIN>,<proc1d>,<TOPSPIN 2.1>,
      <abs ABSG = 5 
       data hash MD5: 128K
       6B B1 E3 85 6E 63 AF 89 78 66 C2 AC 48 E3 59 67>)
$$ ##END=
$$ 
$$ $$ hash MD5
$$ $$ 58 14 CD 4B 55 26 B3 9E 03 08 EE 8E 9C 77 68 86
##$RELAX= 
##$RELAX= 
##$RELAX= 
##$RELAX= 
##$RELAX= 
##$RELAX= 
##$RELAX= 
##$RELAX= 
$$ Bruker specific parameters
$$ [...]
##$TP07= 0
##$TPNAME0= <>
##$TPNAME1= <>
##$TPNAME2= <>
##$TPNAME3= <>
##$TPNAME4= <>
##$TPNAME5= <>
##$TPNAME6= <>
##$TPNAME7= <>
##$TPOAL= (0..7)
0.5 0.5 0.5 0.5 0.5 0.5 0.5 0.5
##$TPOFFS= (0..7)
0 0 0 0 0 0 0 0
##$TUNHIN= 0
##$TUNHOUT= 0
##$TUNXOUT= 0
##$USERA1= <user>
##$USERA2= <user>
##$USERA3= <user>
##$USERA4= <user>
##$USERA5= <user>
##$V9= 5
##$VALIST= <valist>
##$VCLIST= <CCCCCCCCCCCCCCC>
##$VD= 0
##$VDLIST= <DDDDDDDDDDDDDDD>
##$VPLIST= <PPPPPPPPPPPPPPP>
##$VTLIST= <TTTTTTTTTTTTTTT>
##$WBST= 1024
##$WBSW= 4
##$XGAIN= (0..3)
0 0 0 0
##$XL= 0
##$YL= 0
##$YMAX_a= 15425569
##$YMIN_a= -9649168
##$ZGOPTNS= <>
##$ZL1= 120
##$ZL2= 120
##$ZL3= 120
##$ZL4= 120
##$ABSF1= 14.96218
##$ABSF2= -5.596002
##$ABSG= 5
##$ABSL= 3
##$ALPHA= 0
##$AQORDER= 0
##$ASSFAC= 0
##$ASSFACI= 0
##$ASSFACX= 0
##$ASSWID= 0
##$AUNMP= <proc_prof1d_extract.lims>
##$AXLEFT= 0
##$AXNAME= <>
##$AXNUC= <1H>
##$AXRIGHT= 0
##$AXTYPE= 0
##$AXUNIT= <>
##$AZFE= 0.1
##$AZFW= 0.1
##$BCFW= 0
##$BC_mod= 0
##$BYTORDP= 0
##$COROFFS= 0
##$CY= 15
##$DATMOD= 1
##$DC= 0
##$DFILT= <>
##$DTYPP= 0
##$F1P= 0
##$F2P= 0
##$FCOR= 0.5
##$FTSIZE= 131072
##$FT_mod= 6
##$GAMMA= 0
##$GB= 0
##$INTBC= 1
##$INTSCL= 1
##$ISEN= 128
##$LB= 0.3
##$LEV0= 0
##$LPBIN= 0
##$MAXI= 10000
##$MC2= 0
##$MEAN= 0
##$ME_mod= 0
##$MI= 0
##$NCOEF= 0
##$NC_proc= -2
##$NLEV= 6
##$NOISF1= 0
##$NOISF2= 0
##$NSP= 0
##$NTH_PI= 0
##$NZP= 0
##$OFFSET= 14.96218
##$PC= 1
##$PHC0= -0.04943848
##$PHC1= 0
##$PH_mod= 1
##$PKNL= yes
##$PPARMOD= 0
##$PPDIAG= 0
##$PPIPTYP= 0
##$PPMPNUM= 2147483647
##$PPRESOL= 1
##$PSCAL= 4
##$PSIGN= 0
##$PYNMP= <proc.py>
##$REVERSE= no
##$SF= 400.02000916421
##$SI= 131072
##$SIGF1= 0
##$SIGF2= 0
##$SINO= 400
##$SIOLD= 131072
##$SPECTYP= <>
##$SREGLST= <1H.CDCl3>
##$SSB= 0
##$STSI= 131072
##$STSR= 0
##$SW_p= 8223.68421052631
##$SYMM= 0
##$S_DEV= 0
##$TDeff= 65536
##$TDoff= 0
##$TI= <>
##$TILT= no
##$TM1= 0
##$TM2= 0
##$TOPLEV= 0
##$USERP1= <user>
##$USERP2= <user>
##$USERP3= <user>
##$USERP4= <user>
##$USERP5= <user>
##$WDW= 1
##$XDIM= 131072
##$YMAX_p= 405263319
##$YMIN_p= -11690
##$CURPLOT= <Network HP LaserJet P1505>
##$CURPRIN= <$Network HP LaserJet P1505>
##$DFORMAT= <normdp>
##$LAYOUT= <+/1D_H.xwp>
##$LFORMAT= <normlp>
##$PFORMAT= <normpl>
##$SURQMSG= 1
$$ End of Bruker specific parameters
$$ ---------------------------------
##NTUPLES= NMR SPECTRUM
##VAR_NAME=  FREQUENCY,     SPECTRUM/REAL,   SPECTRUM/IMAG
##SYMBOL=    X,             R,               I
##VAR_TYPE=  INDEPENDENT,   DEPENDENT,       DEPENDENT
##VAR_FORM=  AFFN,          ASDF,            ASDF
##VAR_DIM=   131072,        131072,          131072
##UNITS=     HZ,            ARBITRARY UNITS, ARBITRARY UNITS
##FACTOR=    0.0627417313425164, 1,          1
##FIRST=     8223.62146879497, 2203,         -64491
##LAST=      0,             4727,            -63992
##MIN=       0,             -11690,          0
##MAX=       8223.62146879497, 405263319,    0
$$ Real data points
##PAGE= N=1
##DATA TABLE= (X++(R..R)), XYDATA
$$ [...]
63267B96350q64J55J421K163K435K598K586K111J406J214J898K873L225K829K524
63252C24924L088M252N104N339N611O504P646Q318Q587R123R989J0472J0283J0220
63238D29460J1085J2590J3960J5205J6989J9394K1658K3206K4240K5060K5442
63227F38289K5122K4474K4164K4286K4257K3563K2366K1287K0785K0779K0815
63216H90187K0566K0117J9722J9380J8764J7438J5005J1216O321J144l644q362
63204A027854j3832j9895k5105k8325l0057l1511l2761l2770l1069k8509k6065
63193G27955k3690k0814j7305j3428r257m846p31K429M758P126J0033J2943J4982
63180F90155J6022J6736J7771J9102K0237K0809K0865K0734K0713K0842K0871
$$ plain form
63267 296350 295486 295641 297062 299225 301660 304258 306844 308955 310361 311575 313473 316346 319571 322400 324924
63252 324924 328012 332264 337368 342707 348318 354822 362468 370786 379373 388496 398485 408957 419240 429460
63238 429460 440545 453135 467095 482300 499289 518683 540341 563547 587787 612847 638289
63227 638289 663411 687885 712049 736335 760592 784155 806521 827808 848593 869372 890187
63216 890187 910753 930870 950592 969972 988736 1006174 1021179 1032395 1038716 1039860 1036216 1027854
63204 1027854 1014022 994127 969022 940697 910640 879129 846368 813598 782529 754020 727955
63193 727955 704265 683451 666146 652718 643461 638615 637884 640313 645071 652197 662230 675173 690155
63180 690155 706177 722913 740684 759786 780023 800832 821697 842431 863144 883986 904857
63169I04857K0406J9255J7673J6119J4722J3032J0532P176L269j083o005j1316
63157A008637j6389k0698k4189k6920k8751k9686l0144l0441l0224k8966k6888
63146G15341k4877k3439k2189k0436j7933j4924j1926r610q422q074p622o382
63134E39507m613l136k420k213j887j026J74J039J061M93J13L34R16J521K125
63119E31988K640K710K238J814K021K521K401J402L45K22J193K561L471L506K822
63104E63855J924J275J057J251J737K206K282K009K016K816M032M632M055K728
63090E97875J486Q52R20J577K492L136L130K635K211K299K831L361L578L670M188
63075F36241N450P214Q989J0488J1662J2466J2867J3102J3602J4643J6156J7869
$$ plain form
63169 904857 925263 944518 962191 978310 993032 1006064 1016596 1023772 1027041 1025958 1019953 1008637
63157 1008637 992248 971550 947361 920441 891690 862004 831860 801419 771195 742229 715341
63146 715341 690464 667025 644836 624400 606467 591543 579617 570007 561585 553511 545889 539507
63134 539507 534894 531758 529338 527125 525238 524212 524386 525425 526486 526979 527092 527426 528342 529863 531988
63119 531988 534628 537338 539576 541390 543411 545932 548333 549735 550080 550302 551495 554056 557527 561033 563855
63104 563855 565779 567054 568111 569362 571099 573305 575587 577596 579612 582428 586460 591092 595147 597875
63090 597875 599361 600213 601133 602710 605202 608338 611468 614103 616314 618613 621444 624805 628383 632053 636241
63075 636241 641691 648905 657894 668382 680044 692510 705377 718479 732081 746724 762880 780749
63063G80749J9457K0672K1559K2504K3836K5444K7061K8818L1074L3743L6224
63052A071141L8190M0018M2179M4553M6614M8060M8949M9403M9510M9352M8880
63041A576849M7853M6206M4372M2967M2184M1793M1704M2133M3080M3944M3947
63030B057032M2845M0954L8410L4663K8849K0666J0699j93j1595k3465l5412m6366
63018B157087n5122o1191o4960o7091o7884o7198o4822o0819n5541m9403m2785
63007A500271l6058k9481k2948j6134r051k301L555Q763J4020J9316K3669K6333
62995A479954K7821K9265L0979L2245L2530L2295L2382L2963L3433L3082L1565
62984A828514K8860K5217K1101J6841J2162O354r45r318j8101k7070l6278m5320
$$ plain form
63063 780749 800206 820878 842437 864941 888777 914221 941282 970100 1001174 1034917 1071141
63052 1071141 1109331 1149349 1191528 1236081 1282695 1330755 1379704 1429107 1478617 1527969 1576849
63041 1576849 1624702 1670908 1715280 1758247 1800431 1842224 1883928 1926061 1969141 2013085 2057032
63030 2057032 2099877 2140831 2179241 2213904 2242753 2263419 2274118 2273925 2262330 2238865 2203453 2157087
63018 2157087 2101965 2040774 1975814 1908723 1840839 1773641 1708819 1648000 1592459 1543056 1500271
63007 1500271 1464213 1434732 1411784 1395650 1386599 1384298 1387853 1396616 1410636 1429952 1453621 1479954
62995 1479954 1507775 1537040 1568019 1600264 1632794 1665089 1697471 1730434 1763867 1796949 1828514
62984 1828514 1857374 1882591 1903692 1920533 1932695 1939049 1938104 1928786 1910685 1883615 1847337 1802017
62972A802017n3241n9303o3565o6511o8336o8792o7665o5191o1981n8617n5207
62961A113608n1368m6743m1673l7146l3920l1761k9721k7052k3773k0523j8049
62950G51879j6671j5929j4874j2974j0681q857p747o881n951n271n229n661o126
62937F29027o500p001p625q007p833p296o920o961p119o939o415n977n815n548
62923E33071m810l911l449l453l403l131l088l437l530k781j708j371j926k410
62909D90663k082j346j052j267j311q08j38K03K95N19Q78R69N94J26P1M83R63
62892D87760J116Q45L00k75o54p91q72j106j428j575j454j293j341j558j695j563
62876D74416j203q48p75j091j525j602j128n10l53p34j096r72o34p74j624k666
$$ plain form
62972 1802017 1748776 1689473 1625908 1559397 1491061 1422269 1354604 1289413 1227432 1168815 1113608
62961 1113608 1062240 1015497 973824 936678 902758 870997 841276 814224 790451 769928 751879
62950 751879 735208 719279 704405 691431 680750 671893 664146 657265 651314 646043 640814 635153 629027
62937 629027 622527 615526 607901 599894 592061 584765 577845 570884 563765 556826 550411 544434 538619 533071
62923 533071 528261 524350 520901 517448 514045 510914 507826 504389 500859 498078 496370 494999 493073 490663
62909 490663 488581 487235 486183 484916 483605 482797 482659 482862 483157 483676 484554 485523 486117 486243 486314 486797 487760
62892 487760 488876 489721 490021 489746 489092 488301 487429 486323 484895 483320 481866 480573 479232 477674 475979 474416
62876 474416 473213 472365 471590 470499 468974 467372 466244 465734 465381 464647 463551 462579 461945 461171 459547 456881
62860D56881l295l453l433l345l123k895k917l108l110k821k494k262j911j384
62846D17330j011r70r45o83n13p95j212j136n43P5N20J002J457J460J025Q40J353
62829D17254K065K151J487P04L78N11P64Q50P59O32N33L63Q2j13K2M43Q76J153
62811D30914J312J424J601K036K723L176K918K291K273L348M947O249P129Q051
62797D80392R288J0643J1806J2714J3602J4739J6110J7392J8451J9767K1984K5037
62785F71925K8173L0876L3340L5945L8761M1907M5756N0422N5369O0101O4878
62774A157453P0241P5987Q1192Q5135Q7771Q9195Q9111Q6943Q2254P4956O5332
62763B045570N3794M0587K5785R755o549k2015l6080m8822o0394p0571p8872q4932
$$ plain form
62860 456881 453586 450133 446700 443355 440232 437337 434420 431312 428202 425381 422887 420625 418714 417330
62846 417330 416319 415349 414404 413721 413208 412413 411201 410065 409522 409597 410117 411119 412576 414036 415061 415901 417254
62829 417254 419319 421470 422957 423661 424039 424550 425314 426164 426923 427555 428088 428451 428533 428420 428442 428885 429761 430914
62811 430914 432226 433650 435251 437287 440010 443186 446104 448395 450668 454016 458963 465212 472341 480392
62797 480392 489680 500323 512129 524843 538445 553184 569294 586686 605137 624904 646888 671925
62785 671925 700098 730974 764314 800259 839020 880927 926683 977105 1032474 1092575 1157453
62774 1157453 1227694 1303681 1384873 1470008 1557779 1646974 1736085 1823028 1905282 1980238 2045570
62763 2045570 2099364 2139951 2165736 2175491 2168942 2146927 2110847 2062025 2001631 1931060 1852188 1767256
62751A767256q8639r0048q9300q6725q3003p8913p4770p0280o5202n9973n5248
62740I25155n1046m6841m2521l8522l4963l1373k7626k4415k2328k0958j9514
62729E65048j7782j5918j3761j1147q619o957o140n470m652m042l714l051j580
62716D62215L41J980L095M030N179O579P947R118J0389J2281J4790J7256J9221
62703E74421K1118K3645K6806L0141L3609L7462M1421M4902M8152N2195N7262
62692I91134O2102O5378O7127O8237O8998O8837O7161O3739N8328N0580M0514
62681A672135K8747J6138L356r269k1635l3524m4300n3116n9678o4532o8327p0931
62669A295064p1640p0217o7340o4018o0859n7909n4831n1203m6861m2231l8018
$$ plain form
62751 1767256 1678617 1588569 1499269 1412544 1329541 1250628 1175858 1105578 1040376 980403 925155
62740 925155 874109 827268 784747 746225 711262 679889 652263 627848 605520 584562 565048
62729 565048 547266 531348 517587 506440 497821 490864 484724 479254 474602 470560 466846 463795 462215
62716 462215 462556 464536 467631 471661 476840 483419 491366 500484 510873 523154 537944 555200 574421
62703 574421 595539 619184 645990 676131 709740 747202 788623 833525 881677 933872 991134
62692 991134 1053236 1118614 1185741 1253978 1322976 1391813 1458974 1522713 1581041 1631621 1672135
62681 1672135 1700882 1717020 1720376 1711107 1689472 1655948 1611648 1558532 1498854 1434322 1365995 1295064
62669 1295064 1223424 1153207 1085867 1021849 960990 903081 848250 797047 750186 707955 669937
62658F69937l4511l1357k8149k4983k2224j9948j7957j6223j4921j3982j3013
62647D32669j1848j0885j0551j0630j0464r712q644p645o823o133n650n413n252
62634C23019m978m615m313m070l734l251k736k281j870j438r83n98l73k77j38
62619B87364J68N20O90O34N89Q34J440K277L114L796M448N423O860Q361R358R700
62603C45576R694R689R979J0967J2836J5095J7036J8712K0834K3592K6323K8707
62591E49040L1445L5078L8874M1709M3641M5614M7728M8747M7446M3772L8532
62580A011626L2566K6288J9641J2209L779n134j3560k0863k6998l2153l6478l9991
62568I30932m2309m2720m1101l8584l6568l5121l3190l0390k7627k5616k3715
$$ plain form
62658 669937 635426 604069 575920 550937 528713 508765 490808 474585 459664 445682 432669
62647 432669 420821 409936 399385 388755 378291 368579 359935 352290 345467 339334 333684 328271 323019
62634 323019 318041 313426 309113 305043 301309 298058 295322 293041 291171 289733 288750 288152 287779 287502 287364
62619 287364 287532 288052 288742 289376 289965 290799 292239 294516 297630 301426 305874 311297 318157 326518 335876 345576
62603 345576 355270 364959 374938 385905 398741 413836 430872 449584 470418 494010 520333 549040
62591 549040 580485 615563 654437 696146 739787 785401 833129 881876 929322 973094 1011626
62580 1011626 1044192 1070480 1090121 1102330 1106109 1100975 1087415 1066552 1039554 1007401 970923 930932
62568 930932 888623 845903 804802 766218 729650 694529 661339 630949 603322 577706 553991
62557E53991k1024j7935j5725j4813j4325j3339j1993j1053j0820j0862j0713
62546D01389j0467j0485j0637j0221q848p088n904n582n564n233m455l402k277
62533C11226j266l81O25J864K922L345L443L959M966N851O507P668R579J1244
62519C71552J1743J1762J2802J5161J7678J9504K1161K3457K6184K8522L0422
62508E89948L2697L5678L8372L9470L8858L7581L6275L4275L0566K5149J8931
62497I57800J2534N861j231q474j5464k1860k7174l0936l3277l4828l5810l5712
62485G31429l4260l2104l0112k8325k6177k3479k0672j8172j5980j3964j2120
62474D76064j0552r341q478p752o879n908n216m863m241k783q77M93R82J278K106
$$ plain form
62557 553991 532967 515032 499307 484494 470169 456830 444837 433784 422964 412102 401389
62546 401389 390922 380437 369800 359579 350731 343643 337739 332157 326593 321360 316905 313503 311226
62533 311226 309960 309579 310204 312068 314990 318335 321778 325737 330703 336554 343061 350729 360308 371552
62519 371552 383295 395057 407859 423020 440698 460202 481363 504820 531004 559526 589948
62508 589948 622645 658323 696695 736165 775023 812604 848879 883154 913720 938869 957800
62497 957800 970334 976195 974964 966490 951026 929166 901992 871056 837779 802951 767141 731429
62485 731429 697169 665065 634953 606628 580451 556972 536300 518128 502148 488184 476064
62474 476064 465512 456171 447693 439941 433062 427154 421938 417075 412834 410051 409174 409667 410649 411927 414033
62459D14033L259L960L922L712M099N236O574P464P781P929Q326R007R744J0340
62445E05386J0675J0520R614P984O044M245K635Q67j367m084p117j0256j3076
62432E22070j4867j5203j4547j3916j3796j3728j3136j2108j1041r964q696p370
62420C73698o226n120l820k571j725r74K85J815K635K482K311K966M057M758N093
62405C79664N709O699P491P809Q118Q931J0043J0707J0400R333Q203P437O718
62392D87262N437L511J531K9j062k088l124l976m524m858n104n259n127m421l075
62377D55152j379L51K153M190O336Q342J0303J2511J4897J7216J9689K2824K6576
62364E99161L0350L3973L7874M2136M6146M9557N2777N5994N8401N9096N8089
$$ plain form
62459 414033 417292 421252 425174 428886 432985 438221 444795 452259 460040 467969 476295 485302 495046 505386
62445 505386 516061 526581 536195 544179 550223 554468 557103 557970 556603 552519 545402 535146 522070
62432 522070 507203 492000 477453 463537 449741 436013 422877 410769 399728 389764 381068 373698
62420 373698 367472 362352 358532 355961 354236 353262 353547 355362 357997 360479 362790 365756 369813 374571 379664
62405 379664 385373 392072 399563 407372 415490 424421 434464 445171 455571 464904 473107 480544 487262
62392 487262 492699 496210 497741 497770 496708 494620 491496 487520 482996 478138 473034 467775 462648 458227 455152
62377 455152 453773 454124 456277 460467 466803 475145 485448 497959 512856 530072 549761 572585 599161
62364 599161 629511 663484 701358 743494 789640 839197 891974 947968 1006369 1065465 1123554
62353A123554N5770N1859M5721L7419K7783J7705P927q10q163j4586k0740k6658
62341A296781l1959l6608m0788m4209m6217m6598m5730m3996m1574l8758l5900
62330H44444l3069l0179k7449k5344k4019k3182k2413k1371j9863j8053j6422
62319E83080j5113j3663j1694r585p805o133m154k259j190p79q0J183K202K333
62305E16343J926J533J071K25q47j725k325k862l439l982m388m618m745m922n074
62290D82171m723l553k032r77m29M03J878L272L768L595L662M379N379O239O983
62275E10015P778Q616R384J0104J0923J1954J3192J4562J6018J7545J9156K0991
62263F70238K3377K6596L0489L4561L8533M2589M6860N0887N3857N5209N4778
$$ plain form
62353 1123554 1179324 1231183 1276904 1314323 1342106 1359811 1367738 1366928 1358765 1344179 1323439 1296781
62341 1296781 1264822 1228214 1187426 1143217 1097000 1050402 1004672 960676 919102 880344 844444
62330 844444 811375 781196 753747 728403 704384 681202 658789 637418 617555 599502 583080
62319 583080 567967 554304 542610 533025 525220 519087 514933 512674 511484 510705 510625 511808 514010 516343
62305 516343 518269 519802 520873 521098 520251 518526 516201 513339 509900 505918 501530 496912 492167 487245 482171
62290 482171 477448 473895 471863 470886 470457 470860 472738 476010 479778 483373 487035 491414 496793 503032 510015
62275 510015 517793 526409 535793 545897 556820 568774 581966 596528 612546 630091 649247 670238
62263 670238 693615 720211 750700 785261 823794 866383 913243 964130 1017987 1073196 1127974
62252A127974N2492M8211M1852L3537K3765J3500L771m981j2979k0403k7001l2616
62240A247122l7551m2051m5752m8071m8833m8122m6017m2891l9505l6256l2787
62229G79286k8815k4852k1440j8272j4917j1890r895q478o574m199k367j441p80
62216F25366l0N23J010J966L009K921J550L78N20J355J873K169K668K967K633
62201F50878K334K942M095M888N502O946R372J1820J3551J4704J5650J6612J8011
62188G77305K0238K2872K4877K5762K5932K5698K4583K1967J7990J3521R598O978
62176A017321N910N998O537P228Q426J0582J3697J7412K1494K5953L0640L4909
62164A206107L7795L8646L7520L4913L1113K6075J9926J3293O994J511l064o777
$$ plain form
62252 1127974 1180466 1228677 1270529 1304066 1327831 1341331 1345102 1340121 1327142 1306739 1279738 1247122
62240 1247122 1209571 1167520 1121768 1073697 1024864 976742 930725 887834 848329 812073 779286
62229 779286 750471 725619 704179 685907 670990 659100 649205 640727 634153 629954 627587 626146 625366
62216 625366 625336 625859 626869 628835 631844 634765 636315 636693 637213 638568 640441 642610 645278 648245 650878
62201 650878 653212 656154 660249 665137 670639 677585 686957 698777 712328 727032 742682 759294 777305
62188 777305 797543 820415 845292 871054 896986 922684 947267 969234 987224 1000745 1010343 1017321
62176 1017321 1023231 1029229 1035766 1042994 1051420 1062002 1075699 1093111 1114605 1140558 1171198 1206107
62164 1206107 1243902 1282548 1320068 1354981 1386094 1412169 1432095 1445388 1452382 1453893 1450829 1444052
62152A444052r648j1735j3326j4940j6919j8891j9945j9714j8904j8270j7290
62141A264470j4834j1030p506n450m322l032j559o20l53k02J82P32J490K660M101
62126A224727N327O036O336O567P186Q544J0409J1944J2628J2976J3887J5527
62114A342094J7324J8815J9983K0888K1539K2048K2504K2846K3240K4279K6238
62103A581798K8403K9855L0775L2178L4323L6177L6614L5538L3561L1218K8891
62092A939331K7149K6741K8154L1123L4409L6379L6247L4769L3305L2451L2054
62081B292112L2246L3541L5848L8311M0318M1943M3105M3193M2098M0832M0344
62070B723891M0319L9919L9320L9551M0915M2426M2989M2499M1510M0282L8385
$$ plain form
62152 1444052 1434404 1422669 1409343 1394403 1377484 1358593 1338648 1318934 1300030 1281760 1264470
62141 1264470 1249636 1238606 1231100 1225650 1221328 1218296 1216737 1216117 1215764 1215562 1215744 1216476 1217966 1220626 1224727
62126 1224727 1230054 1236090 1242426 1248993 1256179 1264723 1275132 1287076 1299704 1312680 1326567 1342094
62114 1342094 1359418 1378233 1398216 1419104 1440643 1462691 1485195 1508041 1531281 1555560 1581798
62103 1581798 1610201 1640056 1670831 1703009 1737332 1773509 1810123 1845661 1879222 1910440 1939331
62092 1939331 1966480 1993221 2021375 2052498 2086907 2123286 2159533 2194302 2227607 2260058 2292112
62081 2292112 2324358 2357899 2393747 2432058 2472376 2514319 2557424 2600617 2642715 2683547 2723891
62070 2723891 2764210 2804129 2843449 2883000 2923915 2966341 3009330 3051829 3093339 3133621 3172006
62059C172006L5158L0399K4800J9564J5348J1722P924L929K50l122o802j0819
62047C300357j4166j6043j6981j8048j9332k0027j9829j9347j8990j8251j6580
62036C102763j4371j2557j1542j1099j0951j0939j0756j0081r036q057p360o865
62024B979149o631o813p194p246o788o163n663n205m711m308l896l043j651l20
62010B909517L68O17J090K026L114M047M805N520O313P233Q035Q221P550O297
61996B974753M748K621n97m937r967j5343k0874k6050l0123l2849l4776l6472
61984B770134l7754l7894l6626l4707l3402l3319l3810l3614l2138k9949k8058
61973B398863k6967k6488k6124k5371k4028k2464k1355k0838k0276j9212j8111
$$ plain form
62059 3172006 3207164 3237563 3262363 3281927 3297275 3308997 3316921 3320850 3321100 3317978 3311176 3300357
62047 3300357 3286191 3270148 3253167 3235119 3215787 3195760 3175931 3156584 3137594 3119343 3102763
62036 3102763 3088392 3075835 3064293 3053194 3042243 3031304 3020548 3010467 3001431 2993374 2986014 2979149
62024 2979149 2972518 2965705 2958511 2951265 2944477 2938314 2932651 2927446 2922735 2918427 2914531 2911488 2909837 2909517
62010 2909517 2909885 2910502 2911592 2913618 2916732 2920779 2925584 2931104 2937417 2944650 2952685 2960906 2968456 2974753
61996 2974753 2979501 2982122 2981525 2976588 2966621 2951278 2930404 2904354 2874231 2841382 2806606 2770134
61984 2770134 2732380 2694486 2657860 2623153 2589751 2556432 2522622 2489008 2456870 2426921 2398863
61973 2398863 2371896 2345408 2319284 2293913 2269885 2247421 2226066 2205228 2184952 2165740 2147629
61962B147629j7628j7450j6672j5226j4083j3867j3993j3593j2671j1830j1174
61951A989442j0202q704p218o361o019n499m432l182k233j391k4J967L823M834
61937A944801N208N707O706Q037R587J1489J3631J5504J6785J7759J8969K0608
61925B094791K2526K4684K7398L1046L5597M0641M6003N2214O0113O9904Q0952
61914B585869R2658J05165J18997J34351J51206J69823J90594K13542K38503K65729
61904D266437K95796L28925L64834M03172M43406M84038N22287N54505N76284
61895H239684N82023N65231N20237M44169L37926K06486N8916r2604k35336l58919
61885A0267813m57004n27211n70355n89475n88745n72566n45159n10384m71429
$$ plain form
61962 2147629 2130001 2112551 2095879 2080653 2066570 2052703 2038710 2025117 2012446 2000616 1989442
61951 1989442 1979240 1970536 1963318 1956957 1950938 1945439 1941007 1937825 1935592 1934201 1934177 1936144 1939967 1944801
61937 1944801 1950009 1955716 1962422 1970459 1980046 1991535 2005166 2020670 2037455 2055214 2074183 2094791
61925 2094791 2117317 2142001 2169399 2200445 2236042 2276683 2322686 2374900 2435013 2504917 2585869
61914 2585869 2678527 2783692 2902689 3037040 3188246 3358069 3548663 3762205 4000708 4266437
61904 4266437 4562233 4891158 5255992 5659164 6102570 6586608 7108895 7663400 8239684
61895 8239684 8821707 9386938 9907175 10351344 10689270 10895756 10954672 10862068 10626732 10267813
61885 10267813 9810809 9283598 8713243 8123768 7535023 6962457 6417298 5906914 5435485
61876E435485m30688l90107l51424l15688k82861k52437k24581k00124j79291
61867B808284j61041j44157j28583j15077j03715r3455q3375p3637o4834n6934
61857A783476m9426m2290l6114l1217k7168k3302j9303j5239j1380q108n687l978
61845A510264k724k033k194k965l677m229n217o769p945p853o790n608m408k671
61831A445181l94J802L567N078O358P110P257P037O391M918K646L65j149j826
61817A494341k117k411k741k724j743M57L323O060Q560J1308J4329J7043J9335
61804A563020K2161K6501L2149L7954M3002M7195N0997N5051N9878O5598P1894
61793B075400P8459Q5337R2729J00744J09565J19638J31311J44455J58815J74713
$$ plain form
61876 5435485 5004797 4614690 4263266 3947578 3664717 3412280 3187699 2987575 2808284
61867 2808284 2647243 2503086 2374503 2259426 2155711 2062256 1978881 1905244 1840410 1783476
61857 1783476 1734050 1691760 1655646 1624429 1597261 1573959 1554656 1539417 1528037 1519929 1514242 1510264
61845 1510264 1507540 1505507 1503313 1500348 1496671 1492442 1487225 1480456 1472511 1464658 1457868 1452260 1447852 1445181
61831 1445181 1444787 1446589 1450156 1455234 1461592 1468702 1475959 1482996 1489387 1494305 1496951 1497316 1496167 1494341
61817 1494341 1492224 1489813 1487072 1484348 1482605 1483062 1486385 1492445 1501005 1512313 1526642 1543685 1563020
61804 1563020 1585181 1611682 1643831 1681785 1724787 1771982 1822979 1878030 1937908 2003506 2075400
61793 2075400 2153859 2239196 2331925 2432669 2542234 2661872 2793183 2937638 3096453 3271166
61783C271166J93031K14391K38548K64862K93299L24802L60601M01232M46483
61774F008415M96250N51107O11706O77636P47170Q17942Q87424R52253J006893
61765A2756796J042783J048943J014046R29084P89591N97174L60692R6435j74103
61756A8461441m28856o49889q25652r50982j026373j057002j050956j017149r63972
61747A0490610q98729q27267p53851o81662o13213n49982m92152m39491l92298
61738D841965l50862l14405k81515k51609k25030k01753j81037j62491j46448
61729B726815j32853j20728j09177r8255q8384p9695p2303o6456o1899n7771n3745
61718A785549n0573m8822m7726m6013m3444m0795l8644l6813l4781l2161k8982
$$ plain form
61783 3271166 3464197 3678588 3917136 4181998 4475297 4800099 5160700 5561932 6008415
61774 6008415 6504665 7055772 7667478 8345114 9092284 9910226 10797650 11749903 12756796
61765 12756796 13799579 14848522 15862568 16791652 17581243 18178417 18539109 18635544 18461441
61756 18461441 18032585 17382696 16557044 15606062 14579689 13522687 12471731 11454582 10490610
61747 10490610 9591881 8764614 8010763 7329101 6715888 6165906 5673754 5234263 4841965
61738 4841965 4491103 4176698 3895183 3643574 3418544 3216791 3035754 2873263 2726815
61729 2726815 2593962 2473234 2364057 2265802 2177418 2097723 2025420 1958964 1897065 1839294 1785549
61718 1785549 1734976 1686154 1638428 1592415 1548971 1508176 1469532 1432719 1397938 1365777 1336795
61707A336795k5898k3785k2789k2143k1208k0074j8842j7145j5056j3626j3569
61696A122660j4067j3875j3161j3075j3801j4280j3832j2910j2114j1452j0838
61685I79255j0425j0129r663r269r581j0455j0774r942q792q394q548q259p308
61672H57716o530o525o806o469n341m208l955m654n559o030o227o639p127o910
61658G74736n596l812k505j922j668j479j498j714j604o66Q96K268K890K989L174
61643G64489L665M097L990L187J942P92L32P93J777K603L000L192L378L462L423
61628H04122L499L805M134M332M508M606M177K946J280k78j693l240m917o477
61614H20804p848r066r888r983r471q926q807r086r370r184q357p310o683o520
$$ plain form
61707 1336795 1310897 1287112 1264323 1242180 1220972 1200898 1182056 1164911 1149855 1136229 1122660
61696 1122660 1108593 1094718 1081557 1068482 1054681 1040401 1026569 1013659 1001545 990093 979255
61685 979255 968830 958701 949038 939769 930188 919733 908959 899017 890225 881831 873283 865024 857716
61672 857716 851186 844661 837855 831386 826045 821837 817882 813228 807669 801639 795412 788773 781646 774736
61658 774736 769140 765328 762823 760901 759233 757754 756256 754542 752938 752272 753168 755436 758326 761315 764489
61643 764489 768154 772251 776241 779428 781370 782162 782494 783287 785064 787667 790667 793859 797237 800699 804122
61628 804122 807621 811426 815560 819892 824400 829006 833183 836129 837409 837131 835438 832198 827281 820804
61614 820804 812956 803890 794002 784019 774548 765622 756815 747729 738359 729175 720818 713508 706825 700305
61600G00305o182n388m766m848n025m300k756j432q26m14K95J085J663K230K993
61585F72634L714M095M326M870N969P446Q799R466R375R231R892J1374J2983J4390
61571G88564J5997J8073K0161K1688K2681K3559K4549K5635K6635K7106K6541
61560A041189K5095K3732K3236K3321K3082K2066K0553J9014J7798J7143J7008
61549A273237J6859J5997J4201J1831R334O885M485K120l03k916n641q121j0007
61536A327961j1324j2406j3518j4552j5150j5022j4060j2288r914p417n274l401
61524A193635j190J701M867P810J0760J4290J8370K2395K6165L0206L5003M0564
61512A404576M6932N4452O3122P2130Q0673Q8988R8128J08844J21009J33967J47090
$$ plain form
61600 700305 694123 688735 683969 679121 674096 669796 667040 665608 664782 664368 664663 665748 667411 669641 672634
61585 672634 676348 680443 684769 689639 695608 703054 711853 721319 730694 739925 749817 761191 774174 788564
61571 788564 804561 822634 842795 864483 887164 910723 935272 960907 987542 1014648 1041189
61560 1041189 1066284 1090016 1113252 1136573 1159655 1181721 1202274 1221288 1239086 1256229 1273237
61549 1273237 1290096 1306093 1320294 1332125 1341459 1348344 1352829 1354949 1354646 1351730 1346089 1337968 1327961
61536 1327961 1316637 1304231 1290713 1276161 1261011 1245989 1231929 1219641 1209727 1202310 1197036 1193635
61524 1193635 1192445 1194146 1199013 1206823 1217583 1231873 1250243 1272638 1298803 1329009 1364012 1404576
61512 1404576 1451508 1505960 1569082 1641212 1721885 1810873 1909001 2017845 2138854 2272821 2419911
61501B419911J60083J73072J86265J99191K10205K17006K17595K10708J95568
61492D189604J71860J40155J02175O0472J7728k3643o1576r4303j20534j39802
61482D242136j52491j59386j61198j58652j52798j44777j35221j24193j11917
61473B941503r9157q6681p4623o2710n0923l9580k8924j8888r319k47Q078J5385
61461B493914K1687K7406L3012L8414M3048M6645M9524N1935N3474N3584N2295
61450B964938N0084M7317M4427M2353M1919M2674M3114M2446M1488M1368M1882
61439C444010M1742M0167L7572L4769L2073K9254K5851K1453J6095J0514N636
61428C739136J517k738p837j3385j8467k2731k6371k9343l1239l1996l2115l2029
$$ plain form
61501 2419911 2579994 2753066 2939331 3138522 3348727 3565733 3783328 3994036 4189604
61492 4189604 4361464 4501619 4603794 4664266 4681994 4658351 4596775 4502472 4381938 4242136
61482 4242136 4089645 3930259 3769061 3610409 3457611 3312834 3177613 3053420 2941503
61473 2941503 2842346 2755665 2681042 2618332 2567409 2527829 2498905 2480017 2470698 2470451 2478529 2493914
61461 2493914 2515601 2543007 2576019 2614433 2657481 2704126 2753650 2805585 2859059 2912643 2964938
61450 2964938 3015022 3062339 3106766 3149119 3191038 3233712 3276826 3319272 3360760 3402128 3444010
61439 3444010 3485752 3525919 3563491 3598260 3630333 3659587 3685438 3706891 3722986 3733500 3739136
61428 3739136 3740653 3737915 3730078 3716693 3698226 3675495 3649124 3619781 3588542 3556546 3524431 3492402
61416C492402l1648l0658k8825k5902k1803j7167j3212j0599q833p190n824n399
61404C285342n995p233r186j2312j6229j9481k0976k1104k0897k0428j8622j4496
61392C098383q109l32Q058J7003K7149L9218N3173O8046Q2751R7110J11974J28282
61380C722706J46072J64381J81987J98150K12640K25088K34392K38724K36126
61371E560266K25134K05161J76618J40815R9716N5743J1628k9980o7314r9955
61361F277832j28335j52752j73036j89037k01042k09490k14597k16459k15341
61352D577743k11668k05742j97734j87918j76818j65019j52832j40274j27478
61343C012260j14961j03221r2074q0813o9183n7831m7436l7791k8283j8937j0336
$$ plain form
61416 3492402 3460754 3430096 3401271 3375369 3353566 3336399 3323187 3312588 3303755 3296565 3290741 3285342
61404 3285342 3279347 3272114 3262928 3250616 3234387 3214906 3193930 3172826 3151929 3131501 3112879 3098383
61392 3098383 3090274 3089942 3098000 3115003 3142152 3181370 3234543 3302589 3385340 3482450 3594424 3722706
61380 3722706 3868778 4033159 4215146 4413296 4625936 4851024 5085416 5324140 5560266
61371 5560266 5785400 5990561 6167179 6307994 6407710 6463453 6475081 6445101 6377787 6277832
61361 6277832 6149497 5996745 5823709 5634672 5433630 5224140 5009543 4793084 4577743
61352 4577743 4366075 4160333 3962599 3774681 3597863 3432844 3280012 3139738 3012260
61343 3012260 2897299 2794078 2702004 2621191 2552008 2494177 2446741 2408950 2380667 2361730 2351394
61332B351394k621M655J1675J8085K3779K9217L4625L9433M2915M4940M5769M5621
61320B689487M4803M3739M2474M0540L7824L5003L2626L0285K7380K4194K1353
61309C069708J8662J5443J1864Q734N942K315k665q055j2912j7500k2296k6779
61297C042461l0154l2718l5389l8243m0626m2463m4350m6217m7091m6516m5223
61286B593471m3857m1942l8778l4684l0519k6470k2260j8226j5236j3505j2320
61275B295674j1109j0096r803j0483j2171j4594j6816j7667j6921j5541j4345
61264B146128j3053j1035q421n815l369p83K046N174R180J4792K1934K9799L7936
61251B224513M6659N6279O6504P6752Q6433R4851J01342J05777J08295J08199
$$ plain form
61332 2351394 2348773 2353428 2365103 2383188 2406967 2436184 2470809 2510242 2553157 2598097 2643866 2689487
61320 2689487 2734290 2778029 2820503 2861043 2898867 2933870 2966496 2996781 3024161 3048355 3069708
61309 3069708 3088370 3103813 3115677 3124411 3130353 3132668 3130003 3121948 3109036 3091536 3069240 3042461
61297 3042461 3012307 2979589 2944200 2905957 2865331 2822868 2778518 2732301 2685210 2638694 2593471
61286 2593471 2549614 2507672 2468894 2434210 2403691 2377221 2354961 2336735 2321499 2307994 2295674
61275 2295674 2284565 2274469 2264666 2254183 2242012 2227418 2210602 2192935 2176014 2160473 2146128
61264 2146128 2133075 2122040 2113619 2107804 2104435 2103652 2105698 2110872 2120052 2134844 2156778 2186577 2224513
61251 2224513 2271172 2327451 2393955 2470707 2557140 2651991 2753333 2859110 2967405 3075604
61241C075604J03663R3051P6238N4350K8581o5l0097n9286q5339j06633j22348
61230C027719j32223j36541j36198j32535j26796j19590j11003j01290r1284q1891
61220A858368p3360o5423n8031n1486m5844m0756l6114l2259k9206k6114k2088
61209A377687j7283j2718r098o223l490n77K481N549Q556J1467J4156J6221J7117
61196A403845J6601J5000J2846J0331P365M106J143r70k254l282m657o525q533
61183A445016j0253j1662j3119j4859j6615j7853j8423j8766j9412k0305k0826
61172A262923k0631k0302k0794k2244k3711k4350k4400k4558k4835k4693k4164
61161A008241k3904k4018k3654k2195k0241j8785j7919j6987j5713j4537j3904
$$ plain form
61241 3075604 3179267 3272318 3348556 3402906 3431487 3431422 3401325 3342039 3256700 3150067 3027719
61230 3027719 2895496 2758955 2622757 2490222 2363426 2243836 2132833 2031543 1940259 1858368
61220 1858368 1785008 1719585 1661554 1610068 1564224 1523468 1487354 1455095 1425889 1399775 1377687
61209 1377687 1360404 1347686 1338588 1332365 1328875 1328298 1330779 1336328 1344884 1356351 1370507 1386728 1403845
61196 1403845 1420446 1435446 1448292 1458623 1465988 1470094 1471237 1470267 1468013 1464731 1460074 1453549 1445016
61183 1445016 1434763 1423101 1409982 1395123 1378508 1360655 1342232 1323466 1304054 1283749 1262923
61172 1262923 1242292 1221990 1201196 1178952 1155241 1130891 1106491 1081933 1057098 1032405 1008241
61161 1008241 984337 960319 936665 914470 894229 875444 857525 840538 824825 810288 796384
61150G96384j3909j4604j6098j8059j9580j9848j8877j7373j5963j4674j3122
61139F14277j1134r030p301o093n171m311l418k293o96J265L073M388N370O296
61125E85222P110P713Q308R113R927J0390J0510J0571J0698J0837J1082J1562
61113G03043J2076J2265J2080J1682J0950R558P653N883M582L300J414j059l560
61100G89867n594p024p927q462q820r038q885q172p122o284n988o063o135o094
61086F88259o122o274o261n831n273n212n771o217n706m362l283l424m601n723
61072F14199n923n341m795m791n006m802m083l353k952k612j935r94j53M50R33
61057E68842J319J564J815K237K632K662K451K519L044L698M286M985N676N774
$$ plain form
61150 796384 782475 767871 751773 733714 714134 694286 675409 658036 642073 627399 614277
61139 614277 603143 594113 586812 580719 575548 571237 567819 565526 564830 566095 569168 573556 578926 585222
61125 585222 592332 600045 608353 617466 627393 637783 648293 658864 669562 680399 691481 703043
61113 703043 715119 727384 739464 751146 762096 771654 779307 785190 789772 793072 794486 793427 789867
61100 789867 784273 777249 769322 760860 752040 743002 734117 725945 718823 712539 706551 700488 694353 688259
61086 688259 682137 675863 669602 663771 658498 653286 647515 641298 635592 631230 627947 624523 619922 614199
61072 614199 608276 602935 598140 593349 588343 583541 579458 576105 573153 570541 568606 567612 567459 567909 568842
61057 568842 570161 571725 573540 575777 578409 581071 583522 586041 589085 592783 597069 602054 607730 613504
61043F13504N152M769N615P342Q680R058R017R079R097Q989R233J0178J1411J2385
61029G33509J3187J4140J5097J5725J6246J7158J8459J9728K0874K2119K3356
61018I29598K4175K4627K5352K6849K9088L1851L4884L7770M0210M2476M4980
61007A291860M7462M9348N0949N3451N7688O3818P2236Q3584R7502J12598J28201
60996B108697J45054J63849J84560K07993K36437K71672L13938L64235M25906
60987D422341N02311N95157P07535Q46192J017280J223016J468057J762619K098643
60978A4643151K407983K555324K404137J917872J206490M71930r7795l97986m10093
60969B4701013j81701J74573M83549N57745K89818k81971r94313j649456k105922
$$ plain form
61043 613504 618656 623425 629040 636382 645062 654120 663137 672216 681313 690302 699535 709713 721124 733509
61029 733509 746696 760836 775933 791658 807904 825062 843521 863249 884123 906242 929598
61018 929598 953773 978400 1003752 1030601 1059689 1091540 1126424 1164194 1204404 1246880 1291860
61007 1291860 1339322 1388670 1439619 1493070 1550758 1614576 1686812 1770396 1867898 1980496 2108697
60996 2108697 2253751 2417600 2602160 2810153 3046590 3318262 3632200 3996435 4422341
60987 4422341 4924652 5519809 6227344 7073536 8090816 9313832 10781889 12544508 14643151
60978 14643151 17051134 19606458 22010595 23928467 25134957 25606887 25509092 25111106 24701013
60969 24701013 24519312 24693885 25177434 25735179 26024997 25743026 24748713 23099257 20993335
60960B0993335k316225k311382k161638j939030j694804j455791j233831j035277
60952F845357q63134p16249n91502m86986m01806l34127k81266k40784k09891
60943B719612j84807j62630j43251j27798j15784j05339r5503q6522p8264p0277
60933A549437o3154n8158n5400n3837n2885n2524n1989n0118m7198m4788m3357
60922I76029m1578l8473l4790l1661k9081k6504k3960k1799k0075j8717j7679
60911F71712j6563j4807j2686j1318j1180j1310j0536q908p389o596o330o065
60899E48024n471m677m169m177m174l438k056q20r0N95J607K630L236L545L999
60884E34564M760N558N899N419M291L205K561J949Q59l59r80j109j619k857m217
$$ plain form
60960 20993335 18677110 16365728 14204090 12265060 10570256 9114465 7880634 6845357
60952 6845357 5982223 5265974 4674472 4187486 3785680 3451553 3170287 2929503 2719612
60943 2719612 2534805 2372175 2228924 2101126 1985342 1880003 1784500 1697978 1619714 1549437
60933 1549437 1486283 1428125 1372725 1318888 1266003 1213479 1161490 1111372 1064174 1019386 976029
60922 976029 934451 895978 861188 829527 800446 773942 749982 728183 708108 689391 671712
60911 671712 655149 640342 627656 616338 605158 593848 583312 574404 567015 560419 554089 548024
60899 548024 542553 537876 533707 529530 525356 521918 519862 519042 518952 519547 521154 523784 527020 530565 534564
60884 534564 539324 544882 550781 556200 560491 563696 566257 568206 569065 568706 567726 566617 564998 562141 557924
60869E57924n042n303n291n218n181n013m344l267k620k848l076k250q40j19r
60854E07503Q83K963M896N597N638O169P518R498J1902J4092J5120J4896J4350
60841F21025J3925J2931J1069R424R021R364R342Q788Q078P006N175L055J566
60828G29769Q77M95K12J56J69rj88n1K13J83q9l00m81q21j182j439k013l304m924
60809G17273o059o576p059p881q729r137q985q489p921p420o921o379n964n716
60795F14037n144l786k130j179r86n37O46J821K444L182M691O294O908O609O349
60780F39219O610P283Q321R561J0319J0179R826J0130J0834J1057J0707J0332
60768G54378R868Q872P792P686Q486Q778P662N877M626M130L792L207K429J637
$$ plain form
60869 557924 552882 547579 542288 537070 531889 526876 522532 519265 516645 513797 510721 508471 507631 507512 507503
60854 507503 508386 511349 516245 521842 527480 533649 541167 550665 562567 576659 591779 606675 621025
60841 621025 634950 647881 658950 668374 677395 686759 696101 704889 712967 719973 725148 728203 729769
60828 729769 730646 731141 731353 731509 731678 731669 731481 731430 731643 731826 731737 731437 730956 730135 728953 727514 725501 722197 717273
60809 717273 711214 704638 697579 689698 680969 671832 662847 654358 646437 639017 632096 625717 619753 614037
60795 614037 608893 605107 602977 601798 600812 600275 600921 602742 605186 608368 613059 619353 626261 632870 639219
60780 639219 645829 653112 661433 670994 681313 691492 701318 711448 722282 733339 744046 754378
60768 754378 764246 773118 780910 788596 797082 805860 813522 819399 824025 828155 831947 835154 837583 839220
60754H39220R77N03J26k78o97j095j529j854j609o69K34K07p54j941k952l853
60738H24036m551m791m748m953n513o005o204o327o489o479o175n679n020m144
60724G46958l220k517k022j584j315j288j083k64Q33J446J428J221R74M69j57
60709G39879n61j047k298m044n062m816m177m028m067l601k743k083j685j228
60695F98439p18m24l76n23j066k100l153l756m240n300o852q011q364q559r312
60680F35685j0363j0922j0847j0698j0632j0008q443o690n748n469m818l529k455
60667E35063k117j835r03K94J132J983L533N369O351O240N879N820N774N519N265
60652E83367N020M552M156M510N451N952N594N114N011M713L748K747K401K289
$$ plain form
60754 839220 840197 840700 840826 840548 839851 838756 837227 835373 833764 833095 833329 833536 832782 830841 827889 824036
60738 824036 819485 814694 809946 804993 799480 793475 787271 780944 774455 767976 761801 756122 751102 746958
60724 746958 743738 741221 739199 737615 736300 735012 733929 733665 734498 735944 737372 738593 739567 740036 739879
60709 739879 739318 738271 735973 731929 726867 722051 717874 713846 709779 706178 703435 701352 699667 698439
60695 698439 697721 697297 696921 696398 695332 693232 690079 686323 682083 676783 669931 661920 653556 644997 635685
60680 635685 625322 614400 603553 592855 582223 572215 563772 557082 551334 545865 541047 537518 535063
60667 535063 532946 531111 530208 530502 531634 533617 537150 542519 548870 555110 560989 566809 572583 578102 583367
60652 583367 588387 592939 597095 601605 607056 613008 618602 623716 628727 633440 637188 639935 642336 644625
60638F44625J708J040J178K077K979L805N155O988Q357Q727Q683R060R986J1092
60624G25460J2059J2646J2711J2482J2470J2761J2757J1868J0268Q618P318O258
60612H57676N168L906K539J317M98P1k94q89j720k779m320o506q957j1035j2617
60597H22058j4099j5565j6448j6282j5340j4066j2295r745o972n013l973k817
60585F89443r15J007J966K146K488L228L706L456K750K041J530J413J926K825
60571G19010L331K974K216K016K837M302N551N822M969L686L050L541M494M752
60557G72551L842K326R93l5j094k085k315j451q6J119K444M452O608P704P874
60542H02847R081J2844J8315K3487K7619L1477L5598L9458M2212M3161M1433L6309
$$ plain form
60638 644625 646333 647373 648551 650628 653607 657412 662567 669555 677912 686639 695322 704382 714368 725460
60624 725460 737519 750165 762876 775358 787828 800589 813346 825214 835482 844100 851418 857676
60612 857676 862844 866750 869289 870606 871104 871175 870881 869992 868272 865493 861173 854667 845710 834675 822058
60597 822058 807959 792394 775946 759664 744324 730258 717963 708218 701246 696233 692260 689443
60585 689443 688528 689535 691501 693647 696135 699363 703069 706525 709275 711316 712846 714259 716185 719010
60571 719010 722341 725315 727531 729547 732384 736686 742237 748059 753028 756714 759764 763305 767799 772551
60557 772551 776393 778719 779712 779677 778583 776498 774183 772732 772646 773765 776209 780661 787269 794973 802847
60542 802847 811928 824772 843087 866574 894193 925670 961268 1000726 1042938 1086099 1127532 1163841
60530A163841K8135J8217P531l756j5196k5343l2598l6327l6758l4358k9761k3946
60518I79681j7881j2088o764k164J415L855N314O201P019Q015Q948R565J0253
60505A001369J1793J4449J7725K1206K5176L0224L6588M4084N2401O1311P0763
60494A387089Q0841R1436J02017J12106J21881J31938J42627J54287J68110J86039
60484B678371K09431K38290K71792L08401L44566L73603L86879L76709L38769
60475E526811K72833J82425P4187m2601j56742k56732l33577l83257m06875m08597
60465D067875l93595l67224l34535k99401k64268k30934k01004j75171j52706
60456A649037j32482j14310r8712q5761p4825o5426n7507n0787m4540l8330l2570
$$ plain form
60530 1163841 1191976 1210193 1217724 1213968 1198772 1173429 1140831 1104504 1067746 1033388 1003627 979681
60518 979681 961800 949712 942948 940784 942199 946054 951368 957569 964588 972603 981551 991116 1001369
60505 1001369 1013162 1027611 1045336 1066542 1091718 1121942 1158530 1202614 1255015 1316326 1387089
60494 1387089 1467930 1559366 1661383 1773489 1895370 2027308 2169935 2324222 2492332 2678371
60484 2678371 2887802 3126092 3397884 3706285 4050851 4424454 4811333 5188042 5526811
60475 5526811 5799644 5982069 6056256 6013655 5856913 5600181 5266604 4883347 4476472 4067875
60465 4067875 3674280 3307056 2972521 2673120 2408852 2177918 1976914 1801743 1649037
60456 1649037 1516555 1402245 1303533 1217772 1142947 1077521 1020014 969227 924687 886357 853787
60445H53787k7927k4401k1361j8439j6048j4763j4413j4148j3388j2442j1853
60434F64604j1494j0724r412q281q040q489q743q180o998n918n407n185m583l450
60420E59700k421k084k163j925j192m05K19R78K014K897L120K636J818J116Q71
60405E65179J158J758K482L383M351M877M724M547N091N955O100N544N456O337
60391F26942P188O941N824M692L873L373L392L784L600K133J09j095j201j221
60377F68334k005l299m277m408l731k765k182k192k298j915j111l69J80Q08J503
60362F40273J763J302O14N70J488K780L589L704L689M077M819N689O775Q033Q745
60347F97910Q296P318P093P721P946P052N826N091M370K917J164N8n13j465k891
$$ plain form
60445 853787 825860 801459 780098 761659 745611 730848 716435 702287 688899 676457 664604
60434 664604 653110 642386 632974 624693 616653 608164 599421 591241 584243 578325 572918 567733 563150 559700
60420 559700 557279 555195 553032 551107 549915 549510 549729 550707 552721 555618 558738 561374 563192 564308 565179
60405 565179 566337 568095 570577 573960 578311 583188 587912 592459 597550 603505 609605 615149 620605 626942
60391 626942 634130 641071 646895 651587 655460 658833 662225 666009 669609 671742 671851 670756 669555 668334
60377 668334 666329 663030 658753 654345 650614 647849 645667 643475 641177 639262 638151 637782 637962 638770 640273
60362 640273 642036 643338 643952 644522 646010 648790 652379 656083 659772 663849 668668 674357 681132 689165 697910
60347 697910 706206 713524 720617 728338 736284 743336 749162 754253 758623 761540 762704 762762 762249 760784 757893
60332G57893l753l180j347R59K999M337N015N505O026O087N124L359J459l87k387
60317G87709m388n988p266q595r681r632q231o360m913l930l068k344j890j474
60303G09949q61l38l77q49j060p00k71l31o17l88M56J025N11q11j991k495k423
60286F98429j900r55QM03L79Q19K183L861N047N691O192O681P070P272P035O045
60270G54260M674M019M617N615N891N479N218N476O064P058Q671J0495J1793J2607
60256H51937J3765J5644J7650J9153K0365K1999K4426K7448L0699L4129L8057
60245A115272M2670M7501N1838N5787O0315O5945P1982P7607Q3046Q8964R5148
60234A856075J00742J05362J09010J11102J10639J07411J02161R5466Q7229P7285
$$ plain form
60332 757893 754140 750960 749613 750572 753571 757908 762923 768428 774454 780541 785665 789024 790483 790096 787709
60317 787709 783321 777333 770067 761472 751791 742159 733928 727568 722655 718725 715657 713313 711423 709949
60303 709949 709088 708750 708373 707524 706464 705764 705493 705162 704545 704157 704613 705638 706149 705338 703347 700852 698429
60286 698429 696529 695574 695582 695985 696364 697183 699366 703227 708274 713965 720157 726838 733908 741180 748215 754260
60270 754260 758934 762953 767570 773185 779076 784555 789773 795249 801313 808371 817042 827537 839330 851937
60256 851937 865702 881346 898996 918149 938514 960513 984939 1012387 1043086 1077215 1115272
60245 1115272 1157942 1205443 1257281 1313068 1373383 1439328 1511310 1588917 1671963 1760927 1856075
60234 1856075 1956817 2062179 2171189 2282291 2392930 2500341 2602502 2697968 2785197 2862482
60224B862482O5812N2964L8945K4492J0589k410j4593k5449l3883l9536m3256
60213B896157m5771m6695m5209m1194l5205k7865j9707j1110k002Q082J9276L1073
60201B679830M2960N4966O7207P9259R0359R9877J07328J12276J14495J14085
60191C562642J11045J05003R5545Q2718O7064M9481L1090J2910m701k2014l9142
60180D051641n5429o9794q1406q9824r4733r5927r3502q7913p9787o9612n7578
60169C176136m3768k8706j3544O41J3756K6559L9551N2264O3621P2624P8572Q1032
60157C518738P9894P5376O7791N7429M4844L1096J7490M906o556j7205k6895l4628
60145C812280l9242m0401l8625l4292k7097j6744l752J0790K6014M1608N7716
$$ plain form
60224 2862482 2928294 2981258 3020203 3044695 3055284 3052874 3038281 3012832 2978949 2939413 2896157
60213 2896157 2850386 2803691 2758482 2717288 2682083 2654218 2634511 2623401 2621399 2629481 2648757 2679830
60201 2679830 2722790 2777756 2844963 2924222 3014581 3114458 3221786 3334062 3448557 3562642
60191 3562642 3673687 3778690 3874235 3956953 4024017 4073498 4104588 4117498 4112797 4090783 4051641
60180 4051641 3996212 3926418 3845012 3755188 3660455 3564528 3471026 3383113 3303326 3233714 3176136
60169 3176136 3132368 3103662 3090118 3090759 3104515 3131074 3170625 3222889 3286510 3359134 3437706 3518738
60157 3518738 3598632 3674008 3741799 3799228 3844072 3875168 3892658 3897564 3891008 3873803 3846908 3812280
60145 3812280 3773038 3732637 3694012 3659720 3632623 3615879 3612127 3622917 3648931 3690539 3748255
60134C748255P4782R3180J12665J32533J52701J73973J96785K20220K42925K64464
60124E412483K84944L03777L19800L32343L41132L45300L43582L35517L21427
60115H340305L01155K74004K40201K01346J58852J12947O3773J2556l9107r0333
60105I575699j40441j87772k29970k65251k92774l11922l22051l23042l15611
60096G186865l00922k80164k54612k25669j94561j62065j28741r5391o3123l2678
60086E448939l974K3235M8208O9238Q5110R6035J02676J04756J01352R2295P8522
60075F246392O1166M1084J9315k737k3917m3641o1603p7686r2255j05978j19123
60064E841017j31393j42385j51774j58944j63085j63820j61379j56060j47936
$$ plain form
60134 3748255 3823037 3916217 4028882 4161415 4314116 4488089 4684874 4905094 5148019 5412483
60124 5412483 5697427 6001204 6321004 6653347 6994479 7339779 7683361 8018878 8340305
60115 8340305 8641460 8915464 9155665 9357011 9515863 9628810 9692583 9705139 9666032 9575699
60105 9575699 9435258 9247486 9017516 8752265 8459491 8147569 7825518 7502476 7186865
60096 7186865 6885943 6605779 6351167 6125498 5930937 5768872 5640131 5544740 5481617 5448939
60086 5448939 5444965 5468200 5516408 5585646 5670756 5766791 5869467 5974223 6075575 6167870 6246392
60075 6246392 6307558 6348642 6367957 6365220 6341303 6297662 6236059 6158373 6066118 5960140 5841017
60064 5841017 5709624 5567239 5415465 5256521 5093436 4929616 4768237 4612177 4464241
60055D464241j37145j24086j09262r3244p6692n9985m2942k5413p891R055K5752
60044C822388M2941O0353P6672R0992J03420J14006J21908J26082J26018J21488
60034D806268J12258R8585Q1531O2260M1326J8929m494k8257n1655p3955r4348
60023D968448j12042j26257j36269j41773j43072j40574j34441j25120j13742
60014C795158j01232q7435p2017n5769l9884k4285q076Q467K3955L8209N2880
60003C529971O9235Q6713J04224J21496J38218J53138J65053J73667J78628J78663
59993D899006J72811J61593J45974J25995J01547P3730M4304J4303j5778m5016
59983E678469p2451r7878j21086j40613j54390j61537j62558j58118j48699j35348
$$ plain form
60055 4464241 4327096 4203010 4093748 4000504 3923812 3863827 3820885 3795472 3787581 3796636 3822388
60044 3822388 3865329 3925682 4002354 4093346 4196766 4310772 4432680 4558762 4684780 4806268
60034 4806268 4918526 5017111 5098642 5160902 5202228 5221157 5216663 5188406 5136751 5062796 4968448
60023 4968448 4856406 4730149 4593880 4452107 4309035 4168461 4034020 3908900 3795158
60014 3795158 3693926 3606491 3534474 3478705 3438821 3414536 3406460 3414927 3438882 3477091 3529971
60003 3529971 3599206 3685919 3790143 3911639 4049857 4202995 4368048 4541715 4720343 4899006
59993 4899006 5071817 5233410 5379384 5505379 5606926 5680656 5724960 5739263 5723485 5678469
59983 5678469 5606018 5508140 5387054 5246441 5092051 4930514 4767956 4609838 4461139 4325791
59973D325791j19561j02226q3418o3346m2816k2725l640J4137L0639M6298O1334
59962D040467P5160Q6815R5871J02521J07011J09338J09299J06378J00118R1066
59952E024044Q0861P0710O0260M8746L6740K5761J6571R011L376P67J819O100
59940E384766J3201K3676L8423N7635Q0689J06715J34986J65035J96670K29687
59930F431483K63399K96439L27038L53402L74019L87539L92135L85005L63063
59921I573522L24698K70705K03524J26153M2169m3911j27136k03062k68127l19746
59911I578789l56662l79014l87729l84179l70561l49741l23974k94247k61431
59902F471251k27335j93656j60542j27265r4024o1971l1576k172K6704N4473Q0325
$$ plain form
59973 4325791 4206230 4104004 4020586 3957240 3914424 3891699 3888059 3902196 3932835 3979133 4040467
59962 4040467 4115627 4202442 4298313 4400834 4507845 4617183 4726482 4832860 4932978 5024044
59952 5024044 5104905 5175615 5235875 5284621 5321361 5347122 5363693 5372704 5376080 5376847 5378666 5384766
59940 5384766 5397967 5421643 5460066 5517701 5598390 5705105 5840091 6005126 6201796 6431483
59930 6431483 6694882 6991321 7318359 7671761 8045780 8433319 8825454 9210459 9573522
59921 9573522 9898220 10168925 10372449 10498602 10540771 10496860 10369724 10166662 9898535 9578789
59911 9578789 9222127 8843113 8455384 8071205 7700644 7350903 7026929 6732682 6471251
59902 6471251 6243916 6050260 5889718 5762453 5668429 5606458 5574882 5572710 5599414 5653887 5734212
59891E734212J04066J25690J44550J59280J68423J70983J66494J54552J34315
59882G062565J05025O7278K3445k3596p1622j18676j62215j99584k29196k50739
59872F202685k64529k71199k71621k66485k56185k41597k24424k06125j87046
59863D013474j67319j47913j29876j13034r6623q0919o7048n5526m6110l8990
59853C070116l4824l3434l3515l3854l4003l3753l2871l1448k9619k6922k2833
59842B723040j7933j3620j0643q922q715j0699j4696j9512k4308k9067l3356l5925
59830B495644l6187l5032l3488l1561k9099k6797k5305k4028k1745j8146j3845
59819B200411r237m133J458O850J1213J4331J6837J9733K3557K8056L2862L8181
$$ plain form
59891 5734212 5838278 5963968 6108518 6267798 6436221 6607204 6773698 6928250 7062565
59882 7062565 7167590 7234868 7258313 7234717 7163095 7044419 6882204 6682620 6453424 6202685
59872 6202685 5938156 5666957 5395336 5128851 4872666 4631069 4406645 4200520 4013474
59863 4013474 3846155 3698242 3568366 3455332 3358709 3277790 3210742 3155216 3109106 3070116
59853 3070116 3035292 3001858 2968343 2934489 2900486 2866733 2833862 2802414 2772795 2745873 2723040
59842 2723040 2705107 2691487 2680844 2671922 2663207 2652508 2637812 2618300 2593992 2564925 2531569 2495644
59830 2495644 2459457 2424425 2390937 2359376 2330277 2303480 2278175 2254147 2232402 2214256 2200411
59819 2200411 2191174 2187041 2188499 2195349 2206562 2220893 2237730 2257463 2281020 2309076 2341938 2380119
59807B380119M4221N0107N4219N5841N5633N4174N0943M5355L8146L0823K4004
59796B883585J7213J0296M336P77QJ217L661P610J3740K1886L1107M1102N2734
59783C089272O6615Q1964R7701J14168J32759J54136J77860K03591K31479K61318
59773D610863K92257L23200L51954L73378L79529L62732L18620K47200J53117
59764G412850M5974o1201j56077k30673k81710l09132l15476l05728k85730k59884
59754E253213k30551j99363j68234j38989j12549q8772o6997m6725k7971j0873
59744D162189M998K0553L6320N2031O7273Q2201R7278J12733J28611J45157J62751
59733E072095J81604K01742K23181K45915K69977K95606L23261L53314L85816
$$ plain form
59807 2380119 2424340 2474447 2528666 2584507 2640140 2694314 2745257 2790612 2828758 2859581 2883585
59796 2883585 2900798 2911094 2915430 2916207 2916215 2917432 2921093 2928703 2942443 2964329 2995436 3036538 3089272
59783 3089272 3155887 3237851 3335552 3449720 3582479 3736615 3914475 4118066 4349545 4610863
59773 4610863 4903120 5226320 5578274 5951652 6331181 6693913 7012533 7259733 7412850
59764 7412850 7458824 7397623 7241546 7010873 6729163 6420031 6104555 5798827 5513097 5253213
59754 5253213 5022662 4823299 4655065 4516076 4403527 4314755 4247758 4201033 4173062 4162189
59744 4162189 4167187 4187740 4224060 4276091 4343364 4425565 4522843 4635576 4764187 4909344 5072095
59733 5072095 5253699 5455441 5678622 5924537 6194514 6490120 6813381 7166695 7552511
59724G552511M20492M56656M93195N28935N62951N94021O19829O37277O43826
59715A2509693O38338O20939N92917N57004N17144M77564M42242M14945L98739
59706A7169525L94722M01565M16457M36060M56511M73338M82119M79230M62052
59697B1171579M29015L79945L16185K40379J56492O9793j4081r0469j55940k07475
59687B2295423k42407k59469k59122k42658k11598j68109j14822n3565J5027R0191
59677B0848891J70139K53123L38575M26342N15187O02738O86255P62476Q26829
59668B5430555Q73526Q96313Q88772Q44516P58343O28029M55586K47683J5562
59659C1038885k26001m60855o73881q52791r89447j080628j127421j133559j104452
$$ plain form
59724 7552511 7973003 8429659 8922854 9451789 10014740 10608761 11228590 11865867 12509693
59715 12509693 13148031 13768970 14361887 14918891 15436035 15913599 16355841 16770786 17169525
59706 17169525 17564247 17965812 18382269 18818329 19274840 19748178 20230297 20709527 21171579
59697 21171579 21600594 21980539 22296724 22537103 22693595 22763388 22749307 22658838 22502898 22295423
59687 22295423 22053016 21793547 21534425 21291767 21080169 20912060 20797238 20743673 20758700 20848891
59677 20848891 21019030 21272153 21610728 22037070 22552257 23154995 23841250 24603726 25430555
59668 25430555 26304081 27200394 28089166 28933682 29692025 30320054 30775640 31023323 31038885
59659 31038885 30812884 30352029 29678148 28825357 27835910 26755282 25627861 24494302 23389850
59650B3389850j047456r71482q85269p96361p12403o42520n96026n79160n92591
59641A6566582o30794o82823p34961p75090p96256p96781p78102p43395o97432
59632I930948o45613n91996n38526m86284m36683l91155l50204l13344k79840
59623E897303k49323k21776j97140j75028j54947j36787j20721j06509r3291q0508
59613D361273o8667n8711n0942m5031m0877l8869l9266m1786m5920n1280n7557
59602C822367o4342p0999p6762q1048q3749q4933q4259q1224p6174p0452o5072
59591B983353n9709n3553m6628l9649l2926k6268j9770j3872q571l348K016P056
59579B688131J1253J4579J7299J9625K1743K3801K5678K7039K7751K8134K8690
$$ plain form
59650 23389850 22342394 21370912 20485643 19689282 18976879 18334359 17738333 17159173 16566582
59641 16566582 15935788 15252965 14518004 13742914 12946658 12149877 11371775 10628380 9930948
59632 9930948 9285335 8693339 8154813 7668529 7231846 6840691 6490487 6177143 5897303
59623 5897303 5647980 5426204 5229064 5054036 4899089 4762302 4641581 4535072 4441781 4361273
59613 4361273 4292606 4233895 4182953 4137922 4097045 4058176 4018910 3977124 3931204 3879924 3822367
59602 3822367 3758025 3687026 3610264 3529216 3445467 3360534 3276275 3195051 3118877 3048425 2983353
59591 2983353 2923644 2870091 2823463 2783814 2750888 2724620 2704850 2690978 2682407 2679059 2681075 2688131
59579 2688131 2699384 2713963 2731262 2750887 2772630 2796431 2822109 2849148 2876899 2905033 2933723
59568B933723K9725L1233L3019L5036L7710M1758M7505N4439O1684O8876P6391
59557C451099Q4850R4602J05581J17488J30192J43929J58909J74608J89822K03715
59547D854795K16450K28522K39708K49025K55453K58268K56952K51405K42298
59538G052876K30682K16971K00446J79912J54810J25902R5129O4864L7036J2738
59528H371366p576k3868l6371m5293n0349n0708m5540l4551j7964L714K9742N9137
59516H151739R0602J22304J51704J75851J91905J97386J90298J69734J36399R2064
59506I669986L8564k2157q7201j52834k15651k72924l21724l58945l82967l94610
59496G499537l95766l87708l71388l48599l21723k92531k62060k31535k02482
$$ plain form
59568 2933723 2963448 2994681 3027700 3062736 3100446 3142204 3189709 3244148 3305832 3374708 3451099
59557 3451099 3535949 3630551 3736132 3853620 3983812 4127741 4286650 4461258 4651080 4854795
59547 4854795 5071245 5299767 5539475 5788500 6043953 6302221 6559173 6810578 7052876
59538 7052876 7283558 7500529 7700975 7880887 8035697 8161599 8256728 8321592 8358628 8371366
59528 8371366 8363790 8339922 8303551 8258258 8207909 8157201 8111661 8077110 8059146 8062860 8092602 8151739
59516 8151739 8242341 8364645 8516349 8692200 8884105 9081491 9271789 9441523 9577922 9669986
59506 9669986 9708550 9686393 9599192 9446358 9230707 8957783 8636059 8277114 7894147 7499537
59496 7499537 7103771 6716063 6344675 5996076 5674353 5381822 5119762 4888227 4685745
59487D685745j75797j51253j28128j05973q4738o4474m5077k6275p990R439K5759
59476C931238M1581N8041P5473R2945J09558J25644J42117J59076J75589J90577
59466E101839K03303K13105K19148K20390K15617K03795J84651J58632J26102
59457F846582Q7120M2454n628n4091j00468j43153j80857k12345k36657k53272
59447E789685k62315k64792k62246k55810k45939k33158k18627k03574j88689
59438C654535j74263j60367j46589j32435j18467j06295r6693q8389p9498o9678
59428B481861n9997n1231m3283l6104l0075k5190k0601j5387r574m127R2L340
59416B189724O756J0958J5316J9149K2947K7217L0319K9203K2891J3987O127J165
$$ plain form
59487 4685745 4509948 4358695 4230567 4124594 4039856 3975382 3930305 3904030 3896040 3905479 3931238
59476 3931238 3972819 4030860 4106333 4199278 4308836 4434480 4576597 4735673 4911262 5101839
59466 5101839 5305142 5518247 5737395 5957785 6173402 6377197 6561848 6720480 6846582
59457 6846582 6933702 6976156 6970528 6916437 6815969 6672816 6491959 6279614 6042957 5789685
59447 5789685 5527370 5262578 5000332 4744522 4498583 4265425 4046798 3843224 3654535
59438 3654535 3480272 3319905 3173316 3040881 2922414 2816119 2719426 2631037 2551539 2481861
59428 2481861 2421864 2370633 2327350 2291246 2261171 2235981 2215380 2199993 2190419 2186292 2186384 2189724
59416 2189724 2196480 2207438 2222754 2241903 2264850 2292067 2322386 2351589 2374480 2388467 2394594 2395759
59404B395759n95J014N835J2877K1268L0943M1211M9653N3873N3874N1701M9461
59392B766874M8854N1648N8803O9342Q1410R4290J08388J23833J40427J58491
59382C702360J78525K00353K23808K49697K78707L09840L41517L73850M08240
59373F266897M44715M81106N14530N42247N61294N69117N64943N49459N23372
59364A1017680M87754M45526M00787L56350L13305K72855K36662K05007J76223
59355A3912149J48432J20406R0459N6176J5991l0095q1579j37730j96387k54180
59345A3643642l08671l59039m04195m41914m70722m91307n05051n12226n12515
59336I638002n06210m93955m76314m54322m29520m02725l73717l42836l11809
$$ plain form
59404 2395759 2395164 2396178 2402013 2414890 2436158 2467101 2508312 2557965 2611838 2665712 2717413 2766874
59392 2766874 2815728 2867376 2926179 2995521 3076931 3171221 3279609 3403442 3543869 3702360
59382 3702360 3880885 4081238 4305046 4554743 4833450 5143290 5484807 5858657 6266897
59373 6266897 6711612 7192718 7707248 8249495 8810789 9379906 9944849 10494308 11017680
59364 11017680 11505434 11950960 12351747 12708097 13021402 13294257 13530919 13735926 13912149
59355 13912149 14060581 14180987 14271446 14327622 14343613 14313518 14231939 14094209 13897822 13643642
59345 13643642 13334971 12975932 12571737 12129823 11659101 11167794 10662743 10150517 9638002
59336 9638002 9131792 8637837 8161523 7707201 7277681 6874956 6501239 6158403 5846594
59327E846594k82260k54398k27958k03368j80999j60195j40118j20974j03542
59318D172782q8038p4138o1468m9541l7829k6482j6269p401O90Q124J4333J9558
59306C854321K5161L1470L6656L9021L9208L8782L7665L4604K9551K3849J8350
59295D208638J2856P308K203k229o116r041j0007q527n018p7O116J3641K2609
59282D232356L3121M5030N7927P1626Q6022R9989J11014J16990J18178J16744
59272E088997J14531J11938J08422J03012R4414Q1694O5196M6230K5772M176j7845
59261E826537l8718n6895p1717q3118r0993r5255r6269r4838r1679q7169q1569
59250D938317p5413o9562o4839o1652n9903n9117n8612n7831n6769n5827n5024
$$ plain form
59327 5846594 5564334 5309936 5081978 4878610 4697611 4537416 4397298 4276324 4172782
59318 4172782 4084744 4010606 3949138 3899597 3861768 3835286 3819017 3811616 3812306 3820430 3834763 3854321
59306 3854321 3879482 3910952 3947608 3986629 4025837 4064619 4102284 4136888 4166439 4190288 4208638
59295 4208638 4221494 4228802 4231005 4228776 4222660 4213619 4203612 4195085 4190067 4189990 4196106 4209747 4232356
59282 4232356 4265477 4310507 4368434 4440060 4526082 4626071 4737085 4854075 4972253 5088997
59272 5088997 5203528 5315466 5423888 5526900 5621314 5703008 5768204 5814434 5840206 5844382 5826537
59261 5826537 5787819 5730924 5659207 5576089 5485096 5389841 5293572 5198734 5107055 5019886 4938317
59250 4938317 4862904 4793342 4728503 4666851 4606948 4547831 4489219 4431388 4374619 4318792 4263768
59239D263768n3601n0800m6683m1731l5882k8594j9665r313K472J5953L1129M7849
59227D074902O6307Q6718J08626J31523J55969J83059K12648K43150K73201L02389
59217E838492L30026L54229L72577L82628L81551L66562L36481K92081K34565
59208H889192J64928Q5410K98q5680j68829k45680l12072l64518m01930m24959
59198G136160m34281m30756m16625l95172l69080l39947l09156k78355k48969
59189C913819k21830j97226j74965j54676j36357j20333j06498r4195q3184p3862
59179B550693o6098n8704n0868m3326l7195l2243k7264k1739j6131j0944o345
59168B179836k535N05L478P161J1330J4898J7274J9135K1812K6054L1289L6026
$$ plain form
59239 4263768 4210167 4159367 4112684 4070953 4035071 4006477 3986812 3977499 3979971 3995924 4027053 4074902
59227 4074902 4141209 4227927 4336553 4468076 4624045 4807104 5019752 5262902 5536103 5838492
59217 5838492 6168518 6522747 6895324 7277952 7659503 8026065 8362546 8654627 8889192
59208 8889192 9054120 9139530 9139828 9054148 8885319 8639639 8327567 7963049 7561119 7136160
59198 7136160 6701879 6271123 5854498 5459326 5090246 4750299 4441143 4162788 3913819
59189 3913819 3691989 3494763 3319798 3165122 3028765 2908432 2801934 2707739 2624555 2550693
59179 2550693 2484595 2425891 2375023 2331697 2294502 2262259 2234995 2213256 2197125 2186181 2179836
59168 2179836 2177301 2177806 2181284 2188445 2199775 2214673 2231947 2251082 2272894 2298948 2330237 2366263
59156B366263L9274M1596M4300M7667N0738N2928N4787N6847N8663N9553N9325
59145B931941N7778N4395M9230M3224L7004L0270K2959J5891R443K711m847j2031
59133C237968j7318k0833k3554k5356k5363k3635k1027j7661j2896o634O08Q618
59121C052917J7435K6486L5053M3411N2423O2089P1547Q0442Q9235R8106J06508
59110C735652J13950J20576J26931J33634J41010J48578J55366J61330J67783
59101E004810J75517J83224J88805J91602J91940J88986J80451J64468J40540
59092F610343J08891P0156K5826k1968p1153j19304j63101j99546k27778k48598
59082E763768k62370k68759k68434k63477k55610k45207k32494k18562k04565
$$ plain form
59156 2366263 2405537 2447133 2491433 2539100 2589838 2642766 2697553 2754400 2813063 2872616 2931941
59145 2931941 2989719 3044114 3093344 3136568 3173572 3203842 3226801 3242692 3252135 3254846 3249999 3237968
59133 3237968 3220650 3199817 3176263 3150907 3125544 3101909 3080882 3063221 3050325 3043691 3044299 3052917
59121 3052917 3070352 3096838 3131891 3175302 3227725 3289814 3361361 3441803 3531038 3629144 3735652
59110 3735652 3849602 3970178 4097109 4230743 4371753 4520331 4675697 4837027 5004810
59101 5004810 5180327 5363551 5552356 5743958 5935898 6124884 6305335 6469803 6610343
59092 6610343 6719234 6789390 6815216 6793248 6722095 6602791 6439690 6240144 6012366 5763768
59082 5763768 5501398 5232639 4964205 4700728 4445118 4199911 3967417 3748855 3544290
59073C544290j90759j77002j63590j51099j39701j29029j18550j08081r8170q9748
59063B178561q3031p7143p1253o5589o0689n6280n1842m7720m4494m1614l7992
59052A540914l3769l0221k7784k5564k2962k0629j9285j8645j8031j7245j6408
59041A290371j5484j4416j3339j2377j1521j0678r575p813n424l040j044J046
59029A186706L678O307Q125R273J0414J1524J2130J2326J2441J1978J0183P456
59017A302541N062L498K307J327R13R64R61J100K142M081O031P559R004J0387
59003A357877J1118J0970J0271Q984O681L557M62k158m406o067o732o779p012
58990A376766p310o894n903n244m806l441j041J001J936K724M166N522N900N758
$$ plain form
59073 3544290 3353531 3176529 3012939 2861840 2722139 2593110 2474560 2366479 2268309 2178561
59063 2178561 2095530 2018387 1947134 1881545 1820856 1764576 1712734 1665014 1620520 1578906 1540914
59052 1540914 1507145 1476924 1449140 1423576 1400614 1379985 1360700 1342055 1324024 1306779 1290371
59041 1290371 1274887 1260471 1247132 1234755 1223234 1212556 1202981 1195168 1189744 1186704 1185660 1186706
59029 1186706 1190384 1196691 1204816 1214089 1224503 1236027 1248157 1260483 1272924 1284902 1295085 1302541
59017 1302541 1307603 1311101 1313408 1314735 1315648 1316612 1317573 1318673 1320815 1324896 1330927 1338486 1347490 1357877
59003 1357877 1368995 1379965 1390236 1399220 1405901 1409458 1409920 1407762 1403356 1397289 1390557 1383778 1376766
58990 1376766 1369456 1362562 1356659 1351415 1346609 1343168 1342127 1343128 1345064 1347788 1351954 1357476 1363376 1369134
58976A369134N972O509P102Q332J0766J3617J5408J5705J5411J5532J6254J7180
58964A516922J7982J8788J9949K1266K1776K0831J9118J7884J7381J7069J7093
58953A726059J8349K0877K3442K5152K6460K8199L0464L2888L5240L7450L9700
58942B044280M2572M6360N0295N3409N6104N9691O4390O9180P3741P9114Q5941
58931B725077R3503J01078J08940J17446J26341J35757J46745J59965J74783J90346
58921D079981K06701K24268K43071K63130K84796L08190L33072L59617L88308
58912F691134M18813M50066M81735N14276N47141N78319O06145O29880O47762
58903A1565271O56113O51580O32773N98613N46629M74715L83706K76877J57995
$$ plain form
58976 1369134 1375106 1381615 1388717 1397049 1407815 1421432 1436840 1452545 1467956 1483488 1499742 1516922
58964 1516922 1534904 1553692 1573641 1594907 1616683 1637514 1656632 1674516 1691897 1708966 1726059
58953 1726059 1744408 1765285 1788727 1813879 1840339 1868538 1899002 1931890 1967130 2004580 2044280
58942 2044280 2086852 2133212 2183507 2236916 2293020 2352711 2417101 2486281 2560022 2639136 2725077
58931 2725077 2818580 2919658 3028598 3146044 3272385 3408142 3554887 3714852 3889635 4079981
58921 4079981 4286682 4510950 4754021 5017151 5301947 5610137 5943209 6302826 6691134
58912 6691134 7109947 7560013 8041748 8556024 9103165 9681484 10287629 10917509 11565271
58903 11565271 12221384 12872964 13505737 14104350 14650979 15125694 15509400 15786277 15944272
58894A5944272L1429r6667k19317l30938m27801n07094n67152o08444o33001o42773
58884A1942514o39304o24644o01469n72297n39276n04418m69236m34333m00045
58875G157492l67347l37470l10959k87586k66894k48283k31051k14864j99894
58866D693144j86100j72940j60232j48565j38311j28867j19486j10207j01298
58857C427138r2552q3904p6021o9441o3550n7279n0350m3250l6442l0223k4789
58846B799337j9794j4429q473k669K543P781J3571J9307K4269K8891L4027L9599
58834B923960M5024N0372N6091O2103O8163P4642Q2032R0098R8411J07268J17197
58823C775361J28041J39416J51608J65118J79782J95279K12021K30620K50995
$$ plain form
58894 15944272 15975701 15879034 15659717 15328779 14900978 14393884 13826732 13218288 12585287 11942514
58884 11942514 11303210 10678566 10077097 9504800 8965524 8461106 7991870 7557537 7157492
58875 7157492 6790145 6452675 6141716 5854130 5587236 5338953 5107902 4893038 4693144
58866 4693144 4507044 4334104 4173872 4025307 3886996 3758129 3638643 3528436 3427138
58857 3427138 3334586 3250682 3174661 3105220 3041670 2984391 2934041 2890791 2854349 2824126 2799337
58846 2799337 2779543 2765114 2756641 2753972 2756515 2764296 2777867 2797174 2821443 2850334 2884361 2923960
58834 2923960 2968984 3019356 3075447 3137550 3205713 3280355 3362387 3452485 3550896 3658164 3775361
58823 3775361 3903402 4042818 4194426 4359544 4539326 4734605 4946626 5177246 5428241
58814E428241K72966K97110L23950L52785L82569M13481M46328M80621N14531
58805H912582N46624N76229O02080O21770O32776O32866O19293N88735N38829
58796A4271784M69307L81509K77664J61077L6513r0234k13154l26718m26435n09256
58786A4032057n73480o18551o45221o55668o52895o39713o18274n90360n57794
58777H480101n22632m86976m52380m19417l88121l58882l32329l08415k86358
58768D924591k65671k46528k28869k12056j95858j80943j67764j55694j43917
58759C127291j32544j22147j12718j03789r5105q6660p8515p1028o4697n9338
58749B200750n4041m8439m3235l9015l5341l1690k8469k6326k5107k4256k3589
$$ plain form
58814 5428241 5701207 5998317 6322267 6675052 7057621 7471102 7917430 8398051 8912582
58805 8912582 9459206 10035435 10637515 11259285 11892061 12524927 13144220 13732955 14271784
58796 14271784 14741091 15122600 15400264 15561341 15597854 15507620 15294466 14967748 14541313 14032057
58786 14032057 13458577 12840026 12194805 11539137 10886242 10246529 9628255 9037895 8480101
58777 8480101 7957469 7470493 7018113 6598696 6210575 5851693 5519364 5210949 4924591
58768 4924591 4658920 4412392 4183523 3971467 3775609 3594666 3426902 3271208 3127291
58759 3127291 2994747 2872600 2759882 2656093 2560988 2474328 2395813 2324785 2260088 2200750
58749 2200750 2146709 2098270 2055035 2016020 1980679 1948989 1920520 1894194 1869087 1844831 1821242
58738A821242k3028k2255k1369k1120k1743k2312k2077k1609k1709k1921k1267
58727A580832j9912j8962j8989j9709k0739k1825k2598k2993k3553k4709k6074
58716A340769k7040k7546k7678k7188k6088k5087k4660k4270k3267k1909k0741
58705A065295j9651j8327j7034j6106j5311j4469j4037j4213j4278j3649j2909
58694H95311j2834j3127j3065j2756j2713j2820j2617j2074j1301j0093q502p097
58682G56312n915m128j502Q21J943K553L605M817N655O583P966Q798Q068O459
58668H02035N172L961J992j71j237j212j145j382j618k124l372m825n636o036
58654G84402o642p099o791o212n987n274k926L72K936M570O318Q223R234R185
$$ plain form
58738 1821242 1798214 1775959 1754590 1733470 1711727 1689415 1667338 1645729 1624020 1602099 1580832
58727 1580832 1560920 1541958 1522969 1503260 1482521 1460696 1438098 1415105 1391552 1366843 1340769
58716 1340769 1313729 1286183 1258505 1231317 1205229 1180142 1155482 1131212 1107945 1086036 1065295
58705 1065295 1045644 1027317 1010283 994177 978866 964397 950360 936147 921869 908220 895311
58694 895311 882477 869350 856285 843529 830816 817996 805379 793305 782004 771911 763409 756312
58682 756312 750397 746269 744767 745588 747531 750084 753689 758506 764161 770744 778710 787508 795576 802035
58668 802035 807207 811168 813160 812989 811752 810540 809395 808013 806395 804271 800899 796074 790438 784402
58654 784402 777760 770661 763870 757658 751671 746397 743471 743843 746779 751349 757667 765890 775124 784309
58640G84309Q996R034R019R348J0817J3090J5053J6529J8188J9999K1414K2797
58628I58593K5005K7803L0300L2754L6182M0459M4601M8737N3908O0047O5983
58617A424372P1550P8034Q6344R6238J07243J18866J30144J40611J51400J63664
58607B568466J76171J86254J92723J95911J95104J88145J73662J51792J22735
58598D150963Q6771M5836L236l8413p7297j10957j37006j55355j67634j74448
58588C425696j75426j71777j66104j59359j50482j39486j28193j17436j06202
58579B111231r4414q4000p5939o8705o0890n3292m7084m1921l7240l3657l1598
58568A482491l0113k8330k6749k5869k4930k3085k0673j8321j5969j3657j2123
$$ plain form
58640 784309 793305 802339 811358 820706 831523 844613 859666 876195 894383 914382 935796 958593
58628 958593 983598 1011401 1041701 1074455 1110637 1151096 1195697 1244434 1298342 1358389 1424372
58617 1424372 1495922 1573956 1660300 1756538 1863781 1982647 2112791 2253402 2404802 2568466
58607 2568466 2744637 2930891 3123614 3319525 3514629 3702774 3876436 4028228 4150963
58598 4150963 4237734 4283570 4286806 4248393 4171096 4060139 3923133 3767778 3600144 3425696
58588 3425696 3250270 3078493 2912389 2753030 2602548 2463062 2334869 2217433 2111231
58579 2111231 2016817 1932817 1856878 1788173 1727283 1673991 1626907 1584986 1547746 1514089 1482491
58568 1482491 1452378 1424048 1397299 1371430 1346500 1323415 1302742 1284421 1268452 1254795 1242672
58557A242672j1899j2807j4801j7975k1433k3625k4264k4402k4351k3324k1445
58546A022346k0036j9250j7602j4665j2120j1065j0411r190q336q603q617o865
58534H75586m219k617k304k057j288n02k18n99j600k777l515l970m889o236p198
58519H31597p862r357j1805j3715j4132j3833j3570j2811j1192r655q924q239
58507F96502o759n018l948l476l125k878k641j954r94o18p45l4J936L650L714
58492F73612K751K164K248K454K550K544K341K158K343K481J750M62j27J76K37
58477G00144l25n08P9M53J52J65J137K311L021L593M043L573K174J115J003R80
58461G23110M55q5n24j496k715k984k514l032m782n812n134m176l952l437k078
$$ plain form
58557 1242672 1230773 1217966 1203165 1185190 1163757 1140132 1115868 1091466 1067115 1043791 1022346
58546 1022346 1002310 983060 965458 950793 938673 927608 917197 908007 899671 891068 882451 875586
58534 875586 871367 868750 866446 864389 863101 862599 862381 861782 860182 857405 853890 849920 845031 838795 831597
58519 831597 823735 814378 802573 788858 774726 760893 747323 734512 723320 713665 704741 696502
58507 696502 689743 684725 680777 677301 674176 671298 668657 666703 665709 665091 664346 664312 666248 669898 673612
58492 673612 676363 678527 680775 683229 685779 688323 690664 692822 695165 697646 699396 699858 699731 699907 700144
58477 700144 699819 699311 699390 699843 699995 700160 701297 703608 706629 710222 714265 717838 720012 721127 722130 723110
58461 723110 723565 723480 722956 721460 718745 715761 713247 710215 705433 699621 694487 690311 686359 682922 680844
58446F80844j373k116k471p63J764K933K646K074J623J478K438M450N808N560
58432G04895N060N559N964M796K674J037j28j503k760l347l708m121l699j921
58418G08798J79J678L052M641N569N579O121Q059J0062J0800J0973J1683J2557
58405G99751J3074J3928J5372J5983J4662J2279R805O750K881m93k553m352o588
58392H90499q004p662o818o775o928o411n645m784k898l06P97j90q51M57K074
58377H36555K239J960K470K750K046J976L574M978M742M599O113P591P414P420
58363H96427R512J1712J1419J0030J0360J1705J1470R953R400R932J0142J0307
58351A022369J1368J2095J0844Q797Q096Q231P486O365O223O112M497K458J842
$$ plain form
58446 680844 679471 677355 674884 674121 675885 678818 681464 683538 685161 686639 689077 693527 699335 704895
58432 704895 709955 715514 721478 726274 728948 729985 729857 728354 725594 722247 718539 714418 710719 708798
58418 708798 708977 710655 713707 718348 723917 729496 735617 743676 753738 764538 775511 787194 799751
58405 799751 812825 826753 842125 858108 872770 885049 894854 901604 904485 903992 901439 897087 890499
58392 890499 882495 874833 868015 861240 854312 847901 842256 837472 834574 834268 835065 834875 834024 834481 836555
58377 836555 838794 840754 843224 845974 848020 849996 853570 858548 863290 867889 874002 881593 889007 896427
58363 896427 905939 917651 929070 939100 949460 961165 972635 982588 991988 1001920 1012062 1022369
58351 1022369 1033737 1045832 1056676 1065473 1073569 1081800 1089286 1095651 1101874 1107986 1112483 1114941 1116783
58338A116783J802P11k93P22K675L336L427N083P709R160R662J0915J2642J3535
58324A197869J4220J5752J6834J6077J5230J6509J8574J8911J8307J8948K0098
58313A387329J9859J9301K0349K1450J9908J6891J5508J5414J4051J1787J1078
58302A572925J1715J1553J0888J1603J3180J3843J4363J6446J8851J9446J9439
58291A734252K1160K3540K4330K4676K6623K8387K7335K5417K6115K8215K8333
58280B018383K7550K9328L2791L4420L4806L7265M1181M3255M4003M6567N0220
58269B439769N1562N1007N1740N3411N3269N2251N3478N6091N7088N7622O0810
58258C038098O5120O6904O7553P0912P5716P8157P9737Q4527R0846R4204R6282
$$ plain form
58338 1116783 1118585 1119296 1119003 1119725 1122400 1125736 1129163 1134246 1141955 1151115 1160777 1171692 1184334 1197869
58324 1197869 1212089 1227841 1244675 1260752 1275982 1292491 1311065 1329976 1348283 1367231 1387329
58313 1387329 1407188 1426489 1446838 1468288 1488196 1505087 1520595 1536009 1550060 1561847 1572925
58302 1572925 1584640 1596193 1607081 1618684 1631864 1645707 1660070 1676516 1695367 1714813 1734252
58291 1734252 1755412 1778952 1803282 1827958 1854581 1882968 1910303 1935720 1961835 1990050 2018383
58280 2018383 2045933 2075261 2108052 2142472 2177278 2214543 2255724 2298979 2342982 2389549 2439769
58269 2439769 2491331 2542338 2594078 2647489 2700758 2753009 2806487 2862578 2919666 2977288 3038098
58258 3038098 3103218 3170122 3237675 3308587 3384303 3462460 3542197 3626724 3717570 3811774 3908056
58247C908056J02016J09847J14249J16079J20721J27730J32370J35842J43499
58238E010409J54284J62573J69160J79540J92693K02939K11546K24682K41195
58229F749021K54657K66284K83026L04208L23475L42600L69165M01727M32330
58220I726493M62635N01884N49720N97673O46925P07263P79089Q55152R39669
58211A5766503J046017J175715J320606J485704J687716J931412K211968K540236
58203B9165877K938545L410699L944526M544254N230099O010770O898032P949217
58195G0092019R250335J0857028J2805641J5179495J8088399K1572904K5608896
58188A83454717L0164841L4976890L9018661M0314599L6722278K7325657J3285676
$$ plain form
58247 3908056 4010072 4119919 4234168 4350247 4470968 4598698 4731068 4866910 5010409
58238 5010409 5164693 5327266 5496426 5675966 5868659 6071598 6283144 6507826 6749021
58229 6749021 7003678 7269962 7552988 7857196 8180671 8523271 8892436 9294163 9726493
58220 9726493 10189128 10691012 11240732 11838405 12485330 13192593 13971682 14826834 15766503
58211 15766503 16812520 17988235 19308841 20794545 22482261 24413673 26625641 29165877
58203 29165877 32104422 35515121 39459647 44003901 49234000 55244770 62142802 70092019
58195 70092019 79342354 90199382 103005023 118184518 136272917 157845821 183454717
58188 183454717 213619558 248596448 287615109 327929708 364651986 391977643 405263319
58181D05263319k582942j7113700k8011684l4395792l6651891l5881920l3290169
58174B17335221k9800206k5995504k2229187j8711245j5542703j2752963j0335877
58167H1967536q255966o452586m863430l429778k085784q12315K50269P98875
58159E7116821N74250l96209j776331l128807m131962m654598m726422m478730
58151C4398012m068425l606121l140307k695126k295440j953661j662217j412834
58143A3563881j207049j041742r02773p80902o79054n98112n30061m70319m22848
58134F931021l87976l58192l30320l09064k94412k78166k57131k37579k22516
58125D255665k06301j86161j67541j53503j39579j23793j11592j06233j03633
$$ plain form
58181 405263319 402680377 385566677 357554993 323159201 286507310 250625390 217335221
58174 217335221 187535015 161539511 139310324 120599079 105056376 92303413 81967536
58167 81967536 73711570 67258984 62395554 58965776 56879992 56067677 56317946 57116821
58159 57116821 57691071 57294862 55518531 52389724 48257762 43603164 38876742 34398012
58151 34398012 30329587 26723466 23583159 20888033 18592593 16638932 14976715 13563881
58143 13563881 12356832 11315090 10412317 9631415 8952361 8354249 7824188 7353869 6931021
58134 6931021 6543045 6184853 5854533 5545469 5251057 4972891 4715760 4478181 4255665
58125 4255665 4049364 3863203 3695662 3542159 3402580 3278787 3167195 3060962 2957329
58116B957329j00902j00723j03337j03195r7892r2074q8633q4189p6954p0879
58106B038551o8035o4646n8624n3659n2068n0650m7242m4500m3745m1789l7344
58095A476249l4052l3804l3335l0684k8720k9116k9057k7046k5914k6939k6970
58084A150612k4533k2928k4053k4963k3688k2765k3760k3983k1929k0502k1388
58073H96120k1566j8922j6226j5986j6158j4535j2795j2730j2655j0982r275q694
58061G25596p443m618k654l118m065m091m889p182q451p430o633p640q138o538
58047F42706n242o175p241o382n252n557n616l912k386k832l395k074l81k84o03
58032E85374L06J217O08k95l8K13p50j552r18l18j125j950j459j067k057k892
$$ plain form
58116 2957329 2856427 2755704 2652367 2549172 2451280 2359206 2270573 2186384 2109430 2038551
58106 2038551 1970516 1905870 1847246 1793587 1741519 1690869 1643627 1599127 1555382 1513593 1476249
58095 1476249 1442197 1408393 1375058 1344374 1315654 1286538 1257481 1230435 1204521 1177582 1150612
58084 1150612 1126079 1103151 1079098 1054135 1030447 1007682 983922 959939 938010 917508 896120
58073 896120 874554 855632 839406 823420 807262 792727 779932 767202 754547 743565 734290 725596
58061 725596 718153 713535 710881 707763 703698 699607 694718 687536 679085 671655 665022 657382 649244 642706
58047 642706 637464 631289 624048 617666 612414 606857 601241 597329 594943 592111 588716 586642 586261 585977 585374
58032 585374 585680 586897 587505 587210 587172 587385 586635 585083 584165 583847 582722 580772 579313 578246 576189 573297
58016E73297k185j572k733m211m075l252l430m139m507n320o760o803m610k746
58002E16954l183l937k665p81o58j388q98No39k162k695k660l451m271l566k213
57986D81792k031k461j787m81k87j087j425j193j160r05K51J329J147O14J193
57971D73509K228K111J020J88m22j404k100j700j114j497k060j486l84r1k95K0
57955D66523L64l36j651k559l294m327m726l641k163j627j359j81J190J503J383
57940D45099K023K700K041P04K66M40j76j337j636j125j259k591m509o658q767
57925D25215r837r302q268p936p677o460m921m145l481j774L05J279J351J709
57911C66058K301K470K880M523O628P710Q020Q718R364Q622O847N701N515N167
$$ plain form
58016 573297 571112 569540 566807 562596 558521 555269 551839 547700 543193 537873 531113 524310 519700 516954
58002 516954 513771 509834 507169 506388 505730 504342 503444 503449 502810 500648 497953 495293 491842 487571 484005 481792
57986 481792 479761 477300 475513 475032 474745 473658 472233 471040 469880 468975 469226 470555 471702 472316 473509
57971 473509 475737 477848 478868 479056 478634 477230 475130 473430 472316 470819 468759 467273 466889 466798 466503 466523
57955 466523 466887 466551 464900 462341 459047 454720 449994 446353 444190 442563 441204 441023 442213 443716 445099
57940 445099 447122 449822 451863 452567 452833 453273 453097 451760 450124 448999 447740 445149 440640 433982 425215
57925 425215 415378 406076 397808 389872 382195 375735 370814 366669 363188 361414 361719 362998 364349 366058
57911 366058 368359 370829 373709 378232 384860 392570 400590 409308 418672 427294 434141 439842 445357 450524
57897D50524M234L277K343J063j32o56j167k616m453n519n933o420o629o028n593
57882D16295o410p369o491l991j885j011n43l6K35N07J191J622J174R97K569N048
57866D01902O300O135O226P086P450O662N459M357L254K603L044L833L495K047
57852D69853P50j10j337k880l724l750l842m125l873l151k819k907k650k029j708
57837D31698j660j399j268j797k275j779j088j598k858l380l437m548o443p173
57823C90995o335n663o023o364o089o113o787p008o184n173m566l816k801k351
57809C15722k487j892jJ951K808K957L267L880M762O056P262P263N784L800K171
57794C63303R88L87O85J461J911K243L366N083O103O039N751N516M608K937J481
$$ plain form
57897 450524 454758 458035 460378 461441 461309 460653 459486 456870 452417 446898 440965 434545 427916 421888 416295
57882 416295 409885 402516 396025 392034 390149 389138 388595 388559 388794 389301 390492 392114 393288 394285 396854 401902
57866 401902 408202 414337 420563 427649 435099 441761 447220 451577 454831 457434 460478 464311 467806 469853
57852 469853 470603 470493 469156 466276 462552 458802 454960 450835 446962 443811 440992 438085 435435 433406 431698
57837 431698 430038 428639 427371 425574 423299 421520 420432 418834 415976 412596 409159 404611 398168 390995
57823 390995 384660 378997 372974 366610 360521 354408 347621 340613 334429 329256 324690 320874 318073 315722
57809 315722 313235 311343 311342 313293 316101 319058 322325 326205 330967 337023 344285 351548 357332 361132 363303
57794 363303 364291 364678 365363 366824 368735 370978 374344 379427 385530 391569 397320 402836 407444 410381 411862
57779D11862N51o52k344l662m307n049o045o359n745n279n482n458m583l527k789
57764C51132j793k68R46J386J868K953L838L779L433L737M433M686M321L648K817
57749C90916K070J803J906J769J403J586K512L281L179K514J868J445J500K289
57735D20041L307L617L206K917K933K702K459L211M837N872N756N681O479P347
57721D80365P539P724Q617R600R891R869J0133J0344J0080R895J0447J1461J2358
57708F08323J3167J3970J4406J4510J5110J6622J8347J9718K1242K3425K5801
57697H04641K7818K9775L1997L4135L6152L9018M3447M8814N4294O0217O7305
57686A277613P5386Q3898R3091J03734J16138J30127J45388J61313J77207J93138
$$ plain form
57779 411862 412413 411761 409417 405755 401448 396399 390354 383995 378250 372971 367489 362031 357448 353921 351132
57764 351132 349339 349071 350017 351403 353271 356224 360062 363841 367274 371011 375444 380130 384451 388099 390916
57749 390916 392986 394789 396695 398464 399867 401453 403965 407246 410425 412939 414807 416252 417752 420041
57735 420041 423348 426965 430171 433088 436021 438723 441182 444393 449230 455102 460858 466539 473018 480365
57721 480365 487904 495628 504245 513845 523736 533605 543738 554082 564162 574057 584504 595965 608323
57708 608323 621490 635460 649866 664376 679486 696108 714455 734173 755415 778840 804641
57697 804641 832459 862234 894231 928366 964518 1003536 1046983 1095797 1150091 1210308 1277613
57686 1277613 1352999 1436897 1529988 1633722 1749860 1879987 2025375 2186688 2363895 2557033
57676B557033K09696K26281K40706K51123K57263K59033K55375K45554K29976
57667D732040K07649J73555J20995M7619m0875j32379k13153k72751l07206l19043
57657C996451l14029k97610k73809k46095k17666j90810j66587j45183j26244
57648B018418j09216r3861q0288o8342n7495m7582l9033l2006k5906k0186j4940
57637A429563j0261n674p31M476R777J5338K1159K6835L2265L7886M3884M9873
57625A654390N5811O2424P0269P9124Q8770R9459J11111J22816J33728J43713
57615B621615J52587J59425J62993J62052J54958J40056J17133Q7618N3097J4787
57605C826321k5117o3144r6498j24241j45911j60458j67652j69207j67153j62082
$$ plain form
57676 2557033 2766729 2993010 3233716 3484839 3742102 4001135 4256510 4502064 4732040
57667 4732040 4939689 5113244 5234239 5281858 5240983 5108604 4895451 4622700 4315494 3996451
57657 3996451 3682422 3384812 3111003 2864908 2647242 2456432 2289845 2144662 2018418
57648 2018418 1909202 1815341 1735053 1666711 1609216 1561634 1522601 1490595 1464689 1444503 1429563
57637 1429563 1419302 1413628 1412897 1417373 1427150 1442488 1463647 1490482 1522747 1560633 1604517 1654390
57625 1654390 1710201 1772625 1842894 1922018 2010788 2110247 2221358 2344174 2477902 2621615
57615 2621615 2774202 2933627 3096620 3258672 3413630 3553686 3670819 3758437 3811534 3826321
57605 3826321 3801204 3738060 3641562 3517321 3371410 3210952 3043300 2874093 2706940 2544858
57595B544858j54101j44405j34449j24426j13922j03357r3537q4488p5941o8274
57585A447958o1864n6117n0434m5325m1417l8102l4505l1039k8508k6367k3473
57574A010807k0081j7507j6012j4632j2959j1587j0734r778q371o856n449m028
57562H72813k772k052j618p58O07J850K644L247L902M597N448O646Q079R573J1232
57547I23438J3084J4757J6051J7395J9084K0661K1740K2878K4795K7319L0003
57536A151205L3100L6984M1174M5054M9057N4023N9852O5928P2394P9722Q7530
57525A776023R5069J02589J10833J19420J26983J32741J36590J37764J34723J26414
57515B999149J12512R2607O6605L6077L930k7516n7072q3380j04528j19458j28642
$$ plain form
57595 2544858 2390757 2246352 2111903 1987477 1873555 1770198 1676661 1592173 1516232 1447958
57585 1447958 1386094 1329977 1279543 1234218 1192801 1154699 1120194 1089155 1060647 1034280 1010807
57574 1010807 990726 973219 957207 942575 929616 918029 907295 897517 889146 882290 876841 872813
57562 872813 870041 867989 866371 865613 866220 868070 870714 873961 877863 882460 887908 894554 902633 912206 923438
57547 923438 936522 951279 967330 984725 1003809 1024470 1046210 1069088 1093883 1121202 1151205
57536 1151205 1184305 1221289 1262463 1307517 1356574 1410597 1470449 1536377 1608771 1688493 1776023
57525 1776023 1871092 1973681 2084514 2203934 2330917 2463658 2600248 2738012 2872735 2999149
57515 2999149 3111661 3204268 3270873 3306950 3310880 3283364 3226292 3142912 3038384 2918926 2790284
57504B790284j32989j33004j29367j23257j15559j06473r6268q5805p5997o7234
57494A724331n9487n2401m5365l8114l1292k5762k1431j7426j3366r595o235k852
57482A401005Q13M543Q139J1562J4617J7206J9841K3215K7352L1860L6766M2271
57470A639190M7912N2997N7822O3476P0451P8300Q6606R5298J04002J12089J19399
57459B527542J25916J30554J31237J26485J16106J00271P8864N2172K1563j0762
57449C399948m2272p0435r3439j10855j23129j30531j33169j31724j27329j20773
57439B316292j12580j03591r4544q5370p5842o6771n9354n3477m7858m1966l6559
57428A538380l2177k8306k4397k0673j7582j5235j3598j2461j1141r145p071n845
$$ plain form
57504 2790284 2657295 2524291 2394924 2271667 2156108 2049635 1953367 1867562 1791565 1724331
57494 1724331 1664844 1612443 1567078 1528964 1497672 1471910 1450479 1433053 1419687 1410092 1403857 1401005
57482 1401005 1401818 1406361 1414500 1426062 1440679 1457885 1477726 1500941 1528293 1560153 1596919 1639190
57470 1639190 1687102 1740099 1797921 1861397 1931848 2010148 2096754 2192052 2296054 2408143 2527542
57459 2527542 2653458 2784012 2915249 3041734 3157840 3258111 3336975 3389147 3410710 3399948
57449 3399948 3357676 3287241 3193802 3082947 2959818 2829287 2696118 2564394 2437065 2316292
57439 2316292 2203712 2100121 2005577 1920207 1844365 1777594 1718240 1664763 1616905 1574939 1538380
57428 1538380 1506203 1477897 1453500 1432827 1415245 1400010 1386412 1373951 1362810 1353665 1346594 1340749
57416A340749n125l671j338N72J224J165J002M69n69j338j152l16M80J025J379
57401A334556J624K100L210M692N844O527P062P234O543N567N721P300R043R944
57387A416967J0301J0510J0275R631R423R977J0460J0296J0085J0377J0752J0858
57375A539912J1212J2052J2526J2057J1373J1207J1070J0429J0016J0647J1683
57364A664184J2050J1987J2406J3178J3487J3366J3348J3080J1856J0304R951
57353A799197J1054J2292J2758J2960J3491J3994J4025J3927J4178J4502J4353
57342A946731J3829J3558J3870J4498J4976J5036J4714J4277J4028J4153J4665
57331B104335J5415J6086J6364J6235J6058J6276J7053J8174J9197J9750J9827
$$ plain form
57416 1340749 1335624 1331953 1330615 1331187 1332411 1333576 1334578 1335047 1334478 1333140 1331988 1331672 1332152 1333177 1334556
57401 1334556 1336180 1338280 1341490 1346182 1352026 1358553 1365615 1372849 1379392 1384959 1390680 1397980 1407023 1416967
57387 1416967 1427268 1437778 1448053 1457684 1467107 1477084 1487544 1497840 1507925 1518302 1529054 1539912
57375 1539912 1551124 1563176 1575702 1587759 1599132 1610339 1621409 1631838 1641854 1652501 1664184
57364 1664184 1676234 1688221 1700627 1713805 1727292 1740658 1754006 1767086 1778942 1789246 1799197
57353 1799197 1810251 1822543 1835301 1848261 1861752 1875746 1889771 1903698 1917876 1932378 1946731
57342 1946731 1960560 1974118 1987988 2002486 2017462 2032498 2047212 2061489 2075517 2089670 2104335
57331 2104335 2119750 2135836 2152200 2168435 2184493 2200769 2217822 2235996 2255193 2274943 2294770
57320B294770J9713J9522J9074J8435J8150J8491J8900J8841J8793J9504K0561
57309B504754K0901K0605K0940K2342K3623K3756K3296K3320K3943K4676K5469
57298B757625K6520K7577K8306K8922K9795L0744L1354L1707L2230L3058L4019
57287C091857L5028L6119L7278L8509L9787M0834M1289M1139M0461L8910L6185
57276C517396L2977L0373K8110K4543J8898J2485P083K934q12m538p894j0517
57264C651038j2225j2863j2577j1740j0263p624m081j023O10J526K996N175P322
57251C596271R085J0692J2283J3795J5252J6550J7303J7392J7281J7370J7539
57240C760813J7596J7632J7601J7302J7075J7649J8923J9940K0496K1626K3755
$$ plain form
57320 2294770 2314483 2334005 2353079 2371514 2389664 2408155 2427055 2445896 2464689 2484193 2504754
57309 2504754 2525655 2546260 2567200 2589542 2613165 2636921 2660217 2683537 2707480 2732156 2757625
57298 2757625 2784145 2811722 2840028 2868950 2898745 2929489 2960843 2992550 3024780 3057838 3091857
57287 3091857 3126885 3163004 3200282 3238791 3278578 3319412 3360701 3401840 3442301 3481211 3517396
57276 3517396 3550373 3580746 3608856 3633399 3652297 3664782 3671865 3674799 3673987 3669449 3661555 3651038
57264 3651038 3638813 3625950 3613373 3601633 3591370 3583746 3579665 3578642 3579252 3580778 3583774 3588949 3596271
57251 3596271 3605356 3616048 3628331 3642126 3657378 3673928 3691231 3708623 3725904 3743274 3760813
57240 3760813 3778409 3796041 3813642 3830944 3848019 3865668 3884591 3904531 3925027 3946653 3970408
57229C970408K5624K6001K5371K4937K4886K4784K4639K4409K3433K1629K0341
57218D236462K0602K1429K1279K0404K0199K0875K1447K1578K1681K1560K0606
57207D468122J9218J8443J8258J7665J6419J5213J4254J3073J1720J0657R571
57196D632613P814O066N913P504R173R850J0320J1562J3190J4330J4904J5252
57184D758491J5281J4708J3536J1869R781P639N987M938M295M250N139O475P241
57171D869630P246P252P593P664P105O483O362O476O314N832N221M560M053M054
57157D955845M642N563O623P679Q333Q348Q188Q472Q974Q986Q490Q069P802P301
57143E063315O722O617O788O417N347M032K179j097n512r446j2037j4092j6345
$$ plain form
57229 3970408 3996032 4022033 4047404 4072341 4097227 4122011 4146650 4171059 4194492 4216121 4236462
57218 4236462 4257064 4278493 4299772 4320176 4340375 4361250 4382697 4404275 4425956 4447516 4468122
57207 4468122 4487340 4505783 4524041 4541706 4558125 4573338 4587592 4600665 4612385 4623042 4632613
57196 4632613 4640427 4646493 4652406 4659910 4669083 4678933 4689253 4700815 4714005 4728335 4743239 4758491
57184 4758491 4773772 4788480 4802016 4813885 4823666 4831305 4837292 4842230 4846525 4850775 4855914 4862389 4869630
57171 4869630 4876876 4884128 4891721 4899385 4906490 4912973 4919335 4925811 4932125 4937957 4943178 4947738 4951791 4955845
57157 4955845 4960487 4966050 4972673 4980352 4988685 4997033 5005221 5013693 5022667 5031653 5040143 5048212 5056014 5063315
57143 5063315 5070037 5076654 5083442 5089859 5095206 5099238 5101417 5100320 5094808 5085362 5073325 5059233 5042888
57130E042888j8144j8767j8826j9308k0007j9883j8383j5626j1835p288k497K192
57118D874516O727J0832J3946J6038J7840J9796K1559K3023K5341L0326L9367
57107E099311N3289P2670R7766J28527J65179K08535K59695L19920L90789M73576
57097G269257N68216O73565P88937R14772J051684J199472J356665J519712J682282
57088A7024562J836326J973563K084245K154445K167336K109440J976079J772114
57080C3098110J511049J214380R06371O02148K98843j8410l58972p14660j063545
57071C5475314j382712j656630j876926k038929k140250k181390k166110k100887
57063A9931480j994276j856559j699019j532451j365678j205182j055682r20411
$$ plain form
57130 5042888 5024744 5005977 4987151 4967843 4947836 4927953 4909570 4893944 4882109 4874821 4872324 4874516
57118 4874516 4881243 4892075 4906021 4922059 4939899 4959695 4981254 5004277 5029618 5059944 5099311
57107 5099311 5152600 5225270 5323036 5451563 5616742 5825277 6084972 6404892 6795681 7269257
57097 7269257 7837473 8511038 9299975 10214747 11266431 12465903 13822568 15342280 17024562
57088 17024562 18860888 20834451 22918696 25073141 27240477 29349917 31325996 33098110
57080 33098110 34609159 35823539 36729910 37332058 37630901 37612491 37253519 36538859 35475314
57071 35475314 34092602 32435972 30559046 28520117 26379867 24198477 22032367 19931480
57063 19931480 17937204 16080645 14381626 12849175 11483497 10278315 9222633 8302222
57055H302222q00904o97002o07527n30867m65196m08808l60456l19111k83496
57046C828855k52459k25768k03780j86134j71518j58940j48372j39806j32443
57037B209635j25378j18445j11798j05341r8994r3017q7418q1613p5139o8315
57027A244177o1684n5373m9386m3998l9295l4853l0357k5999k1822j7371j2439
57016H51600p517k774K680R849J8704K8668L9804N2944O9296R0112J14850J37735
57004A405951J47097J31277Q7440K4921l9941r2471j25168j38184j36596j26774
56994A137552j13569r9526q5737p2835o1274n1184m2423l4722k7891k1896j6735
56983E09760j2362r040p656r110j3176j8430k3474k7692l0652l1517k9692k5663
$$ plain form
57055 8302222 7501318 6804316 6196789 5665922 5200726 4791918 4431462 4112351 3828855
57046 3828855 3576396 3350628 3146848 2960714 2789196 2630256 2481884 2342078 2209635
57037 2209635 2084257 1965812 1854014 1748673 1649679 1556662 1469244 1387631 1312492 1244177
57027 1244177 1182493 1127120 1077734 1033736 994441 959588 929231 903232 881410 864039 851600
57016 851600 844083 841309 843989 853838 872542 901210 941014 993958 1063254 1153366 1268216 1405951
57004 1405951 1553048 1684325 1771765 1796686 1756745 1664274 1539106 1400922 1264326 1137552
56994 1137552 1023983 924457 838720 765885 704611 653427 611004 576282 548391 526495 509760
56983 509760 497398 488358 480702 471592 458416 439986 416512 388820 358168 326651 296959 271296
56971B71296k0721j5994j1974q524n083j284K459N515Q226J1659J5961J9943K2834
56958B94313K5347K8147L0161K9476K5358J8482R812M42p951j3748j6643j7543
56946D05653j7341j6344j4637j2265r253n951l132j118P47L251O361R688J3360
56933C59019J7652K2228K6320K9181K9618K5982J7726O606m624j4330k2033k7183
56921D66162k9284k8882k7130k4509k1049j7477j4878j3303j1901j0309q820p367
56909B51253n624m046l439l474k916j509k92J84O29J618K703L377L874M468M940
56894B51746N268N914O915P654Q048R085J1549J4894J7953K0004K0499J8503J3318
56881D11350N559k899j0012j4527j6299j6012j4430j1910q750n615k944k03L385
$$ plain form
56971 271296 250575 234581 222607 214083 209000 207716 210175 215690 223916 235575 251536 271479 294313
56958 294313 319660 347807 377968 407444 432802 451284 461096 461538 453587 439839 423196 405653
56946 405653 388312 371968 357331 345066 335813 329862 326730 325612 326359 329610 335971 345659 359019
56933 359019 376671 398899 425219 454400 484018 510000 527726 534332 529708 515378 493345 466162
56921 466162 436878 407996 380866 356357 335308 317831 302953 289650 277749 267440 258620 251253
56909 251253 245629 241583 238144 234670 231754 230245 229953 230137 230766 232384 235087 238464 242338 246806 251746
56894 251746 257014 262928 269843 277497 285545 294630 306179 321073 339026 359030 379529 398032 411350
56881 411350 416909 414010 403998 389471 373172 357160 342730 330820 322070 316455 313511 313308 316693
56868C16693P513J1155J4209J7739K2414K7840L3699M0408M7959N4823N8513N6664
56856G09629M7533L0881R291j2226k9052l9414m3976m3938m0309l4286k7184j9900
56844E07049j2797n953Q32P940J5556K3618L2237M1749N2216O3437P5293Q6899
56832H88076R4927R3956P9907N3277J8912j6721m7709o9786q1264q3472p9510
56821H50593p2159o3029n3077m3067l3419k4200j5423p015J409J0305J9727K9393
56809F00038L9183M9190N8922O6460O8372O1074M3114J6891j2024l7661n6229
56798H97330o6708o9981o7850o2289n4838m6495l8111l0520k4023j8098j2022
56787D06395n674N27O245J1553J6824K2503K8691L4415L7415L5067K6053J1508
$$ plain form
56868 316693 324206 335361 349570 367309 389723 417563 451262 491670 539629 594452 652965 709629
56856 709629 757162 788043 797334 785108 756056 716642 672666 628728 588419 554133 526949 507049
56844 507049 494252 488299 489131 497071 512627 536245 568482 610231 662447 725884 801177 888076
56832 888076 983003 1076959 1156866 1210143 1229055 1212334 1164625 1094839 1013575 930103 850593
56821 850593 778434 715405 662328 619261 585842 561642 546219 539204 540613 550918 570645 600038
56809 600038 639221 688411 747333 813793 882165 943239 986353 1003244 991220 953559 897330
56798 897330 830622 760641 692791 630502 575664 529169 491058 460538 436515 418417 406395
56787 406395 400721 401248 407493 419046 435870 458373 487064 521479 558894 593961 620014 631522
56775F31522n321k0673l2069l8979m2017m1899l9310l5290l1045k7242k3878k0782
56763B73017j7837j4862j1809r153p513o802o238n281m145l307k910k757k444
56750A77959j563k26O78L28q67j639j340m44M02R87J100M62n59j003o06k46o50
56733A72773j380j710j742j924k044j551n97Qk85j311k544l410l537l113k829
56718A44804l105l633l932l976l829l133j632J03J090J077P36P00R50J238J578
56703A29036K038K348K106J368P42O82Q68O36n0n04l41k3k2j6M49R17N62m52j016
56684A39328n44L55Q23O35L1o21q43l09P21J702K529L286L533K744J466J013J735
56667A57584K548K481J750R67K69k74l14R6K08l96j187j547j655j940k331k561
$$ plain form
56775 631522 626201 605528 573459 534480 492463 450564 411254 375964 344919 317677 293799 273017
56763 273017 255180 240318 228509 219356 211843 205041 198803 193522 189377 186070 183160 180403 177959
56750 177959 176396 176170 176848 177176 176309 174670 173330 172886 173288 174275 175375 175837 175278 174275 173669 173423 172773
56733 172773 171393 169683 167941 166017 163973 162422 161825 161833 161548 160237 157693 154283 150746 147633 144804
56718 144804 141699 138066 134134 130158 126329 123196 121564 121667 122757 123834 124570 125270 126220 127458 129036
56703 129036 131074 133422 135528 136896 137638 138320 139188 139824 139774 139270 138929 138906 138884 138868 139317 140234 140796 140344 139328
56684 139328 138784 139139 139962 140597 140628 140007 139164 138855 139576 141278 143807 147093 150626 153370 154836 155849 157584
56667 157584 160132 162613 164363 165330 165599 165325 165011 165107 165315 164919 163732 162185 160530 158590 156259 153698
56651A53698k631k558k233j892k033k560k761k473k352k583k417j579j000j304
56637A23322j614r62O6L20K5L25J298J772J082r1p93p86l66J58N64P37P13N61
56619A26331M16N72J117J411O42q18j479o16O99J086N55K7j01l4J39L67K64l51
56601A30227r45r64n69q9N95J475J908J529J039J173J527J249M13k40m11j88M93
56584A38222J444J853J296N44M00M68J14p8P79K161K771K492K236K200J770J057
56568A59729R60J695K537L114L685M188M252M176M613N293N346M909M947N426
56554B14870N211M061L219L433L867L622L063K782K370J193l86j526k035k289
56540B41455k464k483k312j910j310r95j629l039m139m215l688l244k881k373
$$ plain form
56651 153698 151067 148509 146276 144384 142351 139791 137030 134557 132205 129622 127205 125626 124626 123322
56637 123322 121708 120746 120812 121132 121157 121482 122780 124552 125634 125543 124750 123964 123598 123756 124320 125057 125770 126331
56619 126331 126747 127319 128436 129847 130489 129671 128192 127576 128275 129361 129916 129943 129842 129808 129947 130314 130578 130227
56601 130227 129282 128318 127749 127660 128255 129730 131638 133167 134206 135379 136906 138155 138568 138328 137917 137729 138222
56584 138222 139666 141519 142815 143359 143759 144227 144341 144263 145042 147203 149974 152466 154702 156902 158672 159729
56568 159729 160689 162384 164921 168035 171720 175908 180160 184336 188949 194242 199588 204497 209444 214870
56554 214870 220081 224142 227361 230794 234661 238283 241346 244128 246498 247691 247305 245779 243744 241455
56540 241455 238991 236508 234196 232286 230976 229981 228352 225313 221174 216959 213271 210027 207146 204773
56526B04773k023k284k976l487l568l471l412l252k745j889j053p28j033j556
56512A71296j875k073k465k952l092k718k108j644j575j915k261k046j369j134
56498A42069j756k254j484J02R28M32l08k01N96J266J457J387J351J424J441J171
56482A47621Q13J043K151L382L780L386K955K722K320J762J634K191L041L792
56468A82593M374M672M504M036L706L715M037M627N157M911L710K603K635L293
56454B38573L178K032R77P40P91M21l17j015j468j528j152o93n79p29q83j275
56438B37073k191l059l022k283j874k127k401k334k316k552k658k418k007j447
56424B04384o29K9m9n87o83j28M56P62J081J402J314R08P58R07Q15L85M5j03k27
$$ plain form
56526 204773 202750 200466 197490 194003 190435 186964 183552 180300 177555 175666 174613 173885 172852 171296
56512 171296 169421 167348 164883 161931 158839 156121 154013 152369 150794 148879 146618 144572 143203 142069
56498 142069 140313 138059 136575 136677 137605 138037 137729 137528 138124 139390 140847 142234 143585 145009 146450 147621
56482 147621 148434 149477 151628 155010 158790 162176 165131 167853 170173 171935 173569 175760 178801 182593
56468 182593 186967 191639 196143 200179 203885 207600 211637 216264 221421 226332 230042 232645 235280 238573
56454 238573 241751 243783 244760 245500 246291 246712 246395 245380 243912 242384 241232 240539 239960 239231 238348 237073
56438 237073 234882 231823 228801 226518 224644 222517 220116 217782 215466 212914 210256 207838 205831 204384
56424 204384 203755 203784 203735 203148 202465 202337 202793 203555 204636 206038 207352 208260 209018 209925 210740 211125 211170 211067 210840
56405B10840Q2J342K907L404K573J444O47j50j041j548j653j849j963j404o98
56390B12933j160k697l587l019k183k175k450k204j780j693j596j253j334k147
56376A83655k709k104q52J65J166K771M567N533N432M905M483M221L947L452K803
56361B21435K582L227M060L927K872K222K697L544L844L592L139K631K421K916
56347B65109L673L717L005K397K058J336M24M76J561K252J912J687K389L089K836
56332B97921K196K017K132K345L247M850N895N760N663O674P929Q125P542P132
56318C69428O887O560O797Q011R180R321R177R886J0920J1007J0254R687R323
56305D86438Q295O507M688L170J866R94O68K68o43j299p74N09J441J784K041K298
$$ plain form
56405 210840 210922 212264 215171 218575 221148 222592 223239 223089 222048 220500 218847 216998 215035 213631 212933
56390 212933 211773 209076 205489 202470 200287 198112 195662 193458 191678 189985 188389 187136 185802 183655
56376 183655 180946 178842 177990 178155 179321 182092 186659 192192 197624 202529 207012 211233 215180 218632 221435
56361 221435 224017 227244 231304 235231 238103 240325 243022 246566 250410 254002 257141 259772 262193 265109
56347 265109 268782 272499 275504 277901 279959 281295 281719 282195 283756 286008 287920 289607 291996 295085 297921
56332 297921 300117 302134 304266 306611 309858 314708 320603 326363 332026 338700 346629 354754 362296 369428
56318 369428 376315 382875 389672 397683 406863 416184 425361 435247 446167 457174 467428 477115 486438
56305 486438 494733 501240 505928 509098 510964 511958 512626 512894 512251 510952 510178 510687 512128 513912 515953 518251
56289E18251K362K567L371M616O026P820J0033J1961J3179J4317J5927J7470J8457
56276F46357J9673K2079K5289K8341L1172L4306L7787M1534M5976N1291N6828
56265A040633O2304O8610P6452Q5155R4036J03747J14953J26714J37693J48062
56255B058359J58659J69007J77679J84010J88005J89208J86905J80863J70670
56246C663365J55190J34002J08609Q1048N2130K2336o650l2930n6033p6165r2676
56235C952226j04865j13450j19641j23460j24539j23825j22829j21767j20021
56226B877829j17801j15881j14253j12466j10685j09105j07100j04264j01400
56217A884874r9040r6007r1059q5014p9592p5022p0460o5842o1535n6996n1586
$$ plain form
56289 518251 520613 523180 526551 531167 537193 545013 555046 567007 580186 594503 610430 627900 646357
56276 646357 666030 688109 713398 741739 772911 807217 845004 886538 932514 983805 1040633
56265 1040633 1102937 1171547 1247999 1333154 1427190 1530937 1645890 1772604 1910297 2058359
56255 2058359 2217018 2386025 2563704 2747714 2935719 3124927 3311832 3492695 3663365
56246 3663365 3818555 3952557 4061166 4142214 4194344 4216680 4210030 4177100 4121067 4044902 3952226
56235 3952226 3847361 3733911 3614270 3490810 3366271 3242446 3119617 2997850 2877829
56226 2877829 2760028 2644147 2529894 2417428 2306743 2197638 2090538 1986274 1884874
56217 1884874 1785834 1689827 1598768 1513754 1434162 1359140 1288680 1222838 1161303 1104307 1052721
56206A052721m6041m1436l7493l3473k9800k7126k4791k2042j9672j8535j7555
56195G34757j5423j3108j2334j2415j1206q575o498n995o195o205n827m719k824
56182F23433j178o39l65O91J776J815J757L201N553P020P587Q502R678J0181J0590
56167F89602J2099J3859J4070J3248J3583J5251J6193J5458J4136J3002J1752
56156H42253J0588J0177J0164R807R741J0891J2374J2919J3621J6461K0818K4480
56144A004294K7599L2529M0112M9184N9473P1635Q4599R6139J06020J15269J22373
56133A809226J23679J18011J07734R5147Q1174O7889N8563N3988N1465M8105M2578
56122B657559L3686K0628N428p942j7675k5010l1110l6227m2168n2021o6348q2316
$$ plain form
56206 1052721 1006680 965244 927751 894278 864478 837352 812561 790519 770847 752312 734757
56195 734757 719334 706226 693892 681477 670271 661696 655198 649203 643008 636803 630976 626257 623433
56182 623433 622255 621616 621251 621942 623718 625533 627290 630491 636044 643064 650651 659153 668831 679012 689602
56167 689602 701701 715560 729630 742878 756461 771712 787905 803363 817499 830501 842253
56156 842253 852841 863018 873182 882989 892730 903621 915995 928914 942535 958996 979814 1004294
56144 1004294 1031893 1064422 1104534 1153718 1213191 1284826 1369425 1465564 1571584 1686853 1809226
56133 1809226 1932905 2050916 2158650 2253797 2334971 2402860 2461423 2515411 2566876 2614981 2657559
56122 2657559 2691245 2711873 2717301 2709359 2691684 2666674 2635564 2599337 2557169 2505148 2438800 2356484
56110B356484r7057j09181j17050j18887j15224j08342r9009q6743p3152o1419
56100A370420n2138m3075l3410k4739j7699j1220n549k178m89J735M104L999J507
56087A191268l47q36k451n705p710p158o240o126n067k567r83j148o14J848M078
56072A150242M736N571P588Q992R024R847J2551J4980J5582J5709J6299J6068
56060A287189J4829J4714J6272J7176J6476J6243J7355J7909J7477J8474K1451
56049A475565K3427K2951K2356K3096K3436K2733K3232K5421K6458K5497K5648
56038A739820K8355L0718L0934L1296L3312L4921L5214L6692M0131M2509M2758
56027B126660M4162M8172N1486N2296N3614N7248O0306O1087O2513O6236O9299
$$ plain form
56110 2356484 2259427 2150246 2033196 1914309 1799085 1690743 1591734 1504991 1431839 1370420
56100 1370420 1318282 1275207 1241797 1217058 1199359 1188139 1182590 1180412 1179923 1181658 1185762 1189761 1191268
56087 1191268 1190921 1190085 1187634 1181929 1174219 1167061 1160821 1154695 1149628 1147061 1146078 1144930 1144316 1146164 1150242
56072 1150242 1154978 1160549 1168137 1177129 1186153 1196000 1208551 1223531 1239113 1254822 1271121 1287189
56060 1287189 1302018 1316732 1333004 1350180 1366656 1382899 1400254 1418163 1435640 1454114 1475565
56049 1475565 1498992 1521943 1544299 1567395 1590831 1613564 1636796 1662217 1688675 1714172 1739820
56038 1739820 1768175 1798893 1829827 1861123 1894435 1929356 1964570 2001262 2041393 2083902 2126660
56027 2126660 2170822 2218994 2270480 2322776 2376390 2433638 2493944 2555031 2617544 2683780 2753079
56016B753079P0271P2504P7653Q2167Q3978Q6251R0643R3665R3816R5330J00514
56005C699871J05459J07808J11372J18335J24688J28371J33989J44042J53689
55996D827624J59928J67441J79355J90928J98944K08300K22409K36347K46845
55987F638121K59588K78729K98978L16375L36831L65285L96710M27017M62119
55978I779753N06461N53877O00073O52487P17232P88972Q65237R57064J072861
55969A6494017J206336J354188J530391J748169K004792K300775K655628L085510
55961C2379806L584110M145513M785352N520297O356389P326161Q507195R971789
55953H2576612J1754407J3906370J6532473J9716016K3461335K7758861L2525521
$$ plain form
56016 2753079 2823350 2895854 2973507 3055674 3139652 3225903 3316546 3410211 3504027 3599357 3699871
56005 3699871 3805330 3913138 4024510 4142845 4267533 4395904 4529893 4673935 4827624
55996 4827624 4987552 5154993 5334348 5525276 5724220 5932520 6154929 6391276 6638121
55987 6638121 6897709 7176438 7475416 7791791 8128622 8493907 8890617 9317634 9779753
55978 9779753 10286214 10840091 11440164 12092651 12809883 13598855 14464092 15421156 16494017
55969 16494017 17700353 19054541 20584932 22333101 24337893 26638668 29294296 32379806
55961 32379806 35963916 40109429 44894781 50415078 56771467 64097628 72604823 82576612
55953 82576612 94331019 108237389 124769862 144485878 167947213 195706074 228231595
55946B28231595L7153212M0034435L8883920L2035122J9739757M303924j1036508
55939C89345457k3545231l1803305l5743295l6214269l4404932l1365561k7802719
55932A68466145k4138566k0639760j7467436j4684390j2294307j0284585q625407
55925F0331694p260224o130225n199101m439516l814036l288280k847896k485125
55917B4867291k181506j918881j694393j509026j352231j211639j087347r83156
55909A2929112q93144q09330p33664o70513o15534n62902n15434m76984m42576
55900G209031m06430l72281l45707l23221k98722k74265k54746k38064k19784
55891D475811k02003j88707j77506j64435j51888j43712j37279j28274j18605
$$ plain form
55946 228231595 265384807 305419242 344303162 376338284 396078041 400381965 389345457
55939 389345457 365800226 333996921 298253626 262039357 227634425 196268864 168466145
55932 168466145 144327579 123687819 106220383 91535993 79241686 68957101 60331694
55925 60331694 53071470 46941245 41742144 37302628 33488592 30200312 27352416 24867291
55917 24867291 22685785 20766904 19072511 17563485 16211254 14999615 13912268 12929112
55909 12929112 12035968 11226638 10492974 9822461 9206927 8644025 8128591 7651607 7209031
55900 7209031 6802601 6430320 6084613 5761392 5462670 5188405 4933659 4695595 4475811
55891 4475811 4273808 4085101 3907595 3743160 3591272 3447560 3310281 3182007 3063402
55882C063402j12043j06603r8739r0665q6074q2795p6886p0090o6226o3913n9628
55871B149740n4416n1083m8281m3631l9236l7837l7035l3362k8728k6825k6758
55860A722548k6255k7473l3156m0254m3856m4595m5884m6730m3900l8824l5811
55849A295810l5141l3888l1891l1091l0619k8165k4816k3258k2572j9945j5986
55838I98438j3395j1815r019n803m766n470n433m746n219o249o065n706p423j0276
55824H97053j1690j2110j3828j6480j7975j8578j9901k1123k0365j8631j8118
55813G08254j8021j6224j3785j3315j4079j3186j0656q855p799n501k248k19O75
55800E85041K408M808N926N839O195O577N222K677R10n35l424o736p892p410q050
$$ plain form
55882 3063402 2951359 2844756 2746017 2655352 2569278 2486483 2409597 2339507 2273281 2209368 2149740
55871 2149740 2095324 2044241 1995960 1952329 1913093 1875256 1838221 1804859 1776131 1749306 1722548
55860 1722548 1696293 1668820 1635664 1595410 1551554 1506959 1461075 1414345 1370445 1331621 1295810
55849 1295810 1260669 1226781 1194890 1163799 1133180 1105015 1080199 1056941 1034369 1014424 998438
55838 998438 985043 973228 964209 958406 953640 948170 942737 937991 932772 926523 920458 914752 907329 897053
55824 897053 885363 873253 859425 842945 824970 806392 786491 765368 745003 726372 708254
55813 708254 690233 674009 660224 646909 632830 619644 608988 600133 592334 586833 584585 584366 585041
55800 585041 587449 592257 598183 604022 610217 616794 622016 624693 625603 625068 621644 614908 607016 599606 591556
55785E91556r762r953q465p658p539n586j896J9j485m230o456q995j2117j4052
55771D93381j4052j3690j3792j3062j0944q937p874o692m963m094m843o018o654
55758C77766p187p707p287n955n155n478n971o232p035q306q636p627o666o715
55744B81809p142p299p483p727p370o295n153m073k769j757j774k024r95J034
55730B20982K229J892R79l1j549l156l690l287l299l971m206l791l685l993l726
55715A87698k877k544k752k259q92O7K12O48J840K897L479M405N750O220N138
55700B07030L313J354j051l611m952m482l272k448j975j531j117m47R60K688L759
55685A94218M247N175O603P349O867N962N283M564L652K896K153P15j431l351
$$ plain form
55785 591556 581794 571841 563376 555718 548179 542593 540697 540716 539231 535001 528545 519550 507433 493381
55771 493381 479329 465639 451847 438785 427841 418904 411030 404338 399375 395281 390438 384420 377766
55758 377766 370579 362872 355585 349630 344475 338997 333026 326794 319759 311453 302817 295190 288524 281809
55744 281809 274667 267368 259885 252158 244788 238493 233340 229267 226498 224741 222967 220943 219948 220982
55730 220982 223211 225103 226082 226051 224502 221346 217656 214369 211070 207099 202893 199102 195417 191424 187698
55715 187698 184821 182277 179525 177266 176374 176441 176653 177301 179141 182038 185517 189922 195672 201892 207030
55700 207030 210343 211697 210646 207035 202083 197601 194329 191881 189906 188375 187258 186811 187771 190459 194218
55685 194218 198465 203640 210243 217592 224459 230421 235704 240268 243920 246816 248969 249684 248253 244902
55671B44902m352m466l797k542j454j138j062m13M85Q22Q51J348K123K595L148
55656B37050M229M773L636J919J696K820L278K450J600J280O60m48j234j717k745
55641B59247m007m283l825m168n419o055n747n965p224q145p929p563p741p685
55627A73491o896o174o087o123n962n950n860m939l555l008l413l616l386l571
55613A04951l891k935q77K33m49j395j389j067j064q72m19o60j573j718o87R6
55597H6284q4j19N18N63o23j627j335p06p75q99l62O0l83r85j004r27j149j038
55579G5409m70m55j154j148J04J053O58J68P53J461J201Q88J666K716K799K402
55563H8051K484K470J490K00m60j097k494l728l605k831k747l041k679k086k279
$$ plain form
55671 244902 240550 236084 232287 229745 228291 227153 226091 225678 226163 226985 227836 229184 231307 233902 237050
55656 237050 241279 246052 249688 251607 253303 256123 259401 261851 263451 264731 265391 264943 263709 261992 259247
55641 259247 255240 250957 247132 242964 237545 231490 225743 219778 212554 204409 196480 188917 181176 173491
55627 173491 166595 160421 154334 148211 142249 136299 130439 125500 121945 118937 115524 111908 108522 104951
55613 104951 101060 98125 97248 97481 97032 95637 94248 93181 92117 91245 90826 90166 88593 86875 86188 86284
55597 86284 86200 86081 86599 87162 86539 84912 83577 82871 82096 81197 80835 80895 80512 79527 78523 77596 76447 75409
55579 75409 74939 74484 73330 72182 72286 73339 73997 74165 74918 76379 77580 78468 80134 82850 85649 88051
55563 88051 90535 93005 94495 94695 94235 93138 90644 86916 83311 80480 77733 74692 72013 69927 67648
55548F7648k662j860r0J198J610J866K063J740J255J402J869J674Q57L44L95N44
55532G9853P51J338K048K374K464K700K844K676K791L629M397M180L502L454L903
55517A22904L882L282K673J965N52j425l229m600n662o160n925n623n941o438
55503I0255o286n634n168m794l985l015k620k813l096l446m001m233l554k435
55489C5175j852j945k151k218k113j453r6J187J632J589J662J529P33n3N9N31
55473C2216J30j093j971k060j862j466m18R62J559J026K25j11j98m43o93n31J75
55456B5447J122J621J133N7m28J01O41K66m29k91O21J265J123M68m03j218j464
55439B9632j032p38j251j950j831r76j37N18J147J278M61n08l54Q90K010K289
$$ plain form
55548 67648 64986 63126 63036 64234 65844 67710 69773 71513 72768 74170 76039 77713 78570 78914 79309 79853
55532 79853 80604 81942 83990 86364 88828 91528 94372 97048 99839 103468 107865 112045 115547 119001 122904
55517 122904 126786 130068 132741 134706 135258 133833 130604 126004 120342 114182 108257 102634 96693 90255
55503 90255 83969 78335 73167 68373 64388 61373 58753 55940 52844 49398 45397 41164 37610 35175
55489 35175 33323 31378 29227 27009 24896 23443 23347 24534 26166 27755 29417 30946 31679 31626 31685 32216
55473 32216 32346 31253 29282 27222 25360 23894 23476 24438 25997 27023 27248 27137 26939 26496 25803 25272 25447
55456 25447 26569 28190 29323 29380 28952 29053 29694 29960 29531 29240 29861 31126 32249 32717 32314 31096 29632
55439 29632 28600 27862 26611 24661 22830 21854 21717 22235 23382 24660 25121 24613 24259 25149 27159 29448
55423B9448J921J096q4r31p52k2J48l67p10n40l49k62K37J258K126K348K085J635
55405C8285J092N68J12m96j274j673j341q47q34r30m51K79M18K7j62j44n87j486
55387C0556k018j782j163m88K04O42N07J01kO7k26p23o75J04J017J495J294L39
55369B9249r12j294k28J105R71p21k447l088k779j986r33k4K84J24p1l59r29j298
55351A4664r10k51j96m73j23P52J062N75J95L75N24L20K28L57P7p93j441j284
55333A3658p45m35l38k11n2J42L82M00Jl32j3N38L90l61o92l05j6k26k91K12P10
55312A2416P12O32R54J380J425J194J080J201J474J766J720J001j33j002j315
55297B4505j292j018m30J18J19k05j02M80P77M41Oq7j11l56o28p37q79j145j240
$$ plain form
55423 29448 31369 32465 32381 31450 30698 30676 30824 30457 29747 29207 28858 28596 28833 30091 32217 34565 36650 38285
55405 38285 39377 39945 40057 39561 38287 36614 35273 34426 33592 32662 32211 32490 32908 32935 32773 32629 32042 30556
55387 30556 28538 26756 25593 25105 25309 25951 26458 26559 26557 26624 26398 25675 25000 25104 26121 27616 28910 29249
55369 29249 28337 27043 26815 27920 28891 28170 25723 22635 19856 17870 16937 16913 17197 17321 17250 16891 15962 14664
55351 14664 13754 13503 13307 12834 12711 13463 14525 15100 15295 15670 16194 16514 16742 17099 17176 16383 14942 13658
55333 13658 12913 12478 12140 11929 11877 12019 12401 12801 12802 12470 12457 12995 13385 13024 12332 12027 12011 11785 11494 11706 12416
55312 12416 13128 13760 14714 16094 17519 18713 19793 20994 22468 24234 25954 26955 26822 25820 24505
55297 24505 23213 22195 21765 21883 22002 21797 21695 22175 22952 23393 23399 23312 23201 22845 22217 21480 20601 19456 18216
55278A8216r33l51K52N88L62k71n02J87J040R21n2p20o43n36q85j244j165q34
55260A3430m52J51R10J271R92N69N94J089J616J643Q86l03j041q77m19l38l82
55243A9339k4M51N12M42O73P00l6p34k83O86N54o20j090j84P77P03J11k43m39
55224B1295n38j11O66Q34K32n7N36J127Q68J94j55j66j7M07Q66P20L6l02k2J81
55204B6594N9K28P42P62J74K5O16Q07L6n35J3P84O44j5l40n22r09q99j39L56k16
55183B8265q52k48R72J293P47N97J078J208N91j53o76j241j761j714j114o09n59
55166B5824p79j060j284j236r68j025j622k016j468m27O6k37p28r58q95n24J27
55149A0790P52J153J488J670J164qq04m98K04K10l81p06n46k86R3Q68J741K041
$$ plain form
55278 18216 17283 16932 17184 17772 18134 17863 17361 17548 18588 19509 19457 18737 18094 17558 16673 15429 14264 13430
55260 13430 12978 13129 14039 15310 16302 16871 17465 18554 20170 21813 22699 22396 21355 20478 20059 19721 19339
55243 19339 19315 19766 20278 20720 21393 22093 22057 21323 21040 21726 22280 21660 20570 20386 21163 21866 21977 21734 21295
55224 21295 20757 20646 21312 22146 22378 22321 22857 23984 24852 25046 24891 24725 24708 25115 25981 26701 26737 26435 26413 26594
55204 26594 26653 26881 27623 28385 28559 28584 29200 30007 30043 29508 29521 30305 30949 30934 30594 30072 29163 28264 28125 28481 28265
55183 28265 27413 27165 28137 29430 30177 30774 31852 33060 33651 33498 32822 31581 29820 28106 26992 26383 25824
55166 25824 25045 23985 22701 21465 20497 19472 17850 15834 14366 13939 14005 13768 13040 12082 11187 10663 10790
55149 10790 11542 12695 14183 15853 17017 17009 16205 15707 15911 16121 15740 15034 14488 14202 14295 15163 16904 18945
55131A8945J661R92K88k62k83J88L96p5m87o7O86P69K87J27M98Q54J043J351J648
55112B8559J483R77O93P90J074J520J956J646K70j125j282n31k58p82j062m82
55096C3446K93M65K6o14j007o54N71J885K361K115J854J512M64q88j135J64J701
55079D2559K089J398N45k9l76m50j38L84Q02R16O38K5n37o26l49j83l13n20p93
55060D5042j395k202k505j756k33J207J793J353M68L5L69Q10O43O4j75J04L46
55043D3968J54k70n56n42k66K9m0n32q84n84J10N14M42K18Nl33o95p19j91P23
55023D0551J561J644N48j101j823r02O50J420J341J294J527J516J116P35M82J78
55007E0737P6N59J145R42J15j55N82J372J231L26n56r20o80n2M03K13l36o56q22
$$ plain form
55131 18945 20606 21598 21886 21624 21341 21529 21925 21850 21363 21296 21982 22751 23038 23165 23663 24517 25560 26911 28559
55112 28559 30042 31019 31712 32502 33576 35096 37052 38698 38968 37843 36561 36030 35772 34990 33928 33446
55096 33446 33739 34204 34230 33616 32609 31955 32526 34411 36772 38887 40741 42253 42717 41829 40694 40858 42559
55079 42559 44648 46046 46591 46562 46186 45736 45598 45982 46784 47700 48338 48363 47826 47200 46851 46668 46355 45835 45042
55060 45042 43647 41445 38940 37184 36951 38158 39951 41304 41772 41807 42176 42986 43629 43693 43518 43622 43968
55043 43968 44122 43852 43296 42754 42488 42517 42477 41945 41061 40477 40587 41101 41543 41761 41766 41433 40738 40019 39828 40551
55023 40551 42112 43756 44304 43203 41380 40478 41128 42548 43889 45183 46710 48226 49342 50077 50559 50737
55007 50737 50813 51372 52517 53459 53574 53419 54001 55373 56604 56930 56374 55454 54774 54722 55125 55338 55002 54346 53524
54988E3524j372k131k297j783j397j419j093l0R69J142Q79Q96J102J107J143J544
54972E0784J846J372M38N1M71Q88O04j07m56p4P05J233J213J034J363K296L125
54955F6786L236K953L133M068N181N889O283O796P577Q509R687J1313J3135J4407
54941A68953J4732J4476J3956J2537R297M443o48m907q326j1123j3034j3934j4299
54928A72123j4442j3879j2247j0225q751p792o684n359m299l567k767j893j325
54915G8893j041n89P4N27O89J057J956L181M405N509O409P076P776Q858J0364
54900A35144J2079J3798J5144J5497J4578J2751J0227O541J506l828q121j1277
54888B14039j3963j5949j6270j4881j3006j1526j0232q858p823p460p313o687
$$ plain form
54988 53524 52152 50021 47724 45941 44544 43125 42032 42002 42971 44113 44992 45888 46990 48097 49240 50784
54972 50784 52630 54002 54440 54491 54962 55850 56454 56347 55891 55817 56522 57755 58968 60002 61365 63661 66786
54955 66786 70022 72975 76108 80176 85357 91246 97529 104325 111902 120411 130098 141411 154546 168953
54941 168953 183685 198161 212117 224654 233951 238394 237746 232839 224513 213390 200356 186422 172123
54928 172123 157681 143802 131555 121330 112579 104787 98103 92744 88445 84878 82111 80218 78893
54915 78893 77852 77263 77337 77864 78553 79610 81566 84747 89152 94661 101070 108146 115922 124780 135144
54900 135144 147223 161021 176165 191662 206240 218991 229218 235759 237265 233437 225316 214039
54888 214039 200076 184127 167857 152976 139970 128444 118212 109354 101531 94071 86758 80071
54876H0071n401l773k387j886k305k704k209j290j072j486j328k05Q38J017Q23
54861E6703Q95R69P19N25O75N67l43j546k193k249k145j849j146m33m13j051j564
54844D6121j342n35K20L45k41r41r84l09K97J48n95j255j403j035l58L43P89Q43
54826D0108N47J04m2M88J324J389K90p70l80J053J791J212M97O71J257J374J086
54809E1999R08Q80Q28R42J355J699J691J728K300L270M125M660M933N041N199
54794I1558N658O339O986P855R586J2135J4504J5884J6341J6106J4865J2345Q912
54781B39074N114J096l076o999j0184j2311j3064j2325j0774r542q983q481p651
54768A41894o829o111m970l312j961j449j232p00q2L18Q53J796K739L514M705
$$ plain form
54876 80071 74670 70897 68510 66624 64319 61615 59406 58116 57044 55558 54230 54025 54863 55880 56703
54861 56703 57598 58567 59286 59811 60486 61053 60710 59164 56971 54722 52577 50728 49582 49149 48736 47685 46121
54844 46121 44779 44244 44464 44809 44568 43627 42643 42334 42631 42779 42184 40929 39526 38491 38133 38476 39265 40108
54826 40108 40655 40759 40717 41205 42529 43918 44208 43438 43058 44111 45902 47114 47611 48282 49539 50913 51999
54809 51999 52907 53787 54615 55557 56912 58611 60302 62030 64330 67600 71725 76385 81318 86359 91558
54794 91558 97216 103555 110541 118396 127982 140117 154621 170505 186846 202952 217817 230162 239074
54781 239074 244188 245284 242208 235209 225025 212714 199650 187325 176551 167009 158026 149545 141894
54768 141894 135065 128954 123984 120672 118711 117262 116030 115330 115248 115566 116419 118215 120954 124468 129173
54753A29173O479P829Q070Q110R152J0947J2565J4110J6258J8623K0026K0012
54741B81354J8801J6120J1481N492m73n877j1091j5834j8960k0002j9822j9352
54729B21837j8655j7555j6202j4667j2725j0511q711p740p209o546n660m772l963
54716H6921l155k310j522j076j261j832j971j205q3N48O32O58O47K37m02n96j82
54699G4048K15J23k90o81r12q28k75M31O50K58j11O9N45O99L25k18m48k04K77
54680G3673O89J044J528J888J534N18j86J08Q06R84Q49J343K565L599L911L849
54664I8702L635K918J698Q17R11J445J483R48N92Q77J441J657J349Q37N00M58
54648A20268P11J379K521L766M510M693N006O001P362Q446R244J0285J1731J3131
$$ plain form
54753 129173 135652 143481 151551 159661 168813 179760 192325 206435 222693 241316 261342 281354
54741 281354 300155 316275 327756 333248 332775 326898 315807 299973 281013 261011 241189 221837
54729 221837 203182 185627 169425 154758 142033 131522 122811 115071 107862 101316 95656 90884 86921
54716 86921 83766 81456 79934 78858 77597 75765 73794 72589 72506 73054 73686 74344 74991 75228 74826 74230 74048
54699 74048 74263 74386 74096 73415 72503 71675 71400 71831 72481 72739 72628 72697 73242 73941 74266 74048 73600 73396 73673
54680 73673 74362 75406 76934 78822 80356 80874 80688 80796 81602 82586 83435 84778 87343 90942 94853 98702
54664 98702 102337 105255 106953 107770 108681 110126 111609 112557 113149 114026 115467 117124 118473 119310 119810 120268
54648 120268 120979 122358 124879 128645 133155 137848 142854 148855 156217 164663 173907 184192 195923 209054
54634B09054J3990J4168J3750J2877J1595R585O256J541l556p714j0448j2194
54622B58904j3412j4105j4098j3302j1787r965q558p935p614o924n904n088m589
54609A35623l998l154k368j910j749j828k133k460k564k513k571k778l004l252
54595I9341l517l522l089k524k212k039j734j472j513j549j113n34n90j288j736
54580G0909j395p66o28j130j783k020j634j031q69j236j478j209r98j364j692
54565E1676j079J18P04L97k0j66m76r80r59j91N79Q24Q78R93Q16L10J99P92J307
54546E5722J081O53Q29J407J683J645J732J965K098K295K770L133K925K591K969
54531H5498M000M749M790M693N027N546N712N531N440N579N530M757L190J309
$$ plain form
54634 209054 223044 237212 250962 263839 275434 285019 291275 292816 289260 281546 271098 258904
54622 258904 245492 231387 217289 203987 192200 182235 173677 165742 158128 151204 145300 140212 135623
54609 135623 131625 128471 126103 124193 122444 120616 118483 116023 113459 110946 108375 105597 102593 99341
54595 99341 95824 92302 89213 86689 84477 82438 80704 79232 77719 76170 75057 74523 73933 72645 70909
54580 70909 69514 68748 68120 66990 65207 63187 61553 60522 59653 58417 56939 55730 54732 53368 51676
54565 51676 50597 50715 51419 51816 51796 51630 51154 50174 49215 49024 49603 50427 51305 52298 53114 53424 53623 54415 55722
54546 55722 56803 57456 58285 59692 61375 63020 64752 66717 68815 71110 73880 77013 79938 82529 85498
54531 85498 89498 94247 99037 103730 108757 114303 120015 125546 130986 136565 142095 146852 150042 151351
54517A51351l70j832l401n088o390o935o893o563n899m866l964l818m266m478
54503H6588m087l689l869m150l493j744qO12K27k68m09m28m29p9P09J414J541
54486F8438J154N03l40j061r75L8J003J024N96Q55J745J973Q94n50j073n09L63
54469G4078Q52Q16M80K01J92L28L54K57K21K76L82O11Q59O12m31j633k004j436
54451G5015o95k90j22j86o56j184j054l15J30j44m83l04K2n7l93n94p40j016j192
54432F5742j021o64k88K38P66O85r0o31j90N70M02p93j877j942j163k86J37O1
54414E9656m3M02J367K106K144J955K136K317J714N67J23J095K780L945M048L397
54398H9709K621K322K790L710M323M120L268K200J058k30j467k200k221j825j451
$$ plain form
54517 151351 150981 149149 145748 140660 134270 127335 120442 113879 107980 103114 99150 95332 91066 86588
54503 86588 82501 78812 74943 70793 67300 65556 65548 66160 66387 66119 65710 65282 64853 64774 65483 66897 68438
54486 68438 69592 70095 69755 68694 67719 67757 68760 69784 70380 71235 72980 74953 75847 75297 74224 73715 74078
54469 74078 74930 75746 76226 76427 76619 76947 77301 77558 77779 78055 78437 79048 79907 80519 80088 78455 76451 75015
54451 75015 74320 74030 73908 73722 73066 71882 70828 70513 70643 70499 70016 69712 69734 69677 69284 68690 67950 66934 65742
54432 65742 64721 64057 63769 64007 64773 65458 65368 64737 64547 65117 65519 64726 62849 60907 59744 59458 59595 59656
54414 59656 59613 60015 61382 63488 65632 67587 69723 72040 73754 74321 74444 75539 78319 82264 86312 89709
54398 89709 92330 94652 97442 101152 105475 109595 112863 115063 116121 115891 114424 112224 110003 108178 106727
54383A06727j271j260j505k060k628k756k389j969j867k010k168k189j862j011
54369G9782K5N06K13k38l32k93l45p9O86J099M10o50p99j54Q8k96k96M84J148
54350H0959J088Q96J196J690J978K250K534K320J597J298J941K714K683K072J584
54335A08800J300J027R23R31L98q68j885j869j571k127l208l588l072k625k758
54320H9808l016l007k856k647k332k143k295k367j796r21o29j042j418j343j128
54305F0868r89o91k06N0j32n13r11j335j546j169l97j7m30j160j508j226m94L50
54287D8544R01Q85M56L8q5J99Q99J625J553L11j227j719q46M80J344J538J190
54270E6086M65k32l99k3M10N24K99j81o37m50O83J938K041Q84k65m22M1K72J01
$$ plain form
54383 106727 105456 104196 102691 100631 98003 95247 92858 90889 89022 87012 84844 82655 80793 79782
54369 79782 79807 80313 80526 80288 79956 79663 79318 79239 79925 81024 81434 80784 79985 79831 79919 79623 79327 79811 80959
54350 80959 82047 82943 84139 85829 87807 90057 92591 94911 96508 97806 99747 102461 105144 107216 108800
54335 108800 110100 111127 112050 112981 113379 112511 110626 108757 107186 105059 101851 98263 95191 92566 89808
54320 89808 86792 83785 80929 78282 75950 73807 71512 69145 67349 66428 65799 64757 63339 61996 60868
54305 60868 59879 59188 58982 59032 58900 58387 57476 56141 54595 53426 53029 53012 52582 51422 49914 48688 48194 48544
54287 48544 49445 50330 50786 50824 50739 50938 51837 53462 55015 55326 54099 52380 51534 52014 53358 54896 56086
54270 56086 56551 56319 55920 55897 56307 56831 57130 56949 56312 55862 56545 58483 60524 61408 61143 60721 60762 61034 61135
54251F1135j63m54q55j180j154p92k47M90J369K042K191J912J522J099N43Qj14
54234F7352L24R37J156Q08K87J3r1l38o45n70p8K57P5k73m09n38q63q97j69P63
54214F7101R02K08m59o70q28j099r80k41N02O23K61j05l69n98o00j42N66R78O65
54195F5715l32j445j901j447p13n04p76q41m78j60j22L9N63J031J016O79L39j2
54177F0651l83m73j44K63M97Q10J333J515P89m79j369j544j468j570j723j545
54161E5160q43K19J136J330P89K45L78Q43O86l19j261j267o28l57q97j673j891
54144E1650j356m67L38Q17Q49M69p2n30r17j245j161l03R03J397P64j94n95o28
54126D9719r21j223p15M60J076M58n87r17m37J48M50N53M65J4p07j260j270o74
$$ plain form
54251 61135 60972 60518 59663 58483 57329 56537 56290 56780 58149 60191 62382 64294 65816 66915 67458 67466 67352
54234 67352 67676 68613 69769 70577 70864 70877 70786 70448 69803 69233 69155 69412 69487 69214 68805 68267 67404 66507 66338 67101
54214 67101 68003 68211 67752 67082 66254 65155 64175 63934 64436 65059 65320 65215 64846 64248 63648 63506 64072 65050 65715
54195 65715 65383 63938 62037 60590 59877 59373 58597 57756 57278 57118 56996 57035 57598 58629 59645 60324 60663 60651
54177 60651 60268 59795 59651 59914 60411 61221 62554 64069 64858 64379 63010 61466 59998 58428 56705 55160
54161 55160 54317 54536 55672 57002 57791 58036 58414 59257 59943 59624 58363 57096 56468 56111 55214 53541 51650
54144 51650 50294 49827 50165 50982 51831 52300 52228 51698 50781 49536 48375 48072 48975 50372 51136 50942 50347 49719
54126 49719 48798 47575 46860 47320 48396 48854 48267 47350 46913 47061 47511 48064 48529 48543 47836 46576 45306 44632
54108D4632L49J371J803J329L54l01k10K88O54Q20J142J725K137J918J202N23
54092E9736J32j84n39o70m32j55j28j01K34N34K11n52r11n18M3K31K84O41J105
54073E8961J170R10R40J489J989J797R65R4l69m26k19J61M58K64m00p96k72Q01
54055F7517J415J239Q89Q41Q73Q48J160J897K258J692R92J388K848M172M587M385
54039I9001M125M000M036M143L983L493L383M339N765O295N635M965N230N951
54025A64344O118N519M690M079L747L466K845J723N64L5J11J98J76N35J316J721
54009B01187J125k39j933l850n643o462n980n046m599m495m081l488l433m002
53995A49061m445m138l148j910q95n50j013j837k285k046j340n09K59P76P75J56
$$ plain form
54108 44632 44981 46352 48155 49484 49838 49537 49327 49615 50269 51089 52231 53956 56093 58011 59213 59736
54092 59736 59868 59684 59145 58475 58043 57888 57760 57659 57893 58427 58638 58086 57175 56657 56700 56931 57215 57856 58961
54073 58961 60131 61041 61981 63470 65459 67256 68221 68315 67946 67520 67301 67462 67920 68184 67784 66988 66716 67517
54055 67517 68932 70171 71060 71901 72774 73622 74782 76679 78937 80629 81621 83009 85857 90029 94616 99001
54039 99001 103126 107126 111162 115305 119288 122781 126164 130503 136268 142563 148198 153163 158393 164344
54025 164344 170462 175981 180671 184750 188497 191963 194808 196531 197095 197130 197241 197439 197615 198150 199466 201187
54009 201187 202312 202073 200140 196290 190647 184185 178205 173159 168560 164065 159984 156496 153063 149061
53995 149061 144616 140478 137330 135420 134525 133975 132962 131125 128840 126794 125454 124945 125204 125980 126755 126911
53979A26911p07j083n04N91J077L52r12j577j435j119r25m95K20O51M92J08k54
53962A21391q15j434j330l15N40K80n54p94l32N0J28L81Q48Q74K20m08k47O90
53944A19173J817K624K953L023L261L858M495M813M933N132N230M786L925L324
53930A73347L292L338K871J933J075O45N05L39J06J58Q38K011L137L844M198M403
53914B06040M499M565M801N200N445N479N822O885Q112Q367P176N209L488K399
53900B83487J610O99l82j394k162k655k732k222j424j192k027l372m330m904n734
53885B51266o733o993o249n482n558o070o188n878n590n306m751m133l953m274
53871A74108m761n168n240m557l135j850j547j995k369k465k718l229l604l632
$$ plain form
53979 126911 126204 125121 124617 125208 126285 126637 125725 124148 122713 121594 120669 120174 120394 121045 121537 121645 121391
53962 121391 120576 119142 117812 117497 118037 118317 117763 116969 116637 116687 116815 117196 118044 118918 119138 118730 118483 119173
53944 119173 120990 123614 126567 129590 132851 136709 141204 146017 150950 156082 161312 166098 170023 173347
53930 173347 176639 179977 182848 184781 185856 186501 187006 187345 187451 187609 188447 190458 193595 197439 201637 206040
53914 206040 210539 215104 219905 225105 230550 236029 241851 248736 256848 265215 272391 277600 281088 283487
53900 283487 285097 285796 285414 284020 281858 279203 276471 274249 272825 271633 269606 266234 261904 257000 251266
53885 251266 244533 237540 231291 225809 220251 214181 207993 202115 196525 191219 186468 182335 178382 174108
53871 174108 169347 164179 158939 154382 151247 149397 147850 145855 143486 141021 138303 135074 131470 127838
53857A27838l442l018k259j472j165j272j319j208j268j538j675j657j778j930
53843A02837j590p96l32o29j064q63k27M4k54n28l37j8j04m04j93O89J385J092
53825I8708K03j93J22K74k43p61n98j31o3k24rM40M96K25L28J020J812K413K977
53806A06796L390L228K632K438L056L847M025L703L584M022M777N460N891O090
53792A62939O133O018N635M923L984K936J826Q69N83J285K523L316K979J604j34
53777B07419j477k110k383k854l485l673l233k808k964l397l526l334l043k528
53763A66604j777j460k143l254l684l246k659k295j889j401j201j307j313j201
53749A37774j374j804j948j713j686k177k682k657k153j519r78p01p55q50o20
$$ plain form
53857 127838 124396 121378 119119 117647 116482 115210 113891 112683 111415 109877 108202 106545 104767 102837
53843 102837 101247 100451 100119 99490 98426 97563 97336 97380 97126 96598 96261 96243 96139 95735 95542 96231 97616 98708
53825 98708 98911 98718 98840 99114 98871 98110 97512 97381 97318 97094 97085 97525 98021 98246 98574 99594 101406 103819 106796
53806 106796 110186 113414 116046 118484 121540 125387 129412 133115 136699 140721 145498 150958 156849 162939
53792 162939 169072 175090 180725 185648 189632 192568 194394 195263 195846 197131 199654 202970 205949 207553 207419
53777 207419 205942 203832 201449 198595 195110 191437 188204 185396 182432 179035 175509 172175 169132 166604
53763 166604 164827 163367 161224 157970 154286 151040 148381 146086 144197 142796 141595 140288 138975 137774
53749 137774 136400 134596 132648 130935 129249 127072 124390 121733 119580 118061 117083 116382 115627 114777 114157
53734A14157k28j32k92k82j17k19n03l11N17J306J488J208P55J55m28n52j48K70
53716A16644L69M08O98J181J707K123K125J641J420K322L879M565L767K499J783
53701A47131J414Q77M57O24J105J436J807K550L274L411L187L284L739L931L481
53686A81708K652J931J618J652J589J015J42l48k19Q8K63N59J062J276R02L93
53670A96283K67L76L36J50o1l76p08p59p29j247k087j923k45J407J273k74j386
53653A90297j316r24q76p97l82j56n29r74p11K62J261J683J477J054Q58R32R36
53636A92095O62K84o6n20r81q51J21J217J576J394J501K004K149J607J040J190
53620B04422J910K461K400J951J627J648J782J825K094L009M222M796M509M294
$$ plain form
53734 114157 113929 113797 113505 113223 113106 112887 112384 112073 112590 113896 115384 116592 117347 117502 117074 116522 116374 116644
53716 116644 117013 117421 118119 119300 121007 123130 125255 126896 128316 130638 134517 139082 142849 145348 147131
53701 147131 148545 149422 149879 150503 151608 153044 154851 157401 160675 164086 167273 170557 174296 178227 181708
53686 181708 184360 186291 187909 189561 191150 192165 192307 191959 191740 191828 192091 192650 193712 194988 195890 196283
53670 196283 196550 196926 197262 197412 197351 196975 196267 195508 194779 193532 191445 189522 189277 190684 191957 191683 190297
53653 190297 188981 188057 187181 186384 186002 185846 185317 184343 183632 183894 185155 186838 188315 189369 190227 191159 192095
53636 192095 192757 193041 192975 192455 191474 190623 190744 191961 193537 194931 196432 198436 200585 202192 203232 204422
53620 204422 206332 208793 211193 213144 214771 216419 218201 220026 222120 225129 229351 234147 238656 242950
53606B42950M883N680N683M948M355M358M744N293N809N802N019M081L805M083
53592C11493M250M298M689N138M726L395K226J919K006J894J811K128K457K075
53578C54505Q79n26j450j544r29j32L53N06N58M41k7o08q40q52j200j846k079
53561C45209j623j080r44q72l53M69J080J228Q59J6q51r85k12O93R71P74O35N71
53543C45585L11Q4L97J187J843K046K054K115K101J934J926K354K927K995K388
53528C72247J808K162L532N097O155O910P887Q949R503R570R902J0839J1738J1972
53514D78271J1900J2307J3223J3922J4004J3926J4367J5477J6878J8114J9008
53503F41397J9651K0242K0874K1524K2191K2895K3590K4207K4823K5615K6526
$$ plain form
53606 242950 247833 253513 259196 264144 268499 272857 277601 282894 288703 294505 299524 303605 307410 311493
53592 311493 315743 320041 324730 329868 334594 337989 340215 342134 344140 346034 347845 349973 352430 354505
53578 354505 355384 354858 353408 351864 350935 350803 351156 351662 352220 352661 352634 352026 351186 350334 349134 347288 345209
53561 345209 343586 342506 341562 340690 340337 340806 341886 343114 343973 343989 343138 342153 341941 342634 343605 344379 345014 345585
53543 345585 345896 345980 346377 347564 349407 351453 353507 355622 357723 359657 361583 363937 366864 369859 372247
53528 372247 374055 376217 379749 384846 391001 397911 405798 414747 424250 433820 443722 454561 466299 478271
53514 478271 490171 502478 515701 529623 543627 557553 571920 587397 604275 622389 641397
53503 641397 661048 681290 702164 723688 745879 768774 792364 816571 841394 867009 893535
53492H93535K7176K7266K6905K6395K5872K5380K5174K5601K6550K7199K6702
53481A183755K5174K3821K3768K4843K5796K5783K5126K4479K3763K2518K0897
53470A449723J9563J8769J8188J7652J7290J6807J5417J2931J0249Q354P196O031
53458A618170M387K240l36l077n409p081q706j0997j3572j5256j5660j5735j6454
53445A512514j7667j8670j9421k0493k2054k3569k4506k4820k4664k4132k3516
53434A269002k3325k3672k3993k3710k2920k1918k0389j7784j4465j1688j0177
53423A054961r342q312p124o304n752m824l370j944r14K5J301K931M721O620Q566
53408A031239J0342J1827J3306J5202J7545J9828K1460K2418K3342K4909K7037
$$ plain form
53492 893535 920711 947977 974882 1001277 1027149 1052529 1077703 1103304 1129854 1157053 1183755
53481 1183755 1208929 1232750 1256518 1281361 1307157 1332940 1358066 1382545 1406308 1428826 1449723
53470 1449723 1469286 1488055 1506243 1523895 1541185 1557992 1573409 1586340 1596589 1604943 1612139 1618170
53458 1618170 1622557 1624797 1624461 1621384 1615975 1608894 1600188 1589191 1575619 1560363 1544703 1528968 1512514
53445 1512514 1494847 1476177 1456756 1436263 1414209 1390640 1366134 1341314 1316650 1292518 1269002
53434 1269002 1245677 1222005 1198012 1174302 1151382 1129464 1109075 1091291 1076826 1065138 1054961
53423 1054961 1045619 1037307 1030183 1023879 1018127 1013303 1009933 1007989 1007075 1007100 1008401 1011332 1016053 1022673 1031239
53408 1031239 1041581 1053408 1066714 1081916 1099461 1119289 1140749 1163167 1186509 1211418 1238455
53397A238455K8950L0154L1044L2340L4249L6523L9013M1613M3872M5280M6052
53386A647545M7046M8808N1020N3030N4544N5694N6714N7729N8587N8850N8221
53375B247788N6938N5601N4556N3769N3007N1817M9525M5857M1477L7306L3341
53364B780982K8842K3664J8614J4288J0412O596K947o09m780r958j5381k0000
53352B835617k3801k7573l1652l5626l9120m2219m5151m8062n1022n3719n5248
53341B382424n4881n3082n1215n0208m9898m9680m9286m8733m8013m7135m6182
53330A834111m5117m3826m2442m1302m0384l9159l7224l4827l2528l0487k8422
53319A418393k6025k3185k0010j7004j5107j4990j6184j7322j7488j6952j6289
$$ plain form
53397 1238455 1267405 1297559 1328603 1360943 1395192 1431715 1470728 1512341 1556213 1601493 1647545
53386 1647545 1694591 1743399 1794419 1847449 1901993 1957687 2014401 2072130 2130717 2189567 2247788
53375 2247788 2304726 2360327 2414883 2468652 2521659 2573476 2623001 2668858 2710335 2747641 2780982
53364 2780982 2809824 2833488 2852102 2866390 2876802 2883398 2886345 2885736 2880956 2870998 2855617 2835617
53352 2835617 2811816 2784243 2752591 2716965 2677845 2635626 2590475 2542413 2491391 2437672 2382424
53341 2382424 2327543 2274461 2223246 2173038 2123140 2073460 2024174 1975441 1927428 1880293 1834111
53330 1834111 1788994 1745168 1702726 1661424 1621040 1581881 1544657 1509830 1477302 1446815 1418393
53319 1418393 1392368 1369183 1349173 1332169 1317062 1302072 1285888 1268566 1251078 1234126 1217837
53308A217837j5285j3336j0782q889q278q073p110n437l934k827j463M45K219
53295A135087L132L375L699M579O009P841R855J1769J3498J5295J7354J9465K1306
53282A272264K2907K4457K5870K6831K7228K7204K6783K5840K4486K3146K2083
53271A549099K1048J9624J7794J5916J4149J2219R903P507N537L967K263J91j836
53258A677381l498n197p492j0205j2633j4520j6222j7992j9734k1531k3686k5976
53246A498695k7562k8056k8081k8344k8669k8559k8236k8343k8791k8747k7829
53235A187478k6611k5721k5054k4226k3296k2531k1740k0493j9004j8187j8515
53224I42100j9188j8988j7784j6643j6331j6242j5255j3223j1063r520q510p738
$$ plain form
53308 1217837 1202552 1189216 1178434 1169545 1161267 1153194 1146084 1140647 1136713 1133886 1132423 1132868 1135087
53295 1135087 1138219 1141594 1145293 1149872 1155881 1163722 1173577 1185346 1198844 1214139 1231493 1250958 1272264
53282 1272264 1295171 1319628 1345498 1372329 1399557 1426761 1453544 1479384 1503870 1527016 1549099
53271 1549099 1570147 1589771 1607565 1623481 1637630 1649849 1659752 1667259 1672796 1676763 1679026 1679217 1677381
53258 1677381 1673883 1668686 1661194 1650989 1638356 1623836 1607614 1589622 1569888 1548357 1524671 1498695
53246 1498695 1471133 1443077 1414996 1386652 1357983 1329424 1301188 1272845 1244054 1215307 1187478
53235 1187478 1160867 1135146 1110092 1085866 1062570 1040039 1018299 997806 978802 960615 942100
53224 942100 922912 903924 886140 869497 853166 836924 821669 808446 797383 787863 779353 771615
53212G71615p372p765q805r907j0510j0518j0357j0612j1430j2235j2357j1912
53200F47835j1694j2080j2520j2267j1335j0375r869r724r552r191q933r278j0304
53187E10713j1373j1732j1398j1107j1316j1685j1646j1017r978q808p925p680
53175C85048p889p870p320o718o557o610o323n676n175n176n513n707n387m662
53161B98465m143m299m703m465l514k812k990l527l741l881m467n104m956l980
53147B41883k838j809p86k26r03k563l747l459k273j381j204j386j647j987k299
53132B13375k309j931j399j077j246j892k569k636j801m09Q75J545J459P92j08
53117B00669r62j734k498l123l270k807k046j513j477j725j727j138k32K73k7
$$ plain form
53212 771615 764243 756478 747673 737766 727256 716738 706381 695769 684339 672104 659747 647835
53200 647835 636141 624061 611541 599274 587939 577564 567695 557971 548419 539228 530295 521017 510713
53187 510713 499340 487608 476210 465103 453787 442102 430456 419439 409461 400653 392728 385048
53175 385048 377159 369289 361969 355251 348694 342084 335761 330085 324910 319734 314221 308514 303127 298465
53161 298465 294322 290023 285320 280855 277341 274529 271539 268012 264271 260390 255923 250819 245863 241883
53147 241883 239045 237236 236450 236224 235321 232758 229011 225552 223279 221898 220694 219308 217661 215674 213375
53132 213375 211066 209135 207736 206659 205413 203521 200952 198316 196515 196106 196981 198526 199985 200777 200669
53117 200669 199707 197973 195475 192352 189082 186275 184229 182716 181239 179514 177787 176649 176417 176690 176663
53102A76663p23j022n94J30N16L51ol6M17R75J183J123J310J975K713L035K928
53085A90938K643K213J542P64J96l1j17m56j314k460l117k761j987j939k744l285
53069A78085k930k560l097l858l522k195j273j416j929k187k432k891l174k966
53055A41655k538k106j497q14n95r14j107q91r24j618k166j690o81l40q07j060
53039A21907n00L37P91R03R32P26P5o93j019r16j005j660k435k576j987j332j170
53022A10378j287j177q18o12o69o22k47K10M20M09L66L60M00N03N49K15o44j681
53004A06053k217j782n28P63J228P34M7q3K23L67K95N11J135J631J629J385J167
52987A12558Q06K40q3J85O73P39L26j03k50k36l77q68j520j652o70R82J966J566
$$ plain form
53102 176663 175940 174918 174324 174454 174970 175321 175315 175279 175696 176671 177854 178977 180287 182262 184975 188010 190938
53085 190938 193581 195794 197336 198100 198296 198265 198148 197692 196378 193918 190801 188040 186053 184114 181370 178085
53069 178085 175155 172595 169498 165640 162118 159923 158650 157234 155305 153118 150686 147795 144621 141655
53055 141655 139117 137011 135514 134700 134105 133191 132084 131193 130269 128651 126485 124795 124114 123774 122967 121907
53039 121907 121407 121744 122535 123438 124370 125096 125171 124478 123459 122543 121538 119878 117443 114867 112880 111548 110378
53022 110378 109091 107914 107096 106484 105815 105193 104946 105156 105576 105985 106351 106711 107111 107614 108163 108378 107734 106053
53004 106053 103836 102054 101526 102289 103517 104251 104298 104215 104438 104805 105100 105611 106746 108377 110006 111391 112558
52987 112558 113364 113604 113521 113706 114379 115118 115444 115341 115091 114855 114478 113610 112090 110438 109768 110750 112716 114282
52969A14282O21M73J288K065K025J350N99Q0o6K43Q55J323J288P55M3m29l11L96
52951A26880J264J769J789J650J798K473L591M729N336N144M324L221K069J087
52937A67124N21M67Q22J514K480L289L250K232R85K91Q6j64n94r57j182j378j440
52920A77346j225r82j053j258j153q07o71q04q55q41j170j725j747r19L5L21J28
52903A62620J18L38K76k11n89l54L56R74J061O19J7l62l75o4N29J251J614J153
52885A68971J40m83j84N04P39M52J63K0l31q66r18j08R31J205N05n21j204j353
52867A67662r96j71Q01J271Q63M1l26N9O99J078J228J339J178M07o96j305j041
52850A72091m31j35m7M07J302K015K057J670J360J229R96N76K51K84N69P21L74
$$ plain form
52969 114282 114903 115376 116664 118729 120754 122104 122703 122783 122717 122960 123815 125138 126426 127181 127224 126795 126484 126880
52951 126880 128144 129913 131702 133352 135150 137623 141214 145943 151279 156423 160747 163968 166037 167124
52937 167124 167645 168112 168934 170448 172928 176217 179467 181699 182684 182975 183061 182897 182303 181346 180164 178786 177346
52920 177346 176121 175139 174086 172828 171675 170868 170197 169393 168538 167697 166527 164802 163055 162136 162171 162492 162620
52903 162620 162738 163076 163352 163141 162552 162198 162554 163528 164589 165208 165225 164863 164488 164424 164953 166204 167818 168971
52885 168971 169111 168628 168444 168948 169687 170139 170302 170322 169991 169125 168207 168099 169030 170235 170740 170219 169015 167662
52867 167662 166666 166495 167296 168567 169430 169471 169145 169204 169903 170981 172209 173548 174726 175133 174437 173132 172091
52850 172091 171660 171525 171478 171885 173187 175202 177259 178929 180289 181518 182514 183090 183341 183625 184194 184915 185289
52833A85289m85j376j609r86j29K18R9J44N08N95Q2m45l13K22M49L47N16J108
52815A84234J541J410J029P99N70oq97j719k157k138j873j788k113k461k263j663
52799A70505j470k011k602k577k247k337k868l246l178k914k679k452k218j988
52785A35718j650j169q27q71j073j124j175j508j842j650j038o05n30n50q03j739
52769A17564k940l081j620J95P52m8j046j446j423j338j235j127j168j376j634
52754I9029j952k335k472k079j550j625k307k674k070r78l05k49l59m07o19j053
52738G5995j336j148o41j70J28L07M13N13P15R65R51N02mO5P97J523J504O38n90
52719H1127j684k394k606k310j674j007n57m04m92o32o21m82m82p19p98k86N61
$$ plain form
52833 185289 184804 183428 181819 180833 180704 180922 181021 181165 181673 182268 182350 181905 181592 181814 182263 182610 183126 184234
52815 184234 185775 187185 188214 189013 189583 189577 188680 186961 184804 182666 180793 179005 176892 174431 172168 170505
52799 170505 169035 167024 164422 161845 159598 157261 154393 151147 147969 145055 142376 139924 137706 135718
52785 135718 134068 132899 132072 131201 130128 129004 127829 126321 124479 122829 121791 121186 120656 120106 119303 117564
52769 117564 114624 111543 109923 110118 110870 110822 109776 108330 106907 105569 104334 103207 102039 100663 99029
52754 99029 97077 94742 92270 90191 88641 87016 84709 82035 79965 78987 78682 78433 78074 77667 77048 75995
52738 75995 74659 73511 72870 72700 72828 73135 73548 74061 74776 75741 76692 77194 77190 77255 78052 79575 81079 81717 81127
52719 81127 79443 77049 74443 72133 70459 69452 68895 68491 67999 67367 66746 66264 65782 65063 64265 63979 64540
52702F4540R54N70m3k53j30j06j97l3M46Q71R99R86J075J311J632J859J684R90
52684G7155L05L60J069J500J128O18Q45J629K057J759J172O85L49L77J088K140
52668I4236K581K061J359J242J385J049L10j26j02j74o68j197j311j099r33j032
52652I7581j382j844k191k283k229k164j898j152j41M81L59k14p24r68j064j203
52636G8964j416j420q03L08J005O07k46l18L90M73p85k181k151q93J19K26J22
52619G2001L56N02J00m26l92J10M07J93j61k17j9Q3p2k37q1M02Q45R31P67P56
52599G5848J090J488J432P13k14n45L4Q62J019M72R9M18Q86Q03M05M63J070J599
52581H7942J676J520J304Q98M57N22J199J753J590J132J191J713J903J488J170
$$ plain form
52702 64540 65494 66064 66021 65768 65638 65532 65335 65302 65748 66619 67618 68604 69679 70990 72622 74481 76165 77155
52684 77155 77460 77820 78889 80389 81517 82135 82980 84609 86666 88425 89597 90282 90631 91008 92096 94236
52668 94236 96817 98878 100237 101479 102864 103913 104223 104097 103995 103821 103153 101956 100645 99546 98613 97581
52652 97581 96199 94355 92164 89881 87652 85488 83590 82438 82297 82778 83137 82923 82199 81231 80167 78964
52636 78964 77548 76128 75325 75633 76638 77245 76999 76681 77071 77544 76759 74578 72427 71534 71653 71879 72001
52619 72001 72357 72859 72959 72533 72141 72251 72658 72851 72690 72473 72454 72537 72465 72228 72147 72549 73394 74325 75092 75848
52599 75848 76938 78426 79858 80571 80357 79812 79846 80708 81727 82199 82298 82716 83602 84405 84810 85273 86343 87942
52581 87942 89618 91138 92442 93340 93797 94319 95518 97271 98861 99993 101184 102897 104800 106288 107458
52566A07458J506J995J803J061P56J316J947J709P96K02L73Q01R16Q14Q59J059
52550A25371J175J120R35O59M45N75J000J172P37J01m5M32J123J756K247K272
52534A41075J464J63o55m53K93Q07Q76P71O80N73M59M23M69N22N11M02K19R7J39
52515A48835K00j8n16r24r49p53p09r59j374j748j910j691j085l53J58L57M75
52498A37036P45J091J177P97J49l39m45k67K5L80P15Q61Q56J056J662K280K353
52481A50132J875J319R18M96K6j29K04O52P53N35L82M87O84O37O5r44j758j596
52463A54738m39P27R26L44l2J58J79o10j658j826r19K3Q4m78p71m69L7M34P71
52444A51219R90Q24L09p2k8J91K93L36L18p8q54j318r20j57R3k27m75m32m61o19
$$ plain form
52566 107458 108964 110959 112762 113823 114579 115895 117842 119551 120347 120549 120922 121723 122639 123453 124312 125371
52550 125371 126546 127666 128601 129260 129705 130280 131280 132452 133189 133290 133245 133677 134800 136556 138803 141075
52534 141075 142539 142702 142047 141594 141887 142694 143570 144341 145021 145594 146053 146476 146945 147467 147978 148380 148599 148696 148835
52515 148835 149035 149017 148501 147577 146628 145875 145166 144207 142833 141085 139175 137484 136399 136046 136204 136561 137036
52498 137036 137781 138872 140049 140846 140995 140656 140211 139944 139969 140349 141064 141925 142781 143837 145499 147779 150132
52481 150132 152007 153326 154244 154740 154766 154637 154841 155493 156246 156781 157163 157650 158334 158971 159036 158092 156334 154738
52463 154738 154299 155026 155952 156296 156264 156422 156601 155991 154333 152507 151588 151611 151695 151217 150446 149977 150014 150448 151219
52444 151219 152209 153033 153342 153270 153242 153433 153726 154062 154380 154302 153448 152130 151210 151053 151146 150919 150444 150012 149551 148932
52424A48932m94p6P7j64j43N06J109Q62l2o71o12j11M93J071J475J506J202Q89
52406A55819Q75J208J655J864J629J126P06M02m2o33r40p37m17n02q92j037o71
52389A59413q1L49N66P57J067J413J522J177M42k95o09l32K73O42M03q3N8J176
52371A67858K489K940K465J923J963K508L270M019M261L551K315J651J889K168
52357B05270J818J414J776K585K871K442J953J843J965K114K185J969J449J192
52343B32846J742K714L218L076K895K877K527J699J144J533K487L093K913K189
52329B66953J396J032J455K448L196L156K732K705L165L518L519L681M473N580
52315C09009O363O767P331Q280R144R494R624J0078J0762J1116J1117J1496J2660
$$ plain form
52424 148932 148438 148362 148439 148275 148132 148638 149747 150609 150577 149906 149294 149183 149676 150747 152222 153728 154930 155819
52406 155819 156694 157902 159557 161421 163050 164176 164882 165284 165242 164609 163669 162932 162515 162013 161121 160084 159413
52389 159413 159332 159681 160247 161004 162071 163484 165006 166183 166625 166330 165721 165389 165662 166304 166707 166624 166682 167858
52371 167858 170347 173287 175752 177675 179638 182146 185416 189435 193696 197247 199562 201213 203102 205270
52357 205270 207088 208502 210278 212863 215734 218176 220129 221972 223937 226051 228236 230205 231654 232846
52343 232846 234588 237302 240520 243596 246491 249368 251895 253594 254738 256271 258758 261851 264764 266953
52329 266953 268349 269381 270836 273284 276480 279636 282368 285073 288238 291756 295275 298956 303429 309009
52315 309009 315372 322139 329470 337750 346894 356388 366012 376090 386852 397968 409085 420581 433241
52302D33241J3974J4609J4698J5105J6129J7198J7841J8282J8826J9139J8690
52291F17732J7652J6847J6794J7251J7734J8071J8156J7569J5997J3967J2515
52280H00285J1945J1395R980Q005O487N772N204M048K211M5j926l050k983k280
52266H55138k001k493l093l249l235l461l702l505k858j930p01O18J376J392J542
52251H29838K728M577O068P038Q139R465J0345J0602J0950J1867J2801J3018J2576
52238I50012J2074J1849J1799J1663J1191J0300R270Q438P654O453M835L387K423
52225A061348J534K65j215k516l694n050o535p774q590r151r672j0267j0940j1527
52211I76216j1668j1181j0419r999j0113j0282r927r040q150p643p342o881o230
$$ plain form
52302 433241 447215 461824 476522 491627 507756 524954 542795 561077 579903 599042 617732
52291 617732 635384 652231 669025 686276 704010 722081 740237 757806 773803 787770 800285
52280 800285 812230 823625 833605 841610 848097 853869 859073 863121 865332 865377 863451 860401 857418 855138
52266 855138 853137 850644 847551 844302 841067 837606 833904 830399 827541 825611 824910 825528 826904 828296 829838
52251 829838 832566 837143 843211 850249 858388 867853 878198 888800 899750 911617 924418 937436 950012
52238 950012 962086 973935 985734 997397 1008588 1018888 1028158 1036596 1044250 1050703 1055538 1058925 1061348
52225 1061348 1062882 1063147 1061932 1059416 1055722 1050672 1044137 1036363 1027773 1018622 1008950 998683 987743 976216
52211 976216 964548 953367 942948 932949 922836 912554 902627 893587 885437 877794 870452 863571 857341
52198H57341n549m687l397k078j633k156k467j550J3Q38O45L67N24O38M16L94
52182H37659P78O09r46l068m006l155j616p04o36q88j207j718k362k752k662k363
52166H10963k295k537k825l031l345l902m489m762m591m040l273k646k576k992
52152G63659l275l059k841l235l981m254l797l152k806k803l100l639l958l499
52138G16260k431j555j262j231j212j401j817k092k157k395k846l012k792k812
52124F87245l352l753l438k705j946q92N72J723K047K277L274M499M904M838N689
52109G00982P652R439J0351J1248J2903J4667J5563J5840J6541J8041J9853K1517
52097H74597K2902K3851K4195K4118K4019K3961K3604K2693K1379J9960J8569
$$ plain form
52198 857341 851792 847105 843708 841630 839997 837841 835374 833824 833837 834675 835320 835687 836211 836849 837265 837659
52182 837659 838437 839046 838100 835032 831026 827871 826255 825551 824915 824027 822820 821102 818740 815988 813326 810963
52166 810963 808668 806131 803306 800275 796930 793028 788539 783777 779186 775146 771873 769227 766651 763659
52152 763659 760384 757325 754484 751249 747268 743014 739217 736065 733259 730456 727356 723717 719759 716260
52138 716260 713829 712274 711012 709781 708569 707168 705351 703259 701102 698707 695861 692849 690057 687245
52124 687245 683893 680140 676702 673997 672051 671159 671731 673454 675501 677778 681052 685551 690455 695293 700982
52109 700982 708634 718073 728424 739672 752575 767242 782805 798645 815186 833227 853080 874597
52097 874597 897499 921350 945545 969663 993682 1017643 1041247 1063940 1085319 1105279 1123848
52086A123848J7138J5603J3977J2267J0397Q284O077M074K357O82j034k446l383
52073A207841m435o298q572r929r773r046r012r724j0270j0188r852r567r009
$$ plain form
52086 1123848 1140986 1156589 1170566 1182833 1193230 1201514 1207591 1211665 1214022 1214704 1213670 1211224 1207841
52073 1207841 1203406 1197108 1188536 1178607 1168834 1159788 1150776 1141052 1130782 1120594 1110742 1101175 1092166
$$ [...]
##END NTUPLES=NMR SPECTRUM
##END=
