
##TITLE=AC1242_NUNAH12032_6945093_1EIYo8Zey3
##JCAMPDX= 6.0         $$ Bruker NMR JCAMP-DX V2.0
##DATA TYPE= NMR SPECTRUM
##DATA CLASS= NTUPLES
##ORIGIN= BRUKER
##OWNER= Administrator
$$ 1.72 TOPSPIN		Version 2.1
$$ 2012-10-18 13:43:43.989 -0700  Administrator@X
$$ Compression mode = diff/dup
##.OBSERVE FREQUENCY= 400.02188249412
##.OBSERVE NUCLEUS= ^1H
##.ACQUISITION MODE= SIMULTANEOUS (DQD)
##.ACQUISITION SCHEME= undefined
##.AVERAGES= 8
##.DIGITISER RES= 22
##SPECTROMETER/DATA SYSTEM= spect
##.PULSE SEQUENCE= zg30
##.SOLVENT NAME= COFFEE_meoh
##.SHIFT REFERENCE= INTERNAL, COFFEE_meoh, 1, 14.98509
##AUDIT TRAIL= $$ (NUMBER, WHEN, WHO, WHERE, PROCESS, VERSION, WHAT)
$$ ##TITLE= Audit trail, TOPSPIN		Version 2.1
$$ ##JCAMPDX= 5.01
$$ ##ORIGIN= Bruker BioSpin GmbH
$$ ##OWNER= Administrator
$$ $$ C:\Bruker\TOPSPIN/data/COFFEE/nmr/AC1242_NUNAH12032_6945093_1EIYo8Zey3/10/pdata/1/auditp.txt
$$ ##AUDIT TRAIL=  $$ (NUMBER, WHEN, WHO, WHERE, PROCESS, VERSION, WHAT)
(   1,<2012-10-13 18:04:45.187 -0500>,<Administrator>,<TOPSPIN>,<go>,<TOPSPIN 2.1>,
      <created by zg
	started at 2012-10-13 18:03:38.281 -0500,
	POWCHK enabled, PULCHK disabled,
       configuration hash MD5:
       6B 1B 68 BB D9 2E 58 E2 7F 35 AD 54 07 DF 0E 41
       data hash MD5: 64K
       EE E7 35 CE 29 14 3E 1A BA 79 8F 75 EA 7C A3 5C>)
(   2,<2012-10-13 18:04:47.812 -0500>,<Administrator>,<TOPSPIN>,<proc1d>,<TOPSPIN 2.1>,
      <Start of raw data processing
       efp LB = 0 FT_mod = 6 PKNL = 1 PHC0 = 0 PHC1 = 0 SI = 32K 
       data hash MD5: 32K
       CD 5F 69 65 F0 22 09 24 E3 F7 8F 1B AD 7B DF CC>)
(   3,<2012-10-13 18:04:48.218 -0500>,<Administrator>,<TOPSPIN>,<proc1d>,<TOPSPIN 2.1>,
      <pk PHC0 = 181.3348 PHC1 = 0 
       data hash MD5: 32K
       71 89 18 D3 C1 AA A2 A0 80 97 17 A9 F1 E6 00 22>)
(   4,<2012-10-13 18:04:48.296 -0500>,<Administrator>,<TOPSPIN>,<proc1d>,<TOPSPIN 2.1>,
      <abs ABSG = 1 
       data hash MD5: 32K
       4D 58 F2 36 B5 00 91 51 91 F0 8A FB 36 5C 16 85>)
(   5,<2012-10-13 18:04:48.328 -0500>,<Administrator>,<TOPSPIN>,<proc1d>,<TOPSPIN 2.1>,
      <abs ABSG = 2 
       data hash MD5: 32K
       AC 4F B0 02 88 7F 40 D9 7D 9A 23 FD E9 F9 41 C7>)
(   6,<2012-10-13 18:04:48.359 -0500>,<Administrator>,<TOPSPIN>,<proc1d>,<TOPSPIN 2.1>,
      <abs ABSG = 3 
       data hash MD5: 32K
       D7 09 48 5C 5B B4 B9 70 7C F5 DD B3 B0 FC 17 61>)
(   7,<2012-10-13 18:04:48.390 -0500>,<Administrator>,<TOPSPIN>,<proc1d>,<TOPSPIN 2.1>,
      <abs ABSG = 4 
       data hash MD5: 32K
       1D DE 21 C4 CF 5C 4C 85 0F 7E BA 3A 4E E7 11 47>)
(   8,<2012-10-13 18:04:48.421 -0500>,<Administrator>,<TOPSPIN>,<proc1d>,<TOPSPIN 2.1>,
      <abs ABSG = 5 
       data hash MD5: 32K
       0F 99 00 61 53 64 30 2A 4F 4D 0D CA 25 64 8A 58>)
(   9,<2012-10-13 18:04:52.062 -0500>,<Administrator>,<TOPSPIN>,<audit>,<TOPSPIN 2.1>,
      <user comment:
       ICON-NMR User ID: COFFEE
       data hash MD5: 32K
       0F 99 00 61 53 64 30 2A 4F 4D 0D CA 25 64 8A 58>)
$$ ##END=
$$ [...]
150 150 150 150 150 150 150 150
##$TP07= 0
##$TPNAME0= <>
##$TPNAME1= <>
##$TPNAME2= <>
##$TPNAME3= <>
##$TPNAME4= <>
##$TPNAME5= <>
##$TPNAME6= <>
##$TPNAME7= <>
##$TPOAL= (0..7)
0.5 0.5 0.5 0.5 0.5 0.5 0.5 0.5
##$TPOFFS= (0..7)
0 0 0 0 0 0 0 0
##$TUNHIN= 0
##$TUNHOUT= 0
##$TUNXOUT= 0
##$USERA1= <user>
##$USERA2= <user>
##$USERA3= <user>
##$USERA4= <user>
##$USERA5= <user>
##$V9= 5
##$VALIST= <valist>
##$VCLIST= <CCCCCCCCCCCCCCC>
##$VD= 0
##$VDLIST= <DDDDDDDDDDDDDDD>
##$VPLIST= <PPPPPPPPPPPPPPP>
##$VTLIST= <TTTTTTTTTTTTTTT>
##$WBST= 2048
##$WBSW= 25
##$XGAIN= (0..3)
0 0 0 0
##$XL= 0
##$YL= 0
##$YMAX_a= 498864
##$YMIN_a= -640863
##$ZGOPTNS= <>
##$ZL1= 120
##$ZL2= 120
##$ZL3= 120
##$ZL4= 120
##$ABSF1= 14.98509
##$ABSF2= -5.573092
##$ABSG= 5
##$ABSL= 3
##$ALPHA= 0
##$AQORDER= 0
##$ASSFAC= 0
##$ASSFACI= 0
##$ASSFACX= 0
##$ASSWID= 0
##$AUNMP= <proc_prof1d_extract_pilot.lims>
##$AXLEFT= 0
##$AXNAME= <>
##$AXNUC= <1H>
##$AXRIGHT= 0
##$AXTYPE= 0
##$AXUNIT= <>
##$AZFE= 0.1
##$AZFW= 0.1
##$BCFW= 0
##$BC_mod= 0
##$BYTORDP= 0
##$COROFFS= 0
##$CY= 15
##$DATMOD= 1
##$DC= 0
##$DFILT= <>
##$DTYPP= 0
##$F1P= 0
##$F2P= 0
##$FCOR= 0.5
##$FTSIZE= 32768
##$FT_mod= 6
##$GAMMA= 0
##$GB= 0
##$INTBC= 1
##$INTSCL= 1
##$ISEN= 128
##$LB= 0
##$LEV0= 0
##$LPBIN= 0
##$MAXI= 10000
##$MC2= 0
##$MEAN= 0
##$ME_mod= 0
##$MI= 0
##$NCOEF= 0
##$NC_proc= -8
##$NLEV= 6
##$NOISF1= 0
##$NOISF2= 0
##$NSP= 0
##$NTH_PI= 0
##$NZP= 0
##$OFFSET= 14.98509
##$PC= 1
##$PHC0= 181.3348
##$PHC1= 0
##$PH_mod= 1
##$PKNL= yes
##$PPARMOD= 0
##$PPDIAG= 0
##$PPIPTYP= 0
##$PPMPNUM= 2147483647
##$PPRESOL= 1
##$PSCAL= 4
##$PSIGN= 0
##$PYNMP= <proc.py>
##$REVERSE= no
##$SF= 400.02
##$SI= 32768
##$SIGF1= 0
##$SIGF2= 0
##$SINO= 400
##$SIOLD= 32768
##$SPECTYP= <>
##$SREGLST= <1H.CDCl3>
##$SSB= 0
##$STSI= 32768
##$STSR= 0
##$SW_p= 8223.68421052631
##$SYMM= 0
##$S_DEV= 0
##$TDeff= 65536
##$TDoff= 0
##$TI= <>
##$TILT= no
##$TM1= 0
##$TM2= 0
##$TOPLEV= 0
##$USERP1= <user>
##$USERP2= <user>
##$USERP3= <user>
##$USERP4= <user>
##$USERP5= <user>
##$WDW= 1
##$XDIM= 32768
##$YMAX_p= 448449532
##$YMIN_p= -700960
##$CURPLOT= <Network HP LaserJet P1505>
##$CURPRIN= <$Network HP LaserJet P1505>
##$DFORMAT= <normdp>
##$LAYOUT= <+/1D_H.xwp>
##$LFORMAT= <normlp>
##$PFORMAT= <normpl>
##$SURQMSG= 1
$$ End of Bruker specific parameters
$$ ---------------------------------
##NTUPLES= NMR SPECTRUM
##VAR_NAME=  FREQUENCY,     SPECTRUM/REAL,   SPECTRUM/IMAG
##SYMBOL=    X,             R,               I
##VAR_TYPE=  INDEPENDENT,   DEPENDENT,       DEPENDENT
##VAR_FORM=  AFFN,          ASDF,            ASDF
##VAR_DIM=   32768,         32768,           32768
##UNITS=     HZ,            ARBITRARY UNITS, ARBITRARY UNITS
##FACTOR=    0.250966925370066, 1,           1
##FIRST=     8223.43324360094, -9787,        -181332
##LAST=      0,             -31786,          10100
##MIN=       0,             -700960,         0
##MAX=       8223.43324360094, 448449532,    0
$$ Real data points
##PAGE= N=1
##DATA TABLE= (X++(R..R)), XYDATA
$$ [...]
19538a85354m989j86136J54228m2219A10563a05392j19038P9704l4300h633F6018
$$ -185354 -190343 -376479 -222251 -264470 110563 -105392 -224430 -144726 -179026 -8633 66018
19526g104A5505J38958a21872H7615M0764c41964A81013C8326J80478b98244M1336
$$ -7104 15505 154463 -121872 87615 128379 -341964 181013 38326 218804 -298244 -256908
19515b56908L625E3817O9029a76574A64108o1534C1142c02555j7802i91E9635
$$ -256908 -253283 53817 122846 -176574 164108 102574 31142 -302555 -320357 -991 59635
19503b24930J08871N0925k53917a36770c9900A10550d55258g2378A44621k4693
$$ -224930 -116059 -65134 -319051 -136770 -39900 110550 -455258 -72378 144621 119928
19493A19928b41539E6487m540d1330a8842c514j76484o6829j79607B33892G6302
$$ 119928 -241539 56487 51947 -41330 -18842 -3514 -179998 -246827 -426434 233892 76302
19481a93644k92787c114m7157H8961J0827b02194D4811b40198j12724A16260k9665
$$ -193644 -486431 -3114 -50271 88961 99788 -202194 44811 -240198 -352922 116260 86595
19470H6595g2048d808A27217n1699K61662F6953J37363a03307r900H3533b98877
$$ 86595 -72048 -4808 127217 75518 337180 66953 204316 -103307 -113207 83533 -298877
19458A16813M169b56109B5690a46276A97801B0611J12670B1052J61282p7405a67527
$$ 116813 120982 -256109 25690 -146276 197801 20611 133281 21052 182334 104929 -167527
19446A52260I580a20548f0125k3573q9187A58060a19221j03542J09958I3037J85824
$$ 152260 9580 -120548 -60125 -83698 -172885 158060 -119221 -222763 -112805 93037 278861
19435B78861b31342C7525a83610Q5141A87314H4777e2753k35302d3272A10a25596
$$ 278861 -231342 37525 -183610 -98469 187314 84777 -52753 -288055 -43272 110 -125596
19423c10159J45665A8299a15576e2866J1427j87204d3537j01567j61772M6257
$$ -310159 -164494 18299 -115576 -52866 -41439 -228643 -43537 -145104 -306876 -260619
19413b60619a18905k29765A84963A4525R8425b22438e1613A72299a2350r4585
$$ -260619 -118905 -348670 184963 14525 112950 -222438 -51613 172299 -12350 -106935
19403a06935A96185d2281j535A43478c8023k76955d039A35405a78516D9077a13883
$$ -106935 196185 -42281 -43816 143478 -38023 -314978 -4039 135405 -178516 49077 -113883
19391A03356K74561j55786a87712D06656F4434c0699B9068b39392r390e6085B1725
$$ 103356 377917 222131 -187712 406656 64434 -30699 29068 -239392 -248782 -56085 21725
19379A56120a47587A77467h6452C179N4869A4778g3562j14830l03085A53866i8428
$$ 156120 -147587 177467 -86452 3179 58048 14778 -73562 -188392 -491477 153866 -98428
19367c31901D21028A41691a39316A00658b83925r8589J83896k1839C17408F8596
$$ -331901 421028 141691 -139316 100658 -283925 -382514 -198618 -220457 317408 68596
19356c19032d0093j70385A25325h867k49905B22129a5889j58447L3143j22636
$$ -319032 -40093 -210478 125325 -8867 -258772 222129 -15889 -174336 -141193 -263829
19346b63829g2278F9321k8801b6703E5982K4261k0992b75312c5918j36442j09225
$$ -263829 -72278 69321 40520 -26703 55982 80243 59251 -275312 -35918 -172360 -281585
19335b81585J22145B33526c37285C1714b95734J40420I3137B1295a79716f0593
$$ -281585 -159440 233526 -337285 31714 -295734 -155314 93137 21295 -179716 -60593
19324A74141o2535a15112j9597l19765b5978G5341f169j16302N8135j94963D2604
$$ 174141 111606 -115112 -134709 -454474 -25978 75341 -6169 -122471 -64336 -259299 42604
19312g1154j61750c8280A88294a12294d9401j20A38289a72924e3054p9257B57833
$$ -71154 -232904 -38280 188294 -112294 -49401 -49521 138289 -172924 -53054 -132311 257833
19300E1190a64363b995q0144B1678e83599B00541a1719o0471k24268O2100j38073
$$ 51190 -164363 -2995 -83139 21678 -583599 200541 -11719 -72190 -296458 -234358 -372431
19289c72431E2047J57611a41071H1534b87892L7648O4506J974g0465o6747j93125
$$ -372431 52047 209658 -141071 81534 -287892 -250244 -185738 -183764 -70465 -137212 -330337
19278c30337e2294m3433H2964a969l52318A06331l8690b69653A21994a24260p1184
$$ -330337 -52294 -95727 82964 -1969 -354287 106331 67641 -269653 121994 -124260 -195444
19267a95444P4182o7451B58420H4463a42730j04346A5800a17821j05536A43949
$$ -195444 -121262 -188713 258420 84463 -142730 -247076 15800 -117821 -223357 143949
19256E5238J0367c7764k0984H6388a58318A40882a94208j37101N7686g8356A77739
$$ 55238 65605 -37764 -58748 86388 -158318 140882 -194208 -331309 -273623 -78356 177739
19244a69742e0902A78272d5307l41144I8024f8342A12656f019q0332B30497a82554
$$ -169742 -50902 178272 -45307 -386451 98024 -68342 112656 -6019 -86351 230497 -182554
19232b42940j20859M9297J33476Q9679a6457A43107g8825j33346J01536I5660
$$ -242940 -363799 -314502 -181026 -91347 -16457 143107 -78825 -212171 -110635 95660
19221A1024g904A83079J65244c24028A8161h3250o7356r1226B8310b06531o5460
$$ 11024 -7904 183079 348323 -324028 18161 -83250 -150606 -241832 28310 -206531 -271991
19210b71991g9391J3988C02560C7328Q3464P6401a83658j44452J36216F5075k0243
$$ -271991 -79391 -65403 302560 37328 120792 197193 -183658 -328110 -191894 65075 44832
19199D4832c0298j74765a4494C4746c73145a52988j71205D1491J70637K7541J8544
$$ 44832 -30298 -205063 -14494 34746 -373145 -152988 -324193 41491 212128 239669 258213
19188B58213b83488O2639J6903B68052a84396e056j26427j20753Q7393L2746B9611
$$ 258213 -283488 -220849 -203946 268052 -184396 -5056 -131483 -252236 -164843 -132097 29611
19176h4826K7114A63059a5367G4063c3003j58271G2490b19406J04460C23904a78720
$$ -84826 -57712 163059 -15367 74063 -33003 -191274 72490 -219406 -114946 323904 -178720
19164D4696N5499a61966A11638C1454a26746j48227a7725l3312A52452g5228A61960
$$ 44696 100195 -161966 111638 31454 -126746 -274973 -17725 -51037 152452 -75228 161960
19152a97118n1900n2498O1612A93022K5565I3791e9615m6000A02145C7498d20210
$$ -197118 -249018 -301516 -239904 193022 218587 93791 -59615 -105615 102145 37498 -420210
19140a68350n1209B5955J77015a35742a1371j11673C8316i1214G9471a85049L3036
$$ -168350 -219559 25955 202970 -135742 -11371 -123044 38316 -91214 79471 -185049 -152013
19129a52013k521j36244Q4479f5979b2392l2453j05293g4778b5998j48627G6753
$$ -152013 -154534 -290778 -206299 -65979 -22392 -54845 -160138 -74778 -25998 -174625 76753
19117h4950E0486b41464O0899j48603H7330M6022d4316o3313A19235c8145a3731
$$ -84950 50486 -241464 -180565 -329168 87330 133352 -44316 -107629 119235 -38145 -13731
19105e2866j47125A61410h7988c9667q0537B4650h6195b3805j31237D1954i8414
$$ -52866 -199991 161410 -87988 -39667 -120204 24650 -86195 -23805 -155042 41954 -98414
19093A28419e1958k48707k1231N3775b4986j75675A87708g7859M393j13922B47569
$$ 128419 -51958 -300665 -321896 -268121 -24986 -200661 187708 -77859 -73466 -187388 247569
19081a87249G3552a5194q749j14961L8036d2295j49508j30755I1134a37131B18661
$$ -187249 73552 -15194 -23943 -138904 -100868 -42295 -191803 -322558 91134 -137131 218661
19069a64107A6039J40484a19828B8527N8531d74528H1709a5996E31M3511c39483
$$ -164107 16039 156523 -119828 28527 87058 -474528 81709 -15996 531 44042 -339483
19057b0565A39028b43681b5697j83014j27581E4305a15062j98527p8663A20190
$$ -20565 139028 -243681 -25697 -208711 -336292 54305 -115062 -313589 -392252 120190
19046G3692e2260j1038D6691a74714D1243e5643A79087b00512H1292a950n2797
$$ 73692 -52260 -63298 46691 -174714 41243 -55643 179087 -200512 81292 -1950 -54747
19035e4747P480e052D16813a927A76814J72161C1036a07198B01931a02035L1777
$$ -54747 -47267 -5052 416813 -1927 176814 348975 31036 -107198 201931 -102035 -70258
19024g0258k83553A44104P1033a3925C8601c5814j0277j19410c0093q0287c9906
$$ -70258 -353811 144104 215137 -13925 38601 -35814 -46091 -165501 -30093 -110380 -39906
19012A120N9241b57227C6016i525k05843N3600j22837a33492b9317k7886A8883
$$ 1120 60361 -257227 36016 -9525 -215368 -161768 -284605 -133492 -29317 -57203 18883
19000c5339A81848F6884i3139E9670O0387b02132C0074K40662j16778G1733f0594
$$ -35339 181848 66884 -93139 59670 120057 -202132 30074 270736 153958 71733 -60594
18988i9991c4080A1200K32875a3551D8271b26972j86778A10362a26100q6192F5501
$$ -99991 -34080 11200 244075 -13551 48271 -226972 -413750 110362 -126100 -212292 65501
18976C1420a37190f7638J6909B12801F7988i3023A83946e5448j60016H3256a67563
$$ 31420 -137190 -67638 -50729 212801 67988 -93023 183946 -55448 -215464 83256 -167563
18964A23689a8124p1525A37983c2811j40399N1421k14340B22484a8138l6004B15156
$$ 123689 -18124 -89649 137983 -32811 -173210 -121789 -336129 222484 -18138 -54142 215156
18952I1868L24398d6396G847b33179e7175A91993o9557k2694K014i7678C2675
$$ 91868 416266 -46396 7847 -233179 -57175 191993 122436 99742 101756 -97678 32675
18940c36770A3630b38954b4891l1718j37635j57074a51939A74193G9128B8765
$$ -336770 13630 -238954 -24891 -56609 -194244 -351318 -151939 174193 79128 28765
18929a08914r2186A6699J21011M9997i3823k33567A62976c86520a40498L4137
$$ -108914 -201100 16699 137710 187707 -93823 -327390 162976 -386520 -140498 -106361
18919a06361J3097j7705j4998g561j02387l9854B5589a34072b9097n8517q0314
$$ -106361 -93264 -110969 -125967 -7561 -109948 -149802 25589 -134072 -29097 -87614 -167928
18908a67928A59752J12668c38255B43090d39655A2405a59806F9174b45725Q3371
$$ -167928 159752 272420 -338255 243090 -439655 12405 -159806 69174 -245725 -162354
18898a62354C40521G7556G80d8952k81928h8652c7949O511n8682A58764a62839
$$ -162354 340521 77556 780 -48952 -330880 -88652 -37949 -31438 -90120 158764 -162839
18886a10129j61262a28480M6413n1710j08599A4154M7778h9204o0301A78966c3653
$$ -110129 -271391 -128480 -82067 -133777 -242376 14154 61932 -89204 -149505 178966 -33653
18874B17299a72649B127f6391m6279A98725a81939J9964c3847l03551A30358g7316
$$ 217299 -172649 2127 -66391 -112670 198725 -181939 -161975 -33847 -337398 130358 -77316
18862A40086b68472b2224H2210d59554D1820b67551i5451k90378B02898n1138
$$ 140086 -268472 -22224 82210 -459554 41820 -267551 -95451 -385829 202898 151760
18852A51760B8239K13273j02890b71951A1954O9492k4330a3029p6797B32629h9001
$$ 151760 28239 241512 138622 -271951 11954 81446 57116 -13029 -89826 232629 -89001
18840b01312m0659A92615a28436F0977d1996k51264D5649C239O0639K03581d00616
$$ -201312 -241971 192615 -128436 60977 -41996 -293260 45649 3239 63878 267459 -400616
18828B3156R9785a94509A01494e05096a80918q4525l1506B26567b20062g7637
$$ 23156 122941 -194509 101494 -505096 -180918 -265443 -296949 226567 -220062 -77637
18817i238k17598H3398O6278a13789H3523K18145f7287D81997i4390K0285l77524
$$ -9238 -226836 83398 149676 -113789 83523 301668 -67287 481997 -94390 -74105 -451629
18806d51629C08157a19049D6966a3921D5033J36849g5324A60468K37730a18162
$$ -451629 308157 -119049 46966 -13921 45033 181882 -75324 160468 398198 -118162
18795b14526g1275k41276A77732o6493c50262B47196F9970k0111a24115K5641
$$ -214526 -71275 -312551 177732 111239 -350262 247196 69970 49859 -124115 -98474
18785i8474e462l03533c1235H5471i110j30163j0002C2495G514a46785a8740I6590
$$ -98474 -5462 -308995 -31235 85471 -9110 -139273 -149275 32495 7514 -146785 -18740 96590
18772A7908a13718k7118d2260r2135m6602q206G9155N4687f1584j77153B75023
$$ 17908 -113718 -140836 -42260 -134395 -180997 -189203 79155 133842 -61584 -238737 275023
18760A86092l6445o1322l4386b76004J06961J4595n3493j03613J50846M7315k79333
$$ 186092 149647 88325 53939 -276004 -169043 -154448 -207941 -311554 -160708 -113393 -392726
18749c92726C4031b38078J9776e2262A08365J35068q685g4779A63284a26552j19878
$$ -392726 34031 -238078 -218302 -52262 108365 243433 234748 -74779 163284 -126552 -246430
18738b46430k8363A14394Q0157m6203a95212B23246b0197n9959A14924b01191
$$ -246430 -274793 114394 194551 148348 -195212 223246 -20197 -80156 114924 -201191
18727F9372J4303J44643K8402a21292H0702a21189H810e7C35469a53225p8441
$$ 69372 83675 228318 256720 -121292 80702 -121189 8810 -57 335469 -153225 -231666
18716b31666B31324a8615j86952I9847h7650k65216f4446A30190Q7345D9628h01
$$ -231666 231324 -18615 -205567 99847 -87650 -352866 -64446 130190 217535 49628 -801
18704a08271A18985b16606Q2480D0879c3557l79279d7817j55658B21489A6683
$$ -108271 118985 -216606 -134126 40879 -33557 -412836 -47817 -203475 221489 16683
18693A25727h0348k30738M7780E1087i2487A11334i0848j14655g2019m4463A51707
$$ 125727 -80348 -311086 -263306 51087 -92487 111334 -90848 -205503 -72019 -116482 151707
18681a92664Q1258B4529a97519j27350B1960J26676b91056Q2606A08190d8558
$$ -192664 -111406 24529 -197519 -324869 21960 148636 -291056 -208450 108190 -48558
18670B19983g1091L1511k59456f1104L117q8002A41205E825b9844j00160N8309
$$ 219983 -71091 -39580 -299036 -61104 -57987 -145989 141205 5825 -29844 -130004 -71695
18659g1695G8906b20377A38136b20536f0116j52692E7520O4565J06369i9862B7303
$$ -71695 78906 -220377 138136 -220536 -60116 -212808 57520 122085 228454 -99862 27303
18647b58333C6073a93478P1513L3029b2441k02070A8917O7070b88956J16944g6771
$$ -258333 36073 -193478 -121965 -88936 -22441 -224511 18917 85987 -288956 -172012 -76771
18635A75643b94291J0392A05035d32605C86999a51666O1312q55m2279F5957c19893
$$ 175643 -294291 -283899 105035 -432605 386999 -151666 -90354 -91209 -133488 65957 -319893
18623B23737a49833A10374a12444e2767m9775j99315J16648J4531f6517C034j182
$$ 223737 -149833 110374 -112444 -52767 -102542 -301857 -185209 -170678 -66517 3034 1852
18612A852a39617e3264j68482a3042D1097K36701d5019k31808j86407E613a13434
$$ 1852 -139617 -53264 -221746 -13042 41097 277798 -45019 -276827 -463234 5613 -113434
18600a71270L0522A81968g1073B37382J85905a42877B2199K26008H1533b14816
$$ -171270 -140748 181968 -71073 237382 423287 -142877 22199 248207 81533 -214816
18589b17035e1805q3758M3883k40788a56549j35299q0488G8476e3628F0510J10391
$$ -217035 -51805 -135563 -91680 -332468 -156549 -291848 -372336 78476 -53628 60510 170901
18578A70901K1775G9851a16848j85848F4574k1981e7379A35731a8869A37990b66819
$$ 170901 192676 79851 -116848 -302696 64574 42593 -57379 135731 -18869 137990 -266819
18566B21686a93551j310P6580a0753n9020I5874i2259p8039C8600c08651h1049
$$ 221686 -193551 -194861 -118281 -10753 -69773 95874 -92259 -170298 38600 -308651 -81049
18554a86676E52095a40375j1392I7676c58646A22911f0766P544C1533f319k02423
$$ -186676 552095 -140375 -151767 97676 -358646 122911 -60766 -53222 31533 -6319 -208742
18543b08742N5522N3809E1223e771j0199j04450E2449O7651a74006I5625J61604
$$ -208742 -153220 -99411 51223 -5771 -15970 -120420 52449 120100 -174006 95625 257229
18532B57229b22339D1479d4378A31138d639n2354b7972A362d86144f4136j52624
$$ 257229 -222339 41479 -44378 131138 -4639 -56993 -27972 1362 -486144 -64136 -216760
18521b16760E7472a42368M2590a1727j59276A00958J65083b72714A38486b55220
$$ -216760 57472 -142368 -99778 -11727 -171003 100958 266041 -272714 138486 -255220
18510a54267B45577a15646D6602R1511a19217L6325A7489c04099B6404K15609
$$ -154267 245577 -115646 46602 138113 -119217 -82892 17489 -304099 26404 242013
18500B42013a85710r2002D3593a88721k0413k5425a0833A54169h3856k85118a50568
$$ 242013 -185710 -277712 43593 -188721 -209134 -234559 -10833 154169 -83856 -368974 -150568
18488i1063A47257a61006L4003a2194k29420G8653E579a4103A05325a19634q7887
$$ -91063 147257 -161006 -127003 -12194 -241614 78653 5579 -14103 105325 -119634 -207521
18477b07521c2120n2660A73475J14344B4959b65476f1200m6182p3514j25903g022
$$ -207521 -32120 -84780 173475 287819 24959 -265476 -61200 -107382 -180896 -306799 -7022
18465a8797A39640b6611j27919j88057J33734A44146k2544E9358b06847c45l14977
$$ -18797 139640 -26611 -154530 -342587 -208853 144146 121602 59358 -206847 -345 -315322
18454c15322H8326J26937H2594a18727k5382A9566a96544d3748C4912K18271b48889
$$ -315322 88326 215263 82594 -118727 -144109 19566 -196544 -43748 34912 253183 -248889
18442a03389A72690i6868B18342A6037b61217R8333b7246j39470H3409L0976b71329
$$ -103389 172690 -96868 218342 16037 -261217 -162884 -27246 -166716 83409 114385 -271329
18430A34773C4544c44138J50037r9029B3154b06616E6285a07535j15683H3643
$$ 134773 34544 -344138 -194101 -293130 23154 -206616 56285 -107535 -223218 83643
18419A03115b60888c3604N893l10952B37378F6177c75334i906k78904B4143c4140
$$ 103115 -260888 -33604 -27711 -338663 237378 66177 -375334 -9906 -288810 24143 -34140
18407I2884b0479G4440a84067B8020K3396O9975a61044F3852J78430a47964j14266
$$ 92884 -20479 74440 -184067 28020 51416 121391 -161044 63852 242282 -147964 -262230
18396b62230D7889B1429a54979b1363A18874a90889A23328a59425g0889B68673
$$ -262230 47889 21429 -154979 -21363 118874 -190889 123328 -159425 -70889 268673
18385a9208l71036J37346a15888j20325B50916h2158k31951M2718J28045m029
$$ -19208 -390244 -252898 -115888 -236213 250916 -82158 -314109 -271391 -143346 -147375
18375a47375o3410j36124C8893J8312a36576A57176o6223b80242Q9590I210J35149
$$ -147375 -210785 -346909 38893 57205 -136576 157176 90953 -280242 -190652 9210 144359
18364A44359m7153k4661a08845A35172l1315M9203l1462c50873C7284M9763b2535
$$ 144359 97206 72545 -108845 135172 103857 153060 121598 -350873 37284 87047 -22535
18352b5122m6834E2171J47591a76668j4412A36467a14627k0012L909B13973a00428
$$ -25122 -71956 52171 199762 -176668 -191080 136467 -114627 -134639 -130730 213973 -100428
18340A30044J2364b28612r7121e9872H7374f2411N740l29021d4622p9223e6364
$$ 130044 142408 -228612 -325733 -59872 87374 -62411 -56671 -385692 -44622 -123845 -56364
18328G3150A8864L8476J73915J65125F3349L4866b15443K4147N0077m8732Q3569
$$ 73150 18864 57340 231255 396380 63349 98215 -215443 -191296 -141219 -189951 -106382
18317a06382A1597b71737d8985j25061A8683F595a62233B48786k8836D2532J18566
$$ -106382 11597 -271737 -48985 -174046 18683 6595 -162233 248786 219950 42532 161098
18306A61098K158a05981B82321n2377A03441i9793d2984C33896p9496a6111m94001
$$ 161098 163256 -105981 282321 229944 103441 -99793 -42984 333896 254400 -16111 -510112
18295e10112H7967f7493m0688M7665j67270B1756a19973A61974P4147c8195D784
$$ -510112 87967 -67493 -108181 -60516 -227786 21756 -119973 161974 236121 -38195 4784
18283a60035e1546G6292O7161j3859b15795D1038J44444c1322A05893J34426b07458
$$ -160035 -51546 76292 143453 129594 -215795 41038 185482 -31322 105893 240319 -207458
18271b25897b4893j21554d4667A23824g5956B04679a43714F8154a88223Q9186
$$ -225897 -24893 -146447 -44667 123824 -75956 204679 -143714 68154 -188223 -99037
18261i9037B60889A6433F922a67674j23942N3098A24779B090K51916H2384m71
$$ -99037 260889 16433 6922 -167674 -291616 -238518 124779 2090 254006 82384 81913
18250H1913a29532k9082g1445B4513b76493B9561g9218A13251a03438C4735a39917
$$ 81913 -129532 -158614 -71445 24513 -276493 29561 -79218 113251 -103438 34735 -139917
18238a31722G1103a43359E9794a08868F4662a16311A56717f6923n6953A42634
$$ -131722 71103 -143359 59794 -108868 64662 -116311 156717 -66923 -123876 142634
18227C4647a41252b5423j73189k0616I8917a80829B41977B8422a33219B10679
$$ 34647 -141252 -25423 -198612 -219228 98917 -180829 241977 28422 -133219 210679
18216F1469k9748J941a77460B8631A3085e8864B50929H5631a33126L4430k9530
$$ 61469 31721 33662 -177460 28631 13085 -58864 250929 85631 -133126 -98696 -128226
18205a28226j94910A47931L3922Q4800i1956b2709k59212J01125k0745h1424m401
$$ -128226 -323136 147931 181853 266653 -91956 -22709 -281921 -180796 -201541 -81424 -85825
18194h5825A40680L1703m6775e9100n3663A74672H4466a38227k0312j7648K5247
$$ -85825 140680 172383 125608 -59100 -112763 174672 84466 -138227 -158539 -176187 -150940
18183a50940j45377i1961j02223b231j00016d5087B8875g9514b6164o8408o0626
$$ -150940 -296317 -91961 -194184 -2231 -102247 -45087 28875 -79514 -26164 -94572 -155198
18172a55198d127j55144F5366a13153A25498B4729b59847A42330A1987h0430G1531
$$ -155198 -4127 -159271 65366 -113153 125498 24729 -259847 142330 11987 -80430 71531
18160d21362D8268a57144R05j5158G2671b57825m7290F0404b39625A77150b91380
$$ -421362 48268 -157144 -156239 -171397 72671 -257825 -305115 60404 -239625 177150 -291380
18148a7986F3018d5036D7268c64895a10190A10873a8120B4207J41545a72587e8501
$$ -17986 63018 -45036 47268 -364895 -110190 110873 -18120 24207 165752 -172587 -58501
18136i0570k4245j50982R0491c6141j80025B79495a43266r5264F7166i4883k24456
$$ -90570 -114815 -265797 -175306 -36141 -216166 279495 -143266 -238530 67166 -94883 -319339
18125c19339j8252A00713j6796c27583h0683j17289g6470l2171A34738a04464
$$ -319339 -337591 100713 83917 -327583 -80683 -197972 -76470 -108641 134738 -104464
18114B21164c89518g4387A34145i5189A06077a35399k7057A11568c6442j00005
$$ 221164 -389518 -74387 134145 -95189 106077 -135399 -162456 111568 -36442 -136447
18104a36447L1514I5307d28902i3477k6991H5375a10932L7e3294P330l4369C6544
$$ -136447 -104933 95307 -428902 -93477 -120468 85375 -110932 -110895 -53294 -45964 -80333 36544
18091A29480m1063k9676a84763R2108m219c5116l8628A09297a47357A009a16705
$$ 129480 88417 58741 -184763 -92655 -96874 -35116 -73744 109297 -147357 1009 -116705
18079b1733o7413J7253A79886a89626h4386P486d67p9616j00192Q9050j25075
$$ -21733 -89146 -71893 179886 -189626 -84386 -76900 -467 -80083 -180275 -91225 -216300
18068b16300j1483E5046K94495b92472h2668B37187a4157I6126m5318l212N4252
$$ -216300 -227783 55046 349541 -292472 -82668 237187 -14157 96126 50808 47596 101848
18057A01848l233b42498B75346j19377l6291J6970a27799j78542b8697p8883m1969
$$ 101848 98615 -242498 275346 155969 119678 136648 -127799 -306341 -28697 -107580 -149549
18046a49549m0083A03560K5508c2761A11190A2576K75373E4715a11306p0511H3559
$$ -149549 -189632 103560 129068 -32761 111190 12576 287949 54715 -111306 -181817 83559
18034D5277K71057c7087j09460D5490i8553F8128c81489A98874b22609P5012L1343
$$ 45277 316334 -37087 -146547 45490 -98553 68128 -381489 198874 -222609 -147597 -116254
18023a16254o1065L9957C1589O9693J9428a4664j18849G6784M1677D2872c5767
$$ -116254 -177319 -137362 31589 101282 120710 -14664 -133513 76784 118461 42872 -35767
18011b04291Q5737I3702a40215j0221A16584p420J5579b10169b8529j614r3066
$$ -204291 -118554 93702 -140215 -150436 116584 109164 124743 -210169 -28529 -30143 -123209
18000a23209d7655A15793D4998a50237C16041b52096j53469Ab65788b2379D8284
$$ -123209 -47655 115793 44998 -150237 316041 -252096 -405565 1 -265788 -22379 48284
17988A17789d4588n0665K6264j17133A96089N1676C6681f2710j23997A26912K26256
$$ 117789 -44588 -95253 -68989 -186122 196089 247765 36681 -62710 -186707 126912 353168
17977C53168a10507B03347D8747g4943n4973D8696b24423r8564A87367E062L9747
$$ 353168 -110507 203347 48747 -74943 -129916 48696 -224423 -322987 187367 5062 44809
17966D4809b14473O6849A63228K63858n9739a9745p2527H203f823A08561R000
$$ 44809 -214473 -147624 163228 427086 367347 -19745 -92272 8203 -6823 108561 117561
17955A17561P7655b33112F045M0083a48802C67471A34718h3337D9665c71329b8783
$$ 117561 195216 -233112 6045 46128 -148802 367471 134718 -83337 49665 -371329 -28783
17943A07429a31199M7863j16905B12276p4940i8080Q875j74554J18052k14997
$$ 107429 -131199 -83336 -200241 212276 137336 -98080 -89205 -263759 -145707 -360704
17933c60704A91992F6529b79747B1823o993b2506j42975H0616J22087A0655a80593
$$ -360704 191992 66529 -279747 21823 14830 -22506 -165481 80616 202703 10655 -180593
17921a76570p5967a4525k35575J12245A00615e4734A66349b62760I7659K70125
$$ -176570 -252537 -14525 -250100 -137855 100615 -54734 166349 -262760 97659 367784
17911C67784a37500H4526C9874A9184M0415J6458c10546J04457Q8160l79962B2016
$$ 367784 -137500 84526 39874 19184 59599 76057 -310546 -206089 -117929 -497891 22016
17899I5414c4980m9784k4351M5648j53455N6202F3004K4481b73899a08813b4251
$$ 95414 -34980 -84764 -109115 -63467 -216922 -160720 63004 87485 -273899 -108813 -24251
17887i6201B7981O8312D0196J94580G5775a20048B4830J4005b18443e2978n0278
$$ -96201 27981 96293 40196 234776 75775 -120048 24830 38835 -218443 -52978 -103256
17876a03256A00654A3272K426K6385K68583H9253e2474m6140E0299i092q2829
$$ -103256 100654 13272 15698 42083 310666 89253 -52474 -98614 50299 -9092 -91921
17865i1921l117G6534A2490a3636l89627a83415f2134D9309a64268L1436c5737
$$ -91921 -95038 76534 12490 -13636 -403263 -183415 -62134 49309 -164268 -132832 -35737
17853A53790E8515P5062i8831c0590Q709D9685L0770J10916o3367b50570a10666
$$ 153790 58515 133577 -98831 -30590 -21881 49685 80455 191371 128004 -250570 -110666
17841a1083A01980j5971J8769R4632l0885a73848B00477b0956I6214J62368K1885
$$ -11083 101980 86009 104778 199410 168525 -173848 200477 -20956 96214 258582 280467
17830B80467A5322a23867N9823G1185J96939E1003M1370k6623e082j06147o8562
$$ 280467 15322 -123867 -64044 71185 268124 51003 92373 65750 -5082 -111229 -179791
17819a79791k48161J16257A9889m567a59961M1833p244A70499b0140o1013M0388
$$ -179791 -427952 -311695 19889 15322 -159961 -118128 -125372 170499 -20140 -81153 -40765
17808d0765j24786Q0080a9999k35536D1692c26149a36293k5071j0820L6730j01819
$$ -40765 -165551 -85471 -19999 -255535 41692 -326149 -136293 -161364 -172184 -135454 -237273
17797b37273G7053C3237M2016d2775n6095j76556a28813A32692E0797L6018N5381
$$ -237273 77053 33237 75253 -42775 -98870 -275426 -128813 132692 50797 86815 142196
17786A42196m1062b78060J01513A80593a54581A6484J02058k1763b84035f2336
$$ 142196 101134 -278060 -176547 180593 -154581 16484 118542 96779 -284035 -62336
17775b52997g2437I8732a7315k69485C8050a0315m462A30597N120f5411A65345
$$ -252997 -72437 98732 -17315 -286800 38050 -10315 -14777 130597 135717 -65411 165345
17763A75429E7851g8811G4330l5740K7441i8603b0076H9240k605L7504k7780c64913
$$ 175429 57851 -78811 74330 38590 66031 -98603 -20076 89240 86635 124139 96359 -364913
17750a17288F6346c62230d4034k7434I1766L7759d62977a05577p9510K3391j5748
$$ -117288 66346 -362230 -44034 -71468 91766 129525 -462977 -105577 -185087 -161696 -177444
17739a77444Q3290B39971F0516J73322G4313M3673C3178A1122a3762B8507d6742
$$ -177444 -94154 239971 60516 233838 74313 117986 33178 11122 -13762 28507 -46742
17727a68799i332j43912A31742D2072c84338C37025a64387A79076A3056K36285
$$ -168799 -9332 -153244 131742 42072 -384338 337025 -164387 179076 13056 249341
17717B49341h8226H7180R5471a05809j75671a8912A51314b81522A88903a42640
$$ 249341 -88226 87180 182651 -105809 -281480 -18912 151314 -281522 188903 -142640
17706C25047k6434j40001B4039L7828Q3832B2871c83488J82731k9491B76186F1800
$$ 325047 298613 158612 24039 61867 145699 22871 -383488 -200757 -230248 276186 61800
17694a9796I3850a40142G9244K75909b79860D3647a48407j12114f2416E8975N5028
$$ -19796 93850 -140142 79244 355153 -279860 43647 -148407 -260521 -62416 58975 114003
17683A14003K15451A4434J23986c83283d7254A30745J88270F9192J42507e6186
$$ 114003 329454 14434 138420 -383283 -47254 130745 319015 69192 211699 -56186
17672B97116a28240k4858A57093a2520k24561g008C8764e249r9199B67336A06608
$$ 297116 -128240 -153098 157093 -12520 -237081 -7008 38764 -5249 -104448 267336 106608
17660A82363G5999j0713a89578B07285d16558i4526C3763a91522g2937p3577b6884
$$ 182363 75999 65286 -189578 207285 -416558 -94526 33763 -191522 -72937 -146514 -26884
17648a1981k52998A23950e209r4031r8599H2984a20815B68104b5102D4652j0029
$$ -11981 -264979 123950 -5209 -99240 -197839 82984 -120815 268104 -25102 44652 34623
17637C4623c5921a0991I7612g5170C7743J40225H7868J74711D3651J78105e9062
$$ 34623 -35921 -10991 97612 -75170 37743 177968 87868 262579 43651 221756 -59062
17625b10729i9941D51117A2016K4747O6137M3361K6359f7270D7423a33548A37549
$$ -210729 -99941 451117 12016 36763 102900 146261 172620 -67270 47423 -133548 137549
17613a70877j64965a36535B14592R0203a29627A25539K71568f8358I7064a23078
$$ -170877 -335842 -136535 214592 304795 -129627 125539 397107 -68358 97064 -123078
17602a61644A37781O7556D9584a68657B08088D2745J34057d5575A94355g2941
$$ -161644 137781 205337 49584 -168657 208088 42745 176802 -45575 194355 -72941
17591C2920a15192B64583B1811h6617B64719j03023J3010m0582O6555e6297j97719
$$ 32920 -115192 264583 21811 -86617 264719 161696 174706 134124 200679 -56297 -254016
17580b54016P07A40130N6963C8113K71333a22843i674B25053r2863J6544C2446
$$ -254016 -253309 140130 197093 38113 309446 -122843 -9674 225053 132190 148734 32446
17568D8456a60031A59062a78292d2934o3738H3809C3578e4415A60293F0869o041
$$ 48456 -160031 159062 -178292 -42934 -106672 83809 33578 -54415 160293 60869 54828
17557E4828k6239L46921j86034o3085D3665a11291m9159B00340e8125B7007N2044
$$ 54828 28589 375510 189476 126391 43665 -111291 -160450 200340 -58125 27007 79051
17546G9051b39784a14583C6330a81573I7241C433J75459C4242K9019l923e7852
$$ 79051 -239784 -114583 36330 -181573 97241 3433 178892 34242 63261 59338 -57852
17534A68159i9019G7601h7336A84067k8796g4853C44467A10243A9465K22838a62226
$$ 168159 -99019 77601 -87336 184067 155271 -74853 344467 110243 19465 242303 -162226
17522B16793p7081b36953A51614k9986l6382Q1013p1221a61524A92791a09044
$$ 216793 139712 -236953 151614 121628 85246 166259 95038 -161524 192791 -109044
17511b17911L0823A6780d7053B73182d1496j88618A44661i9155F3068J61440C5630
$$ -217911 -187088 16780 -47053 273182 -41496 -230114 144661 -99155 63068 224508 35630
17499b07737A3226J66505a98604A28825e014l94A27885n1025G403K54065o2871
$$ -207737 13226 179731 -198604 128825 -5014 -5408 127885 76860 7403 261468 198597
17488A98597M7530l5179d8211D56531A35245K65925I0097J54596B2964O8735M06738
$$ 198597 246127 210948 -48211 456531 135245 401170 90097 244693 22964 91699 498437
17477D98437F4352K15006n4912C4925K44682n4948b81407A77359n2112j4876p025
$$ 498437 64352 279358 224446 34925 279607 224659 -281407 177359 125247 110371 103346
17466A03346K10150a13714A19872n885E6359J33881r4211J44256J59244A96867
$$ 103346 313496 -113714 119872 113987 56359 190240 96029 240285 399529 196867
17455A36376N181J52392k8094J6028I6624J97628P6626k2556A24822N38820h0685
$$ 136376 141557 293949 265855 281883 96624 294252 370878 348322 124822 663642 -80685
17443C61978A79468L41326d3418c829C25904G035L47798H6183J14196K49507b74442
$$ 361978 179468 520794 -43418 -3829 325904 7035 354833 86183 200379 449886 -274442
17431A27983k2607m9672L93445k16314O5992A1413a23251A02655L39248M1789
$$ 127983 105376 55704 449149 232835 298827 11413 -123251 102655 441903 483692
17421D83692j46420A23472J99260o0390n8579M8923J06370j50563M1174n708m341
$$ 483692 337272 123472 322732 262342 203763 252686 359056 208493 249667 243959 239618
17410B39618J61554A95599K10831j52736j00198J30075j08374K88315A13736J44117
$$ 239618 401172 195599 406430 253694 153496 283571 175197 463512 113736 257853
17400B57853q2262b00092A7255K9550a56750A13032E3289c571B71208G568K70218
$$ 257853 175591 -200092 17255 46805 -156750 113032 53289 -3571 271208 7568 277786
17389B77786e7430k24849A85855b21737C79804a78160N2579K4742j07703H9880
$$ 277786 -57430 -282279 185855 -221737 379804 -178160 -125581 -100839 -208542 89880
17378B09394r1326K5481K51546K2958a7079A15833C4962L47909R0665C3846J41404
$$ 209394 118068 143549 395095 418053 -17079 115833 34962 382871 473536 33846 175250
17367A75250O2047P3880g230k72A54525H493K28278B9134b65873J29468A17691
$$ 175250 237297 311177 -7230 -7502 154525 8493 236771 29134 -265873 -136405 117691
17355H9094J25763D2875M56309A77136P9381L76657A43683K7364d8637A16804
$$ 89094 214857 42875 499184 177136 256517 633174 143683 171047 -48637 116804
17344G3350Q0366Q7742j15611F1071c1451C4466J04731E3348M74037B08180O7108
$$ 73350 153716 241458 125847 61071 -31451 34466 139197 53348 527385 208180 275288
17333B75288D9777K37572E8038K13864D4140O1956C5242P7510K09386I5310N8111
$$ 275288 49777 287349 58038 271902 44140 106096 35242 112752 322138 95310 153421
17322A53421a12296A5700L7727J81556a6513G2802J39407I3032K00229f5153p122
$$ 153421 -112296 15700 53427 234983 -16513 72802 212209 93032 293261 -65153 -72275
17311g2275A08559J53166m8920l152M1537e4478B32057C809J08641n4685N6105
$$ -72275 108559 261725 212805 209653 251190 -54478 232057 3809 112450 57765 113870
17300A13870K38775j67588J67502l3577B7061J91870f518A04752A7683K83153
$$ 113870 352645 185057 352559 318982 27061 218931 -6518 104752 17683 300836
17290C00836j16857K04999J40116k24739A20811J07982E4298e1931A34482k4892
$$ 300836 183979 388978 529094 304355 120811 228793 54298 -51931 134482 109590
17280A09590J83645L9498A62500P4814m1940q7631N344k0614a10709B04678q7174
$$ 109590 293235 332733 162500 237314 195374 107743 113087 92473 -110709 204678 117504
17269A17504J36793q2263Q8709A18954K68488L03425A67435C5247L60536j07476
$$ 117504 254297 172034 260743 118954 387442 690867 167435 35247 395783 288307
17259B88307j41792N1573R5559a052q99k0836A37078M585L2080r102J2895a99760
$$ 288307 146515 198088 293647 -1052 -1951 -22787 137078 141663 173743 164641 177536 -199760
17246C81210A09532L3400N27766a2991C02325a11069R595B27657r9479J8141L37386
$$ 381210 109532 142932 670698 -12991 302325 -111069 -101474 227657 128178 146319 483705
17235D83705A9998J48826J84727o3377b2493A60301N7124M8393L76998c4833j2592
$$ 483705 19998 168824 353551 290174 -22493 160301 217425 265818 642816 -34833 -47425
17224d7425B30724q2964J61780E7171L41984A40590j8052C1516J24914J12311
$$ -47425 230724 147760 309540 57171 399155 140590 122538 31516 156430 268741
17214B68741K48033k32888J38010j48823q3212J59763j00888q4916b12357B39698
$$ 268741 516774 283886 421896 273073 189861 349624 248736 163820 -212357 239698
17203A2633M63844j38476J06757A2385K01345l3100j0426L1874n4435m6295a5481
$$ 12633 476477 338001 444758 12385 213730 180630 170204 202078 147643 101348 -15481
17191B03559k9125J97102J69061j57097F7609M01289H8672N15982B47039j15498
$$ 203559 174434 371536 540597 383500 67609 468898 88672 604654 247039 131541
17181A31541R9117J82780A30423M25239k65952I3949J39416P7199A49054I142
$$ 131541 230658 413438 130423 555662 289710 93949 233365 310564 149054 9142
17170B11688J88833r2562k30R0244K07599e9002F3579J26247k835N1109a08137
$$ 211688 400521 307959 307729 397973 605572 -59002 63579 189826 186991 238100 -108137
17158B26672L30183B18544H802O43481B18490R6027j29844K53270j72063b1067
$$ 226672 556855 218544 8802 652283 218490 314517 184673 437943 265880 -21067
17147A33021J55989K83024M4078k96150l5393J25914m3500j80008p7938M6806
$$ 133021 289010 572034 616112 319962 284569 410483 366983 186975 109037 155843
17137A55843K1957M03560j56416k8660J29882k53548J58500j80663k4750E9511
$$ 155843 177800 581360 424944 396284 526166 272618 431118 250455 225705 59511
17126E65092k0255k11449J26923K6178B40461K89161k459B33635M12547B21796
$$ 565092 544837 333388 460311 486489 240461 529622 527163 233635 646182 221796
17115C80983j29886J12103O0767R2072A76202K96988k8783o1074l693j07951N6491
$$ 380983 251097 363200 423967 516039 176202 473190 444407 383333 379640 271689 328180
17104C28180L2559r8131K29203j68674K48944Q3099j18055L1522K5174k45654
$$ 328180 360739 262608 491811 323137 572081 655180 537125 568647 593821 348167
17094C48167L99431k45291q9726A79263J65612K73071B70854J45924K25222A89326
$$ 348167 747598 502307 412581 179263 344875 617946 270854 416778 642000 189326
17083F75566E5211J91753M19160l19671J05124n5896j01246J55813b50255E11190
$$ 675566 55211 246964 666124 346453 451577 395681 294435 450248 -250255 511190
17072C00696J55865J6285K2334K04227B23926K10193A37212L13298j00168N50280
$$ 300696 456561 472846 495180 699407 223926 434119 137212 450510 350342 900622
17062I00622m18631j23096j47055N03730B60396L65826j24413j87937M49817C01914
$$ 900622 481991 358895 211840 715570 260396 626222 501809 313872 763689 301914
17051D19931J24339K6731K55587j63946o0414L01938l21976m4136n7406j509K4389
$$ 419931 544270 571001 826588 662642 602228 904166 582190 538054 480648 479139 503528
17040E03528n9145K12529k24084M14812l49154K05480m024r0394K91521o4675
$$ 503528 444383 656912 432828 847640 498486 703966 699942 609548 901069 836394
17030H36394j89329l9267j43305k26790K80094K61529l3951J9892j83395L8788
$$ 836394 647065 607798 464493 237703 517797 779326 745375 765267 581872 620660
17020F20660j57781K77866j11781K9496Q2555j83512R2886J91258j14717j73041
$$ 620660 462879 740745 628964 658460 741015 557503 650389 841647 726930 553889
17010E53889M8752J51538O4185k51770J75168j79948K80414j0886J26737j98820
$$ 553889 602641 754179 818364 566594 741762 561814 842228 831342 958079 759259
17000G59259j94818K7442Q4498K94284q7423j08096j62179J90096l12453K64778
$$ 759259 564441 591883 676381 970665 883242 775146 612967 803063 490610 755388
16990G55388K36723L5863l9516j74503K19421k23929K70559j21202k70778L04790
$$ 755388 992111 1027974 988458 813955 1033376 809447 1080006 958804 688026 992816
16980I92816j59375M52913n25227N28097k46478N4239j80450N096M5790q542j47075
$$ 992816 833441 1286354 761127 1289224 1042746 1096985 916535 921631 967421 958879 811804
16969H11804Q7665L23817k52133J7388J00606k79314m2848L41601k75803R6583
$$ 811804 899469 1223286 971153 988541 1089147 809833 766985 1108586 832783 929366
16959I29366K29717J7402n0437L42798l01041k491j81662K76919j80337j92041
$$ 929366 1159083 1176485 1126048 1468846 1167805 1165314 983652 1260571 1080234 888193
16949H88193J82115m6342j71598O9402M01068m3630k17498r8798L44520o5339
$$ 888193 1070308 1023966 852368 921770 1322838 1279208 1061710 962912 1307432 1242093
16939A242093n6548L55325l32678K39176j84077J27380M9817l60890J72192K60696
$$ 1242093 1185545 1540870 1208192 1447368 1263291 1390671 1440488 1079598 1251790 1512486
16929A512486r4159k22811J66780k51823N3357K44953J58959j18183m4846k844
$$ 1512486 1418327 1195516 1362296 1110473 1163830 1408783 1567742 1449559 1404713 1401869
16919A401869m8479J64250J15411j56700K44384k59749l0116K35972j95503L22167
$$ 1401869 1353390 1517640 1633051 1476351 1720735 1460986 1430870 1666842 1471339 1793506
16909A793506j69462j75013L67062j24084J14997j34891K84598k31616M7470k41665
$$ 1793506 1624044 1449031 1816093 1692009 1807006 1672115 1956713 1725097 1772567 1530902
16899A530902N05250k78535L29150m78352K89548L53141n65846M06252R5779j93318
$$ 1530902 2036152 1757617 2086767 1608415 1897963 2251104 1685258 2091510 2187289 1993971
16889A993971L19103m41950K22372L9165K38383N0659j19114j05228J52615m1250
$$ 1993971 2313074 1871124 2093496 2132661 2371044 2421703 2302589 2197361 2349976 2308726
16879B308726J43021K05405m77565K60444J82145j29872k70989L56030J58622
$$ 2308726 2451747 2657152 2179587 2440031 2622176 2492304 2221315 2577345 2735967
16870B735967J3177q8759J83165l66670L34256J57413j89818J47568j49325K45451
$$ 2735967 2749144 2660385 2843550 2476880 2811136 2968549 2778731 2926299 2776974 3022425
16860C022425L10110m63448j5528L63045m2414J02080N9444m5718L65127l97041
$$ 3022425 3332535 2869087 2853559 3216604 3174190 3276270 3335714 3289996 3655123 3258082
16850C258082L63380j45694r2044L26304K9070j60157L50460k32874K86068L37230
$$ 3258082 3621462 3475768 3383724 3710028 3739098 3578941 3929401 3696527 3982595 4319825
16840D319825j84035k8140M5472J51594j78278L98068n9833M38085N6020k58393
$$ 4319825 4135790 4107650 4153122 4304716 4126438 4524506 4464673 4902758 4958778 4700385
16830D700385J88625j46660L38275L65468L1817l70243N48238j45914K91698j9833
$$ 4700385 4889010 4742350 5080625 5446093 5477910 5107667 5655905 5509991 5801689 5781856
16820E781856K79916O7081j58049O7453N76679j83854J05908J83220M1870M29758
$$ 5781856 6061772 6128853 5970804 6038257 6614936 6431082 6536990 6720210 6762080 7191838
16810G191838o3463J30960N32788j702J05292P3461L11367J28582M51143k39746
$$ 7191838 7128375 7259335 7792123 7790421 7895713 7969174 8280541 8409123 8860266 8620520
16800H620520M14969K86833L62664k15403N75313p4453P39082Q4774J02950K10830
$$ 8620520 9035489 9322322 9684986 9469583 10044896 9970443 10709525 10794299 10897249 11108079
16790A1108079M97630L96416K13845O14433p5197K97988N49831L99688K72830
$$ 11108079 11605709 12002125 12215970 12830403 12755206 13053194 13603025 14002713 14275543
16781A4275543O39076R186R77363J24087O98188O62594N99651N48935M51566N36121
$$ 14275543 14914619 14923805 15901168 16025255 16723443 17386037 17985688 18534623 18986189 19522310
16771A9522310N29079R31873Q45942P01353N74909J225504N40790J349392O17088
$$ 19522310 20051389 20983262 21829204 22530557 23105466 24330970 24871760 26221152 26838240
16762B6838240J093320O86700R51646J537092J141228J558625J743612J321510
$$ 26838240 27931560 28618260 29569906 31106998 32248226 33806851 35550463 36871973
16754C6871973J311336K176163J563795K107239J488738K240230K329617K592132
$$ 36871973 38183309 40359472 41923267 44030506 45519244 47759474 50089091 52681223
16746E2681223K649224K593604K864195L312296K825216L853907L286914L659689
$$ 52681223 55330447 57924051 60788246 64100542 66925758 70779665 74066579 77726268
16738G7726268M329823M370927M169810M684352M820816M905955N505128N273404
$$ 77726268 82056091 86427018 90596828 95281180 100101996 105007951 110513079 115786483
16730A15786483N371278M944528N892410N330157N103369N433950M500866M541217
$$ 115786483 121157761 126102289 131994699 137324856 142428225 147862175 152363041 156904258
16722A56904258L624233L469709K595035J584114J261560J92467m42297j624824
$$ 156904258 160528491 163998200 166593235 168177349 169438909 169631376 169189079 167564255
16714A67564255k094593l251787l582152m125770m925939n094000n371393n651260
$$ 167564255 165469662 162217875 158635723 154509953 149584014 144490014 139118621 133467361
16706A33467361n034635n745639n240770n109533n465611m919461m702509n024354
$$ 133467361 128432726 122687087 117446317 112336784 106871173 101951712 97249203 92224849
16698I2224849m268873m181838m089783l775841l672487l454382l126524l316566
$$ 92224849 87955976 83774138 79684355 75908514 72236027 68781645 65655121 62338555
16690F2338555k928828k525927k385864k585584k446426k141288k178313j656336
$$ 62338555 59409727 56883800 54497936 51912352 49465926 47324638 45146325 43489989
16682D3489989k349198j881599j091735j645580j861134j209176j473059j289121
$$ 43489989 41140791 39259192 38167457 36521877 34660743 33451567 31978508 30689387
16674C0689387j004923j269336j157790j100619j069560r50478o62631j032481
$$ 30689387 29684464 28415128 27257338 26156719 25087159 24136681 23474050 22441569
16666B2441569p54644o30936p20799p82674q58483l07694p82423n61203m90617
$$ 22441569 21686925 21055989 20335190 19552516 18694033 18386339 17603916 17042713 16552096
16657A6552096n98321m06564r24308o8187l94592r62274K76346n70134o45513
$$ 16552096 15953775 15547211 14622903 14554716 14160124 13197850 13474196 12904062 12258549
16648A2258549l81211l0160n52003j71494o68612J9417l91565l480q67517k0102
$$ 12258549 11877338 11847178 11295175 11123681 10455069 10474486 10082921 10079441 9211924 9191822
16638I191822j72278k70199J25257k55695j69682o25787J56159j89633k53359
$$ 9191822 9019544 8749345 8874602 8618907 8449225 7823438 7979597 7789964 7536605
16629G536605j00200n03663n0781J06102Q3494o14013q9592m09692P27340n00117
$$ 7536605 7436405 6932742 6881961 6988063 7071557 6457544 6367952 5958260 6685600 6185483
16619F185483j55774n10887P551J08899j41265j48637l01516K23878l65863M8890
$$ 6185483 6029709 5518822 5526373 5635272 5494007 5345370 5043854 5267732 4901869 4950759
16609D950759m94659K49875L0151n71002N60736n09725j8417J82721o59727L14808
$$ 4950759 4456100 4705975 4736126 4165124 4725860 4216135 4197718 4380439 3720712 4035520
16599D035520K896N5247n04559N72258l15458L5063k25553k54142q9160P1924
$$ 4035520 4038416 4093663 3589104 4161362 3845904 3880967 3655414 3401272 3312112 3384036
16589C384036M1785J21432m14888M07211l64230j64390J65922m21890L44060o0672
$$ 3384036 3425821 3547253 3132365 3539576 3175346 3010956 3176878 2754988 3099048 3038376
16579C038376j80123J49465k79851K74431m06672K99076k47360l1344J47389k11335
$$ 3038376 2858253 3007718 2727867 3002298 2595626 2894702 2647342 2615998 2763387 2552052
16569B552052o0022m5588J32065k05986J06214l28657J35295k13042N3582q2925
$$ 2552052 2492030 2446442 2578507 2372521 2478735 2150078 2285373 2072331 2125913 2042988
16559B042988N43233n81798L79268l65947J76880j10721k49133N67657j79577
$$ 2042988 2586221 2004423 2383691 2017744 2194624 2083903 1834770 2402427 2222850
16550B222850l56042m9566j45107M9161K77164r3514K01741l73616O9757j806
$$ 2222850 1866808 1817242 1672135 1721296 1998460 1904946 2106687 1733071 1802828 1801022
16540A801022j20751K01994k27333K67603m41409K88259j74429j02177L26584
$$ 1801022 1680271 1882265 1654932 1922535 1481126 1769385 1594956 1492779 1819363
16531A819363k89507N814J81860n42446J78168J69798l16058J17223l24032L04927
$$ 1819363 1529856 1535670 1717530 1175084 1353252 1523050 1206992 1324215 1000183 1305110
16521A305110j15940l54045M32147r9274J03691k62240J91005Q4900N4820p5912
$$ 1305110 1189170 835125 1267272 1167998 1271689 1009449 1200454 1285354 1340174 1264262
16511A264262k1905j62186P5444N7734j51874J70996J47913j71486K7900j89416
$$ 1264262 1242357 1080171 1155615 1213349 1061475 1232471 1380384 1208898 1236798 1047382
16501A047382J8253K98261k17040o2187j01198j24931J83635l87991K17974L05447
$$ 1047382 1065635 1363896 1146856 1084669 983471 858540 1042175 654184 872158 1177605
16491A177605k15609m560j38669L7195l0506K09912j28574K32036m66991P4971
$$ 1177605 961996 957436 818767 855962 825456 1035368 906794 1138830 671839 746810
16481G46810J71246P4755J12990m8827l34631J00297m4816M87325n80997Q3691
$$ 746810 918056 992811 1105801 1056974 722343 822640 777824 1265149 684152 767843
16471G67843L4825j37789J99152k74197K64561k78642J79470m4039j09001k9428
$$ 767843 802668 664879 864031 589834 854395 575753 755223 711184 602183 572755
16461E72755J11012J16214k38960j97295O49183k12460j72987M01679m24297r9746
$$ 572755 683767 799981 561021 363726 1012909 800449 627462 1029141 604844 505098
16451E05098n703L15688m1600j44524j6536o5489K49690k34659K97461l8781m2166
$$ 505098 499395 815083 773483 628959 612423 546934 796624 561965 859426 820645 778479
16440G78479l48996M57523j33453k23340l3239K65384C10921K7390J11888O9189
$$ 778479 429483 887006 753553 530213 496974 762358 310921 338311 450199 519388
16430E19388j983K40859k56477M2347l4689L35618l45571P8416j89558N888N78901
$$ 519388 517405 758264 501787 544134 509445 845063 499492 577908 388350 394238 973139
16419I73139C09750L65120B09616N42931C23121P4457J97408j77172J74771j7354
$$ 973139 309750 674870 209616 752547 323121 397578 594986 417814 592585 575231
16409E75231j68586A60269L1365M32273k35533L6147j45883r2054M53847k39390
$$ 575231 406645 160269 191634 623907 388374 424521 278638 186584 640431 401041
16399D01041J94506o0148L5636j30980A33254K53551Q8509M6056m0178m6297J31185
$$ 401041 595547 535399 571035 440055 133254 386805 475314 521370 481192 434895 566080
16388E66080B26042J49465K29332j30036r1677J80486K0492q2975j40481J97674
$$ 566080 226042 375507 604839 474803 383126 563612 584104 501129 360648 558322
16378E58322B39580J62402J8938P3218j42285N6958N0100I8614J51435M44879
$$ 558322 239580 401982 420920 494138 351853 408811 458911 98614 250049 694928
16368F94928A88119K08827M3406k09310J88351K71361k16954p7649K03356B14092
$$ 694928 188119 396946 440352 231042 419393 690754 473800 396151 599507 214092
16357B54598J50075P2653j94662J52112j63025J0206m4085I8505K30002l1631
$$ 254598 404673 477326 282664 434776 271751 281957 237872 98505 328507 296876
16347B96876J81746j35925b4279B81847J60275H3764J15146K75203A83062O4294
$$ 296876 478622 342697 -24279 281847 442122 83764 198910 474113 183062 247356
16337B47356R8911n7118m8296M09790j99484M6022B3920M90370n1815A38751K09971
$$ 247356 346267 289149 240853 650643 451159 497181 23920 514290 462475 138751 348722
16326C48722A69743K34312e5991C57310J38273B47120j4432J47911q9824n0269
$$ 348722 169743 404055 -55991 357310 495583 247120 232688 380599 290775 240506
16316B40506m0223K47205j45979j42942J93732j61837n0166Q5045j2742o5982
$$ 240506 200283 447488 301509 158567 352299 190462 140296 225341 212599 146617
16306A46617K6163m4492O4032D4778J26798L18646B44517J66391K304j18456l6467
$$ 146617 172780 128288 192320 44778 171576 490222 244517 410908 413212 294756 258289
16295B58289B4118K3881K06939D8814L23846B1808J46394K82234E7695K38061
$$ 258289 24118 47999 254938 48814 372660 21808 168202 450436 57695 295756
16285B95756R3006j17797e3870B33699f2595C40959J75639A86941r2255L46407
$$ 295756 388762 270965 -53870 233699 -62595 340959 516598 186941 94686 441093
16275D41093f6961A32635l1278J01085f8427A08256J69926f9642B8957K62975
$$ 441093 -66961 132635 101357 202442 -68427 108256 278182 -69642 28957 291932
16265B91932j00174a82876d7496B6714N0042J36352j01278J67140m6829n9055
$$ 291932 191758 -182876 -47496 26714 76756 213108 111830 278970 232141 173086
16255A73086J80823j50502K01642c34555C23530j44624K62629I1924K5993R420
$$ 173086 353909 203407 405049 -334555 323530 178906 441535 91924 117917 127337
16245A27337a41155N5695A54365K41868j74886f3435C11581m6052C9078b7678
$$ 127337 -141155 -85460 154365 396233 221347 -63435 311581 265529 39078 -27678
16234G6020J09698g0779o8592C04074o4513b59736E42723B51392a49656B36451
$$ 76020 185718 -70779 -139371 304074 239561 -259736 542723 251392 -149656 236451
16223A06172M4550a02580B6117K35208p4667a41676C78675J0507A81496n2119
$$ 106172 150722 -102580 26117 261325 186658 -141676 378675 389182 181496 129377
16213A29377M0153o4563e969j36408c2544C25381a4651G5024O7605R0016J85556
$$ 129377 169530 104967 -5969 -142377 -32544 325381 -14651 75024 142629 232645 418201
16202D18201j74995d6925J1766A33013K8866B6350K3754J08022o1980a15421B16814
$$ 418201 243206 -46925 -35159 133013 161879 26350 50104 158126 96146 -115421 216814
16190H3414a61301D88708j88769D6457b55909B10603F6381E529J2488M0873L00322
$$ 83414 -161301 488708 299939 46457 -255909 210603 66381 5529 18017 58890 359212
16179C59212D5759d735k11201A93727J2628i4578j01226A16174E3170c287l33605
$$ 359212 45759 -4735 -215936 193727 206355 -94578 -195804 116174 53170 -3287 -336892
16168c36892B56133E7606c3518B10376a95038i35B55276N8178a15818C41542C7893
$$ -336892 256133 57606 -33518 210376 -195038 -935 255276 313454 -115818 341542 37893
16156A44463a8943G6730R0295a19567c2555F4061K96140I7868j5673R9412a69522
$$ 144463 -18943 76730 167025 -119567 -32555 64061 360201 97868 82195 181607 -169522
16144D4431c6918l0576j6307l3736A68587d4866j70192j97400a79460f3023D62789
$$ 44431 -36918 -67494 -83801 -117537 168587 -44866 -215058 -412458 -179460 -63023 462789
16132B48779c06511g8716A59637b08762B55933C5208K03060j18400N0404a38352
$$ 248779 -306511 -78716 159637 -208762 255933 35208 238268 119868 170272 -138352
16121b08608f2591j58040A47783K74292i2716B84809b53931J02845c7874l56316
$$ -208608 -62591 -220631 147783 422075 -92716 284809 -253931 -151086 -37874 -394190
16111c94190B2463M2228A8872J52856b59346B58853B8151R0685a07061M8297j21928
$$ -394190 22463 64691 18872 171728 -259346 258853 28151 118836 -107061 -58764 -180692
16100a80692B35963a05173m35950G3526J0062Q8702A9436K96373j02645c18094
$$ -180692 235963 -105173 -541123 73526 83588 172290 19436 315809 213164 -318094
16089C9002a56379e1721A33234i1298L1643F9746M1185Q263e3209D7909P1306
$$ 39002 -156379 -51721 133234 -91298 -59655 69746 110931 119194 -53209 47909 119215
16078A19215a074B1229J11904d2114j42673I8003J93862I0469K67579h8361G933
$$ 119215 -1074 21229 133133 -42114 -184787 98003 291865 90469 358048 -88361 7933
16066A52209a7375A39480B8471O5841a62273A50877R51Q7701D3625b46315K2722
$$ 152209 -17375 139480 28471 94312 -162273 150877 151828 239529 43625 -246315 -223593
16055b23593F523b96451A9250K35998c88656J49080B15452j07120N3160R2102
$$ -223593 6523 -296451 19250 255248 -388656 -239576 215452 108332 161492 253594
16045B53594d79096J93360a02710B8151b67555a526j56190F6169a43023n878a25
$$ 253594 -479096 -285736 -102710 28151 -267555 -1526 -157716 66169 -143023 -148901 -125
16033d1068D5295J85032D0192h4970B74332I4764b63042g5827b5575D11878a00442
$$ -41068 45295 230327 40192 -84970 274332 94764 -263042 -75827 -25575 411878 -100442
16021f0871j45578o1776e8352D3972M4859Q6143a33240A22260a1104j57396d3405
$$ -60871 -206449 -268225 -58352 43972 88831 174974 -133240 122260 -11104 -168500 -43405
16009A38011h0034l899H3001b24313o1930C9327f3986A21254j4655L08309i341
$$ 138011 -80034 -83933 83001 -224313 -286243 39327 -63986 121254 106599 414908 -9341
15997B35044b82974A56333a74771e4244n55335B38332F4348c74992A84628H6955
$$ 235044 -282974 156333 -174771 -54244 -609579 238332 64348 -374992 184628 86955
15986F7155L6142b2118C59731j62862E8710J47129I1561a5457E3987e4253C53146
$$ 67155 103297 -22118 359731 196869 58710 205839 91561 -15457 53987 -54253 353146
15974g4515A09178L3930k7532j2188K57617A557e1865B17417a45232A14643a29619
$$ -74515 109178 143108 115576 103388 361005 1557 -51865 217417 -145232 114643 -129619
15962b4486j3671R536G0880M0537b20714A58304D9561a60060e6195B54083m1841
$$ -24486 -38157 -28621 70880 111417 -220714 158304 49561 -160060 -56195 254083 212242
15951B12242F5841J7458a814E4874a55737l6318m8030P6073P1551B1245e8013
$$ 212242 65841 83299 -1814 54874 -155737 -192055 -240085 -164012 -92461 21245 -58013
15939A12570J1348K4224b84040J37175o910P5370k02718d026C3449b09239A3226
$$ 112570 123918 148142 -284040 -146865 -153775 -78405 -281123 -4026 33449 -209239 13226
15927a75044l3972B0354g648m07723K02238d6577K49A37322a9355j2820I8186
$$ -175044 -209016 20354 -7648 -415371 -213133 -46577 -46328 137322 -19355 -32175 98186
15915a33159D0781Q6941J341b85434a22469l79657J71671C9358a59715o7729A03912
$$ -133159 40781 127722 129063 -285434 -122469 -502126 -330455 39358 -159715 -227444 103912
15903h4588I996a25895B93590a9832l11l87A40902Q6427A9331a94957A57167Q5168
$$ -84588 9996 -125895 293590 -19832 -20143 -20530 140902 227329 19331 -194957 157167 242335
15891B42335A00024K1002D288J11760b07963G439M8823P1471a54911C00965J12816
$$ 242335 100024 121026 4288 116048 -207963 7439 56262 127733 -154911 300965 413781
15880D13781b04612B19419D5752K49618A07352K13574A1859e0618J0112p0211
$$ 413781 -204612 219419 45752 295370 107352 320926 11859 -50618 -40506 -110717
15870a10717B5785b64189B00867H5380k2790a82257A3839f1576k02384C0003a05101
$$ -110717 25785 -264189 200867 85380 62590 -182257 13839 -61576 -263960 30003 -105101
15858b8458G0388b04742m9185a8221Q891F4810d6637A8363a79787A5018C088a77913
$$ -28458 70388 -204742 -253927 -18221 -9330 64810 -46637 18363 -179787 15018 3088 -177913
15845c43628h8896D3749K3463a47859D1840o121L44411a80505E7925b96514H1337
$$ -343628 -88896 43749 67212 -147859 41840 35719 380130 -180505 57925 -296514 81337
15833a00397q6499m603K7751c149o5299A29734b32275N5030A54836a14540D1496
$$ -100397 -186896 -191499 -163748 -3149 -68448 129734 -232275 -177245 154836 -114540 41496
15821a22601n8763F0781A9861g9205k9342i279o7025j11235A14426D4909A8992
$$ -122601 -181364 60781 19861 -79205 -108547 -9279 -76304 -187539 114426 44909 18992
15809a58425r0113g3331n4344A2579a55131b9913j56832m4790A1493J30957g5794
$$ -158425 -248538 -73331 -127675 12579 -155131 -29913 -186745 -231535 11493 142450 -75794
15797d9443l75276J75543A44604i6632k7282A43491i5751C5937b69287c1197A85106
$$ -49443 -424719 -249176 144604 -96632 -123914 143491 -95751 35937 -269287 -31197 185106
15785E08991A59308c1714c006k080k3098C51130g3355I9723c47587J04709J04274
$$ 508991 159308 -31714 -3006 -5086 -28184 351130 -73355 99723 -347587 -242878 -138604
15774a38604A75321a47612B03944a44856e2773C62670b22914A31256a81615H2786
$$ -138604 175321 -147612 203944 -144856 -52773 362670 -222914 131256 -181615 82786
15763C20782a21046m501A27986c12130D5655g2463j02288d6019A23466c2374j03497
$$ 320782 -121046 -125547 127986 -312130 45655 -72463 -174751 -46019 123466 -32374 -135871
15752a35871l4579A00228b21795j99228A76487a9620k1203B05545N1167E3283
$$ -135871 -170450 100228 -221795 -421023 176487 -19620 -40823 205545 256712 53283
15741a36283F0095Q7432J8154a190k40984a17976H8520j0122Q2637L0877r2056
$$ -136283 60095 147527 165681 -1190 -242174 -117976 88520 78398 161035 191912 99856
15730I9856b38434a06373b0754C2470d0691A14683B0797L6572a04306A11012a17746
$$ 99856 -238434 -106373 -20754 32470 -40691 114683 20797 57369 -104306 111012 -117746
15718A8961a7639k82596a0513k2669j17007k2228A46501b03684L203j87929a28824
$$ 18961 -17639 -300235 -10513 -33182 -150189 -172417 146501 -203684 -200481 -388410 -128824
15706b16578a00865l3605j34706C7976a27625A33545n529a17463A91716N9054
$$ -216578 -100865 -134470 -269176 37976 -127625 133545 128016 -117463 191716 250770
15696B50770J39C1687i3785D84879j15125e3537B91845a67126B9412a85757R0260
$$ 250770 250909 31687 -93785 484879 369754 -53537 291845 -167126 29412 -185757 -95497
15685i5497E2655j2688O1358J00443F5375j5022N3246i7979a9890A00538b9578
$$ -95497 52655 39967 101325 201768 65375 50353 103599 -97979 -19890 100538 -29578
15673b02880C17509E6142P1507A9262K10420F563J10602N1244e270q1478j30049
$$ -202880 317509 56142 127649 19262 229682 6563 117165 168409 -5270 -86748 -216797
15662b16797b638l2269p8959m1421A5429b838A8829c15600G2986R398a31238G9320
$$ -216797 -2638 -34907 -113866 -155287 15429 -2838 18829 -315600 72986 82384 -131238 79320
15649b15785c3940j08349j99138a29910B72459a63895N3816k05204r9551J44126
$$ -215785 -33940 -142289 -341427 -129910 272459 -163895 -110079 -315283 -414834 -270708
15639b70708e8807p2606B40574H8937b16914g5562A4857K43865O7913a29644j91605
$$ -270708 -58807 -131413 240574 88937 -216914 -75562 14857 258722 326635 -129644 -321249
15628c21249J10802C47469d5904F1608b22427P1758e8073k63523D7941a833G7680
$$ -321249 -210447 347469 -45904 61608 -222427 -150669 -58073 -321596 47941 -1833 77680
15616h0751k30399A89832G9501b23971g685A40053a74518j40642d3702F8596K409
$$ -80751 -311150 189832 79501 -223971 -7685 140053 -174518 -315160 -43702 68596 71005
15605G1005a32197C70091d7395A82686q6262a68337G3569h3343B15296m9424F2075
$$ 71005 -132197 370091 -47395 182686 96424 -168337 73569 -83343 215296 165872 62075
15593A72127a2819H307M2130A6563a64840M5368A35350c5463q2775A1460b7127
$$ 172127 -12819 8307 50437 16563 -164840 -119472 135350 -35463 -118238 11460 -27127
15581a6379j06492q1146P0490N8048A34982c3128I6571b8479j93138g7195o9250
$$ -16379 -122871 -204017 -133527 -75479 134982 -33128 96571 -28479 -221617 -77195 -146445
15570a46445B42078o5258b33280Q4712Q811A6914J209Q7172K07207j38687O3417
$$ -146445 242078 176820 -233280 -148568 -139757 16914 18123 105295 312502 173815 237232
15559B37232a40796a3118k68425C07296b06842d9999D5918b73720A44620i3237
$$ 237232 -140796 -13118 -281543 307296 -206842 -49999 45918 -273720 144620 -93237
15548c68092A74318D9362h7150J9024l655j39099C18674b78859a34714A8585c34680
$$ -368092 174318 49362 -87150 -68126 -71781 -210880 318674 -278859 -134714 18585 -334680
15536h125A57115a30095B6731b84642D7260g1034j3030F2475c0465C97080A6770
$$ -8125 157115 -130095 26731 -284642 47260 -71034 -84064 62475 -30465 397080 16770
15524A89270K761H3256d03006A03564a2587p2164j34375l54695K80316B36839
$$ 189270 192031 83256 -403006 103564 -12587 -84751 -219126 -573821 -293505 236839
15513H8799g9586j93405i4002C9990J17089l6753b74114A73640b67581Q7348C588
$$ 88799 -79586 -272991 -94002 39990 157079 120326 -274114 173640 -267581 -180233 3588
15501A4804J15625n7188j2223f7085B24821b49504f0052j02561A12296a04044
$$ 14804 130429 73241 61018 -67085 224821 -249504 -60052 -162613 112296 -104044
15490c8338n7677L3914j84114Q1940A40727g8908B7253a31509A61472a69244A05215
$$ -38338 -96015 -62101 -246215 -164275 140727 -78908 27253 -131509 161472 -169244 105215
15478e2240l58682a24805A49412c14597E1817J3090n507P8783a50876l7420i1839
$$ -52240 -410922 -124805 149412 -314597 51817 64907 59400 138183 -150876 -188296 -91839
15466a38074c716j38357O3160l93085a53179d7560B64279E1772a34908j54509
$$ -138074 -3716 -142073 -78913 -471998 -153179 -47560 264279 51772 -134908 -289417
15456b89417h4249n5107G9199c2217A96192a02785E3007c09864A06226G183J1034
$$ -289417 -84249 -139356 79199 -32217 196192 -102785 53007 -309864 106226 7183 18217
15445A8217Q5740N0931a43294A79642a36967k042b0258k27047A00066b25623n9336
$$ 18217 103957 154888 -143294 179642 -136967 -139009 -20258 -247305 100066 -225623 -284959
15434b84959B62193A23717a00421r4035g4053G2256A7720J12730L25848A24447
$$ -284959 262193 123717 -100421 -194456 -74053 72256 17720 130450 456298 124447
15423a5833D6268i1018B7963f0040l2335G9535J38772a98276f5999G8212b29693
$$ -15833 46268 -91018 27963 -60040 -92375 79535 218307 -198276 -65999 78212 -229693
15411E2332Q3017i9337M5786B144f5084E1165e780n0972A06572P4589e6358B39847
$$ 52332 135349 -99337 -53551 2144 -65084 51165 -5780 -56752 106572 181161 -56358 239847
15398B51742q4598c11881A18850f5662H6436K24264b69978Q0818P0554A47816
$$ 251742 167144 -311881 118850 -65662 86436 310700 -269978 -189160 -118606 147816
15387b819j03342E1365a3520A99906f63961D4961a39958o2735A69858a75844B69807
$$ -2819 -106161 51365 -13520 199906 -663961 44961 -139958 -202693 169858 -175844 269807
15375B22614D0929a16812p85B29877d3133B15137b47502J17193A49579A0859a18196
$$ 222614 40929 -116812 -117597 229877 -43133 215137 -247502 -130309 149579 10859 -118196
15363H3469b2324A0425a53873a766H2966d0369G7097K04249L0173F0911P5569
$$ 83469 -22324 10425 -153873 -1766 82966 -40369 77097 281346 311519 60911 136480
15352A36480N8446A3144J58986k1852a5080C94557D9978K0718i6640B52068a17743
$$ 136480 194926 13144 172130 150278 -15080 394557 49978 70696 -96640 252068 -117743
15340a91174N3363A45627a52048B53331m9457F786m51O6923B9960i3220D7094
$$ -191174 -137811 145627 -152048 253331 203874 6786 6335 73258 29960 -93220 47094
15328f9228a1522m148j35326M7895E9465e143A68946a60886I2643i467E5836B3306
$$ -69228 -11522 -15670 -150996 -103101 59465 -5143 168946 -160886 92643 -9467 55836 23306
15315A49944D6424i8222A81622c6925j84222A80178n8274e4944A29668c05219
$$ 149944 46424 -98222 181622 -36925 -221147 180178 121904 -54944 129668 -305219
15304i7101B56907G3206a84403G6324Q2833a33699G6487i6530k01682I7123c1109
$$ -97101 256907 73206 -184403 76324 159157 -133699 76487 -96530 -298212 97123 -31109
15292B049P5677a17036m3368p881L2668B64783i7051A61407B7862J70779m0523
$$ 2049 77726 -117036 -160404 -168285 -135617 264783 -97051 161407 27862 198641 158118
15281A58118p5502N7846b9453B07552L9326A3371P7717K36568a28996l5355C73764
$$ 158118 82616 140462 -29453 207552 246878 13371 91088 327656 -128996 -164351 373764
15269D19380A1337a52584I4028A6945A362L68488j41476F8148J89007B7403q547
$$ 419380 11337 -152584 94028 16945 1362 369850 228374 68148 257155 27403 18856
15258A8856K01123L9624H4957K07435A09572L18747k11783L5765K01660M27987
$$ 18856 219979 259603 84957 292392 109572 428319 216536 252301 453961 881948
15248H81948J2550j50078N9056k70258j65834I6849Q5617M60807A73321a59857
$$ 881948 894498 744420 803476 533218 367384 96849 182466 643273 173321 -159857
15237d8717A25100c5069I1107R2362E073L49655j24085a10963e3793A84452f1788
$$ -48717 125100 -35069 91107 183469 5073 354728 230643 -110963 -53793 184452 -61788
15225a7115B85771b32837I2848J3497j6989a93068B52212D1408e886r980A34306
$$ -17115 285771 -232837 92848 106345 89356 -193068 252212 41408 -5886 -15866 134306
15213f2194g952a04A39976a02181c9550A4819L24257B8940L5284b3408l1737j28824
$$ -62194 -7952 -104 139976 -102181 -39550 14819 339076 28940 64224 -23408 -55145 -183969
15201a83969E2316M7442c2060A3027N2696K06141A00274e8822A52978J57178i0420
$$ -183969 52316 99758 -32060 13027 65723 271864 100274 -58822 152978 310156 -90420
15189F9776f9905H3974h0846G3956b77129B48819A9413M6922k3282c8946C22657
$$ 69776 -69905 83974 -80846 73956 -277129 248819 19413 66335 43053 -38946 322657
15177b77783A16084J63967I2582K19984c50497C05401A00226a33186B74705A654
$$ -277783 116084 280051 92582 312566 -350497 305401 100226 -133186 274705 1654
15166A80724N5460Q4577c0214A1233f9032G053M63888c1733k36783C38912A55386
$$ 180724 236184 320761 -30214 11233 -69032 7053 470941 -31733 -268516 338912 155386
15154D59992k18726a09431c3922D6412M3783f7874C88991j87058r0589C1502N9394
$$ 459992 241266 -109431 -33922 46412 90195 -67874 388991 201933 111344 31502 90896
15143I0896L84719f5583b3840A33274J19541m3591D0714b602A9350J38239k3077
$$ 90896 475615 -65583 -23840 133274 252815 209224 40714 -2602 19350 157589 134512
15132A34512a69215F9159J38513c0757A31216b79411C9977J09913M3493j8914
$$ 134512 -169215 69159 207672 -30757 131216 -279411 39977 149890 193383 174469
15122A74469N5956K3652J03522b41330D29714D3752J99843a32028d3640B41504
$$ 174469 230425 254077 357599 -241330 429714 43752 243595 -132028 -43640 241504
15111B40998i9241A98322K50826F0811K17104k0764a05389A32590M8113M857N7997
$$ 240998 -99241 198322 449148 60811 277915 257151 -105389 132590 180703 185560 243557
15100B43557A21385e1222A39311L3293O5517r6983F5151J29000E7163J30299p729
$$ 243557 121385 -51222 139311 172604 238121 141138 65151 194151 57163 187462 179733
15089A79733n6442K0865J53342G4929g300I7271N4895K45353j72159h4755H2131
$$ 179733 123291 144156 297498 74929 -7300 97271 152166 397519 225360 -84755 82131
15077B45724b3021F2245o789K12584a0785j12740B47784J26228a57B16204p2980
$$ 245724 -23021 62245 55456 268040 -10785 -123525 247784 374012 -157 216204 143224
15066A43224R4813G9421J12081l8209k1326o3145J17765J72725j78899J55585
$$ 143224 238037 79421 191502 153293 131967 68822 186587 359312 180413 335998
15056C35998B9292K65468J23431B06778r8127h8081A43515N8516o7775K6767e394
$$ 335998 29292 294760 418191 206778 108651 -88081 143515 202031 134256 161023 -5394
15044C63861A32534j5096a22474B26616l7815J6743L9743k4834j4529P1728B5240
$$ 363861 132534 117438 -122474 226616 188801 205544 245287 220453 205924 277652 25240
15032H3172L19059n2954B884J05184J77907A22358P5168J96727B7668L33848j0234
$$ 83172 402231 349277 2884 108068 285975 122358 197526 394253 27668 361516 351282
15021C51282j12021M7145a8742D81770L0009r2512j95133C783b426I0910J93779
$$ 351282 239261 286406 -18742 481770 511779 419267 224134 3783 -2426 90910 284689
15010B84689n7878F6171O2691j7161A0119K23296H5320j2870k785N425P5710K02841
$$ 284689 226811 66171 128862 111701 10119 233415 85320 72450 69665 75090 150800 353641
14998C53641I3597P4382f7317E5514e6921A41911K35550r5919R965k9534a2584
$$ 353641 93597 167979 -67317 55514 -56921 141911 377461 281542 291507 261973 -12584
14986B79283j09502K56817D0978L99454A05188J17319K46061A86843p4800O4433
$$ 279283 169781 426598 40978 440432 105188 222507 468568 186843 112043 176476
14976A76476n8908M43903D3109k0655K21023q9853J31176J00648l2649m8348j14946
$$ 176476 117568 561471 43109 22454 243477 153624 284800 385448 352799 304451 189505
14965A89505p364J2084F6358K04415m5691L46280k69370j29456a7348D6060K76958
$$ 189505 182141 194225 66358 270773 225082 571362 301992 172536 -17348 46060 323018
14954C23018J31432k04732N2913k5526j19383J18846o1422G9951j8378J30801
$$ 323018 454450 249718 302631 277105 157722 276568 215146 79951 61573 192374
14944A92374O8150c8579A66561m5072a38735e4518A20158K65248D3383L72737
$$ 192374 260524 -38579 166561 121489 -138735 -54518 120158 385406 43383 416120
14934D16120c0640A20505j7640K1220O01591A62616N1990l8403O3814q0929L76124
$$ 416120 -30640 120505 102865 124085 725676 162616 214606 176203 240017 159088 535212
14923E35212k65691g0092C75927K03345j85972K2898j07600P7852l5470K6879
$$ 535212 269521 -70092 375927 579272 393300 416198 308598 386450 350980 377859
14913C77859j45018J63509A87944J39611J08469r5680J70895E8134N33589B82595
$$ 377859 232841 396350 187944 327555 436024 340344 511239 58134 591723 282595
14902i359A88036L34011B43055A13298K24889R7638A17107J00664K15488A09498
$$ -9359 188036 522047 243055 113298 338187 435825 117107 217771 433259 109498
14891B99711F9480L39148F0666L56267j79435K41185p0672j73158O5641f7770
$$ 299711 69480 408628 60666 416933 237498 478683 408011 234853 300494 -67770
14880D14332Q0647j04073A59240m5586J45892m0172P0518o3965J00734j321k0789
$$ 414332 494979 390906 159240 113654 259546 219374 289892 225927 326661 325340 304551
14869C04551K80245a8215D65237j1694k02917A09180K43211A53748G3135K57602
$$ 304551 584796 -18215 465237 453543 250626 109180 352391 153748 73135 330737
14859C30737K42282k75544J16213j08768j19926M55300k64353j9272F5144K83643
$$ 330737 573019 297475 413688 304920 184994 640294 375941 356669 65144 348787
14849C48787j52687M57874k95192L88942B84499j06366P3490J66055M03162C26713
$$ 348787 196100 653974 358782 747724 284499 178133 251623 417678 820840 326713
14838E67026j57577p6K97090B11200I9840L13390J41764J9821j93021M2025j59908
$$ 567026 409449 409373 706463 211200 99840 413230 554994 574815 381794 423819 263911
14827B63911Q8045J79968j8099J14445r8774A1648N09477k16429M1813L20206
$$ 263911 351956 531924 513825 628270 529496 11648 521125 304696 346509 666715
14817F66715p2244j38778k04826M14889k60437k0804m986P9791N4197j91357J42626
$$ 666715 594471 455693 250867 665756 405319 384515 379529 459320 513517 322160 464786
14806D64786J1914k7601m9841M5271J71739j65142q2158A52734M76951l3694L63287
$$ 464786 476700 449099 399258 444529 616268 451126 368968 152734 629685 595991 959278
14795I59278k92236j3843K7342j45460m3872L5360Q5664j57664J82107l6296O2953
$$ 959278 667042 653199 680541 535081 491209 526569 612233 454569 636676 600380 663333
14784F63333k10039J42704k17994M26573k08495j10669Q6487j5771J85595j08763
$$ 663333 453294 595998 378004 804577 596082 485413 571900 556129 741724 632961
14774F32961j04272J31451k33238P7593L10122m03621K27743J57335j56017n6179
$$ 632961 528689 660140 426902 504495 814617 410996 638739 796074 640057 583878
14764E83878B86298K94446k38127J77733j06599J85070k1699N0524j27520L02340
$$ 583878 286298 580744 342617 520350 413751 598821 577122 627646 500126 802466
14754H02466j06690Q9238k24018n0077j36570J47849J08285L8337J44807k79338
$$ 802466 695776 785014 560996 510919 374349 522198 630483 668820 813627 534289
14744E34289J21704Q3215l31212L15548q5122Q7073l1587J11341K2800J19903
$$ 534289 655993 739208 407996 723544 638422 725495 693908 805249 828049 947952
14734I47952K226k28778J83517q7559l04124K20007j73391R8454n6765L47306
$$ 947952 950178 721400 904917 817358 513234 733241 559850 658304 601539 948845
14724I48845m61587L05943M6691k93690L65363k14357j16311K5872L02656n3382
$$ 948845 487258 793201 839892 546202 911565 697208 580897 606769 909425 856043
14714H56043J23954q0888K38841j34878k51983K91359M2684l05962Q7745n5875
$$ 856043 979997 899109 1137950 1003072 751089 1042448 1085132 779170 866915 811040
14704H11040n8959L46296j80967C83179J91729J52322K84561l57552M6871k43878
$$ 811040 752081 1098377 917410 383179 574908 727230 1011791 654239 701110 457232
14694D57232O74113l89602K61252j2760k50364n742L80048N0556k96420J21837
$$ 457232 1131345 741743 1002995 990235 739871 734129 1114177 1164733 868313 990150
14684I90150J08210N1873k87070p0459K25821k56644J72226q1386J7236L89922
$$ 990150 1098360 1150233 863163 792704 1018525 761881 934107 852721 869957 1259879
14674A259879k33553k3612L50014j98903l82788K7817o9950L64877J56364k94705
$$ 1259879 1026326 1002714 1352728 1153825 771037 798854 728904 1093781 1250145 955440
14664I55440J09974P2940q0536M46748o98517o0475J08355K34094k11602n5874
$$ 955440 1065414 1138354 1057818 1504566 806049 745574 853929 1088023 876421 820547
14654H20547O36262l71479j34420N98981m54094J77091N2070j69254m5691R024
$$ 820547 1456809 1085330 950910 1549891 1095797 1272888 1324958 1155704 1110013 1119037
14644A119037j16005L03612J88164j81344l8487M44928o88368L41350j76629K10477
$$ 1119037 1003032 1306644 1494808 1313464 1274977 1719905 1031537 1372887 1196258 1406735
14634A406735l34611N3040K92559K88139n50449N4635j28197J98758J12916l6474
$$ 1406735 1072124 1125164 1417723 1705862 1155413 1210048 1081851 1280609 1393525 1357051
14624A357051j02550k4292r469J68197j43334K52775J78064k89154j05408P3180
$$ 1357051 1254501 1230209 1220740 1388937 1245603 1498378 1676442 1387288 1281880 1355060
14614A355060K38969r367k71254J05363N5507J58419O5507o0989p0279j31681
$$ 1355060 1594029 1584662 1313408 1418771 1474278 1632697 1698204 1637215 1566936 1435255
14604A435255p776L62155r2124j74188O6219M5097Q08j9535J92107J0572p3340
$$ 1435255 1427479 1789634 1697510 1523322 1589541 1634638 1635446 1615911 1808018 1818590 1745250
14593A745250j00422k31204p8352L77105K29855J03762m18209M02251m1908J53455
$$ 1745250 1644828 1413624 1335272 1712377 1942232 2045994 1627785 2030036 1988128 2141583
14583B141583o86212N33689N9234J73210l30627J50144J7107L28201k61588M58235
$$ 2141583 1455371 1989060 2048294 2221504 1890877 2041021 2058128 2386329 2124741 2582976
14573B582976j32503k65267K25531j37988L71712l11391m53P0882J68128J30531
$$ 2582976 2450473 2185206 2410737 2272749 2644461 2333070 2332617 2403499 2571627 2702158
14563B702158m24195N96530J46653M6939K88623J20810N3254Q9347N75436K10807
$$ 2702158 2277963 2874493 3021146 3068085 3356708 3477518 3530772 3620119 4195555 4406362
14553D406362P15497L20823P82443J088286J731879L671093O612065R524542L876955
$$ 4406362 5121859 5442682 6225125 7313411 9045290 12716383 19328448 28852990 32729945
14544C2729945j5283742p913124l142467k055084n11539o07653k34073k84112
$$ 32729945 17446203 9533079 6390612 4335528 3823989 3216336 2982263 2698151
14536B698151R6420J77560m88045O6351J74436q7803o2653m98871M52143L36411
$$ 2698151 2794571 2972131 2484086 2550437 2724873 2637070 2574417 2075546 2527689 2864100
14526B864100m48773l6948K86495q2586q2821o9044k17798N88825j6073m51406
$$ 2864100 2415327 2378379 2664874 2582288 2499467 2430423 2212625 2801450 2785377 2333971
14516B333971N30647K41358m30698K1413p204k6864J12703K31092o5941j81852
$$ 2333971 2864618 3105976 2675278 2696691 2689487 2662623 2775326 3006418 2940477 2758625
14506B758625L35452j00993O5005J01130R4200o865r294r6257R1998p4129o160
$$ 2758625 3094077 2993084 3058089 3159219 3253419 3246554 3237260 3141003 3233001 3158872 3152712
14495C152712j50276M26784r431J67781m23778J70877L58937l45692K28896j5969
$$ 3152712 3002436 3429220 3419789 3587570 3163792 3334669 3693606 3347914 3576810 3560841
14485C560841J48359Q729R6609j13141K98260j76610K18396J54274k3977l8014
$$ 3560841 3709200 3717929 3814538 3701397 3999657 3823047 4041443 4195717 4171740 4133726
14475D133726M45273o02780K55072j55618K26011p6825L57124j83663K73573j98486
$$ 4133726 4578999 3976219 4231291 4075673 4301684 4224859 4581983 4398320 4671893 4473407
14465D473407L50363J34876j25018N3736K7203J16312m05931N2438J04720J00447
$$ 4473407 4823770 4958646 4833628 4887364 4914567 5030879 4624948 4677386 4782106 4882553
14455D882553L96071o21823N96664j142M88159m27377p7419L85741O1471K32698
$$ 4882553 5278624 4656801 5253465 5252323 5740482 5313105 5235686 5621427 5682898 5915596
14445E915596r8144K9876P3263L58362l27653J84322k65630N36599Q2291Q2694
$$ 5915596 5817452 5847328 5920591 6278953 5951300 6135622 5869992 6406591 6488882 6571576
14435F571576r1657K37043j38680N03744j5170N1210J69222k31105J28560O5048
$$ 6571576 6479919 6716962 6578282 7082026 7066856 7118066 7287288 7056183 7184743 7249791
14425G249791j315L48392K34462J14744k42488N86415j71213M9274j19363n9021
$$ 7249791 7248476 7596868 7831330 7946074 7703586 8290001 8118788 8168062 8048699 7989678
14415G989678M76964O7684J21634Q3798K93265J23141q8329O55276k5073l93969
$$ 7989678 8466642 8534326 8655960 8739758 9033023 9156164 9067835 9723111 9698038 9304069
14405I304069M30460M01421M23785m1881K9352M49647k47241M61785J03117L26125
$$ 9304069 9734529 10135950 10559735 10517854 10547206 10996853 10749612 11211397 11314514 11640639
14395A1640639J0435l9168K78258K25051K73012J45007L91329j07092N45453l4805
$$ 11640639 11651074 11611906 11890164 12115215 12388227 12533234 12924563 12817471 13362924 13328119
14385A3328119K01745K08157M99767J86579J16068M89982K43531O47292k617L54790
$$ 13328119 13529864 13738021 14237788 14424367 14540435 15030417 15273948 15921240 15918623 16273413
14375A6273413M84194L3036M76154P40649K50556p3369M95843N93258L59120Q7433
$$ 16273413 16757607 16790643 17266797 18007446 18258002 18184633 18680476 19273734 19632854 19720287
14365A9720287K12451Q97528M69041l1813R11050N37322N26493O20204M48966
$$ 19720287 19932738 20830266 21299307 21267494 22178544 22715866 23242359 23862563 24311529
14356B4311529N90501L43983Q98104O09446M63446P22202P66178P16313R88275
$$ 24311529 24902030 25246013 26144117 26753563 27217009 27939211 28705389 29421702 30409977
14347C0409977M36071J031450J086602M50417P59951J357499N01985J407712R04596
$$ 30409977 30846048 31877498 32964100 33414517 34174468 35531967 36033952 37441664 38346260
14338C8346260J123186J042323J275073R60828J382729J814114J003799J022410
$$ 38346260 39469446 40511769 41786842 42747670 44130399 45944513 46948312 47970722
14330D7970722J863055J460307J785214K097677J585937J805947K057016J937632
$$ 47970722 49833777 51294084 53079298 55176975 56762912 58568859 60625875 62563507
14322F2563507K145159K475368K259504K589826K706839K833924K951428L070903
$$ 62563507 64708666 67184034 69443538 72033364 74740203 77574127 80525555 83596458
14314H3596458L188024L367993L215139L983535L854887M528407M428062M829499
$$ 83596458 86784482 90152475 93367614 97351149 101206036 105734443 110162505 114992004
14306A14992004M537519N287542N521441O025878O340488O087859P222741P115383
$$ 114992004 119529523 124817065 130338506 136364384 142704872 148792731 156015472 163130855
14298A63130855P710894Q178564Q782933R058916J0293458J0247192J0685911
$$ 163130855 170841749 179020313 187803246 196862162 207155620 217402812 228088723
14291B28088723J1551597J0496170J1526624J1713946J1379978J1344866J1789677
$$ 228088723 239640320 250136490 261663114 273377060 284757038 296101904 307891581
14284C07891581J2700775J3011682J2736181J1708711J1210328J0918510J0803957
$$ 307891581 320592356 333604038 346340219 358048930 369259258 380177768 390981725
14277C90981725J0064930R865899Q388483P915609Q000050O411897M127831J289742
$$ 390981725 401046655 410912554 419301037 427216646 435216696 441628593 445756424 447046166
14269D47046166J403366o484788p933520p298864j0324253j3057276j3962941
$$ 447046166 448449532 441964744 434031224 426732360 416408107 403350831 389387890
14262C89387890j2880329j2890859j3617534j3307158j2402632j2146033j2452021
$$ 389387890 376507561 363616702 349999168 336692010 324289378 312143345 299691324
14255B99691324j1145642j1999836j1178591j1195582j0673598j0354448r644922
$$ 299691324 288545682 276545846 265367255 254171673 243498075 233143627 223498705
14248B23498705r576486r282047q664774q208548p980264p555303p425761o908269
$$ 223498705 213922219 204640172 195975398 187766850 179786586 172231283 164805522 157897253
14240A57897253o377519o628929n659544n455617n724299n116205m903333m434029
$$ 157897253 151519734 144890805 139231261 133775644 128051345 122935140 118031807 113597778
14232A13597778m376814m169695l985079m301422l763416l327511l611843l297792
$$ 113597778 109220964 105051269 101066190 96764768 93001352 89673841 86061998 82764206
14224H2764206k839285l066509k949729k252388k623212k376030k240075k723716
$$ 82764206 79924921 76858412 73908683 71656295 69033083 66657053 64416978 61693262
14216F1693262j835486k079868j602481j710982j830022j939530j395064j727328
$$ 61693262 59857776 57777908 56175427 54464445 52634423 50694893 49299829 47572501
14208D7572501j274357j404537j784971r10123j311190j257583j028657j256700
$$ 47572501 46298144 44893607 43108636 42198513 40887323 39629740 38601083 37344383
14200C7344383p39748j267600j174732o03179j235481q43557k60817r31290p63858
$$ 37344383 36604635 35337035 34162303 33559124 32323643 31480086 31219269 30287979 29524121
14191B9524121r50155r48718l65098p11735p75144l64194p35333m20808m98959
$$ 29524121 28573966 27625248 27260150 26548415 25773271 25409077 24673744 24252936 23753977
14182B3753977q91212p5020n90700o35934j74778m19357l86611p52130q4734p47327
$$ 23753977 22862765 22787745 22197045 21561111 21386333 20966976 20580365 19828235 19743501 18996174
14172A8996174k14363o96564k79211L5020k35880l97183j36070o03643n16085
$$ 18996174 18781811 18085247 17806036 17841056 17605176 17207993 17071923 16468280 15952195
14163A5952195J0733o82204Q4582j90776l75004m81157P2642l54031k64212j49105
$$ 15952195 15962928 15280724 15365306 15174530 14799526 14318369 14391011 14036980 13772768 13623663
14153A3623663k54462l01973k30430l71838N1288j5570k95054l99606r2305k01391
$$ 13623663 13369201 13067228 12836798 12464960 12516248 12500678 12205624 11806018 11713713 11512322
14143A1512322k51887K09768m0544o35242M3468l48106R029l58914M5311m95702
$$ 11512322 11260435 11470203 11429659 10794417 10837885 10489779 10498808 10139894 10185205 9689503
14133I689503K58561k04310m47604L84962o98688L0350m29872L28119k57079l85027
$$ 9689503 9948064 9743754 9296150 9681112 8982424 9012774 8582902 8911021 8653942 8268915
14123H268915M10871j05961m95771k7736m7425n1660o1427k34354k88137l11526
$$ 8268915 8679786 8573825 8078054 8050318 8002893 7951233 7889806 7655452 7367315 7055789
14113G055789L87797j46286J09500l25167j98061R5262J79576o5458l15700j25555
$$ 7055789 7443586 7297300 7406800 7081633 6883572 6978834 7158410 7092952 6777252 6651697
14103F651697J17956k49247K38039n53671K45119r5395k07273k04225J0608j81404
$$ 6651697 6769653 6520406 6758445 6204774 6449893 6354498 6147225 5943000 5953608 5772204
14093E772204P6272q7759K6242m02340j09678L16447m7977j61624K06742k66482
$$ 5772204 5848476 5760717 5786959 5384619 5274941 5591388 5543411 5381787 5588529 5322047
14083E322047k4713P4109k15752j12297J67295N4880k86251k26005J92724j53036
$$ 5322047 5297334 5371443 5155691 5043394 5210689 5265569 4979318 4753313 4946037 4793001
14073D793001k52126L47030k51396j72801j09886J52190j70750j95313K10936
$$ 4793001 4540875 4887905 4636509 4463708 4353822 4506012 4335262 4139949 4350885
14064D350885J0279p9845n4581j8094L0864J16594j40063l1811K7110j47436L7501
$$ 4350885 4361164 4281319 4226738 4208644 4239508 4356102 4216039 4184228 4211338 4063902 4101403
14053D101403p3472q8659N5090m06174K74119O8025j68608j11352l96941j0269
$$ 4101403 4027931 3939272 3994362 3588188 3862307 3930332 3761724 3650372 3253431 3243162
14043C243162J38975K29297k85153o3661K08427m8049j64827n6021J43859J06503
$$ 3243162 3382137 3611434 3326281 3262620 3471047 3422998 3258171 3202150 3346009 3452512
14033C452512q9432j86314J9226J17387m78818M30782l22234O6821l17075L00324
$$ 3452512 3363080 3176766 3195992 3313379 2834561 3265343 2943109 3009930 2692855 2993179
14023B993179m4195N2675q4342k70500M31054m34503J7716K55922l24325N1017
$$ 2993179 2948984 3001659 2917317 2646817 3077871 2643368 2661084 2917006 2592681 2643698
14013B643698j73147J04455J31082l96592n25N28683j68794j40235N1242K76261
$$ 2643698 2470551 2575006 2706088 2309496 2308971 2837654 2668860 2528625 2579867 2856128
14003B856128l92903j4318L3246P4002J46490K12190O436O236K56071L12147k09686
$$ 2856128 2463225 2448907 2482153 2556155 2702645 2914835 2921271 2927507 3183578 3495725 3286039
13992C286039L09373P05868M82530J252485K622204N393046J0134942Q642940
$$ 3286039 3595412 4301280 4783810 6036295 8658499 14051545 24186487 32829427
13984C2829427j2264862p420710m015552j947181j424681q73823n53459L78894
$$ 32829427 20564565 13143855 9128303 7181122 5756441 4882618 4329159 4708053
13976D708053q36828p4817p0062l01677m7809o2192l69448p4561k86042L0039
$$ 4708053 3871225 3796408 3726346 3424669 3376860 3314668 2945220 2870659 2584617 2614656
13966B614656J34507j97961J66667l65634j93860K15523l37693L47664L1585J7026
$$ 2614656 2749163 2551202 2717869 2352235 2158375 2373898 2036205 2383869 2415454 2432480
13956B432480m78291K46074J2105o3944J97567j41198J42213J352l92103J24313
$$ 2432480 1954189 2200263 2212368 2148424 2345991 2204793 2347006 2348358 1956255 2080568
13946B080568L4770l34897J34220L22902k75087P8732J06184l58924J63489j09785
$$ 2080568 2115338 1780441 1914661 2237563 1962476 2041208 2147392 1788468 1951957 1842172
13936A842172J41094m7968P6352J07003l97309K7389j7292J78416l39994J7009
$$ 1842172 1983266 1935298 2011650 2118653 1721344 1748733 1731441 1909857 1569863 1586872
13926A586872r7054L48308j19826k00315K52911j2563j68653j22040R5080k7653
$$ 1586872 1489818 1838126 1718300 1517985 1770896 1758333 1589680 1467640 1562720 1535067
13916A535067k56276O15776l93384L51806m27133J97021j83112R6900K56881k44391
$$ 1535067 1278791 1894567 1501183 1852989 1425856 1622877 1439765 1536665 1793546 1549155
13906A549155k12506J21437l5225j517m8092n3532K65770l29864J26627j54369
$$ 1549155 1336649 1458086 1422861 1421344 1373252 1319720 1585490 1255626 1382253 1227884
13896A227884K15753n5730j99563M50918l42163O3336j23886P1165P8626k5344
$$ 1227884 1443637 1387907 1188344 1639262 1297099 1360435 1236549 1307714 1386340 1360996
13886A360996r4449J71109l16017J85237Q7883K8986L7675J6449l32526p7054
$$ 1360996 1266547 1437656 1121639 1306876 1394759 1423745 1461420 1477869 1145343 1068289
13876A068289p0610L31669k95208J88418K2899k17956O29590n68442j60314j09227
$$ 1068289 997679 1329348 1034140 1222558 1245457 1027501 1657091 1088649 928335 819108
13866H19108M92846n7679r6035k11755K04153K01972M7225j5963l12299K37132
$$ 819108 1311954 1254275 1158240 946485 1150638 1352610 1399835 1383872 1071573 1308705
13856A308705k53891k4582q6572J32562J9357J10228m31174M39816O1999J4476
$$ 1308705 1054814 1030232 943660 1076222 1095579 1205807 774633 1214449 1276448 1290924
13846A290924q1354n5345j88344J38235k09282J63055J33898O7537j75857j87283
$$ 1290924 1209570 1154225 965881 1104116 894834 1057889 1191787 1259324 1083467 896184
13836H96184J39997o6636J54300l641j17006k23414K87018j80731q3834J79803
$$ 896184 1036181 969545 1123845 1120204 1003198 779784 1066802 886071 802237 982040
13826I82040M6178l97087L07659J16342K7681k82618j49806M08788l18849M71051
$$ 982040 1028218 631131 938790 1055132 1082813 800195 650389 1059177 740328 1211379
13816A211379j79169j97556P1179K12315m79042L62290l05636K96062k05762K99094
$$ 1211379 1032210 834654 905833 1118148 639106 1001396 695760 991822 786060 1085154
13806A085154q8834k29672K49374j27125J14578k05512K50628l12501J26058Q3165
$$ 1085154 996320 766648 1016022 888897 1003475 797963 1048591 736090 862148 945313
13796I45313n0331j06434J28871J49147l97250K15030j67380L52011j90557j0286
$$ 945313 894982 788548 917419 1066566 669316 884346 716966 1068977 878420 868134
13786H68134j31352K23575n4252j32356j36958K65699j62375o6334K2958J41366
$$ 868134 736782 960357 906105 773749 636791 902490 740115 673781 696739 838105
13776H38105j91022J33187k0399C07588L45906n60K8898J56778j58712J24902
$$ 838105 647083 780270 759871 307588 653494 652934 681832 838610 679898 804800
13766H04800j88854q583Q1010l1038K02877p0320k09172J70347o8936m6251n3604
$$ 804800 615946 607363 688373 657335 860212 789892 580720 751067 682131 635880 582276
13755E82276k31422L14662K8089o4019J4399K13521j86430K05815o6677J4719
$$ 582276 350854 665516 693605 629586 643985 857506 671076 876891 810214 824933
13745H24933j46475r9451R4687j96955J45541q4550M7979K69660j43083n2480
$$ 824933 678458 579007 673694 476739 622280 537730 585709 855369 712286 659806
13735F59806B72544J36691J44410J13678m047r8821K11162J13292j44540C58217
$$ 659806 272544 409235 553645 667323 663276 564455 775617 888909 744369 358217
13724C31486J12928J92202N9489J16824j03599n8221r0886K15389B68360K28208
$$ 331486 444414 636616 696105 812929 709330 651109 560223 775612 268360 496568
13714D96568j39605M87802l05933k3034P5833K3481j02325L27614C59387J69687
$$ 496568 356963 844765 538832 515798 591631 615112 512787 840401 359387 529074
13704E29074L16628j47380j05275k5898R7247B44196J57823K63756k05091o1699
$$ 529074 845702 698322 593047 567149 664396 244196 402019 665775 460684 398985
13694C98985K72838j12794j76894j2253A42976L17713k5921L1049B25451N20733
$$ 398985 671823 559029 382135 369882 142976 460689 434768 465817 225451 746184
13684G46184k06068j43614L09799j74309R2700k6791k64028M17606j92953K3816
$$ 746184 540116 396502 706301 531992 624692 597901 333873 751479 558526 582342
13674E82342j31628q2478j5489K396J51216m4242o6457K85291l19884J65220R6767
$$ 582342 450714 368236 352747 355143 506359 462117 395660 680951 361067 526287 623054
13663F23054k44824J39855P1339B16349J71433n8462J45103J96994r3314j72993
$$ 623054 378230 518085 589424 216349 387782 329320 474423 671417 578103 405110
13653D05110J91224K0211n5514J1903J3873k08909K87916k45016M2239Q9808B59868
$$ 405110 596334 616545 561031 572934 586807 377898 665814 420798 463037 552845 259868
13641C00129L47461j33754j2077j05702M8897o295J88897j79183k09929P0571
$$ 300129 647590 513836 501759 396057 444954 438659 627556 448373 238444 309015
13631C09015K26209q078A9863L36085J51745j00474R3763P6413A16500L54246
$$ 309015 535224 527146 19863 355948 507693 407219 500982 577395 116500 470746
13621D70746J35099k80779Q1416m2925J57016K08968k6259k96355j84112J81012
$$ 470746 605845 325066 406482 363557 520573 729541 703282 406927 222815 403827
13611D03827A62898L52897A86516P2161J32306j5560M28323B35332L38325k72968
$$ 403827 162898 515795 186516 258677 390983 375423 803746 235332 573657 300689
13601C00689l836J14223j63613A02700L43543j34944N6361A32657M7148K62251
$$ 300689 296853 411076 247463 102700 446243 311299 367660 132657 179805 442056
13591D42056j98357j08540L01429A8077K45544A29874J50025j13631J47959K17969
$$ 442056 243699 135159 436588 18077 263621 129874 279899 166268 314227 532196
13581E32196M7046j13226A49080M94004j82397j56737o8981J92431j84518K98329
$$ 532196 579242 466016 149080 643084 460687 303950 234969 427400 242882 541211
13571E41211B46014Q863J70215M9664l4383m9880j78733L59037k53586A51771
$$ 541211 246014 254877 425092 474756 440373 390493 211760 570797 317211 151771
13560F03116k24677k6415m918k9350M0967A42735L74459m7236B19551N7593A4000
$$ 603116 378439 352024 347106 317756 358723 142735 517194 469958 219551 277144 14000
13548A20310L11685B06564M66397m0621C13577J06813J27176A19504K24452b9824
$$ 120310 431995 206564 672961 632340 313577 420390 547566 119504 343956 -29824
13537E37575j80448j57727L12596C654K96182a3427E9644J58213H8879f2358J4959
$$ 537575 357127 199400 511996 3654 299836 -13427 59644 217857 88879 -62358 -47399
13526d7399B82613J28522J29651R9279B69846J48874k04131R6267K86273B51722
$$ -47399 282613 411135 540786 640065 269846 418720 214589 310856 597129 251722
13515E86912B84834K27976A80204R1316M6713L74963h467B82755j14052J22643
$$ 586912 284834 512810 180204 271520 318233 693196 -8467 282755 168703 291346
13505B91346A31369J72348N5803k6771j1263P799M796C3797Q4492J33671G9353
$$ 291346 131369 303717 359520 332749 321486 329285 334081 33797 118289 251960 79353
13493C26515M7326p9333R3488Q847A79095K14604j38662C4222M39969A58467K06068
$$ 326515 373841 294508 387996 396843 179095 393699 255037 34222 474191 158467 364535
13482C64535j5898j12380I4505L8967J55988k0145J05101k8093j63339P109K600
$$ 364535 348637 236257 94505 133472 289460 269315 374416 346323 182984 190093 192693
13471A92693K06346j22728j30167J7125J91417i6452A70935J76345l6596d5825
$$ 192693 399039 276311 146144 163269 354686 -96452 170935 347280 310684 -45825
13460B2440L95112a01688C28704r6366b22552B84126K32199Q7172A29292O2547
$$ 22440 417552 -101688 328704 232338 -222552 284126 516325 603497 129292 191839
13450A91839k6571n094J39269A46138J93949n7582M4856J12357j04937A07937
$$ 191839 165268 160174 299443 146138 340087 282505 327361 439718 334781 107937
13439D05072F0236N0545J02525H6147K47550l08p6827Q6630B8007O3439O1726
$$ 405072 60236 110781 213306 86147 333697 333389 256562 343192 28007 91446 153172
13428A53172j1282a19410B96507j40294J8794J47236a48369B92278n8820K27810
$$ 153172 141890 -119410 296507 156213 175007 322243 -148369 292278 233458 461268
13418D61268k06098n5501F8008K86726N0773j92426L16406A29552J10080l5591
$$ 461268 255170 199669 68008 354734 405507 213081 529487 129552 239632 204041
13408B04041D2001L08996l4952r4835R0102q9150r0064K6019B1725J48492J76701
$$ 204041 42001 350997 316045 221210 311312 222162 132098 158117 21725 170217 346918
13397C46918C591J55575K15492M1901j19040a3199B22227F9589N5105O4054l9189
$$ 346918 3591 159166 374658 416559 297519 -13199 222227 69589 124694 188748 149559
13386A49559K18930j74701G8339J89566M3215j38288G5999J21083I2039J19722
$$ 149559 368489 193788 78339 267905 311120 172832 75999 197082 92039 211761
13376B11761r9335J22667K5668q7325j0927K20281A12247P5434M3793K40216k19166
$$ 211761 112426 235093 260761 173436 162509 382790 112247 187681 231474 471690 252524
13365B52524o0364J09640j04071A2415P6515O6104Q6167E8560K72910H2939g900
$$ 252524 192160 301800 197729 12415 88930 155034 241201 58560 331470 82939 -7900
13353a82466C25656m0914P4305A13873K49831A19459K71025B9135K42927L689
$$ -182466 325656 284742 359047 113873 363704 119459 390484 29135 272062 275751
13343B75751c8641k3723B05745K82561b52247B74915p956J04129J26551b251C34152
$$ 275751 -38641 -62364 205745 488306 -252247 274915 266959 371088 497639 -2251 334152
13331B27899N5303n6713o1781K9418R1068D0705a02989B40574J71869A43056K87351
$$ 227899 283202 226489 164708 194126 285194 40705 -102989 240574 412443 143056 430407
13320D30407A74265L27744B48500H4408K38611J92886A68469M0938D6736K46743
$$ 430407 174265 502009 248500 84408 323019 515905 168469 209407 46736 293479
13310B93479f3357B19041K0566a50309C00270j08806J46912j13555G3991J31354
$$ 293479 -63357 219041 239607 -150309 300270 191464 338376 224821 73991 205345
13300B05345K1004h6374L8794C22197A20420d2033E8639c4559B89702E8052b686
$$ 205345 226349 -86374 -47580 322197 120420 -42033 58639 -34559 289702 58052 -2686
13288e8586j4810A46810J99742A47873j3077J4344j21e1565j6788B80710j28021
$$ -58586 -73396 146810 346552 147873 134796 149140 149019 -51565 -68353 280710 152689
13277A52689O6152j07275P1352J00244n303L50A9647B473J45946j8882K81658
$$ 152689 218841 111566 182918 283162 277859 278209 19647 2473 148419 129537 411195
13266D11195A88703b30344B45544p3823L7032j7406B4407J47649b8013I8915D7620
$$ 411195 188703 -230344 245544 171721 208753 191347 24407 172056 -28013 98915 47620
13254A94586e6955P432B01613J61066F5539M7536J19634H2758O9519l3753k4440
$$ 194586 -56955 -49523 201613 362679 65539 113075 232709 82758 152277 118524 94084
13243I4084J06081I9988k9661K4182M6362k6722m2503M8710K0250J68155n7505
$$ 94084 200165 99988 70327 94509 140871 114149 71646 120356 140606 308761 251256
13232B51256G9993K28064A7977N2270a62909k431B8311J24214K89220j91017L1988
$$ 251256 79993 308057 17977 70247 -162909 -165340 28311 152525 441745 250728 282716
13221B82716H1392e6028G2811R3880o5315a78193B38623b27623F627c54173E496
$$ 282716 81392 -56028 72811 166691 101376 -178193 238623 -227623 6627 -354173 5496
13209A96873b2907m9686A68208i8607F7274O5277a47394D55078F5997i8455K8876
$$ 196873 -22907 -72593 168208 -98607 67274 132551 -147394 455078 65997 -98455 -69579
13198f9579a7300A16827K81430A67259G4371P3705K1291L222L6748K9069R3488
$$ -69579 -17300 116827 398257 167259 74371 148076 169367 172589 209337 238406 331894
13187C31894e1324A82076B3371h4664B8547K71624A05347m9571h532B83831a8250
$$ 331894 -51324 182076 23371 -84664 28547 300171 105347 55776 -8532 283831 -18250
13175A10081J77239a13406B65410G1398J15509a53546F0641c8542B76826l0442
$$ 110081 287320 -113406 265410 71398 186907 -153546 60641 -38542 276826 246384
13165B46384b11179B0374P1513l2450J66663q4409d8141A65619a7096I3425J96895
$$ 246384 -211179 20374 91887 59437 226100 141691 -48141 165619 -17096 93425 290320
13154B90320c8566q6698A10921J32167J73192h668E16107a81214P1474A28602
$$ 290320 -38566 -125264 110921 243088 416280 -8668 516107 -181214 -109740 128602
13143a19585B51725R0857J08216i2814A73404R7328c5663B52219J08059D325i0241
$$ -119585 251725 342582 450798 -92814 173404 270732 -35663 252219 360278 4325 -90241
13131A02420a41467A72660L204c00312B50867n8145c66818D0447N0191a34064
$$ 102420 -141467 172660 175864 -300312 250867 192722 -366818 40447 90638 -134064
13120a53070A59643F8644b2502l5928M240A71597d5620A0509a5329q4421A94634
$$ -153070 159643 68644 -22502 -58430 -54190 171597 -45620 10509 -15329 -99750 194634
13108a28566A25593K9623K93944j25097G8077a35399c9697E5529J61218L9310
$$ -128566 125593 155216 449160 324063 78077 -135399 -39697 55529 216747 256057
13098B56057I4701b08663B75257A16259k8134a54293C10886j12026b10928A10979
$$ 256057 94701 -208663 275257 116259 88125 -154293 310886 198860 -210928 110979
13087B09307E7485h8061B27896P6034E3695a34302b1520A89195L7060b7768j46569
$$ 209307 57485 -88061 227896 303930 53695 -134302 -21520 189195 226255 -27768 -174337
13076a74337E3052A8557L7170K70542j62523B1519J94531d2412q2134C14153j18946
$$ -174337 53052 18557 55727 326269 163746 21519 216050 -42412 -124546 314153 195207
13065A95207J4528d7843B32910E188K0289a72075G8147N5872i256m7570K0307
$$ 195207 209735 -47843 232910 5188 25477 -172075 78147 134019 -9256 -56826 -36519
13054c6519l502c894F7187P094J37793B2242a08454D6066K43906a47930C54276
$$ -36519 -40021 -3894 67187 74281 212074 22242 -108454 46066 289972 -147930 354276
13042A0655L1007K71687b42624L7566A46438j5085B0688L09395E1662M1338k9779
$$ 10655 41662 313349 -242624 -205058 146438 131353 20688 330083 51662 93000 63221
13031F3221k3407i95B53292l3918J9038d755j03360B37247O565J977p4791d8667
$$ 63221 39814 -995 253292 219374 238412 -4755 -108115 237247 243812 245789 170998 -48667
13018A6456b8599j45401A10281L5637B0121e4049D48118A16065O0154K06528A13018
$$ 16456 -28599 -174000 110281 145918 20121 -54049 448118 116065 176219 382747 113018
13006a13330A03420a07510A92238C9411J79640A05253C8552J46447C8364J14668
$$ -113330 103420 -107510 192238 39411 219051 105253 38552 184999 38364 153032
12996A53032p1783J0209e304E2695K2633K9627b6099B35505B5244L22479a6257
$$ 153032 81249 91458 -5304 52695 75328 104955 -26099 235505 25244 347723 -16257
12984e8739A52238b6799B56738B6501J6351K42544o3437e774B08204B5850M02616
$$ -58739 152238 -26799 256738 26501 42852 285396 221959 -5774 208204 25850 428466
12973D28466c43058D6263e7917A83768b41341c7841J3655j8488A28198a91044
$$ 428466 -343058 46263 -57917 183768 -241341 -37841 -24186 -42674 128198 -191044
12962H9000M24143A69883o1168K35275A04580h1978j80454b7128F7802J9208L1466
$$ 89000 513143 169883 108715 343990 104580 -81978 -262432 -27128 67802 87010 118476
12951A18476k4293J20713H1732b135k95608P1496A42298K7109d086B57297D9207
$$ 118476 94183 214896 81732 -2135 -297743 -226247 142298 169407 -4086 257297 49207
12939A3495J9501f2122k90401E65245g4185m4165k31933J69275g5315j58573A04317
$$ 13495 32996 -62122 -352523 565245 -74185 -118350 -350283 -181008 -75315 -233888 104317
12927B01640D5272K12274b62026e5819O08A96135k3606D545a57248C43610f0658
$$ 201640 45272 257546 -262026 -55819 -55211 196135 172529 4545 -157248 343610 -60658
12915d4485A30014L1142a43385k0072B6075J44836D4445i9055F9696a46865A07678
$$ -44485 130014 161156 -143385 -163457 26075 170911 44445 -99055 69696 -146865 107678
12903A0651J03130j6509P5837n0498J50328D7175B3454p536J22345A0882c0909
$$ 10651 113781 97272 173109 122611 272939 47175 23454 15918 138263 10882 -30909
12891b27859C3117N2653A5005Q123L2162a20492A70673i0293j12405B47334b86581
$$ -227859 33117 85770 15005 23128 55290 -120492 170673 -90293 -202698 247334 -286581
12879B60151H6289k5227B9548P1863J22931D3183b56006F3287a49398E0238f7204
$$ 260151 86289 61062 29548 101411 224342 43183 -256006 63287 -149398 50238 -67204
12867g8416D1818K2806J71448D9318Q7329K8193p8287a69652A40982K9659a12473
$$ -78416 41818 64624 236072 49318 136647 164840 86553 -169652 140982 170641 -112473
12855A40067a12065A60654G6237c28029A02365a04416R752A59221i615B49322
$$ 140067 -112065 160654 76237 -328029 102365 -104416 -94664 159221 -9615 249322
12844C4040K2483a01706C0686Q830a30519j0747A97258o4698c825A20037J57216
$$ 34040 56523 -101706 30686 39516 -130519 -141266 197258 132560 -3825 120037 277253
12833B77253c93177a02374a0463A27562M1817h825q6213l5683a5684p8076L3819
$$ 277253 -393177 -102374 -10463 127562 169379 -8825 -95038 -130721 -15684 -93760 -59941
12822e9941A72053a7407k23874A27159c4239B66091o8843r0842i0453n8273P2834
$$ -59941 172053 -17407 -241281 127159 -34239 266091 197248 106406 -90453 -148726 -75892
12811g5892c5707o4921j06190Q4780A78318a72435D7067a72140O8737A97414j6235
$$ -75892 -35707 -100628 -206818 -122038 178318 -172435 47067 -172140 -103403 197414 181179
12800A81179n393o7844A9283K20219I6039a9720B28414K6726b1374B06031R764
$$ 181179 175786 107942 19283 239502 96039 -19720 228414 255140 -21374 206031 215795
12789B15795A4743L7473f830j80328A32259a80509l9237A81314p4634d01641C6916
$$ 215795 14743 52216 -6830 -187158 132259 -180509 -219746 181314 106680 -401641 36916
12777A02592b53726O7609E2522J74074a11241j08278c5215k1954H0689c2105A24112
$$ 102592 -253726 -186117 52522 226596 -111241 -219519 -35215 -57169 80689 -32105 124112
12765E93R9565l5857k0401Q0776k2260K1998c4117A42840E5702O1886c99255d8410
$$ 593 100158 64301 43900 124676 102416 124414 -34117 142840 55702 117588 -399255 -48410
12752A65758B1484M6704P5280J33071a11319A88058a932k27805f8975O727H543
$$ 165758 21484 68188 143468 276539 -111319 188058 -1932 -229737 -68975 -62248 8543
12740h6412q77J129B48490b6230D8182J6721a21744B56935J1686G2778D260J29404
$$ -86412 -87289 -86160 248490 -26230 48182 64903 -121744 256935 268621 72778 4260 133664
12728A33664a14203J0071B32257f0484k9434A49330a52306B60897k0345a1099
$$ 133664 -114203 -104132 232257 -60484 -89918 149330 -152306 260897 240552 -11099
12717B88407j06288h8094R915E4249J0742M3071K9023B3545J35154a28502C0719
$$ 288407 182119 -88094 -78179 54249 64991 108062 137085 23545 158699 -128502 30719
12705A74463p6246P4333j6967i7311B8511Q6076M1866p7937K78532d0280B84953
$$ 174463 98217 172550 155583 -97311 28511 114587 156453 78516 357048 -40280 284953
12693B46840F7847d9690C58314h8828E6060a73324A92820g3992B78469a3835A22121
$$ 246840 67847 -49690 358314 -88828 56060 -173324 192820 -73992 278469 -13835 122121
12681B13857C8098O215K17518r605q3904b1803j09813I6599f6107D12592a50122
$$ 213857 38098 44313 261831 252226 168322 -21803 -131616 96599 -66107 412592 -150122
12669a57751C57872b18306c8196j04472E5907J44111a22697n0829L1998C28396
$$ -157751 357872 -218306 -38196 -142668 55907 200018 -122697 -173526 -141528 328396
12658D7443b19020C57250L05739B83825H8026j58a46970p617A42930a97981A43286
$$ 47443 -219020 357250 662989 283825 88026 87868 -146970 -154587 142930 -197981 143286
12646d1516m14661i550E4538a84955H5301C3083a32841I7061K07582C4149L35105
$$ -41516 -456177 -9550 54538 -184955 85301 33083 -132841 97061 304643 34149 369254
12635C69254M0035c09680B97221D216J70823a10424E7773a1822C67340M7990D0452
$$ 369254 409289 -309680 297221 4216 175039 -110424 57773 -11822 367340 415330 40452
12623e5211E27838j01285A05290K91538f2349b7652A41977d5598j76932h8059
$$ -55211 527838 426553 105290 396828 -62349 -27652 141977 -45598 -222530 -88059
12612A9456K1697K6447j3813B5927K74259A8113a96226J3098a1270j1172H6564
$$ 19456 41153 67600 53787 25927 300186 18113 -196226 -183128 -11270 -22442 86564
12600D07176c4763j38316C21513B3996c8627g023E4314c9771E4054A7250J12733
$$ 407176 -34763 -173079 321513 23996 -38627 -7023 54314 -39771 54054 17250 129983
12589A29983m4071B431N5119O908a87510G9411i3410A42926J8826p6104a90j79241
$$ 129983 85912 2431 57550 64458 -187510 79411 -93410 142926 161752 85648 -190 -179431
12577a79431k0542G0875M5063J31871A20576d5951j82044B33296r1846j2987a77814
$$ -179431 -199973 70875 115938 247809 120576 -45951 -227995 233296 141450 128463 -177814
12565A80970i9017G6788J62970J0750b1177m9463C86424b47427C26969a75480
$$ 180970 -99017 76788 239758 250508 -21177 -70640 386424 -247427 326969 -175480
12554C0668L07036b57082i6221M0089A29327a46238E1539a36318q2550h8708k06826
$$ 30668 337704 -257082 -96221 -56132 129327 -146238 51539 -136318 -218868 -88708 -295534
12543b95534P6224a4759O886j60151I3877K17703F6997b67242B46342A13030E986
$$ -295534 -219310 -14759 -7873 -168024 93877 311580 66997 -267242 246342 113030 5986
12531a33575C5107a37474l0650D6345r060O5495l1851M6374g5687D07358B00977
$$ -133575 35107 -137474 -168124 46345 37285 102780 70929 117303 -75687 407358 200977
12519A51202B2182a99522C2462O7728F666b66131A37988b34865Q8823M6816k56070
$$ 151202 22182 -199522 32462 100190 6666 -266131 137988 -234865 -146042 -99226 -355296
12508c55296B2544M04084f3293G575b00304A48381C1917K09821j02406a06365
$$ -355296 22544 426628 -63293 7575 -200304 148381 31917 241738 139332 -106365
12497D19189f4494i76D01853A78275Q1777l8401g1273m2521m4026a5385j76526
$$ 419189 -64494 -976 401853 178275 260052 221651 -71273 -113794 -157820 -15385 -191911
12486a91911C6229c33183C2905G821J95759c09032A2707a6395m7267J4388B44304
$$ -191911 36229 -333183 32905 7821 203580 -309032 12707 -16395 -63662 -49274 244304
12474b15485I501g7110D395M4609h5733C4318L8851R9929a8524A02834K01113
$$ -215485 9501 -77110 4395 49004 -85733 34318 73169 173098 -18524 102834 303947
12463C03947B1112Q2743J3544a59756g7373b2619k9348H8051a38282G1770R7587
$$ 303947 21112 103855 117399 -159756 -77373 -22619 -51967 88051 -138282 71770 169357
12452A69357B4912L24556b0381I5686m1354c6886j11288j60776B0603a11890a8832
$$ 169357 24912 349468 -20381 95686 54332 -36886 -148174 -308950 20603 -111890 -18832
12440G1857a51621n0494E8926K54604E7353J25555d0414m8906L9897a9865A44223
$$ 71857 -151621 -202115 58926 313530 57353 182908 -40414 -89320 -49423 -19865 144223
12428a82223m9217a0320C8085c12072D289J8406b6090A11291a95262A5780J64166
$$ -182223 -231440 -10320 38085 -312072 4289 22695 -26090 111291 -195262 15780 179946
12417A79946d3078j8761A12155a09531k2723G0279G944b75254J23253A54539c15713
$$ 179946 -43078 -61839 112155 -109531 -132254 70279 7944 -275254 -152001 154539 -315713
12405a02546j31384A77989L81251a22438i586k9677A29023m8055R7998f370q6238
$$ -102546 -233930 177989 559240 -122438 -9586 -39263 129023 80968 178966 -6370 -92608
12394i2608B78074a10964k9950B13819E5218J15897K0233J0053k6606L1703c9976
$$ -92608 278074 -110964 -140914 213819 55218 171115 191348 201401 174795 206498 -39976
12382C54942b8644k48135F797J22934b46606A51737f5649D3995P0877e5867B85284
$$ 354942 -28644 -276779 6797 129731 -246606 151737 -65649 43995 114872 -55867 285284
12370A54879J38186g2983A27329l5139f0476A23506a98200A58762a86173d0778
$$ 154879 293065 -72983 127329 92190 -60476 123506 -198200 158762 -186173 -40778
12359a70386B59875d1396f40j4344B96125b20929A38947b6519F2351j0060Q74
$$ -170386 259875 -41396 -640 -14984 296125 -220929 138947 -26519 62351 52291 53165
12348E3165a91428N3006A53812O4643j00647a08576C71531A77984c45841B43673
$$ 53165 -191428 -138422 153812 218455 117808 -108576 371531 177984 -345841 243673
12337B47838g5605b7854j75549A21021a57954G3559J67993h8706r7681p9133A11607
$$ 247838 -75605 -27854 -203403 121021 -157954 73559 241552 -88706 -186387 -265520 111607
12325c7039o0487m3457C62756F9946J7185R801a15982B9090a00571j8583j34447
$$ -37039 -97526 -140983 362756 69946 87131 96932 -115982 29090 -100571 -119154 -253601
12314b53601i7224m5776j5343B26042L4710i5744j01040B29697B7747J08489n5031
$$ -253601 -97224 -143000 -158343 226042 260752 -95744 -196784 229697 27747 136236 81205
12303H1205b19962G1315a30648k24049A68483K9254g7719C8075h7641k22733A22941
$$ 81205 -219962 71315 -130648 -354697 168483 197737 -77719 38075 -87641 -310374 122941
12291C83647b24096M1936C34554A66149J06515B4089k619i187E0489a61347J5392
$$ 383647 -224096 -182160 334554 166149 272664 24089 21470 -9187 50489 -161347 -145955
12280a45955k31680C31897F6504a9704C47856p9203n6715G6740A5549M617J44795
$$ -145955 -377635 331897 66504 -19704 347856 268653 211938 76740 15549 20166 164961
12269A64961K47986c1213B90992a15403m8610B72088o3341b0139B4888a01423
$$ 164961 412947 -31213 290992 -115403 -164013 272088 208747 -20139 24888 -101423
12258b53130C95554A4333J22752J05766a3811A07510h1259F6815J84631Q3215
$$ -253130 395554 14333 137085 242851 -13811 107510 -81259 66815 251446 334661
12248C34661B50K14009p7786E321L31158A66487K42277A60702F4703J68334I9831
$$ 334661 250 214259 136473 5321 336479 166487 408764 160702 64703 233037 99831
12236C87560j28609J4076e8733F3866J85639i965j43063B14525J01781E7115a22962
$$ 387560 258951 273027 -58733 63866 249505 -9965 -153028 214525 316306 57115 -122962
12224B56140C789M62839A21596J29412A1859b7951h625C52085L49645B8184N5624
$$ 256140 3789 466628 121596 251008 11859 -27951 -8625 352085 701730 28184 83808
12213H3808c38010D3919g2726b8232C22926q3218A07321J54505D0743J35119A7841
$$ 83808 -338010 43919 -72726 -28232 322926 239708 107321 261826 40743 175862 17841
12201E5635J34034P4268m896a15030a7788B45779A16021b22136B54555a9531C42692
$$ 55635 189669 263937 259041 -115030 -17788 245779 116021 -222136 254555 -19531 342692
12189A93868a92340A14190D1196J69498C5152K60561j09331K23086B04151j0807
$$ 193868 -192340 114190 41196 210694 35152 295713 186382 409468 204151 193344
12179A93344a16592G9384J70376M6673E3233J59585q7125J72842d464j20464h360
$$ 193344 -116592 79384 249760 296433 53233 212818 125693 298535 -4464 -124928 -8360
12167i5035F66948B74361o9877e8039a6240B69557H4998J30768A00814c9853a5626
$$ -95035 666948 274361 204484 -58039 -16240 269557 84998 215766 100814 -39853 -15626
12155a0684j629C14540p0331a41955L4873I2859m0923J04094J91258D4647a3975
$$ -10684 -12313 314540 244209 -141955 -107082 92859 51936 156030 347288 44647 -13975
12143A28746a80697B97539I350a18326c2954A362N9616L94363b47868P5135b3234
$$ 128746 -180697 297539 9350 -118326 -32954 1362 60978 455341 -247868 -172733 -23234
12131C3280L3582L11703E7194a95157a166l9082B08765a80547Q7226C6762E322
$$ 33280 66862 378565 57194 -195157 -1166 -40248 208765 -180547 -93321 36762 5322
12119h8608H2038B117c68083h1113c3174B42115h8012m6634J6994l1562A17423
$$ -88608 82038 2117 -368083 -81113 -33174 242115 -88012 -134646 -117652 -149214 117423
12107G5864p104f0187A48021c2347B39559A19684b02830R3379B25607a3034G1428
$$ 75864 68760 -60187 148021 -32347 239559 119684 -202830 -109451 225607 -13034 71428
12095B61122I4329f2374A62091p1265A2182a22188j327d3892r2469j1676r6920
$$ 261122 94329 -62374 162091 90826 12182 -122188 -123515 -43892 -136361 -148037 -244957
12084b44957b6969B22475G8813I250L15579J34774J7185K41963P97805E46626
$$ -244957 -26969 222475 78813 9250 324829 459603 476788 718751 1516556 546626
12073C12160q2529J59343q2837a40275C94080A68478F9093J75999b48765j16856
$$ 312160 229631 388974 306137 -140275 394080 168478 69093 245092 -248765 -365621
12063c65621E0934K57395a58140F8R8346l5017c11302B2355N7430L4541h3472
$$ -365621 50934 308329 -158140 68 98414 63397 -311302 22355 79785 114326 -83472
12051C90331G0835d11772G6648J22443C2467a64408e5781o6020l3366F3117b18846
$$ 390331 70835 -411772 76648 199091 32467 -164408 -55781 -121801 -155167 63117 -218846
12039A83718J11278e6342p1816A07567b88922A85075D7376j4643a39813C2028
$$ 183718 294996 -56342 -128158 107567 -288922 185075 47376 32733 -139813 32028
12028b4262n6286A19552i6554A77994H3748d9695I5394N3367C5000a65250H8425
$$ -24262 -80548 119552 -96554 177994 83748 -49695 95394 148761 35000 -165250 88425
12016B29622J90835c6295k45019E2747c6293g184H3120m0311c2100r760k48357
$$ 229622 420457 -36295 -281314 52747 -36293 -7184 83120 42809 -32100 -41860 -290217
12005b90217Q6612A8918a13220J728G1148Q4396b1113A46926h6595A53216C0598
$$ -290217 -203605 18918 -113220 -111492 71148 155544 -21113 146926 -86595 153216 30598
11993F8920l1343b16002N119d7975k1424B00775I4859g3220D1515L78321a46819
$$ 68920 37577 -216002 -210883 -47975 -69399 200775 94859 -73220 41515 419836 -146819
11981a55453A00703k9035c71981a08014A59060O3178a37590d3117G4299a10851
$$ -155453 100703 71668 -371981 -108014 159060 222238 -137590 -43117 74299 -110851
11970A84259p6994Q404J69495k4056n0344d10332A57256b18633C89881A40125
$$ 184259 107265 115669 285164 261108 210764 -410332 157256 -218633 389881 140125
11959c7126A05843b09206n6291i9537j31794c6142H9491d0714J4413l3313j083
$$ -37126 105843 -209206 -265497 -99537 -231331 -36142 89491 -40714 -26301 -59614 -60697
11948f0697A640K36007o129n591h8007B4898c69218b9866k05780a15717H3379
$$ -60697 1640 237647 231518 225927 -88007 24898 -369218 -29866 -235646 -115717 83379
11936B41399r4946J18301f8274m2840B2673P6688c77145a73363A220O6385A9491
$$ 241399 146453 264754 -68274 -111114 22673 99361 -377145 -173363 1220 67605 19491
11924d59395a74432O0182I5831A0329a88693D4309a24321C6879K66121c15406
$$ -459395 -174432 -114250 95831 10329 -188693 44309 -124321 36879 303000 -315406
11913B01192k8407D4461M5206N2234E8749B1411H030a02635b9086F9988K16755
$$ 201192 172785 44461 89667 141901 58749 21411 8030 -102635 -29086 69988 286743
11902B86743i3060I0332k1293a92294a046q558H8824b33455h779F202b64043A35117
$$ 286743 -93060 90332 69039 -192294 -1046 -9604 88824 -233455 -8779 6202 -264043 135117
11889A63935a48796D7867J14493f5834p3885C8039i8887k4278A63435a48711D9682
$$ 163935 -148796 47867 162360 -65834 -139719 38039 -98887 -123165 163435 -148711 49682
11877a11461F5205O7589b1126k89760A23695o0680a30898B0594d0425l31049e4680
$$ -111461 65205 132794 -21126 -310886 123695 63015 -130898 20594 -40425 -371474 -54680
11865i2959B98957c21992J57124j77166d4599B43010f2633A07241h5114A92173
$$ -92959 298957 -321992 -164868 -342034 -44599 243010 -62633 107241 -85114 192173
11854F2749Q2557C2136c17079J54711A14410c87625A38914a21476A39704c69508
$$ 62749 145306 32136 -317079 -162368 114410 -387625 138914 -121476 139704 -369508
11843H8573f5095J4386D7326N0323a47909j66728R0960M5971h5293A3928a60653
$$ 88573 -65095 -50709 47326 97649 -147909 -314637 -223677 -177706 -85293 13928 -160653
11831A44502a9176D9510a93337k4144A5782c8881A34538j4151R7865a2160l3660
$$ 144502 -19176 49510 -193337 -217481 15782 -38881 134538 120387 218252 -12160 -45820
11820d5820j74422A11884N4653K8725a192B51097c2187A04545a00365j324j10896
$$ -45820 -220242 111884 166537 195262 -1192 251097 -32187 104545 -100365 -101689 -212585
11809b12585I8069l9452a39143L8782A15867j4097B7685c1379A04245a23797j63386
$$ -212585 98069 58617 -139143 -100361 115867 101770 27685 -31379 104245 -123797 -287183
11798b87183B06878a44954K0080A61355a86146H9533J11982B0813f7322B53671
$$ -287183 206878 -144954 -124874 161355 -186146 89533 201515 20813 -67322 253671
11787A69652k2037K64450g1040D6302F208a18268k6952C14764A21744L3170E9395
$$ 169652 147615 412065 -71040 46302 6208 -118268 -145220 314764 121744 154914 59395
11775a93057j78686B4794a37033M5600G8509g8505E4510J24123E1698J84724C9061
$$ -193057 -371743 24794 -137033 -91433 78509 -78505 54510 178633 51698 236422 39061
11763b2183B12460J31038a88806Q8445J5024o7999L3423l4464I2193b32405e631
$$ -22183 212460 343498 -188806 -100361 -85337 -153336 -119913 -154377 92193 -232405 -5631
11751h7755H7583a66988H7759f9850E6749b43461B50960h2864l42990D5722M9224
$$ -87755 87583 -166988 87759 -69850 56749 -243461 250960 -82864 -425854 45722 94946
11740I4946a16330B9396h0904n2304A01463k9610c59707c8216j09618L0007G8052
$$ 94946 -116330 29396 -80904 -133208 101463 71853 -359707 -38216 -147834 -117827 78052
11728E3575K13247c06219A71985L09259j47205p6241c2357n1449D5670a70206
$$ 53575 266822 -306219 171985 481244 334039 257798 -32357 -83806 45670 -170206
11717G7677J86849i1491B7674A0809d0178J8764k7362j52682A31732l9122a30285
$$ 77677 264526 -91491 27674 10809 -40178 -21414 -48776 -201458 131732 92610 -130285
11705a02449B29827A11384e9065B45497r4185b67294r456a10424l46917B9733
$$ -102449 229827 111384 -59065 245497 151312 -267294 -276750 -110424 -457341 29733
11694a40643G1888f3051A71628O7801j12123J56592B6235J21348K49577A25042
$$ -140643 71888 -63051 171628 239429 127306 283898 26235 147583 397160 125042
11683A65827a03113D11742A43093a7719j26880k30060a03861A00398J03376K7259
$$ 165827 -103113 411742 143093 -17719 -144599 -374659 -103861 100398 203774 231033
11673B31033A0461J75496N4020g5822B83455G1758h1805D98875d04826J46159
$$ 231033 10461 185957 239977 -75822 283455 71758 -81805 498875 -404826 -258667
11663b58667A76009M6442A09485A9461E282L10758b38730b4973k4978A96281a94721
$$ -258667 176009 222451 109485 19461 5282 316040 -238730 -24973 -49951 196281 -194721
11651A03748d8682A74629a84036Q7243A00157h9113h898A34336J63909D0065K47567
$$ 103748 -48682 174629 -184036 -96793 100157 -89113 -8898 134336 298245 40065 287632
11640B87632d18222B61808b75792A11166B957c9171J0495B00622b2662q7408B51295
$$ 287632 -418222 261808 -275792 111166 2957 -39171 -28676 200622 -22662 -110070 251295
11628a07276R542B9516B981K81674o3375G3162N5488h412A85882q8540M9689h8888
$$ -107276 -97734 29516 2981 284655 221280 73162 128650 -8412 185882 97342 147031 -88888
11615a14196A52496i9243A98233J35402j05430O7508J48877A41727a10464i073
$$ -114196 152496 -99243 198233 333635 228205 295713 444590 141727 -110464 -9073
11604a96667B66077j31449j7226b10046m9872B17935r1296J93265C3158J76427
$$ -196667 266077 134628 117402 -210046 -259918 217935 126639 319904 33158 209585
11594B09585J88711C9555e1557j12485F2006L63262i3875B2138K23487I8347K64004
$$ 209585 398296 39555 -51557 -164042 62006 425268 -93875 22138 245625 98347 362351
11583C62351D9096a29930B02273B2730J79945P7297q0493C9539Q7527a66571A47796
$$ 362351 49096 -129930 202273 22730 202675 279972 199479 39539 127066 -166571 147796
11571A51220o3069j4519A2442N36976a87489A99839A4108i0983B1637J03434E6973
$$ 151220 88151 73632 12442 549418 -187489 199839 14108 -90983 21637 125071 56973
11559E650M45598b85280D01428b4328j67578c508C12551A43646b68813B76584
$$ 5650 451248 -285280 401428 -24328 -191906 -3508 312551 143646 -268813 276584
11548a49504F6325R8504D0558J56360R0077J18530I184a475k30828q9439i3300
$$ -149504 66325 164829 40558 196918 286995 405525 9184 -1475 -232303 -321742 -93300
11536c56723b8058j82806J8529d3219D8393o844b49175I7411J28508L2125A23662
$$ -356723 -28058 -210864 -192335 -43219 48393 41549 -249175 97411 225919 258044 123662
11524A28307D3534p699a78218A3097N42269a22335j3226N8138C2903L3330J4894
$$ 128307 43534 35835 -178218 13097 555366 -122335 -135561 -77423 32903 66233 81127
11513H1127j6062l1784K06121L46801j38731a09567r3050B74311r2031D0397d1934
$$ 81127 65065 33281 239402 586203 447472 -109567 -202617 274311 182280 40397 -41934
11501A36071c70083A0993J56808a7081f529A31459j7309n042b15756C05933c17247
$$ 136071 -370083 10993 167801 -17081 -6529 131459 114150 109108 -215756 305933 -317247
11489g8366A83130G4420J51109a07201M2692L0569A54998a77796B18126d8617
$$ -78366 183130 74420 225529 -107201 -64509 -33940 154998 -177796 218126 -48617
11478B8411L68294j46555n4451c3053B61982L5494j47560D3926J44990a05497
$$ 28411 396705 250150 195699 -33053 261982 297476 149916 43926 188916 -105497
11467a08950B28078K59427f0124C92844j00443a3196H0917E267L12802R4507b1523
$$ -108950 228078 487505 -60124 392844 292401 -13196 80917 5267 318069 412576 -21523
11455a26548b0084n5736n8069A70438L6047I3145m5548e5544a9626A45504d4703
$$ -126548 -20084 -75820 -133889 170438 206485 93145 47597 -55544 -19626 145504 -44703
11443C8732K45084m3515J12804a49159C7905O642L9497j2579J16497j5718e9770
$$ 38732 283816 240301 353105 -149159 37905 44547 84044 71465 187962 172244 -59770
11431B61295a05101q0982C3313a70383G8039J08112R508d5423m3700k1864A97108
$$ 261295 -105101 -186083 33313 -170383 78039 186151 195659 -45423 -89123 -110987 197108
11419e9154j59610A22602i1055l1082B23036A11052n084c1326j75332i4538A50759
$$ -59154 -218764 122602 -91055 -122137 223036 111052 105968 -31326 -206658 -94538 150759
11407a05226A38780A3100c6264A32124b21750a03514j30529C72185n9880j14032
$$ -105226 138780 13100 -36264 132124 -221750 -103514 -234043 372185 312305 198273
11397A98273a00045C46242f9213o2518A04411C8568J76136J3558b2298B88948
$$ 198273 -100045 346242 -69213 -131731 104411 38568 214704 228262 -22298 288948
11386a68892f4693d333B12180a30482A52670o8732N5101a44202b9050B00393A8687
$$ -168892 -64693 -4333 212180 -130482 152670 83938 139039 -144202 -29050 200393 18687
11374A45184a12386n8456A96156B9179J8797K7250C6871J04831j8188A4387J33148
$$ 145184 -112386 -170842 196156 29179 47976 75226 36871 141702 123514 14387 147535
11363A47535K67704b18326b5530j73281l505C89809b56197F7002B8548b46920
$$ 147535 415239 -218326 -25530 -198811 -202316 389809 -256197 67002 28548 -246920
11352a90656k31431J79916A8559c4271m4189c8433E04268a87304g804k26618b2620
$$ -190656 -422087 -242171 18559 -34271 -78460 -38433 504268 -187304 -7804 -234422 -22620
11340H8826b096j71924A68643c13965G7651J59814h3929C3033J3517a55741I4189
$$ 88826 -2096 -174020 168643 -313965 77651 237465 -83929 33033 46550 -155741 94189
11328a28123b2358G0109b49436B18319B5564a98001G9893M58023a72506O8014
$$ -128123 -22358 70109 -249436 218319 25564 -198001 79893 537916 -172506 -104492
11318a04492I5567c82712d137C95716j13597A18089E7032B6455g8322q2631C2022
$$ -104492 95567 -382712 -4137 395716 282119 118089 57032 26455 -78322 -160953 32022
11306B25031f0215B41956a16864L5712l6189o7450R2226r4582k13671K5176E7038
$$ 225031 -60215 241956 -116864 -81152 -117341 -184791 -92565 -187147 -400818 -375642 57038
11294A13584g3923b2494l6389H087K778d5654A51011C84d5962q244A7180b21636
$$ 113584 -73923 -22494 -58883 8087 10865 -45654 151011 384 -45962 -54206 17180 -221636
11281a96795H3345a34873q37K4971A33486a20806b6256l3105p3407j7232o9696
$$ -196795 83345 -134873 -135710 -110739 133486 -120806 -26256 -59361 -132768 -150000 -219696
11270b19696J09739j32585C66700a25096A44554E2647J00229E9914k6048J07c43691
$$ -219696 -109957 -242542 366700 -125096 144554 52647 152876 59914 33866 33973 -343691
11258f209k14539g6615A52292d3379C2520c7316j08161B71443h6251I4859C4265
$$ -6209 -220748 -76615 152292 -43379 32520 -37316 -145477 271443 -86251 94859 34265
11246B4597a25463F0616K1267a40589I0315a36882D2809R0551B4454k501J24135
$$ 24597 -125463 60616 81883 -140589 90315 -136882 42809 133360 24454 21953 146088
11235A46088c8936j14764r822c3725k2028r3885k991j10724C20205H9811i1310
$$ 146088 -38936 -153700 -163522 -33725 -55753 -149638 -152629 -263353 320205 89811 -91310
11223b2505j80455b7798A27524E721J52304c59171F5359b46506E0901c60519A7339
$$ -22505 -202960 -27798 127524 5721 158025 -359171 65359 -246506 50901 -360519 17339
11211A54647f5332J4398j30879A03689a13296g064m02772J96198B8373a80381
$$ 154647 -65332 -50934 -181813 103689 -113296 -7064 -409836 -213638 28373 -180381
11200b07524b1438j18360l8471G4466M1571r786a00729M8323G7099c16026A7437
$$ -207524 -21438 -139798 -178269 74466 116037 106251 -100729 -52406 77099 -316026 17437
11188A06077g4400r9585a5639j26759N3669C2611J86769E9467c8841l9803l2208
$$ 106077 -74400 -173985 -15639 -142398 -88729 32611 219380 59467 -38841 -78644 -110852
11177a10852C7391c43288I1046a39794B35895K9110I0906a24008H5993J43588
$$ -110852 37391 -343288 91046 -139794 235895 265005 90906 -124008 85993 229581
11167B29581c4746n6555b2218B7669R5406B3155g274k43886B32670m9005a3513
$$ 229581 -34746 -91301 -22218 27669 123075 23155 -7274 -251160 232670 183665 -13513
11155d45978C57106a9722A0414a37637D75166I6500d7279q7077I9562h1338j29635
$$ -445978 357106 -19722 10414 -137637 475166 96500 -47279 -134356 99562 -81338 -210973
11144b10973h6934j33597O3085f8477A22701b78572A77776h1905H6739a76372
$$ -210973 -86934 -220531 -157446 -68477 122701 -278572 177776 -81905 86739 -176372
11133A28617E0940j6249J71053b6071A71965R6611a45311Q089c9483B21052h3669
$$ 128617 50940 34691 205744 -26071 171965 268576 -145311 -137222 -39483 221052 -83669
11121A99978G8878C0343M26712A72923m2286K9479P8970c6698A91452j817P9264
$$ 199978 78878 30343 457055 172923 130637 160116 239086 -36698 191452 189635 268899
11110B68899j31963a2872D22194F5241M16190F5265K62311B9090O432b1734A5386
$$ 268899 136936 -12872 422194 65241 481431 65265 327576 29090 35522 -21734 15386
11098A65079i6434j6359K780B84278F7499i5093H8904K15840j5535p3632e8586
$$ 165079 -96434 -112793 -110013 284278 67499 -95093 88904 304744 289209 215577 -58586
11086A91792L7003P6362A41726O100a77382B75034j7310q7152K40063j79527j02638
$$ 191792 228795 305157 141726 147826 -177382 275034 257724 170572 410635 231108 128470
11075A28470J02296J12283L0899P6447B18138M0058D1833L88942O6197m0984r5964
$$ 128470 230766 343049 373948 450395 218138 258196 41833 430775 496972 455988 360024
11064C60024q98l1694R5128A32684M39431M8398k59231Q4612L23039l84067J68640
$$ 360024 359126 327432 422560 132684 572115 620513 361282 445894 768933 384866 553506
11053E53506j18374L088N0352P9218L23177D03346N16942l88373K36317j96042
$$ 553506 435132 438220 488572 567790 890967 403346 920288 531915 768232 572190
11043E72190O27243E10038L25421l21673K19579k3928k01393l4321M3312A25665
$$ 572190 1199433 510038 835459 513786 733365 709437 508044 473723 517035 125665
11032A86700N01888B71859K01494N7861L0445J06083p3721J22554k52587J63147
$$ 186700 688588 271859 473353 531214 561659 667742 594021 716575 463988 627135
11022F27135p5390L01633k14187p3277J17086o0486j85648K77629l33289L56105
$$ 627135 551745 853378 639191 565914 683000 622514 436866 714495 381206 737311
11012G37311J58955j35986k66250N27J34341Q9848N2827l53173J89052j8759r2780
$$ 737311 896266 760280 494030 494557 628898 718746 771573 418400 607452 588693 495913
11001D95913K59952j37742k81054O01672D53168J72513k24263M80996j41333j12502
$$ 495913 755865 618123 337069 938741 453168 625681 401418 882414 741081 628579
10991F28579L28504j32627j83188K88425K1112L2051j18557k9942j6727J64816
$$ 628579 957083 824456 641268 929693 950805 982856 864299 834357 817630 982446
10981I82446K71615L8610J45170P8857n7630k9753L65314K58026J2857L45235
$$ 982446 1254061 1292671 1437841 1516698 1459068 1429315 1794629 2052655 2065512 2410747
10971B410747l17340L76948n33679L08555J03569m00446k94675j457o893Q1140
$$ 2410747 2093407 2470355 1936676 2245231 2348800 1948354 1653679 1652222 1645329 1726469
10961A726469l21224R7372K53539J3847P6817k14144M1117j44526k26875j08706
$$ 1726469 1405245 1502617 1756156 1770003 1846820 1632676 1673793 1529267 1302392 1193686
10951A193686o5800j71135k02469n8911J6307k77935j27293R4729A43471J67560
$$ 1193686 1127886 956751 754282 695371 711678 433743 306450 401179 143471 311031
10941C11031p4483M42286C06201m0267f7074A06827a03609F2404A8522L92827
$$ 311031 236548 678834 306201 265934 -67074 106827 -103609 62404 18522 411349
10931D11349H5340i2595C17710M1206F0207R3417a78028b1826I4026N3702a78861
$$ 411349 85340 -92595 317710 358916 60207 153624 -178028 -21826 94026 147728 -178861
10919H132K67553a25649B29861a54614c5793p3321j67440A89405a3197k40430
$$ 8132 275685 -125649 229861 -154614 -35793 -109114 -276554 189405 -13197 -253627
10909b53627D4280L3796l1327O1842a32511A7158b74675c8922k7135B69414a05942
$$ -253627 44280 78076 46749 108591 -132511 17158 -274675 -38922 -66057 269414 -105942
10897b79814H043K46828H9745N5926d09132B31542b9510D5245K42386d9297F834
$$ -279814 8043 254871 89745 145671 -409132 231542 -29510 45245 287631 -49297 6834
10885B6738E599N5413d57986j01587A47097a22979j77896B19625a45410M8626
$$ 26738 5599 61012 -457986 -559573 147097 -122979 -300875 219625 -145410 -96784
10875i6784B50097d68613d974A92444E6463R0348K13408a51779e2286D1511a41773
$$ -96784 250097 -468613 -4974 192444 56463 146811 360219 -151779 -52286 41511 -141773
10863A29593A3735a72478I667d97715B2301m333c8686A34546f2547j10671K1140
$$ 129593 13735 -172478 9667 -497715 22301 17968 -38686 134546 -62547 -173218 -152078
10852a52078n9744f4750j84830B4811J35444G174K35485F2245Q4384a73320A20614
$$ -152078 -211822 -64750 -249580 24811 160255 7174 242659 62245 146629 -173320 120614
10840e6784A09228c49534b8432B67217l2629A11317b40081A99081a68781A45055
$$ -56784 109228 -349534 -28432 267217 234588 111317 -240081 199081 -168781 145055
10829B17750C6373a00228j48753C2560n544a71519c4964D5567a44858m889N9361
$$ 217750 36373 -100228 -248981 32560 27016 -171519 -34964 45567 -144858 -149747 -90386
10818i0386A73566o7860a94066A72986J3283a49412A78225a19970N7196A5749
$$ -90386 173566 105706 -194066 172986 186269 -149412 178225 -119970 -62774 15749
10807C2706a89847o3946O2103b3719H54a37767m6235a9194j14666E9806P0114
$$ 32706 -189847 -253793 -191690 -23719 854 -137767 -184002 -19194 -133860 59806 129920
10796A29920b22404I3857a15124b4535m54798D2492J7784d6391B81192A35369
$$ 129920 -222404 93857 -115124 -24535 -479333 42492 60276 -46391 281192 135369
10785i0401B0592J14526J92446r5031a88897A44339a76380C7536L99774e589r9470
$$ -90401 20592 135118 327564 232533 -188897 144339 -176380 37536 437310 -5589 -105059
10774a05059M1251p4691d3498j23908g7300A16888j1068H290Q4148b1663D17155
$$ -105059 -63808 -138499 -43498 -167406 -77300 116888 105820 8290 92438 -21663 417155
10762a56444B88909f7867k9396k1184E2335c2199p2076p5083p883f9024A34762
$$ -156444 288909 -67867 -97263 -118447 52335 -32199 -104275 -179358 -187241 -69024 134762
10750A90652j336a38189N3765Q225B4646K7265a32169b3642j6760a3781l1483
$$ 190652 189316 -138189 -84424 -76199 24646 51911 -132169 -23642 -40402 -13781 -45264
10739d5264o8683A02983b58636l8916h547A02209D8233O5709c5578j63271A6070
$$ -45264 -113947 102983 -258636 -297552 -8547 102209 48233 113942 -35578 -198849 16070
10727f7578m07713K24905G2789b53640o0606a12528A01690i6386j40659p7984
$$ -67578 -475291 -250386 72789 -253640 -314246 -112528 101690 -96386 -237045 -315029
10717c15029b5046B40452g3473i801k60578A4497b3040m8083a3212j6107A86676
$$ -315029 -25046 240452 -73473 -9801 -270379 14497 -23040 -71123 -13212 -29319 186676
10705C18303b93483J09650A74015F7173d05368a57465C15843a99697B3775Q0246
$$ 318303 -293483 -183833 174015 67173 -405368 -157465 315843 -199697 23775 104021
10695A04021k6148b66350o1114B15160o0680C081c29907H9763b549C55788j02043
$$ 104021 77873 -266350 -327464 215160 154480 3081 -329907 89763 -2549 355788 253745
10684B53745d7495j56976l5984k30159J77439Q4494B42088A6028c16003O9341
$$ 253745 -47495 -204471 -240455 -470614 -293175 -208681 242088 16028 -316003 -246662
10674b46662p4353J21069B64321e4178j02530A36500a7433E3577K4829K2703J95026
$$ -246662 -321015 -199946 264321 -54178 -156708 136500 -17433 53577 78406 101109 296135
10663B96135D1180b23728Q7737B47168b52937b7598J1155j42562f2093A78898
$$ 296135 41180 -223728 -135991 247168 -252937 -27598 -16443 -159005 -62093 178898
10652b11389j72219D5247e9767A0629g8416L7192p0918c498A35541b19293A61451
$$ -211389 -383608 45247 -59767 10629 -78416 -41224 -112142 -3498 135541 -219293 161451
10640H8164k3521M1711e4270k34499B91339a06662k69482A87914c0058k71710
$$ 88164 64643 106354 -54270 -288769 291339 -106662 -376144 187914 -30058 -301768
10630c01768a07940N2756m7513d6769j77921h7004c243p767A9918R3222P8648
$$ -301768 -107940 -55184 -102697 -46769 -224690 -87004 -3243 -11010 19918 113140 191788
10619A91788q4797a30723e724A7036a25912r9891b7407C5523g5017k83269J04805
$$ 191788 106991 -130723 -5724 17036 -125912 -225803 -27407 35523 -75017 -358286 -253481
10608b53481a3754l15851J7933g2331k43403O2343J01886D7867a94096C8871b39279
$$ -253481 -13754 -329605 -311672 -72331 -315734 -253391 -151505 47867 -194096 38871 -239279
10596i9639B41312i4909K1912k54548h8067A97507H1488b61964J27642d0451l8444
$$ -99639 241312 -94909 -72997 -327545 -88067 197507 81488 -261964 -134322 -40451 -78895
10585g8895l63611I3586J287a37738c710D8121a06725a4014j04497k4997B68306
$$ -78895 -442506 93586 94873 -137738 -3710 48121 -106725 -14014 -118511 -143508 268306
10573A30672a28003k49507A10766J44155b39736J16013e5141j938j57482J6725
$$ 130672 -128003 -377510 110766 254921 -239736 -123723 -55141 -57079 -214561 -197836
10563a97836e5676k20624j17573a19353J9617k57138J77383A76125C8256A9066
$$ -197836 -55676 -276300 -393873 -119353 -99736 -356874 -179491 176125 38256 19066
10552f9771n26777g2750B0808J10710B5314b44275A51642a4694E1227J29820q6658
$$ -69771 -596548 -72750 20808 131518 25314 -244275 151642 -14694 51227 181047 94389
10541I4389R981a01628j02078Q1548j08760i7939E9466a36146A61744b41305d2768
$$ 94389 104370 -101628 -203706 -122158 -230918 -97939 59466 -136146 161744 -241305 -42768
10529b60551c6063C26509A33265h2549A57072A4172b02215E8011a38533E2976
$$ -260551 -36063 326509 133265 -82549 157072 14172 -202215 58011 -138533 52976
10518a06005D280M820g0527o1794H2788i9275A35372a85909A88847b59465J06061
$$ -106005 4280 9100 -70527 -132321 82788 -99275 135372 -185909 188847 -259465 -153404
10507a53404D542K2116a57645A44518D7938g8030D7795a19918A84241i7514B04526
$$ -153404 4542 26658 -157645 144518 47938 -78030 47795 -119918 184241 -97514 204526
10495c01354i1749A35275K3533J3224k1265b78679A16498K667d7439B00333g691
$$ -301354 -91749 135275 158808 172032 150767 -278679 116498 119165 -47439 200333 -7691
10483C02713D6170M56179L8592k30883J49646j59829d1997A75619b2560j276A49048
$$ 302713 46170 502349 540941 310058 459704 299875 -41997 175619 -22560 -23836 149048
10471b00882Q5156j8702B48704a75496J3800A55978M603n9376a56469A7057J32517
$$ -200882 -115726 -134428 248704 -175496 -161696 155978 160581 101205 -156469 17057 149574
10460A49574a99653d8008j23821N0812e5770j74243a3700A17773L05511C5151
$$ 149574 -199653 -48008 -171829 -121017 -55770 -230013 -13700 117773 423284 35151
10449a58616J519n565C8402i9776A71358h8020l9060b5107j24364k26262C50878
$$ -158616 -157097 -162662 38402 -99776 171358 -88020 -127080 -25107 -149471 -375733 350878
10437a2413I7548R0942f2548A92543d4848m4069L1741H4305a05519B15456b07606
$$ -12413 97548 188490 -62548 192543 -44848 -88917 -57176 84305 -105519 215456 -207606
10425I2021a71913B3444J23606C4340b41411B00959q6504d3090B98196F9941B5600
$$ 92021 -171913 23444 147050 34340 -241411 200959 114455 -43090 298196 69941 25600
10413b8783o08280b33280J3312a9781C31621I7406k2587d83895A04979a62785
$$ -28783 -637063 -233280 -219968 -19781 331621 97406 74819 -483895 104979 -162785
10402a85981j2031E03133h4989A69678a89221i2838H606K44818q5156Q7951f2152
$$ -185981 -198012 503133 -84989 169678 -189221 -92838 8606 253424 168268 256219 -62152
10390I4793Q2811q793K31263I6446A3047b3715k81569i490D4926A4629b5143D6386
$$ 94793 177604 168811 400074 96446 13047 -23715 -305284 -9490 44926 14629 -25143 46386
10377B14096R1209p8515a25139C48444a19465G4960K51469K3123G0908h68C42624
$$ 214096 305305 226790 -125139 348444 -119465 74960 326429 349552 70908 -868 342624
10365B10682M49065j08163b38204D50313a35011A66502j3633J1121B4266L8530
$$ 210682 659747 551584 -238204 450313 -135011 166502 152869 163990 24266 62796
10355F2796P8383J0311k1013J41748M17813C27586K74120k67097O8914j68780
$$ 62796 141179 151490 130477 272225 690038 327586 601706 334609 403523 234743
10345B34743r4597Q261K74651j89832J69563J57300B48775B6008L15836I2273
$$ 234743 140146 148407 423058 233226 402789 560089 248775 26008 341844 92273
10334a06762D92376i0549C8643j9142J75965E1366J78017A03410l8048M55400
$$ -106762 492376 -90549 38643 19501 195466 51366 229383 103410 65362 520762
10324E20762g4978C32418j15393D3703L61957Q7235H7024N3278D1523K09170o0604
$$ 520762 -74978 332418 217025 43703 405660 492895 87024 140302 41523 250693 190089
10313A90089a97991B925h3779a3690j38712A54130K4867a56542A65629a74526
$$ 190089 -197991 2925 -83779 -13690 -152402 154130 178997 -156542 165629 -174526
10302i1440F1957d851A00745J21644G3576b00108G294i1809D0516K15173d9029
$$ -91440 61957 -4851 100745 222389 73576 -200108 7294 -91809 40516 255689 -49029
10290B1709b20359J7990P2594k338J3203k04671J36795I4270k2528c17498a2808
$$ 21709 -220359 -202369 -129775 -132113 -118910 -323581 -186786 94270 71742 -317498 -12808
10278a57544a124l36294A7694a5725E0359a80004e1794A45377k8555a71144j45461
$$ -157544 -1124 -337418 17694 -15725 50359 -180004 -51794 145377 116822 -171144 -316605
10267c16605c3209j387J31D8288J99661B1961L68189k4805A77461p4630K54402
$$ -316605 -33209 -34596 -34465 48288 247949 21961 390150 365345 177461 102831 357233
10256C57233j37382k2170K01208A42339m4628J60222a6466r9681j65323n4a06180
$$ 357233 219851 197681 398889 142339 97711 257933 -16466 -116147 -281470 -281524 -106180
10244b42719A12846J85078G3676R6466a72002d0617j23815f5677j3984r7516A48103
$$ -242719 112846 297924 73676 170142 -172002 -40617 -164432 -65677 -79661 -177177 148103
10232b00740j64121B7831J28818a62381o5234A20667J72737b06518j9477B26483
$$ -200740 -364861 27831 156649 -162381 -227615 120667 293404 -206518 -225995 226483
10221c60385a8096q953i561F7640a16110B41435B0246J0808a46515l66181C1321
$$ -360385 -18096 -27049 -9561 67640 -116110 241435 20246 31054 -146515 -512696 31321
10209a41798j84776F7653K8370g9393b5529j62732k1610A34983L8246a18882A88667
$$ -141798 -326574 67653 96023 -79393 -25529 -188261 -209871 134983 173229 -118882 188667
10197i3123A83225q3840b0766A51289F0882M4929m3567b81990A80208L85064A36561
$$ -93123 183225 99385 -20766 151289 60882 105811 62244 -281990 180208 565272 136561
10185B08673i2048K5729p6102A50649a75771g1512j11847I0485O3238B6438a552
$$ 208673 -92048 -66319 -142421 150649 -175771 -71512 -183359 90485 153723 26438 -1552
10173A3302c00640G7574J12615c20899J26916p6573d0419p5610A02019k4068a46718
$$ 13302 -300640 77574 190189 -320899 -193983 -270556 -40419 -116029 102019 77951 -146718
10161a36674B21289m8242b02994N3567K8054B26077a72305A57979C3434e79410
$$ -136674 221289 173047 -202994 -149427 -121373 226077 -172305 157979 33434 -579410
10150f39547H3724a88317j14894D6477c55444j90586D6562B1042L2943f9939j8768
$$ -639547 83724 -188317 -303211 46477 -355444 -546030 46562 21042 53985 -69939 -88707
10139h8707D760K5122b1211K114F9134d9389A3267N425h6272m7585O166j34582
$$ -88707 4760 29882 -21211 -19097 69134 -49389 13267 18692 -86272 -133857 -127691 -262273
10127b62273e7723j71429B02596r0946c7119B05101a80277O9208o5540j50108
$$ -262273 -57723 -229152 202596 111650 -37119 205101 -180277 -111069 -176609 -326717
10117c26717B27573b66295A75533b09060f9854n1438m780M4790j06901f1370A57441
$$ -326717 227573 -266295 175533 -209060 -69854 -121292 -126072 -81282 -188183 -61370 157441
10105A02050e3701C6736h9683r5544k20167a35479J3790J0626a8146F4207c918
$$ 102050 -53701 36736 -89683 -185227 -405394 -135479 -121689 -111063 -18146 64207 -3918
10093c15189D0880a11750M9436A72536c4246l0751b9724j52263A3304a54350n7226
$$ -315189 40880 -111750 -62314 172536 -34246 -64997 -29724 -181987 13304 -154350 -211576
10082b11576J6796F4265A5770c3409l08878B35980a43898m3338J8519G2755b05180
$$ -211576 -194780 64265 15770 -33409 -342287 235980 -143898 -187236 -168717 72755 -205180
10070B03176b74414Q2013C7119b99787e2136A56157e8942n8802c5764k63722A34294
$$ 203176 -274414 -192401 37119 -299787 -52136 156157 -58942 -117744 -35764 -299486 134294
10058A18899b58412J7252J14395n2456G6064a07162C80345A82351i9060k7565
$$ 118899 -258412 -241160 -126765 -179221 76064 -107162 380345 182351 -99060 -126625
10048a26625B9669K9929a19700k27688A44725c0110a4970k16417D5030h7191n0176
$$ -126625 29669 59598 -119700 -347388 144725 -30110 -14970 -231387 45030 -87191 -137367
10037a37367A36311n4853K49863A26650i1599A11826a33555m2686A35755P7418
$$ -137367 136311 81458 331321 126650 -91599 111826 -133555 -176241 135755 213173
10027B13173h6446k31549a44762E0397J73638M749a26877A23806A1030L5063a76938
$$ 213173 -86446 -317995 -144762 50397 224035 228784 -126877 123806 11030 46093 -176938
10015A47864A6214a58778D0944a81769h8934C4880c54397J19254D3065e6153f115
$$ 147864 16214 -158778 40944 -181769 -88934 34880 -354397 -235143 43065 -56153 -6115
10003b77063F4831c34468F6958B110a69344i484q5701H9642K07854B8280a44080
$$ -277063 64831 -334468 66958 2110 -169344 -9484 -95185 89642 297496 28280 -144080
9991F8624a45496A3218O3854d1876j31641E9238J5055b67238E5961a50938e6974
$$ 68624 -145496 13218 77072 -41876 -173517 59238 74293 -267238 55961 -150938 -56974
9979a00915j16342B66890a58392G9784h0833F6875F190f8009B7531j0256J79108
$$ -100915 -217257 266890 -158392 79784 -80833 66875 6190 -68009 27531 17275 196383
9968A96383g0928b5994k74593k054j2064I9219g615A21372a82695j32646l885
$$ 196383 -70928 -25994 -300587 -302641 -314705 99219 -7615 121372 -182695 -315341 -319226
9957c19226a29544p6621g6013A12934h0104b0965k76555c0828H6294O7608a54105
$$ -319226 -129544 -206165 -76013 112934 -80104 -20965 -297520 -30828 86294 153902 -154105
9945B85534a68884B04118a02323A39195b39453K7276R516A37813d37091a6859
$$ 285534 -168884 204118 -102323 139195 -239453 -212177 -202661 137813 -437091 -16859
9934a10164k42920J62583A97704O2584b60593N2592A00058c1953l66710m9467
$$ -110164 -353084 -190501 197704 260288 -260593 -208001 100058 -31953 -398663 -448130
9924d48130J81602L0934A08963J10272a52610P2278j94887N0043G9586i7243e025
$$ -448130 -266528 -235594 108963 219235 -152610 -80332 -275219 -225176 79586 -97243 -5025
9912c33373Q1689M9465e6775K0186A08468B770N1887J67267b42959i0226G6658
$$ -333373 -251684 -202219 -56775 -36589 108468 2770 54657 221924 -242959 -90226 76658
9900B05689M8583G7268b00597A67845a80709r3759H1808f7323k2703b5377k99524
$$ 205689 254272 77268 -200597 167845 -180709 -274468 81808 -67323 -90026 -25377 -324901
9889c24901c4921j58764J2341n6827l8191d1199p9485M3432q4690b7273A49c1805
$$ -324901 -34921 -193685 -181344 -238171 -276362 -41199 -120684 -77252 -161942 -27273 149 -31805
9876a86342A25755f7186n2157B2516b18004f9167A76143o3824L84490b50812G3605
$$ -186342 125755 -67186 -119343 22516 -218004 -69167 176143 112319 496809 -250812 73605
9864B64648J4424C6859l387K47769h0993G0192K21061b36060B35742a51883A9145
$$ 264648 279072 36859 33472 281241 -80993 70192 291253 -236060 235742 -151883 19145
9852b24592C6439d32420H371c45264A58945o8834a06387L1689A07254f4597H4632
$$ -224592 36439 -432420 8371 -345264 158945 90111 -106387 -74698 107254 -64597 84632
9840a32835l49563d3229j9136q656m6471M1682j94501A8909a82681Q4536d6083
$$ -132835 -482398 -43229 -62365 -71021 -117492 -75810 -270311 18909 -182681 -98145 -46083
9828c50513a68687L7689O2774p1478d5231D5955a07631A44350a10428k78478h1027
$$ -350513 -168687 -130998 -68224 -139702 -45231 45955 -107631 144350 -110428 -388906 -81027
9816A93932a77117J9955A35567g4638E3233k5386a20194b428C287J7437L0519
$$ 193932 -177117 -157162 135567 -74638 53233 27847 -120194 -2428 3287 20724 51243
9805E1243e4192j21718e3944k5370l2152J5809G008c2961j53530a0448D6009b17986
$$ 51243 -54192 -175910 -53944 -79314 -111466 -95657 7008 -32961 -186491 -10448 46009 -217986
9792b31029A32470i3921i248B32976d09378a51543j6112j23052E7057J16849c62464
$$ -231029 132470 -93921 -9248 232976 -409378 -151543 -167655 -290707 57057 173906 -362464
9780a58700b5239C68622e4799j28306o2056j34076C9993h1936D8144d9925l3238
$$ -158700 -25239 368622 -54799 -183105 -245161 -379237 39993 -81936 48144 -49925 -83163
9769h3163k0686j24430p2870J33846j8354k35743G4782d39800a91197C0738c8488
$$ -83163 -103849 -228279 -301149 -167303 -185657 -421400 74782 -439800 -191197 30738 -38488
9757E9692J33676m1322B8865a62227L0209k16911A0141P3974a18956A03537C198
$$ 59692 193368 152046 28865 -162227 -132018 -348929 10141 84115 -118956 103537 3198
9745b62674A51886d0860A33562n2692a27543R757j64558a24352N2408J2906j49904
$$ -262674 151886 -40860 133562 80870 -127543 -117786 -282344 -124352 -71944 -59038 -208942
9734b08942N2663d8966k00657a23067C2352c8955a6361j26681C5188A2789L61312
$$ -208942 -156279 -48966 -249623 -123067 32352 -38955 -16361 -143042 35188 12789 374101
9723C74101j85518n7208a32819f5998A7789M225c07350A51627h3619M166L9696
$$ 374101 188583 131375 -132819 -65998 17789 22014 -307350 151627 -83619 -79453 -39757
9712c9757B6678K9623b2661A53938J13874e3740C4615a70078L4789K7571q0523
$$ -39757 26678 56301 -22661 153938 267812 -53740 34615 -170078 -135289 -107718 -188241
9701a88241D2381J41016O5746J8342A11552e0302n3120A56340b23023C52310f4119
$$ -188241 42381 183397 249143 267485 111552 -50302 -103422 156340 -223023 352310 -64119
9689b16440m1668B317Q1383L2119e5575k97659a62994j17892B9449K8389h549
$$ -216440 -258108 2317 83700 115819 -55575 -353234 -162994 -280886 29449 57838 -8549
9677A13468A0565h8980o8449m1198p8937e6284E7748R7399A9803K71654H9979
$$ 113468 10565 -88980 -157429 -198627 -277564 -56284 57748 155147 19803 291457 89979
9665b42966g7903b9948k407a0120A04736A4957J58336a60945A7173h5371F6867
$$ -242966 -77903 -29948 -32355 -10120 104736 14957 173293 -160945 17173 -85371 66867
9653g9697F8591a38544E5488b52280l9797c9587N189H61b79396d1136b891O59
$$ -79697 68591 -138544 55488 -252280 -292077 -39587 -34398 861 -279396 -41136 -2891 -2232
9641b232I8159c90015A60803d48578R5899A41455j7045a65463G973J28384D9832
$$ -2232 98159 -390015 160803 -448578 -352679 141455 124410 -165463 7973 136357 49832
9629A27491K0099L8241G6003g7256j44870O8132k09675H2428j6484f8540A5806
$$ 127491 147590 185831 76003 -77256 -222126 -153994 -363669 82428 65944 -68540 15806
9617d8000A6332J36675b14664G9176R9797a8151A21503A3593b03219O937O3303
$$ -48000 16332 153007 -214664 79176 178973 -18151 121503 13593 -203219 -196282 -132979
9606a32979M7744l12356c9808p1495j11535f0776k97414i9494B66976a66310B17057
$$ -132979 -85235 -397591 -39808 -111303 -222838 -60776 -358190 -99494 266976 -166310 217057
9594h7566j75123A05281d44662b06609j40028d4903H2135a80141D3069g3400m8623
$$ -87566 -262689 105281 -444662 -206609 -346637 -44903 82135 -180141 43069 -73400 -122023
9583a22023A13805c22239f2554m55373A76209N0584c15107a44040O2180b9676
$$ -122023 113805 -322239 -62554 -517927 176209 226793 -315107 -144040 -81860 -29676
9572E9408a15719A5776M8583J89824c1316o6852k2583q4130O6344H4615b92639
$$ 59408 -115719 15776 64359 254183 -31316 -98168 -120751 -204881 -138537 84615 -292639
9560c2113J3476k36708K466J14857l3288A61e4914k2271k75828a32968J1977j47509
$$ -32113 -18637 -255345 -252879 -138022 -171310 161 -54914 -77185 -353013 -132968 -120991 -268500
9548b68500A2978b26507p3661I1341J18023q2175b98497B63608l2988d2656i449
$$ -268500 12978 -226507 -300168 91341 209364 127189 -298497 263608 230620 -42656 -9449
9536E7724d8143B6559g1399j12223J4472M7763k24663J48265P4228N7583A237
$$ 57724 -48143 26559 -71399 -183622 -169150 -121387 -346050 -197785 -123557 -65974 1237
9524a21578C09965E4943B2514L2108b57178c6606l01794A24869B8967d1206l491
$$ -121578 309965 54943 22514 54622 -257178 -36606 -338400 124869 28967 -41206 -44697
9513d4697k92019B3380a3176j56541I9903a78437a7916B53934a82834E3504N609
$$ -44697 -336716 23380 -13176 -169717 99903 -178437 -17916 253934 -182834 53504 59113
9502E9113P819J41027O3091j06292a11579N1117A01579a2624m02580A28468i5580
$$ 59113 66932 207959 271050 164758 -111579 -60462 101579 -12624 -415204 128468 -95580
9490b51810N0707P7657A13075f3360k14442C2992b31777L3883O9746M1912L1072
$$ -251810 -201103 -123446 113075 -63360 -277802 32992 -231777 -197894 -128148 -86236 -55164
9479e5164I7542a19076A0296J86001q7790b63j13633l9864G0404b53149a01897
$$ -55164 97542 -119076 10296 196297 108507 -263 -113896 -153760 70404 -253149 -101897
9467h8194A6022d2896j59280F5335B7260c19062h9013C9666Q9750c4660k64839
$$ -88194 16022 -42896 -202176 65335 27260 -319062 -89013 39666 129416 -34660 -299499
9456b99499j64429a04654A73045n2415b42791N1405L4235A60072g5126j74653
$$ -299499 -463928 -104654 173045 120630 -242791 -191386 -157151 160072 -75126 -249779
9446b49779A35555a38851p8135A16999d7051R379B37078e0205A12895a56920b0470
$$ -249779 135555 -138851 -216986 116999 -47051 -37672 237078 -50205 112895 -156920 -20470
9434H6056b95263N5693B17663o5130g4997A15907L0654D814b88041b2640r3518
$$ 86056 -295263 -239570 217663 152533 -74997 115907 146561 4814 -288041 -22640 -116158
9423a16158H7802d8771G8507i0046A76786d68202A31371D1994a36595j67008A70900
$$ -116158 87802 -48771 78507 -90046 176786 -468202 131371 41994 -136595 -303603 170900
9411d6852k20533N8708p8326N5896J02870A03591e2736G9275g8320D71575j86359
$$ -46852 -267385 -208677 -287003 -231107 -128237 103591 -52736 79275 -78320 471575 285216
9400B85216A8220d00398B87996b23238N089A07632d0772i648D9600c76457a36836
$$ 285216 18220 -400398 287996 -223238 -218149 107632 -40772 -9648 49600 -376457 -136836
9388e3135k42806B68186a09475E7621a80128k04781a62360P4992k35872i7486
$$ -53135 -295941 268186 -109475 57621 -180128 -384909 -162360 -87368 -323240 -97486
9377i4000q0654j10751f5756k38913P4744A17043c4976A8267J4701R180a17200
$$ -94000 -174654 -285405 -65756 -304669 -229925 117043 -34976 18267 32968 42148 -117200
9365H5080j8311a61497M3033L6993J2606I845f2762l96581H4869c28782h1805
$$ 85080 66769 -161497 -118464 -81471 -68865 9845 -62762 -459343 84869 -328782 -81805
9353d5236B1051a46646p2904C7718J5250J66754K25380b29744g1002A50484Q1884
$$ -45236 21051 -146646 -219550 37718 52968 219722 445102 -229744 -71002 150484 232368
9342B32368A4750d1249A24401N2138n2193d2561J5082B2794a43914l0695m20333
$$ 232368 14750 -41249 124401 176539 124346 -42561 -27479 22794 -143914 -174609 -594942
9331e94942C8174a64681k53767I8578G000a22039A65875c91464a20557c8557n1889
$$ -594942 38174 -164681 -418448 98578 7000 -122039 165875 -391464 -120557 -38557 -90446
9320i0446J2016l4569q2319C7588c6022k57093J06654E12582i4655d1917l77538
$$ -90446 -78430 -112999 -195318 37588 -36022 -293115 -186461 512582 -94655 -41917 -419455
9309d19455b1312A29247f4083k35830L3007a23680B04512a91384b8884A27833
$$ -419455 -21312 129247 -64083 -299913 -266906 -123680 204512 -191384 -28884 127833
9298A65863a51289D9288J45707f1286p0674M3793j07403l9081A46542c69139A0312
$$ 165863 -151289 49288 194995 -61286 -131960 -88167 -195570 -234651 146542 -369139 10312
9286i3490D906R9895O1289a73613B29522a92888K7746M7975j7487O0811J9880
$$ -93490 4906 104801 166090 -173613 229522 -192888 -165142 -117167 -134654 -73843 -53963
9275e3963k0590p5212f8724j32766A93085a95976M4983A91712J41058I5353a72973
$$ -53963 -74553 -149765 -68724 -201490 193085 -195976 -150993 191712 332770 95353 -172973
9263B13770c81465a1019A33694b05829I1262J12964a58199e7848A71701A1494
$$ 213770 -381465 -11019 133694 -205829 91262 204226 -158199 -57848 171701 11494
9252b28914C6448L71614c65762B17548a2790q5504k53447a65883f574B15044H5917
$$ -228914 36448 408062 -365762 217548 -12790 -98294 -351741 -165883 -6574 215044 85917
9240b21838A2053b06824R2374j48186i7159M8080H0511A7430a71744L7476b5214
$$ -221838 12053 -206824 -114450 -262636 -97159 -49079 80511 17430 -171744 -134268 -25214
9228B32393H0307i9668p5578B55478b02883C29290a05034A09919b20074B30763
$$ 232393 80307 -99668 -175246 255478 -202883 329290 -105034 109919 -220074 230763
9217a53436A58897A3489i5249j85975I8218P4591c69751a15475O008j88772k08629
$$ -153436 158897 13489 -95249 -281224 98218 172809 -369751 -115475 -109467 -298239 -506868
9206e06868b9774o7509j77580l3602J0680A89472j4578A0805b35159Q7802j74173
$$ -506868 -29774 -97283 -274863 -308465 -297785 189472 174894 10805 -235159 -147357 -321530
9195c21530a13853D9624l305a1873A16575L4620j5926a31153A60391j6033e5060
$$ -321530 -113853 49624 46319 -11873 116575 151195 135269 -131153 160391 144358 -55060
9183a04838A21004A181a05165j66764J31728B96019a03069I8235a25306A56518
$$ -104838 121004 1181 -105165 -271929 -140201 296019 -103069 98235 -125306 156518
9172c76973a62227N9043M7058m8746A66465c89736P0079G6464J34922k1125b62720
$$ -376973 -162227 -103184 -56126 -104872 166465 -389736 -319657 76464 211386 190261 -262720
9160d4789D6906c04038A78073M0795b66826l248A32266c51393f8160B25299g2242
$$ -44789 46906 -304038 178073 218868 -266826 -270074 132266 -351393 -68160 225299 -72242
9148a23805n856b6494m9719j33733j1204D3107b45111R6983J8760J3530j17926
$$ -123805 -129661 -26494 -76213 -209946 -221150 43107 -245111 -148128 -129368 -115838 -233764
9137b33764h9800A53986a03715B89741F7633d0367A51102B9690d28979B46994
$$ -233764 -89800 153986 -103715 289741 67633 -40367 151102 29690 -428979 246994
9126A68006c01947B24010d5551B519c11099P3621A97201H742a79572N6727D569
$$ 168006 -301947 224010 -45551 2519 -311099 -237478 197201 8742 -179572 -122845 4569
9114D6485b12553g587B94707b92505b418G684a48938A41867A1798a00739H3013
$$ 46485 -212553 -7587 294707 -292505 -2418 7684 -148938 141867 11798 -100739 83013
9102b45805I4574M0487g8684c1250E745M0899a22883j01320Q9744A70410b72823
$$ -245805 94574 135061 -78684 -31250 5745 46644 -122883 -224203 -134459 170410 -272823
9090F4862a60206G521J84913G2685a53507E1264i9528C61180b27481C50390b93405
$$ 64862 -160206 7521 192434 72685 -153507 51264 -99528 361180 -227481 350390 -293405
9078c10774A48748c8958M753j67336E68697j97746a59374A19993J01361b91665
$$ -310774 148748 -38958 -34205 -201541 568697 370951 -159374 119993 221354 -291665
9067D6034J36675c17359d3317A11944c63138A76013G5735B285b53572A4207e7228
$$ 46034 182709 -317359 -43317 111944 -363138 176013 75735 2285 -253572 14207 -57228
9055d8911k82898e8161k13265a03093B35975c4633C9533e9112m483k41695A13453
$$ -48911 -331809 -58161 -271426 -103093 235975 -34633 39533 -59112 -63595 -305290 113453
9043a04523b4565C65434b24944d4007p1937o3804F1221a34856k83771J03193o8408
$$ -104523 -24565 365434 -224944 -44007 -115944 -179748 61221 -134856 -418627 -315434 -383842
9032c83842B61875a95503f3481k95802J36866O3967B35557B3725A371N7103c44018
$$ -383842 261875 -195503 -63481 -359283 -222417 -158450 235557 23725 1371 58474 -344018
9020b46355B7975b54752D8852a62158H5022e8935A57962f7820K5589j41193b1160
$$ -246355 27975 -254752 48852 -162158 85022 -58935 157962 -67820 -42231 -183424 -21160
9008f6857k28975E3812a69958k81667A7710b01751o8801a30113A0241b6457r8341
$$ -66857 -295832 53812 -169958 -451625 17710 -201751 -270552 -130113 10241 -26457 -124798
8997a24798C68948a38194r9136P4979L2760A13619b46210C61277g3550J0267G5834
$$ -124798 368948 -138194 -237330 -162351 -129591 113619 -246210 361277 -73550 -63283 75834
8985d44277A1436a36825d3587I85c5883k33048B26828b31917j10202F9035B0995
$$ -444277 11436 -136825 -43587 985 -35883 -268931 226828 -231917 -342119 69035 20995
8973E2478a02923p1070A34645I809a50110B48834e2416C69266j61905b6655r7320
$$ 52478 -102923 -173993 134645 9809 -150110 248834 -52416 369266 207361 -26655 -123975
8962a23975B16019a61756B5933g9283i765G531a35845O3972l05790I4995M7860
$$ -123975 216019 -161756 25933 -79283 -9765 7531 -135845 -71873 -377663 94995 142855
8951A42855F7633g6741D4220f7991I5124i3571j7470C64754b78778J29547k20788
$$ 142855 67633 -76741 44220 -67991 95124 -93571 -111041 364754 -278778 -149231 -370019
8940c70019J19138b7587o0974B65216q3941N3911K4001a11653A84918M5254n0144
$$ -370019 -250881 -27587 -88561 265216 181275 235186 259187 -111653 184918 230172 180028
8929A80028K5908Q5940m4581P3289M98133M51901Q78994K986620M423467C594338
$$ 180028 205936 291876 247295 320584 818717 1270618 2149612 5136232 9559699 3594338
8918A953753r34735m11994B6713J88746B1701K83812A3763K80340I9772J22483
$$ 1953753 1019018 607024 26713 215459 21701 305513 13763 294103 99772 222255
8908B22255p7719K50717c4469C9316O7126B0312J44327a86601b4316A2694a99790
$$ 222255 144536 395253 -34469 39316 106442 20312 164639 -186601 -24316 12694 -199790
8896A29217g5581j66429A18896a78932E758J89800i5370L282C9554h9238h361
$$ 129217 -75581 -242010 118896 -178932 5758 195558 -95370 -92088 39554 -89238 -8361
8884C25136A4819c4454A06777A6324L08828F7687k5152J45869b15947H120J37150
$$ 325136 14819 -34454 106777 16324 325152 67687 42535 188404 -215947 8120 145270
8873A45270a62821D7721J15270c1822E3155N7577d15537a18896e0276A71072a35499
$$ 145270 -162821 47721 162991 -31822 53155 110732 -415537 -118896 -50276 171072 -135499
8861h6069n33304a20313A10973M7048J44347b05884e8082H1512c45156J10944
$$ -86069 -619373 -120313 110973 158021 302368 -205884 -58082 81512 -345156 -234212
$$ [...]
##END NTUPLES=NMR SPECTRUM
##END=
