
##TITLE=AC1242_NUNAH12032_6945093_1EIYo8Zey3
##JCAMPDX= 6.0         $$ Bruker NMR JCAMP-DX V2.0
##DATA TYPE= NMR SPECTRUM
##DATA CLASS= NTUPLES
##ORIGIN= BRUKER
##OWNER= Administrator
$$ 1.72 TOPSPIN		Version 2.1
$$ 2012-10-18 13:43:52.802 -0700  Administrator@X
$$ Compression mode = diff/dup
##.OBSERVE FREQUENCY= 400.02188249412
##.OBSERVE NUCLEUS= ^1H
##.ACQUISITION MODE= SIMULTANEOUS (DQD)
##.ACQUISITION SCHEME= undefined
##.AVERAGES= 64
##.DIGITISER RES= 22
##SPECTROMETER/DATA SYSTEM= spect
##.PULSE SEQUENCE= noesygpps1d.comp
##.SOLVENT NAME= COFFEE_meoh
##.SHIFT REFERENCE= INTERNAL, COFFEE_meoh, 1, 14.96102
##AUDIT TRAIL= $$ (NUMBER, WHEN, WHO, WHERE, PROCESS, VERSION, WHAT)
$$ ##TITLE= Audit trail, TOPSPIN		Version 2.1
$$ ##JCAMPDX= 5.01
$$ ##ORIGIN= Bruker BioSpin GmbH
$$ ##OWNER= Administrator
$$ $$ C:\Bruker\TOPSPIN/data/COFFEE/nmr/AC1242_NUNAH12032_6945093_1EIYo8Zey3/12/pdata/1/auditp.txt
$$ ##AUDIT TRAIL=  $$ (NUMBER, WHEN, WHO, WHERE, PROCESS, VERSION, WHAT)
(   1,<2012-10-13 18:17:51.765 -0500>,<Administrator>,<TOPSPIN>,<go>,<TOPSPIN 2.1>,
      <created by zg
	started at 2012-10-13 18:06:21.609 -0500,
	POWCHK enabled, PULCHK disabled,
       configuration hash MD5:
       6B 1B 68 BB D9 2E 58 E2 7F 35 AD 54 07 DF 0E 41
       data hash MD5: 64K
       5E 0E A7 46 A5 3A 8F 2D 91 09 DB ED C9 8E 8E D4>)
(   2,<2012-10-13 18:17:54.562 -0500>,<Administrator>,<TOPSPIN>,<proc1d>,<TOPSPIN 2.1>,
      <Start of raw data processing
       efp LB = 0.3 FT_mod = 6 PKNL = 1 PHC0 = 0 PHC1 = 0 SI = 128K 
       data hash MD5: 128K
       45 45 98 98 C5 0E 84 C1 EA F5 12 EA F7 C0 04 4E>)
(   3,<2012-10-13 18:17:55.734 -0500>,<Administrator>,<TOPSPIN>,<proc1d>,<TOPSPIN 2.1>,
      <pk PHC0 = 3.290405 PHC1 = 0 
       data hash MD5: 128K
       64 AA E6 5D 71 67 FE AB 19 C3 52 4C 8F 96 BB 19>)
(   4,<2012-10-13 18:17:55.968 -0500>,<Administrator>,<TOPSPIN>,<proc1d>,<TOPSPIN 2.1>,
      <abs ABSG = 1 
       data hash MD5: 128K
       8D 47 B9 FA 58 26 EE 0B 06 CC DB 3C C6 9C 61 D2>)
(   5,<2012-10-13 18:17:56.046 -0500>,<Administrator>,<TOPSPIN>,<proc1d>,<TOPSPIN 2.1>,
      <abs ABSG = 2 
       data hash MD5: 128K
       E8 1E 31 03 FB C6 0C 80 AF 9D 1C 6E 6C B6 9B 18>)
(   6,<2012-10-13 18:17:56.234 -0500>,<Administrator>,<TOPSPIN>,<proc1d>,<TOPSPIN 2.1>,
      <abs ABSG = 3 
       data hash MD5: 128K
       24 50 B3 83 58 77 0B 1D 0E B7 0D 18 78 19 83 F7>)
(   7,<2012-10-13 18:17:56.328 -0500>,<Administrator>,<TOPSPIN>,<proc1d>,<TOPSPIN 2.1>,
      <abs ABSG = 4 
       data hash MD5: 128K
       B2 24 A1 C8 1D 01 2F BA 06 17 E3 E5 7D AB 84 AE>)
(   8,<2012-10-13 18:17:56.375 -0500>,<Administrator>,<TOPSPIN>,<proc1d>,<TOPSPIN 2.1>,
      <abs ABSG = 5 
       data hash MD5: 128K
       DB C8 89 6C 9C 4A 1C B2 FF 29 A6 06 D0 18 B8 63>)
(   9,<2012-10-13 18:17:56.609 -0500>,<Administrator>,<TOPSPIN>,<audit>,<TOPSPIN 2.1>,
      <user comment:
       ICON-NMR User ID: COFFEE
       data hash MD5: 128K
$$ [...]
##$TP07= 0
##$TPNAME0= <>
##$TPNAME1= <>
##$TPNAME2= <>
##$TPNAME3= <>
##$TPNAME4= <>
##$TPNAME5= <>
##$TPNAME6= <>
##$TPNAME7= <>
##$TPOAL= (0..7)
0.5 0.5 0.5 0.5 0.5 0.5 0.5 0.5
##$TPOFFS= (0..7)
0 0 0 0 0 0 0 0
##$TUNHIN= 0
##$TUNHOUT= 0
##$TUNXOUT= 0
##$USERA1= <user>
##$USERA2= <user>
##$USERA3= <user>
##$USERA4= <user>
##$USERA5= <user>
##$V9= 5
##$VALIST= <valist>
##$VCLIST= <CCCCCCCCCCCCCCC>
##$VD= 0
##$VDLIST= <DDDDDDDDDDDDDDD>
##$VPLIST= <PPPPPPPPPPPPPPP>
##$VTLIST= <TTTTTTTTTTTTTTT>
##$WBST= 2048
##$WBSW= 25
##$XGAIN= (0..3)
0 0 0 0
##$XL= 0
##$YL= 0
##$YMAX_a= 12572871
##$YMIN_a= -9366545
##$ZGOPTNS= <>
##$ZL1= 120
##$ZL2= 120
##$ZL3= 120
##$ZL4= 120
##$ABSF1= 14.96102
##$ABSF2= -5.597161
##$ABSG= 5
##$ABSL= 3
##$ALPHA= 0
##$AQORDER= 0
##$ASSFAC= 0
##$ASSFACI= 0
##$ASSFACX= 0
##$ASSWID= 0
##$AUNMP= <proc_prof1d_extract.lims>
##$AXLEFT= 0
##$AXNAME= <>
##$AXNUC= <1H>
##$AXRIGHT= 0
##$AXTYPE= 0
##$AXUNIT= <>
##$AZFE= 0.1
##$AZFW= 0.1
##$BCFW= 0
##$BC_mod= 0
##$BYTORDP= 0
##$COROFFS= 0
##$CY= 15
##$DATMOD= 1
##$DC= 0
##$DFILT= <>
##$DTYPP= 0
##$F1P= 0
##$F2P= 0
##$FCOR= 0.5
##$FTSIZE= 131072
##$FT_mod= 6
##$GAMMA= 0
##$GB= 0
##$INTBC= 1
##$INTSCL= 1
##$ISEN= 128
##$LB= 0.3
##$LEV0= 0
##$LPBIN= 0
##$MAXI= 10000
##$MC2= 0
##$MEAN= 0
##$ME_mod= 0
##$MI= 0
##$NCOEF= 0
##$NC_proc= -2
##$NLEV= 6
##$NOISF1= 0
##$NOISF2= 0
##$NSP= 0
##$NTH_PI= 0
##$NZP= 0
##$OFFSET= 14.96102
##$PC= 1
##$PHC0= 3.290405
##$PHC1= 0
##$PH_mod= 1
##$PKNL= yes
##$PPARMOD= 0
##$PPDIAG= 0
##$PPIPTYP= 0
##$PPMPNUM= 2147483647
##$PPRESOL= 1
##$PSCAL= 4
##$PSIGN= 0
##$PYNMP= <proc.py>
##$REVERSE= no
##$SF= 400.020009630362
##$SI= 131072
##$SIGF1= 0
##$SIGF2= 0
##$SINO= 400
##$SIOLD= 131072
##$SPECTYP= <>
##$SREGLST= <1H.CDCl3>
##$SSB= 0
##$STSI= 131072
##$STSR= 0
##$SW_p= 8223.68421052631
##$SYMM= 0
##$S_DEV= 0
##$TDeff= 65536
##$TDoff= 0
##$TI= <>
##$TILT= no
##$TM1= 0
##$TM2= 0
##$TOPLEV= 0
##$USERP1= <user>
##$USERP2= <user>
##$USERP3= <user>
##$USERP4= <user>
##$USERP5= <user>
##$WDW= 1
##$XDIM= 131072
##$YMAX_p= 325888505
##$YMIN_p= -12436
##$CURPLOT= <Network HP LaserJet P1505>
##$CURPRIN= <$Network HP LaserJet P1505>
##$DFORMAT= <normdp>
##$LAYOUT= <+/1D_H.xwp>
##$LFORMAT= <normlp>
##$PFORMAT= <normpl>
##$SURQMSG= 1
$$ End of Bruker specific parameters
$$ ---------------------------------
##NTUPLES= NMR SPECTRUM
##VAR_NAME=  FREQUENCY,     SPECTRUM/REAL,   SPECTRUM/IMAG
##SYMBOL=    X,             R,               I
##VAR_TYPE=  INDEPENDENT,   DEPENDENT,       DEPENDENT
##VAR_FORM=  AFFN,          ASDF,            ASDF
##VAR_DIM=   131072,        131072,          131072
##UNITS=     HZ,            ARBITRARY UNITS, ARBITRARY UNITS
##FACTOR=    0.0627417313425164, 1,          1
##FIRST=     8223.62146879497, -2095,        -63676
##LAST=      0,             247,             -64288
##MIN=       0,             -12436,          0
##MAX=       8223.62146879497, 325888505,    0
$$ Real data points
##PAGE= N=1
##DATA TABLE= (X++(R..R)), XYDATA
$$ [...]
64013C95059l365k628k312k832l663m041l778l189k523j760q38K24J340K245K544
63998C70483K128J459J188J528K236L056L867M515M914N335O174P337Q200Q355
63984D30775Q152Q255Q804R321R431R374R711J0580J1532J2125J2481J3043J3936
63971E67520J4907J5827J6876J8188J9718K1485K3498K5304K6266K6616K7630
63960H03835L0215L3769L7096M0001M3237M7137N1203N5115N9294O4326P0355
63949A335583P7317Q5197R3888J03154J12887J23015J33016J41956J49154J54493
63939B509660J58031J59695J59371J56815J51387J42329J29502J13516R5060P4506
63929C849872N2213K8753M661j9629m3575o6583q8332j08461j25945j39451j48598
$$ y = [395059, 391694, 389066, 386754, 383922, 380259, 376218, 372440, 369251, 366728, 364968, 364130, 364354, 365694, 367939, 370483, 372611, 374070, 375258, 376786, 379022, 382078, 385945, 390460, 395374, 400709, 406883, 414220, 422420, 430775, 438927, 447182, 455986, 465307, 474738, 484112, 493823, 504403, 515935, 528060, 540541, 553584, 567520, 582427, 598254, 615130, 633318, 653036, 674521, 698019, 723323, 749589, 776205, 803835, 834050, 867819, 904915, 944916, 988153, 1035290, 1086493, 1141608, 1200902, 1265228, 1335583, 1412900, 1498097, 1591985, 1695139, 1808026, 1931041, 2064057, 2206013, 2355167, 2509660, 2667691, 2827386, 2986757, 3143572, 3294959, 3437288, 3566790, 3680306, 3775366, 3849872, 3902085, 3930838, 3935499, 3915870, 3872295, 3805712, 3717380, 3608919, 3482974, 3343523, 3194925]
63918C194925j54258j57413j58206j56454j52440j46724j39595j31203j21910
63909A876722j12202j02521r3350q5022p7232o9355o1556n4884m9837m5442m0521
63898A084800l5331l1140k8481k6704k5057k3386k1740k0091j8627j7704j7262
63887H19277j6678j5508j3981j2607j1495j0301q697o751m854l307j959l89J513
63874G14263L370M844O064P308Q540R580J0494J1415J2103J2188J1765J1299J0896
63861H34129J0120Q717P118N934N132M035K149k81k595m437o024p695r519j1406
63847H35377j3355j5298j6839j7639j7992j8597j9605k0397k0499k0333k0595
63836F34228k1212k1379k0614j9322j8271j7730j7253j6272j4787j3388j2572
$$ y = [3194925, 3040667, 2883254, 2725048, 2568594, 2416154, 2269430, 2129835, 1998632, 1876722, 1764520, 1661999, 1568649, 1483627, 1406395, 1337040, 1275484, 1220600, 1170763, 1125321, 1084800, 1049469, 1018329, 989848, 963144, 938087, 914701, 892961, 872870, 854243, 836539, 819277, 802599, 787091, 773110, 760503, 749008, 738707, 730010, 723259, 718405, 715098, 713139, 712750, 714263, 717633, 722477, 728541, 735849, 744389, 753969, 764463, 775878, 787981, 800169, 811934, 823233, 834129, 844249, 852966, 860084, 866018, 871150, 875185, 877334, 877053, 874458, 870021, 863997, 856302, 846783, 835377, 822022, 806724, 789885, 772246, 754254, 735657, 716052, 695655, 675156, 654823, 634228, 613016, 591637, 571023, 551701, 533430, 515700, 498447, 482175, 467388, 454000, 441428]
63825D41428j2204j1781j1082j0255r431q659q144p997p768o793n209m050m016
63812C34039m590m746m107l137k485k516l174l960m250l936l520l398l419l300
63798B83501l087k918k763k629k657k744k520j969j567j505j369r73q40j307j804
63783B52849j728j423j487j625j174m69n29j458k147j784q07j32j28n99j188j491
63767B34680j258o84k59j69j93j50j06r1o0j25m22p14n43J03O36N06j87p88o56
63748B29520L28J565K199J930J250P24L96J59K17P20J309J607J735J858J605P60
63732B47882M4K96J097J261O51L66J056K089K734L122L578L877L751L491L397
63717B78692L176K514J755J401J284P90k34j345k124k501k532k274j909j695j730
$$ y = [441428, 429224, 417443, 406361, 396106, 386675, 378016, 369872, 361875, 354107, 347314, 342105, 338055, 334039, 329449, 324703, 320596, 317459, 314974, 312458, 309284, 305324, 301074, 297138, 293618, 290220, 286801, 283501, 280414, 277496, 274733, 272104, 269447, 266703, 264183, 262214, 260647, 259142, 257773, 256800, 255960, 254653, 252849, 251121, 249698, 248211, 246586, 245412, 244943, 244414, 242956, 240809, 239025, 238218, 238086, 237958, 237359, 236171, 234680, 233422, 232738, 232479, 232310, 232117, 231967, 231861, 231770, 231710, 231585, 231163, 230449, 229906, 230009, 230645, 231151, 230964, 230176, 229520, 229848, 231413, 233612, 235542, 236792, 237516, 237912, 238071, 238288, 239008, 240317, 241924, 243659, 245517, 247122, 247882, 247926, 248222, 249319, 250580, 251231, 251597, 252653, 254742, 257476, 260598, 264176, 268053, 271804, 275295, 278692, 281868, 284382, 286137, 287538, 288822, 289612, 289378, 288033, 285909, 283408, 280876, 278602, 276693, 274998, 273268]
63702B73268j787j463n89M63J010Q28M99P08J405K002K255K375K399K093J535
63687B87001J195J212J209J013J030J518K002J847J143N45M66O77O98L26k17n76
63671C01089o29n31l69k5M83Q58R74J080J180P06n75j788j922j291j146j884k720
63654B93490l085l271l450l157k238j333q96n16J89Q15R50R40J213J418J054N16
63638B82639P12J866L353M441M747M280L559L389L954M484M316L930M264N359
63624C35293O404O936P226P560P853Q084Q509R227J0045J0930J2230J4098J5981
63611D60376J7009J6996J6764J7273J8379J8798J7545J5050J2476J0226P848N240
63599F33980K986J271n33k744m591n210m820m322m302m968o479q528j0093j0539
$$ y = [273268, 271481, 270018, 269429, 269892, 270902, 271730, 272229, 272937, 274342, 276344, 278599, 280974, 283373, 285466, 287001, 288196, 289408, 290617, 291630, 292660, 294178, 296180, 298027, 299170, 299715, 300181, 300858, 301556, 301882, 301665, 301089, 300460, 299929, 299560, 299535, 300018, 300876, 301850, 302930, 304110, 304816, 304241, 302453, 300531, 299240, 298094, 296210, 293490, 290405, 287134, 283684, 280527, 278289, 276956, 276060, 275544, 275733, 276548, 277498, 278438, 279651, 281069, 282123, 282639, 283351, 285217, 288570, 293011, 297758, 302038, 305597, 308986, 312940, 317424, 321740, 325670, 329934, 335293, 341697, 348633, 355859, 363419, 371272, 379356, 387865, 397092, 407137, 418067, 430297, 444395, 460376, 477385, 494381, 511145, 528418, 546797, 565595, 583140, 598190, 610666, 620892, 628740, 633980, 636966, 638237, 637704, 634960, 630369, 625159, 620339, 616017, 611715, 606747, 600268, 591740, 581647, 571108]
63585E71108j0610j1397j2624j2886j1646r970r006q609p906o650n447m805m458
63572D55094l722k350p57O08J863L283M522M943M754N014O155P286P504P201P331
63557E08729P993Q661R335J0466J1952J3236J4376J6005J8156K0024K1143K1892
63545F81968K2360K1553J8370J3104P351K584q79l516n655p057p447p110o684
63532G28942o453o282o342p187q816j0349j1158j1768j2932j4393j5440j6212
63520F01610j7353j8574j8810j7831j6620j5861j5098j3767j2167j0871r879q902
63508D25877p917p014o134n354m932m747m253l373k848l172l707l517k653j944
63494C64312j756j592r43NO15M86j31m99j10O92J058P95P57J733L325M341M176
$$ y = [571108, 560498, 549101, 536477, 523591, 511945, 501975, 492969, 484360, 476454, 469804, 464357, 459552, 455094, 451372, 449022, 448265, 448873, 450736, 454019, 458541, 463484, 468238, 473252, 479407, 486693, 494197, 501398, 508729, 516722, 525383, 534718, 545184, 557136, 570372, 584748, 600753, 618909, 638933, 660076, 681968, 704328, 725881, 744251, 757355, 764706, 767290, 766411, 762895, 757240, 750183, 742736, 735626, 728942, 722489, 716207, 709865, 702678, 693862, 683513, 672355, 660587, 647655, 633262, 617822, 601610, 584257, 565683, 546873, 529042, 512422, 496561, 481463, 467696, 455529, 444658, 434779, 425877, 417960, 410946, 404812, 399458, 394526, 389779, 385526, 382153, 379305, 376133, 372426, 368909, 366256, 364312, 362556, 360964, 360021, 360026, 360641, 361127, 360996, 360497, 360387, 361079, 362137, 362932, 363689, 365422, 368747, 373088, 377264]
63477C77264L316K572K190J824J121J77m67m01J05K45n10j844k983l417l168k607
63461C73417k143j951j827j472r65o46m05L57J784K982L001K168J810K704M291
63446C83105N574O256O825P804R292J1022J2609J3751J4350J4570J4805J5470
63434E15433J6611J7639J7612J6002J3165R945O988M631L196K917L597M725O149
63421F38610Q162J0781J3346J5204J6557J8040J9559K0073J8712J5750J2231Q865
63409H15890N653K356r52l878o038p287p785p829p624p311p246p990r800j2263
63395G37896j4620j6427j7632j8234j8232j7831j7294j6605j5596j4444j3563
63384E57418j2938j2049j0591q845p136n423l671k086p06P77K350L384L595L771
$$ y = [377264, 380580, 383152, 385342, 387166, 388287, 388464, 387997, 387596, 387701, 387946, 387436, 385592, 382609, 379192, 376024, 373417, 371274, 369323, 367496, 366024, 365059, 364413, 364008, 364365, 366149, 369131, 372132, 374300, 376110, 378814, 383105, 388679, 394935, 401760, 409564, 418856, 429878, 442487, 456238, 470588, 485158, 499963, 515433, 532044, 549683, 567295, 583297, 596462, 606407, 613395, 618026, 621222, 624139, 627736, 632461, 638610, 646772, 657553, 670899, 686103, 702660, 720700, 740259, 760332, 779044, 794794, 807025, 815890, 821543, 823899, 822947, 819069, 813031, 805744, 797959, 790130, 782506, 775195, 767949, 759959, 750159, 737896, 723276, 706849, 689217, 670983, 652751, 634920, 617626, 601021, 585425, 570981, 557418, 544480, 532431, 521840, 512995, 505859, 500436, 496765, 494679, 493973, 494750, 497100, 500484, 504079, 507850]
63370E07850M840O500P660Q096Q800J0530J2783J4521J5392J5883J6632J7913
63358F47400J9501K0781K1243K0956K0393J9674J8324J5878J2510Q840N363K192
63346H33055p82l587n942p393p867q004q539r456j0180j0676j1722j3782j6101
63333G19024j7445j7498j7035j6837j6884j6624j5644j3906j1675r350p297n594
63321E53235m097k873k464l495n904q765j0956j1951j1944j1389j0671r994r303
63308D49429q335p049n895n340n185m812m089l467l128k668j912j384j544k025
63294C92596k125j694j043m77k67o17j152j005r4L58n75k018k460j902j564j700
63278C74261j305j03P39M35k08j88J86J12k94l75j24o3k57k94M6P16J713K859
$$ y = [507850, 512690, 519190, 526850, 534946, 543746, 554276, 567059, 581580, 596972, 612855, 629487, 647400, 666901, 687682, 708925, 729881, 750274, 769948, 788272, 804150, 816660, 825500, 830863, 833055, 832273, 828686, 822744, 815351, 807484, 799480, 790941, 781485, 771305, 760629, 748907, 735125, 719024, 701579, 684081, 667046, 650209, 633325, 616701, 601057, 587151, 575476, 566126, 558829, 553235, 549138, 546265, 543801, 540306, 534402, 525637, 514681, 502730, 490786, 479397, 468726, 458732, 449429, 441094, 434045, 428150, 422810, 417625, 412813, 408724, 405257, 402129, 399461, 397549, 396165, 394621, 392596, 390471, 388777, 387734, 387257, 386990, 386373, 385221, 384216, 384122, 384480, 383905, 381887, 379427, 377525, 375961, 374261, 372956, 372853, 373592, 374027, 373819, 373631, 373817, 373929, 373635, 373260, 373136, 373073, 372816, 372522, 372568, 373284, 374997, 377856]
63260C77856L544L327K627K293K656L415M155M580M538M316M554N414O211O363
63246D35849O290O744P672Q545R415J0780J2480J3732J4324J4865J5701J6386
63234E72783J6616J6931J8038J9872K1720K2913K3160K2533K1473K0489J9677
63223G96205J8790J7937J7695J8286J9004J8985J8176J7175J6347J5577J4723
63212I88900J3752J2363J0019O566K514j548n581r864j4292j8199k0957k2516
63200I41157k3285k3593k3470k2825k1653k0093j8356j6679j5083j3186j0473
63189G32461p032l785j713p31K93K275M916P158Q484R359J0418J1606J2379J2485
63175G98573J2155J1661J1038J0346R831R680R732R567Q735O956M384J722l08
$$ y = [377856, 381400, 384727, 387354, 389647, 392303, 395718, 399873, 404453, 408991, 413307, 417861, 423275, 429486, 435849, 442139, 448883, 456555, 465100, 474515, 485295, 497775, 511507, 525831, 540696, 556397, 572783, 589399, 606330, 624368, 644240, 665960, 688873, 712033, 734566, 756039, 776528, 796205, 814995, 832932, 850627, 868913, 887917, 906902, 925078, 942253, 958600, 974177, 988900, 1002652, 1015015, 1025034, 1031600, 1034114, 1032566, 1026985, 1017121, 1002829, 984630, 963673, 941157, 917872, 894279, 870809, 847984, 826331, 806238, 787882, 771203, 756120, 742934, 732461, 725429, 721644, 719931, 719200, 719493, 721768, 726684, 733842, 742326, 751685, 762103, 773709, 786088, 798573, 810728, 822389, 833427, 843773, 853604, 863284, 873016, 882583, 891318, 898274, 902658, 904380, 904072]
63162I04072j845l871p042j0834j4166j6529j8102j9121j9707k0149k0707k1205
63150G30794k1288k0975k0418j9306j7293j4986j3579j3281j2950j1677r901q463
63138E46677p304n912m483l708l679l810l711l489l128k334j099P4P19Q62Q50
63123E06525J018J571K442L170L273K823K425K471K663K460J864J514J918K745
63109E38882L079K529J837K050L154M050L928L160K458J777O69o19j181n89N48
63094E65732J379J649J600J446J279J232J553K403L675M864N306M773L841L478
63080F04210M141N456O723P556Q013Q375Q871R491J0032J0365J0648J1109J1754
63067G16744J2491J3388J4568J5846J6936J7972J9491K1659K3956K5867K7588
$$ y = [904072, 902227, 898356, 891314, 880480, 866314, 849785, 831683, 812562, 792855, 772706, 751999, 730794, 709506, 688531, 668113, 648807, 631514, 616528, 602949, 589668, 576718, 565041, 555140, 546677, 539373, 533461, 528978, 525270, 521591, 517781, 514070, 510581, 507453, 505119, 504020, 504094, 504813, 505675, 506525, 507543, 509114, 511556, 514726, 517999, 520822, 523247, 525718, 528381, 530841, 532705, 534219, 536137, 538882, 541961, 544490, 546327, 548377, 551531, 555581, 559509, 562669, 565127, 566904, 567573, 566954, 565773, 565184, 565732, 567111, 568760, 570360, 571806, 573085, 574317, 575870, 578273, 581948, 586812, 592118, 596891, 600732, 604210, 608351, 613807, 620530, 628086, 636099, 644474, 653345, 662836, 672868, 683233, 693881, 704990, 716744, 729235, 742623, 757191, 773037, 789973, 807945, 827436, 849095, 873051, 898918, 926506]
63056I26506K9663L2133L4494L6471L8333M0342M2313M3985M5474M6971M8224
63045A364909M8854M9037M9312M9599M9073M7357M5281M3963M3493M3126M2381
63034A876385M1309L9860L7894L5721L3715L1167K6550J9385J1059L119m531j2975
63022B138658k2341l1473l9241m5318m9719n2462n3876n4510n4478n3379n1010
63011A630851m7659m3549l8563l2879k7286k2413j7909j2982p587k604J191L962
62999A382573O466R235J2198J4920J6902J7792J7647J7077J6878J7298J7791J7641
62987A564418J6709J5330J3699J1712R306O522L175j077o162j1547j6897k2335
62975A582853k7750l2370l5602l7911m0244m2698m4409m4719m3855m2320m0226
$$ y = [926506, 956169, 988302, 1022796, 1059267, 1097600, 1137942, 1180255, 1224240, 1269714, 1316685, 1364909, 1413763, 1462800, 1512112, 1561711, 1610784, 1658141, 1703422, 1747385, 1790878, 1834004, 1876385, 1917694, 1957554, 1995448, 2031169, 2064884, 2096051, 2122601, 2141986, 2153045, 2156164, 2151633, 2138658, 2116317, 2084844, 2045603, 2000285, 1950566, 1898104, 1844228, 1789718, 1735240, 1681861, 1630851, 1583192, 1539643, 1501080, 1468201, 1440915, 1418502, 1400593, 1387611, 1380024, 1377420, 1378611, 1382573, 1389039, 1398274, 1410472, 1425392, 1442294, 1460086, 1477733, 1494810, 1511688, 1528986, 1546777, 1564418, 1581127, 1596457, 1610156, 1621868, 1631174, 1637696, 1640871, 1639794, 1633632, 1622085, 1605188, 1582853, 1555103, 1522733, 1487131, 1449220, 1408976, 1366278, 1321869, 1277150, 1233295, 1190975, 1150749]
62964A150749l7613l5003l3046l1670l0036k7590k4924k3214k2828k2838k2134
62953H39853k0618j8991j7609j6272j5070j4562j4785j4840j4060j3007j2608
62942F67431j2683j2238j1008r789r186q878q438q090q076p891o845n167l869
62929E55273l473l458l136k561k186k004j637j181j314k256l120k937j988j532
62915E22490k206l346l975l876l453l027k724k635k733k773k587k293k023j775
62901D83064j624j728j881j541o34J18Q8m58q91j099j269j222p16j45j76p26j037
62884D68123p94n31p46j142j088m25L94Q32P71N63N28M28k42j363k019j622p39
62867D60928l16m56n93n76p60j155j272q74k44L87J041J552J580J210J002J188
$$ y = [1150749, 1113136, 1078133, 1045087, 1013417, 983381, 955791, 930867, 907653, 884825, 861987, 839853, 819235, 800244, 782635, 766363, 751293, 736731, 721946, 707106, 693046, 680039, 667431, 654748, 642510, 631502, 621713, 612527, 603649, 595211, 587121, 579045, 571154, 564309, 559142, 555273, 551800, 548342, 545206, 542645, 540459, 538455, 536818, 535637, 534323, 532067, 528947, 526010, 524022, 522490, 520284, 516938, 512963, 509087, 505634, 502607, 499883, 497248, 494515, 491742, 489155, 486862, 484839, 483064, 481440, 479712, 477831, 476290, 475656, 475774, 475862, 475404, 474513, 473414, 472145, 470923, 470207, 470062, 469886, 469160, 468123, 467329, 466798, 466052, 464910, 463822, 463397, 463791, 464623, 465394, 465957, 466485, 466913, 466671, 465308, 463289, 461667, 460928, 460612, 460156, 459563, 458987, 458227, 457072, 455800, 454926, 454682, 455069, 456110, 457662, 459242, 460452, 461454, 462642]
62851D62642J368J184P93N32M84O16Q77J009O91L5m25m19j73J64P85J680K320
62834D74163K270J815J522J464J260Q02N19Q27J569K150K234K111K253K677L043
62819E00679L319L902M939N994O659P028P231P051O467O068O321O848P105P273
62805E86884P734Q169Q179Q375R676J1742J3286J3901J4303J4787J4837J4612
62793G26485J5396J7894K1160K3915K5972K7794K9615L1727L4713L8517M2067
62782A035255M4721M7355N1140N5807O0117O3549O6489O9141P1144P2148P1907
62771A708773P0036O6365O1352N5400M7965L8120K5916J2545p78j3444k5043l5130
62759B012077m3588n0694n6731o1734o5596o8068o8921o8447o7512o6556o4937
$$ y = [462642, 464010, 465194, 465987, 466519, 467003, 467619, 468496, 469505, 470196, 470231, 469806, 469387, 469214, 469378, 470163, 471843, 474163, 476433, 478248, 479770, 481234, 482494, 483296, 483815, 484642, 486211, 488361, 490595, 492706, 494959, 497636, 500679, 503998, 507900, 512839, 518833, 525492, 532520, 539751, 546802, 553269, 559337, 565658, 572506, 579611, 586884, 594618, 602787, 610966, 619341, 629017, 640759, 654045, 667946, 682249, 697036, 711873, 726485, 741881, 759775, 780935, 804850, 830822, 858616, 888231, 919958, 954671, 993188, 1035255, 1079976, 1127331, 1178471, 1234278, 1294395, 1357944, 1424433, 1493574, 1564718, 1636866, 1708773, 1778809, 1845174, 1906526, 1961926, 2009891, 2048011, 2073927, 2086472, 2085694, 2072250, 2047207, 2012077, 1968489, 1917795, 1861064, 1799330, 1733734, 1665666, 1596745, 1528298, 1460786, 1394230, 1329293]
62748A329293o1868n7791n4012n1062m8243m4819m0867l6787l2757k9058k6288
62737H45741k4700k3645k2114j9742j7005j4549j2627j1093r754q578p592o595
62725F67747n219l392j592m30o3q8L7O35J726L103M576O202Q061R845J1027J1686
62709G13861J2670J4575J6980J9160K1140K3457K6110K8549L0598L2635L4824
62698I74559L6854L8669M0734M3232M5544M6944M7407M7198M6050M3369L9116
62687A449676L3879K7988K1130J3053M250m449j2713k0739k8492l5422m0971m5048
62675A362142m7829m9456n0124n0138m9586m8231m6084m3724m1596l9331l6376
62664H59667l3060l0290k8150k5775k2771j9964j8208j7179j5923j4165j2426
$$ y = [1329293, 1267425, 1209634, 1155622, 1104560, 1056317, 1011498, 970631, 933844, 901087, 872029, 845741, 821041, 797396, 775282, 755540, 738535, 723986, 711359, 700266, 690512, 681934, 674342, 667747, 662528, 659136, 657544, 657114, 657051, 656963, 657000, 657635, 659361, 662464, 667040, 673242, 681303, 691148, 702175, 713861, 726531, 741106, 758086, 777246, 798386, 821843, 847953, 876502, 907100, 939735, 974559, 1011413, 1050082, 1090816, 1134048, 1179592, 1226536, 1273943, 1321141, 1367191, 1410560, 1449676, 1483555, 1511543, 1532673, 1545726, 1549976, 1545527, 1532814, 1512075, 1483583, 1448161, 1407190, 1362142, 1314313, 1264857, 1214733, 1164595, 1115009, 1066778, 1020694, 976970, 935374, 896043, 859667, 826607, 796317, 768167, 742392, 719621, 699657, 681449, 664270, 648347, 634182, 621756]
62653F21756j1140j0336j0001j0175j0610j0735j0145q964p703o828o351n816
62641E12952m783l367k129j457j341j664k233k578k227j365o96n01l83j05ll18
62625D87802o93p63o27l93J17P84J033Q15J050K333L868M558M619N113O210P059
62609E22885P236P335P883Q672R362J0067J1018J2137J3298J4582J6142J8002
62597F58619K0143K2510K4858K6871K8498K9982L1567L3241L4681L5327L4701
62586I80998L2760K9739K5682K0536J4742R086L738j893q010j3876j8853k3239
62574A051410k7343l0568l2255l2857l3235l3283l2290l0397k8551k7186k5883
62563G17562k4318k2633k0892j9005j7145j5514j3836j1910j0300r620r317q260
$$ y = [621756, 610616, 600280, 590279, 580104, 569494, 558759, 548614, 539650, 531947, 525119, 518768, 512952, 508169, 504802, 502673, 501216, 499875, 498211, 495978, 493400, 491173, 489808, 489112, 488611, 488228, 488123, 488120, 487802, 487109, 486346, 485719, 485326, 485443, 486227, 487260, 488075, 489125, 491458, 495326, 499884, 504503, 509616, 515826, 522885, 530121, 537456, 545339, 554011, 563373, 573440, 584458, 596595, 609893, 624475, 640617, 658619, 678762, 701272, 726130, 753001, 781499, 811481, 843048, 876289, 910970, 946297, 980998, 1013758, 1043497, 1069179, 1089715, 1104457, 1113543, 1117281, 1115388, 1107378, 1093502, 1074649, 1051410, 1024067, 993499, 961244, 928387, 895152, 861869, 829579, 799182, 770631, 743445, 717562, 693244, 670611, 649719, 630714, 613569, 598055, 584219, 572309, 562009, 552389, 543072, 534812]
62551E34812o424m870m091l526k832k432k524k624k414k138j881j370p22m57n29
62536D95978k96K51L06k75m42O05K310L707M619N401O270P431R127J0954J2001
62521E57947J2104J2287J3338J4824J6126J7558J9638K1976K3799K5079K6322
62510G60998K7693K8957K9869L0010K8813K6360K3599K1160J8541J5115J1220
62499A022335P458L652n49m521p302q882r925j0461r982q578o892n059k728p7
62485I58489K248M263O691R641J2177J3580J4236J4841J5298J4784J2532Q370
62473A087150L012k078n687q079j0756j4793j9778k4576k8512l1486l3417l4209
62461H76791l4076l3334l1967k9758k6912k4147k2026k0375j8612j6498j4376
$$ y = [534812, 528388, 523518, 519427, 515901, 513069, 510637, 508113, 505489, 503075, 500937, 499056, 497686, 496964, 496507, 495978, 495682, 495933, 496239, 495964, 495522, 496127, 498437, 502144, 506763, 512164, 518434, 525865, 534992, 545946, 557947, 570051, 582338, 595676, 610500, 626626, 644184, 663822, 685798, 709597, 734676, 760998, 788691, 817648, 847517, 877527, 906340, 932700, 956299, 977459, 996000, 1011115, 1022335, 1029793, 1033445, 1032896, 1028375, 1021073, 1012191, 1002266, 991805, 981823, 973245, 966353, 961294, 958566, 958489, 960737, 965000, 971691, 981332, 993509, 1007089, 1021325, 1036166, 1051464, 1066248, 1078780, 1087150, 1090162, 1088084, 1082397, 1074318, 1063562, 1048769, 1028991, 1004415, 975903, 944417, 911000, 876791, 842715, 809381, 777414, 747656, 720744, 696597, 674571, 654196, 635584, 619086, 604710]
62450F04710j2605j1049r355p553o066n131m492l759k797j718p23o1J69K30M98
62435E40298R38J175J112J017Q72J75j356l302n043o309o963o821o128n672n889
62420D98104o227o015n563n690o363o599n787m381l198k560k276k054j705j225
62406D38461q59q48j052r97l86N99J500J949J920J673J503J509J643J904K216
62391D50735K225J744J333J894L446M903N374N137M959N014N076N191N566O037
62377E08634O379O805P641Q702R542J0070J0371J0278R803R617J0360J1644J2535
62364F32381J2914J3535J4886J6769J8989K1617K4393K6635K8015K8897K9737
62353H68768L0606L1342L1537L0377K7185K2312J6980J2088P669L533k13l518
$$ y = [604710, 592105, 581056, 571701, 564148, 558082, 552951, 548459, 544700, 541903, 540185, 539462, 539401, 539570, 539800, 540298, 541236, 542411, 543523, 544540, 545412, 545587, 544231, 540929, 535886, 529577, 522614, 515793, 509665, 503993, 498104, 491877, 485862, 480299, 474609, 468246, 461647, 455860, 451479, 448281, 445721, 443445, 441391, 439686, 438461, 437602, 436754, 435702, 434705, 434319, 434918, 436418, 438367, 440287, 441960, 443463, 444972, 446615, 448519, 450735, 452960, 454704, 456037, 457931, 461377, 466280, 471654, 476791, 481750, 486764, 491840, 497031, 502597, 508634, 515013, 521818, 529459, 538161, 547703, 557773, 568144, 578422, 588225, 597842, 608202, 619846, 632381, 645295, 658830, 673716, 690485, 709474, 731091, 755484, 782119, 810134, 839031, 868768, 899374, 930716, 962253, 992630, 1019815, 1042127, 1059107, 1071195, 1078864, 1082397, 1082184, 1078666]
62341A078666o598r553j2256j4724j7129j9327k0930k1869k2295k1955k0493j8490
62329H73047j7228j7054j6854j5745j4350j3704j3682j3492j3148j3322j3960
62318G10508j4145j3506j2822j2878j3375j3431j2727j1716j0870j0190r436q563
62306E66849p711o931o122n235m319l337k219j157m64j9P59J977K838K751K444
62291E40104L157M844O210O495O239O092N949N789O272P759R389J0052R771R351
62277F37473R092Q722Q252Q007P848P268O346N874O343P362Q277Q913R489J0158
62263G49424J0915J1811J3022J4671J6628J8514K0174K1990K4416K7063K8826
62252I57454K9168K8761K8363K7561K5353K1557J6913J1948O639J120m070q619
$$ y = [1078666, 1072068, 1062515, 1050259, 1035535, 1018406, 999079, 978149, 956280, 933985, 912030, 891537, 873047, 855819, 838765, 821911, 806166, 791816, 778112, 764430, 750938, 737790, 724468, 710508, 696363, 682857, 670035, 657157, 643782, 630351, 617624, 605908, 595038, 584848, 575412, 566849, 559138, 552207, 546085, 540850, 536531, 533194, 530975, 529818, 529354, 529335, 530094, 532071, 534909, 537660, 540104, 543261, 548105, 554315, 560810, 567049, 573141, 579090, 584879, 591151, 598910, 608299, 618351, 628122, 637473, 646565, 655287, 663539, 671546, 679394, 686662, 693008, 698882, 705225, 712587, 720864, 729777, 739266, 749424, 760339, 772150, 785172, 799843, 816471, 834985, 855159, 877149, 901565, 928628, 957454, 986622, 1015383, 1043746, 1071307, 1096660, 1118217, 1135130, 1147078, 1153717, 1154837, 1150767, 1142148]
62240A142148j2675j6252j9132k1557k4260k7401l0053l1184l0848k9901k8915
62229H69970k7817k6384k4616k2698k0852j9199j7633j5970j4319j3042j2148
62218F55292j1137r693q207p191o497n565m366l434l017k688k027j255r47j250
62204E88018j685j700j170l95L19R17J502K077K596L122L759M384M758M964N416
62189F16882O221O918P161P328P964Q859R290R089Q766Q502P818O536N395N118
62175G21847N399N447N214N393O392P995R988J2336J4652J6226J6964J7729J9316
62162H64898K1401K2934K3239K2377K0679J8407J5703J2546Q773M516M80k621
62150A033332m870p057r733j2698j5399j7460j8716j9148j8952j8458j7792j6827
$$ y = [1142148, 1129473, 1113221, 1094089, 1072532, 1048272, 1020871, 990818, 959634, 928786, 898885, 869970, 842153, 815769, 791153, 768455, 747603, 728404, 710771, 694801, 680482, 667440, 655292, 644155, 634462, 626255, 619064, 612567, 607002, 602636, 599202, 596185, 593497, 591470, 590215, 589268, 588018, 586333, 584633, 583463, 583068, 583387, 584304, 585806, 587883, 590479, 593601, 597360, 601744, 606502, 611466, 616882, 623103, 630021, 637182, 644510, 652474, 661333, 670623, 679712, 688478, 696980, 704798, 711334, 716729, 721847, 727246, 732693, 737907, 743300, 749692, 757687, 767675, 780011, 794663, 810889, 827853, 845582, 864898, 886299, 909233, 932472, 954849, 975528, 993935, 1009638, 1022184, 1030957, 1035473, 1035953, 1033332, 1028462, 1021405, 1011672, 998974, 983575, 966115, 947399, 928251, 909299, 890841, 873049, 856222]
62138H56222j5533j4132j2751j1227r479p790o479n483m580l806l288k852k184
62125G56638j388q76o31l0J373L211M712N459N415M527K827Q92m00p64q25j266
62109G78874k017k615l063l844n157o596p673q255q293p611o242m706l472k347
62095G06983q30R84K364K947L251L860M515M525L996L974N148O837P717P421O977
62080G70669P491Q825R846R856R367R412J0374J1702J2609J2800J2557J2374J2580
62067I10462J3135J3661J3748J3372J2904J2666J2532J2082J1079R580P638N126
62055A047985J999j430m584o997q502r306j0037j1488j3903j6586j8626k0010
62043I28515k1583k3699k5484k5870k5022k4066k3580k3030k1789k0158j8896
$$ y = [856222, 840689, 826557, 813806, 802579, 793100, 785310, 778831, 773348, 768768, 764962, 761674, 758822, 756638, 755250, 754374, 753743, 753713, 755086, 758297, 763009, 768468, 773883, 778410, 781237, 782129, 781729, 780965, 780140, 778874, 776857, 774242, 771179, 767335, 762178, 755582, 747909, 739654, 731361, 723750, 717508, 712802, 709330, 706983, 706153, 707137, 709501, 712448, 715699, 719559, 724074, 728599, 732595, 736569, 741717, 748554, 756271, 763692, 770669, 778160, 786985, 796831, 806687, 816054, 825466, 835840, 847542, 860151, 872951, 885508, 897882, 910462, 923597, 937258, 951006, 964378, 977282, 989948, 1002480, 1014562, 1025641, 1035221, 1042859, 1047985, 1049984, 1048554, 1043970, 1036973, 1028471, 1019165, 1009128, 997640, 983737, 967151, 948525, 928515, 906932, 883233, 857749, 831879, 806857, 782791, 759211, 736181, 714392, 694234, 675338]
62032F75338j8100j7024j5022j2387j0188r260r431r721r359q444p524o773o003
62019E36102n341n254n758o130n760m992m640m876n048m556l536k579k002j568
62005D74062q53J79J097J559J816K336K926K764J529Q7m57q8K12k05j014j620
61989D84330k008k587l548m629n414n691n596n478n539n582n264m587l939l591
61975D20877l352k910k333j967j933j999j989k025k211k303k005j479j212j262
61961C91897j091l27O61J267J420J432J400J326J621K682L989M428L800L199L543
61946D21247M439N083N630O799Q543R991J0644J0922J1394J2130J2816J3149J2965
61933E45752J2402J1958J2036J2392J2374J1663J0457Q950P127N108L238J752
$$ y = [675338, 657238, 640214, 625192, 612805, 602617, 593357, 583926, 574205, 564846, 556402, 548878, 542105, 536102, 530761, 525507, 519749, 513619, 507859, 502867, 498227, 493351, 488303, 483747, 480211, 477632, 475630, 474062, 473209, 473388, 474485, 476044, 477860, 480196, 483122, 485886, 487415, 487502, 487045, 486957, 487169, 486964, 485950, 484330, 482322, 479735, 476187, 471558, 466144, 460453, 454857, 449379, 443840, 438258, 432994, 428407, 424468, 420877, 417525, 414615, 412282, 410315, 408382, 406383, 404394, 402369, 400158, 397855, 395850, 394371, 393159, 391897, 390806, 390479, 391140, 392407, 393827, 395259, 396659, 397985, 399606, 402288, 406277, 410705, 414505, 417704, 421247, 425686, 430769, 436399, 443198, 451741, 461732, 472376, 483298, 494692, 506822, 519638, 532787, 545752, 558154, 570112, 582148, 594540, 606914, 618577, 629034, 637984, 645111, 650219, 653457, 655209]
61921F55209N77m13j295k200l182l973m226l986l571k916j591M69K654M398N789
61906F41743P162Q442R145Q946P983O648N283L915K224j23k951n533p162p757
61892F77965p852q046q465q757q613q255q190q494q566p853o574n482n067n263
61878E72488n730o082o011n555n075m718m151l198k398k267k319j597q3J261K002
61863E26567K815M259N779O507O533O706P478Q529R423J0200J1265J2889J4811
61850F33761J6352J7061J7244J7612J8380J9058J9091J8320J6747J4350J1404
61839H19380Q554O270M446K688O66j760m315o137o389n259l807k652j376M32K326
61824H13067L670M558N320N676N114L874K629J298j033m736q879j2105j4005j5285
$$ y = [655209, 655786, 655373, 654078, 651878, 648696, 644723, 640497, 636511, 632940, 630024, 628433, 628902, 631556, 635954, 641743, 648905, 657347, 666492, 675438, 683421, 690069, 695352, 699267, 701491, 701368, 698417, 692884, 685722, 677965, 670113, 662067, 653602, 644845, 636232, 627977, 619787, 611293, 602727, 594874, 588300, 582818, 577751, 572488, 566758, 560676, 554665, 549110, 544035, 539317, 535166, 531968, 529570, 527303, 524984, 523387, 523304, 524565, 526567, 529382, 533641, 539420, 545927, 552460, 559166, 566644, 575173, 584596, 594796, 606061, 618950, 633761, 650113, 667174, 684418, 702030, 720410, 739468, 758559, 776879, 793626, 807976, 819380, 827934, 834204, 838650, 841338, 842004, 840244, 835929, 829792, 823403, 818144, 814337, 811685, 810309, 810741, 813067, 816737, 821295, 826615, 832291, 837405, 841279, 843908, 845206, 844173, 839437, 830558, 818453, 804448, 789163]
61810G89163j6786j8518j9722j9714j8624j7160j5824j4618j3475j2495j1674
61799F10553j0858j0143r818r639q834p269o000n953o502o220m844l557l338l833
61785E13745m178m104l831l448k903k381k237k563l084l372l160k548k014j983
61771D71939k324k433j934j097m66l09n40r91j483j714j346l56Q44J700J975J865
61755D63330J741J697J440O36n80j520j549q22k12l41q84j121j029j275k042k518
61739D54951k039j204j185k137l046l097k428j532n41M94J242J413J092N15j44
61724D42354o16n33J00P78J053R96Q92Q93J074J432J635J238L84k18k66l26r48
61707D49922j848k458k753l049l325l409l496l876m353m481m191l732l176k496
$$ y = [789163, 772377, 753859, 734137, 714423, 695799, 678639, 662815, 648197, 634722, 622227, 610553, 599695, 589552, 579734, 570095, 561261, 553992, 547992, 542039, 535537, 529317, 524473, 520916, 517578, 513745, 509567, 505463, 501632, 498184, 495281, 492900, 490663, 488100, 485016, 481644, 478484, 475936, 473922, 471939, 469615, 467182, 465248, 464151, 463685, 463376, 462836, 461845, 460362, 458648, 457302, 456946, 457790, 459490, 461465, 463330, 465071, 466768, 468208, 468844, 468264, 466744, 465195, 464373, 464161, 463820, 462936, 461815, 460786, 459511, 457469, 454951, 452912, 451708, 450523, 448386, 445340, 442243, 439815, 438283, 437742, 438236, 439478, 440891, 441983, 442498, 442354, 441738, 441205, 441305, 442083, 443136, 444132, 445024, 445917, 446991, 448423, 450058, 451296, 451680, 451462, 451196, 450870, 449922, 448074, 445616, 442863, 439814, 436489, 433080, 429584, 425708, 421355, 416874, 412683, 408951, 405775, 403279]
61693D03279k015k179k903l608l821l453k655j785j339j513j915k037j829j528
61679C70699j207r40j028j542j908j538o61L8L22L19j29j204k303k473j732j102
61663C53611j103j059k85P70J157P29K48L71J004J589J725J491J248J172J042
61648C63710N66j27n74l90N15J916L165L420K447J039J71o1j44q2N62J562J871
61631C79566R17o58j890k586l045l200k692j635p93q70j805k814l104k584j811
61616C50996j228o23L42J329J557P42o10j877k793l224l030k418j975k086k603
61601C32499l178l612l711l234k249j267p03m63k25O2J32k76j162k141k592k214
61585C05666j399p97n94n64p21j290k015k161j471n75j44j57l14o66j276j685
$$ y = [403279, 401264, 399085, 396182, 392574, 388753, 385300, 382645, 380860, 379521, 378008, 376093, 374056, 372227, 370699, 369492, 368552, 367524, 365982, 364074, 362536, 361875, 361913, 362235, 362554, 362425, 361221, 358918, 356445, 354713, 353611, 352508, 351449, 351164, 351934, 353091, 353820, 354068, 354439, 355443, 357032, 358757, 360248, 361496, 362668, 363710, 364276, 364149, 363575, 363185, 363700, 365616, 368781, 372201, 374648, 375687, 375858, 375797, 375653, 375571, 376133, 377695, 379566, 380483, 379825, 377935, 375349, 372304, 369104, 366412, 364777, 363984, 363114, 361309, 358495, 355391, 352807, 350996, 349768, 349145, 349487, 350816, 352373, 353115, 352505, 350628, 347835, 344611, 341581, 339163, 337188, 335102, 332499, 329321, 325709, 321998, 318764, 316515, 315248, 314545, 314082, 313857, 313919, 314051, 313775, 312613, 310472, 307880, 305666, 304267, 303470, 302876, 302312, 301591, 300301, 298286, 296125, 294654, 294079, 293935, 293778, 293464, 292798, 291522, 289837]
61569B89837j325k79P96J376J377R69M68K64M75P60P44M81K64J59N8O2L70Q64
61551B97720J238J423J545J490J009K86j18o6j12n66p53J66J875L051K925K051
61535C13164J261N66l55j116j030l04M0l42o49k33L79L83j09m85p11j201j821
61518C07437j882j136j62L23P0o89j367j291l64O35Q51L45j44k12K1M90J168J621
61500C05714J333N35n5k94o41j125j221q70p07r29q48J9J185J948K210K106J562
61483C09922P69M06P88J308J310R15N05m9r00j501j145M8J290J982J895R69l84
61466C18128j127n98N18R48M49n9P5M69N30L31L01M93N56K82o3LO21J280J255
61447C24392M47m28o23j83K91M42M45O40J148J775K174K128J746J282Q37M78N51
$$ y = [289837, 288512, 288233, 289029, 290405, 291782, 292751, 293219, 293483, 293958, 294718, 295462, 295943, 296207, 296366, 296424, 296486, 296856, 297720, 298958, 300381, 301926, 303416, 304425, 304711, 304593, 304527, 304415, 303849, 303096, 303262, 305137, 308188, 311113, 313164, 314425, 314991, 314636, 313520, 312490, 312186, 312226, 311884, 311235, 311002, 311381, 311764, 311655, 311170, 310459, 309258, 307437, 305555, 304419, 304257, 304580, 304650, 303961, 302594, 301303, 300939, 301574, 302425, 302770, 302626, 302414, 302435, 302925, 304093, 305714, 307047, 307582, 307527, 307233, 306592, 305467, 304246, 303376, 302669, 301740, 300892, 300911, 302096, 304044, 306254, 308360, 309922, 310691, 311097, 311885, 313193, 314503, 315418, 315923, 315874, 314974, 313473, 312328, 312376, 313666, 315648, 317543, 318512, 318128, 317001, 316403, 316921, 317869, 318318, 318259, 318334, 318803, 319333, 319664, 319965, 320458, 321014, 321296, 321233, 321236, 321857, 323137, 324392, 324839, 324411, 323788, 323605, 323896, 324338, 324783, 325423, 326571, 328346, 330520, 332648, 334394, 335676, 336513, 336991, 337542]
61430C37542J354K431K755J935O67j59l57j33M41J160J449J055N38N23P87P58
61414C52746N27O91J338J913J954J450N98l00p89o66l84m80q14p70k06M15P10
61397C57933P19N41J89k05m13m40m54m89n13o10q05p96l11M59J117J501J502Q48
61379C59773l27j104o98M05J010Q29O98J204J983K531K887L197L214K713J980
61364C80295J578J818K546L186L076K154J284J324K055K576K692L040L895M716
61350D16235N162N607O195O255N307L961L087K556J650L94k71K92J605K559K364
61335D62958J130k46p77k97M09N42J49j59j78l30r67j825k275j923r31J51Q61
61318D56292J159J352J703K218K790L361L924M533N288O175O911P229P330P727
$$ y = [337542, 338896, 341327, 344082, 346017, 346684, 346525, 346168, 346035, 346476, 347636, 349085, 350140, 350678, 351201, 351988, 352746, 353273, 353964, 355302, 357215, 359169, 360619, 361217, 360917, 360128, 359462, 359078, 358598, 357784, 357014, 356808, 357223, 357933, 358652, 359193, 359382, 359177, 358764, 358324, 357870, 357381, 356868, 356258, 355453, 354657, 354346, 354805, 355922, 357423, 358925, 359773, 359446, 358342, 357644, 358049, 359059, 359888, 360586, 361790, 363773, 366304, 369191, 372388, 375602, 378315, 380295, 381873, 383691, 386237, 389423, 392499, 394653, 395937, 397261, 399316, 401892, 404584, 407624, 411519, 416235, 421397, 427004, 433199, 439454, 444761, 448722, 451809, 454365, 456015, 456409, 456138, 456430, 458035, 460594, 462958, 464088, 463842, 463065, 462768, 463177, 463719, 463868, 463709, 463531, 463201, 462234, 460409, 458134, 456211, 455280, 455431, 456292, 457451, 458803, 460506, 462724, 465514, 468875, 472799, 477332, 482620, 488795, 495706, 502935, 510265, 517992]
61304E17992Q482Q990Q653P583O347N262M206L031J875R67K79m85j483k354k538
61289E66807k133k074l092m709n777n858n435m839l792k285j123r71j379j365
61275E21975p11q9j3k20n1Q76K354L674M100L554K688K167K073K245K743L569
61259E50934M224M207L818L779M120M055L145J954J260J074Q41L04k34m38m16
61244E82627o52j496k680l367k976j915j140r90r08n18k72o28j095q48J0N78N21
61227E64251M62R24J660K324L063L908M298L880L359L715M785N444N213M874N249
61212F17409O098O525O062M980L910L417L659M148M231L978M270N606P265Q008
61198F89566P526O741O783P985R764J1145J1424J0598R260P956O779N613M466
$$ y = [517992, 526474, 535464, 544117, 551700, 558047, 563309, 567515, 570546, 572421, 573388, 573667, 573182, 571699, 569345, 566807, 564674, 562600, 559508, 554799, 549022, 543164, 537729, 532890, 529098, 526813, 525690, 524719, 523340, 521975, 521264, 521175, 521162, 520942, 520891, 521767, 524121, 527795, 531895, 535449, 538137, 540304, 542377, 544622, 547365, 550934, 555158, 559365, 563183, 566962, 571082, 575137, 578282, 580236, 581496, 582570, 583411, 583715, 583481, 583043, 582627, 581975, 580479, 577799, 574432, 571456, 569541, 568401, 567411, 566503, 565985, 565713, 565085, 563990, 563142, 563152, 563730, 564251, 564713, 565637, 567297, 569621, 572684, 576592, 580890, 584770, 588129, 591844, 596629, 602073, 607286, 612160, 617409, 623507, 630032, 636094, 641074, 644984, 648401, 652060, 656208, 660439, 664417, 668687, 674293, 681558, 689566, 697092, 703833, 710616, 718601, 728365, 739510, 750934, 761532, 770792, 778748, 785527, 791140, 795606]
61185G95606L374K174O72j018k557l680m327m655n001n574o078n998n432n155
61171G52351n630o400o870p112p447p736p737p759q165q581q415p916p796p940
61157F46847p455o135m802m051l478k509j258j51O09Q29K86p18j391j505j761
61142F13357k644l535l564k875k298k164k094j691q05O42K430L760L933L394L475
61127F09321M938P144Q881R629R905J0494J1572J2643J3291J3826J4838J6232
61115G42714J7191J7370J7451J8111J8892J8771J7654J6516J6111J6078J5561
61104I32420J4139J2048R797P767N955M011J746m50j937k685l417m822o806q645
61090I59121r685r781r241q470p649o761n854n076m356l367k014p44P3P68J940
$$ y = [795606, 798980, 801154, 801826, 800808, 798251, 794571, 790244, 785589, 780588, 775014, 768936, 762938, 757506, 752351, 746721, 740321, 733451, 726339, 718892, 711156, 703419, 695660, 687495, 678914, 670499, 662583, 654787, 646847, 639392, 633257, 628455, 624404, 620926, 618417, 617159, 617008, 617617, 618446, 618732, 618014, 616623, 615118, 613357, 610713, 607178, 603614, 600739, 598441, 596277, 594183, 592492, 591687, 592329, 594759, 598519, 602452, 605846, 609321, 614259, 621403, 630284, 639913, 649818, 660312, 671884, 684527, 697818, 711644, 726482, 742714, 759905, 777275, 794726, 812837, 831729, 850500, 868154, 884670, 900781, 916859, 932420, 946559, 958607, 968404, 976171, 982126, 986137, 987883, 987433, 985496, 982811, 979394, 974572, 967766, 959121, 949436, 939655, 930414, 921944, 914295, 907534, 901680, 896604, 892248, 888881, 886867, 886123, 886196, 886964, 888904]
61075H88904L528M881N775O670P912R247J0445J1796J3548J5242J6171J6331J6472
61062A026922J7239J8576J9959K0912K1343K1532K1861K2494K3345K4361K5588
61051A264132K6933K8150K9210L0385L1800L3119L3947L4279L4388L4569L5149
61040A616061L6349L7814L8769L9119L9854M1755M4085M5518M6058M7020M9149
61029B081551N1748N3935N5757N7705O0038O3078O7403P3066P9307Q5573R2292
61018B821453J00110J08984J18586J29101J41148J55554J73739J97430K27422
61009D173527K63477L06106L57214M18239M89207N70479O62700P62629Q62178
61000H865756R55499J042087J111913J126622J031686Q05388M97399K06880J4397
$$ y = [888904, 892432, 897313, 903088, 909758, 917670, 926917, 937362, 949158, 962706, 977948, 994119, 1010450, 1026922, 1044161, 1062737, 1082696, 1103608, 1124951, 1146483, 1168344, 1190838, 1214183, 1238544, 1264132, 1291065, 1319215, 1348425, 1378810, 1410610, 1443729, 1477676, 1511955, 1546343, 1580912, 1616061, 1652410, 1690224, 1728993, 1768112, 1807966, 1849721, 1893806, 1939324, 1985382, 2032402, 2081551, 2133299, 2187234, 2242991, 2300696, 2360734, 2423812, 2491215, 2564281, 2643588, 2729161, 2821453, 2921563, 3030547, 3149133, 3278234, 3419382, 3574936, 3748675, 3946105, 4173527, 4437004, 4743110, 5100324, 5518563, 6007770, 6578249, 7240949, 8003578, 8865756, 9821255, 10863342, 11975255, 13101877, 14133563, 14938951, 15436350, 15643230, 15657627]
60991A5657627o3820n9316p783O2856J09572O7904j08405l99253p19327r73374
60981A3566681j112455j144234j103727j023489r25065q22884p26227o38681n60247
60972E509672m90680m29835l76240l27852k84162k46167k14361j87940j65863
60963B786572j47514j32385j19910j09573j00542r1600q2231p3415o6414o1037
60953A801951n6107n1347m7599m5270m3695m2203m0700l9047l6808l4038l1438
60942A333699k9482k8055k7121k6872k6936k6369k4890k3418k2847k2883k2645
60931A052181k1910k1180k0828k0676k0254j9229j7639j5909j4496j3465j2645
60920H53950j2011j1600j1181j0498r733r246q958q493p911p604p518p141o323
$$ y = [15657627, 15593807, 15534491, 15526708, 15589564, 15699136, 15767040, 15658635, 15259382, 14540055, 13566681, 12454226, 11309992, 10206265, 9182776, 8257711, 7434827, 6708600, 6069919, 5509672, 5018992, 4589157, 4212917, 3885065, 3600903, 3354736, 3140375, 2952435, 2786572, 2639058, 2506673, 2386763, 2277190, 2176648, 2085048, 2002817, 1929402, 1862988, 1801951, 1745844, 1694497, 1646898, 1601628, 1557933, 1515730, 1475030, 1435983, 1399175, 1365137, 1333699, 1304217, 1276162, 1249041, 1222169, 1195233, 1168864, 1143974, 1120556, 1097709, 1074826, 1052181, 1030271, 1009091, 988263, 967587, 947333, 928104, 910465, 894556, 880060, 866595, 853950, 841939, 830339, 819158, 808660, 798927, 789681, 780723, 772230, 764319, 756715, 749197, 742056, 735733]
60907G35733n483m904m468m092l893l843l825m004m512m860m525l996m307n479
60893F73542o450o722o936p477p701p140o458o461o946p236p190p056o899o786
60879E76084o924p100o645n504m600m509m558l965l157l012l458l685l374k781
60865E12812j955p68M73J250J512J542J314O63j82p83j049j031n53M24J351J663
60849E16683J478J170N35p80k333l176l035k518k193k104k197k613l420m388n120
60834D85989n247m747m177m242m786m832l950l027l058l791m237m084l687l185
60820D28939k483j866j749j997k201k408k769k957k736k761l641m574m182k660
60806C89955j697k146l040l308l152l141l010k283j277o57n22n38n73n87l44J97
$$ y = [735733, 730250, 725346, 720878, 716786, 712893, 709050, 705225, 701221, 696709, 691849, 687324, 683328, 679021, 673542, 667092, 660370, 653434, 645957, 638256, 631116, 624658, 618197, 611251, 604015, 596825, 589769, 582870, 576084, 569160, 562060, 555415, 549911, 545311, 540802, 536244, 532279, 529122, 526110, 522652, 518967, 515593, 512812, 510857, 510089, 510562, 511812, 513324, 514866, 516180, 516843, 516661, 515878, 514829, 513798, 513245, 513669, 515020, 516683, 518161, 519331, 519866, 519086, 516753, 513577, 510542, 508024, 505831, 503727, 501530, 498917, 495497, 491109, 485989, 480742, 475995, 471818, 467576, 462790, 457958, 454008, 450981, 447923, 444132, 439895, 435811, 432124, 428939, 426456, 424590, 422841, 420844, 418643, 416235, 413466, 410509, 407773, 405012, 401371, 396797, 392615, 389955, 388258, 386112, 383072, 379764, 376612, 373471, 370461, 368178, 366901, 366244, 365722, 365184, 364611, 364024, 363680, 363877]
60790C63877N97N68N46J061J842K133J698R69L54q1l26l38l00m73p16n44J75R37
60772C71979J194R75O46L33m4l06j08M31P34N98N11P28N87n01j809k016j133n95
60754C72204j234k209k469k203k110k042j444n50n9O7M87J289J743J297J08j386
60738C61489k713l319k976k266k006k174k048j403q57q94j253j397j113m57L25
60723C36938P58N42P0L0M35O07K57n5J89O91Q27N55L82O13R21P49K8n84l39O58
60703C44272J541J808J904K311K594K024P70k61o65q63j247j674j841j577p66
60688C48330M61J513J889J832J844J714Q54n12j379j319q47l27N43J758K426J891
60672C60671P88K86O19J006P10l01j616k754l293l037k193j265o89n14m97m78
$$ y = [363877, 364474, 365042, 365588, 366649, 368491, 370624, 372322, 373291, 373645, 373564, 373238, 372900, 372600, 372127, 371411, 370867, 371042, 371979, 373173, 374148, 374794, 375127, 375083, 374777, 374669, 375100, 375834, 376432, 376943, 377671, 378258, 377757, 375948, 373932, 372799, 372204, 370970, 368761, 366292, 364089, 361979, 359937, 358493, 357943, 357884, 357951, 358438, 359727, 361470, 362767, 362875, 361489, 358776, 355457, 352481, 350215, 348209, 346035, 343987, 342584, 341727, 340833, 339580, 338183, 337070, 336613, 336938, 337696, 338238, 338308, 338338, 338773, 339380, 339637, 339582, 339771, 340462, 341289, 341844, 342226, 342839, 343760, 344509, 344537, 343953, 343614, 344272, 345813, 347621, 349525, 351836, 354430, 356454, 357224, 356963, 356298, 355435, 354188, 352514, 350673, 349096, 348330, 348791, 350304, 352193, 354025, 355869, 357583, 358437, 357925, 356546, 355227, 354380, 354053, 354596, 356354, 358780, 360671, 361459, 361745, 362364, 363370, 364080, 363779, 362163, 359409, 356116, 353079, 350886, 349621, 348932, 348418, 347921, 347443]
60656C47443o43j090j285m57J263K667K888K387K029J781J173N08M96R42Q74N9
60640C61035o77p99p05q27r39p82o18p66j157j571j845j692r63j71o1n39p09j52
60622C46062N67Q74Q73Q13O80N76P96J166J067L92j57j39N7M2R8N21R32Q58M65
60603C56543K39L19N26P20P91P12P20J039J368J242R08J053J613J792J416J203
60587C72204J363J118J56n36j14Q06J205J160J345J687J673J460J710K498L308
60572C91043L918M592N479O436P313P934Q119Q021Q096Q358Q203P337O266N364
60558D86479M118K076j96j790k637l149l247k668j823j412j389j073r6J489L656
60543D78338O107P886Q313Q102Q624J0108J1505J2173J2658J3568J4531J4703
$$ y = [347443, 346800, 345710, 344425, 343968, 345231, 347898, 350786, 353173, 355202, 356983, 358156, 358664, 359160, 360102, 360976, 361035, 360358, 359559, 358854, 358027, 357088, 356306, 355688, 354922, 353765, 352194, 350349, 348657, 347694, 347523, 347462, 346923, 346214, 346062, 346629, 347503, 348376, 349189, 349869, 350445, 351241, 352407, 353474, 353866, 353709, 353570, 353627, 353669, 353767, 354288, 355220, 356078, 356543, 356782, 357101, 357627, 358347, 359138, 359850, 360570, 361609, 362977, 364219, 365127, 366180, 367793, 369585, 371001, 372204, 373567, 374685, 374841, 374305, 374191, 374997, 376202, 377362, 378707, 380394, 382067, 383527, 385237, 387735, 391043, 394961, 399553, 405032, 411468, 418781, 426715, 434834, 442855, 450951, 459309, 467512, 474849, 481115, 486479, 490597, 492673, 492477, 490687, 488050, 484901, 481654, 478986, 477163, 475751, 474362, 473289, 473193, 474682, 478338, 484445, 492331, 500644, 508746, 517370, 527478, 538983, 551156, 563814, 577382, 591913, 606616]
60531F06616J3728J1822R299O459L727J536Rj221k677m383n628n817n448n572
60517F22450o172n982m334k275j116o74R9J388K554L475M717O414Q059R383J0652
60502F48638J2048J3512J5175J7232J9489K1716K4265K7456L0491L1989L1651
60491H93662L0367K8569K5644K1369J6768J2800Q968M080k073q520j4375j9616
60479I97643k4578k9241l3093l5498l6188l5522l4208l2664l0849k8674k6373
60468F50755k4229k2193j9992j7615j5420j3707j2387j1212j0194r465q798p686
60456D77857o177n095m967n090m436l180k468k676k935k618k250k442k875k974
60442D27674k825k728k530k110j923k276k666k606k439k526k318j245nK74j95
$$ y = [606616, 620344, 632166, 641465, 647924, 651651, 653187, 653196, 651975, 649298, 644915, 639287, 633470, 628022, 622450, 616278, 610296, 605962, 603687, 602571, 601897, 601996, 603384, 605938, 609413, 614130, 620544, 628603, 637986, 648638, 660686, 674198, 689373, 706605, 726094, 747810, 772075, 799531, 830022, 862011, 893662, 924029, 952598, 978242, 999611, 1016379, 1029179, 1038147, 1042227, 1040154, 1031634, 1017259, 997643, 973065, 943824, 910731, 875233, 839045, 803523, 769315, 736651, 705802, 677128, 650755, 626526, 604333, 584341, 566726, 551306, 537599, 525212, 514000, 503806, 494341, 485543, 477857, 471680, 466585, 461618, 456528, 452092, 448912, 446444, 443768, 440833, 438215, 435965, 433523, 430648, 427674, 424849, 422121, 419591, 417481, 415558, 413282, 410616, 408010, 405571, 403045, 400727, 399482, 399477, 399751, 399556]
60427C99556k30M35Q36M49p6p6K60N13O54P18N41J53o5J42O74J382K087K433K200
60408D12586J694J251N92o11j738j748o93K23K31j64j24N86J778L163M196M323
60392D25545L679K987K571K138J627J527K009K518K550K269J998J704J352J209
60378D55683J382J584J677J978K650L239L206K610J920J477J406J665J949J847
60364D84273J386J138J548K355K863K619J833J322J946L727N606O435O183N723
60350E28957N565N398M772L635K155O58l19n31o56j682l530m990n255m761m277
60335E25139l926l485l027k678k267j702j313j416j846k270k602k836k780k338
60321D90653j775j445j389j353r77N2J660L184L947M109M511N544O701P442P909
$$ y = [399556, 399326, 399761, 400597, 401046, 400970, 400894, 401154, 401667, 402321, 403039, 403580, 403733, 403668, 403810, 404484, 405866, 407953, 410386, 412586, 414280, 415531, 416123, 415512, 413774, 412026, 411333, 411556, 411787, 411623, 411499, 412085, 413863, 417026, 421222, 425545, 429224, 432211, 434782, 436920, 438547, 440074, 442083, 444601, 447151, 449420, 451418, 453122, 454474, 455683, 457065, 458649, 460326, 462304, 464954, 468193, 471399, 474009, 475929, 477406, 478812, 480477, 482426, 484273, 485659, 486797, 488345, 490700, 493563, 496182, 498015, 499337, 501283, 505010, 510616, 517051, 523234, 528957, 534522, 539920, 544692, 548327, 550482, 551140, 550821, 550290, 549634, 547952, 544422, 539432, 534177, 529416, 525139, 521213, 517728, 514701, 512023, 509756, 508054, 506741, 505325, 503479, 501209, 498607, 495771, 492991, 490653, 488878, 487433, 486044, 484691, 483714, 483766, 485426, 488610, 492557, 496666, 501177, 506721, 513422, 520864, 528773]
60306E28773Q495R104R241Q606P370O055N161M639L772J939n28k744m427o065
60292E79391p914r531j0485j0857j0785j0087q732p160n841m924m458m516m825
60279D79276m767m028k946k034j502j248j034o25k00m20j542k691k784k022j513
60264D49920j528j298o15l67r52j430r56j16P2l03l45L16J312K140K436K027J290
60247D51603R78J237J320P98K37J84J90l34r55q27k9N90O15L13j02n96r16o63
60229D53643K12J420K679L622L802L213K471K018J564Q60M55J001K203L185L581
60214D85929L624L528L488L905M860N641N512M764M210M049L994M208N051O029
60200E48792O032M814L353K598K516K556K339J718P38k08o82p58r32j415k012
$$ y = [528773, 537268, 546372, 555613, 564219, 571589, 577644, 582805, 587444, 591216, 593155, 592627, 589883, 585456, 579391, 571477, 561946, 551461, 540604, 529819, 519732, 511000, 503840, 497999, 493075, 488617, 484101, 479276, 474509, 470481, 467535, 465501, 463999, 462751, 461717, 461092, 460892, 460472, 458930, 456239, 453455, 451433, 449920, 448392, 447094, 446479, 446112, 445160, 443730, 442774, 442658, 442730, 442427, 442082, 442398, 443710, 445850, 448286, 450313, 451603, 452581, 453818, 455138, 455936, 456173, 456357, 456547, 456213, 455258, 454431, 454402, 454992, 455607, 455920, 455818, 455222, 454306, 453643, 453855, 455275, 457954, 461576, 465378, 468591, 471062, 473080, 474644, 475504, 475959, 476960, 479163, 482348, 485929, 489553, 493081, 496569, 500474, 505334, 510975, 516487, 521251, 525461, 529510, 533504, 537712, 542763, 548792, 554824, 559638, 562991, 565589, 568105, 570661, 573000, 574718, 575456, 575248, 574566, 573808, 572876, 571461, 569449]
60185E69449k627l282l665l329k497k004k218k578k442j932j570j532j590j578
60171E36605j553j625j765j776j470r43n63m92m25n5L67L95N2l26p18j267j609
60154E22832j100J43J160J395J348J568J679J041l9n18P7J145J911K189K132J779
60138E38742J289J239K118L597M707M915M616M402M224L629K577J584J110J175
60124E79924J579K071K317J992J159K64k50k31K51R36J352J151N08p4m11p45j191
60107E90602j518j519j260q66n08n45j222k139k608k580k587k699k243j002J35
60092E67441K53m28j043j264j366j443j216n07M87J350J618J068J09m88m32k19
60076E63920l80r01j594k493l556m440m980n394n748n739n339m975m723m066k972
$$ y = [569449, 566822, 563540, 559875, 556546, 554049, 552045, 549827, 547249, 544807, 542875, 541305, 539773, 538183, 536605, 535052, 533427, 531662, 529886, 528416, 527473, 526910, 526418, 525993, 525938, 526305, 526700, 526752, 526426, 525708, 524441, 522832, 521732, 521875, 523035, 524430, 525778, 527346, 529025, 530066, 530027, 529509, 529586, 530731, 532642, 534831, 536963, 538742, 540031, 541270, 543388, 546985, 551692, 556607, 561223, 565625, 569849, 573478, 576055, 577639, 578749, 579924, 581503, 583574, 585891, 587883, 589042, 589306, 589056, 588825, 589076, 590012, 591364, 592515, 593023, 592949, 592538, 591793, 590602, 589084, 587565, 586305, 585439, 584931, 584386, 583164, 581025, 578417, 575837, 573250, 570551, 568308, 567306, 567441, 567694, 567266, 566223, 564959, 563593, 562150, 560934, 560427, 560914, 562264, 563882, 564950, 565059, 564571, 564139, 563920, 563540, 562639, 561045, 558552, 554996, 550556, 545576, 540182, 534434, 528695, 523356, 518381, 513658, 509592, 506620]
60061E06620k362k773l375l125k271j719j570j381j290j673j980j307J5O74L13
60046D82796N9Q01K051K904L233L358L244K673J789J082R10J206J490J244M90
60031E09330j52l24n74j563k966l754l568l009k721k857l463m559n696o111n614
60016D62399m763m055l480l021k988l507m109m129l310j964q18n69j190j730j314
60001D21452k83K03l43j196j440r17q5N42O66M63O21J633K956L414K599J368P80
59984D32433J025J541J700J196J79p89j229j294j488j842j843j278o14l43l67
59969D26987k62J94Q91J470J475P69j37m92j13N81J231J830K304K258J419N7j099
59952D39363j254j66J335J772N73j086j564p08K26L82O3k71p26j323j573j200
$$ y = [506620, 504258, 501485, 498110, 494985, 492714, 490995, 489425, 488044, 486754, 485081, 483101, 481794, 481809, 482483, 482796, 482855, 483656, 485707, 488611, 491844, 495202, 498446, 501119, 502908, 503990, 504900, 506106, 507596, 508840, 509330, 509178, 508854, 508280, 506717, 503751, 499997, 496429, 493420, 490699, 487842, 484379, 479820, 474124, 468013, 462399, 457636, 453581, 450101, 447080, 444092, 440585, 436476, 432347, 429037, 427073, 426255, 425686, 424496, 422766, 421452, 421169, 421372, 421029, 419833, 418393, 417476, 417391, 417933, 418599, 419062, 419683, 421316, 424272, 427686, 430285, 431653, 432433, 433458, 434999, 436699, 437895, 438074, 437285, 436056, 434762, 433274, 431432, 429589, 428311, 427697, 427354, 426987, 426725, 426919, 427810, 429280, 430755, 431524, 431387, 430895, 430782, 431363, 432594, 434424, 436728, 438986, 440405, 440462, 439363, 438109, 437943, 439278, 441050, 441623, 440537, 438973, 438265, 438491, 438873, 438936, 438665, 437939, 436616, 435043, 433843]
59936D33843o65m72m51j58M78J212J830K127J948J514J312J456J607J652J880
59921D49113K289K364J895J417J367J339P74k0j72N45J440J781J569J354J549
59906D68604J975K092J669J164J221J849K387K291J614P84K84M98J391K307K590
59891D92720K523L020M261N281N257M559M035L741L109K116J617K350L998N424
59877E44011N737N080M330M047L865L139J904Q46L35N5m25j136j822k149j751
59862E66066n77O70J002K63o90j111j173j325j389q42L55J716K845L636L958L582
59846E76986K511J078l53j607k524k754j946l11J256J889J567Q90J25r93k331
59831E73483l020k593j828j752k200k249j686j135q83o49n36j125k391l416l617
$$ y = [433843, 433178, 432706, 432255, 432097, 432575, 433787, 435617, 437744, 439692, 441206, 442518, 443974, 445581, 447233, 449113, 451402, 453766, 455661, 457078, 458445, 459784, 460558, 460538, 460366, 460911, 462351, 464132, 465701, 467055, 468604, 470579, 472671, 474340, 475504, 476725, 478574, 480961, 483252, 484866, 485650, 485934, 486432, 487823, 490130, 492720, 495243, 498263, 502524, 507805, 513062, 517621, 521656, 525397, 528506, 530622, 532239, 534589, 538587, 544011, 549748, 554828, 559158, 563205, 567070, 570209, 572113, 572959, 573294, 573349, 572924, 571788, 569966, 567817, 566066, 565489, 566159, 567161, 567424, 566734, 565623, 564450, 563125, 561736, 560894, 561249, 562965, 565810, 569446, 573404, 576986, 579497, 580575, 580222, 578615, 576091, 573337, 571391, 571080, 572336, 574225, 575792, 576682, 576807, 575814, 573483, 570463, 567870, 566042, 564290, 562090, 559841, 558155, 557020, 556137, 555488, 554952, 553827, 551436, 548020, 544403]
59816E44403l431l420l439l160k767k600k603k601k715l031l287l182k785k323
59802E03059j881j538j430j529j634j657j575j181m30M0m82j576j966j299o93
59787D84228j031j602j183J22R97O72k55o41J8J258K180K264J786J344J158J086
59771D92401J190J618K001J754J101J031J884K783K933K735K960L466L507K985
59757E24349K573K757L311L721L754L585L582L909M277M296M047L962M102M071
59743E76296L648L030K362J658J257J717K921L981M232L762K777J330o9m74K59
59728F08687J042R84N51O83J387J972K056J653P17n49j398j377j123j558k558
59713F11169l156k839j936q73J89R67J014K89o53j188j151q58p64j019j299j280
$$ y = [544403, 540972, 537552, 534113, 530953, 528186, 525586, 522983, 520382, 517667, 514636, 511349, 508167, 505382, 503059, 501178, 499640, 498210, 496681, 495047, 493390, 491815, 490634, 490204, 490244, 489762, 488186, 486220, 484921, 484228, 483197, 481595, 480412, 480534, 481531, 482203, 481948, 481307, 481325, 482583, 484763, 487027, 488813, 490157, 491315, 492401, 493591, 495209, 497210, 498964, 500065, 501096, 502980, 505763, 508696, 511431, 514391, 517857, 521364, 524349, 526922, 529679, 532990, 536711, 540465, 544050, 547632, 551541, 555818, 560114, 564161, 568123, 572225, 576296, 579944, 582974, 585336, 586994, 588251, 589968, 592889, 596870, 601102, 604864, 607641, 608971, 608902, 608428, 608687, 609729, 610713, 611264, 611947, 613334, 615306, 617362, 619015, 619732, 619183, 617785, 616408, 615285, 613727, 611169, 608013, 605174, 603238, 602365, 602554, 603521, 604535, 604824, 604171, 602983, 601832, 600974, 600210, 599191, 597892, 596612]
59697E96612j117j108j005m04K05k83j901l167k919j805j177j325j628j867k322
59682E74789k842k856k259j566j227j282j618k075k427k614k805l016l070l167
59668E41965l830m822m943l609j941j403j886k172j767j194p27n6P86J256J247
59653E16904J265J502J484R61M19M01P87J014O84k30j413k378k818k789k482j950
59637E11361j349j096j373j766j781j523j339j134o63k72o27j742k788l039k559
59622D88310j946j728k013k482k702k579k389k278k089j774j543j336o87M92J481
59607D64737J556R00K65J44N95J412K070J978J270P52P17N12j65m51L87J604J983
59590D80266J575J393J727J932J628J059M13k97p72p47o25r68j525j596j166q45
$$ y = [596612, 595495, 594387, 593382, 592978, 593183, 592900, 590999, 587832, 584913, 583108, 581931, 580606, 578978, 577111, 574789, 571947, 569091, 566832, 565266, 564039, 562757, 561139, 559064, 556637, 554023, 551218, 548202, 545132, 541965, 538135, 533313, 528370, 524761, 522820, 521417, 519531, 517359, 515592, 514398, 513671, 513615, 514401, 515657, 516904, 518169, 519671, 521155, 522116, 522535, 522936, 523723, 524737, 525421, 525191, 523778, 521400, 518582, 515793, 513311, 511361, 510012, 508916, 507543, 505777, 503996, 502473, 501134, 500000, 499337, 499065, 498438, 496696, 493908, 490869, 488310, 486364, 484636, 482623, 480141, 477439, 474860, 472471, 470193, 468104, 466330, 464787, 463451, 462764, 463256, 464737, 466293, 467193, 467458, 467602, 468197, 469609, 471679, 473657, 474927, 475679, 476396, 476908, 476743, 476292, 476679, 478283, 480266, 481841, 483234, 484961, 486893, 488521, 489580, 489993, 489696, 488924, 488177, 487552, 486584, 485059, 483463, 482297, 481452]
59574D81452q40r28j165j702k033j515n22l5j45M6R13J749J859J281L22p31j317
59557D76689r69j66P1m09o85k12N27R68J229J511J649J665K066L109M378N468
59541D96889O484P581Q575R425J0534J2075J3316J2993J0228N218n87n018o575
59528E81138n558l615k140j459j247j132q88o37q65j728k515k468j912j793k248
59513E50933k564k542k820l685m551m921n025n083m780l929l075k882l382m056
59499D97638m290l656k354j347j374j766j127O28J917J631N36k2P7J61K26Q29
59483D87707J794K132J454O91R82K228L158K821J691J089J586K444K741K598K721
59468E17837L127L108K444J822J876K367K680K616K377K069J674J347J436K167
$$ y = [481452, 480612, 479684, 478519, 476817, 474784, 473269, 472747, 472712, 472567, 472613, 473526, 475275, 477134, 478415, 478737, 478006, 476689, 475720, 475554, 475625, 475216, 474531, 474319, 474846, 475814, 477043, 478554, 480203, 481868, 483934, 487043, 491421, 496889, 503373, 510954, 519529, 528954, 539488, 551563, 564879, 577872, 588100, 593318, 592731, 587713, 581138, 575580, 571965, 569825, 568366, 567119, 565987, 565099, 564462, 563597, 561869, 559354, 556886, 554974, 553181, 550933, 548369, 545827, 543007, 539322, 534771, 529850, 524825, 519742, 514962, 511033, 507958, 505076, 501694, 497638, 493348, 489692, 487338, 485991, 484617, 482851, 481724, 482352, 484269, 485900, 486436, 486414, 486491, 486652, 486878, 487707, 489501, 491633, 493087, 493778, 494760, 496988, 500146, 502967, 504658, 505747, 507333, 509777, 512518, 515116, 517837, 520964, 524072, 526516, 528338, 530214, 532581, 535261, 537877, 540254, 542323, 543997, 545344, 546780, 548947]
59454E48947L331M344M725M540M232M005L696L281L036K983K650J751N65o10j855
59439E89621l003l371k698j763j351j189p01j46p1j53L41J310K055K523L261M389
59423E89054N576O806Q216R444J0101J0664J1942J3848J5655J7132J8419J9189
59411G36046J8937J7665J5241J0794M207k374o246p082o572n628l853j458N31
59398G70208K059L759M636K367l287r454j3472j5350j6129j5849j4361j2436j0647
59385F72044q536o112m647m720m925l968k676k445k840k534j606j167j294j024
59371F23550j22O18O97L84J09K49J245K961M330M443L702L187L310L782M382N011
59355F61838N442N714O297P302Q106Q378Q663R269R439Q569P418P099P485P635
$$ y = [548947, 552278, 556622, 561347, 565887, 570119, 574124, 577820, 581101, 584137, 587120, 589770, 591521, 592086, 591476, 589621, 586618, 583247, 580549, 578786, 577435, 576246, 575545, 575399, 575328, 575175, 575516, 576826, 578881, 581404, 584665, 589054, 594630, 601436, 609652, 619096, 629197, 639861, 651803, 665651, 681306, 698438, 716857, 736046, 754983, 772648, 787889, 798683, 802890, 800516, 794270, 787188, 780616, 774988, 771135, 769677, 770208, 772267, 776026, 780662, 783029, 779742, 770288, 756816, 741466, 725337, 709488, 695127, 682691, 672044, 663508, 657396, 652749, 648029, 643104, 639136, 636460, 634015, 631175, 628641, 627035, 625868, 624574, 623550, 623428, 624046, 624743, 625127, 625236, 625485, 626730, 629691, 634021, 638464, 642166, 645353, 648663, 652445, 656827, 661838, 667280, 672994, 679291, 686593, 694699, 703077, 711740, 721009, 730448, 739017, 746435, 753534, 761019, 768654]
59341G68654P285O828O243N045L110P46j796m198n923o827p512q481r389r755
59327G44030r752r747r715r749j0288j1135j1132r747q124p527p566p092o106
59314F26350n397m920l975k673j848j637j310n00M63J429K615L986N182O058O510
59299F30333N953L821N17k799n301o868p630p775p548o901n502l589k222k030
59285E82459k199j543r9J152J778K186K705L280L836M349M691N023N876P350Q697
59270F29541R266R317R315R077Q361P551P001O317N154L939L009J854J83j139
59256G08746j402j392k134l093l128k524k455k893k840k326k378l018l028j944
59242F74191p82l95m26k59J46P13J431J802J135k99j339j503j547k224l364m455
$$ y = [768654, 775939, 782767, 789010, 794055, 797165, 797911, 796115, 791917, 785994, 779167, 771655, 763174, 753785, 744030, 734278, 724531, 714816, 705067, 694779, 683644, 672512, 662765, 654641, 647114, 639548, 632456, 626350, 620953, 616033, 612058, 609385, 607537, 605900, 604590, 604090, 604553, 605982, 608597, 612583, 617765, 623823, 630333, 636286, 640107, 640624, 637825, 632524, 625656, 618026, 610251, 602703, 595802, 590300, 586711, 584489, 582459, 580260, 578717, 578618, 579770, 581548, 583734, 586439, 589719, 593555, 597904, 602595, 607618, 613494, 620844, 629541, 638807, 648124, 657439, 666516, 674877, 682428, 689429, 695746, 700900, 704839, 707848, 709702, 709885, 708746, 707344, 705952, 703818, 700725, 697597, 695073, 692618, 689725, 686885, 684559, 682181, 679163, 676135, 674191, 673409, 673014, 672588, 672329, 672475, 673188, 674619, 676421, 677556, 677257, 675918, 674415, 672868, 670644, 667280, 662825]
59226F62825n384o194o799p169p347p106o184m871l878l597l890m471m973m945
59212E86017m328l678l359k991k278j811k123k581k251j425j074j181q81lP75
59197E56828J195J578J789J330M88K16P56J491K109K793L213K680J506R74J580
59182E80526K345K293J579Q11K08j54l8M61P65N31R0j4M49J312K057K122J644
59165E96987J478J921J994Q73o26j157q96j129k089k762k748k794l306l765l844
59150E78137l863l861l472k978l182l943m093l248k489k699l376l625l348k884
59136E31076k344j845j618j528j108l91J03L11P29J431J925K096K357K742K865
59121E36801K937L709N124O183O448O574O988P188O825O475O694P228P618P762
$$ y = [662825, 657441, 651247, 644448, 637279, 629932, 622826, 616642, 611771, 607893, 604296, 600406, 595935, 590962, 586017, 581689, 578011, 574652, 571661, 569383, 567572, 565449, 562868, 560617, 559192, 558118, 556937, 556056, 556053, 556828, 558023, 559601, 561390, 562720, 563208, 563424, 564180, 565671, 567780, 570573, 573786, 576466, 577972, 578946, 580526, 582871, 585164, 586743, 587554, 587762, 587608, 587570, 588031, 588796, 589327, 589417, 589403, 589852, 591164, 593221, 595343, 596987, 598465, 600386, 602380, 603253, 602627, 601470, 600574, 599445, 597356, 594594, 591846, 589052, 585746, 581981, 578137, 574274, 570413, 566941, 563963, 560781, 556838, 552745, 549497, 547008, 544309, 540933, 537308, 533960, 531076, 528732, 526887, 525269, 523741, 522633, 522242, 522345, 522656, 523385, 524816, 526741, 528837, 531194, 533936, 536801, 539738, 543447, 548571, 554754, 561202, 567776, 574764, 581952, 588777, 595252, 601946, 609174, 616792, 624554]
59107F24554P510O537N131M176M004M009L658L062K291J132k19j188j814k700
59093F60143l695l832k956k182k173k191j563r26j090j676j876j854k355l377
59079F28397m128m109l636l425l889m712n031m383l334k675k417k246k527l610
59065E78275m596m227k953k430k906k838j571m92p68j599j764j395j131q09k02
59050E48594Jp28j571j475o92j42M8L75R31J498K092K500J968L10j239j288MJ339
59032E52525J989K271K598K986L317L544L710M065M921O112P064P547P794P800
59018F18243P227O311N899O185O216N174L374J565K1j208j893k050k040j884j210
59003F49930j81M49N47Q68J694K284K191K044K396K856K963K910K784K151J098
$$ y = [624554, 632064, 638601, 643732, 647908, 651912, 655921, 659579, 662641, 664932, 666064, 665845, 664657, 662843, 660143, 656448, 652616, 649660, 647478, 645305, 643114, 641551, 640625, 639535, 637859, 635983, 634129, 631774, 628397, 624269, 620160, 616524, 613099, 609210, 604498, 599467, 595084, 591750, 589075, 586658, 584412, 581885, 578275, 573679, 569452, 566499, 564069, 561163, 558325, 556754, 556262, 555494, 553895, 552131, 550736, 549605, 548796, 548594, 548595, 547867, 546296, 544821, 544129, 543987, 544035, 544410, 545341, 546839, 548931, 551431, 553399, 553709, 552470, 551182, 551186, 552525, 554514, 556785, 559383, 562369, 565686, 569230, 572940, 577005, 581926, 588038, 595102, 602649, 610443, 618243, 625470, 631781, 637680, 643865, 650081, 655255, 658629, 660194, 660215, 659007, 657114, 655064, 653024, 651140, 649930, 649749, 650198, 650745, 651613, 653307, 655591, 657782, 659826, 662222, 665078, 668041, 670951, 673735, 675886, 676984]
58988F76984N03N66K81p95j500q73K30M76N4K3N58J157J826K836L814M299M677
58971F95116N527O522O980P028P221P531P606P583P698P668P229O705O277N391
58957G92082L783K239J380M00j757m599o671p559q080q747r246r316r203r171
58943G25535r143q826p894o363n050m906n640n860m994m013l586k903j281J86
58929F55262O9j208j988j586n76N45J628K217J882J001K67k55p58r08m84j47n29
58912F54432j022n90O35J684K261K790L355L683L981M764O022P322Q558R781J0684
58897G18340J0929J0660J0072R130Q264Q445R773J0899J0829J0341J0554J1153
58885H39389J1315J1355J1812J1806J0091P217M867L427J921P4j377k412l990
$$ y = [676984, 677487, 678053, 678334, 677539, 676039, 675166, 675396, 675872, 675926, 675949, 676507, 677664, 679490, 682326, 686140, 690439, 695116, 700643, 707165, 714145, 721173, 728394, 735925, 743531, 751114, 758812, 766480, 773709, 780414, 786691, 792082, 795865, 798104, 799484, 799884, 798127, 793528, 786857, 779298, 771218, 762471, 753225, 743909, 734706, 725535, 716392, 707566, 699672, 693309, 688259, 683353, 677713, 671853, 666859, 662846, 659260, 656357, 655076, 655262, 655331, 654123, 652135, 650549, 649973, 650518, 652146, 654363, 656245, 657246, 657513, 657258, 656500, 655592, 655108, 654961, 654432, 653410, 652820, 653455, 655139, 657400, 660190, 663545, 667228, 671209, 675973, 681995, 689317, 697875, 707656, 718340, 729269, 739929, 750001, 759131, 767395, 775840, 785613, 796512, 807341, 817682, 828236, 839389, 850704, 862059, 873871, 885677, 895768, 902985, 907852, 911279, 913200, 913274, 911897, 909485, 905495]
58872I05495o380q627r967j0531j0515r769q454p093n906m889m421m797n440n563
58858H03143n418n760o351o335n935o385p962r343r272p896o220n044m628m748
58844G11846m959n176n778o672o986o391o002o842q041p923o407m949m423m414
58830F26883m442m468m207l276k075j390j130n33M38J123J451K036K909L341L031
58815F19691K461J991J582J370J517J605J128M98M90Q43N33o41j814k324k221
58800F26709j646q51o57j697l302m241m435m795n453n586m990m429m194l650k507
58785E74276j376o61K4R62J756K034J984J863J666J468J467J550J345P50r9j172
58769E87837k371l302l798m202m624m454l407k307j969j964j518r06p88q86n27
$$ y = [905495, 899115, 890488, 880521, 869990, 859475, 849706, 841252, 834159, 828253, 823364, 818943, 814146, 808706, 803143, 797725, 791965, 785614, 779279, 773344, 766959, 758997, 749654, 740382, 732486, 726266, 721222, 716594, 711846, 706887, 701711, 695933, 689261, 682275, 675884, 669882, 663040, 654999, 647076, 640669, 635720, 631297, 626883, 622441, 617973, 613766, 610490, 608415, 607025, 605895, 605362, 605800, 606923, 608374, 610410, 613319, 616660, 619691, 622152, 624143, 625725, 627095, 628612, 630217, 631345, 631843, 632333, 633176, 633709, 633068, 631254, 628930, 626709, 625063, 624212, 623555, 621858, 618556, 614315, 609880, 605085, 599632, 594046, 589056, 584627, 580433, 576783, 574276, 572900, 572239, 572263, 573225, 574981, 577015, 578999, 580862, 582528, 583996, 585463, 587013, 588358, 589108, 589009, 587837, 585466, 582164, 578366, 574164, 569540, 565086, 561679, 559372, 557403, 555439, 553921, 553015, 552227, 551341, 550814]
58754E50814J41P02J532K900L774L104J736J388K189K871K911K811K640K176K131
58739E83820L387N185N871N305M759M606M152L620M160N684O625O262N464M853
58725F53753M031K990K514K702K695K272K218K796L352L669M178M656M340L534
58711F99700L393L855L561K106N47o22k059l767m672m730n490p644r773j0498
58697F63907j0347j0514j1106j1560j1644j1228j0130q794q053p806p070n684
58685E49971m654m447m314l710l037k590k065j500j378j489j083k90O9K13J152
58670E20848K580K962K195K173L924O058O975O906O824O820O472N598L935J392
58656E85662j008j891j623k003l482m532m262l707l749l789l456l599m438m570
$$ y = [550814, 550955, 551657, 553189, 556089, 559863, 562967, 564703, 566091, 568280, 571151, 574062, 576873, 579513, 581689, 583820, 587207, 592392, 598263, 603568, 608327, 612933, 617085, 620705, 624865, 630549, 637174, 643436, 648900, 653753, 657784, 660774, 663288, 665990, 668685, 670957, 673175, 675971, 679323, 682992, 687170, 691826, 696166, 699700, 703093, 706948, 710509, 712615, 713162, 712540, 710481, 706714, 702042, 697312, 691822, 684178, 674405, 663907, 653560, 643046, 631940, 620380, 608736, 597508, 587378, 578584, 570531, 562725, 555655, 549971, 545317, 540870, 536556, 532846, 529809, 527219, 525154, 523654, 522276, 520787, 519704, 519414, 519483, 519696, 520848, 523428, 526390, 528585, 530758, 534682, 540740, 547715, 554621, 561445, 568265, 574737, 580335, 584270, 585662, 584654, 582763, 581140, 579137, 575655, 571123, 566861, 563154, 559405, 555616, 552160, 548561, 544123, 539553]
58642E39553l120j256l55j27K34N11L64L64R01J250Q81M89O51O61k18j366j756
58625E37661j306n10L30Q85Q11N55R99J901K060J408J336K456L650M016L978L832
58609E64062K963J383L36M14O65L89J61L52L19o6Q8Q28R34K21K07J437K213J346
58591E78252J65L18J435K458L557N029O032N973N853O638P670Q031Q120Q514Q668
58576F56713Q148P789Q286Q910Q839Q487Q413Q283Q020Q508J0049J1564J2374
58563G74383J3266J4775J6075J6549J6714J6659J5426J2996J0839R435P429M375
58551I28921J927R33j80k500m542m959m949n868o774o575o517q084j0280j1369
58537H59184j1650j2229j2680j2242j1711j1938j1918j0602q973q240p530n711
$$ y = [539553, 536433, 535177, 534822, 534695, 534929, 535440, 535804, 536168, 537069, 538319, 539200, 539689, 540340, 541001, 540783, 539417, 537661, 536355, 535845, 536175, 537060, 537871, 538426, 539425, 541326, 543386, 544794, 546130, 548586, 552236, 556252, 560230, 564062, 567025, 568408, 568744, 569158, 569823, 570212, 570373, 570725, 571044, 570978, 571066, 571894, 572828, 573049, 573256, 574693, 576906, 578252, 578417, 578735, 580170, 582628, 586185, 591214, 597246, 603219, 609072, 615710, 623380, 631411, 639531, 648045, 656713, 664861, 672650, 680936, 689846, 698685, 707172, 715585, 723868, 731888, 740396, 750445, 762009, 774383, 787649, 802424, 818499, 835048, 851762, 868421, 883847, 896843, 907682, 917117, 924546, 928921, 930848, 931781, 931601, 929101, 924559, 919600, 914651, 908783, 902009, 895434, 888917, 880833, 870553, 859184, 847534, 835305, 822625, 810383, 798672, 786734, 774816, 764214, 755241, 747001, 739471, 733760]
58525G33760l841l414l718l272k520k690l301l116k463k339k434k010j547j652
58511F95443j673j168j131k036k517j786j283j873j841n5J416O34p22l17P33K11
58495F82035q63r2J802K282J539J792L029L285K546K708M016M916N137N769O688
58480G26589O892O946Q159R797J0021R108Q714Q598P033M123J732M41o54j602
58466H05897j795j974l250m623m215k445j234p02N74K617M184N241O530P357O588
58451H18750N165M795M991M195K825K154J257j454m598n400m168l597m110l749
58437H17056k308j703k169j836l38O11O00J117K473L244L156L577M828N761O042
58422H40111O234N820L952J793J224J570P15j100j774j252j382k200j924o43m50
$$ y = [733760, 729919, 726505, 722787, 719515, 716995, 714305, 711004, 707888, 705425, 703086, 700652, 698642, 697095, 695443, 693770, 692602, 691471, 689435, 686918, 685132, 683849, 681976, 680135, 680080, 681496, 682130, 681408, 681091, 681824, 682035, 681172, 681080, 682882, 685164, 686703, 688495, 691524, 694809, 697355, 700063, 704079, 708995, 714132, 719901, 726589, 733481, 740427, 748586, 758383, 768404, 777512, 786226, 794824, 801857, 805980, 807712, 808153, 807499, 805897, 804102, 802128, 798878, 794255, 790040, 787595, 786361, 785659, 786233, 788850, 793034, 798275, 804805, 812162, 818750, 823915, 828710, 833701, 837896, 840721, 842875, 844132, 842678, 838080, 832680, 828512, 824915, 820805, 817056, 814748, 813045, 810876, 809040, 808702, 809313, 809913, 811030, 813503, 816747, 819903, 823480, 828308, 834069, 840111, 846345, 852165, 856117, 857910, 859134, 860704, 861419, 860319, 858545, 857293, 855911, 853711, 851787, 851144, 850694]
58407H50694j740k628k336j980j909j264j80M67J208L051M915N145M803N949P545
58392H71740O909M616L792M908N536N067N362O566O700N712N822P324Q092P661
58378I55807P916R261R930R514R411R566Q543O986P026Q252Q304P445Q188J0325
58364A076474J0953R729R422J0746J1310J0411J0232J1395J1866J1150J1147J1957
58352A206792J1317R114Q060Q899R355Q654Q688R859J0210R657J0435J2499J3046
58339A336585J1617J1111J2757J4541J5475J6865J8535J8545J7430J7962J9916
58328A511339K0049J7902J6467J6418J5202J2678J2020J3831J5007J4653J5416
58317A680982J7704J8487J7297J7494J9980K1582K1281K2022K4615K5922K5059
$$ y = [850694, 848954, 846326, 843990, 842010, 840101, 838837, 838657, 839124, 840332, 843383, 848298, 853443, 858246, 864195, 871740, 878649, 883265, 887057, 891965, 897501, 902568, 907930, 914496, 921196, 926908, 932730, 940054, 948146, 955807, 963723, 972984, 982914, 992428, 1001839, 1011405, 1019948, 1026934, 1033960, 1042212, 1050516, 1057961, 1066149, 1076474, 1087427, 1097156, 1106578, 1117324, 1128634, 1139045, 1149277, 1160672, 1172538, 1183688, 1194835, 1206792, 1218109, 1227223, 1235283, 1244182, 1253537, 1262191, 1270879, 1280738, 1290948, 1300605, 1311040, 1323539, 1336585, 1348202, 1359313, 1372070, 1386611, 1402086, 1418951, 1437486, 1456031, 1473461, 1491423, 1511339, 1531388, 1549290, 1565757, 1582175, 1597377, 1610055, 1622075, 1635906, 1650913, 1665566, 1680982, 1698686, 1717173, 1734470, 1751964, 1771944, 1793526, 1814807, 1836829, 1861444, 1887366, 1912425]
58306A912425K5250K7545K8848K8087K8259L0333L1402L0836L1812L4696L5578
58295B245071L3599L2930L5204L6879L6528L7581M1250M3985M4680M7064N2005
58284B686776N5122N5045N6310O0754O4044O4439O6785P3627Q0394Q3889Q7678
58273C434863R4484J00970J04757J09041J15483J20266J21862J24980J32074J38825
58263D597605J42710J47776J56099J63023J66159J70413J78635J86008J89318
58254F097746J92956J99856K05531K07173K09591K15882K21354K23041K25888
58245G999018K33138K40237K44780K52569K67091K83345K98752L19224L47210
58236A0485364L75122L98287M22741M52406M80886N04242N28966N58372N84567
$$ y = [1912425, 1937675, 1965220, 1994068, 2022155, 2050414, 2080747, 2112149, 2142985, 2174797, 2209493, 2245071, 2278670, 2311600, 2346804, 2383683, 2420211, 2457792, 2499042, 2543027, 2587707, 2634771, 2686776, 2741898, 2796943, 2853253, 2914007, 2978051, 3042490, 3109275, 3182902, 3263296, 3347185, 3434863, 3529347, 3630317, 3735074, 3844115, 3959598, 4079864, 4201726, 4326706, 4458780, 4597605, 4740315, 4888091, 5044190, 5207213, 5373372, 5543785, 5722420, 5908428, 6097746, 6290702, 6490558, 6696089, 6903262, 7112853, 7328735, 7550089, 7773130, 7999018, 8232156, 8472393, 8717173, 8969742, 9236833, 9520178, 9818930, 10138154, 10485364, 10860486, 11258773, 11681514, 12133920, 12614806, 13119048, 13648014, 14206386, 14790953]
58227A4790953O03499O24301O53896O86740P19919P62736Q19769Q80414R37313
58218B1479540R98682J070057J142111J210552J289017J386654J492537J598728
58210C1667878J718182J862114K021620K190521K382384K604307K840736L088142
58202E0375884L379319L747887M198348M738408N405879O230799P210368Q360931
58194I3647823R751161J1434119J3385758J5549386J7867774K0202733K2309698
58187B04148452K3980087K5048481K5009777K2732598J7038767P930343k842421
58180C23046084j2685992j9726177k3562201k4822700k4365526k2892925k0932630
58173A74057933j8842293j6799780j4878781j3132609j1583064j0192731q915786
$$ y = [14790953, 15394452, 16018753, 16672649, 17359389, 18079308, 18842044, 19661813, 20542227, 21479540, 22478222, 23548279, 24690390, 25900942, 27189959, 28576613, 30069150, 31667878, 33386060, 35248174, 37269794, 39460315, 41842699, 44447006, 47287742, 50375884, 53755203, 57503090, 61701438, 66439846, 71845725, 78076524, 85286892, 93647823, 103398984, 114833103, 128218861, 143768247, 161636021, 181838754, 204148452, 228128539, 253177020, 278186797, 300919395, 317958162, 325888505, 323046084, 310360092, 290633915, 267071714, 242249014, 217883488, 194990563, 174057933, 155215640, 138415860, 123537079, 110404470, 98821406, 88628675, 79712889]
58166G9712889p754505o731094n837873n053284m377889l817212l351259k952871
58158C9836902k616887k344167k116333j912546j733794j586621j459233j336381
58150B4730940j222513j128195j047355r68376q94738q34840p82947p29145o77615
58141A6445216o37416o04754n70923n38582n14319m93591m68333m41615m20505
58132A1755178m02003l79680l57106l41386l30039l16639l02880k93175k83787
58123H748483k69186k53132k42187k34038k23037k11483k04587j99729j91361
58114F719743j81455j74980j69855j61316j51566j45435j41059j34175j27227
58105E332675j24909j24786j21486j16273j13672j12345j08055j02181r8877r7011
$$ y = [79712889, 71958384, 65227290, 59389417, 54336133, 49958244, 46141032, 42789773, 39836902, 37220015, 34875848, 32759515, 30846969, 29113175, 27526554, 26067321, 24730940, 23508427, 22380232, 21332877, 20364501, 19469763, 18634923, 17851976, 17122831, 16445216, 15807800, 15203046, 14632123, 14093541, 13579222, 13085631, 12617298, 12175683, 11755178, 11353175, 10973495, 10616389, 10275003, 9944964, 9628325, 9325445, 9032270, 8748483, 8479297, 8226165, 7983978, 7749940, 7526903, 7315420, 7110833, 6911104, 6719743, 6538288, 6363308, 6193453, 6032137, 5880571, 5735136, 5594077, 5459902, 5332675, 5207766, 5082980, 4961494, 4845221, 4731549, 4619204, 4511149, 4408968, 4310091, 4213080]
58095D213080r2940q8131q6223q5627q2575p8497p7053p6906p4537p1192p0054
58084C329345o9618o6726o3057o1902o1652n9168n6342n6530n7688n5983n3008
58073B667671n2503n2991n0769m7384m6911m8310m7501m4818m3543m3160m0861
58062B148920l7785l7079l7593l5916l2977l2260l3272l2985l1997l2974l4707
58051A769375l3948l1619l1079l1693l0292k7556k6782k7492k6493k4199k3849
58040A454373k5272k5352k3986k3850k4838k4324k2471k1887k2527k2057k0696
58029A197113k0623k1332k0626j9379k0136k1818k1095j8434j7422j8502j8689
58018I79057j7228j6332j6398j5516j3847j3638j4730j4510j2515j0832j0078
$$ y = [4213080, 4120140, 4032009, 3945786, 3860159, 3777584, 3699087, 3622034, 3545128, 3470591, 3399399, 3329345, 3259727, 3193001, 3129944, 3068042, 3006390, 2947222, 2890880, 2834350, 2776662, 2720679, 2667671, 2615168, 2562177, 2511408, 2464024, 2417113, 2368803, 2321302, 2276484, 2232941, 2189781, 2148920, 2111135, 2074056, 2036463, 2000547, 1967570, 1935310, 1902038, 1869053, 1837056, 1804082, 1769375, 1735427, 1703808, 1672729, 1641036, 1610744, 1583188, 1556406, 1528914, 1502421, 1478222, 1454373, 1429101, 1403749, 1379763, 1355913, 1331075, 1306751, 1284280, 1262393, 1239866, 1217809, 1197113, 1176490, 1155158, 1134532, 1115153, 1095017, 1073199, 1052104, 1033670, 1016248, 997746, 979057, 961829, 945497, 929099, 913583, 899736, 886098, 871368, 856858, 844343, 833511, 823433]
58007H23433r162q631r942j1719j1148q748p502p750p403o595p363r041q890p252
57993G02287p173q746q810o700n497o702q138q143p754p800p547p094p636q749
57979E95798q703p763p823q748q628p620p726q748q389o516n445n713n463m311
57965D94202l923m371l790k187j693k588k797j866j682k654k976k278k328l430
57951D55639l777l052l018l957m178l641m199n555m996k086K85O02P13J891K758
57936D23429K510K539L306L066J370M24J308K000R10o72j346k004l609n215n898
57921D22118o365p083p151o282n647n637n088l778l176l685l676k388j278j331
57907C59553j539j151r33j161q33M1r3j470k183j368o01r60j283o48m1j60L0J198
$$ y = [823433, 814271, 805640, 795698, 783979, 772831, 764083, 756581, 748831, 741428, 734833, 727470, 718429, 709539, 702287, 695114, 686368, 677558, 670858, 665361, 658659, 650521, 642378, 634624, 626824, 619277, 612183, 604547, 595798, 587095, 579332, 571509, 562761, 554133, 546513, 538787, 530039, 521650, 515134, 509689, 503976, 498513, 494202, 490279, 485908, 482118, 479931, 478238, 475650, 472853, 470987, 469305, 466651, 463675, 461397, 459069, 455639, 451862, 448810, 445792, 441835, 437657, 434016, 429817, 424262, 419266, 417180, 417465, 418067, 418780, 420671, 423429, 425939, 428478, 431784, 434850, 436220, 436644, 437952, 439952, 440862, 440190, 438844, 436840, 433231, 428016, 422118, 415753, 408670, 401519, 395237, 389590, 383953, 378865, 375087, 371911, 368226, 364550, 362162, 360884, 359553, 358014, 356863, 355930, 354769, 353936, 353977, 353884, 352414, 350231, 348863, 348262, 347302, 346019, 345371, 345330, 345170, 345200, 346398]
57889C46398K275K561K905L661L761K913K392K561K067O27J1R12J439K57j285
57874C73455j781k057l106l977l582k627k055j418l22L51P8j75K25N14M28J063
57858C55014K587L319K432J448J574J756R65J98M87R65O79L98Q28R23j87j350
57842C72036j283p12q24j194j026q54j290j534q32l8j09m02m3M23K84J42O17R17
57824C64278K97l59kQ41J114Q60M93k06j164j480j137j693l922o235o903o345
57808C38437n845n512n019m861n296n333m277l002k382j862r47m51q38q85L41
57793B92268J729J987J693J864J964J264O70J230K075J818R25P78J425K062K721
57778C16473L705M315L943L521M127N087N095M245L364K333Q33k80k28j0r90k561
$$ y = [346398, 348673, 351234, 354139, 357800, 361561, 364474, 366866, 369427, 371494, 372121, 372132, 373044, 374483, 374740, 373455, 371674, 369617, 366511, 362534, 358952, 356325, 354270, 352852, 352530, 352881, 352959, 352784, 353009, 353523, 353951, 355014, 357601, 360920, 363352, 364800, 366374, 368130, 369095, 369293, 369780, 370745, 371424, 371822, 372650, 373573, 373386, 372036, 370753, 370041, 369217, 368023, 366997, 366143, 364853, 363319, 362487, 362449, 362340, 361938, 361895, 362318, 362602, 362744, 363361, 364278, 364575, 364216, 364214, 365055, 366169, 367029, 367522, 367316, 366152, 364672, 363535, 361842, 357920, 351685, 344782, 338437, 332592, 327080, 322061, 317200, 311904, 306571, 302294, 299292, 296910, 295048, 294101, 293650, 292812, 291927, 292268, 293997, 295984, 297677, 299541, 301505, 302769, 303439, 304669, 306744, 308562, 309487, 310265, 311690, 313752, 316473, 320178, 324493, 328436, 331957, 336084, 341171, 346266, 350511, 353875, 356208, 357041, 356761, 356533, 356523, 355533, 352972]
57762C52972l022k175j318j208j622k264k724k165n09Q25P36J26L26R00O90PJ9
57745C39594O81J075J140J309J109r7j528j888j338j014j066q63o16j019j681
57730C33798j516n33K48M06L31J77j18j55M03J008J037Q28Q37O30q4l12Q20K295
57712C40100K475J430M66m6n92r45m72L32L33l47n28N8M98K83j43m33p16j000
57694C40753j158j336j536j252l32L88K87K0L81R47J000R47J539K476L093L661
57678C49878M674N691O307P393R874J3087J5907J8679K2348K6481K9843L2329
57666E42491L4551L6027L5315L1379K3499J1059m647j9362k8964l3209l4574l4359
57654E59206l2237k8859k5964k3835k1174j7772j5068j3719j2739j1347r834q270
$$ y = [352972, 349950, 347775, 346457, 345249, 343627, 341363, 338639, 336474, 335965, 336790, 337526, 337652, 337978, 338878, 339568, 339575, 339594, 340275, 341350, 342490, 343799, 344908, 344811, 343283, 341395, 340057, 339043, 337977, 337114, 336498, 335479, 333798, 332282, 331749, 331997, 332403, 332734, 332911, 332793, 332638, 333041, 334049, 335086, 335914, 336751, 337381, 337297, 336985, 337805, 340100, 342575, 344005, 344471, 344425, 343833, 342888, 342416, 342748, 343081, 342734, 342206, 342264, 342762, 343045, 342902, 342469, 341753, 340753, 339595, 338259, 336723, 335471, 335139, 335527, 335814, 335834, 336215, 337162, 338162, 339109, 340648, 343124, 346217, 349878, 354552, 360243, 366550, 373943, 383817, 396904, 412811, 431490, 453838, 480319, 510162, 542491, 577042, 613069, 648384, 679763, 703262, 714321, 709674, 690312, 661348, 628139, 593565, 559206, 526969, 498110, 472146, 448311, 427137, 409365, 394297, 380578, 367839, 356492, 346658, 338388]
57642C38388o250m222l271l346l307k904k846k942k140p18k50r98j326l95N75
57627C04048M98O3K50P64R41Q48N83k72j628k460k212j634j517j597j355j006
57611B94314r85j212j357j295r88n59n32j225j959j792r78o44j040j335j153j047
57595B76213j304j477j340j188j058p11m45p52j158p17L09O07j71r65j058q87
57579B63898p77l68K40J77q31j907k352k380k120j200J46Q24M43O2O36J672K093
57562B58256J641Q03k8o93j099j297j336j031l19K60J91j07J70R71J622K014K439
57545B62457K565J874R26P41J083Q40R2J47J336K443K666K535K435J875Q52M27
57529B85294J119J958J882J065K38k33j19P00J586J515N70j7L62J081J699K650
$$ y = [338388, 332138, 327916, 324645, 321299, 317992, 315088, 312242, 309300, 307160, 306442, 306192, 305194, 303868, 303473, 304048, 304546, 304609, 304859, 305623, 306564, 307412, 307995, 307723, 306095, 303635, 301423, 299789, 298272, 296675, 295320, 294314, 293329, 292117, 290760, 289465, 288477, 287918, 287386, 286161, 284202, 282410, 281432, 280788, 279748, 278413, 277260, 276213, 274909, 273432, 272092, 270904, 269846, 269135, 268690, 267938, 266780, 266063, 266372, 266979, 266808, 265843, 264785, 263898, 263121, 262753, 262993, 263170, 262339, 260432, 258080, 255700, 253580, 252380, 252526, 253350, 253793, 253855, 254491, 256163, 258256, 259897, 260700, 260672, 259979, 258880, 257583, 256247, 255216, 254897, 255157, 255348, 255241, 255411, 256382, 258004, 260018, 262457, 265022, 266896, 267822, 268563, 269646, 270486, 270578, 270725, 272061, 274504, 277170, 279705, 282140, 284015, 284867, 285294, 286413, 288371, 290253, 291318, 291556, 291323, 291204, 291904, 293490, 295005, 295575, 295558, 295920, 297001, 298700, 301350]
57513C01350L943M640M248L431K710J767O85M77J563K811L064K588K200J968J572
57498C39017J133R11R50J477K781M244M594L675K833K970L413L353L133L195K965
57483C80644J862N62J27N51J036J166J083R91J116J549J831J375O06P36K020L297
57467D00552L664L495L286K767J849J269J412J523J008N31R36J979K908L559M008
57452D34746L975L399K853K719K645K437K576L213L586L205K761L027L739M248
57438D79129M543M855N042N038N169N444N370M992N057N647N806N196M830N386
57424E51504O024N940N808O453P271P260O729O629O948P046O940P029P167P104
57410F45852P286Q187R331R990J0124R902R050P727P089P877R215R892J0001J0103
$$ y = [301350, 305293, 309933, 314181, 317612, 320322, 322089, 322774, 323251, 324814, 327625, 330689, 333277, 335477, 337445, 339017, 340150, 341061, 342011, 343488, 346269, 350513, 355107, 358782, 361615, 364585, 367998, 371351, 374484, 377679, 380644, 382506, 383068, 383195, 383746, 384782, 385948, 387031, 388022, 389138, 390687, 392518, 393893, 394499, 395235, 397255, 400552, 404216, 407711, 410997, 413764, 415613, 416882, 418294, 419817, 420825, 421356, 422292, 424271, 427179, 430738, 434746, 438721, 442120, 444973, 447692, 450337, 452774, 455350, 458563, 462149, 465354, 468115, 471142, 474881, 479129, 483672, 488527, 493569, 498607, 503776, 509220, 514590, 519582, 524639, 530286, 536092, 541288, 546118, 551504, 557528, 563468, 569276, 575729, 583000, 590260, 596989, 603618, 610566, 617612, 624552, 631581, 638748, 645852, 653138, 661325, 670656, 680646, 690770, 700672, 709722, 717449, 724538, 732415, 741630, 751522, 761523, 771626]
57396G71626R821Q728P822Q376R860J0693J0703J1174J2587J4003J4744J5187
57384I05324J5635J5769J5553J5556J5994J6363J6356J6423J6992J7858J8580
57373A086403J8978J8984J8515J7758J7311J7781J9227K0977K2097K2312K2357
57362A302700K3046K4089K4545K4325K4281K4741K5071K5006K5202K5952K6510
57351A575468K6464K6589K7498K8458K8576K8260K8386K8856K9042K8973K9015
57340A885585K9063K8947K9093K9761L0350L0419L0678L2002L4106L6219L8311
57329B234534M0610M2646M3875M4629M5396M5894M5880M6096M7148M8313M8671
57318B733692M8684M9214M9814M9534M8819M8821M9412M9624M9715N0941N3288
$$ y = [771626, 781447, 790175, 797997, 806373, 816233, 826926, 837629, 848803, 861390, 875393, 890137, 905324, 920959, 936728, 952281, 967837, 983831, 1000194, 1016550, 1032973, 1049965, 1067823, 1086403, 1105381, 1124365, 1142880, 1160638, 1177949, 1195730, 1214957, 1235934, 1258031, 1280343, 1302700, 1325746, 1349835, 1374380, 1398705, 1422986, 1447727, 1472798, 1497804, 1523006, 1548958, 1575468, 1601932, 1628521, 1656019, 1684477, 1713053, 1741313, 1769699, 1798555, 1827597, 1856570, 1885585, 1914648, 1943595, 1972688, 2002449, 2032799, 2063218, 2093896, 2125898, 2160004, 2196223, 2234534, 2275144, 2317790, 2361665, 2406294, 2451690, 2497584, 2543464, 2589560, 2636708, 2685021, 2733692, 2782376, 2831590, 2881404, 2930938, 2979757, 3028578, 3077990, 3127614, 3177329, 3228270, 3281558]
57307C281558N5284N6252N7149N8831O0928O2833O4544O5974O6511O5817O4415
57296C960096O3145O2656O3364O5219O7426O9088P0148P1183P2479P3907P5435
57285D714146P7029P8306P9004P9463Q0065Q0577Q0738Q0895Q1297Q1427Q0921
57274E593868Q0462Q0742Q1240Q1162Q0878Q1118Q1476Q1225Q0949Q1701Q2965
57263F487786Q3209Q2221Q1144Q0294P8853P6810P5360P4901P4211P2262O9506
57252G336557O6794O4151O1236N8126N5105N2437N0661N0421N1718N3898N6401
57241G957505N8958O1266O3203O5102O6959O7746O6513O3797O0892N8028N4604
57230H644573N0846M7817M5869M4512M3782M4261M5613M6545M6476M5999M5547
$$ y = [3281558, 3336842, 3393094, 3450243, 3509074, 3570002, 3632835, 3697379, 3763353, 3829864, 3895681, 3960096, 4023241, 4085897, 4149261, 4214480, 4281906, 4350994, 4421142, 4492325, 4564804, 4638711, 4714146, 4791175, 4869481, 4948485, 5027948, 5108013, 5188590, 5269328, 5350223, 5431520, 5512947, 5593868, 5674330, 5755072, 5836312, 5917474, 5998352, 6079470, 6160946, 6242171, 6323120, 6404821, 6487786, 6570995, 6653216, 6734360, 6814654, 6893507, 6970317, 7045677, 7120578, 7194789, 7267051, 7336557, 7403351, 7467502, 7528738, 7586864, 7641969, 7694406, 7745067, 7795488, 7847206, 7901104, 7957505, 8016463, 8077729, 8140932, 8206034, 8272993, 8340739, 8407252, 8471049, 8531941, 8589969, 8644573, 8695419, 8743236, 8789105, 8833617, 8877399, 8921660, 8967273, 9013818, 9060294, 9106293, 9151840]
57219I151840M4905M4325M4787M6705M9397N2163N4877N7329N9044N9990O0551
57208I725913O0587N9405N6759N3062M8633M3741L9116L5406L2210K8793K5524
57197A0209149K3378K2233K1008J9276J7356J5099J2308J0135J0164J2007J3728
57186A0385841J4857J7073K1388K6614L1301L5371L9113M2279M5136M8844N3729
57175A0761546N8523O2229O5602O9965P5781Q3120R2209J02563J12526J20460
57165A1604524J25428J26492J22856J15602J07795J01799R7542R4024R1126Q8904
57155A2676092Q6577Q3594Q0631P8272P5535P0911O4040N5208M3992K9619J2257
57144A3356728o916k6416m4583n9776p1419q0393q7688r3177r6125r6193r3325
$$ y = [9151840, 9196745, 9241070, 9285857, 9332562, 9381959, 9434122, 9488999, 9546328, 9605372, 9665362, 9725913, 9786500, 9845905, 9902664, 9955726, 10004359, 10048100, 10087216, 10122622, 10154832, 10183625, 10209149, 10232527, 10254760, 10275768, 10295044, 10312400, 10327499, 10339807, 10349942, 10360106, 10372113, 10385841, 10400698, 10417771, 10439159, 10465773, 10497074, 10532445, 10571558, 10613837, 10658973, 10707817, 10761546, 10820069, 10882298, 10947900, 11017865, 11093646, 11176766, 11268975, 11371538, 11484064, 11604524, 11729952, 11856444, 11979300, 12094902, 12202697, 12304496, 12402038, 12496062, 12587188, 12676092, 12762669, 12846263, 12926894, 13005166, 13080701, 13151612, 13215652, 13270860, 13314852, 13344471, 13356728, 13349812, 13323396, 13278813, 13219037, 13147618, 13067225, 12979537, 12886360, 12790235, 12694042, 12600717]
57133A2600717q7586p9849p1925o5334o0572n8004n8428o2116o8263p6190q6159
57122A1826291r8135j10652j21792j30579j36672j39529j38907j35659j31266
57113A0683100j27051j24300j24247j27143j31767j36288j38935j37627j30319
57104I505423j16689r8844p9832o2026m6914l4733k3253p908J5975N1605J01364
57093I204168J67115K48321L39998M32799N15445N80027O29289O78893P47973
57084A3544028Q44921R64216J095096J222971J315092J314009J164671Q59614
57076B2324618M55091L7597l26150o10156q14645r45827j011839j027516j012166
57067A7069007r80556r38712q88402q32394p73823p12923o47325n75595m99131
$$ y = [12600717, 12513131, 12433282, 12361357, 12296023, 12235451, 12177447, 12119019, 12056903, 11988640, 11912450, 11826291, 11728156, 11617504, 11495712, 11365133, 11228461, 11088932, 10950025, 10814366, 10683100, 10556049, 10431749, 10307502, 10180359, 10048592, 9912304, 9773369, 9635742, 9505423, 9388734, 9289890, 9210058, 9148032, 9101118, 9066385, 9043132, 9035224, 9051199, 9102804, 9204168, 9371283, 9619604, 9959602, 10392401, 10907846, 11487873, 12117162, 12796055, 13544028, 14388949, 15353165, 16448261, 17671232, 18986324, 20300333, 21465004, 22324618, 22779709, 22817306, 22491156, 21881000, 21066355, 20120528, 19108689, 18081173, 17069007, 16088451, 15149739, 14261337, 13428943, 12655120, 11942197, 11294872, 10719277, 10220146]
57058A0220146m20961l44483k73478k11467j59756j16899q0660m9765k3331J27
57048H539473K2113M3189O3297Q2190R8918J11691J19370J22728J23735J24106
57038I450810J25037J27232J30267J32581J33012J31810J29626J26477J22647
57029A0609499J19462J17655J15433J09613R8739Q4330O9451N6935M8544M4567
57019A1474228M3851M4532M4683M2453L6728K8389K0167J4313J1052R792J0744
57008A1780932J4225J9225K4066K8059L1436L4146L5898L6954L7807L8272L7790
56997A2118810L6291L3959L0737K6841K3165K0242J7430J4223J1585J0810J1606
56986A2355699J2585J3203J3851J4487J4570J4126J3646J2973J1526R472P683
$$ y = [10220146, 9799185, 9454702, 9181224, 8969757, 8810001, 8693102, 8612442, 8562677, 8539346, 8539473, 8561586, 8604775, 8668072, 8750262, 8849180, 8960871, 9080241, 9202969, 9326704, 9450810, 9575847, 9703079, 9833346, 9965927, 10098939, 10230749, 10360375, 10486852, 10609499, 10728961, 10846616, 10962049, 11071662, 11170401, 11254731, 11324182, 11381117, 11429661, 11474228, 11518079, 11562611, 11607294, 11649747, 11686475, 11714864, 11735031, 11749344, 11760396, 11770188, 11780932, 11795157, 11814382, 11838448, 11866507, 11897943, 11932089, 11967987, 12004941, 12042748, 12081020, 12118810, 12155101, 12189060, 12219797, 12246638, 12269803, 12290045, 12307475, 12321698, 12333283, 12344093, 12355699, 12368284, 12381487, 12395338, 12409825, 12424395, 12438521, 12452167, 12465140, 12476666, 12486138, 12493821]
56975A2493821O529N691M929M201L229J934R41P74R77R12Q11Q79Q7k673o631r849
56959A2506562j1641j2834j3896j4530j5124j6964k0508k4819k9079l3435l7894
56948A2275838m1525m3416m3732m3305m2702m2029m1114l9745l8043l6647l6107
56937A1827473l6279l6722l7327l8148l8977l9677m0496m1596m2966m5350n0243
56926A1379692n7908o6164p2381p6091p8604q0891q3315q6651r1616r7471j02608
56915A0485992j06396j09196j10870j10769j09077j06745j04137j00998r7683
56906I530121r5099r3514r2493r1799r1213q9909q7399q4716q3206q2595q1771
56895H556407q1055q1857q4283q7010q9353r1547r3010r2484r0147q7619q5620
$$ y = [12493821, 12500350, 12506041, 12510970, 12515171, 12518400, 12520334, 12521275, 12522049, 12523026, 12523938, 12524749, 12525628, 12525715, 12523042, 12516411, 12506562, 12494921, 12482087, 12468191, 12453661, 12438537, 12421573, 12401065, 12376246, 12347167, 12313732, 12275838, 12234313, 12190897, 12147165, 12103860, 12061158, 12019129, 11978015, 11938270, 11900227, 11863580, 11827473, 11791194, 11754472, 11717145, 11678997, 11640020, 11600343, 11559847, 11518251, 11475285, 11429935, 11379692, 11321784, 11255620, 11183239, 11107148, 11028544, 10947653, 10864338, 10777687, 10686071, 10588600, 10485992, 10379596, 10270400, 10159530, 10048761, 9939684, 9832939, 9728802, 9627804, 9530121, 9435022, 9341508, 9249015, 9157216, 9066003, 8976094, 8888695, 8803979, 8720773, 8638178, 8556407, 8475352, 8393495, 8309212, 8222202, 8132849, 8041302, 7948292, 7855808, 7765661, 7678042, 7592422]
56884G592422q3657q2272q3354q7365r2380r6643j00205j03116j04119j02527
56874F656784r9690r7128r4623r1568q8840q7670q7580q7055q5653q4056q2520
56863E670401q0543p7881p4836p1636o8447o6071o6071o9973p8172q9229j00207
56852D827335j08343j12684j13952j13100j10675j07252j03411r9224r4663r0376
56842C773655q7158q4749q2295p9840p8018p6407p3732o9904o6264o3532o1392
56831B950364o0777o4659p5130r0538j06496j18952j25759j26588j22623j15852
56821A942990j07815r9252r0883q3425p6508o8839o0194n2088m5658l9854l2782
56810A185692k4143j5385p958k226J916L952K335m543j6455l0524m3021n1881
$$ y = [7592422, 7508765, 7426493, 7343139, 7255774, 7163394, 7066751, 6966546, 6863430, 6759311, 6656784, 6557094, 6459966, 6365343, 6273775, 6184935, 6097265, 6009685, 5922630, 5836977, 5752921, 5670401, 5589858, 5511977, 5437141, 5365505, 5297058, 5230987, 5164916, 5094943, 5016771, 4927542, 4827335, 4718992, 4606308, 4492356, 4379256, 4268581, 4161329, 4057918, 3958694, 3864031, 3773655, 3686497, 3601748, 3519453, 3439613, 3361595, 3285188, 3211456, 3141552, 3075288, 3011756, 2950364, 2889587, 2824928, 2749798, 2659260, 2552764, 2433812, 2308053, 2181465, 2058842, 1942990, 1835175, 1735923, 1645040, 1561615, 1485107, 1416268, 1356074, 1303986, 1258328, 1218474, 1185692, 1161549, 1146164, 1138206, 1135980, 1137896, 1141848, 1144183, 1139640, 1123185, 1092661, 1049640, 997759]
56798I97759n6891n8164n5964n1697m7320m3338l8799l3458k8404k4189j9992
56787E39543j5231j0551o487k551J628N499Q581J0992J2330J1302P216P72o987
56774E56056j5159k2087k5799k6236k5519k5142k4423k2525k0218j8449j6783
56763C13716j4695j2967j2333j1947j0697r036q098p821p339o460n538m602l682
56750A98501l281l575l837l595l426l808m217m183m132m211l570j899m28k05n53
56735A53581n21o03j541k597k585j769j160q22l73l21j283k477k589j597n09K62
56719A33096R26J304J125P54N86K99l14n96j72R8m85j163j078q35j177j323l03
56702A30742R58Q95j84p17m22k73m11j11M75M70j7m9L79M72L03O34J151P19n53
$$ y = [997759, 940868, 882704, 826740, 775043, 727723, 684385, 645586, 612128, 583724, 559535, 539543, 524312, 513761, 507274, 504723, 506351, 511850, 520431, 531423, 543753, 555055, 562271, 563043, 556056, 540897, 518810, 493011, 466775, 441256, 416114, 391691, 369166, 348948, 330499, 313716, 299021, 286054, 273721, 261774, 251077, 242041, 233943, 226122, 218783, 212323, 206785, 202183, 198501, 195220, 191645, 187808, 184213, 180787, 176979, 172762, 168579, 164447, 160236, 156666, 154767, 154339, 154134, 153581, 153060, 152457, 150916, 148319, 145734, 143965, 142805, 141983, 141610, 141289, 140006, 137529, 134940, 133343, 132834, 133096, 134022, 135326, 136451, 137205, 137791, 138090, 137776, 137180, 137008, 137106, 136621, 135458, 134380, 133545, 132368, 131045, 130742, 131700, 132595, 132411, 131694, 131272, 130999, 130588, 130477, 130952, 131422, 131405, 131356, 131735, 132207, 132510, 133144, 134295, 135014, 134461]
56683A34461j167m43O79J262J330J064L20o28j060p95l25M5L24L01j77n89l67
56666A34235J47L52N18J137J645J206K78m2J15k58j111j388q80m27l01L7N54N39
56648A36356pl05k88o15j158r81j4P10Q24J098J738J737N48q22j151n22J46L33
56630A37627J51o3n1J10j3m95o39L9P44L02j169k449k851k660k241j719j395j401
56612A21827j219m60K12K4n62o80o43j261k073j933j027n56o45l65K52J47o63
56595A10375q82j66K72j90n79j32M93N34K66J79K19M70J311K385K557J558M56
56578A19126P7N5m6Q3O30J075J073R58R41Q00O79J100J905K251K018J995K410
56561A37130K602K535L134M565N514M979L577K317J256J27p67j105j164j146q04
$$ y = [134461, 133294, 132851, 133530, 134792, 136122, 137186, 137506, 136878, 135818, 135023, 134698, 134743, 135067, 135368, 135191, 134602, 134235, 134382, 134734, 135252, 136389, 138034, 139240, 139518, 139476, 139591, 139333, 138222, 136834, 135954, 135527, 135226, 135263, 135817, 136356, 136349, 136044, 135756, 135141, 133983, 133002, 132988, 133698, 134522, 135620, 137358, 139095, 139643, 138821, 137670, 137148, 137294, 137627, 137778, 137715, 137664, 137774, 137761, 137266, 136627, 136666, 137410, 137712, 136543, 134094, 131243, 128583, 126342, 124623, 123228, 121827, 120608, 120148, 120360, 120384, 119822, 119142, 118499, 117238, 115165, 113232, 112205, 111649, 111004, 110639, 110891, 111038, 110375, 109493, 109327, 109599, 109409, 108830, 108698, 109191, 109725, 109991, 110170, 110389, 110859, 112170, 114555, 117112, 118670, 119126, 119203, 119258, 119212, 119295, 119925, 121000, 122073, 123031, 123972, 124772, 125451, 126551, 128456, 130707, 132725, 134720, 137130, 139732, 142267, 145401, 149966, 155480, 160459, 164036, 166353, 167609, 167736, 166969, 165864, 164700, 163554, 162750]
56546A62750k34p1l77l62J70K47o60j608j597j039q69j081j126j060j306j710
56530A50067j801j589j389j209q67m89l72n73q64q72k33R22J677J221k7r09j044
56513A41649r66q43k60N63O75j18p95o87l40l30k84J54M48M3n96o83k17K51M40
56494A38104L34j31q20j263j156o77j06L89N17O9n04m00M40J269J629J767J853
56477A41314J620J037N26K65Kk83k50J03L42K82J30r1m22m88L8N45J73p88j209
56458A42846q19l20P4Q66J896K190J495P09M27L41L29P98J573J699Q98L2l39o53
56440A54042j146j218n61J44L11K39L59N62P05Q91R55N85J15J78N17K93l38k65
56422A56368P70J699J749J236N64j87n17J62J181J148K8p73o74n31o94l49O68
$$ y = [162750, 162516, 162445, 162068, 161706, 161876, 162123, 161463, 159855, 158258, 157219, 156350, 155269, 154143, 153083, 151777, 150067, 148266, 146677, 145288, 144079, 143212, 142723, 142351, 141778, 140914, 140042, 139809, 140731, 142408, 143629, 143602, 142693, 141649, 140683, 139840, 139580, 140143, 140818, 140700, 139905, 139218, 138878, 138548, 138264, 138418, 138866, 138909, 138313, 137630, 137413, 137664, 138104, 138438, 138307, 137487, 136224, 135068, 134391, 134285, 134674, 135191, 135260, 134756, 134356, 134796, 136065, 137694, 139461, 141314, 142934, 143971, 144497, 144762, 144764, 144481, 144231, 144334, 144676, 144958, 145088, 144997, 144575, 144087, 144125, 144670, 144843, 144055, 142846, 142027, 141707, 141781, 142647, 144543, 146733, 148228, 148937, 149364, 149705, 150034, 150832, 152405, 154104, 155002, 155034, 154695, 154042, 152896, 151678, 151117, 151261, 151572, 151811, 152170, 152732, 153437, 154328, 155283, 155868, 155983, 156161, 156678, 156971, 156633, 156368, 157138, 158837, 160586, 161822, 162386, 162199, 161682, 161844, 163025, 164173, 164201, 163428, 162754, 162223, 161529, 161180, 161848]
56405A61848J210P60L40O88J159J179J189J378J049P7n33k98L8J27O28J492J539
56388A73870O20K81J242K082J646Q94J028J504J409J227J620J924J369N52K82
56373A91550J82j81j15Q37J637J314O15O21Q77M30l37m32K7K76K83L96L90O0j0
56354A98420O47J488J918K249K809L096K664J881J026j44j214r99N09J606J280
56339B17236O83J004J582J449J158J584K257K469K680L425M055M001M005M638
56325B52226M977M255L462L680M096L422K124J515J632J682J653J945K263K252
56311B91184K366K864L020K463K108K595L146L182L531M669N412M902M271M663
56297C40376N219M889M603N643P189P615P016O561O448O345O715P820Q637Q459
$$ y = [161848, 163058, 163818, 164158, 164846, 166005, 167184, 168373, 169751, 170800, 170877, 170344, 170046, 170084, 170211, 170839, 172331, 173870, 174490, 174771, 176013, 178095, 179741, 180635, 181663, 183167, 184576, 185803, 187423, 189347, 190716, 191268, 191550, 191732, 191551, 191436, 192273, 193910, 195224, 195839, 196460, 197337, 197767, 197430, 196998, 197025, 197301, 197584, 197980, 198370, 198430, 198420, 199067, 200555, 202473, 204722, 207531, 210627, 213291, 215172, 216198, 216054, 214840, 213841, 214350, 215956, 217236, 217919, 218923, 220505, 221954, 223112, 224696, 226953, 229422, 232102, 235527, 239582, 243583, 247588, 252226, 257203, 261458, 264920, 268600, 272696, 276118, 278242, 279757, 281389, 283071, 284724, 286669, 288932, 291184, 293550, 296414, 299434, 301897, 304005, 306600, 309746, 312928, 316459, 321128, 326540, 331442, 335713, 340376, 345595, 350484, 355087, 360730, 367919, 375534, 382550, 389111, 395559, 401904, 408619, 416439, 425076, 433535]
56283D33535Q363R348J0408J0370J0042J0619J1407J1345J1307J2554J4209J4674
56271E68181J4444J5136J6724J8003J8835J9834K0816K1587K3137K5989K8652
56260G91338K9862L0984L3875L7800M0917M3559M7270N1809N5811N9509O4191
56249A286925O9757P5285Q0958Q7101R2378R5476R7394R9462J00424R8230R3429
56238B276819Q7693Q0315O9405N5651M1422K7026J1145n570k0841l4241m7059
56227B541765n8953o8044p4307p9692q4806q8286q9568q9482q8207q5276q1500
56216A653644p8310p5323p1049o5666o0725n6577n2643m9392m7373m5061m0698
56205A010827l5525l2119l0219k7523k3947k1601k0796j9652j7615j6035j5215
$$ y = [433535, 441898, 451246, 461654, 472024, 482066, 492685, 504092, 515437, 526744, 539298, 553507, 568181, 582625, 597761, 614485, 632488, 651323, 671157, 691973, 713560, 736697, 762686, 791338, 821200, 852184, 886059, 923859, 964776, 1008335, 1055605, 1107414, 1163225, 1222734, 1286925, 1356682, 1431967, 1512925, 1600026, 1692404, 1787880, 1885274, 1984736, 2085160, 2183390, 2276819, 2364512, 2444827, 2514232, 2569883, 2611305, 2638331, 2649476, 2643906, 2623065, 2588824, 2541765, 2482812, 2414768, 2340461, 2260769, 2175963, 2087677, 1998109, 1908627, 1820420, 1735144, 1653644, 1575334, 1500011, 1428962, 1363296, 1302571, 1245994, 1193351, 1143959, 1096586, 1051525, 1010827, 975302, 943183, 912964, 885441, 861494, 839893, 819097, 799445, 781830, 765795, 750580]
56194G50580j4004j2379j1407j0783r323p628p208p432o488m845m390m635l445
56181F46613j122J8j64L41J588J632O14Q07K413L215K812L166M560M936L928L612
56165F78969M595N094M676N185P127Q754R440J0481J1897J2133J1506J2330J4902
56152G97089J7025J8028J9546K1772K2947K3277K5315K9597L3853L7367M2066
56141A087882M8388N4181N8698O3489O8255P0038O7857O4036N9735N3426M5226
56130A741211L8422L4778L2296K9264K6588K4396K0381J3525O029k56n887j1058
56118A949689j4487j6611k0213k6409l3451m0437m8197n5491n8794n7417n4628
56107A523554n2200m8285m2159l6399l2335k7859k1901j6804j4094j2008r263
$$ y = [750580, 736576, 724197, 712790, 702007, 692684, 685056, 677848, 670416, 663928, 659083, 654693, 650058, 646613, 645491, 645509, 645345, 645686, 647274, 648906, 649520, 650327, 652740, 655955, 658767, 661933, 666493, 671429, 675357, 678969, 683564, 688658, 693334, 698519, 705646, 714400, 723840, 734321, 746218, 758351, 769857, 782187, 797089, 814114, 832142, 851688, 873460, 896407, 919684, 944999, 974596, 1008449, 1045816, 1087882, 1136270, 1190451, 1249149, 1312638, 1380893, 1450931, 1518788, 1582824, 1642559, 1695985, 1741211, 1779633, 1814411, 1846707, 1875971, 1902559, 1926955, 1947336, 1960861, 1966890, 1966634, 1960747, 1949689, 1935202, 1918591, 1898378, 1871969, 1838518, 1798081, 1749884, 1694393, 1635599, 1578182, 1523554, 1471354, 1423069, 1380910, 1344511, 1312176, 1284317, 1262416, 1245612, 1231518, 1219510, 1210247]
56096A210247p135n936l691k50J673J466K103M740O508N878N447P071Q896R642
56082A246659J1099J3863J5266J4222J3525J4821J5899J5507J5946J8268J9813
56071A414888J9244J9220K1199K2663K2305K2879K5753K7733K6696K5408K6406
56060A674394K7864K7863K7947K9261K9814K8736K8478K9977L0629K9740L0534
56049A995237L4022L6638L6821L7899M1408M3982M4146M5549M9874N3418N4482
56038B473476N7071O3071O8196P0144P3315Q0442Q7122R0013R2884R8822J04055
56027C358611J05576J07463J13150J18848J21224J24200J31231J38260J41515
56018D460078J45026J52939J61491J66321J70579J78011J85038J87631J89168
$$ y = [1210247, 1203112, 1197176, 1193485, 1193235, 1194908, 1196374, 1198477, 1203217, 1209725, 1215603, 1221050, 1228121, 1237017, 1246659, 1257758, 1271621, 1286887, 1301109, 1314634, 1329455, 1345354, 1360861, 1376807, 1395075, 1414888, 1434132, 1453352, 1474551, 1497214, 1519519, 1542398, 1568151, 1595884, 1622580, 1647988, 1674394, 1702258, 1730121, 1758068, 1787329, 1817143, 1845879, 1874357, 1904334, 1934963, 1964703, 1995237, 2029259, 2065897, 2102718, 2140617, 2182025, 2226007, 2270153, 2315702, 2365576, 2418994, 2473476, 2530547, 2593618, 2661814, 2731958, 2805273, 2885715, 2972837, 3062850, 3155734, 3254556, 3358611, 3464187, 3571650, 3684800, 3803648, 3924872, 4049072, 4180303, 4318563, 4460078, 4605104, 4758043, 4919534, 5085855, 5256434, 5434445, 5619483, 5807114, 5996282]
56009E996282J93552J97584J98123J99561K06081K13865K19108K26080K38991
56000G889227K53902K67176K83414L06130L29475L48458L68142L93141M17923
55991A0856988M37722M58589M85439N10897N28146N44155N67728N95459O22654
55982A5607777O56383P03226P55618Q05119Q57362R18779R81800J039983J104197
55973B3430244J185760J277329J369433J471182J594276J732290J877730K042551
55965C5980795K237875K452113K676685K934945L256977L646556M104684M661782
55957F1952412N349745O168976P126931Q280939R690812J1353729J3230842J5284665
55949A38439051J7411569J9393311K1015357K2132049K2381516K0860849J6480285
$$ y = [5996282, 6189834, 6387418, 6585541, 6785102, 6991183, 7205048, 7424156, 7650236, 7889227, 8143129, 8410305, 8693719, 8999849, 9329324, 9677782, 10045924, 10439065, 10856988, 11294710, 11753299, 12238738, 12749635, 13277781, 13821936, 14389664, 14985123, 15607777, 16264160, 16967386, 17723004, 18528123, 19385485, 20304264, 21286064, 22326047, 23430244, 24616004, 25893333, 27262766, 28733948, 30328224, 32060514, 33938244, 35980795, 38218670, 40670783, 43347468, 46282413, 49539390, 53185946, 57290630, 61952412, 67302157, 73471133, 80598064, 88879003, 98569815, 109923544, 123154386, 138439051, 155850620, 175243931, 196259288, 218391337, 240772853, 261633702, 278113987]
55942B78113987R002667k89884r185012j5887978j9835972k1447611k1433416
55935A99036781k0405834j8837038j7065363j5279842j3571843j2006036j0614106
55928I1256719r367208q219470p167495o233433n415606m695294m071407l550303
55920D2536503l115895k742388k424078k164661j950170j759436j590141j449698
55912B5340036j330720j218737j114729j028029r55096q85436q20524p67646p22258
55903A6496861o74661o27462n89244n57399n23639m90299m65143m45394m22324
55894A1701296l96863l76217l59554l40854l21699l07975k97753k84923k70938
55885H744520k61137k53457k42469k30607k23869k20053k12589k02548j95695
$$ y = [278113987, 287116654, 286826770, 277641758, 261753780, 241917808, 220470197, 199036781, 178630947, 159793909, 142728546, 127448704, 113876861, 101870825, 91256719, 81889511, 73670041, 66502546, 60269113, 54853507, 50158213, 46086806, 42536503, 39420608, 36678220, 34254142, 32089481, 30139311, 28379875, 26789734, 25340036, 24009316, 22790579, 21675850, 20647821, 19692725, 18807289, 17986765, 17219119, 16496861, 15822200, 15194738, 14605494, 14048095, 13524456, 13034157, 12569014, 12123620, 11701296, 11304433, 10928216, 10568662, 10227808, 9906109, 9598134, 9300381, 9015458, 8744520, 8483383, 8229926, 7987457, 7756850, 7532981, 7312928, 7100339, 6897791, 6702096]
55876F702096j90920j82663j71982j64544j60015j53624j45959j41292j38362
55867E252735j32473j24830j20460j18733j14885j09221j05936j04446j00529
55858D221222r4732r1327r0133q7271q2827q0170p9000p6414p3548p3792p5752
55847C316256p5121p2230p0797p0583o8288o4413o2265o1368n8642n4866n3288
55836B604395n3051n0729m7146m5994m6766m5856m3547m3181m4250m3161m0180
55825B100534l9006l9771l9035l6436l5070l5377l4776l3240l3286l4470l3769
55814A706298l1363l0366l0893l0028k7660k6611k6968k5904k3278k1835k1700
55803A409692k0173j7276j6013j6670j6321j4564j4342j6278j7501j7027j7289
$$ y = [6702096, 6511176, 6328513, 6156531, 5991987, 5831972, 5678348, 5532389, 5391097, 5252735, 5120262, 4995432, 4874972, 4756239, 4641354, 4532133, 4426197, 4321751, 4221222, 4126490, 4035163, 3945030, 3857759, 3774932, 3694762, 3615762, 3539348, 3465800, 3392008, 3316256, 3241135, 3168905, 3098108, 3027525, 2959237, 2894824, 2832559, 2771191, 2712549, 2657683, 2604395, 2551344, 2500615, 2453469, 2407475, 2360709, 2314853, 2271306, 2228125, 2183875, 2140714, 2100534, 2061528, 2021757, 1982722, 1946286, 1911216, 1875839, 1841063, 1807823, 1774537, 1740067, 1706298, 1674935, 1644569, 1613676, 1583648, 1555988, 1529377, 1502409, 1476505, 1453227, 1431392, 1409692, 1389519, 1372243, 1356230, 1339560, 1323239, 1308675, 1294333, 1278055, 1260554, 1243527, 1226238]
55792A226238j9168k0272j9503j8894j9595k0031j9236j8384j8135j7930j8337
55781A016753k0518k3156k3608k2239k1723k2076k0634j7162j4562j3909j3110
55770H04056j1235j0119j0653j1385j1681j2656j4162j4507j3806j4038j5106
55759F64708j4595j2177j0499j0842j1472j1222j1185j1788j1673j0529r963j0499
55747E28264j0678r994r737j0266j0304r608r378r578q784p160o529p160p493
55734D11595p301p817q593p735n656m978o126o695n835n496o458o891o039n623
55720C20352o251n993m046k464k601k994k354j650j610j100K74P47o62k279k535
55705B84834k195k320k357j868k000l539n401o366o593o483n855n128n323o085
$$ y = [1226238, 1207070, 1186798, 1167295, 1148401, 1128806, 1108775, 1089539, 1071155, 1053020, 1035090, 1016753, 996235, 973079, 949471, 927232, 905509, 883433, 862799, 845637, 831075, 817166, 804056, 792821, 782702, 772049, 760664, 748983, 736327, 722165, 707658, 693852, 679814, 664708, 650113, 637936, 627437, 616595, 605123, 593901, 582716, 570928, 559255, 548726, 538763, 528264, 517586, 507592, 497855, 487589, 477285, 467677, 458299, 448721, 439937, 432777, 426248, 419088, 411595, 404294, 396477, 387884, 380149, 374493, 369515, 363389, 356694, 350859, 345363, 338905, 332014, 325975, 320352, 314101, 308108, 304062, 301598, 298997, 296003, 293649, 291999, 290389, 289289, 289563, 290310, 289648, 287369, 284834, 282639, 280319, 277962, 276094, 274094, 270555, 265154, 258788, 252195, 245712, 239857, 234729, 229406, 223321]
55691B23321n808m259k972k529j858q03o60j449j404m9Q72N61M86J476K227J881
55675B09033J451J422N90j358k676k357j702j781j737r83n68r90j032k10J21n46
55659A96677n62Q60J954J380M58O63J226J124J118J775J715K3j611j436n41r36
55643B03887k350l145l155l434m190m804n077m998m221k992k442k894l191k734
55629A54260k558l273l685k858j782j566j616j149q49j426j980j565q94r43j196
55614A26920r22q10j699k876l222k906k536j903r36n89j293j807j111j20p1n35
55598A03584n51m11p18r35n14k57r17j596j231m73m64q13n45n4k22n82j21P59
55580I3939Q98L58J59M64O11M70M77P14J011J508K104K068J171M28O76J233J050
$$ y = [223321, 217513, 213254, 210282, 207753, 205895, 205092, 204432, 202983, 201579, 201530, 202402, 202963, 203449, 204925, 207152, 209033, 210484, 211906, 212496, 211138, 208462, 206105, 204403, 202622, 200885, 199902, 199334, 198344, 197312, 197102, 197223, 196677, 196115, 196975, 198929, 200309, 200767, 201430, 202656, 203780, 204898, 206673, 208388, 208411, 206800, 205364, 204823, 203887, 201537, 198392, 195237, 191803, 187613, 182809, 177732, 172734, 168513, 165521, 163079, 160185, 156994, 154260, 151702, 148429, 144744, 141886, 140104, 138538, 136922, 135773, 134924, 133498, 131518, 129953, 129059, 128116, 126920, 125998, 125188, 123489, 120613, 117391, 114485, 111949, 110046, 109110, 108521, 107228, 105421, 104310, 104190, 104119, 103584, 103033, 102622, 101904, 100969, 100455, 100198, 99281, 97685, 96454, 95981, 95517, 94704, 94159, 94105, 93883, 93301, 93180, 93939, 94837, 95195, 95354, 95818, 96429, 96899, 97376, 98090, 99101, 100609, 102713, 104781, 105952, 106380, 107056, 108289, 109339]
55563A09339K80l09o53j053j350j381j398j200l9J781K508J332k39n72j36j95
55547A06715o04n37j95j75o1O91J403J193N02K10J20k46l78J91N92m8r30q66l08
55528A07269l86q39p08l13p04j674k107j878j761j886j801j653j812j832j230
55513H6685p18j181k026k052j405j039q98l20K39k06j168j181j34O30N48M35P15
55496G6924P17M7p03r81r89j048j139j207j170p47O9O12L97l4K2K58J0m67m74
55477G0097j40o2r3K82P84O96J07l56o93j322j988j989j248k29Q46J773J889R17
55459F9271k08m06O9K49k3k95n86j080j333r87o50q44p93K99J550J570P50N79
55441F7132J129J073J5r99j297j246j019l30M97O40J46j16L9n4n06o62l71j65
$$ y = [109339, 109619, 109310, 108657, 107604, 106254, 104873, 103475, 102275, 102236, 104017, 106525, 107857, 107618, 107046, 106910, 106715, 106111, 105574, 105379, 105204, 105143, 105834, 107237, 108430, 108932, 109142, 109262, 109016, 108638, 108829, 109421, 109373, 108443, 107577, 107269, 106883, 106044, 105336, 105023, 104319, 102645, 100538, 98660, 96899, 95013, 93212, 91559, 89747, 87915, 86685, 85967, 84786, 82760, 80708, 79303, 78264, 77366, 77046, 77285, 77079, 75911, 74730, 74596, 75226, 75774, 76209, 76924, 77641, 77688, 76985, 76004, 75015, 73967, 72828, 71621, 70451, 69704, 69773, 70385, 70782, 70748, 70770, 71028, 71038, 70571, 70097, 69957, 69895, 69802, 70084, 70868, 71564, 71671, 71315, 70622, 69300, 67312, 65323, 64075, 63846, 64692, 66465, 68354, 69271, 69063, 68657, 68726, 68975, 68952, 68657, 68071, 66991, 65658, 64671, 64021, 63177, 62384, 62683, 64233, 65803, 66553, 67132, 68261, 69334, 69349, 68350, 67053, 65807, 64788, 64458, 64955, 65595, 65741, 65625, 65664, 65610, 65104, 64442, 64071, 63906]
55423F3906o9M69J357J786J595J484J744J850J466Q70K60l36n34m9M65Q8r24j477
55405G3951j276r35o77k19J24l63j464k145k028j567q87K02J126J006K10J3O23
55388F5694J017Q20P93J150J106M44J04N63J011P31J7p07j430j809j186L7M07
55371F8762m91j312r49l8M02N91J211J906J743N94p71j568j403l58Q01J093M90
55354G0703j0J20J83m79j290j321o90k72l12k11M16J109J111K46q62j393j155
55337F5893o83m31k49J15M22M51M99P86P82M3p90q05k76j43k98J93J288J823J346
55318F9966P16N08J80o56j340j173l73N64J464J977J470J13q90p91k62k21n01
55301G0751m30j2J96o6o45j272j523r47K21J012Q07O5m26m89l31O0P08J239J220
$$ y = [63906, 63837, 64306, 65663, 67449, 69044, 70528, 72272, 74122, 75588, 76458, 76718, 76382, 75848, 75799, 76264, 76352, 75428, 73951, 72675, 71740, 71063, 70844, 70968, 70605, 69141, 66996, 64968, 63401, 62514, 62716, 63842, 64848, 65058, 65071, 65694, 66711, 67531, 68324, 69474, 70580, 71024, 71128, 71691, 72702, 73433, 73450, 72743, 71313, 69504, 68318, 68355, 68762, 68271, 66959, 66010, 65972, 66374, 66965, 68176, 70082, 71825, 72419, 71648, 70080, 68677, 68319, 69120, 70213, 70703, 70693, 70813, 70996, 70517, 69227, 67906, 67216, 66944, 66632, 66421, 66837, 67946, 69057, 69303, 68441, 67048, 65893, 65210, 64779, 64530, 64645, 65067, 65518, 66017, 66803, 67585, 67628, 66838, 66033, 65757, 65614, 65316, 65509, 66797, 68620, 69966, 70682, 71190, 71370, 70714, 69374, 68201, 67828, 68392, 69856, 71833, 73303, 73416, 72526, 71735, 71473, 71252, 70751, 70321, 70309, 70505, 70439, 69794, 68522, 66999, 66052, 66273, 67285, 68092, 68157, 67731, 67242, 66911, 66971, 67679, 68918, 70138]
55282G0138O78p2q70j629k033j760q30L88J411J847J590Q91J05n50q50n49J55
55265F8060N18J20m96o22m02k89k9Q11J610J255j71j310j305o21K9M79O77M57
55247F8771L1j28p6k69n63l69J62J80m10o77j88L24K64O8K68N85N49K76J08J05
55227F9011K79O39P81J81q46j336j039o39m05K23J343K025J684R26M28n9q36j319
55209G1041r18j03K73J46J7N0R4J99M78P89R17Q01L89k37n62j44M83L29n00q03
55189G2739r0O78O38J49j59l77o69o53k23J8j52J5Q90J536J097J53k88l12m81
55170G4509n27Q7Q62P89j23r52j202j064o25J71R61J257J202J266J369J116O64
55153G9760N10N55J70p65j652j992j879j567j142o34j33L25P39J081J323J407
$$ y = [70138, 70816, 70744, 69874, 68245, 66212, 64452, 63622, 64010, 65421, 67268, 68858, 69749, 69854, 69304, 68454, 67905, 68060, 68578, 68698, 68202, 67580, 67178, 66889, 66860, 67671, 69281, 70536, 70365, 69055, 67750, 67129, 67158, 67637, 68314, 68771, 68802, 68674, 68598, 68329, 67766, 67397, 67559, 67739, 67329, 66652, 66464, 66788, 67052, 67120, 67388, 67973, 68522, 68798, 68906, 69011, 69290, 69929, 70710, 70891, 70045, 68709, 67670, 67031, 66626, 66849, 68192, 70217, 71901, 72827, 73255, 73196, 72360, 71041, 70123, 70020, 70293, 70439, 70456, 70506, 70600, 70799, 71277, 72066, 72983, 73784, 74173, 73936, 73374, 73230, 73713, 74042, 73542, 72739, 72649, 73327, 73965, 74114, 73955, 73578, 72909, 72256, 72033, 72051, 71899, 71914, 72804, 74340, 75437, 75590, 75302, 74990, 74509, 73982, 74069, 74931, 75720, 75597, 74645, 73443, 72379, 71754, 71925, 72886, 74143, 75345, 76611, 77980, 79096, 79760, 80270, 80825, 80995, 80230, 78578, 76586, 74707, 73140, 71998, 71364, 71231, 71556, 72295, 73376, 74699, 76106]
55137G6106J121L62m36o69l70j65k89l72l31n64j016r63k18M25N29P83J629K164
55119G7726J405k0o61k02M45O78P38R03R97Q00K54o35j629k196k081j604j048
55102G3870k47P47J291J088Q58J223J583J091K01J28R75J577J174L15q2K22P93
55085H6807J094R02N08M38P46Q84N15k5l71o62r72r00l85j55o04r14k28Q89J175
55066H8742M44m61j059j482j628j255p99r71j525j460n08N68J235J728K148K008
55050H5725J097L7m73m55m03o04r28j030o63k0K84r9p54r71n82J9M43N32K88m6
55030H1397j14L5J5p0M81J705K430J760M33k35j14J1o1K6Q2l51q28m52M86O19
55010H7255n21j829k143j506n96J26M23K17j48j78J15M32R05J796K533K166Q20
$$ y = [76106, 77227, 77589, 77153, 76484, 76114, 75949, 75660, 75288, 74957, 74393, 73377, 72414, 72196, 72621, 73150, 73933, 75562, 77726, 79131, 79111, 78450, 78248, 78693, 79371, 80109, 81012, 82009, 82809, 83063, 82428, 80799, 78603, 76522, 74918, 73870, 73623, 74370, 75661, 76749, 77607, 78830, 80413, 81504, 81705, 81833, 82808, 84385, 85559, 85874, 85792, 86014, 86807, 87901, 88803, 89311, 89749, 90495, 91379, 91894, 91869, 91498, 90836, 89864, 88964, 88579, 88424, 87820, 86906, 86678, 87567, 88742, 89186, 88725, 87666, 86184, 84556, 83301, 82502, 81531, 80006, 78546, 78038, 78606, 79841, 81569, 83717, 85725, 86822, 86859, 86386, 85931, 85528, 84924, 83996, 82966, 82303, 82283, 82567, 82468, 81714, 80743, 80161, 80180, 80623, 81155, 81443, 81397, 81283, 81318, 81333, 81263, 81744, 83449, 85879, 87639, 88072, 87837, 87723, 87734, 87673, 87699, 87781, 87430, 86602, 86150, 86636, 87255, 86734, 84905, 82762, 81256, 80660, 80786, 81209, 81426, 81278, 81100, 81215, 81647, 82552, 84348, 86881, 89047, 89867]
54993H9867k47l15Q1K73L01L29K40J67N47J246J422P22k14p98j158j426j254o25
54975H9158j77j89MP98J467J237N63M07P49Q07L25k11n12p56r79r08m45J90Q28
54956I2356J412J715J504R25M51L05K77R4k34n08n34l28j27j84l85k99K58Q41
54938I7539Q94M85L11Q59J759K132J549N67J69P03J588K085K085J883J573J157
54922A17338J044J754L115M266M676M640M588M364L580K400J389P51N1j208k913
54907A49835m394n036m810m175l585l199l001k931k806k364j622r54o38m85k02
54892A09633J40L12L90N87P79O50L37M19J160K039K285J740J116J313K457L698
54876A29055M139L897L867M422M863M407L121J506k94k261l910m625m461l971
$$ y = [89867, 89620, 89305, 89386, 89659, 89960, 90289, 90529, 90696, 91243, 92489, 93911, 94633, 94419, 93621, 92463, 91037, 89783, 89158, 88981, 88792, 88796, 89594, 91061, 92298, 92861, 93268, 94017, 94824, 95149, 94938, 94426, 93670, 92691, 91783, 91338, 91528, 92356, 93768, 95483, 96987, 97912, 98363, 98668, 98945, 99039, 98805, 98297, 97763, 97435, 97308, 97124, 96739, 96440, 96698, 97539, 98433, 98918, 99229, 100088, 101847, 103979, 105528, 106095, 106264, 106967, 108555, 110640, 112725, 114608, 116181, 117338, 118382, 120136, 123251, 127517, 132193, 136833, 141421, 145785, 149365, 151765, 153154, 153905, 153956, 152748, 149835, 145441, 140405, 135595, 131420, 127835, 124636, 121635, 118704, 115898, 113534, 111912, 110958, 110320, 109835, 109633, 109773, 110085, 110475, 111062, 111841, 112491, 112828, 113247, 114407, 116446, 118731, 120471, 121587, 122900, 125357, 129055, 133194, 137091, 140958, 145380, 150243, 154650, 157771, 159277, 158983, 156722, 152812, 148187, 143726, 139755]
54862A39755l465k971k691k897l360l520l159k523j887j438j460k023k601k495
54848A03265j677o79J47Q13J191J019L55m25j114j695k020j920j527j056m34L40
54832I4583P15K37n84p31o6N29L99j73o11o86l97K26R42J396J482J298Q52K41
54814I9652p0K68Q39Q95L60k39o25q74q29k25O41J102R92O72K79k66p08p52p57
54795A00355j181j485q06L98P06q3n76KP26P36O85J396K274K254J498J003J013
54778A08915R97P66N96M53Q2k40J62J396K814L719L910L535K936K544K575K899
54762A38059L366M005M633M654L662K025M50q44k131l565m803n271m671l377k277
54747A33915j967k093j902j378j248j772k305k257j828j379p19L54J352J486O31
$$ y = [139755, 136290, 133319, 130628, 127731, 124371, 120851, 117692, 115169, 113282, 111844, 110384, 108361, 105760, 103265, 101588, 100909, 101056, 101869, 103060, 104079, 104434, 104009, 102895, 101200, 99180, 97260, 95733, 94677, 94243, 94583, 95298, 95535, 94951, 94220, 94154, 94683, 95082, 94909, 94298, 93612, 93215, 93441, 94383, 95779, 97261, 98559, 99411, 99652, 99582, 99850, 100689, 101584, 101944, 101705, 101080, 100206, 99377, 99152, 99793, 100895, 101887, 102559, 102838, 102572, 101864, 101112, 100355, 99174, 97689, 96883, 97281, 97987, 97904, 97328, 97330, 98056, 98792, 99477, 100873, 103147, 105401, 106899, 107902, 108915, 109912, 110678, 111274, 111727, 111809, 111569, 111731, 113127, 115941, 119660, 123570, 127105, 130041, 132585, 135160, 138059, 141425, 145430, 150063, 154717, 158379, 160404, 160854, 160010, 157879, 154314, 149511, 144240, 139569, 136192, 133915, 131948, 129855, 127953, 126575, 125327, 123555, 121250, 118993, 117165, 115786, 115067, 115421, 116773, 118259, 118890]
54732A18890n31j135o62P57K314L093K988K710K819L135L324L455L675L831L792
54717A52455L644L267K205L25j821l577m664m896m152k953k298k407k377j659
54703A31092j081j586k657l071k687k392k506k349j530o40m04p67j177j275j107
54688A05863q97q08p75n74j95O7J2k10m67q79j356j339m56P55J377J167O63L59
54670A02307L09M21O32P56N09j26q51j279j167n70L1R2l44n47k3P48R29M61J10
54651A02398L99R31Q77Pj012j330q10j20J60J66K77L74J29k26k03J3k18q12r44
54632A00056m49j65n45q78n43m3j8j37J14K99k05q67o32M45J315J525J532J525
54614A02329J067J42m56k29L12M19P8k14j93rJ07M6j16j87l3L21Q13J417J945
$$ y = [118890, 118359, 117224, 116562, 117319, 119633, 122726, 125714, 128424, 131243, 134378, 137702, 141157, 144832, 148663, 152455, 156099, 159366, 161571, 161896, 160075, 156498, 151834, 146938, 142786, 139833, 137535, 135128, 132751, 131092, 130011, 128425, 125768, 122697, 120010, 117618, 115112, 112763, 111233, 110593, 110189, 109422, 108245, 106970, 105863, 104966, 104158, 103383, 102809, 102614, 102681, 102693, 102483, 102016, 101137, 99781, 98442, 97986, 98741, 100118, 101285, 101948, 102307, 102616, 103037, 103669, 104425, 104934, 104808, 103957, 102678, 101511, 100941, 100972, 101064, 100720, 100173, 100150, 100898, 101827, 102288, 102398, 102797, 103728, 104605, 104612, 103600, 102270, 101460, 101340, 101500, 101666, 101943, 102317, 102446, 102220, 102017, 102030, 101812, 101000, 100056, 99607, 99442, 98897, 98019, 97476, 97433, 97415, 97278, 97392, 97691, 97486, 96619, 95987, 96432, 97747, 99272, 100804, 102329, 103396, 103538, 103082, 102853, 103165, 103584, 103662, 103448, 103255, 103246, 103353, 103399, 103283, 103096, 103063, 103384, 104197, 105614, 107559]
54595A07559K041J601R82N34J65l31q38j117j147r49l92L97Q18M82j79m84m00
54578A08742l42l79l02k17l49m35MQ00J289J251J062Q86M62k11o24m87j98j89
54560A10763l05j26L29O26M62k6n12q07r13q70o09r1N64J166J615J809J538Q32
54542A15445K60L96R81J206Q51M91M39K63l28r04j098j212j503j531r32k00P4
54525A12698J41M61O38K5r59j168l42N45N77j85j081j539j322o22N5M53Q07J187
54507A10369J111L72l04j51M57O02K12p2q6j64j74L45J125J354R40N98N26J36
54489A17196o53r59l28L88K10n97r83n44J47L83J02j51J77R74J501J284P58O75
54471A19580J105J517J646J624J460J049O51O04O37K03n38q49n38j72q8l7J03
$$ y = [107559, 109600, 111201, 112183, 112717, 112882, 112551, 111713, 110596, 109449, 108500, 108108, 108505, 109323, 109805, 109626, 109142, 108742, 108400, 108021, 107719, 107502, 107153, 106718, 106722, 107522, 108811, 110062, 111124, 112010, 112472, 112261, 111637, 111150, 110952, 110763, 110458, 110332, 110661, 111287, 111749, 111723, 111211, 110404, 109491, 108621, 108012, 107921, 108485, 109651, 111266, 113075, 114613, 115445, 115705, 116101, 117082, 118288, 119139, 119630, 120069, 120332, 120004, 119100, 118002, 116790, 115287, 113756, 112824, 112624, 112698, 112839, 113300, 113938, 113963, 113004, 111836, 111494, 112039, 112616, 112431, 111350, 109811, 108489, 107867, 107922, 108375, 109182, 110369, 111480, 111852, 111548, 111397, 111854, 112456, 112668, 112596, 112510, 112346, 112172, 112517, 113642, 114996, 115936, 116534, 117060, 117196, 116543, 115584, 115256, 115644, 115854, 115257, 114274, 113730, 113877, 114260, 114362, 114211, 114388, 115362, 116863, 118147, 118905, 119580, 120685, 122202, 123848, 125472, 126932, 127981, 128632, 129236, 129873, 130076, 129538, 128689, 128151, 127979, 127891, 127854, 127957]
54454A27957R1J2L38J037J309O06o82j788k246j911r82k07l50j129j405o52M83
54437A20481J208J479J526J305Q42M39J54l14q29p01K17J027R23K21k23j05L29
54420A27979Q45J161Q81J0q25j096r54o94k40L96O93L06k94m27j07K24M26N57
54402A28841M44J3k19K56J105J513J289R32P26M57P1l0L57Q08Q39N80N14O98O27
54383A39821J1o37n04L71R81N63l88p47j82O23J042J146J218J260J224J202J183
54366A48187J014Q43J143J975K637K423J469N62K54L78L58j57q87j246j065q66
54350A57022j136j679k042k214k373k272j663j019j002j326j138m46j29m53o92
54335A37438m59k24j75K72J214J631Q60k40n18j11M6k73o32r23j319j562j199
$$ y = [127957, 128048, 128060, 128398, 129435, 130744, 131350, 130668, 128880, 126634, 124723, 123741, 123534, 123184, 122055, 120650, 119998, 120481, 121689, 123168, 124694, 125999, 126841, 127280, 127434, 127120, 126291, 125590, 125807, 126834, 127757, 127978, 127755, 127650, 127979, 128824, 129985, 130866, 130876, 130051, 128955, 128001, 127307, 127067, 127463, 128156, 128462, 128168, 127741, 127634, 127858, 128284, 128841, 129285, 129298, 129079, 129335, 130440, 131953, 133242, 134174, 134900, 135357, 135428, 135398, 135755, 136563, 137402, 137982, 138496, 139194, 139821, 139832, 139195, 138691, 139062, 140043, 140606, 140218, 139471, 139289, 139912, 140954, 142100, 143318, 144578, 145802, 147004, 148187, 149201, 150044, 151187, 153162, 155799, 158222, 159691, 160253, 160507, 160885, 161243, 161086, 160199, 158953, 157888, 157022, 155886, 154207, 152165, 149951, 147578, 145306, 143643, 142624, 141622, 140296, 139158, 138712, 138583, 138130, 137438, 136979, 136755, 136580, 136852, 138066, 139697, 140557, 140317, 139799, 139688, 139734, 139461, 138829, 137906, 136587, 135025, 133826]
54318A33826m07K01M66O97R08P24L6p05r70o46j10P1l09p36n67k0L3o45j251j103
54298A29493m92O0N25Q30M82n29j154n77N89J224J257J304J344Q79J09k44j69
54281A34931l11p15o66Q2P77O65k08j320k192k446j868o18Q93K323L269L202K022
54264A37820N08m02n40k92K03Q94J276R18L36L64P98P08N7j61L99P62J43q15j032
54245A41944n23j80m34q44q42l55K83P15Q02O94O06N65M92M73O35Q14O76K28j51
54226A45598k53k87n33r68j350j470j255p96l06P5L39L71J3n27o62k44P8k15o12
54207A36996k79N95J023O13k7l24l37k23J65Q20J383J621J571J106L3j186j520
54190A42030o37N73J104R56P08N59L53J61J54J45j67o11o78k62K01L16J54k4j63
$$ y = [133826, 133419, 133620, 134086, 134783, 135691, 136415, 136451, 135746, 134776, 134130, 134020, 134091, 133782, 133046, 132479, 132459, 132492, 131847, 130596, 129493, 129001, 129061, 129586, 130416, 130898, 130369, 129215, 128638, 129227, 130451, 131708, 133012, 134356, 135235, 135344, 135100, 134931, 134620, 133905, 133239, 133321, 134098, 134763, 134555, 133235, 131043, 128597, 126729, 126111, 127004, 129327, 132596, 135798, 137820, 138328, 137926, 137386, 137094, 137297, 138191, 139467, 140385, 140721, 141085, 141883, 142591, 142648, 142487, 142886, 143648, 143791, 142976, 141944, 141421, 141241, 140807, 139963, 139121, 138766, 139049, 139764, 140566, 141260, 141866, 142431, 142923, 143396, 144031, 144845, 145521, 145749, 145598, 145345, 145058, 144525, 143557, 142207, 140737, 139482, 138686, 138380, 138455, 138794, 139165, 139178, 138651, 137989, 137745, 137823, 137608, 136996, 136717, 137312, 138335, 138948, 138921, 138597, 138260, 138037, 138202, 139022, 140405, 142026, 143597, 144703, 144736, 143550, 142030, 141393, 141966, 143070, 144026, 144734, 145293, 145646, 145807, 145961, 146106, 145939, 145328, 144650, 144388, 144589, 144905, 145059, 145035, 144872]
54171A44872m39j006j742k248k141j394l79M04O50L46j70l71K5O84R94Q03N01
54154A39389L85L06J09mJ17J64j73n38k33O99J294P86l67j045p99k14J03K86P28
54135A40993J256J350R38N04L28K05n8l10l73k97q2L55P34M85m07j018n35O77
54117A44745J593J773J604J451J228Q59N80O30R31J227J329J205J053J164J588
54102A62960K031K224K236K218K161K126K389K963L278K728J395j86j676k874
54088A83973l381k915j869r59m13N0N55R38J192J481J747J752J510J218Q42K87
54072A86008j71j97j9j64n87p84p12q76j376j587j160o40o99j167j305p68M1N06
54054A74343M29J61J59M87R19J528K625L928M364L335J723Q96J058J425J695K288
$$ y = [144872, 144433, 143427, 141685, 139437, 137296, 135902, 135523, 135927, 136577, 136923, 136753, 136382, 136407, 137091, 138085, 138888, 139389, 139774, 140080, 140189, 140185, 140302, 140466, 140293, 139755, 139522, 140221, 141515, 142301, 141934, 140889, 140090, 139876, 139979, 140265, 140993, 142249, 143599, 144537, 145041, 145369, 145574, 145516, 145206, 144833, 144536, 144454, 144809, 145543, 146028, 145621, 144603, 144068, 144745, 146338, 148111, 149715, 151166, 152394, 153253, 153833, 154463, 155394, 156621, 157950, 159155, 160208, 161372, 162960, 164991, 167215, 169451, 171669, 173830, 175956, 178345, 181308, 184586, 187314, 188709, 188523, 186847, 183973, 180592, 177677, 175808, 174849, 174436, 174486, 175041, 175979, 177171, 178652, 180399, 182151, 183661, 184879, 185721, 186008, 185837, 185640, 185621, 185457, 184870, 184086, 183374, 182498, 181122, 179535, 178375, 177735, 177036, 175869, 174564, 173796, 173837, 174343, 174772, 174933, 175092, 175579, 176498, 178026, 180651, 184579, 188943, 192278, 194001, 194897, 195955, 197380, 199075, 201363]
54038B01363L214L810L827L761L838L618K965K543K813L297L367L115K905K625
54024B47061K042J373R60O83K25l78q60j127j237j242j330j749k354k621k425
54009B37021k313k739l434l844l806l455k910k407k305k572k640k161j492j095
53995A99848q70n28k26k85n87p41o41m69l26k90n59j139j577j469j060r31j214
53978A86936j390q67M16J867K635K374J620J115Q25K26n22m35R24K752M127N117
53962B07720O157P017P148O565N569M007J694p15k241k844l317l941m088l313
53948B25418k065j042m44j24L1J88O16J344K033K386K461K425K267J950J644J589
53932B40677J836K271K828L501M144M371L864K864K225K681M001N084N016L916
$$ y = [201363, 204577, 208387, 212214, 215975, 219813, 223431, 226396, 228939, 231752, 235049, 238416, 241531, 244436, 247061, 249103, 250476, 251436, 252119, 252344, 251966, 251106, 249979, 248742, 247500, 246170, 244421, 242067, 239446, 237021, 234708, 231969, 228535, 224691, 220885, 217430, 214520, 212113, 209808, 207236, 204596, 202435, 200943, 199848, 198978, 198450, 198224, 197939, 197352, 196611, 195970, 195501, 195175, 194885, 194326, 193187, 191610, 190141, 189081, 188150, 186936, 185546, 184679, 185095, 186962, 189597, 191971, 193591, 194706, 195531, 195757, 195235, 194800, 195724, 198476, 202603, 207720, 213877, 220894, 228042, 234607, 240176, 244183, 245877, 245162, 242921, 240077, 236760, 232819, 228731, 225418, 223353, 222311, 221867, 221743, 221774, 221962, 222578, 223922, 225955, 228341, 230802, 233227, 235494, 237444, 239088, 240677, 242513, 244784, 247612, 251113, 255257, 259628, 263492, 266356, 268581, 271262, 275263, 280347, 285363, 289279]
53918B89279K769K582L640N254O265O111N420N132N201M704L289J721P37J55m44
53903C41815r48j181j548k356l056k925k215j843k228l093m100m923n026m256
53889C02117l548m009n375o267o101n702n814n941n236l784k363j467j100j247
53875B44163j912k831l515l632l185k505k122k362k917l086k576j834j457j561
53861B08668j906k209k160j470l23M64J78r18j817j859j330q90p18m98m1L68M03
53844A93942K10J55K25J6n70j071j059o49j71L46R51J345J159N91K23K78M85O60
53826A97066R54J441J820J717J009q8j089j387p88J90Q19R81J112J416J666J794
53810B08633K070K516K711K462K183K223K347K290K391L069M005M444M187L690
$$ y = [289279, 292048, 294630, 298270, 303524, 309789, 315900, 321320, 326452, 331653, 336357, 339646, 341367, 342104, 342259, 341815, 340867, 339686, 338138, 335782, 332726, 329801, 327586, 325743, 323515, 320422, 316322, 311399, 306373, 302117, 298569, 294560, 289185, 282918, 276817, 271115, 265301, 259360, 254124, 250340, 247977, 246510, 245410, 244163, 242251, 239420, 235905, 232273, 229088, 226583, 224461, 222099, 219182, 216096, 213520, 211686, 210229, 208668, 206762, 204553, 202393, 200923, 200600, 201064, 201242, 200324, 198507, 196648, 195318, 194428, 193710, 193212, 193171, 193539, 193942, 194152, 194307, 194532, 194548, 193978, 192907, 191848, 191199, 191028, 191374, 192325, 193670, 194829, 195420, 195643, 195921, 196406, 197066, 198020, 199461, 201281, 202998, 204007, 203919, 202830, 201443, 200655, 200845, 201664, 202645, 203757, 205173, 206839, 208633, 210703, 213219, 215930, 218392, 220575, 222798, 225145, 227435, 229826, 232895, 236900, 241344, 245531, 249221]
53796B49221L243K645J827J216J201J653K208K627K673K004O69o04j149j281j895
53781B66258l173m220m238l520k912k716k636k525k593k861l028k974k933l020
53767B22909l001k764k569k598k552k067j277o98o81j210k016k611k492j663p21
53752A93989k22p4M2O1k41o09n35n0K55J40J09O83J629K199J936J013k4o86q37
53733A98778p39o90o03j34P55J548J701J201N32K10M79J240K038K246J574M28
53717B10564m35o39l84O5P52J705K513K683K346K190K540K948K858K281J527P06
53701B34220o1k53N41J875K824L098L163L245K963K156J360J073J134J169J211
53686B59718J363J335Q07p2r15j515j680j100J06J118J241P44L48K14k0m66q87
$$ y = [249221, 252464, 255109, 256936, 258152, 259353, 261006, 263214, 265841, 268514, 270518, 271187, 270583, 269434, 268153, 266258, 263085, 258865, 254627, 251107, 248195, 245479, 242843, 240318, 237725, 234864, 231836, 228862, 225929, 222909, 219908, 217144, 214575, 211977, 209425, 207358, 206081, 205383, 204702, 203492, 201476, 198865, 196373, 194710, 193989, 193767, 193693, 193735, 193796, 193555, 192946, 192411, 192361, 192616, 192756, 192865, 193548, 195177, 197376, 199312, 200325, 200301, 199615, 198778, 198039, 197349, 196746, 196612, 197367, 198915, 200616, 201817, 202349, 202559, 203038, 204278, 206316, 208562, 210136, 210564, 210129, 209490, 209106, 209171, 209923, 211628, 214141, 216824, 219170, 221360, 223900, 226848, 229706, 231987, 233514, 234220, 234159, 233906, 234447, 236322, 239146, 242244, 245407, 248652, 251615, 253771, 255131, 256204, 257338, 258507, 259718, 261081, 262416, 263223, 263151, 262236, 260721, 259041, 257941, 258047, 259165, 260406, 261150, 261498, 261712, 261692, 261226, 260339]
53669B60339j161j228p97K51J327J653J245P42M02J3k94l6O24P40j97j480k052
53652B60091j647p44J46P87J072J086J080J188J304J406J685K193K579K480J991
53637B76697J517J314J312J324J269J276J588K256K923L111K764K338K256K454
53623C04399K572K409K075J775J567J388J206J092J061J002R27J117J727K370
53609C26687K566K572L078L953M130L109J784J179J118R99J092J904K765K437
53595C59373J049N8J36M30K64K10Q28J396J001N5l13P0L35K8k75N5P42Q86o9j736
53575C64523l038l092k001p34j75l34n58l18K62N89K70k89k26O65J433J154K70
53558C58401O1R13J914K276K205K085J728J033O04R55J609J750J423J387J951
$$ y = [260339, 259178, 257950, 257153, 257404, 258731, 260384, 261629, 262371, 262773, 262786, 262492, 262456, 263080, 263820, 263623, 262143, 260091, 258444, 257700, 257846, 258633, 259705, 260791, 261871, 263059, 264363, 265769, 267454, 269647, 272226, 274706, 276697, 278214, 279528, 280840, 282164, 283433, 284709, 286297, 288553, 291476, 294587, 297351, 299689, 301945, 304399, 306971, 309380, 311455, 313230, 314797, 316185, 317391, 318483, 319544, 320546, 321473, 322590, 324317, 326687, 329253, 331825, 334903, 338856, 342986, 346095, 347879, 349058, 350176, 351175, 352267, 354171, 356936, 359373, 360422, 360480, 360616, 361046, 361310, 361520, 362348, 363744, 364745, 364800, 364487, 364557, 364892, 364920, 364645, 364700, 365442, 366328, 366259, 364523, 361485, 358393, 356392, 355658, 355483, 355149, 354591, 354273, 354535, 355124, 355394, 355105, 354879, 355544, 356977, 358131, 358401, 358462, 359375, 361289, 363565, 365770, 367855, 369583, 370616, 371220, 372175, 373784, 375534, 376957, 378344, 380295]
53543C80295K663L074L172L046K713K436K729L760M976N560N280M728M675N255
53529D34362N920O250O552P388Q662R633R753R222Q715Q871R964J1589J2772J2917
53515E62570J2572J2766J3650J4420J4603J4628J4973J5543J6141J6792J7281
53504G25939J7109J6362J5896J6176J6629J6578J6203J5954J5719J5187J4502
53493I02254J3985J3640J3458J3633J3980J3826J3089J2705J3243J3823J3444
53482A051080J2613J2538J3194J3479J2992J2357J1848J1000R669Q397P438O466
53470A183071N387M543L824K538M53j795l605m968n918o261o203o425p111p590
53456A149940p403p123p602q834j0088j0770j0833j0589j0419j0465j0443j0109
$$ y = [380295, 382958, 386032, 389204, 392250, 394963, 397399, 400128, 403888, 408864, 414424, 419704, 424432, 429107, 434362, 440282, 446532, 453084, 460472, 469134, 478767, 488520, 497742, 506457, 515328, 525292, 536881, 549653, 562570, 575142, 587908, 601558, 615978, 630581, 645209, 660182, 675725, 691866, 708658, 725939, 743048, 759410, 775306, 791482, 808111, 824689, 840892, 856846, 872565, 887752, 902254, 916239, 929879, 943337, 956970, 970950, 984776, 997865, 1010570, 1023813, 1037636, 1051080, 1063693, 1076231, 1089425, 1102904, 1115896, 1128253, 1140101, 1151101, 1160770, 1169167, 1176605, 1183071, 1188458, 1193001, 1196825, 1199363, 1199816, 1198021, 1194416, 1189448, 1183530, 1177269, 1171066, 1164641, 1157530, 1149940, 1142537, 1135414, 1127812, 1118978, 1108890, 1098120, 1087287, 1076698, 1066279, 1055814, 1045371, 1035262]
53444A035262r767r818r919r308q051p027o455n396l205o76R38J378J281J200
53430I70437J362J937K852L703M329N086O097O815O946P170Q197R616J0541J1061
53416A056149J2030J3622J5090J5905J6295J6618J7051J7909J9406K1020K1894
53405A242989K2051K2400K3364K4370K4991K5723K7115K8886L0438L1671L2708
53394A536706L3437L3935L4766L6156L7342L7479L6841L6364L6242L5889L5069
53383A930226L4162L3253L1827K9635K7161K4954K3024K1205J9488J7751J5582
53372B208268J2790R691O576L339j00l423o453r671j3654j8179k2351k5481k7503
53359B113849k8681k9356k9879l0430l0848l0933l0714l0254k9395k8084k6761
$$ y = [1035262, 1025495, 1015677, 1005758, 996450, 988399, 981372, 974917, 969521, 966316, 965640, 966578, 967956, 969237, 970437, 971799, 973736, 976588, 980291, 984620, 989706, 995803, 1002618, 1009564, 1016734, 1024931, 1034547, 1045088, 1056149, 1068179, 1081801, 1096891, 1112796, 1129091, 1145709, 1162760, 1180669, 1200075, 1221095, 1242989, 1265040, 1287440, 1310804, 1335174, 1360165, 1385888, 1413003, 1441889, 1472327, 1503998, 1536706, 1570143, 1604078, 1638844, 1675000, 1712342, 1749821, 1786662, 1823026, 1859268, 1895157, 1930226, 1964388, 1997641, 2029468, 2059103, 2086264, 2111218, 2134242, 2155447, 2174935, 2192686, 2208268, 2221058, 2230749, 2237325, 2240664, 2240564, 2237141, 2230688, 2221017, 2207363, 2189184, 2166833, 2141352, 2113849, 2085168, 2055812, 2025933, 1995503, 1964655, 1933722, 1903008, 1872754, 1843359, 1815275, 1788514]
53348A788514k5969k5752k5820k6136k6763k7307k7150k6361k5665k5347k4762
53337A501482k3239k1021j8930j7413j6270j5124j3821j2511j1553j1191j1260
53326A329149j1289j1061j0861j1098j1813j2606j2953j2592j1804j1183j0974
53315A200915j0763j0170r494r167q781p516n488l790k978k481j828j460j611
53302A125388j389M9K015L118L267L729N246P178Q640R572J0354J1122J1841J2572
53288A212702J3244J3611J3662J3690J3726J3267J1910R950Q060O631N641M935
53276A341029M260L199J423r26l286n176o605p915r381j0882j2108j3030j3991
53263A266611j5175j6209j6576j6428j6566j7522j8918j9927k0186j9995j9760
$$ y = [1788514, 1762545, 1736793, 1710973, 1684837, 1658074, 1630767, 1603617, 1577256, 1551591, 1526244, 1501482, 1478243, 1457222, 1438292, 1420879, 1404609, 1389485, 1375664, 1363153, 1351600, 1340409, 1329149, 1317860, 1306799, 1295938, 1284840, 1273027, 1260421, 1247468, 1234876, 1223072, 1211889, 1200915, 1190152, 1179982, 1170488, 1161321, 1152540, 1145024, 1139536, 1135746, 1132768, 1130287, 1128459, 1126999, 1125388, 1123999, 1124048, 1126063, 1129181, 1132448, 1136177, 1141423, 1148601, 1157241, 1166813, 1177167, 1188289, 1200130, 1212702, 1225946, 1239557, 1253219, 1266909, 1280635, 1293902, 1305812, 1315762, 1323822, 1330453, 1336094, 1341029, 1345289, 1348488, 1349911, 1348985, 1345699, 1340523, 1333918, 1326003, 1316622, 1305740, 1293632, 1280602, 1266611, 1251436, 1235227, 1218651, 1202223, 1185657, 1168135, 1149217, 1129290, 1109104, 1089109, 1069349]
53252A069349j9473j8860j7875j6885j6325j6250j6367j6396j6274j6020j5639
53241H82985j5237j5077j5300j5699j5879j5548j4645j3399j2376j2143j2575
53230G25107j2761j1913j0352r135q777q734q308p639p468q115r122r959j0628
53217F02196j1336j1867j1772j1187j0888j1255j1663j1305j0300r479r271r388
53205D72485r426r170q374p000n753n597o549p602q051q149q182p827o955o234
53191C67616o155o125n395m387m157m760n163m755m060l852m144m343l917k899
53177C03504j932j805k591l408l403k747k275k370k681k818k740k582k471k479
53163B67202k451k119j645j592k001k036j116P8N27L05K08L79L19j9k04k53n28
$$ y = [1069349, 1049876, 1031016, 1013141, 996256, 979931, 963681, 947314, 930918, 914644, 898624, 882985, 867748, 852671, 837371, 821672, 805793, 790245, 775600, 762201, 749825, 737682, 725107, 712346, 700433, 690081, 680946, 672169, 663435, 655127, 647488, 640020, 631905, 622783, 612824, 602196, 590860, 578993, 567221, 556034, 545146, 533891, 522228, 510923, 500623, 491144, 481873, 472485, 463059, 453889, 445515, 438515, 432762, 427165, 420616, 413014, 404963, 396814, 388632, 380805, 373850, 367616, 361461, 355336, 349941, 345554, 341397, 336637, 331474, 326719, 322659, 318807, 314663, 310320, 306403, 303504, 301572, 299767, 297176, 293768, 290365, 287618, 285343, 282973, 280292, 277474, 274734, 272152, 269681, 267202, 264751, 262632, 260987, 259395, 257394, 255358, 254242, 254320, 254847, 255152, 255360, 255739, 256058, 256039, 255835, 255582, 255054]
53146B55054q51p76o65j270k228k277j199k73l50p32n17O1M11O15Q75P77N5o36
53128B46074n69l7K57L30O27J016J015P52Q04J231J482J196N52j24n73o00k99
53111B53134j60n30j122j436j434j360j237j041j098j666k265k043r18K07M16
53096B37447k98j180j416p86J21M46k7o53q19p13p68p83k32O21P85q7j047r77
53078B29634PP91O69Mm72n49m56l40k04k15n61r83r47m46j27l42o36n36l42n19
53058B23430q59q91p74q83r03k72O67J076R72J062J259P70j83k63Q34J616J025
53041B27683M5l2K61l49j580j958j061J23Q52J324J682J576R79M89M91P41Q57
53024B32123O91J67n72r73o89k44l74p69m02Q69J953K007J390Q49N21J71j97m26
$$ y = [255054, 254203, 253427, 252762, 251492, 249264, 246987, 245788, 245515, 245165, 244433, 243916, 243977, 244388, 245003, 245878, 246655, 246710, 246074, 245505, 245468, 245725, 246055, 246682, 247698, 248713, 249465, 250269, 251500, 252982, 254178, 254730, 254606, 254033, 253433, 253134, 252974, 252444, 251322, 249886, 248452, 247092, 245855, 244814, 243716, 242050, 239785, 237742, 236824, 237031, 237447, 237149, 235969, 234553, 233767, 233888, 234334, 234307, 233654, 232835, 232122, 231354, 230571, 230339, 230960, 231745, 231658, 230611, 229634, 229641, 230432, 231101, 231105, 230633, 230084, 229628, 229288, 229084, 228869, 228308, 227325, 226378, 225932, 225805, 225463, 224827, 224291, 223949, 223430, 222571, 221680, 220906, 220023, 219120, 218848, 219515, 220591, 221563, 222625, 223884, 224654, 224471, 224208, 225042, 226658, 227683, 227728, 227696, 227957, 227608, 226028, 224070, 223009, 223132, 223984, 225308, 226990, 228566, 229545, 230034, 230525, 231266, 232123, 232814, 232981, 232409, 231436, 230747, 230503, 230129, 229360, 228958, 229827, 231780, 233787, 235177, 236026, 236547, 236718, 236521, 236095]
53006B36095m82k96K96J084J348O59m56j021o82J7L70K94K39N43R63J026O38J68
52988B40803j20l14n22o09m68j97K50J094K146K637K114J131N45M91N14L81J64
52971B50040j53n91q62o93k72J62P71J617K089J566L94o21j337k090k619k177
52955B45224p45P81J646J751J157j7j178j629j533j651k072k070j409p52n28l56
52939B36619J8J55k17n85m66j34J6J63N32Q10O07P4m83j038j464j293m17M84P64
52920B34145O14N82P39Q45R13J047J116J058J088J198R23J13n98o55m45o13j018
52903B41052j127r75r57r94p73n61q55j369j283n14J90M67P84J429J914J761J262
52886B39451R47Q08N05j0n16q56r41o26K8N61N11Nl48j02O29J389J793J762J463
$$ y = [236095, 235613, 235317, 235613, 236697, 238045, 238704, 238248, 237227, 236545, 236562, 236932, 237226, 237465, 238008, 238971, 239997, 240635, 240803, 240683, 240369, 239847, 239238, 238770, 238573, 238823, 239917, 242063, 244700, 246814, 247945, 248490, 248981, 249495, 249876, 250040, 249887, 249296, 248434, 247741, 247469, 247631, 248402, 250019, 252108, 253674, 254068, 253447, 252110, 250020, 247401, 245224, 244479, 245260, 246906, 248657, 249814, 249797, 248619, 246990, 245457, 243806, 241734, 239664, 238255, 237503, 236975, 236619, 236637, 236792, 236575, 235990, 235524, 235390, 235406, 235569, 236101, 236911, 237518, 237592, 237109, 236071, 234607, 233314, 232897, 233381, 234145, 234759, 235341, 236080, 236925, 237838, 238885, 240001, 241059, 242147, 243345, 244268, 244381, 243783, 243128, 242683, 242070, 241052, 239925, 238950, 237993, 236999, 236226, 235665, 234810, 233441, 232158, 231644, 231834, 232301, 233085, 234514, 236428, 238189, 239451, 240398, 241206, 241711, 241701, 241185, 240329, 239388, 238762, 238790, 239351, 239862, 239867, 239519, 239417, 240046, 241435, 243228, 244990, 246453]
52867B46453J082O77K65j2k1P1q1n06p74n71k38l96j102j746j841j621j610j890
52849B36139k129k146k042j831j359o92k24k18n20q95j261j443j107l23K87L30
52833B20566K33N19Q89O95J27N8O78J122O72k98r24r14o02l73l44m21m30l27l17
52814B20609n01m84K42J438K157J752N04q47j691j710r88j87ll54n88n88q42j335
52796B16584j282m43K05j38q62q94k85R3mj3L69Q22J019R90Q90Q93J194J577J374
52777B22089M12l97j43O84Q08q0j058j402j239q15j35M75M74M8L0N03M79m30j086
52758B19217l93R57J366N34l17l14K8j19o51q41l82L91J115J775K432K888K819
52741B30505K157J244N56L08L72N26O77Q77J199J617J921J791J099J72m44n64
$$ y = [246453, 247535, 248212, 248477, 248465, 248444, 248515, 248434, 247928, 247154, 246583, 246345, 245949, 244847, 243101, 241260, 239639, 238029, 236139, 234010, 231864, 229822, 227991, 226632, 225940, 225716, 225498, 224978, 224083, 222822, 221379, 220272, 219949, 220236, 220566, 220799, 221318, 222207, 222902, 223029, 223087, 223765, 224887, 225559, 225261, 224337, 223423, 222821, 222448, 222104, 221683, 221253, 220926, 220609, 220108, 219624, 219866, 221304, 223461, 225213, 225717, 224870, 223179, 221469, 220481, 220294, 220291, 219937, 219349, 218761, 217919, 216584, 215302, 214859, 215064, 214926, 214064, 213170, 212885, 212978, 212974, 212961, 213330, 214152, 215171, 216161, 217051, 217944, 219138, 220715, 222089, 222501, 222104, 221961, 222645, 223453, 223373, 222315, 220913, 219674, 218859, 218724, 219199, 219673, 219721, 219751, 220254, 220733, 220303, 219217, 218824, 219781, 221147, 221681, 221364, 221050, 221078, 220959, 220308, 219467, 219085, 219476, 220591, 222366, 224798, 227686, 230505, 232662, 233906, 234462, 234770, 235142, 235668, 236345, 237222, 238421, 240038, 241959, 243750, 244849, 245021, 244577, 244013]
52725B44013n45p96j198j287q61k77j5j39l22l00j51n4o9k02n57j118j506j263
52707B33353m67K72N06M47N77J039J522J608J071K9r85j302p43J26N36L24n2j40
52689B37721M8J91O1k90o16p11o21n47n76n64l40O8M54N82L09k62q01j051j025
52670B32030p88j87P53J406J096J28l92P2Q79J246J176R96O85K42J61Q19J764
52653B42086K253K150J710R73N9m03m7L67j46j211j492p03o3n32j568k029j535
52636B39869m81N67J079Q13L13N99J928L341L839L393K482J242k74j537j966j731
52620B53476j504j598j802j841j563q46J42P60M58m76j193j234q30l47Q9L75L25
52603B42391mk16j4M29P34Q11R01J135J251R15K28k73k68p6j96n18m79O1N18L86
$$ y = [244013, 243468, 242672, 241474, 240187, 239326, 239049, 239034, 238895, 238573, 238273, 238122, 238068, 237999, 237797, 237240, 236122, 234616, 233353, 232886, 233158, 233664, 234111, 234688, 235727, 237249, 238857, 239928, 239957, 238972, 237670, 236927, 237053, 237589, 237913, 237861, 237721, 237769, 237960, 238021, 237731, 237115, 236404, 235783, 235236, 234660, 234096, 233756, 233824, 234278, 234860, 235169, 234907, 234106, 233055, 232030, 231242, 231055, 231808, 233214, 234310, 234438, 234046, 234118, 234997, 236243, 237419, 238415, 239100, 239342, 239503, 240322, 242086, 244339, 246489, 248199, 249172, 249231, 248828, 248781, 249148, 249002, 247791, 246299, 245596, 245533, 245001, 243433, 241404, 239869, 239388, 239955, 241034, 241847, 242160, 242759, 244687, 248028, 251867, 255260, 257742, 258984, 258710, 257173, 255207, 253476, 251972, 250374, 248572, 246731, 245168, 244322, 244464, 245224, 245682, 245206, 244013, 242779, 241949, 241602, 241691, 242066, 242391, 242387, 242171, 242157, 242586, 243320, 244131, 245032, 246167, 247418, 248333, 248561, 248288, 248020, 247944, 247748, 247230, 246751, 246812, 247330, 247716]
52583B47716o9k10J47O71J046J190J000L73m65r88r16n11j75O0L70O43N20L9k05
52564B50236J42N08J09q27j142l15P62J005N24J92K50J80k04m21j14M59R17J120
52546B53381R72M17k31n10m97o98j155j360j176j076j204j032l96rk72l48O66
52529B45472K179K692J729K92n01m46N7N40O16J78l39l38K17Q04J046J008Q23
52512B56029N30K69J87J69L4J6N44J432J828J143k98j653k291k076j328p03p20
52495B53112j175j297o70K38O18J54p60j426j304l83P19J232R18K06l66o02n05
52478B48709r4M02M89k8o29n25M21J484J863J476R13O98P74Q15Q50J291K229L036
52460B64174K995K185J309P02J5r58j681j530p56k66n21j105j436j456j438j485
$$ y = [247716, 247647, 247437, 247584, 248255, 249301, 250491, 251491, 251864, 251399, 250411, 249495, 248984, 248809, 248869, 249239, 249882, 250402, 250441, 250236, 250378, 250886, 250995, 250168, 249026, 248711, 249473, 250478, 251002, 251194, 251444, 251624, 251420, 250999, 250885, 251344, 252261, 253381, 254353, 254770, 254539, 254029, 253532, 252834, 251679, 250319, 249143, 248067, 246863, 245831, 245435, 245426, 245154, 244806, 245472, 247651, 250343, 252072, 252364, 251863, 251417, 251474, 252014, 252630, 252808, 252469, 252131, 252348, 253152, 254198, 255206, 256029, 256559, 256828, 257015, 257184, 257218, 257234, 257778, 259210, 261038, 262181, 261883, 260230, 257939, 255863, 254535, 253832, 253112, 251937, 250640, 249970, 250208, 250826, 250980, 250220, 248794, 247490, 247107, 247826, 249058, 249976, 250182, 249816, 249214, 248709, 248615, 249017, 249506, 249478, 248849, 248324, 248745, 250229, 252092, 253568, 254481, 255179, 255953, 256768, 257618, 258909, 261138, 264174, 267169, 269354, 270663, 271365, 271380, 270422, 268741, 267211, 266455, 266189, 265668, 264563, 263127, 261671, 260233, 258748]
52444B58748j501j441j259p34K15J059R59k03j480j859j363p79n22k91J76O46
52428B50371Q88J106J558K031K156J939J642J303P61Q6m47o01j80J024K804M192
52412B70633M217L175K553L406N163O418O532O039N611N196M289K702P86j010
52398C25710k512l717m527m768m461l854l174k510k019j902k041j853r41K33P51
52383B88415L63j24J99J306K368K760K617K437K436K469K401K287K238K254K304
52368C16730K343K282K015J742J904K571L091K787J884J277J336J564J553J598
52354C44677K037K546K659K566K806L397L830L779L347K808K528K911L882M680
52340C88453M763M655N188O111O442O152O420P922R809J0947J1361J1749J2236
$$ y = [258748, 257247, 255806, 254547, 253813, 254028, 255087, 256046, 255843, 254363, 252504, 251141, 250362, 249840, 249549, 249725, 250371, 251259, 252365, 253923, 255954, 258110, 260049, 261691, 262994, 263755, 263841, 263394, 262793, 262613, 263637, 266441, 270633, 274850, 278025, 280578, 283984, 289147, 295565, 302097, 308136, 313747, 318943, 323232, 325934, 326720, 325710, 323198, 319481, 314954, 310186, 305725, 301871, 298697, 296187, 294168, 292266, 290225, 288372, 287431, 287664, 288415, 288778, 288654, 288853, 290159, 292527, 295287, 297904, 300341, 302777, 305246, 307647, 309934, 312172, 314426, 316730, 319073, 321355, 323370, 325112, 327016, 329587, 332678, 335465, 337349, 338626, 339962, 341526, 343079, 344677, 346714, 349260, 351919, 354485, 357291, 360688, 364518, 368297, 371644, 374452, 376980, 379891, 383773, 388453, 393216, 397871, 403059, 409170, 415612, 421764, 428184, 436106, 445915, 456862, 468223, 479972, 492208]
52327D92208J2478J2579J3008J3731J4173J4104J4031J4565J5762J7213J8432
52316F52284J9115J9273J9172J8956J8367J7114J5530J4529J4683J5499J5807
52305H40329J4911J3266J1966J1508J1305J0495R068P824P212O730N676M090K557
52292I56937J323J03j285k533l282l659m103m732n086m689l716k905k626k339
52278I17408j246N79K214L110L784N019O689P875Q048P752P951Q915R938J0184
52264I98220R697R366R817J0608J0887J0515J0094R921R632Q981Q320P944P533
52251A121535O713N697M783L627J658r41l289m791n564n964o266o776p747r044
52237A093631j0282j1247j1886j1949j1186r963r098q894q803q289p574p115o784
$$ y = [492208, 504686, 517265, 530273, 544004, 558177, 572281, 586312, 600877, 616639, 633852, 652284, 671399, 690672, 709844, 728800, 747167, 764281, 779811, 794340, 809023, 824522, 840329, 855240, 868506, 880472, 891980, 903285, 913780, 922848, 930672, 937884, 944614, 950290, 954380, 956937, 958260, 958363, 957078, 954545, 951263, 947604, 943501, 938769, 933683, 928994, 925278, 922373, 919747, 917408, 916162, 916741, 918955, 922065, 925849, 930868, 937557, 945432, 953480, 961232, 969183, 978098, 988036, 998220, 1007917, 1017283, 1027100, 1037708, 1048595, 1059110, 1069204, 1079125, 1088757, 1097738, 1106058, 1114002, 1121535, 1128248, 1133945, 1138728, 1142355, 1144013, 1143072, 1139783, 1134992, 1129428, 1123464, 1117198, 1110422, 1102675, 1093631, 1083349, 1072102, 1060216, 1048267, 1037081, 1027118, 1018020, 1009126, 1000323, 992034, 984460, 977345, 970561]
52224I70561o034m768l548k941k907k966k752k277j718j102k60Q65K003K768L073
52209I47997L199L438L743L795L334K431J495R64R99J447K095K777L261L283K840
52194I87098K340K198K375K458K135J426N82q2l39k80k68n55j030j537k207l214
52178I91100m313m999n009m448l532k539j879j815k077k148j868j451r62j90Q42
52163I54712J698K015J888J663J568J618J726J821K044K699L692M211L441J686
52149I86482K81K20J198K166K478K309K274K880M095N222N439M602L390K597K550
$$ y = [970561, 964527, 959759, 956211, 953270, 950363, 947397, 944645, 942368, 940650, 939548, 939288, 940153, 942156, 944924, 947997, 951196, 954634, 958377, 962172, 965506, 967937, 969432, 970396, 971395, 972842, 974937, 977714, 980975, 984258, 987098, 989438, 991636, 994011, 996469, 998604, 1000030, 1000612, 1000530, 1000191, 999911, 999643, 999088, 998058, 996521, 994314, 991100, 986787, 981788, 976779, 972331, 968799, 966260, 964381, 962566, 960489, 958341, 956473, 955022, 954060, 953870, 954712, 956410, 958425, 960313, 961976, 963544, 965162, 966888, 968709, 970753, 973452, 977144, 981355, 984796, 986482, 986763, 986983, 988181, 990347, 992825, 995134, 997408, 1000288, 1004383, 1009605, 1015044, 1019646, 1023036, 1025633, 1028183]
$$ [...]
##END NTUPLES=NMR SPECTRUM
##END=
