
##TITLE=AC1242_NUNAH12032_6641810_56OZyya5Ff
##JCAMPDX= 6.0         $$ Bruker NMR JCAMP-DX V2.0
##DATA TYPE= NMR SPECTRUM
##DATA CLASS= NTUPLES
##ORIGIN= BRUKER
##OWNER= Administrator
$$ 1.72 TOPSPIN		Version 2.1
$$ 2012-08-08 14:17:20.406 -0500  Administrator@TOPSPIN
$$ Compression mode = diff/dup
##.OBSERVE FREQUENCY= 400.02188249412
##.OBSERVE NUCLEUS= ^1H
##.ACQUISITION MODE= SIMULTANEOUS (DQD)
##.ACQUISITION SCHEME= undefined
##.AVERAGES= 8
##.DIGITISER RES= 22
##SPECTROMETER/DATA SYSTEM= spect
##.PULSE SEQUENCE= zg30
##.SOLVENT NAME= COFFEE_meoh
##.SHIFT REFERENCE= INTERNAL, COFFEE_meoh, 1, 14.98509
##AUDIT TRAIL= $$ (NUMBER, WHEN, WHO, WHERE, PROCESS, VERSION, WHAT)
$$ ##TITLE= Audit trail, TOPSPIN		Version 2.1
$$ ##JCAMPDX= 5.01
$$ ##ORIGIN= Bruker BioSpin GmbH
$$ ##OWNER= Administrator
$$ $$ C:\Bruker\TOPSPIN/data/COFFEE/nmr/AC1242_NUNAH12032_6641810_56OZyya5Ff/10/pdata/1/auditp.txt
$$ ##AUDIT TRAIL=  $$ (NUMBER, WHEN, WHO, WHERE, PROCESS, VERSION, WHAT)
(   1,<2012-08-08 14:16:55.375 -0500>,<Administrator>,<TOPSPIN>,<go>,<TOPSPIN 2.1>,
      <created by zg
	started at 2012-08-08 14:15:47.062 -0500,
	POWCHK enabled, PULCHK disabled,
       configuration hash MD5:
       6B 1B 68 BB D9 2E 58 E2 7F 35 AD 54 07 DF 0E 41
       data hash MD5: 64K
       78 26 E1 FB 59 86 AC 9B FB D5 1F D7 A4 37 4C C5>)
(   2,<2012-08-08 14:17:09.062 -0500>,<Administrator>,<TOPSPIN>,<proc1d>,<TOPSPIN 2.1>,
      <Start of raw data processing
       efp LB = 0 FT_mod = 6 PKNL = 1 PHC0 = 0 PHC1 = 0 SI = 32K 
       data hash MD5: 32K
       E1 8F D5 FC ED 4D CD 06 A0 17 4D AF 94 DD E3 D8>)
(   3,<2012-08-08 14:17:09.953 -0500>,<Administrator>,<TOPSPIN>,<proc1d>,<TOPSPIN 2.1>,
      <pk PHC0 = 176.5063 PHC1 = 0 
       data hash MD5: 32K
       DE 93 B6 32 93 4F B0 DC D5 9A CC 65 79 9B CF B0>)
(   4,<2012-08-08 14:17:10.468 -0500>,<Administrator>,<TOPSPIN>,<proc1d>,<TOPSPIN 2.1>,
      <abs ABSG = 1 
       data hash MD5: 32K
       EB E5 88 8C E9 A0 4D B4 61 F2 2C 16 A3 36 F3 38>)
(   5,<2012-08-08 14:17:10.796 -0500>,<Administrator>,<TOPSPIN>,<proc1d>,<TOPSPIN 2.1>,
      <abs ABSG = 2 
       data hash MD5: 32K
       31 0D ED 9C A3 51 25 5E 92 5F D3 CD 57 FF FE 0A>)
(   6,<2012-08-08 14:17:11.031 -0500>,<Administrator>,<TOPSPIN>,<proc1d>,<TOPSPIN 2.1>,
      <abs ABSG = 3 
       data hash MD5: 32K
       5D 04 D0 83 D9 E2 1A 6C D6 56 FC 80 1F 28 6B 9D>)
(   7,<2012-08-08 14:17:11.328 -0500>,<Administrator>,<TOPSPIN>,<proc1d>,<TOPSPIN 2.1>,
      <abs ABSG = 4 
       data hash MD5: 32K
       03 6F 4B F5 53 70 48 2B 1A 13 39 BB BC 61 A2 CA>)
(   8,<2012-08-08 14:17:11.656 -0500>,<Administrator>,<TOPSPIN>,<proc1d>,<TOPSPIN 2.1>,
      <abs ABSG = 5 
       data hash MD5: 32K
       DE 68 36 F4 FD 32 DD A5 4A A5 E3 D7 93 22 83 B1>)
$$ ##END=
$$ 
$$ $$ hash MD5
$$ $$ 4A 2E 73 4C 90 E3 1F 53 79 27 99 79 C3 6F F5 4A
##$RELAX= 
##$RELAX= 
##$RELAX= 
##$RELAX= 
##$RELAX= 
##$RELAX= 
##$RELAX= 
$$ Bruker specific parameters
$$ --------------------------
$$ [...]
##$TP= (0..7)
150 150 150 150 150 150 150 150
##$TP07= 0
##$TPNAME0= <>
##$TPNAME1= <>
##$TPNAME2= <>
##$TPNAME3= <>
##$TPNAME4= <>
##$TPNAME5= <>
##$TPNAME6= <>
##$TPNAME7= <>
##$TPOAL= (0..7)
0.5 0.5 0.5 0.5 0.5 0.5 0.5 0.5
##$TPOFFS= (0..7)
0 0 0 0 0 0 0 0
##$TUNHIN= 0
##$TUNHOUT= 0
##$TUNXOUT= 0
##$USERA1= <user>
##$USERA2= <user>
##$USERA3= <user>
##$USERA4= <user>
##$USERA5= <user>
##$V9= 5
##$VALIST= <valist>
##$VCLIST= <CCCCCCCCCCCCCCC>
##$VD= 0
##$VDLIST= <DDDDDDDDDDDDDDD>
##$VPLIST= <PPPPPPPPPPPPPPP>
##$VTLIST= <TTTTTTTTTTTTTTT>
##$WBST= 1024
##$WBSW= 4
##$XGAIN= (0..3)
0 0 0 0
##$XL= 0
##$YL= 0
##$YMAX_a= 465607
##$YMIN_a= -611460
##$ZGOPTNS= <>
##$ZL1= 120
##$ZL2= 120
##$ZL3= 120
##$ZL4= 120
##$ABSF1= 14.98509
##$ABSF2= -5.573092
##$ABSG= 5
##$ABSL= 3
##$ALPHA= 0
##$AQORDER= 0
##$ASSFAC= 0
##$ASSFACI= 0
##$ASSFACX= 0
##$ASSWID= 0
##$AUNMP= <proc_prof1d_extract_pilot.lims>
##$AXLEFT= 0
##$AXNAME= <>
##$AXNUC= <1H>
##$AXRIGHT= 0
##$AXTYPE= 0
##$AXUNIT= <>
##$AZFE= 0.1
##$AZFW= 0.1
##$BCFW= 0
##$BC_mod= 0
##$BYTORDP= 0
##$COROFFS= 0
##$CY= 15
##$DATMOD= 1
##$DC= 0
##$DFILT= <>
##$DTYPP= 0
##$F1P= 0
##$F2P= 0
##$FCOR= 0.5
##$FTSIZE= 32768
##$FT_mod= 6
##$GAMMA= 0
##$GB= 0
##$INTBC= 1
##$INTSCL= 1
##$ISEN= 128
##$LB= 0
##$LEV0= 0
##$LPBIN= 0
##$MAXI= 10000
##$MC2= 0
##$MEAN= 0
##$ME_mod= 0
##$MI= 0
##$NCOEF= 0
##$NC_proc= -8
##$NLEV= 6
##$NOISF1= 0
##$NOISF2= 0
##$NSP= 0
##$NTH_PI= 0
##$NZP= 0
##$OFFSET= 14.98509
##$PC= 1
##$PHC0= 176.5063
##$PHC1= 0
##$PH_mod= 1
##$PKNL= yes
##$PPARMOD= 0
##$PPDIAG= 0
##$PPIPTYP= 0
##$PPMPNUM= 2147483647
##$PPRESOL= 1
##$PSCAL= 4
##$PSIGN= 0
##$PYNMP= <proc.py>
##$REVERSE= no
##$SF= 400.02
##$SI= 32768
##$SIGF1= 0
##$SIGF2= 0
##$SINO= 400
##$SIOLD= 32768
##$SPECTYP= <>
##$SREGLST= <1H.CDCl3>
##$SSB= 0
##$STSI= 32768
##$STSR= 0
##$SW_p= 8223.68421052631
##$SYMM= 0
##$S_DEV= 0
##$TDeff= 65536
##$TDoff= 0
##$TI= <>
##$TILT= no
##$TM1= 0
##$TM2= 0
##$TOPLEV= 0
##$USERP1= <user>
##$USERP2= <user>
##$USERP3= <user>
##$USERP4= <user>
##$USERP5= <user>
##$WDW= 1
##$XDIM= 32768
##$YMAX_p= 441528193
##$YMIN_p= -655766
##$CURPLOT= <Network HP LaserJet P1505>
##$CURPRIN= <$Network HP LaserJet P1505>
##$DFORMAT= <normdp>
##$LAYOUT= <+/1D_H.xwp>
##$LFORMAT= <normlp>
##$PFORMAT= <normpl>
##$SURQMSG= 1
$$ End of Bruker specific parameters
$$ ---------------------------------
##NTUPLES= NMR SPECTRUM
##VAR_NAME=  FREQUENCY,     SPECTRUM/REAL,   SPECTRUM/IMAG
##SYMBOL=    X,             R,               I
##VAR_TYPE=  INDEPENDENT,   DEPENDENT,       DEPENDENT
##VAR_FORM=  AFFN,          ASDF,            ASDF
##VAR_DIM=   32768,         32768,           32768
##UNITS=     HZ,            ARBITRARY UNITS, ARBITRARY UNITS
##FACTOR=    0.250966925370066, 1,           1
##FIRST=     8223.43324360094, -181325,      -133494
##LAST=      0,             -232534,         11083
##MIN=       0,             -655766,         0
##MAX=       8223.43324360094, 441528193,    0
$$ Real data points
##PAGE= N=1
##DATA TABLE= (X++(R..R)), XYDATA
$$ [...]
$$ plain form
19494 169915 25984 -141087 -169014 -152640 -85034 -64912 -293095 -350870 -351218 -180373 -32847
19482 -76094 -291759 35906 66692 -20926 -247918 69282 -106794 -192803 97774 -208030 -68001
19470 -123069 -182202 537757 -20891 -207346 143575 54009 -166345 -174144 -53943 94992 -71325
19458 -4846 132797 -225999 -254336 -271392 -340595 -75827 -7283 -24009 -243864 -184442 -110499
19447 -110499 98264 -244087 -67824 -123031 -625 -314550 36818 162721 94016 -269974 -73021
19435 -70016 381574 341462 172632 -124758 226862 268623 -17899 -57496 254590 -448388
19424 -80481 359034 -100451 -152603 -394864 -3309 -165081 -424054 -49824 69155 -11729 196890
19412 -70555 179017 -175486 161356 150758 19889 2611 176043 -53215 -173440 46831 -49563
$$ packed form
19494A69915B5984a41087k7927J6374O7606K0122k28183n7775l48J70845c2847
19482g6094k15665C5906L0786b0926k26992F9282a06794q6009I7774b08030f8001
19470a23069n9133E37757b0891j86455A43575E4009a66345p799e3943I4992g1325
19458d846A32797b25999k8337j7056o9203g5827g283j6726k19855N9422P3943
19447a10499I8264b44087f7824n5207f25l13925C6818J25903o8705b69974g3021
19435g0016C81574m0112j68830a24758B26862M1761a7899l9597B54590d48388
19424h0481C59034a00451n2152k42261c309j61772k58973d9824F9155a1729A96890
19412g0555A79017a75486A61356j0598A9889B611J73432e3215j20225D6831d9563
$$ plain form
19400 -31909 -250601 -150930 147006 -132291 -42380 267274 -95920 -10954 -25542 -59152 -51410
19389 -51410 207441 -111238 -603532 12307 212550 -17724 223509 -397670 -286018 -208021
19379 -208021 -124712 68333 -357672 -252084 -352237 113117 15086 -193768 42377 31683
19369 31683 16231 -137714 120283 -5053 -152222 -182605 -325481 69006 56860 48408 231022
19358 231022 -187709 -208717 133093 -26369 16427 -150951 -126298 51455 -35360 -342042 -59550
19346 -26164 -291864 190145 211668 -38251 -180822 -181674 -72491 -100311 -335166 -35112 -64949
19335 -64949 27531 -95227 -207147 24243 -199630 -105163 50956 -82939 -160887 -2089 -55219
19324 -55219 -55329 -131900 -168866 18064 75815 -130594 -105570 -415076 -235846 -61454 -271684
$$ packed form
19400c1909k18692R9671A47006a32291d2380B67274i5920a0954j4588l3610P742
19389e1410B07441a11238m92294A2307K00243a7724B23509c97670J11652P7997
19379b08021Q3309F8333c57672J05588j00153A13117A5086a93768D2377j0694
19369C1683j5452a37714A20283e053j47169l0383j42876F9006j2146q452J82614
19358B31022a87709k1008A33093b6369A6427a50951K4653E1455c5360l06682e9550
19346b6164k65700A90145K1523c8251j42571q52g2491k7820k34855c5112k9837
19335f4949B7531i5227j11920B4243a99630R4467E0956h2939p7948b089n3130
19324e5219j10p6571l6966A8064N7751a30594K5024l09506J79230f1454k10230
$$ plain form
19313 -271684 46105 -430883 -9090 47069 25529 -60745 50767 -76308 -109752 -222098 -119755
19302 -119755 -345909 -301308 -206446 87536 42744 -7514 -112646 -303110 111069 -332920 25877
19290 245860 77214 -208309 -125468 -7480 67457 -246925 -210080 -99878 136933 -189274 -193533
19279 -193533 82240 -143661 -61902 -92378 -187827 -5644 142863 -6030 -274735 -126820 -376046
19268 -376046 -72309 -231810 134400 -40767 -278029 -241494 12873 -14735 110692 109546 -185791
19256 -5529 -133257 -299800 -115226 56789 183864 56911 22419 -105160 132131 -99206 -191577
19245 -191577 12890 56774 28570 -150043 138907 -53798 -403531 -119224 -163 -158282 -227592
19234 -227592 -329067 -41365 66850 -284886 -146685 126873 -219223 110724 -419743 98340
$$ packed form
19313b71684D6105d30883i090D7069k1540f0745E0767g6308l3444j12346J02343
19302a19755k26154M4601R4862H7536D2744g514j05132j90464A11069c32920B5877
19290B45860G7214b08309Q2841g480F7457b46925L6845i9878A36933a89274m259
19279a93533H2240a43661f1902l0476r5449e644A42863f030k68705a26820k49226
19268c76046g2309j59501A34400d0767k37262L6535A2873a4735A10692j146a85791
19256e529j27728j66543a15226E6789J27075E6911B2419a05160A32131i9206r2371
19245a91577A2890M3884k8204a50043A38907e3798l49733a19224a63j58119o9310
19234b27592j01475d1365F6850b84886J38201A26873b19223A10724d19743I8340
$$ plain form
19223 -267685 40886 -187061 35196 -99795 -273347 -131482 19092 -106511 -133462 -123853 141059
19211 98325 -254545 62370 -84200 -202814 14101 -148198 -156258 -253032 85879 -104531 164993
19199 -64513 -186998 123371 -134677 155432 -208124 -139654 -71923 135317 -103189 -44666
19188 90215 -15904 113494 251548 61328 60845 -13470 56768 48532 -149295 -99794 -126535 -51031
19175 -2099 41869 -80777 38772 97084 134343 -89150 -129113 155748 -212581 72940 -477789
19163 -205546 -224223 201582 172924 -168395 -313487 98258 -70005 -81991 -270795 25442 -221984
19151 -319015 71146 115644 9637 129804 -68217 -231403 371 -3610 -235577 -41089 -153927
19140 -153927 167808 50164 -173281 -154623 -24433 -138799 -279358 74673 49528 -463557
$$ packed form
19223b67685D0886a87061C5196i9795j73552a31482A9092a06511k6951R609A41059
19211I8325b54545F2370h4200j18614A4101a48198q060r6774H5879a04531A64993
19199f4513j22485A23371a34677A55432b08124O8470O7731A35317a03189d4666
19188I0215a5904A13494J38054F1328m83a3470E6768q236a49295M9501k6741e1031
19175b099D1869h0777C8772N8312L7259h9150l9963A55748b12581G2940d77789
19163b05546j8677B01582k8658a68395j45092I8258g0005j1986j88804B5442b21984
19151c19015G1146M4498I637J20167f8217j63186C71c610k31967d1089j12838
19140a53927A67808E0164a73281J8658b4433j14366j40559G4673k5145d63557
$$ plain form
19129 156784 -95949 -208779 -166879 -251008 -47898 -456592 384045 -326381 -147449 -181125
19119 -181125 43269 140609 -44941 -304317 29110 211452 -13894 71561 -318546 -332113 92158
19107 -130126 -170982 106799 -13482 -137895 -84968 -152539 -204548 1325 -74183 -112170 -62253
19096 -62253 1205 7362 -175990 15549 -257910 -192906 -78077 -79860 -144504 182742 17218 121823
19084 121823 -253908 -328617 282060 -189357 64519 113667 149810 31351 -66929 -239449 -46257
19072 -93086 21040 75195 119690 285359 -196755 54839 -277992 45039 48738 -64556 -26227
19060 -214787 316106 29118 -224025 -115368 162052 -167191 140370 -26991 -44050 71222
19049 36252 -144083 84532 -12567 -84901 365974 -194999 147297 9283 -10555 -149766 -166980
$$ packed form
19129A56784i5949j12830M1900q4129d7898m08694C84045c26381a47449l3676
19119a81125D3269R7340d4941k59376B9110J82342a3894G1561c18546j3567I2158
19107a30126m0856A06799a3482j24413N2927o7571n2009A325g4183l7987M9917
19096f2253A205O157a75990A5549b57910O5004g8077j783o4644A82742A7218J04605
19084A21823b53908p4709B82060a89357F4519M9148L6143C1351f6929j72520d6257
19072i3086B1040N4155M4495J65669a96755E4839b77992D5039L699f4556b6227
19060b14787C16106B9118b24025J08657A62052a67191A40370b6991j7059G1222
19049C6252a44083H4532a2567p2334C65974a94999A47297I283a0555j39211j7214
$$ plain form
19038 -166980 -185801 -290919 -44555 -40965 130395 216137 -194848 193325 -70813 -35970 -381287
19027 -381287 -208156 -20334 69650 -84141 41247 -18137 260531 -333292 -137583 169079
19016 98356 51297 -151201 -112342 -17782 -75532 -26882 -201733 78591 71945 -15633 17325
19004 134641 -202471 -109897 -86383 73327 266068 113147 -57980 -174867 3144 -81346 -215056
18993 -215056 118680 131122 -227438 -40294 -195842 -171167 141552 -160827 -24260 -267008
18983 -267008 -232997 -83848 -85254 -101390 80113 -63775 236659 13574 110835 85211 -114392
18971 412074 418058 356358 541795 -156654 52033 -105959 -32915 -96716 145715 61042 -216963
18959 -145051 104381 -466473 -73331 -121853 82690 98075 -174014 243568 110254 -207203
$$ packed form
19038a66980j8821j05118d4555L590A30395Q5742a94848A93325g0813L4843l45317
19027c81287J73131b0334F9650h4141D1247a8137B60531c33292a37583A69079
19016I8356m7059a51201L8859a7782n7750b6882j74851G8591o646a5633A7325
19004A34641b02471R2574K3514G3327J92741A13147e7980j16887C144h1346j33710
18993b15056A18680J2442b27438d0294j55548K4675A41552a60827b4260k42748
18983b67008L4011h3848j406j6136H0113f3775B36659A3574R7261k5624a14392
18971D12074N984o1700J85437a56654E2033a05959c2915o3801A45715F1042b16963
18959a45051A04381d66473g3331m8522H2690J5385a74014B43568A10254b07203
$$ plain form
18948 163990 -55400 -158251 -50280 2555 10909 -105894 140011 151098 79132 -39666 -242522
18937 -242522 -402729 -311904 -404189 108986 -132716 5165 -147628 -110980 -155756 13487 12616
18926 12616 73737 259120 -92864 -121177 177884 -183347 -16560 333007 55843 -58204 -143561
18915 -143561 -181965 -30019 -263256 101145 -153398 109017 44739 238261 304777 388747
18905 388747 77410 3504 185384 -103520 -151615 -73829 -130923 28268 -324686 -227814 269060
18893 -217016 66866 -140670 -159075 -96708 224827 -333928 102854 -94470 -203603 136901
18882 -225769 -88619 -44151 140435 -65690 87705 -134904 -522049 -42424 187837 94128 78812
18871 78812 -9041 -360590 287753 8990 -219952 -195226 -20558 -373406 -38303 -911 -76121 -154460
$$ packed form
18948A63990e5400j02851e0280B555Q354a05894A40011J1087p1966c9666k02856
18937b42522j60207R0825r2285A08986a32716E165a47628L6648m4776A3487q71
18926A2616O1121J85383i2864k8313A77884a83347a6560C33007E5843e8204q5357
18915a43561l8404c0019k33237A01145a53398A09017D4739J93522O6516Q3970
18905C88747G7410C504J81880a03520m8095g3829n7094B8268c24686R6872B69060
18893b17016F6866a40670j8405O2367B24827c33928A02854i4470j09133A36901
18882b25769h8619d4151A40435f5690H7705a34904l87145d2424A87837r3709j5316
18871G8812i041l51549B87753H990b19952K4726b0558l52848c8303i11p5210p8339
$$ plain form
18859 -154460 -59097 -119710 20043 -223587 -44953 90390 81511 -22648 8343 276313 -32986
18847 -115835 46825 -45068 -103479 71311 -118651 70597 -181656 -53496 -443955 316975 -60581
18835 -58540 -206631 -112686 -329497 -211751 -174957 -110309 -351146 -173409 -57492 -223926
18825 -223926 -392604 28270 -134501 -33914 30004 -32583 230722 236337 44451 220807 47183
18813 304412 191715 233628 142151 174332 262583 -176472 -181886 -215589 125269 157998 -199775
18801 43462 138006 57596 -69366 39042 -25280 -240737 -226732 -90373 -140673 37321 -176666
18789 284255 -265632 -146430 -354743 37090 71085 -91115 -385873 264073 90752 35780
18778 -74125 -272691 14466 -4986 208932 -101846 -217271 -242694 -345541 -51856 38360 -31576
$$ packed form
18859a54460e9097o0613B0043b23587d4953I0390q879b2648H343K67970c2986
18847a15835D6825d5068n8411G1311a18651G0597a81656e3496l90459C16975f0581
18835e8540j48091R3945k16811J17746L6794O4648k40837a73409e7492j66434
18825b23926j68678B8270a34501c3914C0004c2583B30722N615D4451J76356D7183
18813C04412j12697M1913r1477L2181Q8251a76472n414l3703A25269L2729a99775
18801D3462R4544E7596f9366C9042b5280k15457J4005i0373n0300C7321a76666
18789B84255b65632J19202k08313C7090L3995i1115k94758B64073I0752C5780
18778g4125j98566A4466d986B08932a01846j15425k5423j02847e1856C8360c1576
$$ plain form
18766 360393 -9819 32930 -179654 141069 -156052 19535 11434 12223 15714 -88375 -43619 -88240
18754 -88240 -411236 -228437 -129279 47904 66801 62009 35014 -49898 -300558 34812 -130752
18742 132003 22588 -141951 18778 -138731 -36697 -261989 -279645 103725 -60299 14655 -72460
18730 60975 57397 -221320 144446 -261246 126085 126249 -310620 -93545 57238 198202 -74462
18718 202339 -343471 -200678 -384046 32167 -136295 -437841 46486 79965 -165128 -40748
18707 -348561 -120858 -85827 -21268 -154880 109652 -224685 133934 139391 -39139 386580
18696 166481 100885 -23160 61192 80992 -224344 23971 -227192 -16513 -169934 -116597 85564
18684 -164632 43412 -204291 48970 -116777 197171 -67178 15307 -192260 -85100 -319565
$$ packed form
18766C60393i819C2930a79654A41069a56052A9535q101P89L491h8375d3619m4621
18754h8240l22996J82799R9158D7904J8897m792k6995d9898k50660C4812a30752
18742A32003B2588a41951A8778a38731c6697k25292j7656A03725f0299A4655g2460
18730F0975l578b21320A44446b61246A26085J64c10620i3545E7238J40964g4462
18718B02339c43471J42793j83368C2167a36295l01546D6486L3479a65128d0748
18707c48561a20858L5031b1268j33612A09652b24685A33934N457c9139C86580
18696A66481o5596b3160F1192J9800b24344B3971b27192a6513j53421N3337H5564
18684a64632D3412b04291D8970a16777A97171f7178A5307a92260h5100k34465
$$ plain form
18674 -319565 13992 -93374 -478099 -138546 -43432 139501 18796 -29090 -22555 16623 -194216
18662 -105988 -136787 55764 106897 -20460 -87547 -77925 54285 120073 -135769 4566 -235697
18650 54171 -196845 238404 -292881 57508 -85997 -180696 -169543 -26356 196113 -411023 -170179
18638 -242343 216639 140757 -99075 -44931 8322 -240772 -49434 -44164 -170510 21727 118571
18627 118571 -101939 -102282 -37336 54540 -60571 -179064 208048 -114358 -51241 182566 156889
18616 156889 189351 167178 -297716 -21358 -58590 -94886 45050 -19043 -177412 -59535 36978
18604 -216690 -178431 154486 -269566 -633503 235703 -155673 -52566 97458 -106640 -86657
18594 -86657 35460 -163426 -82679 -65670 -224522 -48397 -125165 -65327 89026 -10147 -399159
$$ packed form
18674c19565A3992i3374l84725a38546d3432A39501A8796b9090O535A6623a94216
18662a05988l0799E5764N1133b0460o7087R622E4285O5788a35769D566b35697
18650E4171a96845B38404b92881E7508h5997r4699J1153b6356A96113d11023a70179
18638b42343B16639p5882i9075d4931H322b40772d9434N270j26346B1727R6844
18627A18571a01939l43c7336E4540f0571j18493B08048a14358e1241A82566k5677
18616A56889L2462k2173b97716b1358l7232l6296D5050a9043j58369e9535C6978
18604b16690L8259A54486b69566l63937B35703a55673e2566I7458a06640J9983
18594h6657C5460a63426Q0747J7009j58852d8397p6768N9838H9026a0147l89012
$$ plain form
18583 -399159 56064 40636 -115285 15956 -46889 -162356 2802 -92869 -206068 -241899 41804
18571 -31389 -130461 -127174 -76561 162930 231228 143537 -439 -218644 -121205 32660 -86295 44512
18558 350301 136209 -96382 89913 227464 -216207 -244059 -223557 -58001 -312006 13855 -134659
18546 -72676 -8932 -347363 129279 -207056 -202352 -18611 52490 -60199 -192937 -371609 -95526
18534 -99577 111579 159224 87326 11082 -20609 -247273 138485 -74831 145744 -75037 94995
18522 -82627 -8898 -126933 -194594 -365549 262283 105633 13917 85369 -11064 -316457 -100659
18510 -397659 -158771 -157614 -213761 -90146 23478 -215169 -58596 -361933 -58225 105152 -139016
18498 84456 -180422 -7078 -244458 -361708 113175 -5916 51404 337114 24402 30797 -412726
$$ packed form
18583c99159E6064j5428a15285A5956d6889j15467B802i2869j13199l5831D1804
18571c1389r9072L287N0613A62930O8298q7691d39k18205R7439C2660h6295D4512
18558C50301A36209i6382H9913J37551b16207k7852K0502e8001k54005A3855a34659
18546g2676h932l38431A29279b07056M704a8611E2490f0199j32738j78672i5526
18534i9577A11579M7645p1898A1082b0609k26664A38485g4831A45744g5037I4995
18522h2627h898j18035o7661j70955B62283A05633A3917P1452a1064l05393a00659
18510c97659a58771J157n6147i0146B3478b15169e8596l03337e8225A05152a39016
18498H4456a80422g078k37380j17250A13175e916E1404K85710B4402O395d12726
$$ plain form
18486 110971 4130 134458 -26983 188 70232 -311652 -237450 -73694 -81010 84085 89769 -119498
18473 92307 -40961 -74556 -42256 231255 38022 -25241 -15186 209588 -147963 135057 -55158
18461 201455 -223535 -162586 86175 -208054 -59266 -56870 16387 170757 19092 -53722 -88563
18450 -88563 248396 -176205 -219953 -187575 16752 64033 131882 64944 -160281 -252427 -4651
18438 78198 66543 -280230 -232876 374672 92313 -37503 62771 -97457 200282 -30187 -77326
18427 -77326 115376 -55012 134583 -71286 98649 105476 -138169 -182357 191401 129083 -253406
18415 -197366 470697 -48284 88866 -67019 -104915 -159269 -31950 63085 278255 -227653 80051
18403 -33388 -4336 90745 99103 166280 39309 221912 -154126 -233981 -237523 28381 220717 76672
$$ packed form
18486A10971D130J30328b6983A88P0044c11652P4202g3694p316H4085N684a19498
18473I2307d0961l3595L2300B31255C8022b5241J0055B09588a47963A35057e5158
18461B01455b23535O0949H6175b08054e9266K396A6387J54370A9092e3722l4841
18450h8563B48396a76205m3748L2378A6752M7281O7849F4944a60281r2146d651
18438G8198j1655b80230M7354C74672I2313c7503F2771i7457B00282c0187m7139
18427g7326A15376e5012A34583g1286I8649O827a38169m4188A91401o2318b53406
18415a97366D70697d8284H8866f7019l7896n4354c1950F3085K15170b27653H0051
18403c3388d336I0745Q358O7177C9309J82603a54126p9855l542B8381J92336G6672
$$ plain form
18390 -309024 -88993 132648 -87733 220797 7713 -27266 287696 -80152 -384195 -353518 -86146
18378 -62665 27795 154219 -116694 -15828 -147520 -5410 -76644 106043 66426 43480 204409
18367 204409 -29723 22547 24174 144827 24073 20836 129018 -71240 324477 242172 -132810
18355 254512 -25252 -50274 -40259 -75930 -292962 489 -80844 -245310 -65840 -347872 -56313
18343 84034 57834 15522 -61010 -310009 157935 -52876 -125808 -99373 -151910 397511 106509
18331 18287 244273 -112124 70082 207617 44778 -301704 37086 150174 164641 65977 -154303
18319 -142137 25607 -163022 38969 58036 -93081 -122930 -259272 -173483 68519 98196 -103464
18307 49531 -171705 167038 176032 -166478 490762 -329575 35675 -166851 210172 122024
$$ packed form
18390c09024h8993A32648h7733B20797G713b7266B87696h0152l04043L0677h6146
18378f2665B7795J26424a16694a5828j31692e410p1234A06043l9617k2946J60929
18367B04409b9723B2547J627J20653B4073l237J08182g1240C24477q2305a32810
18355B54512b5252k5022J0015l5671k17032D89h0844j64466f5840k82032e6313
18343H4034k6200A5522f1010k48999A57935e2876p2932K6435n2537C97511A06509
18331A8287K25986a12124G0082J37535D4778c01704C7086J13088J4467F5977a54303
18319a42137B5607a63022C8969J9067i3081k9849j36342Q5789F8519K9677a03464
18307D9531a71705A67038Q994a66478D90762c29575C5675a66851B10172q8148
$$ plain form
18297 122024 61993 -52495 -226493 -84439 381406 35656 -16180 197673 -35591 275057 -167034
18285 -217792 54457 -225851 -20776 -109575 158801 -166292 60599 82828 -202820 -265200 149882
18273 -189723 36764 48526 154091 312067 226515 12916 -145291 157483 59578 69936 50777
18262 50777 -119367 -172595 59834 -372514 -32921 132386 -34884 -93528 48137 -109807 -315156
18251 -315156 130910 10228 155117 -41082 -198533 -14409 -46952 -237106 -103436 -112561 199013
18239 -94514 68280 -142198 -109113 -196177 143984 -119976 -238085 -276094 -10366 4937 -261891
18227 79696 -29902 153487 -85509 -419475 405901 -370864 63981 61624 -132877 -14343 -182469
18216 -182469 -54534 -164178 38963 -167378 125256 -86710 143219 -70877 119948 -237926
$$ packed form
18297A22024o0031e2495j73998h4439C81406C5656a6180A97673c5591B75057a67034
18285b17792E4457b25851b0776q8799A58801a66292F0599K2229b02820o2380A49882
18273a89723C6764J1762J05565J57976q5552A2916a45291A57483E9578J0358j9159
18262E0777a19367n3228E9834c72514c2921A32386c4884n8644D8137a09807k05349
18251c15156A30910A0228J44889d1082j57451a4409l2543j90154a03436r125A99013
18239i4514F8280a42198L3085q7064A43984a19976j18109l8009a0366D937b61891
18227G9696b9902A53487h5509l33966D05901c70864F3981k357a32877a4343j68126
18216a82469e4534j09644C8963a67378A25256h6710A43219g0877A19948b37926
$$ plain form
18205 -117371 -85105 -187749 -40539 -98491 -311923 -229732 147420 -35219 158220 -29325 -109547
18194 -109547 107322 84982 -122413 -11856 -351608 -8945 165535 465527 -151006 201525
18183 -200283 91172 137095 389972 58905 48592 -230111 296400 193570 -3647 -269986 93131
18171 126894 189603 -181092 -376127 -83429 352172 -87475 -203714 68155 99167 -29717 393127
18159 -323895 -253924 122342 -142494 -149078 -96758 -150474 148542 148409 -122297 89853 -94186
18147 -145191 109206 -226447 -122827 8725 45021 -105332 -269455 11220 181078 69082
18136 -32035 475 -122752 -12574 167079 -82004 -314149 63424 -15434 -87834 21631 -50509
18124 -95713 -41546 138672 -138471 -20671 1722 239991 -334707 -145241 60594 195288 5213
$$ packed form
18205a17371L2266j02644d0539n7952k13432Q2191A47420c5219A58220b9325q0222
18194a09547A07322k2340a22413a1856l39752h945A65535K99992a51006B01525
18183b00283I1172M5923K52877E8905j0313b30111B96400j02830c647k66339I3131
18171A26894O2709a81092j95035h3429C52172h7475j16239F8155L1012b9717C93127
18159c23895O9971A22342a42494o584N2320n3716A48542j33a22297H9853i4186
18147a45191A09206b26447J03620H725L6296a05332j64123A1220J69858F9082
18136c2035D75a22752a2574A67079h2004k32145F3424a5434p2400B1631e0509
18124i5713d1546A38672a38471b0671A722K38269c34707a45241F0594J34694E213
$$ plain form
18112 -134459 47737 153850 -193122 -220665 -103908 -22836 -235086 120133 152024 -61633
18101 -79798 -7728 65770 -91386 -219000 -44281 -258224 224986 -342879 -6864 -252 -92976 -569570
18089 -569570 292519 -150316 70293 100174 56381 143615 6610 6143 -226998 84117 -16509
18077 -76698 -259690 71567 305713 9817 -73624 319199 -167239 67279 65124 -132600 124359
18065 69883 121833 88165 -366939 1721 -279313 303700 -42954 -26686 417170 -154758 190446
18053 43559 -185865 115164 -119520 95873 -273662 -225121 194293 -92311 41734 -546020
18042 -426 128388 -395188 147882 352582 -133118 200834 -91085 -262376 -85091 133414
18031 -91678 -281894 -13630 286 71899 -55931 51505 -227899 61816 -326139 220703 -152099
$$ packed form
18112a34459D7737J06113a93122k7543a03908b2836k12250A20133L1891f1633
18101g9798g728F5770i1386j27614d4281k13943B24986c42879f864b52r2724m76594
18089e69570B92519a50316G0293K9881m3793Q7234F610m67b26998H4117a6509
18077g6698j82992G1567K34146I817g3624C19199a67239F7279k155a32600A24359
18065F9883N1950l3668c66939A721b79313C03700d2954J6268D17170a54758A90446
18053D3559a85865A15164a19520I5873b73662M8541A94293i2311D1734e46020
18042d26A28388c95188A47882K04700a33118B00834i1085j71291h5091A33414
18031i1678j90216a3630B86P1613e5931E1505b27899F1816c26139B20703a52099
$$ plain form
18019 50185 -33857 186642 330616 -385160 276689 213621 -137457 305525 -114914 -146212
18009 -146212 157879 184335 350980 -252050 175526 70806 -89434 -140174 -235260 -325778 -1892
17997 183990 -111922 -80763 111167 -40851 22957 -303234 153324 -91190 52530 -358212
17986 -28181 -58485 85784 98274 -162067 -39603 110829 -180153 145213 237540 196142 158728
17975 158728 10897 -341612 -382676 -91815 89568 -209493 39781 -142879 -166308 11231 18912
17964 18912 200930 1369 -128140 23993 133323 -220178 106522 -196748 -69278 36333 66037
17953 66037 29254 -136423 86537 -304719 -278330 160261 -185900 -3879 55485 -87775 -98767
17942 -98767 -217249 -294686 -83829 -18415 -126082 287162 -162197 67064 331835 -109856
$$ packed form
18019E0185c3857A86642J43974c85160B76689o3068a37457C05525a14914l1298
18009a46212A57879K6456J66645b52050A75526G0806h9434n0740r5086r0518a892
17997A83990a11922L1159A11167d0851B2957c03234A53324i1190E2530c58212
17986b8181l0304H5784J2490a62067c9603A10829a80153A45213R2327m1398l7414
17975A58728A0897c41612m1064i1815H9568b09493C9781a42879k3429A1231P681
17964A8912J82018A369a28140B3993J09330b20178A06522a96748f9278C6333K9704
17953F6037B9254a36423H6537c04719K6389A60261a85900c879E5485h7775j0992
17942i8767j18482p7437h3829a8415j07667B87162a62197F7064K64771a09856
$$ plain form
17931 -6945 102433 -170665 -338175 -84757 -142650 121882 -213200 -398093 -101477 218777
17920 40014 388617 71127 -53259 39610 -14082 34131 -124752 238207 14662 79810 -158068
17908 26100 -9053 -92555 -66340 37634 118826 110414 -60265 22478 29493 -134269 -8439 -84677
17896 -84677 85984 -13975 -70908 -45087 -196231 89805 -26011 80285 150092 17083 274676
17885 274676 16651 194728 -231697 52860 206101 391062 -199955 6200 48836 116237 -109051
17873 59655 156268 59711 -81024 7805 -14889 74492 5810 -47351 41515 61587 151467 -75718
17860 -22740 -69673 7903 148736 518736 460971 280528 -86641 -141065 175097 49280 -35509
17848 -201180 -162949 184324 -73901 -65709 66020 295044 231461 125945 125534 109047 -191529
$$ packed form
17931f945A02433a70665j67510h4757n7893A21882b13200j84893a01477B18777
17920D0014L48603G1127e3259C9610a4082C4131a24752B38207A4662O5148a58068
17908B6100i053q3502K6215C7634Q1192q412f0265B2478P015a34269h439p6238
17896h4677H5984a3975n6933K5821j51144H9805b6011H0285O9807A7083K57593
17885B74676A6651J78077b31697E2860J53241J84961a99955F200M2636O7401a09051
17873E9655R6613E9711h1024G805a4889G4492E810d7351D1515K0072Q9880g5718
17860b2740m6933G903J40833L70000n7765j80443h6641n4424A75097D9280c5509
17848b01180L8231A84324g3901Q192F6020K29024o3583j05516m11j6487a91529
$$ plain form
17836 82574 -6152 66616 193930 -94546 -31967 48552 139076 -27804 -289538 -104814 203011
17824 122102 153756 11508 -7748 108556 152841 -71420 95202 78123 30640 114754 -98491
17812 -190109 24093 81339 -62926 59016 -49209 109743 -52360 -165246 10949 176376 -247676
17800 119898 20161 -175354 -28417 -125262 -11619 179270 -103968 208719 65690 162482 222508
17789 222508 -224939 310119 -133380 -140642 -297570 125127 -211658 231941 -82399 -253940
17779 -253940 54362 101806 261843 254882 -22356 59373 182707 219552 -260613 220199 -224707
17767 -96662 41576 15633 46276 301317 309447 168041 141308 -131374 -166480 368154 37013
17755 132691 53422 212769 -179473 24788 180789 -99118 -182620 -110898 9681 -147842 98290
$$ packed form
17836H2574f152F6616J27314i4546c1967D8552R0524b7804k61734a04814B03011
17824A22102L1654A1508g748A08556M4285g1420I5202j7079C0640Q4114i8491
17812a90109B4093N7246f2926E9016d9209A09743e2360j12886A0949J65427b47676
17800A19898B0161a75354b8417r6845a1619A79270a03968B08719F5690R6792O0026
17789B22508b24939C10119a33380p262j56928A25127b11658B31941h2399j71541
17779b53940E4362M7444J60037o961b2356E9373J23334L6845b60613B20199b24707
17767i6662D1576A5633L0643K55041Q130j41406k6733a31374l5106C68154C7013
17755A32691E3422J59347a79473B4788J56001i9118q3502P1722I681a47842I8290
$$ plain form
17743 329667 -9655 -202830 -7950 198716 -19402 121933 104045 127447 70547 -40161 19093
17731 227512 257783 263405 173587 2295 -160017 -307558 173602 147085 94869 -95515 98651
17719 -102436 160518 30592 224598 60151 367300 257995 50565 -149297 -330290 -90169
17708 69392 -180092 172587 199507 -94238 117773 278573 46780 -135330 272521 -53859
17697 321272 133960 -7643 285255 109035 136797 126495 215379 -154588 330342 -15413 340674
17685 76378 203559 96911 -2036 44525 83773 -13743 -18630 90803 249023 43293 -52364 143944
17672 -15972 392415 238292 250849 328375 -56618 239944 268371 -11210 114431 -16342 -61302
17661 -61302 134081 90047 63358 117561 63826 -97262 89096 159211 12738 -28050 -187009
$$ packed form
17743C29667i655j93175g950A98716a9402A21933j7888K3402n6900d0161A9093
17731B27512L0271N622q9818B295a60017j47541A73602k6517n2216i5515I8651
17719a02436A60518C0592J94006F0151L07149j09305E0565a49297j80993i0169
17708F9392a80092A72587K6920i4238A17773J60800D6780a35330B72521e3859
17697C21272A33960g643B85255A09035K7762j0302Q8884a54588C30342a5413C40674
17685G6378J27181I6911b036D4525L9248a3743m887I0803J58220D3293e2364A43944
17672a5972C92415j54123J2557P7526e6618B39944K8427a1210A14431a6342m4960
17661f1302A34081m4034k6689N4203n3735i7262H9096P0115A2738b8050j58959
$$ plain form
17650 -187009 402849 73266 -13837 265507 -7963 109523 86987 287525 138383 68862 32015
17638 53989 119874 472176 -141794 167193 111215 263911 -136440 35270 181066 -261547
17627 -15359 -161089 390276 -271199 136055 266990 521781 83206 313342 -38166 4607
17616 -63680 264664 68806 115545 145616 247671 -69196 -207403 156241 45908 303083 46391
17604 145912 165852 131081 228709 265234 168784 76409 20254 75486 188400 211856 296220
17593 296220 80443 280095 -136136 -191415 266320 -124629 128702 391758 228065 -126270
17582 54202 508979 314419 54591 77909 390277 212037 255483 39088 91884 -129607 232080
17570 -73534 303655 272637 406484 113157 326097 466620 -1034 84462 155692 166865 -95043
$$ packed form
17650a87009D02849G3266a3837B65507g963A09523k2536K00538A38383F8862C2015
17638E3989O5885L52302a41794A67193n5978J52696a36440C5270J45796b61547
17627a5359j45730C90276b71199A36055J30935K54791H3206K30136c8166D607
17616f3680B64664F8806M6739L0071J02055f9196j38207A56241D5908K57175D6391
17604A45912J9940l4771R7628L6525r6450G6409B0254N5232J12914K3456Q4364
17593B96220H0443J99652a36136n5279B66320a24629A28702K63056j63693a26270
17582E4202M54777j94560E4591K3318L12368j78240M3446C9088N2796a29607B32080
17570g3534C03655l1018J33847A13157K12940J40523a034H4462P1230J1173i5043
$$ plain form
17558 386740 -116320 216203 176399 532941 130881 245105 29891 -284 231410 265483 255706
17547 255706 87832 382700 274497 292562 342955 -130686 257775 144948 -95122 119671
17536 294308 256733 263289 449233 454799 96761 372848 344844 290765 478905 619885 683137
17525 683137 894792 675688 836038 762393 767981 829949 540983 414708 702167 607803
17515 607803 81911 351076 376803 824836 389416 838172 748563 810292 799573 732165 494588
17504 494588 601476 523519 341524 310102 596242 237462 368911 234142 507142 109981
17493 123694 55397 77676 296397 6494 311047 542249 447686 238367 483244 322352
17483 322352 295476 172307 504125 395880 535174 244696 36401 257636 159663 428458
$$ packed form
17558C86740a16320B16203l9804L56542A30881J14224B9891b84B31410L4073r777
17547B55706H7832K94868j08203J8065N0393a30686B57775j12827i5122A19671
17536B94308l7575O556J85944N566I6761K76087k8004n4079J88140J40980O3252
17525F83137K11655k19104J60350p3645N588O1968k88966j26275K87459r4364
17515F07803H1911K69165K5727M48033C89416M48756q9609O1729j0719o7408k37577
17504D94588J06888p7957j81995l1422K86140B37462J31449j34769K73000A09981
17493A23694E5397K2279K18721F494L04553K31202r4563k09319K44877j60892
17483C22352k6876j23169L31818j08245J39294B44696C6401K21235r7973K68795
$$ plain form
17473 428458 183803 387107 200479 184561 270048 246495 -124876 573522 283243 163987
17463 163987 191407 56334 202148 143334 484156 -10281 244974 564984 398510 310461
17453 310461 382358 447503 265696 332324 361994 214817 330085 388087 213597 418584
17443 418584 619546 464887 462341 434511 259696 124288 632645 -11920 244794 -14134
17432 -26079 119695 109642 465014 226630 400777 496582 216147 411535 316847 535039
17422 535039 545039 604143 290901 544233 444688 550076 625313 161837 173005 346260
17412 346260 588917 449449 450229 261850 345503 418432 283764 470561 124366 232258
17402 232258 230228 231210 249560 316665 351149 506391 -78397 123202 18588 437936 11286
$$ packed form
17473D28458A83803K03304j86628j5918Q5487k3553a24876E73522B83243j19256
17463A63987K7420E6334J45814n8814L40822a0281B44974L20010j66474q8049
17453C10461P1897O5145j81807O6628K9670j47177J15268N8002j74490K04987
17443D18584K00962j54659k546k7830j74815A24288N08357a1920B44794a4134
17432b6079A19695j0053L55372B26630J74147R5805B16147J95388r4688K18192
17422E35039J0000N9104B90901K53332r9545J05388P5237A61837J1168J73255
17412C46260K42657j39468P80j88379Q3653P2929j34668J86797A24366J07892
17402B32258k030R82J8350O7105L4484J55242g8397A23202A8588M19348A1286
$$ plain form
17390 547838 138295 316267 120978 555699 421110 378423 246348 347140 328245 268972
17380 268972 314281 385005 334144 311330 346478 172454 547322 512509 211250 298255 652776
17369 652776 123653 313114 338615 425685 492882 47478 105727 175906 291795 432340 181586
17357 307767 -4091 336680 600863 195619 413007 190352 22135 459056 266877 198683
17347 198683 280057 352771 267789 302567 492116 290101 285066 154923 250073 185690 267222
17336 267222 368488 287538 405981 273655 284568 182235 381560 719214 -159105 327456
17325 149839 130612 -57039 403320 50375 -2088 80687 166237 160135 399483 92376 418307
17314 418307 265402 294145 171681 111998 103130 268158 258082 110142 112331 433554 288762
$$ packed form
17390E47838A38295J77972A20978M34721j34589m2687j32075J00792j8895n9273
17380B68972M5309P0724n0861k2814L5148A72454L74868l4813B11250Q7005L54521
17369F52776A23653J89461K5501Q7070O7197D7478N8249P0179J15889J40545A81586
17357C07767d091C36680K64183A95619K17388A90352B2135M36921j92179o8194
17347A98683Q1374P2714q4982L4778J89549k02015n035j30143R5150o4383Q1532
17336B67222J01266q0950J18443j32326J0913j02333J99325L37654a59105C27456
17325A49839j9227e7039D03320E0375b088H0687Q5550o102K39348I2376L25931
17314D18307j52905K8743j22464n9683q868J65028j0076A10142K189L21223j44792
$$ plain form
17303 288762 262423 297719 -44491 473764 38987 203502 268497 199380 -29910 427478 239851
17292 239851 275524 358612 281318 359894 384229 618903 94612 483875 277044 426434 45203
17280 269948 634460 485611 331874 14026 76079 230945 170127 315353 322905 134559
17269 425272 408769 482390 326308 450406 532091 200010 250552 481523 428109 137488
17258 291395 346094 556919 174607 186069 113343 395925 217912 431549 308150 525200
17248 525200 259258 63779 534571 305921 -5211 137378 349302 647040 181651 567934
17238 567934 311343 641259 486913 232774 20000 311643 439558 297235 263174 358995
17228 358995 123157 346180 481654 327861 192762 303903 426325 442423 373508 448374
$$ packed form
17303B88762k6339L5296d4491D73764C8987J64515O4995o9117b9910D27478j87627
17292B39851L5673Q3088p7294P8576K4335K34674I4612L89263k06831J49390D5203
17280B69948L64512j48849j53737A4026O2053J54866o0818J45226P552A34559
17269D25272j6503P3621j56082J24098Q1685B00010N0542K30971n3414A37488
17258B91395N4699K10825A74607J1462p2726K82582j78013K13637j23399K17050
17248E25200B59258F3779M70792k28650e211A37378K11924K97738A81651L86283
17238E67934k56591L29916j54346B32774B0000K91643J27915j42323l4061R5821
17228C58995A23157K23023J35474j53793j35099J11141J22422J6098o8915P4866
$$ plain form
17218 448374 707527 529333 102524 403894 385869 744066 595617 412916 469952 343520
17208 343520 618044 509789 251142 281201 658582 450123 413229 147159 245424 397131
17198 397131 693941 235330 455736 401569 437368 293278 283660 602776 414979 759599
17188 759599 396554 614474 401942 456041 629764 615138 338626 413988 317314 107782
17177 771703 326041 638785 648857 696970 446715 489242 343152 582523 563784 618318
17167 618318 818047 406839 543945 457882 142400 648805 392632 556216 355700 438270
17157 438270 625779 695525 478653 565966 458700 590978 566239 468414 489576 688253
17147 688253 511015 378113 582650 247118 610316 694792 790933 678858 747922 396239
$$ packed form
17218D48374K59153j78194A02524L01370j8025L58197j48449j82701N7036j26432
17208C43520K74524j08255B51142L0059L77381k08459l6894A47159R8265J51707
17198C97131K96810B35330K20406n4167L5799j44090r618L19116j87797L44620
17188G59599l63045K17920k12532N4099J73723j4626k76512P5362r6674A07782
17177G71703C26041L12744J0072M8113k50255M2527j46090K39371j8739N4534
17167F18318J99729D06839J37106q6063A42400N06405k56173J63584k00516Q2570
17157D38270J87509O9746k16872Q7313j07266J32278k4739r7825K1162J98677
17147F88253j77238j32902K04537B47118L63198Q4476R6141j12075O9064l51683
$$ plain form
17137 396239 527245 442805 793106 765536 676735 569627 441850 591197 670391 626988
17127 626988 841504 626833 708526 837582 511205 715200 657123 541598 257452 743729
17117 743729 345683 757811 589385 882597 541030 453661 547589 342789 859087 623879
17107 623879 760407 513077 561926 540893 722019 554922 567356 538080 726894 732137 562453
17096 562453 829184 761457 784654 517024 726868 760549 519335 702994 951796 642043
17086 642043 771405 806274 896774 687851 727812 691028 721166 692022 728271 892295 810061
17075 810061 1001982 740998 1202133 599964 862040 1088616 841696 1073005 1064603 924682
17065 924682 692727 662587 795709 995157 1142185 778526 1015795 855542 763512 752005
$$ packed form
17137C96239J31006q4440L50301k7570q8801j07108j27777J49347P9194m3403
17127F26988K14516k14671Q1693J29056l26377K03995n8077j15525B57452M86277
17117G43729C45683M12128j68426K93212l41567q7369R3928k04800N16298k35208
17107F23879J36528k47330M8849k1033J81126j67097J2434k9276J88814N243j69684
17096E62453K66731o7727K3197k67630K09844L3681k41214J83659K48802l09753
17086F42043J29362L4869R0500k08923L9961l6784L0138k9144L6249J64024q2234
17075H10061J91921k60984M61135E99964K62076K26576k46920K31309q402j39921
17065I24682k31955l0140J33122J99448J47028l63659K37269j60253r2030j1507
$$ plain form
17055 752005 794372 968064 871729 1106016 868371 1029135 844302 754379 1043598 1200158
17045 1200158 916496 830165 1017140 1076282 1113194 1238507 1191687 1119101 1227015 1074122
17035 1074122 986713 809860 1262729 1152998 981625 963829 831376 1243097 1154803 1137442
17025 1137442 996823 1099553 1127311 1058936 1389548 1116653 1377965 1345272 1342529 1172448
17015 1172448 950379 1178338 1197952 1403611 1377270 1140787 1340938 1425045 1450526 1162014
17005 1162014 1431650 1442554 1352944 1052794 1237150 1683515 1716120 1456931 1376551 1566255
16995 1566255 1761913 1534270 1681059 1510533 1522849 1526953 1389607 1446732 1476701 1213747
16985 1213747 1476907 1311103 1786077 1535835 1639294 1660689 1685698 1978095 1361773 1866319
$$ packed form
17055G52005M2367J73692r6335K34287k37645J60764j84833q9923K89219J56560
17045A200158k83662q6331J86975N9142L6912J25313m6820p2586J07914j52893
17035A074122q7409j76853M52869j09731j71373j7796j32453M11721q8294j7361
17025A137442j40619J02730K7758o8375L30612k72895K61312l2693k743j70081
17015A172448k22069K27959J9614K05659k6341k36483K00151Q4107K5481k88512
17005A162014K69636J0904q9610l00150J84356M46365L2605k59189q0380J89704
16995A566255J95658k27643J46789j70526J2316M104j37346N7125K9969k62954
16985A213747K63160j65804M74974k50242J03459K1395K5009K92397o16322N04546
$$ plain form
16975 1866319 1598830 1470839 1503053 1777784 1541209 1550527 1756367 1588136 1875109 1775007
16965 1775007 1826485 1583854 1720689 1982309 1859634 1860757 2081597 1987932 1873340 2015487
16955 2015487 1859065 1587407 1892714 2212602 1801128 2215717 2283387 1822196 2240178 1853609
16945 1853609 1958046 2362854 2220450 2261534 2513159 2336861 2192126 2125941 2416830 2411144
16935 2411144 2335938 1964399 2773404 2534064 2493180 2669977 2599090 2728876 2821911 2751197
16925 2751197 2642480 2680333 2596478 2599373 2678452 2618894 2701839 2720884 2695189 2941108 2593307
16914 2593307 2947226 3322551 2897832 2983937 3127224 3345695 2731484 3287545 3224172 3282432
16904 3282432 3157833 3011318 3242600 3353804 3269328 3653112 3431827 3577809 3739429 3427893
$$ packed form
16975A866319k67489j27991L2214K74731k36575R318K05840j68231K86973j00102
16965A775007N1478k42631J36835K61620j22675J123K20840r3665j14592J42147
16955B015487j56422k71658L05307L19888m11474M14589O7670m61191M17982l86569
16945A853609J04437M04808j42404M1084K51625j76298j44735o6185K90889n686
16935B411144p5206l71539Q09005k39340m0884J76797p0887J29786R3035p0714
16925B751197j08717L7853q3855K895P9079n9558Q2945J9045k5695K45919l47801
16914B593307L53919L75325m24719Q6105J43287K18471o14211N56061o3373N8260
16904C282432j24599j46515K31282J11204q4476L83784k21285J45982J61620l11536
$$ plain form
16894 3427893 3492773 3661108 4031840 3814727 3571868 3688150 3686588 3426929 3805656 4090865
16884 4090865 3976654 3829185 4153064 4246747 4250955 4183831 4679042 4661262 4561074 4495215
16874 4495215 4625239 4943321 4822120 4683771 4824678 4697624 5178319 4957468 5061325
16865 5061325 5362570 5259844 5305705 5522909 5794274 5633716 5532495 5453130 6175740 6046942
16855 6046942 6020772 5980110 6116226 6038168 6320439 6247916 6213398 6646698 6608905 6922948
16845 6922948 6829555 6958817 7026770 7403041 7085845 7324434 7169502 7599463 7851392 8190351
16835 8190351 8123651 8369465 8331686 8470465 8715306 8642563 9105512 8829240 9560043 9415019
16825 9415019 9412893 9845650 9945823 10094627 10518241 10301391 10472638 11001164 10704931 11014160
$$ packed form
16894C427893O4880J68335L70732k17113k42859J16282j562k59659L78727K85209
16884D090865j14211j47469L23879R3683M208o7124M95211j7780j00188o5859
16874D495215J30024L18082j21201j38349J40907j27054M80695k20851J03857
16865E061325L01245j02726M5861K17204K71365j60558j01221p9365P22610j28798
16855F046942k6170m0662J36116p8058K82271p2523l4518M33300l7793L14043
16845F922948r3393J29262O7953L76271l17196K38589j54932M29961K51929L38959
16835H190351o6700K45814l7779J38779K44841p2743M62949k76272P30803j45024
16825I415019k126M32757J00173J48804M23614k16850J71247N28526k96233L09229
$$ plain form
16815 11014160 11003243 11809649 11793658 11874357 12232114 12279644 12579131 12839876 13682616 13283394
16805 13283394 13549736 13901961 14530021 14699203 15138166 15149759 15540111 16065803 16081740 16794333
16795 16794333 16921442 17234971 17669258 18080181 18743316 19194918 19593866 19811375 20454484
16786 20454484 20800096 21320798 21662222 22340731 22905601 23456464 24131924 24634956 25395966
16777 25395966 26265107 26522798 27077532 28336165 29044109 29895882 30381532 31454496 32523609
16768 32523609 33275559 34407022 35410807 36089736 37181779 38230700 39295087 40921009
16760 40921009 41834025 43247079 44417306 45220007 47257278 48648113 50183169 51784431
16752 51784431 53374962 55050953 57142900 58717439 60725923 62137527 64567635 66745053
$$ packed form
16815A1014160j0917Q06406j5991Q0699L57757M7530K99487K60745Q42740l99222
16805A3283394K66342L52225O28060J69182M38963J1593L90352N25692J5937P12593
16795A6794333J27109L13529M34287M10923O63135M51602L98948K17509O43109
16786B0454484L45612N20702L41424O78509N64870N50863O75460N03032P61010
16777B5395966Q69141K57691N54734J258633P07944Q51773M85650J072964J069113
16768C2523609P51950J131463J003785O78929J092043J048921J064387J625922
16760D0921009R13016J413054J170227Q02701K037271J390835J535056J601262
16752E1784431J590531J675991K091947J574539K008484J411604K430108K177418
$$ plain form
16744 66745053 68517693 70686422 72851089 74751730 77197003 79240869 81699496 84080857
16736 84080857 85758015 87968576 90433743 92444779 94645519 96074564 98189355 100126523
16728 100126523 101602471 102840547 104388251 105549113 105961292 106844812 107105766 107352581
16720 107352581 107256978 107193416 106547951 105424486 104827741 103641968 102208471 100818326 99029685
16711 99029685 97191340 94980326 93052886 91188625 88433450 86231934 83898829 81688066
16703 81688066 79464526 77018125 74822414 72016453 69961768 67717017 65513199 63102942
16695 63102942 61420232 59037846 57021562 55286512 52988205 51614864 49519150 48189583
16687 48189583 46594615 44575177 43252060 42023342 40378707 39084162 37838151 36659137
$$ packed form
16744F6745053J772640K168729K164667J900641K445273K043866K458627K381361
16736H4080857J677158K210561K465167K011036K200740J429045K114791J937168
16728A00126523J475948J238076J547704J160862M12179Q83520K60954K46815
16720A07352581r5603o3562o45465j123465n96745j185773j433497j390145j788641
16711I9029685j838345k211014j927440j864261k755175k201516k333105k210763
16703H1688066k223540k446401k195711k805961k054685k244751k203818k410257
16695F3102942j682710k382386k016284j735050k298307j373341k095714j329567
16687D8189583j594968k019438j323117j228718j644635j294545j246011j179014
$$ plain form
16679 36659137 35691881 34437749 33368757 32296570 31040037 30226951 29235068 28549332 27560730
16670 27560730 26865873 26146293 25208233 24590025 23754470 23079640 22347816 21677256 21082572
16661 21082572 20660772 20296090 19479430 18861713 18464606 17866596 17654288 17109273 16714484
16652 16714484 16395705 16107597 15183611 15148345 14992492 14460743 13727138 13825253 13490389 13621787
16642 13621787 12929992 12544037 12378979 12058972 11594463 11476824 10965583 10953678 10960112 10662291
16632 10662291 10381576 10351135 9749487 10106979 9615333 9198135 9099487 9222237 8567377 8461608
16622 8461608 8210907 8426902 8036516 8007790 7851624 7601288 7842680 7617177 7578638 7186553
16612 7186553 6790672 7196011 6958270 6562079 6508802 6590109 6215107 6598671 6095028 6179686
$$ packed form
16679C6659137r67256j254132j068992j072187j256533q13086r91883o85736r88602
16670B7560730o94857p19580r38060o18208q35555o74830p31824o70560n94684
16661B1082572m21800l64682q16660o17717l97107n98010k12308n45015l94789
16652A6714484l18779k88108r23986l5266j55853n31749p33605R8115l34864J31398
16642A3621787o91795l85955j65058l20007m64509j17639n11241j1905O434k97821
16632A0662291k80715l0441o01648L57492m91646m17198r8648J22750o54860j05769
16622H461608k50701K15995l90386k8726j56166k50336K41392k25503l8539l92085
16612G186553l95881M05339k37741l96191n3277Q1307l75002L83564n03643Q4658
$$ plain form
16602 6179686 5790697 5768637 5693410 5483586 5771796 5584485 5513108 5208936 5133118 5302784
16592 5302784 4994605 5112493 5262538 5132600 4842016 4715608 4904778 4827580 4606179 4741394
16582 4741394 4574225 4588349 4365595 3924441 4242045 4060986 4159437 3897514 3990800 4000750
16572 4000750 4062581 3772244 3715007 4071652 3963945 3522188 3353122 3483217 3494654 3441467
16562 3441467 3635309 3328863 3245614 3612482 3333263 2895758 3437527 3055851 3178070 3331022
16552 3331022 3135215 2791758 2952095 2910764 3282115 3180145 2650480 2942456 2949395 2718258
16542 2718258 2707891 2847610 2644112 2641046 2612533 2471034 2709378 2350424 2324171 2675367
16532 2675367 2356721 2555124 2437958 2496492 2410364 2697132 2150819 2566723 2121166 2155132
$$ packed form
16602F179686l88989k2060p5227k09824K88210j87311p1377l04172p5818J69666
16592E302784l08179J17888J50045j29938k90584j26408J89170p7198k21401J35215
16582D741394j67169J4124k22754m41154L17604j81059R8451k61923R3286R950
16572D000750O1831k90337n7237L56645j07707m41757j69066J30095J1437n3187
16562C441467J93842l06446q3249L66868k79219m37505N41769l81676J22219J52952
16552C331022j95807l43457J60337m1331L71351j01970n29665K91976O939k31137
16542B718258j0367J39719k03498l066k8513j41499K38344l58954k6253L51196
16532B675367l18646J98403j17166N8534q6128K86768n46313M15904m45557L3966
$$ plain form
16522 2155132 2474928 2153079 2383029 2023324 2046091 1997601 2272729 2269831 1976806 1816884
16512 1816884 1976646 2084083 1903717 1831363 2031126 2055929 1885725 1741763 1866580 1902414
16502 1902414 1760523 1696318 1743957 1991437 2018604 2009562 1357230 1860132 1847674 1792630 1556259
16491 1556259 1570520 1413943 1636619 1545604 1457037 1717238 1580700 1678824 1961191 1257970
16481 1257970 1276792 1591512 1426203 1475613 1238814 1352618 1529570 1836009 1457516 1230359
16471 1230359 1532585 1438500 1453890 1277374 1242088 1555812 1349438 1276998 1591638 1399515
16461 1399515 1284064 1392329 1225494 1361204 1242802 1119999 1388307 1241447 1067196
16452 1067196 1065143 996041 1041412 1146761 1228191 1413760 1389538 1226900 1042704 1227995
$$ packed form
16522B155132L19796l21849K29950l59705K2767m8490K75128k898k93025j59922
16512A816884J59762J07437j80366p2354J99763K4803j70204j43962J24817L5834
16502A902414j41891o4205M7639K47480K7167r042o52332N02902j2458n5044k36371
16491A556259J4261j56577K22676r1015q8567K60201j36538R8124K82367p03221
16481A257970J8822L14720j65309M9410k36799J13804J76952L06439l78493k27157
16471A230359L02226r4085J5390j76516l5286L13724k06374p2440L14640j92123
16461A399515j15451J08265j66835J35710j18402j22803K68308j46860j74251
16452A067196k053o9102M5371J05349Q1430J85569k4222j62638j84196J85291
$$ plain form
16442 1227995 1160583 1308178 1279016 1080009 1155129 1108535 833575 1023228 1052436 919155
16432 919155 936655 1042458 795848 1003364 1133933 1019654 663778 1014854 869467 1039719
16422 1039719 1163298 1149297 1151666 821010 1197648 626106 832243 1017119 1297611 993114
16412 993114 1149167 615564 737605 824438 1192830 1007897 967809 1058127 1170987 852950
16402 852950 1042712 917364 784397 1060944 946760 844771 680126 827335 793704 1311872
16392 1311872 621268 828053 907409 1063292 651707 549360 533662 788793 988963 718528
16382 718528 449938 698734 639714 679914 690980 789942 565092 545122 637322 936551 617914
16371 617914 793875 924197 464410 540051 895985 705678 668272 794160 181266 393343
$$ packed form
16442A227995o7412J47595k9162j99007P5120m6594k74960J89653K9208j33281
16432I19155J7500J05803k46610K07516J30569j14279l55876L51076j45387J70252
16422A039719J23579j4001K369l30656L76638n71542K06137J84876K80492l04497
16412I93114J56053n33603J22041Q6833L68392j84933m0088R0318J12860l18037
16402H52950J89762j25348j32967K76547j14184j01989j64645J47209l3631N18168
16392A311872F21268K06785P9356J55883m11585j02347j5698K55131K00170k70435
16382G18528k68590K48796n9020M0200J1066R8962k24850j9970R2200K99229l18637
16371F17914J75961J30322m59787P5641L55934j90307l7406J25888A81266K12077
$$ plain form
16361 393343 692233 548371 671350 1029841 648309 870812 737332 697124 591435 414599
16351 414599 472745 683500 258586 688786 426905 403566 776188 455040 593227 593506
16341 593506 602102 902303 698799 483383 341694 851768 457993 502320 560544 473352
16331 473352 460949 437082 640920 650988 362337 442284 382607 216405 530830 491945 243806
16319 783087 729947 551347 380046 643711 420354 290857 559516 402234 500014 772061
16309 772061 358447 244678 452854 522124 476116 441247 372031 478617 553309 596193 396743
16298 396743 325497 492984 580015 640081 328042 406824 247252 347794 184624 513728
16288 513728 587488 505535 634732 193402 218903 12353 725405 579940 449689 310623
$$ packed form
16361C93343K98890j43862J22979L58491l81532K22503j33480m0208j05689j76836
16351D14599N8146K10755B58586M30200k61881k3339L72622l21148J38187K79
16341E93506Q596L00201k03504k15416j41689N10074l93775M4327N8224q7192
16331D73352j2403k3867K03838J0068k88651P9947n9677j66202L14425l8885B43806
16319G83087n3140j78600j71301K63665k23357j29497K68659j57282R7780K72047
16309G72061C58447j13769K08176O9270m6008l4869o9216J06586P4692M2884j99450
16298C96743p1246J67487Q7031O0066l12039P8782j59572J00542j63170L29104
16288E13728P3760q1953J29197A93402K5501A2353P13052j45465j30251j39066
$$ plain form
16278 310623 524475 405741 397204 85225 534685 179230 382512 375733 344065 190075 307472
16267 307472 680168 124191 283660 178721 100874 158064 102395 433627 -61558 375370
16256 474356 304922 354469 554753 298886 275940 343625 23572 135487 282366 246230
16246 246230 117935 304706 432599 265018 438085 460616 298836 80946 423056 361878
16236 361878 148519 438360 196405 491908 245249 324709 276005 67836 237513 52992
16225 329389 405442 165632 346284 433602 258401 111349 505406 395641 270235 265612
16215 265612 458377 -83343 165712 -15564 276323 103198 278248 349139 411413 -39358
16204 388083 348915 19302 248796 185971 265326 159775 516497 389689 466925 105500
$$ packed form
16278C10623K13852j18734q537H5225M49460A79230K03282o779l1668j53990J17397
16267C07472L72696A24191J59469j04939p7847N7190n5669L31232f1558C75370
16256D74356j69434M9547K00284k55867k2946O7685B3572J11915J46879l6136
16246B46230A17935J86771J27893j67581J73067K2531j61780H0946L42110o1178
16236C61878A48519K89841A96405K95503B45249P9460m8704F7836J69677E2992
16225C29389P6053A65632J80652Q7318j75201A11349L94057j09765j25406m623
16215B65612J92765h3343A65712a5564B76323A03198J75050P0891O2274c9358
16204C88083l9168A9302K29494o2825P9355j05551L56722j26808P7236A05500
$$ plain form
16193 271429 20388 -55913 153813 289913 147396 25001 121908 123780 107125 157537 424467
16182 424467 249755 356605 383437 364432 -115719 209597 154259 320259 18711 -63628
16171 63226 8420 121231 318321 166431 31237 436187 160355 340 61444 91552 341895
16160 341895 -182405 359598 142375 319145 521 387775 249744 246307 417369 267346
16150 267346 395277 394507 98236 400917 32514 274719 194490 77957 -94401 15249 80677
16139 80677 -102952 -105695 235068 264265 464501 178304 -147301 -175326 52571 -228086 -13047
16127 276209 215986 15686 443050 203484 182504 401688 -46174 290302 -156762 -90771
16117 -90771 -80403 205350 270225 -98871 277960 87443 30454 318581 137699 -3780 -150802
$$ packed form
16193B71429B0388e5913A53813J36100j42517B5001R6907J872j6655N0412K66930
16182D24467j74712J06850K6832j9005a15719B09597n5338J66000A8711f3628
16171F3226H420J12811J97090j51890C1237M04950A60355C40O1104L0108K50343
16160C41895a82405C59598A42375J76770E21L87254j38031l437J71062j50023
16150B67346J27931p70I8236L02681C2514K42205q0229G7957i4401A5249O5428
16139H0677a02952k743B35068K9197K00236A78304a47301k8025E2571b28086a3047
16127B76209o0223A5686M27364B03484k0980K19184d6174B90302a56762O5991
16117i0771J0368B05350O4875i8871B77960H7443C0454K88127A37699c780j47022
$$ plain form
16106 -150802 283444 -161613 6662 61604 375986 68045 210425 608 310409 168423 152401
16095 152401 374196 474994 261014 -160962 92512 10117 -41648 -94358 375560 -77614
16084 241671 -210800 174754 266985 -187132 33325 44731 440687 70928 129729 -427180
16073 19978 194006 65632 147166 -6385 275722 296467 63209 -42672 -359790 -131021 144443
16061 198908 -18024 -103294 -12943 -123189 -32960 -36683 174186 157503 -184595 -53998 192232
16049 -231156 31416 -138806 -32657 271832 85124 72181 55531 -115217 67866 60849 154880
16038 154880 -242479 -61696 251249 -111800 301808 250507 363409 271929 -121973 140689
16027 147493 -58792 14454 -170316 -192497 233077 290216 94623 34577 187198 -193248 34809
$$ packed form
16106a50802B83444a61613F662N4942L14382F8045J42380F08L09801j41986j6022
16095A52401K21795J00798k13980a60962I2512A0117d1648n2710C75560g7614
16084B41671b10800A74754R2231a87132C3325J1406L95956G0928N8801d27180
16073A9978J74028F5632Q1534f385B75722K0745F3209d2672l17118a31021A44443
16061A98908a8024q5270a2943j10246c2960l723A74186j6683a84595e3998A92232
16049b31156C1416a38806c2657B71832H5124j2943j6650a15217F7866p017R4031
16038A54880b42479f1696B51249a11800C01808n1301J12902r1480a21973A40689
16027A47493e8792A4454a70316k2181B33077N7139I4623C4577J52621a93248C4809
$$ plain form
16015 140073 315370 152916 16712 131149 247200 -26766 279515 134373 153284 -386 50889
16003 -216672 91163 211054 -224430 -112305 -84236 -29303 209063 -93228 268459 44123
15992 262230 -93063 253220 447541 79490 478845 487429 1091587 977573 848436 1029102
15982 1029102 822232 616367 585526 530162 609684 285019 246046 82933 -73287 257220
15971 -90688 -280105 -151369 -114930 81296 39648 262001 -24523 283815 118613 -153478
15960 -76164 145518 285360 30127 275195 -10790 -66037 -151794 180741 -8700 -119095 122234
15948 -11614 11775 57733 -127526 280479 180917 -48976 -40244 91595 -93253 -31152 -226636
15937 -226636 168707 -39947 -52552 177560 -134621 -203160 -1844 -57638 -192714 -23056 108376
$$ packed form
16015A40073J75297A52916A6712J14437J16051b6766B79515A34373J8911c86E0889
16003b16672I1163J19891b24430J12125K8069b9303B09063i3228B68459D4123
15992B62230i3063B53220J94321G9490L99355Q584O04158j14014j29137J80666
15982A029102k06870k05865l0841n5364P9522B85019l8973H2933g3287B57220
15971i0688j89417J28736L6439H1296C9648K22353b4523B83815A18613a53478
15960g6164A45518J39842C0127K45068a0790n5247q5757A80741h700j10395A22234
15948a1614A1775M5958a27526B80479r9562d8976Q732I1595i3253c1152j95484
15937b26636A68707c9947j2605A77560a34621o8539a844n5794j35076b3056A08376
$$ plain form
15925 -304333 48813 -133056 -91681 29467 -112315 108981 275699 297155 78453 -43394 329289
15913 -73502 -126141 -82384 70351 348322 -29262 258467 -152070 81014 -66391 280272 -92093
15901 126803 -33287 -142752 267917 224800 -115580 -124912 -102080 -123147 -122830 45092 -248740
15889 -197865 53953 201131 -155838 -243509 -35969 -74238 -108116 -89642 -3363 -305235 66263
15877 -94524 -248071 22475 43788 155265 -189591 -17177 -189703 29678 -115255 25031 258988
15866 258988 30765 -184689 -198777 -69107 185079 -135674 249823 62032 78774 61176 21657
15854 -45234 -274954 -301811 -144320 27796 143444 -126166 -27169 111186 -22879 -44158 -64104
15843 -64104 241546 10911 -204 40408 143509 264275 -154943 91603 -515568 -69387 15587
$$ packed form
15925c04333D8813a33056M1375B9467a12315A08981J66718K1456G8453d3394C29289
15913g3502n2639M3757G0351K77971b9262B58467a52070H1014f6391B80272i2093
15901A26803c3287j09465B67917m3117a15580r332K2832k1067L17D5092b48740
15889a97865E3953J47178a55838q7671c5969l8269l3878J8474c363l01872F6263
15877i4524j53547B2475K1313J11477a89591a7177j72526B9678a15255B5031K33957
15866B58988C0765a84689j4088f9107A85079a35674B49823F2032J6742j7598B1657
15854d5234k29720k6857a44320B7796J15648a26166b7169A11186b2879k1279j9946
15843f4104B41546A0911b04D0408J03101J20766a54943I1603e15568f9387A5587
$$ plain form
15831 -69767 -138555 -152015 46504 -102446 53353 -28542 128582 -57412 55497 247787 -142093
15819 15830 237835 -16125 -91093 -4813 167899 493135 253403 90140 206783 -129650 -35467
15807 -5067 -63595 -107202 267003 -80192 26261 -149900 149721 48762 266041 -64919 40160
15795 -180557 185864 275071 -6801 169691 -269276 -277850 208001 194312 29388 167276 222335
15784 222335 -134681 88930 79072 -142082 -85230 359092 -228394 102766 66028 98560 -54996
15772 -142181 -119164 31886 129801 -165253 531332 92335 116048 86213 33942 226383 -175997
15760 -265921 -4688 20106 56921 312421 -206461 69908 76323 246270 47893 79848 -287042
15748 -102264 189788 853 75301 -201598 -91731 84058 21185 -222468 8696 507243 120097
$$ packed form
15831f9767o8788j3460D6504a02446E3353b8542A28582e7412E5497J92290a42093
15819A5830K22005a6125p4968d813A67899L25236k39732I0140J16643a29650c5467
15807e067n8528m3607B67003h0192B6261a49900A49721D8762K17279f4919D0160
15795a80557A85864Q9207f801A69691b69276q574B08001j3689B9388J37888N5059
15784B22335a34681H8930r858a42082N6852C59092b28394A02766l6738L2532e4996
15772a42181K3017C1886R7915a65253E31332I2335K3713k9835C3942J92441a75997
15760b65921d688B0106L6815K55500b06461F9908O415J69947D7893L1955b87042
15748a02264A89788H53P4448b01598i1731H4058B1185b22468H696M98547A20097
$$ plain form
15736 58583 -32461 84174 -138051 -71480 -46439 146868 -3896 -105778 207962 -224901 121855
15724 -175847 165354 -32430 119120 -212083 -128084 74297 -16039 -95473 -52203 5853 125698
15713 125698 -165171 46750 64184 122355 -50755 -7142 440830 70856 -63772 -122468 288597
15701 -405443 -4339 -1535 75830 72180 -107050 18364 347643 -219098 164689 86076 -15380
15689 -206103 -63239 53161 264685 27266 108726 -121669 199897 -23522 -8218 124343 -19016
15677 210538 328308 -106958 8549 -30798 86534 268931 -61945 -79572 -99627 -72790 -166646
15666 -166646 -365470 290547 -128048 280552 -351149 -275128 -42012 -169962 -91264 85735
15655 -53286 -332301 -307221 39015 36152 71964 -184786 -63755 -333880 -254137 35042 170552
$$ packed form
15736E8583c2461H4174a38051O6571K5041A46868c896j01882B07962b24901A21855
15724a75847A65354c2430A19120b12083Q3999G4297a6039p9434M3270E853J19845
15713A25698a65171D6750J7434N8171e0755g142D40830G0856f3772n8696B88597
15701d05443d339a535G5830l650a07050A8364L29279b19098A64689p8613a5380
15689b06103f3239E3161K11524B7266Q1460a21669A99897b3522h218A24343a9016
15677B10538J17770a06958H549c0798H6534J82397f1945j7627k0055K6837r3856
15666a66646j98824B90547a28048B80552c51149P6021d2012j27950P8698H5735
15655e3286k79015K5080C9015k863L5812a84786f3755k70125P9743C5042J35510
$$ plain form
15644 170552 468461 -160843 -132400 -55083 -164602 -44503 -64858 40952 -38597 157838 26991
15632 -17750 98389 -514714 95543 -160679 79002 142492 -309913 -156925 -410900 -133028
15621 -58114 -41849 -168879 94313 -79628 -130928 -151790 -33567 -24970 -150476 -99138 20783
15609 -188124 -255666 -143539 85550 59261 -124518 -427279 76648 146958 -1116 12580 47542
15598 47542 -99122 -245240 -271895 -108000 231308 -158661 17530 5897 254820 155999 162057
15587 162057 -385943 -110077 55981 -33852 3365 -144309 116131 -95385 32079 -368695 -192372
15576 -192372 130923 -253206 -46001 -57837 70855 13199 -201697 82200 -92826 -147259 214761
15564 59217 -94152 18028 -236096 -359649 227009 -179132 77529 -1296 -104857 36839 -158948
$$ packed form
15644A70552K97909a60843K8443e5083j09519d4503k0355D0952c8597A57838B6991
15632a7750I8389e14714I5543a60679G9002O3490c09913J52988k53975a33028
15621e8114J6265j27030I4313g9628n1300k0862c3567Q597j25506N1338B0783
15609a88124o7542J12127H5550k6289a24518l02761G6648P0310a116A2580L4962
15598D7542i9122j46118k6655a08000B31308a58661A7530E897K48923r8821O058
15587A62057c85943a10077E5981c3852C365a44309A16131i5385C2079c68695J76323
15576a92372A30923b53206d6001j1836G0855A3199b01697H2200i2826n4433B14761
15564E9217i4152A8028b36096j23553B27009a79132G7529a296j03561C6839a58948
$$ plain form
15552 -71360 -174734 191589 116681 122160 40907 242737 -56967 21182 67445 13412 165750
15541 165750 64248 -18385 125634 188958 -48587 33140 -113003 77573 62262 106144 90771
15530 90771 -311799 -44373 -68114 223078 -61625 131370 32484 108972 -41556 136443 104126
15519 104126 275342 93437 242413 222999 433224 164722 435393 -17327 344634 575156
15509 575156 -130198 -26941 217624 247081 -294540 97371 252812 289894 26616 255532
15499 255532 -78175 255535 376897 -56716 -361349 283502 68724 310808 341297 219112
15489 219112 -245262 257397 317202 113802 229853 144173 50544 -69330 377367 480159
15479 480159 170687 -140417 598129 548171 464849 332519 520072 420092 69529 502516
$$ packed form
15552g1360j03374A91589p4908N479D0907K01830e6967B1182M6263A3412J52338
15541A65750F4248a8385A25634O3324d8587C3140a13003G7573j5311M3882j5373
15530I0771c11799d4373k3741B23078f1625A31370C2484P6488d1556A36443l2317
15519A04126J71216I3437J48976j9414K10225A64722K70671a7327C44634K30522
15509E75156a30198b6941B17624K9457b94540I7371J55441L7082B6616K28916
15499B55532g8175B55535J21362e6716l04633B83502F8724K42084L0489j22185
15489B19112b45262B57397N9805A13802J16051q5680E0544f9330C77367J02792
15479D80159A70687a40417E98129m9958q3322j32330J87553r9980F9529M32987
$$ plain form
15469 502516 55255 29714 319270 -188430 4336 192620 194455 100476 94032 -197804 249369
15457 -12706 80492 241027 49450 414861 37001 188761 -60194 23331 -137485 103391 250338
15446 250338 245409 321888 427014 703898 806253 670243 740573 508950 496231 387636
15436 387636 444757 359672 169117 189635 -75279 3513 -11075 98156 -186090 41360 89984
15425 89984 106661 -203336 -134927 211351 36365 -150722 -121871 -206086 -74339 -174518 -22044
15413 -181566 -74631 312331 89326 -208878 -267007 -188675 187809 -138838 42485 195572
15403 195572 68976 70597 -126260 -51260 -329404 322404 184455 -4633 27121 272 98133
15392 98133 179458 356312 -25642 -185445 -219658 -131333 107892 321511 -103381 174367
$$ packed form
15469E02516E5255k5541K89556a88430D336J88284J835r3979o444a97804B49369
15457a2706H0492J60535D9450L65411C7001J51760f0194B3331a37485A03391J46947
15446B50338m929P6479J05126K76884J02355j36010P0330k31623j2719j08595
15436C87636N7121q5085A69117K0518g5279C513a1075I8156a86090D1360M8624
15425H9984J6677b03336O8409B11351C6365a50722K8851q4215g4339j00179b2044
15413a81566g4631C12331H9326b08878n8129P8332A87809a38838D2485J53087
15403A95572F8976J621a26260e1260k78144C22404j37949d633B7121B72R7861
15392I8133Q1325J76854b5642j59803l4213Q8325A07892K13619a03381A74367
$$ plain form
15381 -24050 -183627 397378 -155170 90688 -50870 85334 -24344 305129 253116 174816 26122
15369 309328 173414 -12731 44068 121791 374737 113508 363737 144432 -159372 259577
15358 306511 286911 131506 57476 126390 -133184 178205 122249 455277 -56870 89615 2717
15346 111019 227239 -51662 181896 239244 491845 600835 38608 -39261 322783 -172438
15335 552 -47762 375319 129990 -21716 335262 339566 -101396 -54935 250717 404001 8576
15323 116587 261698 61228 346265 90773 307876 213300 -56968 150893 163575 228822 320014
15312 320014 340952 -34305 201746 153561 13733 -62549 156777 21835 -46514 106202 194081
15301 194081 266517 99579 149972 332547 -92017 197379 -81077 92575 -212703 -125275 121199
$$ packed form
15381b4050j59577C97378a55170I0688e0870H5334b4344C05129n2013p8300B6122
15369C09328j35914a2731D4068P7723K52946A13508K50229A44432a59372B59577
15358C06511j9600A31506E7476O8914a33184A78205n5956L33028e6870H9615B717
15346A11019J16220e1662A81896N7348K52601J08990C8608c9261C22783a72438
15335E52d7762C75319A29990b1716C35262M304a01396M6461B50717J53284H576
15323A16587J45111F1228K85037I0773K17103r4576e6968A50893J2682O5247R1192
15312C20014K0938c4305B01746m8185A3733f2549A56777B1835d6514A06202Q7879
15301A94081P2436I9579N0393J82575i2017A97379h1077I2575b12703Q7428A21199
$$ plain form
15289 -56180 -283017 -98417 89010 66052 -85083 -119443 193572 -19942 -352540 35865 -219446
15277 46733 215153 -347953 -143546 145830 209783 -24882 -16 53380 124431 -136325 -166442
15266 -166442 234670 270983 258886 77887 75391 375448 -59664 13029 -77491 -72751 75 143273
15254 143273 -48743 -42257 -261810 -141706 229858 180404 120502 254161 -39717 178234 604036
15243 604036 690662 977581 1079682 1227176 1489901 897014 644878 572620 342785 600705
15233 600705 413112 289741 29918 267484 169188 165490 130828 84529 364047 -4097 193777
15221 -19948 -36487 150180 32048 -91458 156718 -129425 -199645 123935 -177028 13642 -172498
15209 -16988 59131 18707 284078 256527 -87287 322595 41788 -36506 -157765 -1669 8724
$$ packed form
15289e6180k26837i8417H9010k2958h5083l4360A93572a9942l32598C5865b19446
15277D6733J68420c47953a43546A45830O3953b4882a6E3380P1051a36325l0117
15266a66442B34670L6313j2097G7887k496L00057e9664A3029g7491M740G5J43198
15254A43273d8743O486k19553J20104B29858m9454n9902J33659c9717A78234M25802
15243F04036Q6626K86919J02101J47494K62725n92887k52136p2258k29835K57920
15233F00705j87593j23371B9918K37566r8296l698l4662m6299K79518d097A93777
15221a9948j6539A50180C2048i1458A56718a29425p0220A23935a77028A3642a72498
15209a6988E9131A8707K65371k7551h7287C22595D1788c6506j21259a669H724
$$ plain form
15197 -47366 6029 84542 153931 163168 -124599 270094 98966 -8963 407701 127557 99084
15186 99084 -64937 125117 129605 209943 -58126 -23727 200583 -39102 -41048 -10029 90072 -30848
15173 156801 -8921 27880 130577 111856 154036 425244 24274 201093 9920 -280395 59025
15161 11490 80466 -89292 17693 128394 -16608 233362 5224 163028 294618 279582 -189787
15149 65979 404202 -29817 -33299 -31251 261569 -134521 544391 -44381 280367 -295625 271861
15137 97794 -54883 156669 336459 168772 206302 402053 236660 47576 180419 134644
15127 134644 -92899 -1664 -31451 106989 -135300 319853 366231 114028 99357 226458 75777
15115 55596 422173 -57638 109916 314457 140200 274362 228578 217644 68333 168316 199075
$$ packed form
15197d7366F029P8513O9389R237a24599B70094I8966h963D07701A27557k8473
15186I9084f4937A25117M488Q0338e8126b3727B00583c9102j946a0029I0072c0848
15173A56801h921B7880J02697j8721M2180K71208B4274J76819I920b80395E9025
15161A1490O8976h9292A7693J10701a6608B33362E224J57804J31590j5036a89787
15149F5979L38223b9817l482K048B61569a34521E44391d4381B80367b95625B71861
15137I7794e4883A56669J79790j67687L7530J95751j65393D7576J32843m5775
15127A34644i2899a664k9787A06989a35300C19853M6378A14028j4671J27101G5777
15115E5596L66577e7638A09916K04541A40200J34162m5784j0934F8333R9983L0759
$$ plain form
15104 199075 -20193 351862 352427 -172229 92142 127976 126421 211971 153420 -72314 -47644 97184
15091 232321 -113296 2233 69678 109373 134004 234835 241806 37686 208392 229774 230003 85091
15078 143145 -78857 207188 143089 247179 371739 237320 88494 9645 177409 207788 309635
15067 309635 416353 289412 150521 -128445 222378 369061 292200 27729 -24828 123894
15056 336142 176652 126485 444519 497247 179595 248959 145230 147885 389936 354502 578417
15045 578417 213637 368327 402884 189627 222259 319912 400195 487409 242684 183150 349835
15034 349835 399937 101912 590605 556121 483843 904224 788346 539520 387330 459273
15024 459273 503864 493506 390858 658643 291497 591438 352638 461033 730570 399585
$$ packed form
15104A99075b0193C51862N65a72229I2142L5834j555Q5550n8551g2314K4670I7184
15091B32321a13296B233O7445L9695K4631J00831O971C7686J70706K1382K29H5091
15078A43145g8857B07188o4099J04090J24560j34419H8494I645J67764L0379J01847
15067C09635J06718j26941j38891a28445B22378J46683p6861B7729b4828A23894
15056C36142j59490n0167L18034N2728A79595O9364j03729K655K42051l5434K23915
15045E78417B13637J54690L4557A89627L2632R7653Q0283Q7214B42684n9534J66685
15034C49835N0102A01912M88693l4484p2278M20381j15878k48826j52190P1943
15024D59273M4591j0358j02648K67785B91497K99941k38800J08395K69537l30985
$$ plain form
15014 399585 435190 314435 539810 510285 515635 484143 318330 654803 507482 242062
15003 160341 290281 212005 384752 450680 503197 301628 361978 529785 -147914 411868
14992 436131 625828 235372 269454 430335 350892 497576 397146 462755 598716 770454
14982 770454 941563 665134 910174 400325 731475 491965 548775 407270 664215 486358
14972 486358 656817 599908 633693 575052 582037 860795 463370 576515 293574 447774
14962 447774 225885 285267 208664 307818 207406 360993 230843 282275 226830 260093 636355
14951 636355 404646 342943 391226 261680 371830 675362 384204 616998 816985 635046
14941 635046 396588 594325 200200 685037 428358 741326 580112 817339 677553 870377
$$ packed form
15014C99585L5605j20755K25375k9525N350l1492j65813L36473j47321B42062
15003A60341J29940p8276J72747O5928N2517k01569O0350J67807a47914D11868
14992D36131J89697B35372L4082J60881p9443J46684j00430O5609J35961J71738
14982G70454J71109k76429K45040D00325L31150k39510N6810j41505K56945j77857
14972D86358J70459n6909L3785n8641O985K78758l97425J13145k82941J54200
14962D47774k21889N9382p6603R9154j00412J53587j30150N1432n5445L3263L76262
14951F36355k31709o1703M8283j29546J10150L03532k91158K32794J99987j81939
14941F35046k38458J97737B00200M84837k56679L12968j61214K37227j39786J92824
$$ plain form
14931 870377 599533 930124 1330972 1136411 1564639 1402677 1547940 1306462 1761892 1551855
14921 1551855 1536361 1479201 1467894 1955171 1851629 1752971 1669208 1573032 1346080 1068433
14911 1068433 1210236 1297292 839149 435313 762229 596019 595888 476573 471606 651636
14901 651636 297418 380714 399450 718610 310273 483686 413177 162061 318248 754284
14891 754284 423270 508938 377745 552085 713273 900891 544755 499572 691929 1000657
14881 1000657 884735 849627 540027 783895 799950 348164 341733 544141 709448 662477
14871 662477 312811 231304 508661 1018376 445222 705000 791154 1005327 876517 470381
14861 470381 738467 496995 615979 315443 549457 595633 354938 407181 533916 684334
$$ packed form
14931H70377k70844L30591M00848j94561M28228j61962J45263k41478M55430k10037
14921A551855j5494n7160j1307M87277j03542r8658q3763r6176k26952k77647
14911A068433J41803Q7056m58143m03836L26916j66210j31j19315m967J80030
14901F51636B97418Q3296J8736L19160C10273J73413p0509A62061J56187M36036
14891G54284l31014Q5668j31193J74340J61188J87618l56136m5183J92357L08728
14881A000657j15922l5108l09600K43868J6055C48164o431K02408J65307m6971
14871F62477C12811q1507K77357N09715D45222K59778Q6154K14173j28810m06136
14861D70381K68086k41472J18984l00536K34014M6176k40695N2243J26735J50418
$$ plain form
14851 684334 607430 273109 457438 633220 422066 728106 851214 567065 1232645 771898
14841 771898 1040120 1108657 1014376 873897 1007858 672680 945635 897557 712113 524862
14831 524862 877705 628281 572276 688676 709372 548387 656674 716917 734232 828512
14821 828512 1019788 872170 564829 676938 309523 1129596 684253 613119 789398 1017417
14811 1017417 456147 623425 284433 695716 760475 710138 1097333 1029811 490553 1053558
14801 1053558 787517 711113 354612 796395 862125 567697 627559 739000 517184 779306
14791 779306 679873 1090963 399348 1006355 671433 405565 536358 634310 569305 722363
14781 722363 738546 849053 767311 479284 801916 901803 880709 786806 977325 793317
$$ packed form
14851F84334p6904B73109J84329J75782k11154L06040J23108k84149O65580m60747
14841G71898K68222O8537r4281j40479J33961l35178K72955m8078j85444j87251
14831E24862L52843k49424n6005J16400K0696j60985J08287O0243J7315R4280
14821H28512J91276j47618l07341J12109C09523Q20073m45343p1134J76279K28019
14811A017417D56147J67278B84433M11283O4759n0337L87195o7522D90553N63005
14801A053558k66041p6404C54612M41783O5730k94428N9862J11441k21816K62122
14791G79306r9433M11090C99348O07007l34922k65868J30793R7952o5005J53058
14781G22363J6183J10507q1742k88027L22632R9887k1094r3903J90519j84008
$$ plain form
14771 793317 759683 648321 920920 918884 541995 955657 640696 404823 613236 349175
14761 349175 718456 404268 207075 525349 250085 414266 825509 526241 660949 638228
14751 638228 401523 402200 510703 741394 1043132 935276 743421 584754 981104 550239
14741 550239 1115390 1010075 684568 797764 734460 800377 891391 1119464 963662 872841
14731 872841 1017603 1370414 1325789 988708 1396504 1801673 1691766 1412552 1623157 1015448
14721 1015448 1241178 942800 1329244 726408 1109026 1118696 1063457 1212611 526079 722897
14711 722897 891554 981337 739696 751044 758894 1027009 1404378 1410539 1479012 1522802 1960143
14700 1960143 1647173 1347625 1457241 1435297 1154211 1398517 1043830 1191847 1050002 824655
$$ packed form
14771G93317l3634j11362K72599k036l76889M13662l14961k35873K08413k64061
14761C49175L69281l14188j97193L18274B50085J64181M11243k99268J34708k2721
14751F38228k36705O77J08503K30691L01738j07856j91855j58667L96350m30865
14741E50239N65151j05315l25507J13196o3304O5917R1014K28073j55802r0821
14731H72841J44762L52811m4625l37081M07796M05169j09907k79214K10605o07709
14721A015448K25730k98378L86444o02836L82618R670n5239J49154E26079J96818
14711G22897J68657Q9783k41641J1348P850K68115L77369O161O8473M3790M37341
14700A960143l12970k99548J09616k1944k81086K44306l54687J48017j41845k25347
$$ plain form
14690 824655 1155861 870997 1125065 1104923 1289980 875449 935888 938732 738766 857547
14680 857547 619323 956115 1023364 1122272 766137 1142215 1123295 1100907 1075574 992071 1089717
14669 1089717 946288 1114017 842367 1292536 974469 691386 1371441 1183290 1152558 1033054
14659 1033054 1066924 996988 1312870 978129 1074168 1263799 1446803 1451813 1672554 1493901
14649 1493901 1191446 1124107 1266936 883281 1116333 1147868 1292791 1180028 1433859 812286
14639 812286 1518451 1324722 1391912 1176827 1343522 1874029 1240166 1344469 1187243 1520221
14629 1520221 1511398 858230 1235158 1322983 1535288 1253549 1505124 1532623 1620262 1388726
14619 1388726 1238841 1122646 1008049 1290275 1632828 1486635 1948312 1700814 1794287 2032205
$$ packed form
14690H24655L31206k84864K54068k0142J85057m14531O0439K844j99966J18781
14680H57547k38224L36792O7249R8908l56135L76078j8920k2388k5333q3503R7646
14669A089717j43429J67729k71650M50169l18067k83083O80055j88151l0732j19504
14659A033054L3870o9936L15882l34741R6039J89631J83004N010K20741j78653
14649A493901l02455o7339J42829l83655K33052L1535J44923j12763K53831o21573
14639H12286P06165j93729O7190k15085J66695N30507o33863J04303j57226L32978
14629A520221q823o53168L76928Q7825K12305k81739K51575K7499Q7639k31536
14619A388726j49885j16195j14597K82226L42553j46193M61677k47498R3473K37918
$$ plain form
14609 2032205 1576719 1725434 1755456 1535047 1636527 1763876 1415011 1545702 1800855 1763603
14599 1763603 1753181 1593124 1888177 2137336 1589379 1651788 1653450 2217219 2146233 1931082
14589 1931082 1659946 1704733 1829475 2216564 2023752 2224620 2015992 2112289 1893711 2160337
14579 2160337 2440307 1985107 2029053 1897954 2242414 2210096 2326522 2303573 2620423 2589667
14569 2589667 2393100 2567596 2586254 2419814 2794852 2903882 2835728 2745702 2720562 3050048
14559 3050048 3120432 3492892 3149121 3582189 3996023 3715984 3897859 4326298 5191935 6166173
14549 6166173 8514201 11548661 17394689 26042100 25840059 18634446 11477074 8665432
14541 8665432 8352663 7292098 6590712 6250326 5318838 4235411 3296743 2897572 2921371
$$ packed form
14609B032205m55486J48715L0022k20409J01480J27349l48865J30691K55153l7252
14599A763603j0422j60057K95053K49159n47957O2409J662N63769p0986k15151
14589A931082k71136M4787J24742L87089j92812K00868k08628R6297k18578K66626
14579B160337K79970m55200M3946j31099L44460l2318J16426k2949L16850l0756
14569B589667j96567J74496J8658j66440L75038J09030o8154r0026k5140L29486
14559C050048P0384L72460l43771M33068M13834k80039J81875M28439Q65637R74238
14549F166173K348028L034460N846028Q647411k02041p205613p157372k811642
14541H665432l12769j060565p01386l40386r31488j083427r38668l99171K3799
$$ plain form
14532 2921371 2740166 2309663 2415271 2160972 2490991 2904356 2188056 2422786 2731008
14523 2731008 3058941 2937322 2610214 2713497 2629181 2662381 2787095 3077312 3154758 2950972
14513 2950972 3177411 2987348 3406855 2992166 3298690 3490036 3065811 3288069 3464689
14504 3464689 3547037 3236140 3694801 3245282 3544643 3674328 3586460 3650348 3625038 3827534
14494 3827534 3751172 3712000 4055133 3890364 4055392 3841156 4168560 4303052 4291603 4263162
14484 4263162 4272011 4030457 4387884 4332652 4071065 4436276 4383768 4623850 4608671 4711801
14474 4711801 4477934 4642405 4956354 4777447 5147072 5281124 5153387 5396808 5063086
14465 5063086 5161234 5250671 5370986 5594107 5645811 5332349 5715408 5867005 5588803 5832464
$$ packed form
14532B921371j81205m30503J05608k54299L30019M13365p16300K34730L08222
14523B731008L27933j21619l27108J03283q4316L3200J24714K90217P7446k03786
14513B950972K26439j90063M19507m14689L06524J91346m24225K22258J76620
14504C464689Q2348l10897M58661m49519K99361J29685q7868O3888k5310K02496
14494C827534p6362l9172L43133j64769J65028k14236L27404J34492j1449k8441
14484D263162Q849k41554L57427n5232k61587L65211n2508K40082j5179J03130
14474D711801k33867J64471L13949j78907L69625J34052j27737K43421l33722
14465E063086R8148Q9437J20315K23121N1704l13462L83059J51597k78202K43661
$$ plain form
14455 5832464 5984021 6178261 5896182 6109313 6047266 6031618 6288615 6732734 6702922 6446688
14445 6446688 6851417 6782303 6990104 7066210 7272771 6826044 7376785 7401304 7440046 7639773
14435 7639773 7625835 7725984 7788161 7690564 7789810 7824626 8404291 8401918 8503309 8578773 8967350
14424 8967350 8776330 8867193 9585969 10073419 9595347 9967862 9997038 10396515 10465803 10672128
14414 10672128 10299276 10464188 10828493 10827442 11057161 11185183 11057702 11694609 11927587 11777193
14404 11777193 12264067 12203631 12833382 12678128 12717261 13060386 13480079 13882217 13766017 13936288
14394 13936288 14507169 14302257 14387102 14639148 14889101 15104742 15202824 15989574 16142376 16394078
14384 16394078 16836430 17287025 17610740 17610383 17905050 18476244 18577940 18881882 19402106 19409171
$$ packed form
14455E832464J51557J94240k82079K13131o2047j5648K56997M44119k9812k56234
14445F446688M04729o9114K07801P6106K06561m46727N50741K4519L8742J99727
14435G639773j3938J00149O2177r7597R9246L4816N79665k373J01391P5464L88577
14424H967350j91020R0863P18776M87450m78072L72515K9176L99477O9288K06325
14414A0672128l72852J64912L64305j051K29719J28022j27481O36907K32978j50394
14404A1777193M86874o0436O29751j55254L9133L43125M19693M02138j16200J70271
14394A3936288N70881k04912Q4845K52046K49953K15641R8082P86750J52802K51702
14384A6394078M42352M50595L23715l57K94667N71194J01696L03942N20224P065
$$ plain form
14374 19409171 19910861 20476114 20668321 21330173 21542989 21996374 22086541 22668527 23222211
14365 23222211 23372543 23985805 24539002 24533685 25326557 26110098 26385005 27036131 27298062 28004675
14355 28004675 28378929 29102819 30110239 30454566 31139806 31789167 32900407 33389191 34465661
14346 34465661 34908390 35867502 36634221 37557150 38752225 39526280 40426827 41354936 42514918
14337 42514918 43549951 44906900 45667564 46741430 48413896 49551617 51221623 52689482
14329 52689482 54214748 55402691 57195582 58857607 60547645 62461825 64326000 66426134
14321 66426134 68413823 70896093 73260831 75489241 78200652 80158090 82966754 85650114
14313 85650114 88737311 92004720 94735473 98285185 102151952 105725660 109711726 113493722
$$ packed form
14374A9409171N01690N65253J92207O61852K12816M53385R0167N81986N53684
14365B3222211J50332O13262N53197n317P92872P83541K74907O51126K61931P06613
14355B8004675L74254P23890J007420L44327O85240O49361J111240M88784J076470
14346C4465661M42729R59112P66719R22929J195075P74055R00547R28109J159982
14337D2514918J035033J356949P60664J073866J672466J137721J670006J467859
14329E2689482J525266J187943J792891J662025J690038J914180J864175K100134
14321F6426134J987689K482270K364738K228410K711411J957438K808664K683360
14313H5650114L087197L267409K730753L549712L866767L573708L986066L781996
$$ plain form
14305 113493722 118220012 122943622 127433798 132732753 138134660 143853318 149986508 155818685
14297 155818685 162661489 169566007 177031138 184363361 193013372 201745422 211401243 221312001
14289 221312001 231789717 242719478 254024962 265988264 278549611 292283013 306243185
14282 306243185 320901961 336310765 351905388 368027466 383763745 399084658 413481525
14275 413481525 425721563 434435322 437307007 438606004 439694706 441528193 427687966 418981720
14267 418981720 413529943 399218005 386934005 381377892 380182554 380857357 379578184 373730545
14259 373730545 359894717 343180267 326476671 309361910 293066021 277287660 262326916
14252 262326916 248323333 234993457 222093007 210557398 199964357 189885173 180219753
$$ packed form
14305A13493722M726290M723610M490176N298955N401907N718658O133190N832177
14297A55818685O842804O904518P465131P332223Q650011Q732050R655821R910758
14289B21312001J0477716J0929761J1305484J1963302J2561347J3733402J3960172
14282C06243185J4658776J5408804J5594623J6122078J5736279J5320913J4396867
14275D13481525J2240038Q713759K871685J298997J088702J833487j3840227q706246
14267D18981720n451777j4311938j2284000n556113j195338O74803j279173n847639
14259C73730545j3835828j6714450j6703596j7114761j6295889j5778361j4960744
14252B62326916j4003583j3329876j2900450j1535609j0593041j0079184r665420
$$ plain form
14245 180219753 170958663 162561135 154510872 146851379 140012565 133247475 127010154 121376645
14237 121376645 116094259 110746738 106005265 101189122 96896961 92761776 89348315 85434307
14229 85434307 82258969 78980291 75744569 73136115 70237891 67667116 65174140 62896952
14221 62896952 60563735 58525048 56700944 54710720 52848162 50926873 49543138 48047586
14213 48047586 46593635 45251282 43706436 42473141 41211243 40079127 39052106 38032326
14205 38032326 36755670 35707509 34892179 34151072 33117241 32640906 31320204 30835211 29626771
14196 29626771 28944522 28328045 27402122 27279057 26371731 25934184 25047031 24142034 23724243
14187 23724243 23206891 22623070 22043877 21819221 21120208 20506836 20239274 19699417 19280483
$$ packed form
14245A80219753r261090q397528q050263p659493o838814o765090o237321n633509
14237A21376645n282386n347521m741473m816143m292161m135185l413461l914008
14229H5434307l175338l278678l235722k608454k898224k570775k492976k277188
14221F2896952k333217k038687j824104j990224j862558j921289j383735j495552
14213D8047586j453951j342353j544846j233295j261898j132116j027021j019780
14205C8032326j276656j048161q15330p41107j033831m76335j320702m84993j208440
14196B9626771o82249o16477r25923j23065r07326m37547q87153r04997m17791
14187B3724243n17352n83821n79193k24656o99013o13372k67562n39857m18934
$$ plain form
14178 19280483 19051622 18406825 18212725 17563448 17511041 16841741 16736173 16162223 16050334
14169 16050334 15865906 15802197 15156265 14759073 14818416 14542819 13916942 13856268 13301540 13215428
14159 13215428 13463964 13190859 12506313 12451757 12184036 12358514 11898541 11694425 11484249
14150 11484249 11184273 11094104 10809007 11155546 10574080 10367515 10492539 10337092 9838197
14141 9838197 10116020 9714128 9563574 9350560 9213651 9104064 9098911 8895670 9003508 8742872
14131 8742872 8539194 8593840 8620146 8039653 8149519 7944565 8002331 7634021 7577963 7505370
14121 7505370 7632409 7495034 7141681 7311835 7157135 7054628 6872307 6834596 6929109 6548355
14111 6548355 6785862 6475860 6669186 6355638 6314482 6255937 6069045 6199044 5793807 6002427
$$ packed form
14178A9280483k28861o44797j94100o49277n2407o69300j05568n73950j11889
14169A6050334j84428o3709o45932l97192N9343k75597o25877o0674n54728q6112
14159A3215428K48536k73105o84546n4556k67721J74478m59973k04116k10176
14150A1484249k99976r0169k85097L46539n81466k06565J25024j55447m98895
14141I838197K77823m01892j50554k13014j36909j09587n153k03241J07838k60636
14131H742872k03678N4646K6306n80493J09866k04954N7766l68310n6058p2593
14121G505370J27039j37375l53353J70154j54700j02507j82321l7711R4513l80754
14111F548355K37507l10002J93326l13548m1156n8545j86892J29999m05237K08620
$$ plain form
14101 6002427 6175530 5729464 5860011 5635770 5777063 5397783 5162550 5580523 5393382
14092 5393382 5420384 5397329 5379888 4995356 5170071 4878482 4913838 4666590 4858935 4847330
14082 4847330 5043419 4736689 4803665 4356331 4600964 4749061 4246374 4565421 4085281 4279960
14072 4279960 4070873 4010041 4555027 3986762 4193076 4233179 3980805 4140434 3880803 4257805
14062 4257805 4064789 4143576 3862654 4219306 3446918 4305163 4194745 3972969 3748229 3874705
14052 3874705 3523871 3717288 3346972 3420774 3584282 3902460 3342898 3162398 3331814 3440727
14042 3440727 3471406 3401392 3217908 3203559 3248919 3140660 3370129 2727834 2951672 3022536
14032 3022536 3124261 3049405 3248516 3170305 2747524 3393727 2774208 2891020 2820188 2720342
$$ packed form
14101F002427J73103m46066J30547k24241J41293l79280k35233M17973j87141
14092E393382K7002k3055j7441l84532J74715k91589L5356k47248J92345j1605
14082D847330J96089l06730O6976m47334K44633J48097n02687L19047m80140J94679
14072D279960k09087o0832N44986n68265K06314M0103k52374J59629k59631L77002
14062D257805j93016P8787k80922L56652p72388Q58245j10418k21776k24740J26476
14052C874705l50834J93417l70316P3802J63508L18178n59562j80500J69416J08913
14042C440727L0679p0014j83484j4349M5360j08259K29469o42295K23838P0864
14032C022536J01725p4856J99111p8211m22781O46203o19519J16812p0832r9846
$$ plain form
14022 2720342 2857774 2920633 2537344 2300281 2708677 2548318 2891350 2848079 2273782 2619845
14012 2619845 2541809 2662511 2351763 2390755 2560351 2175441 2458110 2617605 2400376 2326696
14002 2326696 2378206 2406144 2179254 2385156 2090114 2286267 2163307 2290413 2583026 2301375
13992 2301375 2441851 2715375 3317425 4832791 7396980 12121885 21840222 25299884 21373797
13983 21373797 13994678 10518097 9345427 8797294 7355857 6006822 4876430 3653607
13975 3653607 3266413 2999778 2899728 2358031 2683506 2560440 2563092 2398746 2269268 2496347
13965 2496347 2274832 1831094 2514363 2016036 2056909 1831316 2114423 2087679 1929839 2080061
13955 2080061 2101446 1567619 2036261 2014263 2208976 1897097 1657945 1699339 1637703 1716787
$$ packed form
14022B720342J37432O2859l83289k37063M08396j60359L43032m3271n74297L46063
14012B619845p8036J20702l10748L8992J69596l84910K82669J59495k17229p3680
14002B326696N1510K7938k26890K05902k95042J96153j22960J27106K92613k81651
13992B301375J40476K73524O02050J515366K564189M724905R718337L459662l926087
13983B1373797p379119l476581j172670n48133j441437j349035j130392j222823
13975C653607l87194k66635j00050n41697L25475j23066K652j64346j29478K27079
13965B496347k21515m43738O83269m98327M0873k25593K83107k6744j57840J50222
13955B080061K1385n33827M68642k1998J94713l11879k39152M1394o1636P9084
$$ plain form
13945 1716787 1509663 1703884 1461378 1794505 1712176 1535730 1591158 1527542 1584643 1648407
13935 1648407 1495351 1652557 1463991 1524124 1461626 1620567 1443804 1501146 1223662 1668236
13925 1668236 1547744 1379572 1407726 1633993 1431258 1474431 1756117 1275948 1365219 1327261
13915 1327261 1628392 1501386 1305991 1333445 1439107 1200683 1559770 1387110 1238598 1231861
13905 1231861 1327856 1583291 1463103 1113161 1323015 769925 1067944 1085542 1233814 1382222
13895 1382222 1415530 1315118 1049002 1030924 1148311 1410539 1186443 1063676 1189019 1185857
13885 1185857 1275288 1107683 1128499 1020592 1133180 1217006 944564 990534 892583 1055552
13875 1055552 1297625 943890 1083958 1013757 1128279 1189822 878729 1328096 739086 1087079
$$ packed form
13945A716787k07124J94221k42506L33127q2329j76446N5428o3616N7101O3764
13935A648407j53056J57206j88566O0133o2498J58941j76763N7342k77484M44574
13925A668236j20492j68172K8154K26267k02735M3173K81686m80169Q9271l7958
13915A327261L01131j27006j95395K7454J05662k38424L59087j72660j48512o737
13905A231861R5995K55435j20188l49942K09854n53090K98019J7598J48272J48408
13895A382222L3308j00412k66116j8078J17387K62228k24096j22767J25343l162
13885A185857Q9431j67605K0816j07907J12588Q3826k72442M5970r7951J62969
13875A055552K42073l53735J40068p0201J14522O1543l11093M49367n89010L47993
$$ plain form
13865 1087079 1247807 1151625 1242335 739252 861992 799876 1304517 776828 1106031 1204354
13855 1204354 899131 918925 1150688 1099124 1095319 1179825 858290 988632 1281007 852226
13845 852226 871492 1253020 945150 985210 983704 847549 1294720 269661 614353 800395
13835 800395 812951 828574 853957 438393 636336 805676 1107904 925944 676440 1000854
13825 1000854 981428 1340426 695600 822647 994786 921843 989386 710158 697559 888165
13815 888165 442706 530223 702585 679338 761196 941471 800252 753409 867686 1010909
13805 1010909 723003 1162781 845349 869436 882374 764710 808580 911270 721237 786858
13795 786858 828646 1043203 524879 722812 795863 1020326 788544 885087 609574 840523
$$ packed form
13865A087079J60728r6182R0710n03083J22740o2116N04641n27689L29203R8323
13855A204354l05223J9794K31763n1564l805Q4506l21535J30342K92375m28781
13845H52226J9266L81528l07870M0060j506j36155M47171B69661L44692J86042
13835H00395J2556J5623K5383m15564J97943J69340L02228j81960k49504L24414
13825A000854j9426L58998o44826J27047J72139p2943O7543k79228j2599J90606
13815H88165D42706Q7517J72362k3247Q1858J80275j41219m6843J14277J43223
13805A010909k87906M39778l17432K4087J2938j17664M3870J02690j90033O5621
13795G86858M1788K14557n18324J97933P3051K24463k31782R6543k75513K30949
$$ plain form
13785 840523 522357 614441 618432 748411 775461 1041960 904255 709881 673628 545746
13775 545746 338733 638515 779170 608982 689213 769152 1067300 696534 606268 844534
13765 844534 1028807 467537 465995 942309 703694 475944 374068 921802 728225 523801
13755 523801 791259 722697 453994 649902 681070 80668 427679 707096 362308 792657
13745 792657 232521 591441 757890 486085 477407 475262 558535 550252 746303 726461 467897
13734 467897 492542 444931 604300 479388 571241 376704 473578 846031 670302 386653
13724 386653 581997 385408 735963 830019 244688 400108 708803 432797 842516 617307
13714 617307 435539 214192 679662 865343 468763 647788 649310 507440 806004 596243
$$ packed form
13785H40523l18166R2084L991J29979K7050K66499j37705j94374l6253j27882
13775E45746k07013K99782J40655j70188Q0231P9939K98148l70766r0266K38266
13765H44534J84273D67537j542M76314k38615k27750j01876N47734j93577k04424
13755E23801K67458o8562k68703J95908L1168H0668L47011K79417l44788M30349
13745G92657B32521L58920J66449k71805q678k145Q3273q283J96051j9842k58564
13734D67897K4645m7611J59369j24912R1853j94537R6874L72453j75729k83649
13724C86653J95344j96589L50555R4056B44688J55420L08695k76006M09719k25209
13714F17307j81768B14192M65470J85681l96580J79025J522j41870K98564k09761
$$ plain form
13704 596243 421881 707594 678766 659164 547314 535524 394788 584972 823482 274194
13693 425946 629618 443852 423425 618543 326828 587875 378002 423291 397497 541856
13683 541856 500440 512348 305259 594176 442752 308811 372454 452408 350916 429257
13673 429257 587750 578124 326050 693426 561849 398872 492089 656753 602098 383465
13663 383465 449157 779350 801967 418844 434997 471318 404690 308120 435720 456660 567656
13652 567656 440721 401993 452327 298026 140538 450615 363645 38011 177323 441243
13642 441243 452752 451188 203803 249026 371075 -92484 578920 348223 746527 642344
13632 642344 567890 372384 362981 427103 289134 143235 347667 446886 631874 301866
$$ packed form
13704E96243j74362K85713k8828j9602j11850j1790j40736J90184K38510B74194
13693D25946K03672j85766k0427J95118k91715K61047k09873M5289k5794J44359
13683E41856m1416J1908k07089K88917j51424j33941O3643P9954j01492P8341
13673D29257J58493r626k52074L67376j31577j62977R3217J64664n4655k18633
13663C83465O5692L30193K2617l83123J6153L6321o6628r6570J27600K0940J10996
13652E67656j26935l8728N0334j54301A40538L10077q6970C8011J39312K63920
13642D41243J1509j564B03803M5223J22049i2484E78920k30697L98304j04183
13632F42344p4454j95506r403O4122j37969A43235K04432R9219J84988C01866
$$ plain form
13621 119992 341233 91450 98563 578877 466776 175440 591988 258824 94721 396292
13611 396292 355872 525720 404702 672349 124776 368780 471905 661653 76895 538196
13601 538196 572685 295762 295754 210444 367814 156645 -109925 304901 286082 267622 155500
13590 155500 122238 349654 -50255 532566 577109 354498 357201 223788 402761 474406 262456
13579 262456 82052 -37929 85424 443137 389645 269992 394231 175235 334670 62254
13568 711751 519587 160363 378554 116338 305731 512270 172888 101411 536611 -80086
13557 269835 560456 249939 294626 145758 7946 237459 145421 42787 138009 217437 139335
13546 139335 75710 457679 308798 220479 207709 214155 -48113 251114 1489 437832 414016
$$ packed form
13621A19992K21241I1450P113M80314j12101A75440M16548B58824I4721L01571
13611C96292m0420J69848j21018K67647A24776K44004J03125J89748G6895M61301
13601E38196L4489k76923qq5310J57370A56645a09925C04901j8819j8460j12122
13590A55500l3262K27416e0255E32566M4543k22611K703j33413J78973P1645k11950
13579B62456H2052c7929H5424L57713n3492j19653J24239A75235J59435F2254
13568G11751j92164A60363K18191A16338J89393K06539A72888p1477M35200h0086
13557B69835K90621B49939M4687A45758G946K29513r2038D2787R5222P9428p8102
13546A39335o3625L81969j48881q8319j2770O446d8113B51114A489M36343k3816
$$ plain form
13535 414016 216473 249258 241948 269486 306925 482145 63258 165288 381414 178420 5096
13523 366711 285982 53659 327713 148573 150771 367734 34029 34878 196634 210861 476900
13512 476900 418079 22116 296759 58952 582111 605435 12615 435038 288863 154732
13502 154732 -52302 510168 412736 448233 408531 452118 296942 200181 178354 -116692 137419
13490 140213 165098 -147805 91047 308011 244488 187019 -96199 179870 -67889 109065 326294
13479 326294 153433 -48347 542017 -122459 653242 411383 -166334 29170 271646 -297526
13468 404853 382024 389902 150532 157697 153306 270934 419332 331167 415556 238661 179929
13457 179929 458372 144664 388168 284399 360515 431060 -38977 273868 196881 594941
$$ packed form
13535D14016j97543L2785p310K7538L7439J75220F3258J02030K16126A78420E096
13523C66711q0729E3659K74054A48573K198K16963C4029Q49J61756J4227K66039
13512D76900n8821B2116K74643E8952N23159K3324A2615M22423j46175j34131
13502A54732e2302E10168r7432L5497l9702M3587j55176r6761k1827a16692A37419
13490A40213K4885a47805I1047K16964o3523n7469i6199A79870f7889A09065K17229
13479C26294A53433d8347E42017a22459F53242k41859a66334B9170K42476b97526
13468D04853k2829P878A50532P165m391J17628J48398q8165Q4389j76895n8732
13457A79929K78443A44664K43504j03769P6116P0545c8977B73868p6987L98060
$$ plain form
13447 594941 138901 111271 171011 368449 475630 44147 136340 50707 339077 200400
13437 200400 227354 67910 -92554 328264 83673 181405 14217 12467 28913 71413 250980
13426 250980 469722 205430 115339 130599 427531 308922 306936 385429 -46900 346265 358392
13415 358392 20163 325983 -27490 -36339 -34668 94103 191776 191890 321025 403806 212047 326461
13403 326461 -286727 208575 268072 290213 378365 -126052 243532 64632 209394 239492
13393 239492 292426 216255 191560 73915 15301 216541 -175760 595864 387366 -155540
13382 163369 131550 355822 -42463 48582 64600 356604 162908 19512 229664 -64239 -149408
13371 -149408 320472 134367 65352 261946 452901 213020 23326 451241 369286 211523
$$ packed form
13447E94941A38901k7630N9740J97438J07181D4147R2193E0707K88370j38677
13437B00400K6954F7910i2554C28264H3673R7732A4217j750J6446M2500J79567
13426B50980K18742B05430r0091J5260K96932j18609j986P8493d6900C46265J2127
13415C58392B0163L05820b7490q849J671I4103R7673J14J29135Q2781j91759J14414
13403C26461b86727B08575N9497K2141Q8152a26052B43532F4632J44762L0098
13393B39492N2934p6171k4695G3915A5301K01240a75760E95864k08498a55540
13382A63369l1819K24272d2463D8582J6018K92004A62908A9512K10152f4239q5169
13371a49408C20472A34367F5352J96594J90955B13020B3326M27915q1955j57763
$$ plain form
13361 211523 134585 497143 253226 290743 302438 352373 243063 -31000 500833 -74440 -38142
13350 -38142 -6225 -13042 425034 148189 212685 119012 568945 407291 606676 155807 315823
13339 315823 161488 281072 114802 531640 446957 116491 208274 300748 457032 109798
13328 150359 145966 397447 244619 75876 67412 -15589 76531 292773 223833 267923 238965
13317 238965 88396 72434 177538 189292 139047 44312 21912 465711 397284 340244 139285
13305 296215 183887 134509 17557 201633 294417 399008 87366 186611 -11904 33737 -125225
13293 235985 37776 224203 -12694 -274424 74149 243615 301699 49883 250814 403392
13283 403392 249304 142861 212624 -19841 53403 190391 210120 65316 295887 150650
$$ packed form
13361B11523p6938L62558k43917L7517J1695M9935j09310c1000E00833g4440L6298
13350c8142f225o817D25034A48189O4496r3673M49933j61654J99385A55807J60016
13339C15823j54335J19584A14802M16838q4683A16491R1783R2474J56284A09798
13328A50359m393K51481j52828G5876q464a5589G6531K16242o8940M4090k8958
13317B38965H8396j5962J05104J1754n0245D4312B1912M43799o8427n7040A39285
13305B96215j12328m9378A7557J84076R2784J04591H7366R9245a1904C3737a25225
13293B35985C7776J86427a2694k61730G4149J69466N8084D9883K00931J52578
13283D03392j54088j06443O9763a9841E3403J36988J9729F5316K30571j45237
$$ plain form
13273 150650 29474 -125815 119373 -200198 94231 32957 -28055 516361 -114447 203545
13262 -14084 -7581 -19811 66941 287484 39355 -333558 243843 154549 148090 108493 395917
13251 395917 240488 70923 -50166 145243 -40497 184402 39754 99397 127118 118511 -26120
13239 -98146 -138557 302638 -15952 39466 336966 -100467 333159 61602 -42734 -79290 -87722
13228 -87722 36720 -388158 54437 231945 103807 96914 106667 -61208 49035 -16596 37142
13216 390833 -196022 270090 134924 426170 212945 239971 116447 -22600 215345 81243
13205 128771 221782 81320 -39489 71452 -26333 13630 377496 77436 -30856 181927 230181
13194 230181 -80123 96538 14701 -67996 -168061 235150 -300205 61808 -37408 -53365 104214
$$ packed form
13273A50650B9474a25815A19373b00198I4231C2957b8055E16361a14447B03545
13262a4084O503j2230F6941K20543C9355c33558B43843q9294o459l9597K87424
13251C95917j55429G0923e0166A45243d0497A84402C9754N9643K7721q607b6120
13239i8146m0411C02638a5952C9466K97500a00467C33159F1602d2734l6556q432
13228h7722C6720c88158E4437J77508A03807o893R753f1208D9035a6596C7142
13216C90833a96022B70090A34924K91246B12945K7026A16447b2600B15345H1243
13205A28771R3011H1320c9489G1452b6333A3630L63866G7436c0856A81927M8254
13194B30181h0123I6538A4701f7996j00065B35150c00205F1808c7408j5957A04214
$$ plain form
13182 211046 285270 40083 -5083 87756 322820 -129969 465728 127905 -111871 -26951 68155
13170 172187 -164125 402120 24250 224599 88310 -31151 -113925 155940 405022 108503
13159 144149 316534 241405 215259 -251997 155627 -217146 -19632 335476 -2253 293493
13148 324339 -4957 173332 -51699 114657 -150533 -235513 206763 134603 6083 48299 -31356
13136 -55293 160476 15514 86369 -12845 115300 220909 60149 -32938 300282 -133291 -152903
13125 -152903 168985 -13324 235233 80841 146440 313358 -31305 316474 281408 121055
13114 -319248 53179 -91761 -196259 -51347 161144 192923 39779 4113 -41109 -482242 -89333
13102 170649 56494 -144408 187457 141912 188488 79140 -246908 152320 208279 256899 -16135
$$ packed form
13182B11046P4224D0083e083H7756K35064a29969D65728A27905a11871b6951F8155
13170A72187a64125D02120B4250K00349H8310c1151q2774A55940K49082A08503
13159A44149J72385p5129k6146b51997A55627b17146a9632C35476b253B93493
13148C24339d957A73332e1699A14657a50533q4980B06763p2160F083M2216c1356
13136e5293A60476A5514P0855a2845A15300J05609F0149c2938C00282a33291j9612
13125a52903A68985a3324B35233H0841O5599J66918c1305C16474l5066A21055
13114c19248E3179i1761j04498e1347A61144L1779C9779D113d1109m41133h9333
13102A70649E6494a44408A87457m5545M6576G9140b46908A52320N5959M8620a6135
$$ plain form
13090 167413 -111694 -78427 104519 -114320 44658 94465 51481 47023 30418 320740 75537
13078 213706 -34770 33280 211299 63581 -1706 -118612 -57282 -203671 -25018 -111093 50165
13066 246977 212000 264300 -337857 79621 207576 231757 337176 406255 199835 -143512
13055 124216 289490 148099 -115955 191080 -192510 -218022 131628 389524 -2385 21632
13044 237817 168344 9913 -60752 19351 -234790 -68148 131446 -174581 -331574 78006 412044
13033 412044 32591 150364 -100469 -60400 -277852 387782 44949 -247448 -24133 77644
13022 -70011 156099 136873 209081 -81997 112992 40532 70894 -35820 93044 106410 -54143
13010 122361 93751 266508 82084 25900 -110725 280936 87132 84306 345464 -44309 79141
$$ packed form
13090A67413a11694L3267A04519a14320D4658M9807m2984m458j6605K90322G5537
13078B13706c4770C3280J78019F3581a706j16906e7282j46389b5018q6075E0165
13066B46977l4977N2300c37857G9621J27955K4181J05419O9079A99835a43512
13055A24216J65274j41391a15955A91080a92510k5512A31628K57896b385B1632
13044B37817o9473I913f0752A9351b34790f8148A31446a74581j56993G8006L34038
13033D12044C2591J17773a00469M0069k17452C87782D4949b47448b4133G7644
13022g0011A56099j9226P2208h1997A12992D0532L0362c5820I3044J3366e4143
13010A22361k8610J72757H2084B5900a10725B80936H7132k826K61158d4309G9141
$$ plain form
12998 252244 322719 -107209 315737 230312 152570 -113764 164731 48831 -141589 12830
12987 164952 35779 221679 285662 -321313 -119926 -303262 358409 139494 -392587 90563
12976 256731 212733 164613 -9152 -166280 -41859 -148066 255349 57036 -96257 -49464 357383
12964 74956 109402 -87948 42348 88630 229571 -14153 -147792 254714 221827 -453272 338220
12952 -136001 -138725 -2188 115771 -36857 4664 -117092 -79943 -8603 69459 391235 10278 20806
12940 20806 339690 27230 -163773 174723 -127760 233679 -81997 -333686 -403761 -13766
12929 149959 135578 289783 -188296 61370 299776 182971 -123237 -220137 -21871 -91160
12919 -91160 -78134 289895 -122024 26497 -188254 317440 167490 67318 46345 -110245
$$ packed form
12998B52244P0475a07209C15737q5425p7742a13764A64731D8831a41589A2830
12987A64952C5779J85900O3983c21313a19926j83336C58409A39494c92587I0563
12976B56731m3998m8120i152j57128d1859j06207B55349E7036i6257M6793C57383
12964G4956L4446h7948D2348M6282J40941a4153j33639B54714l2887d53272C38220
12952a36001k724b188A15771c6857D664a17092L7149h603F9459L21776A0278J0528
12940B0806L18884B7230a63773A74723a27760B33679h1997k51689p0075a3766
12929A49959j4381J54205a88296F1370K38406j16805a23237r6900b1871o9289
12919i1160J3026B89895a22024B6497a88254C17440j49950F7318k0973a10245
$$ plain form
12908 -164438 433788 59064 211018 -118798 301810 243514 -12942 74581 -53493 -198529
12898 -198529 10562 -127383 -10883 5829 -59343 -221797 38660 -44838 -172051 388110 -173291
12886 -159420 157119 82728 94507 -180222 16812 333259 -45926 -42966 47824 241689 -70866
12874 -99534 280326 -92454 172614 -466854 -227780 -95697 49936 -31156 -336169 290469
12863 -88097 228134 27988 -57979 -9677 27075 28362 -31951 -42026 275325 418413 -42231
12851 4504 -276704 -124208 166350 138595 335753 14487 25571 -44002 -91250 326854 26875
12839 -121661 -188068 -327427 -110822 -192293 197456 109028 -81221 120440 134772 10247 -121453
12827 -111336 -80396 -38326 -148984 -169361 222461 -132188 -26707 152289 349650 15569
$$ packed form
12908a64438D33788E9064J51954a18798C01810n8296a2942G4581e3493j45036
12898a98529A0562a27383a0883E829e9343j62454C8660d4838j27213C88110a73291
12886a59420A57119p4391J1779a80222A6812L16447d5926K960D7824J93865g0866
12874i9534B80326i2454A72614d66854b27780i5697D9936c1156l05013B90469
12863h8097B28134B7988e7979i677B7075J287c1951j0075B75325J43088d2231
12851D504b76704a24208A66350k7755J97158A4487J1084d4002m7248C26854B6875
12839a21661o6407j39359a10822q1471A97456q8428h1221A20440J4332A0247a21453
12827a11336L0940c8326j10658k0377B22461a32188b6707A52289J97361A5569
$$ plain form
12816 -64587 145193 78051 82893 -287376 -25238 84739 40782 165861 -278460 63236 -101587
12804 110009 63647 -85346 -6958 117307 161945 -136898 259069 -234504 -2670 -160514 160225
12792 211327 125106 -48451 1513 -73535 26238 39208 -99305 15223 35293 -103062 62969
12780 -3327 -59476 130508 -85341 -103408 206167 -219267 -66503 -122605 116125 36413 118309
12769 118309 86088 -116605 118033 127092 153806 116091 -44570 -137786 -208491 -64381 184359
12757 -10732 -80881 -63147 -430143 164765 -242378 -216671 88490 -89889 283354 -113359 2956
12745 -101117 142525 73724 73987 39890 171785 111940 44283 33273 310289 -140489 165452
12733 -138146 127113 237837 324388 324643 190937 -199844 -25431 -100924 12044 -45891 77074
$$ packed form
12816f4587A45193o7142M842b87376b5238H4739D0782J25079b78460F3236a01587
12804A10009m6362h5346f958A17307M4638a36898B59069b34504b670j57844A60225
12792B11327q6221d8451A513g3535B6238J2970i9305A5223K0070a03062F2969
12780c327n6149A30508h5341j8067B06167b19267f6503n6102A16125C6413Q1896
12769A18309l2221a16605A18033R059K6714l7715d4570r3216p0705f4381A84359
12757a0732p0149J7734l66996A64765b42378K5707H8490h9889B83354a13359B956
12745a01117A42525o8801K63l4097J31895n9845D4283j1010K77016a40489A65452
12733a38146A27113J10724Q6551K55j33706a99844b5431p5493A2044d5891G7074
$$ plain form
12721 202140 -96767 43730 88134 -63515 -49788 -176140 267569 83720 111560 -151075 -120247
12710 -120247 -11635 299404 2874 300517 94735 283554 94508 319365 424153 -22250 -39236
12699 -39236 -149880 -100717 95705 -144848 -133228 209938 -22815 427333 55851 -167097 -449536
12688 -449536 -117916 -307869 3668 113862 -34010 33633 -107839 37819 140246 -52906 253050
12676 95167 -113183 -327419 188860 62890 130719 84751 -187559 47143 -32303 -48424 -3339
12664 -141517 65499 146151 -194905 37934 200199 127854 354476 -165691 132890 -116042
12653 24849 156825 21153 284751 284590 240771 157118 97039 169048 196842 74143 -211616
12641 -84065 152642 -157859 62021 -106218 40119 -224299 52329 -23314 258715 218883 123675
$$ packed form
12721B02140i6767D3730M4404f3515J3727j26352B67569H3720K7840a51075L0828
12710a20247a1635B99404B874K97643I4735J88819I4508K24857J04788b2250j6986
12699c9236j10644M9163I5705a44848J1620B09938b2815D27333E5851a67097k82439
12688d49536a17916j89953C668J10194c4010C3633a07839C7819J02427e2906B53050
12676I5167a13183k14236A88860F2890O7829m5968a87559D7143c2303j6121c339
12664a41517F5499Q0652a94905C7934J62265p2345K26622a65691A32890a16042
12653B4849J31976B1153K63598j61m3819q3653o0079P2009K7794G4143b11616
12641h4065A52642a57859F2021a06218D0119b24299E2329b3314B58715l9832r5208
$$ plain form
12630 123675 31559 203790 387988 70806 -37586 -29660 192981 -271889 -8771 7713 72021
12619 72021 58632 -2045 -14106 184226 -332104 -129942 83930 -179631 -58933 227749 -56538
12607 429027 103596 -126341 43311 -48310 -81754 -12571 -20632 -70816 96587 367615 105777
12595 123858 -301845 127667 -164746 -104866 -88710 -61636 22563 -120455 96402 -258621
12584 73268 15966 207401 -312692 22017 217525 269084 -116227 -13090 -102995 368494 -83049
12572 -258028 222383 63235 281436 181820 -37147 -52067 39907 -217344 24578 -167037 40915
12560 78199 141589 18060 -276028 -3212 1567 4146 -103369 137997 301468 64110 -34852
12548 25209 -70185 58133 138553 151067 -280760 -141383 -37333 65001 18224 -82997 116558
$$ packed form
12630A23675C1559J72231J84198G0806c7586P926A92981b71889h771G713O4308
12619G2021j3389b045j2061A84226c32104a29942H3930a79631e8933B27749e6538
12607D29027A03596a26341D3311d8310l3444a2571q061n0184I6587K71028A05777
12595A23858c01845A27667a64746N9880J6156K7074B2563a20455I6402b58621
12584G3268A5966J91435c12692B2017J95508N1559a16227a3090q9905C68494h3049
12572b58028B22383F3235K18201r9616c7147j4920C9907b17344B4578a67037D0915
12560G8199O3390A8060b76028c212A567K579a03369A37997J63471F4110c4852
12548B5209g0185E8133Q0420J2514b80760J39377c7333F5001A8224h2997A16558
$$ plain form
12536 -156914 -179643 -82816 376718 -170259 334589 -422992 -85184 -31231 -146486 -103691
12526 -103691 115213 -49862 347407 -287898 -92671 98392 -145766 192739 174088 125526
12516 125526 126896 -91419 51371 -206876 101314 -78870 -114136 43121 68045 189604 13549
12504 -97656 178801 37707 -79392 149720 -107985 -184499 37035 150143 68912 14128 -110516
12492 -275724 -78228 -82013 56352 98396 -59009 -185781 155663 -58022 -8842 55752 -29194
12480 480488 -241230 -168443 10376 48453 -34390 -183171 205562 138350 176822 142467 8753
12468 208251 295 70861 -54799 13728 -6658 -178098 60263 -13025 -196630 -13427 23113 -230626
12455 278079 -370941 -354227 -45785 -87527 5011 -45790 -26693 46878 150845 78976 -88226
$$ packed form
12536a56914k2729h2816C76718a70259C34589d22992h5184c1231j15255M2795
12526a03691A15213d9862C47407b87898i2671I8392a45766A92739j8651m8562
12516A25526J370i1419E1371b06876A01314g8870l5266D3121K4924J21559A3549
12504i7656A78801C7707g9392A49720a07985p6514C7035J13108F8912A4128a10516
12492b75724g8228l785E6352M2044e9009j26772A55663e8022h842E5752b9194
12480D80488b41230P2787A0376L8077c4390j48781B05562o7212L8472l4355H753
12468B08251B95P0566e4799A3728f658j71440F0263a3025j83605a3427B3113b30626
12455B78079c70941J6714d5785m1742E011d5790J9097D6878J03967p1869h8226
$$ plain form
12443 74343 34278 199201 -146082 -38674 12382 227660 -4726 34358 -8397 -180903 180520
12431 -131503 140938 237207 148761 -144445 -76462 12515 -394256 99142 -36416 118449 349
12419 -131295 -126070 -192053 -132540 43964 -14698 299360 83572 -125171 -214966 348142 164945
12407 80918 51923 -220572 -83492 20221 115716 -55194 100148 -3480 94101 132586 -102591
12395 -101143 -327712 136034 6710 31548 -54218 105985 330668 -176720 -105962 -75310 -78323
12384 -78323 115415 375391 -65404 -2408 -173932 195954 591 -101275 -10851 -68421 135390
12372 15990 229661 48959 58840 -9265 -46603 -21941 -116761 -261351 -110784 383759 -117134
12360 -242292 -47116 -202440 -151936 -111141 -97079 48369 -17966 -144204 201013 -976 -91871
$$ packed form
12443G4343C4278J64923a46082c8674A2382K15278d726C4358h397j72506A80520
12431a31503A40938R6269q8446a44445O7983A2515c94256I9142c6416A18449C49
12419a31295N225o5983N9513D3964a4698B99360H3572a25171q9795C48142A64945
12407H0918k8995b20572h3492B0221R5495e5194A00148c480I4101L8485a02591
12395a01143k26569A36034F710K4838e4218A05985K24683a76720P0758L0652l013
12384g8323A15415K59976f5404b408j71524A95954E91a01275a0851n7570A35390
12372A5990K13671D8959R881i265l7338b1941r4820j44590a10784C83759a17134
12360b42292d7116j55324N0504M0795J4062D8369a7966j26238B01013i76r0895
$$ plain form
12349 -91871 -253805 96948 -10622 193428 127101 6078 114220 273716 -249866 -174932 -176647
12338 -176647 -34231 111347 -14756 193409 -41010 -30925 26239 221023 118427 275169
12328 275169 42392 141235 -106900 196006 192192 274871 -47932 146544 226378 222620 101853
12316 270730 172225 226256 233105 326132 290813 121015 76947 55815 301641 -80547 102490
12304 -124052 136144 -147296 -197514 -152726 85377 43321 38655 136094 169434 278111 -81140
12292 107686 171383 122136 28008 298792 -156468 -30548 80160 59961 343903 120738 169241
12281 169241 96714 128012 242759 287420 188040 40882 -24335 -70248 -8493 464664 59674
12269 146545 388649 52793 106591 102534 -117987 79541 147845 271619 111127 101804 -7835
$$ packed form
12349i1871j61934I6948a0622A93428o6327F078J08142J59496b49866P4934j715
12338a76647c4231A11347a4756A93409d1010J0085B6239J94784j02596J56742
12328B75169D2392R8843a06900A96006l814Q2679d7932A46544P9834l758A01853
12316B70730r8505N4031O849R3027l5319A21015m4068k1132K45826h0547A02490
12304a24052A36144a47296n0218M4788H5377m2056m666R7439L3340J08677h1140
12292A07686O3697m9247B8008K70784a56468c0548H0160k0199K83942A20738M8503
12281A69241p2527L1298J14747M4661r9380D0882b4335m5913h493D64664E9674
12269A46545K42104E2793N3798m057a17987G9541O8304J23774A11127r323g835
$$ plain form
12257 283617 462 148043 257996 251130 -42507 -270777 335096 -36614 11987 60574 225886
12246 225886 108983 153309 97409 48143 99216 32172 69136 329659 96396 -60394 -9396
12234 59464 -53127 346968 137921 69918 83349 -26535 389170 60407 235808 36939 316491
12223 316491 379827 -137525 117281 192995 128473 175005 220101 -13420 483786 106978 40452
12211 374969 58622 -134091 88014 125070 184474 137284 138252 320860 -99656 173128 149466
12200 149466 567816 486591 286482 196178 250802 70708 -65169 349987 149096 392325
12190 392325 290518 106943 -70329 131021 224352 283101 157988 42888 -120209 131122
12179 245928 47676 48417 474813 309060 99100 103645 153119 264734 335563 217481 518908
$$ packed form
12257B83617D62J47581J09953o866d2507k28270C35096c6614A1987M8587J65312
12246B25886A08983M4326n5900D8143N1073C2172L6964K60523I6396f0394i396
12234E9464e3127C46968A37921o8003J3431b6535C89170F0407J75401C6939K79552
12223C16491O3336a37525A17281P5714o4522M6532M5096a3420D83786A06978D0452
12211C74969E8622a34091H8014L7056N9404m7190R68J82608i9656A73128k3662
12200A49466M18350q1225k00109r0304N4624G0708f5169C49987A49096K43229
12190C92325j01807A06943g0329A31021R3331N8749j25113D2888a20209A31122
12179B45928D7676P41M26396j65753I9100M545M9474J11615P0829j18082L01427
$$ plain form
12168 518908 478162 57267 179045 435417 -88509 420512 264956 -5001 -64407 106985 470569
12157 470569 478220 -159294 -28005 -4371 -114200 241740 -78216 -232568 -20137 -133566 335754
12145 162815 384702 186428 166271 -46306 97453 -126711 563185 175649 -66000 -106869
12135 -106869 270999 51318 -119969 123230 -278218 14384 206590 58043 52165 10784 198055
12124 198055 -27744 85803 -101850 82605 369934 128990 198192 -93685 151401 -10934 108583
12112 113736 11968 37847 143376 -351580 115708 30783 104051 280631 196163 227314 -56177
12100 -86503 -132144 452931 92232 83506 345675 384152 81091 76102 309711 45595 400129
12089 400129 24721 -194107 243846 -59584 135995 242992 332288 181080 269068 29141
$$ packed form
12168E18908m0746E7267J21778K56372h8509D20512j55556e001n9406A06985L63584
12157D70569P651a59294b8005d371j09829B41740g8216j54352b0137j13429C35754
12145A62815K21887A86428k0157d6306I7453a26711E63185A75649f6000m0869
12135a06869B70999E1318a19969A23230b78218A4384J92206E8043n878A0784J87271
12124A98055b7744H5803a01850H2605K87329A28990O9202i3685A51401a0934A08583
12112A13736A1968K5879J05529c51580A15708C0783P3268J76580q4468L1151e6177
12100h6503m5641D52931I2232q726K62169L8477H1091m989K33609D5595L54534
12089D00129B4721a94107B43846e9584A35995J06997Q9296j51208Q7988B9141
$$ plain form
12078 190892 22630 92028 349791 202812 313643 34036 148187 150464 -145428 88862 -11623
12066 -98595 40832 40007 -38256 -74323 -33385 92558 164689 -88976 507636 320884 18099 361271
12054 361271 240584 -189892 705733 174376 -250212 95378 4699 94412 144412 -139304
12043 -177019 27670 10226 -64400 -106973 186467 -41548 25511 -164836 51250 -346882 29835
12031 3383 -70629 138756 -13951 221372 34203 297391 257300 288743 118317 -113813 -68589
12020 -68589 -154637 445178 114816 28044 311407 125897 348083 39341 29131 336625
12010 336625 -62619 -146141 96513 98849 -182699 38794 129184 -120662 -8001 -131087 -35215
11998 -47337 -115004 370086 137777 -190972 129556 -111706 -232470 -254070 119613 -421350
$$ packed form
12078A90892B2630O9398K57763j46979J10831C4036J14151K277a45428H8862a1623
12066i8595D0832q25c8256l6067c3385I2558P2131h8976E07636j86752A8099L43172
12054C61271j20687a89892G05733A74376b50212I5378D699Q9713N0000a39304
12043a77019B7670A0226f4400m2573A86467d1548B5511a64836E1250c46882B9835
12031C383g0629A38756a3951B21372C4203K63188m0091L1443A18317a13813M5224
12020f8589q6048D45178A14816B8044K83363A25897K22186C9341j0210L07494
12010C36625f2619q3522I6513K336a82699C8794R0390a20662h001j23086c5215
11998d7337o7667C70086A37777a90972A29556a11706j20764k1600A19613d21350
$$ plain form
11987 -277081 73639 214538 -56629 -2844 -233425 5805 -41324 94067 -47106 142237 -199581
11975 13288 -38319 82046 -48191 -229265 -34500 -45498 -3632 157912 436598 70231 168665
11964 168665 -165885 -33137 55594 -128739 -205077 -306236 -299855 126644 -281736 140769
11953 11000 142026 -260929 -249026 -65480 -219542 -12076 -204522 116624 -60058 -233299
11943 -233299 -30619 -35966 -389932 -334962 -188915 -306920 129337 57336 167669 -123365
11932 -66712 362607 -153784 -337191 109810 -129708 7834 27642 -23610 63715 -123288 151486
11920 -15408 -37733 -282490 130491 96485 -185067 8468 -37488 123656 4477 -273499 -200853
11909 -200853 125022 163313 35582 190689 107705 -37429 -120217 -104196 -115422 -134814 53091
$$ packed form
11987b77081G3639J40899e6629b844k30581E805d1324I4067d7106A42237a99581
11975A3288c8319H2046d8191j81074c4500j0998c632A57912K78686G0231R8434
11964A68665a65885c3137E5594a28739p6338j01159O381A26644b81736A40769
11953A1000J31026b60929J1903f5480j54062a2076j92446A16624f0058j73241
11943b33299c0619n347l53966N4970J46047j18005A29337E7336J10333a23365
11932f6712C62607a53784j83407A09810a29708G834J9808b3610F3715a23288A51486
11920a5408k2325k44757A30491l4006a85067H468c7488A23656D477b73499P2646
11909b00853A25022L8291C5582J55107q2984c7429q2788J6021j1226j9392E3091
$$ plain form
11897 82295 114756 198497 -72420 -298945 115078 -347343 -79378 182402 99228 -197968 93722
11885 -20487 -19553 -192475 33291 -122586 217071 135320 -235208 -193884 -321792 435708 -163255
11873 92894 26753 24022 144220 -110362 245936 -206942 -7221 -176939 -64692 -59511 -268184
11862 -268184 -226600 -10327 -25225 -81672 -56790 -149309 -142290 -184175 -290621 285806 -136307
11850 101863 55948 -422017 -37038 -158963 -117552 -331958 -260119 -177999 50666 -169362 253216
11838 116015 -41818 -139600 -47525 301463 160693 310511 -17081 -6724 -175678 113346 193343
11827 193343 -68673 77617 -45010 -207041 257184 -136276 30980 76322 32875 -93651 53049
11815 -144846 124287 -99586 108651 136675 392484 178097 -63785 -327425 -34094 217919
$$ packed form
11897H2295L2461Q3741g2420k26525A15078c47343g9378A82402q3174a97968I3722
11885b0487R34j72922C3291a22586B17071q1751b35208M1324j27908D35708a63255
11873I2894B6753k731J20198a10362B45936b06942g221j69718f4692N181k08673
11862b68184M1584a0327j4898n6447K4882r2519P019m1885j06446B85806a36307
11850A01863m5915d22017c7038j21925M1411k14406P1839Q2120E0666a69362B53216
11838A16015d1818r7782d7525C01463j40770J49818a7081f724j68954A13346P9997
11827A93343f8673G7617d5010j62031B57184a36276C0980M5342C2875i3651E3049
11815a44846A24287i9586A08651K8024K55809A78097f3785k63640c4094B17919
$$ plain form
11804 -185720 -78836 -17382 -297814 10726 -29357 -88942 45828 -55410 -11289 -99469 59249
11792 -229979 29194 -156352 -71198 -75735 -33840 -92652 -262096 266177 -145854 43936 -39549
11780 51667 140339 209714 -138956 -135139 -279381 -56438 209340 -413148 -18364 -115553 -311263
11769 -311263 44188 26149 -361105 144038 -156044 74064 27297 -35889 -14444 -135785 189444
11757 -219122 215247 -192110 46912 7872 -415529 -189383 -413793 57394 -308486 315728
11746 59839 -21387 -338 -190157 -204947 -122213 145192 28655 -53729 -53105 -360657 102920 142585
11734 142585 -108211 122368 -208935 -256901 -55600 76143 -151672 137685 -69978 -26816
11723 92517 324199 15722 221066 8302 82287 -385493 -107576 132761 -92230 -25273 296524
$$ packed form
11804a85720g8836a7382k80432A0726b9357n9585D5828e5410a1289q8180E9249
11792b29979B9194a56352g1198m537c3840n8812j69444B66177a45854D3936c9549
11780E1667Q8672O9375a38956L817j44242e6438B09340d13148a8364r7189j95710
11769c11263D4188j8039c61105A44038a56044G4064B7297c5889a4444j21341A89444
11757b19122B15247a92110D6912G872d15529a89383k24410E7394c08486C15728
11746E9839b1387c38j89819j4790Q2734A45192B8655e3729O24l07552A02920L9665
11734A42585a08211A22368b08935m7966e5600G6143a51672A37685f9978b6816
11723I2517K31682A5722K05344H302P3985c85493a07576A32761i2230b5273B96524
$$ plain form
11711 -43317 -30966 -130966 260565 165835 81138 102235 -25651 129654 -70090 92925 87357
11700 87357 68654 102134 369133 -402161 -46963 -125439 28474 22710 -24138 199981 109694
11689 109694 -74238 -250701 -7199 -160373 226786 189937 -47686 109049 15024 -32154 274901
11677 360448 -94570 -282062 -127677 86620 306409 -23769 95310 -97743 -199593 199992
11666 91670 -122881 -104961 -205240 59789 285611 -129132 -103922 461959 232026 108279
11655 -22168 381838 4483 -412739 235523 -146653 125389 -179410 208 97918 221427 -327016
11643 498857 20480 -138940 -26227 98005 184862 -164580 28632 337244 -36248 357184 435819
11632 435819 118209 -187957 107301 -119374 -414242 -38588 66196 -11144 319846 -105035
$$ packed form
11711d3317J2351j00000B60565r4730H1138K1097b5651A29654g0090I2925n568
11700H7357j8703L3480K66999d02161d6963p8476B8474n764b4138A99981r0287
11689A09694g4238j76463g199j53174B26786l6849d7686A09049A5024c2154B74901
11677C60448i4570j87492a27677H6620K19789b3769I5310i7743j01850A99992
11666I1670a22881J7920j00279E9789K25822a29132K5210D61959k29933A08279
11655b2168C81838D483d12739B35523a46653A25389a79410B08R7710J23509c27016
11643D98857B0480a38940b6227I8005Q6857a64580B8632L08612c6248C57184P8635
11632D35819A18209a87957A07301a19374k94868c8588F6196a1144C19846a05035
$$ plain form
11621 239749 -189376 23613 94795 127765 -138655 -244133 -62318 -62374 94642 126669 186738
11610 186738 -135247 -105292 -346501 84713 199044 256592 38823 9994 30140 -132568 283091
11598 -279229 20157 341334 186259 163820 282256 138356 53892 111280 125 309762 -164311
11586 -32306 82413 239076 103466 -48902 -127884 394380 -195646 -56284 -157680 52768 43201
11575 43201 30799 300073 117194 223437 48548 164289 294367 -97961 -159921 -98033 -11950
11563 71326 138677 287229 166916 63369 -96399 -122266 -10867 -275539 -18044 252757 -86513
11551 -41052 69874 26626 190970 13814 171973 -136032 7938 126842 130819 114891 24661
11539 282294 239787 118289 189317 220746 175555 -182497 238817 204682 32221 193530 -51035
$$ packed form
11621B39749a89376B3613P1182L2970a38655j05478f2318n6I4642L2027O0069
11610A86738a35247K9955k41209H4713J14331N7548C8823I994K0146a32568B83091
11598b79229B0157L21177j55075k2439J18436A38356E3892N7388A25L09637a64311
11586c2306H2413J56663A03466d8902p8982C94380a95646e6284j01396E2768r567
11575D3201j2402K69274A17194J06243D8548J15741J30078i7961o1960O1888a1950
11563G1326O7351J48552j20313F3369i6399k5867a0867k64672a8044B52757h6513
11551d1052F9874B6626J64344A3814J58159a36032G938J18904L977j5928B4661
11539B82294m2507A18289P1028L1429m5191a82497B38817l4135C2221J61309e1035
$$ plain form
11527 102947 -152658 24066 28050 97031 -98924 74917 17150 -115224 152875 113956 381444
11516 381444 284830 82024 118141 157259 116232 228235 152965 -136195 201355 197327 223704
11505 223704 288977 84045 -81947 258482 217998 157902 313209 154915 226496 377257 52704
11493 -12535 270946 379029 258516 380727 -34340 82550 145833 -321362 -81065 136155
11482 -35124 -10564 121305 -59154 94561 -191003 197590 100684 350900 -128671 213902
11471 -38272 383978 4742 262153 -111890 180865 342182 187681 165482 235478 118649
11461 118649 -9657 -26580 175391 66223 -93061 319479 -235281 240386 241144 -193898 109497
11449 156928 28196 181517 69551 79420 -50764 156316 86812 120589 163551 -156424 -28911
$$ packed form
11527A02947a52658B4066L984O8981i8924G4917A7150a15224A52875l8919K67488
11516C81444r6614H2024L6117L9118m1027J12003p5270a36195B01355m028K6377
11505B23704O5273H4045h1947B58482m0484o0096J55307A54915P1581J50761E2704
11493a2535B70946J08083j20513J22211c4340H2550O3283c21362h1065A36155
11482c5124a0564A21305e9154I4561a91003A97590r6906K50216a28671B13902
11471c8272C83978D742K57411a11890A80865J61317j54501k2199O9996j16829
11461A18649i657j6923A75391F6223i3061C19479b35281B40386P58a93898A09497
11449A56928B8196J53321F9551R869e0764A56316o9504L3777M2962a56424b8911
$$ plain form
11437 307204 -66832 165654 -28453 116836 117159 262754 323432 166126 104979 -31527 -167166
11426 -167166 -5868 -86120 -100627 310610 -24787 -1248 -151830 -157298 54811 -44942 57273 6305
11413 -312910 -53194 131521 -498450 -89286 133727 160097 -12077 186280 -227691 13515
11402 106727 364979 -338503 112293 378746 82913 193360 -33565 -79144 143026 -28530
11391 -44974 -70441 245815 -40620 -2202 80136 410598 -145592 -204732 -308897 -43118 60047
11379 -460040 117342 -96056 -288852 126735 34879 -71795 215063 -109592 -356533 -32602
11368 -334195 -1908 -102036 -165129 121725 -70458 145595 14862 79030 -78200 -407426 159884
11356 194788 98162 122210 19782 -172747 -27165 76233 -42381 -234491 -226516 -201271 -132464
$$ packed form
11437C07204f6832A65654b8453A16836L23J45595O0678j57306o1147c1527j35639
11426a67166e868q0252j4507C10610b4787a248j50582n468E4811d4942E7273F305
11413c12910e3194A31521d98450h9286A33727K6370a2077A86280b27691A3515
11402A06727K58252c38503A12293K66453H2913J10447c3565m5579A43026b8530
11391d4974k5467B45815d0620b202H0136L30462a45592n9140j04165d3118F0047
11379d60040A17342i6056j92796A26735C4879g1795B15063a09592k46941c2602
11368c34195a908j00128o3093A21725g0458A45595A4862O4168g8200l29226A59884
11356A94788r6626K4048A9782a72747b7165G6233d2381j92110P975K5245O8807
$$ plain form
11345 -132464 282035 -111932 -42339 432502 55524 -11482 109994 187671 -27413 -276193
11335 -276193 -497674 59731 78975 -97289 -229882 -380026 -236621 223428 -220041 -54332
11324 -292220 -128536 68063 -65832 -330074 -136734 163327 286350 -112089 173663 -34185
11313 -151115 -3011 -116285 133523 1248 -69396 -27067 -324546 72768 -103422 298615 244885
11302 244885 -97543 -336986 52672 103876 -44228 -137917 -28957 -66118 -106649 -113745 316286
11290 194963 -67817 -360854 262231 -240012 237286 -231232 -105417 66747 -450907 50397
11279 40468 -222857 -56835 -53648 -120515 19517 -397558 -15024 75612 -110082 -237068 3205
11267 269794 -75824 55755 30353 29193 -119163 -140811 117788 -57184 -260584 -48283 29591
$$ packed form
11345a32464B82035a11932d2339D32502E5524a1482A09994P7677b7413k48780
11335b76193k21481E9731J9244i7289j32593j50144J43405B23428b20041e4332
11324b92220a28536F8063f5832k64242a36734A63327J23023a12089A73663c4185
11313a51115c011j13274A33523A248f9396b7067k97479G2768a03422B98615n3730
11302B44885i7543k39443E2672N1204d4228r3689b8957l7161m0531p096C16286
11290A94963f7817k93037B62231b40012B37286b31232a05417F6747d50907E0397
11279D0468b22857e6835L187o6867A9517c97558a5024G5612a10082j26986C205
11267B69794g5824E5755k5402j160a19163k1648A17788e7184k03400d8283B9591
$$ plain form
11255 114063 -13797 220471 -148565 153240 -216060 127567 -95505 -73192 -189016 296209
11244 54483 29118 -227989 -275059 209268 66575 -115579 -328347 301510 81891 22387 -87999
11232 -78134 -287499 -540245 -14249 -131332 2086 81524 -195216 138869 -101339 40698 63848
11221 63848 31920 -153756 -60982 -139976 -222759 15880 -88368 -289456 -1879 -291037 129597
11209 -158631 6562 4408 23647 27243 -142000 102338 -31030 -71172 -14796 11401 -343602
11197 -152621 -241944 -384163 29566 91147 -49319 -282345 120028 164066 -177486 153203
11186 45033 -166442 -85373 -277164 -36530 -395204 201417 -255253 -78138 194199 -35410
11175 157703 -48178 -344243 141769 106291 -240699 253054 79003 -32043 -85840 95670 -214985
$$ packed form
11255A14063a3797B20471a48565A53240b16060A27567i5505K2313j15824B96209
11244E4483k5365b27989m7070B09268F6575a15579k12768C01510H1891B2387h7999
11232g8134k09365k52746a4249j17083B086P9438a95216A38869a01339D0698K3150
11221F3848C1920a53756f0982p8994q2783A5880h8368k01088a879k89158A29597
11209a58631F562k154J9239L596a42000A02338c1030m0142a4796A1401c43602
11197a52621q9323j42219B9566O1581d9319k33026A20028M4038a77486A53203
11186D5033a66442Q1069j91791c6530l58674B01417b55253g8138A94199c5410
11175A57703d8178k96065A41769l5478b40699B53054G9003c2043n3797I5670b14985
$$ plain form
11163 -21339 158189 80985 -108940 426134 184447 -191854 -46332 -20660 -239665 -145744
11153 -145744 -83222 190186 133431 119393 -98347 -91364 111575 424781 -36617 -33553 -320802
11142 -320802 156622 61153 7063 -23392 69271 -268241 -18537 -92362 -456631 25929 246522
11131 246522 -136275 -52464 158702 325673 12717 -143834 75680 31853 -140771 211634
11120 177838 132593 117934 12429 69689 132888 180342 -71394 216642 42670 -246672 25165
11108 29289 165660 260057 266062 -196401 -82655 -52982 -8262 134970 162112 312554 213481
11097 213481 204093 208408 136710 199167 138196 277314 344076 283423 134191 192535 208516
11086 208516 271661 346777 329841 -97290 209130 266611 162052 201758 551021 328129 313549
$$ packed form
11163b1339A58189p7204a08940D26134A84447a91854d6332b0660k19005R3921
11153a45744O2522A90186n6755j4038i8347O983A11575L13206c6617L064k87249
11142c20802A56622F1153G063b3392F9271b68241a8537p3825l64269B5929K20593
11131B46522a36275e2464A58702J66971A2717a43834G5680C1853a40771B11634
11120A77838m5245j4659A2429N7260O3199M7454g1394B16642D2670b46672B5165
11108B9289J36371R4397O005a96401h2655K9673h262A34970K7142J50442r9073
11097B13481r388M315p1698O2457o0971J39118O6762o0653A34191N8344J5981
11086B08516O3145P5116j6936i7290B09130N7481j04559L9706L49263k22892j4580
$$ plain form
11075 313549 82694 20466 306652 310364 657028 166947 157439 307669 571181 427209 436943
11064 436943 716309 442897 329011 562270 589592 683826 945479 437279 759883 958843
11054 958843 568453 915495 686791 780813 1021139 655680 504812 766053 876271 544494
11044 544494 1056404 729237 696303 1084696 974770 1093611 991701 1072068 639447 1071795
11034 1071795 1110355 681914 1154332 1212448 701208 727464 808605 666265 977203 910501
11024 910501 592075 777285 1147000 707175 1168412 732219 354726 419817 783775 851794
11014 851794 630742 614568 663764 878619 976889 840532 541552 805841 695653 713468
11004 713468 930752 367193 579131 762250 685399 880214 654286 818279 417745 890763
$$ packed form
11075C13549H2694B0466K86186L712L46664A66947r508J50230K63512j43972R734
11064D36943K79366k73412j13886K33259K7322R4234K61653D37279L22604J98960
11054I58843l90390L47042k28704R4022K40326l65459j50868K61241J10218l31777
11044E44494N11910l27167l2934L88393j09926J18841j01910Q0367m32621M32348
11034A071795L8560m28441M72418N8116n11240K6256Q1141j42340L10938o6702
11024I10501l18426J85210L69715m39825M61237m36193C54726O5091L63958O8019
11014H51794k21052j6174M9196K14855R8270j36357k98980K64289j10188J7815
11004G13468K17284C67193K11938J83119p6851J94815k25928J63993m00534M73018
$$ plain form
10994 890763 791880 472236 922132 944098 521730 556659 785162 983248 729510 953889
10984 953889 681867 1016023 905613 829516 1089674 1056293 1314195 1206106 1494688 1455357
10974 1455357 1257029 1767183 1633612 1827642 2626570 2559248 2373769 2804405 2819389 2831426
10964 2831426 3001216 2513510 2264832 2223425 2035367 2141027 1791787 1846958 1715120 1651706
10954 1651706 1464317 1615382 1379666 1606968 1361288 1318206 1081298 1048644 924196 733690
10944 733690 1064418 585537 462204 367923 253297 226183 -56791 368081 -111549 454967
10933 134048 251032 245390 188345 64044 -49868 271747 -96619 435645 -262700 138241 13008
10921 230824 -68394 -70395 17829 -294946 93122 13062 -260091 2584 206193 112321 -204266
$$ packed form
10994H90763r8883l19644M49896K1966m22368L4929K28503J98086k53738K24379
10984I53889k72022L34156j10410p6097K60158l3381K57902j08089K88582l9331
10974A455357j98328N10154j33571J94030P98928o7322j85479M30636J4984J2037
10964B831426J69790m87706k48678m1407j88058J05660l49240N5171j31838o3414
10954A651706j87389J51065k35716K27302k45680m3082k36908l2654j24448j90506
10944G33690L30728m78881j23333r4281j14626k7114e6791C68081a11549D54967
10933A34048J16984n642n7045F4044d9868B71747i6619D35645b62700A38241A3008
10921B30824f8394k001A7829b94946I3122A3062b60091B584K03609r3872b04266
$$ plain form
10909 -26279 71866 297224 204165 315716 -5655 44320 -59773 119402 -309838 -59248 152028
10897 -48875 -175511 -39053 -15085 52133 -154065 182210 -129558 141937 416354 10245
10886 38152 -6951 106167 -7260 -130781 -119240 -199087 -127128 -236257 151467 47270 274977
10875 274977 -222723 50107 -213892 -112691 -38149 103436 264588 -29383 -189854 -265468
10865 -265468 -214925 -40883 -76456 -110971 86897 69762 -127708 9539 -122791 3890 -88526
10853 -39738 235408 -126950 -73826 131729 271835 -54837 141183 16388 -178860 -283013
10843 -283013 190000 -319834 -66954 -331383 -320574 69189 -187288 138030 -265603 12457
10832 -184711 -238580 205616 150169 -37109 314981 -106839 -137221 -70769 20587 -251036 -78723
$$ packed form
10909b6279G1866K25358r3059J11551e655D4320e9773A19402c09838e9248A52028
10897d8875j26636c9053a5085E2133a54065A82210a29558A41937K74417A0245
10886C8152f951A06167g260j23521J1541p9847P1959j09129A51467D7270K27707
10875B74977b22723E0107b13892J01201c8149A03436J61152b9383j60471p5614
10865b65468N0543d0883l5573l4515H6897j7135a27708I539a22791C890h8526
10853c9738B35408a26950N3124A31729J40106e4837A41183A6388a78860j04153
10843b83013A90000c19834f6954k64429J0809F9189a87288A38030b65603A2457
10832a84711n3869B05616n5447c7109C14981a06839l0382O6452B0587b51036g8723
$$ plain form
10820 -56242 -157153 -265749 175173 -6602 190109 116120 35529 88779 191068 -171367 -65956
10808 -165662 -193742 121219 227269 -410058 6878 187246 249100 -145779 15394 215978
10798 215978 123020 -176906 -73397 12522 -197650 -67928 96352 -145360 -303974 -373172 -289141
10787 -289141 -94259 218325 -71673 92716 -353091 51095 40341 -194478 27663 78963 -80811
10775 -94876 -160413 -40984 -233779 -118567 88937 102880 66544 -158278 94907 117904 -255251
10763 223189 288391 22073 -125711 -2041 -157995 -283020 -26608 74291 -226928 -117330 171740
10751 -74238 -258403 159286 13494 -200998 136114 -70374 86172 15623 -80981 -57900 -118662
10740 -118662 87280 216997 232308 -254997 269870 234304 -41971 125225 18672 256979
$$ packed form
10820e6242j00911j08596A75173f602A90109p3989C5529N3250J02289a71367f5956
10808a65662k8080A21219J06050d10058F878J80368O1854a45779A5394K00584
10798B15978r2958a76906g3397A2522a97650f7928I6352a45360j58614o9198Q4031
10787b89141i4259B18325g1673I2716c53091E1095j0754a94478B7663N1300h0811
10775i4876o5537d0984j92795J15212H8937J3943l6336a58278I4907K2997b55251
10763B23189O5202B2073a25711b041j55954j25025b6608G4291b26928J09598A71740
10751g4238j84165A59286A3494b00998A36114g0374H6172A5623h0981K3081o0762
10740a18662H7280J29717J5311b54997B69870l5566d1971A25225A8672K38307
$$ plain form
10730 256979 -279430 24380 -107698 -161828 21046 214576 44657 63628 -361909 -81211 -97840
10719 -97840 -205688 -241626 -294986 -210446 -176181 -25784 79460 76954 -219745 -505014 21194
10707 -82468 -44435 74337 69634 -33832 76008 32930 -300828 -217036 -88671 -211628 32978
10695 -367257 21960 -128092 -199296 14913 31465 142081 -23921 -15753 87636 -116246 -142040
10684 -142040 -103949 28657 -67370 -107280 -212817 -242557 31609 -254623 390324 -549376 -367896
10673 -367896 -153179 67559 -28412 -308203 188821 -126152 68452 45645 30913 -44623 -186428
10662 -186428 82813 -407251 -288847 63477 -61049 74450 54215 117124 -40943 -277074 -72637
10650 -423460 -1627 220693 186305 -250941 6475 76483 -210984 -388255 315333 -296201 -163250
$$ packed form
10730B56979b79430B4380a07698n4130B1046J93530D4657J8971c61909h1211j6629
10719i7840j07848l5938n3360Q4540L4265b5784G9460k506b19745k85269B1194
10707h2468L8033G4337m703c3832G6008C2930c00828Q3792h8671j22957C2978
10695c67257B1960a28092p1204A4913J6552J10616b3921Q168H7636a16246k5794
10684a42040L8091B8657f7370l9910j05537k9740C1609b54623C90324e49376J81480
10673c67896a53179F7559b8412k79791A88821a26152F8452k2807j4732d4623j41805
10662a86428H2813d07251J18404F3477f1049G4450k0235O2909d0943k36131g2637
10650d23460a627B20693l4388b50941F475P0008b10984j77271C15333b96201J32951
$$ plain form
10639 -163250 214573 -314793 -59211 22155 34995 48064 -42686 -73567 -10231 119769 -162740
10627 120975 -90480 -48639 -82383 -118988 -292033 57251 84914 194882 -140833 135054 -125043
10615 -215183 208203 -27917 -169174 -192163 -198433 -64776 -77606 107066 -140445 -66454 -198832
10604 -198832 60920 173975 -35229 -293331 -226876 -306586 -181714 -277224 -216851 86029 82075
10593 82075 -67209 -139930 78260 -203548 132078 -109493 -160373 -149342 15466 -73661 -34800
10581 -117597 -139890 -113229 -116242 256040 19635 -169817 -111377 -230876 119103 -51256 -9712
10569 -57064 72003 -322217 -222666 -42430 -354194 -333499 -61651 53283 -240750 -59220 -212923
10558 -212923 32726 -65400 -140815 37289 -220573 -116883 -163997 184643 -215096 -123014 447701
$$ packed form
10639a63250B14573c14793e9211B2155J2840J3069d2686l0881a0231A19769a62740
10627A20975i0480M1841l3744l6605j73045E7251K7663J09968a40833A35054a25043
10615b15183B08203b7917j41257k2989o270f4776j2830A07066a40445f6454j32378
10604a98832F0920J13055c5229k58102O6455p9710J24872r5510O0373H6029l954
10593H2075f7209p2721G8260b03548A32078a09493n0880J1031A5466g3661c4800
10581a17597k2293K6661l013B56040A9635a69817N8440j19499A19103e1256i712
10569e7064G2003c22217R9551d2430l11764K0695f1651E3283b40750e9220j53703
10558b12923C2726f5400p5415C7289b20573J03690m7114A84643b15096R2082D47701
$$ plain form
10546 -403509 187068 -102255 -17805 78909 254461 -252655 169675 -45206 -328758 158358
10535 26119 -105105 -125915 -45108 -233 -154633 153560 78794 -60375 -147926 -125109 -29123
10523 -223774 -249549 -218637 278375 107922 -56968 -281767 82825 27556 227026 -47659 2306
10511 52143 201726 -395505 -85501 115860 158927 214568 -298080 -66744 88213 -274444 -317248
10500 -317248 -172563 153448 148797 25630 -160379 65135 -202920 -111333 -270538 -54809 -198357
10489 -198357 157586 -231819 236346 -259370 203179 -140642 119262 356660 33904 108068
10479 108068 119821 -23181 172082 425166 363597 59985 210637 591163 292384 217111
10469 217111 437626 -89218 75417 200574 339990 -264643 44721 139126 -35224 -68118 -38247
$$ packed form
10546d03509A87068a02255a7805G8909J75552b52655A69675d5206k83552A58358
10535B6119a05105k0810d5108b33j54400A53560p4766f0375q7551K2817b9123
10523b23774k5775L0912B78375A07922e6968k24799H2825B7556J99470d7659B306
10511E2143J49583c95505h5501A15860M3067N5641b98080f6744H8213b74444m2804
10500c17248J44685A53448m651B5630a60379F5135b02920R1587j59205e4809j43548
10489a98357A57586b31819B36346b59370B03179a40642A19262K37398C3904P4164
10479A08068J1753b3181A72082K53084o1569E9985J50652L80526B92384p5273
10469B17111K20515h9218G5417J25157J39416b64643D4721R4405c5224l2894K9871
$$ plain form
10458 -38247 222744 -62361 -256402 345114 60481 -67045 70482 -72288 23773 -287807 -137076
10446 -39612 -131729 -415444 -173612 -300073 34392 -364470 8248 53907 -48776 -374706 -31656
10434 207662 -333379 270459 132968 7880 -77687 14378 -55968 141692 20092 171295 -281498
10422 -196352 -27501 17386 -401802 -226485 -5481 -46110 38389 -18342 23150 165 146472
10411 146472 -342070 122660 -93264 -125907 -38702 -21996 221510 101258 -60461 254621
10400 233757 -203129 -281141 201873 181013 -55481 -85617 -95215 -72714 4644 354517 145118
10388 258203 324946 158557 83992 -98234 -47734 -217006 181698 227305 273492 315911 -153447
10376 -131698 85956 -57176 236254 221778 470667 229128 238105 753795 178684 527034
$$ packed form
10458c8247B22744f2361j94041C45114F0481f7045G0482g2288B3773b87807a37076
10446c9612r2117k83715a73612j26461C4392c64470H248M5659d8776l25930c1656
10434B07662c33379B70459A32968G880g7687A4378e5968A41692B0092J51203b81498
10422a96352b7501A7386d01802J75317e481m0629C8389a8342B3150A65J46307
10411A46472c42070A22660i3264l2643c8702J6706B21510A01258f0461B54621
10400B33757b03129p8012B01873k0860e5481l0136r598K2501D644L49873A45118
10388B58203O6743A58557p4565i8234d7734j69272A81698M5607M6187M2419a53447
10376a31698H5956e7176B36254j4476K48889B29128Q977N15690A78684L48350
$$ plain form
10366 527034 -46985 147062 484654 240897 281888 406222 424068 111044 160661 252726
10356 252726 67897 345442 207814 378218 141786 432476 274583 484740 331670 153286
10345 488837 289079 194886 58747 434852 448494 307950 388649 665899 225635 240270
10335 240270 96267 102374 280782 46996 34789 302270 183070 524002 275753 -236743
10324 13563 -318151 -82065 347121 149536 222093 16122 334358 303461 355864 313506 -13019
10312 324959 -221327 376241 43913 -141702 220758 30178 438214 -132754 -122682 111483
10301 159671 -22371 -38624 -145597 -112380 -81068 -977 -25788 -321890 -255590 208762 135323
10290 135323 104766 -78948 -304738 66911 12807 -59963 58510 51208 -169546 113651 -60790
$$ packed form
10366E27034d6985A47062L37592B40897M0991J24334J7846A11044M9617R2065
10356B52726F7897K77545j37628J70404A41786K90690j57893K10157j53070A53286
10345D88837j99758r4193E8747L76105J3642j40544Q0699K77250B25635J4635
10335B40270I6267O107J78408D6996j2207K67481j19200L40932k48249b36743
10324A3563c18151h2065C47121A49536P2557A6122L18236l0897N2403m2358a3019
10312C24959b21327C76241D3913a41702B20758C0178M08036a32754J0072A11483
10301A59671b2371j6253j06973L3217L1312i77k4811k96102O6300B08762p3439
10290A35323l0557g8948k25790F6911A2807e9963E8510p302a69546A13651f0790
$$ plain form
10278 15911 -113974 -190857 -10075 -187130 -48300 -26511 63431 34628 -71104 -50205 -48797
10267 -48797 -132958 37683 89997 -126697 -169952 -131477 194606 -171529 -247210 149929 204743
10256 204743 -12264 146204 -8073 -135607 388168 189661 528510 190719 -106756 -30162
10245 480134 -42265 -85247 -59687 -8612 -16965 -252512 184338 133885 96344 -264701 75774
10233 -18027 -65601 104360 -258104 86210 -138979 -57856 -232412 -30268 -384627 -11892 16888
10221 -431935 39617 29642 75367 33580 -165589 125952 288011 -73826 -58335 262502 -201958
10209 -197815 -187543 192255 55202 20465 -143408 -158503 32977 -89259 -178678 -182091 -271933
10198 -271933 337412 210254 -315432 -67666 54564 -182476 -135698 -198014 139172 -160642
$$ packed form
10278A5911a13974p6883a0075j77055d8300K1789F3431k8803g1104K0899J408
10267d8797q4161C7683N2314a26697m3255L8475A94606a71529p5681A49929N4814
10256B04743a2264A46204h073j27534C88168A89661L38849A90719a06756c0162
10245D80134d2265m2982K5560h612q353k35547A84338n0453l7541b64701G5774
10233a8027m7574A04360b58104H6210a38979e7856j74556c0268l54359a1892A6888
10221d31935C9617r975M5725C3580a65589A25952J62059g3826J5491B62502b01958
10209a97815J0272A92255E5202B0465a43408j5095C2977h9259q9419l413q9842
10198b71933C37412j27158c15432f7666E4564a82476M6778o2316A39172a60642
$$ plain form
10187 -6420 95852 117824 -79149 -117610 116825 -148149 -102891 -146249 -483699 -180083 -13049
10175 -268816 -265444 -90372 47178 8984 10519 -114026 -39749 -166831 29956 192243 -313346
10163 214052 7603 31264 -75103 201771 -296354 -166290 -246163 152616 -655766 169772
10152 -132870 -28422 -84102 140 107809 -121987 5008 114274 -81354 -284253 88458 7051
10140 111540 -356668 76978 74034 -218435 35298 -140787 -171491 -195245 90638 -86417 -231314
10129 -231314 -230573 -37720 48813 -59777 47814 -57407 -47613 53157 72188 -219885 -219152 -167832
10117 -167832 130970 65987 -37207 270122 -5955 118304 -114447 -82926 -133043 94553 -204104
10105 -211437 49905 -265529 -112658 -197785 79547 -112532 26321 88174 -79175 125354 -454487
$$ packed form
10187f420I5852K1972g9149l8461A16825a48149M5258m3358l37450a80083a3049
10175b68816L372i0372D7178H984J535a14026c9749j27082B9956J62287c13346
10163B14052G603K3661g5103B01771b96354J30064p9873A52616f55766A69772
10152a32870b8422n5680A40J07669a21987E008J09266h1354k02899H8458G051
10140A11540c56668G6978k944b18435C5298a40787l0704k3754I0638h6417j44897
10129b31314P41c7720D8813e9777D7814e7407R794E3157J9031b19885P33N1320
10117a67832A30970o4983c7207B70122e955A18304a14447L1521n0117I4553b04104
10105b11437D9905b65529a12658q5127G9547a12532B6321O1853g9175A25354d54487
$$ plain form
10093 -44274 -73338 -55022 89754 104570 -7672 44986 -24862 -246029 -239762 -122369 44172 130895
10081 130895 -51431 -206821 -226029 107822 -95682 202950 -277418 242279 -49961 50873
10070 -70441 -110262 -139169 -325894 -282231 -94042 247697 -93520 -29405 -62685 -142972 -159997
10059 -159997 -215603 36035 -240521 -104464 -149404 -217930 48717 -107974 -88601 -153570 32968
10047 -101816 217987 147360 -147690 7361 -528110 -116331 -21977 -10176 -156713 -16009 -205662
10036 -205662 -177913 -81735 -267084 33320 91774 -185807 23670 -136436 68558 -201206 183397
10024 -201960 -60076 -253273 -306603 -132089 -167496 51806 156674 -260230 -428742 -232024
10014 -232024 232769 -38073 59283 -18625 105117 -211442 43312 -53161 248356 1154 -7318
$$ packed form
10093d4274k9064J8316H9754J4816g672D4986b4862k21167O267J17393D4172Q6723
10081A30895e1431j55390j9208A07822i5682B02950b77418B42279d9961E0873
10070g0441l9821k8907j86725M3663i4042B47697i3520b9405l3280q0287j7025
10059a59997n5606C6035b40521a04464m4940o8526D8717a07974J9373o4969C2968
10047a01816B17987p0627a47690G361e28110a16331b1977a0176j46537a6009j89653
10036b05662K7749h1735j85349C3320N8454a85807B3670a36436F8558b01206A83397
10024b01960f0076j93197n3330a32089l5407E1806J04868b60230j68512J96718
10014b32024B32769c8073E9283a8625A05117b11442D3312e3161B48356A154g318
$$ plain form
10002 -134525 -3180 -254904 -210077 -298611 14599 -600177 -82251 -95105 -100884 -231575 -47741
9990 -94569 -166992 -123175 100070 -329766 130617 -390109 439046 -25420 -49356 -128415 -182874
9979 -182874 260595 -271919 37653 -66521 -257297 -273904 57039 -115336 -100857 -370142 185750
9967 -125128 -470753 -279291 350821 143851 225725 132220 -142779 -301733 -25992 371034
9956 74904 -181605 -158742 53697 45767 -103995 -233297 -198198 -172513 -77104 -75361 -72555 310782
9943 117033 -18795 -185759 -272127 -229379 -91045 199351 -48942 -42198 -8185 44290 -125525
9931 -21453 -126598 121026 -44314 90404 -375876 -96595 -184541 15586 56810 274065 29526
9919 -175290 -132546 174894 -66024 -338918 -236163 -186372 -42564 -71705 -57205 -291779 -91731
$$ packed form
10002a34525c180k51724M4827q8534A4599f00177h2251j2854n779j30691d7741
9990i4569p2423M3817A00070c29766A30617c90109D39046b5420k3936p9059n4459
9979a82874B60595b71919C7653f6521j90776j6607E7039a15336J4479k69285A85750
9967a25128l45625J91462C50821A43851Q1874r3505a42779j58954b5992C71034
9956G4904a81605K2863E3697p930a03995j29302L5099K5685g7104J743K806C10782
9943A17033a8795j66964q6368M2748i1045A99351d8942O744h185D4290a25525
9931b1453j05145A21026d4314I0404c75876i6595q7946A5586M1224K17255B9526
9919a75290M2744A74894f6024k72894J02755M9791d2564k9141J4500k34574i1731
$$ plain form
9907 -55988 -106800 -291103 -180156 74060 -412999 -43256 129640 -21421 -9305 44237 -189380
9895 -192366 -9006 -19188 -34900 99403 -485117 182581 -63938 101798 -320727 -54658 -24810
9883 -53331 123942 -189090 -100717 -109364 14093 -1163 -248093 220169 -208529 -339670 -232407
9872 -232407 49473 68662 -31975 84468 95404 -107258 42523 253912 -123296 85312 -42687
9860 -12063 -101550 -56951 102187 -136278 252791 -132577 -142911 44647 100451 -70268 -174325
9849 -174325 -57571 89890 -40549 43992 -75340 118316 36429 17335 258715 -48736 213686
9837 -136934 -388811 140152 -176828 49214 -77173 21928 -219853 -295253 61094 -236947 314448
9825 -231003 -22709 -38854 226140 -339776 -181847 -56243 -402932 -96915 -218405 91168 -173820
$$ packed form
9907e5988n0812j84303J10947G4060d12999d3256A29640b1421i305D4237a89380
9895a92366i006j0182j5712I9403d85117A82581f3938A01798c20727e4658b4810
9883e3331A23942a89090Q8373q647A4093a163k46930B20169b08529j31141J07263
9872b32407D9473J9189c1975H4468J0936a07258D2523K11389a23296H5312d2687
9860a2063q9487M4599A02187a36278B52791a32577j0334D4647N5804g0268j04057
9849a74325e7571H9890d0549D3992g5340A18316C6429A7335K41380d8736B13686
9837a36934k51877A40152a76828D9214g7173B1928b19853p5400F1094b36947C14448
9825b31003b2709j6145B26140c39776J57929e6243l46689i6915j21490I1168a73820
$$ plain form
9813 -92674 138736 -228962 -195635 -57198 -190948 24338 -98122 -249545 -486620 -200664 -353444
9802 -353444 -166302 131581 -3624 247417 -190364 -72149 -7436 -157218 217193 -152503 85812
9790 -193023 -144900 -167336 -135297 203105 -163953 52602 99760 -28485 69479 46161 -114431
9778 -177601 173645 400343 -356701 -135506 100588 -5707 -358397 198100 -40964 33401
9767 -282352 -385000 -282856 -96244 -183928 -105897 -174404 9336 -164082 -197806 -289400 -28375
9755 -48323 -31164 -317782 -100198 67412 -180469 -212836 -31422 52232 14679 41550 -31663
9743 -9775 25629 -299638 195120 -23796 -161794 -9779 107856 115439 27926 -177468 -4814 18827
9730 -12311 -183735 20911 34171 163733 72921 -158141 84908 -28372 210157 -104719 -288857
$$ packed form
9813i2674A38736b28962L3327e7198j33750B4338i8122j51423k37075b00664j52780
9802c53444a66302A31581c624B47417a90364g2149g436j49782B17193a52503H5812
9790a93023M8123k2436L2039B03105a63953E2602M7158b8485F9479k3318a14431
9778a77601A73645K26698c56701a35506A00588e707l52690A98100d0964C3401
9767b82352j02648J02144i6244q7684P8031o8507I336a64082l3724r1594b8375
9755d8323J7159k86618a00198F7412a80469l2367c1422E2232A4679K6871c1663
9743i775B5629b99638A95120b3796j37998i779A07856P583B7926a77468d814A8827
9730a2311j71424B0911J3260J29562G2921a58141H4908b8372B10157a04719j84138
$$ plain form
9719 -288857 -403016 -218803 -62827 109534 69535 -31556 -26032 -146974 -68192 -151665 -33568
9707 49233 -108896 137399 -339488 -99258 23233 -182295 42121 112438 -391986 -205823 153551
9695 -39952 -225213 -223315 -80168 -39139 -193520 -329586 -3454 259910 35356 222112 -37551
9683 -259886 147105 -170036 147220 125260 -190699 38304 -236657 -128540 71916 243087
9673 243087 207155 -283268 -100045 -40970 -176944 -116503 -319393 -90599 -66868 -35613 -60307
9662 -60307 154105 12296 -164222 131227 -185056 -44650 139328 -15505 66777 48073 -402396
9650 -123697 -425466 -24809 -274111 226008 460727 -41974 34718 -255683 190342 77956
9639 43811 -16005 18666 219754 34971 45729 -86037 -273110 -114281 -128188 -18331 -62437
$$ packed form
9719b88857j14159J84213f2827A09534l9999c1556N524j20942f8192q3473c3568
9707D9233a08896A37399c39488i9258B3233a82295D2121P0317c91986J86163A53551
9695c9952j85261J898h0168c9139j54381j36066c454B59910C5356J86756c7551
9683b59886A47105a70036A47220k1960a90699C8304b36657J08117G1916J71171
9673B43087l5932b83268a00045d0970j35974O0441k02890i0599K3731L1255k4694
9662f0307A54105A2296a64222A31227a85056d4650A39328a5505F6777j8704d02396
9650a23697l01769b4809k49302B26008K34719d1974C4718b55683A90342G7956
9639D3811a6005A8666K01088C4971J0758h6037j87073a14281j3907a8331m4106
$$ plain form
9628 -62437 130131 -28611 -384581 -465732 -22817 211767 -27987 167314 -187014 71085 16793
9616 -107964 -121862 -26337 -215275 -204561 -22009 -69840 -262711 -18104 -166092 73411 76 -16982
9603 -196116 -182190 179742 144561 27260 86133 -81166 -317282 63742 20452 93407 -282077
9591 112989 -98347 -196056 -322823 -136116 20210 -74490 101623 -204074 -223170 -88555 -180549
9580 -180549 -19537 -26954 82955 -22428 154518 -271952 -18445 -176054 222816 195142 -92750
9568 -307797 -398875 -232017 16584 52686 -126765 10083 273251 -285310 -289637 -285137 -244387
9557 -244387 -46254 109684 -183220 106005 38098 -195747 118257 -25031 -294245 59663
9546 81534 -118375 2400 24499 -93498 -110448 -98154 -344664 -205287 101419 -12147 -149131
$$ packed form
9628f2437A30131b8611l55970q1151b2817B11767b7987A67314a87014G1085A6793
9616a07964j3898b6337j88938J0714b2009m7831j92871a8104j47988G3411G6a6982
9603a96116J3926A79742l5181B7260N8873h1166k36116F3742B0452P2955b82077
9591A12989i8347r7709j26767a36116B0210g4490A01623b04074j9096h8555r1994
9580a80549a9537p417H2955b2428A54518b71952a8445j57609B22816k7674i2750
9568c07797r1078J66858A6584L6102a26765A0083K63168b85310m327M500M0750
9557b44387d6254A09684a83220A06005C8098a95747A18257b5031k69214E9663
9546H1534a18375B400K2099i3498j6950J2294k46510J39377A01419a2147j36984
$$ plain form
9535 -149131 -139037 296538 -49959 -188045 -97813 -112402 84635 -49071 -63872 -364550 -436519
9524 -436519 -65855 -160879 -112968 -87651 -208320 -107742 -44310 319991 38009 -148870 -326091
9513 -326091 -325097 44519 129946 -100819 -96290 60274 -8443 50336 195999 -139401 6904 -136012
9500 171657 -62724 -102445 -300898 -108917 -115952 -72839 -4568 -22304 185745 -44004 -177741
9489 -177741 -143549 -34918 -140252 -307449 -140797 -254647 -163094 -35171 169134 -69112 125800
9477 25997 314544 -174250 -29576 124901 35588 225850 79685 -17941 -183174 -58389 -385629
9466 -385629 93287 -50214 -98223 -299162 84404 243147 -45143 -176757 -117289 38462 -111542
9454 2459 -13507 237539 -157036 -8359 -70344 29635 -108957 105720 -43986 193008 -221801
$$ packed form
9535a49131J0094B96538d9959j38086R0232j4589H4635d9071j4801l00678p1969
9524d36519f5855r5024M7911K5317j20669J00578d4310C19991C8009a48870j77221
9513c26091R94D4519Q5427a00819M529F0274h443E0336J45663a39401F904a36012
9500A71657f2724l9721j98453a08917p035M3113d568j7736A85745d4004j33737
9489a77741L4192c4918j05334j67197a40797j13850R1553c5171A69134f9112A25800
9477B5997K88547a74250b9576A24901C5588J90262G9685a7941j65233e8389l27240
9466c85629I3287e0214m8009k00939H4404J58743d5143j31614N9468C8462a11542
9454B459a3507B37539a57036h359o1985B9635a08957A05720d3986A93008b21801
$$ plain form
9442 99951 -377616 -81517 58976 -23775 -220773 217150 55972 -421880 -311553 1735 26145
9431 26145 75747 -154501 -280983 -19155 165862 9083 -64757 -102379 147389 -154472 -274058
9420 -274058 -7350 -350463 84589 3566 -99645 186440 -86234 -43110 162345 -104254 -147221
9409 -147221 47303 -33496 16525 -288057 -156321 -97640 -52256 146007 -234737 -32315 3612
9397 100207 150644 -236084 -122630 149914 -98854 71746 81888 -351071 -23116 -387127 -132411
9385 -1192 -298166 -293596 232699 67202 -148217 -154197 111163 -404086 -13153 84370 -188377
9373 4609 -63179 248078 -211520 180868 -54499 -37779 -278083 -162341 -52609 3808 -450446
9361 21933 91892 11488 -232473 -104673 -45799 292876 -50844 -38284 252131 -57223 27794
$$ packed form
9442I9951c77616h1517E8976b3775j96998B17150E5972d21880J10327A735K4410
9431B6145M9602a54501j26482a9155A65862I083f4757l7622A47389a54472j19586
9420b74058g350l43113H4589C566i9645A86440h6234d3110A62345a04254m2967
9409a47221D7303c3496A6525b88057J31736N8681M5384A46007b34737c2315C612
9397A00207N0437b36084J13454A49914i8854G1746J0142c51071b3116l64011a32411
9385a192k96974M570B32699F7202a48217n980A11163d04086a3153H4370a88377
9373D609f3179B48078b11520A80868e4499J6720k40304J15742e2609C808d50446
9361B1933O9959A1488b32473a04673d5799B92876e0844J2560B52131e7223B7794
$$ plain form
9349 -160642 -301385 144756 -312706 -167656 -17692 -249114 -115480 -240626 -211696 -296775
9339 -296775 -138902 -315887 -158242 -245703 187063 -66464 81080 -200912 -326573 158 -188416
9327 237768 -195839 -116881 -178019 36254 59 -242875 -63670 76086 -17602 33434 -205172 99024
9314 3003 52411 117541 -36028 204755 -39903 -178199 -172263 113597 -259827 -42017 -152293
9303 -152293 -61982 -89177 132573 -175213 686 107666 30682 -166775 -45879 -191757 -92622
9291 -196781 -190923 212283 161284 -226093 189322 -352331 67056 56106 136285 -251750 67133
9279 114429 -93922 55905 -107824 -226145 -122307 -116361 -5673 118318 -71055 52769 -112460
9267 -189833 -435389 -270626 -112800 303706 -473043 -78433 -92010 -392099 -45772 87483
$$ packed form
9349a60642j40743A44756c12706J45050a7692k31422a15480j25146K8930q5079
9339b96775a38902j76985J57645q7461A87063f6464H1080b00912j25661A58a88416
9327B37768a95839P8958o1138C6254E9b42875f3670G6086a7602C3434b05172I9024
9314C003M9408O5130c6028B04755c9903j38296N936A13597b59827d2017j10276
9303a52293f1982k7195A32573a75213F86J06980C0682a66775d5879j45878i2622
9291a96781N858B12283n0999b26093A89322c52331F7056j0950Q0179b51750F7133
9279A14429i3922E5905a07824j18321J03838N946e673A18318g1055E2769a12460
9267a89833k45556J64763a12800C03706d73043g8433j3577l00089d5772H7483
$$ plain form
9256 -67691 -121032 -196491 -93230 214576 53803 -110527 -46048 43049 143861 -88032 -272249
9245 -272249 103106 197753 21439 -261974 95653 153449 29535 -237630 -111834 72226 -161650
9233 -215906 -328847 -110940 42578 107811 -109427 105379 -321649 -92742 83260 -40122 1505
9221 122407 294024 -44534 -42745 19492 -254831 -750 -12100 -300737 -66205 -185937 -29109
9209 -45814 147280 -202770 259141 97854 84670 -265268 -37997 -335755 12550 113869 -186524
9197 -379373 -97231 -304594 72516 89465 145302 356850 66401 224754 -195663 8878 -31019
9185 -207093 -4087 138714 131450 -80149 -531012 83010 249885 -41965 80623 -27236 -177074
9174 -177074 335832 -133577 175013 59019 164977 145576 -146758 -223592 -69577 -256640
$$ packed form
9256f7691n3341p5459i3230B14576E3803a10527d6048D3049J00812h8032j84217
9245b72249A03106R4647B1439b61974I5653N7796B9535b37630a11834G2226a61650
9233b15906j12941a10940D2578O5233a09427A05379c21649i2742H3260d0122A505
9221A22407J71617d4534J789A9492b54831g50j1350k88637f6205j19732b9109
9209d5814A47280b02770B59141I7854j3184b65268c7997k97758A2550J01319a86524
9197c79373i7231k07363G2516J6949N5837K11548F6401J58353a95663H878c1019
9185b07093d087A38714p264h0149m50863H3010J66875d1965H0623b7236j49838
9174a77074C35832a33577A75013E9019J05958j9401a46758p6834f9577j87063
$$ plain form
9164 -256640 -22957 -57584 -81182 -58799 49735 -148708 48451 -183012 48402 68047 -469519
9152 247124 27786 -358230 -581709 -51544 409825 44738 -81786 -276310 31346 296455 80622
9140 106271 -6105 -194223 -154544 -129173 25799 -42841 297972 -27758 -193133 -170389 62306
9128 -69550 -127580 140518 244112 156742 61407 56838 132381 -216792 -98639 -230047 -68127
9116 -100337 -70086 -139620 110694 60042 -179817 222927 -72940 174216 91471 -332291 195422
9104 309965 228981 -1037 -97161 -156880 -7244 -231474 49842 102431 -290182 146787 -216485
9092 61879 -307954 -201786 111857 394860 -102178 145079 78952 -63121 143289 -78062
9081 -110250 -220479 -228969 -67182 -100846 -143869 140376 -293696 -167153 -332979 -350795 -275539
$$ packed form
9164b56640b2957l4627k3598K2383D9735a48708D8451a83012D8402J9645d69519
9152B47124B7786c58230k23479e1544D09825D4738h1786j94524C1346K65109H0622
9140A06271f105j88118L9679K5371B5799d2841B97972b7758j65375K2744F2306
9128f9550n8030A40518J03594q7370F1407m569P5543b16792i8639j31408f8127
9116a00337L0251o9534A10694n0652a79817B22927g2940A74216q2745c32291A95422
9104C09965q0984a037r6124n9719g244k24230D9842N2589b90182A46787b16485
9092F1879c07954J06168A11857K83003a02178A45079o6127f3121A43289g8062
9081a10250j10229q490f7182l3664m3023A40376b93696J26543j65826j7816P5256
$$ plain form
9070 -275539 -121045 173373 -282515 -278475 -185082 -112228 183924 59196 38380 -7592 -333957
9059 -333957 -73865 94584 -208323 -162175 -208196 -221382 -314571 -152040 -45016 208623 -413029
9047 -333305 -58401 7716 -160019 -480984 -124294 116015 -262265 -244885 -262946 -41211 -202993
9036 -202993 52450 -1640 94866 257852 -114201 -89916 -276844 98162 106760 -66273 -126721
9025 -126721 19681 -286670 -128514 -279266 -233899 152160 95107 -61274 -165035 -254861 306601
9013 -431328 143683 130348 -201032 -120594 -12793 -87170 -11445 -190801 -17212 -49637 -233279
9002 -233279 -14286 -44779 2996 5666 -8625 -36515 -35553 -141734 221488 -12847 -246358 -149023
8990 -149023 56774 21951 -201551 -116134 -264188 -164841 106847 29739 -77161 113592 -126987
$$ packed form
9070b75539a21045A73373b82515M040R3393P2854A83924E9196k0816g592l26365
9059c33957g3865I4584b08323M6148m6021j3186r3189a52040d5016B08623d13029
9047c33305e8401G716a60019l20965a24294A16015b62265J7380j8061d1211j61782
9036b02993E2450a640I4866J62986a14201K4285j86928I8162Q598f6273o0448
9025a26721A9681b86670a28514j50752M5367A52160n7053f1274j03761q9826C06601
9013d31328A43683j3335b01032Q0438a2793p4377a1445j79356a7212l2425j83642
9002b33279a4286l0493B996K670h625k7890R62j06181B21488a2847k33511R7335
8990a49023E6774B1951b01551Q5417j48054R9347A06847B9739g7161A13592a26987
$$ plain form
8978 96286 337727 -336363 -125679 243790 -270437 258355 453079 245950 -70202 -124958
8968 -124958 124508 -268872 -185552 154908 87259 -256058 -261431 -125833 -44078 43406 211602
8957 211602 148434 121393 -3200 324973 20759 20230 -116761 16367 -37656 -60569 -214313 -8524
8944 101568 56213 -224631 -216964 169928 42903 -13244 79863 14409 -140549 -62644 -41088
8933 -41088 -78587 225183 -371896 -131087 -253714 16907 -123946 -36327 -334833 321275
8922 176054 463289 558177 1322219 1828749 1222468 478343 293148 480077 290555 570513
8912 570513 35100 414326 -72985 187597 -372867 -96234 29869 160482 -100968 -75591 152441
8900 -41871 -133962 53825 150209 -21859 26126 172749 -485 86693 -20389 -134812 219642 -378973
$$ packed form
8978I6286K41441c36363a25679B43790b70437B58355J94724k07129g0202n4756
8968a24958A24508b68872Q3320A54908o7649b56058n373a25833d4078D3406J68196
8957B11602o3168k7041c200C24973B0759n29a16761A6367c7656k2913j53744h524
8944A01568m5355b24631P667A69928D2903a3244G9863A4409a40549f2644K1556
8933d1088l7499B25183c71896a31087j22627A6907a23946c6327k98506C21275
8922A76054K87235R4888P64042N06530o06281D78343j85195J86929j89522K79958
8912E70513C5100L79226g2985A87597c72867i6234B9869J30613a00968K5377A52441
8900d1871r2091E3825R6384b1859B6126J46623d85H6693b0389j14423B19642c78973
$$ plain form
8887 -6637 -123308 45329 -38302 68566 -45902 -212895 265247 -159629 89194 307371 216689
8876 216689 92905 -185337 -226028 113275 -191967 -287583 57273 9648 -59953 -85920 220103
8864 2178 -269525 -178411 165939 -55092 -219038 -343524 -30618 -255912 -64374 133715 -207685
8852 283596 127980 -254584 -66865 -293926 -33143 -317893 -211824 -140773 -226841 -253802 256815
$$ packed form
8887f637j16671D5329c8302F8566d5902j66993B65247a59629H9194K18177r0682
8876B16689I2905a85337m0691A13275a91967r5616E7273I648e9953k5967B20103
8864B178b69525R1114A65939e5092j63946j24486c0618k25294f4374A33715b07685
8852B83596A27980b54584f6865k27061c3143k84750J06069P1051q6068k6961B56815
$$ [...]
##END NTUPLES=NMR SPECTRUM
##END=
