
##TITLE=AC1242_NUNAH12032_6641810_56OZyya5Ff
##JCAMPDX= 6.0         $$ Bruker NMR JCAMP-DX V2.0
##DATA TYPE= NMR SPECTRUM
##DATA CLASS= NTUPLES
##ORIGIN= BRUKER
##OWNER= Administrator
$$ 1.72 TOPSPIN		Version 2.1
$$ 2012-08-08 14:30:25.609 -0500  Administrator@TOPSPIN
$$ Compression mode = diff/dup
##.OBSERVE FREQUENCY= 400.02188249412
##.OBSERVE NUCLEUS= ^1H
##.ACQUISITION MODE= SIMULTANEOUS (DQD)
##.ACQUISITION SCHEME= undefined
##.AVERAGES= 64
##.DIGITISER RES= 22
##SPECTROMETER/DATA SYSTEM= spect
##.PULSE SEQUENCE= noesygpps1d.comp
##.SOLVENT NAME= COFFEE_meoh
##.SHIFT REFERENCE= INTERNAL, COFFEE_meoh, 1, 14.96252
##AUDIT TRAIL= $$ (NUMBER, WHEN, WHO, WHERE, PROCESS, VERSION, WHAT)
$$ ##TITLE= Audit trail, TOPSPIN		Version 2.1
$$ ##JCAMPDX= 5.01
$$ ##ORIGIN= Bruker BioSpin GmbH
$$ ##OWNER= Administrator
$$ $$ C:\Bruker\TOPSPIN/data/COFFEE/nmr/AC1242_NUNAH12032_6641810_56OZyya5Ff/12/pdata/1/auditp.txt
$$ ##AUDIT TRAIL=  $$ (NUMBER, WHEN, WHO, WHERE, PROCESS, VERSION, WHAT)
(   1,<2012-08-08 14:30:20.609 -0500>,<Administrator>,<TOPSPIN>,<go>,<TOPSPIN 2.1>,
      <created by zg
	started at 2012-08-08 14:18:50.015 -0500,
	POWCHK enabled, PULCHK disabled,
       configuration hash MD5:
       6B 1B 68 BB D9 2E 58 E2 7F 35 AD 54 07 DF 0E 41
       data hash MD5: 64K
       01 5E E8 1E 4B E8 2C ED 1E A2 51 1B DD B5 03 1D>)
(   2,<2012-08-08 14:30:23.500 -0500>,<Administrator>,<TOPSPIN>,<proc1d>,<TOPSPIN 2.1>,
      <Start of raw data processing
       efp LB = 0.3 FT_mod = 6 PKNL = 1 PHC0 = 0 PHC1 = 0 SI = 128K 
       data hash MD5: 128K
       8B 8D 53 B2 23 39 69 8D 2E 07 A2 62 8E 49 35 EB>)
(   3,<2012-08-08 14:30:24.765 -0500>,<Administrator>,<TOPSPIN>,<proc1d>,<TOPSPIN 2.1>,
      <pk PHC0 = -1.016235 PHC1 = 0 
       data hash MD5: 128K
       7B A1 AE 90 E1 23 0F CA 53 03 68 F8 CF FA CB 25>)
(   4,<2012-08-08 14:30:25.281 -0500>,<Administrator>,<TOPSPIN>,<proc1d>,<TOPSPIN 2.1>,
      <abs ABSG = 1 
       data hash MD5: 128K
       7E 97 AC 68 2C 8E A5 18 BB CD 61 05 E8 9F EE D5>)
(   5,<2012-08-08 14:30:25.359 -0500>,<Administrator>,<TOPSPIN>,<proc1d>,<TOPSPIN 2.1>,
      <abs ABSG = 2 
       data hash MD5: 128K
       7F A0 0B 64 18 F3 C0 1E 85 49 6A 5D CF 1A 88 EE>)
(   6,<2012-08-08 14:30:25.406 -0500>,<Administrator>,<TOPSPIN>,<proc1d>,<TOPSPIN 2.1>,
      <abs ABSG = 3 
       data hash MD5: 128K
       09 6F B8 6A 75 F3 E1 AE 44 64 C8 BF 3A 13 BA 6C>)
(   7,<2012-08-08 14:30:25.468 -0500>,<Administrator>,<TOPSPIN>,<proc1d>,<TOPSPIN 2.1>,
      <abs ABSG = 4 
       data hash MD5: 128K
       79 F0 27 2E C7 BE 6A E5 AB 88 7D 63 D2 B4 DE 12>)
(   8,<2012-08-08 14:30:25.531 -0500>,<Administrator>,<TOPSPIN>,<proc1d>,<TOPSPIN 2.1>,
      <abs ABSG = 5 
       data hash MD5: 128K
       77 AB F9 EC 40 5F 20 6C 95 1E B0 5F 81 9E 9F 32>)
$$ ##END=
$$ 
$$ $$ hash MD5
$$ $$ F5 71 17 69 54 6D 23 04 23 AE FF 8C B8 89 4E A0
##$RELAX= 
##$RELAX= 
##$RELAX= 
##$RELAX= 
##$RELAX= 
##$RELAX= 
##$RELAX= 
##$RELAX= 
$$ Bruker specific parameters
$$ [...]
##$TP07= 0
##$TPNAME0= <>
##$TPNAME1= <>
##$TPNAME2= <>
##$TPNAME3= <>
##$TPNAME4= <>
##$TPNAME5= <>
##$TPNAME6= <>
##$TPNAME7= <>
##$TPOAL= (0..7)
0.5 0.5 0.5 0.5 0.5 0.5 0.5 0.5
##$TPOFFS= (0..7)
0 0 0 0 0 0 0 0
##$TUNHIN= 0
##$TUNHOUT= 0
##$TUNXOUT= 0
##$USERA1= <user>
##$USERA2= <user>
##$USERA3= <user>
##$USERA4= <user>
##$USERA5= <user>
##$V9= 5
##$VALIST= <valist>
##$VCLIST= <CCCCCCCCCCCCCCC>
##$VD= 0
##$VDLIST= <DDDDDDDDDDDDDDD>
##$VPLIST= <PPPPPPPPPPPPPPP>
##$VTLIST= <TTTTTTTTTTTTTTT>
##$WBST= 1024
##$WBSW= 4
##$XGAIN= (0..3)
0 0 0 0
##$XL= 0
##$YL= 0
##$YMAX_a= 19566402
##$YMIN_a= -12394272
##$ZGOPTNS= <>
##$ZL1= 120
##$ZL2= 120
##$ZL3= 120
##$ZL4= 120
##$ABSF1= 14.96252
##$ABSF2= -5.595662
##$ABSG= 5
##$ABSL= 3
##$ALPHA= 0
##$AQORDER= 0
##$ASSFAC= 0
##$ASSFACI= 0
##$ASSFACX= 0
##$ASSWID= 0
##$AUNMP= <proc_prof1d_extract.lims>
##$AXLEFT= 0
##$AXNAME= <>
##$AXNUC= <1H>
##$AXRIGHT= 0
##$AXTYPE= 0
##$AXUNIT= <>
##$AZFE= 0.1
##$AZFW= 0.1
##$BCFW= 0
##$BC_mod= 0
##$BYTORDP= 0
##$COROFFS= 0
##$CY= 15
##$DATMOD= 1
##$DC= 0
##$DFILT= <>
##$DTYPP= 0
##$F1P= 0
##$F2P= 0
##$FCOR= 0.5
##$FTSIZE= 131072
##$FT_mod= 6
##$GAMMA= 0
##$GB= 0
##$INTBC= 1
##$INTSCL= 1
##$ISEN= 128
##$LB= 0.3
##$LEV0= 0
##$LPBIN= 0
##$MAXI= 10000
##$MC2= 0
##$MEAN= 0
##$ME_mod= 0
##$MI= 0
##$NCOEF= 0
##$NC_proc= -3
##$NLEV= 6
##$NOISF1= 0
##$NOISF2= 0
##$NSP= 0
##$NTH_PI= 0
##$NZP= 0
##$OFFSET= 14.96252
##$PC= 1
##$PHC0= -1.016235
##$PHC1= 0
##$PH_mod= 1
##$PKNL= yes
##$PPARMOD= 0
##$PPDIAG= 0
##$PPIPTYP= 0
##$PPMPNUM= 2147483647
##$PPRESOL= 1
##$PSCAL= 4
##$PSIGN= 0
##$PYNMP= <proc.py>
##$REVERSE= no
##$SF= 400.020009027943
##$SI= 131072
##$SIGF1= 0
##$SIGF2= 0
##$SINO= 400
##$SIOLD= 131072
##$SPECTYP= <>
##$SREGLST= <1H.CDCl3>
##$SSB= 0
##$STSI= 131072
##$STSR= 0
##$SW_p= 8223.68421052631
##$SYMM= 0
##$S_DEV= 0
##$TDeff= 65536
##$TDoff= 0
##$TI= <>
##$TILT= no
##$TM1= 0
##$TM2= 0
##$TOPLEV= 0
##$USERP1= <user>
##$USERP2= <user>
##$USERP3= <user>
##$USERP4= <user>
##$USERP5= <user>
##$WDW= 1
##$XDIM= 131072
##$YMAX_p= 510922805
##$YMIN_p= -25059
##$CURPLOT= <Network HP LaserJet P1505>
##$CURPRIN= <$Network HP LaserJet P1505>
##$DFORMAT= <normdp>
##$LAYOUT= <+/1D_H.xwp>
##$LFORMAT= <normlp>
##$PFORMAT= <normpl>
##$SURQMSG= 1
$$ End of Bruker specific parameters
$$ ---------------------------------
##NTUPLES= NMR SPECTRUM
##VAR_NAME=  FREQUENCY,     SPECTRUM/REAL,   SPECTRUM/IMAG
##SYMBOL=    X,             R,               I
##VAR_TYPE=  INDEPENDENT,   DEPENDENT,       DEPENDENT
##VAR_FORM=  AFFN,          ASDF,            ASDF
##VAR_DIM=   131072,        131072,          131072
##UNITS=     HZ,            ARBITRARY UNITS, ARBITRARY UNITS
##FACTOR=    0.0627417313425164, 1,          1
##FIRST=     8223.62146879497, 2256,         -134273
##LAST=      0,             5844,            -134230
##MIN=       0,             -25059,          0
##MAX=       8223.62146879497, 510922805,    0
$$ Real data points
##PAGE= N=1
##DATA TABLE= (X++(R..R)), XYDATA
$$ [...]
66801 2461284 2435912 2411800 2389202 2368444 2348970 2329528 2309077 2286931 2262585 2236481 2210658
66790 2210658 2187327 2166578 2146452 2125434 2103911 2082989 2062988 2043578 2024338 2004530 1983297
66779 1983297 1961037 1939871 1921588 1905359 1888456 1869245 1848761 1829194 1811477 1794693 1777548
66768 1777548 1759984 1743087 1727436 1712059 1695542 1677920 1660576 1644210 1627985 1611104 1594215
66757 1594215 1578423 1563714 1549322 1535068 1521227 1507496 1493338 1479201 1466141 1454113 1441803
66746 1441803 1428518 1415158 1402736 1390801 1378050 1363992 1349384 1335443 1323182 1313149 1305092
66735 1305092 1297823 1289780 1279828 1267617 1253643 1239268 1226265 1215688 1207122 1199161 1190633 1181298 1171631
66722 1171631 1162125 1152723 1142872 1132288 1121538 1111447 1101911 1091944 1081102 1070254 1060557 1052266 1044990
66709 1044990 1038430 1032120 1025025 1016480 1007366 999265 992341 985140 976788 968326 961095 954598 947057 937864
66695 937864 928433 920434 913909 907579 900591 893401 887026 881820 877176 872256 866717 860701 854285 847257
66681 847257 839479 831291 823406 816445 810629 805805 801616 797680 793676 789252 783923 777336 769873 762731
66667 762731 757056 752939 749503 745922 742024 737972 733810 729499 724980 719957 714002 707217 700434 694321
66653 694321 688660 683085 678209 675183 674108 673627 672180 668973 663748 656695 649050 642749 638617 635478
66639 635478 631835 627825 624576 622155 619321 615254 610540 606395 603642 602337 601520 599458 595151 589599
66625 589599 584615 580490 576077 571197 567315 565301 564096 562483 560773 559509 557772 554341 549723 545389
66611 545389 541549 537290 532611 528636 525834 523573 521664 520838 521187 521395 520147 517446 514101 510789 508028
66596 508028 506199 505093 504084 503013 502065 500612 497362 492258 487156 483825 482076 480607 478871 477179
66582 477179 475560 473528 470665 466760 461819 456538 452219 449572 448164 447579 448185 449833 450832 449666 447133
66567 447133 445239 444455 443669 442566 442047 442134 441477 439651 438138 437931 437699 435627 431956 428207 424806 421032
66551 421032 416847 413159 410335 407788 405141 402629 400278 397771 395383 393957 393641 393625 393435 393473 393763 393385
66535 393385 392050 391225 392310 394277 394637 392698 390353 389222 388349 385685 380968 376007 372473 370467 369231
66520 369231 368254 367286 365900 363659 360628 357448 354953 353716 353739 354474 355200 355427 354847 353168 350421 347376
66504 347376 345055 343587 342047 339823 337703 337062 338169 339840 340757 340614 339895 339039 338189 337453 336957 336496
66488 336496 335397 333063 329723 326431 324015 322077 319440 315719 312038 309886 309556 310137 310820 311685 313108
66473 313108 314823 315853 315303 313244 310849 309504 309581 310276 310819 311463 312777 314245 314394 312438 309134 305809
66457 305809 303133 301242 300382 300745 301930 303175 304051 304444 304042 302538 300465 299163 299418 300386 300312 298267
66441 298267 294903 291593 289260 288072 287887 288569 289891 291369 292234 291699 289611 287110 286210 287972 290975
66426 290975 292290 290367 286553 283411 282089 281915 282101 282735 283889 284558 283223 279401 274427 270661 269823
66411 269823 271828 275153 278365 281075 283285 284370 283409 280416 276452 272419 268440 264633 261663 259963
66397 259963 258950 257733 256362 255760 256410 257601 258062 257153 255301 253376 251773 250227 248559 247242 246884
66382 246884 247434 248406 249566 250636 250613 248642 245783 244563 245992 248120 248579 247580 247102 247822 248519 248332 247849
66365 247849 247515 246412 243525 239531 236533 236234 238606 241924 243955 243652 241928 240434 239670 238958 238035 237465
66349 237465 237173 235939 233202 230350 229089 229191 229053 228000 226758 225751 224345 222153 219945 218585 217695
66334 217695 216128 213506 210775 209302 209683 211356 213184 214487 215567 217120 219267 221410 223052 224294
66320 224294 225372 226069 225913 224729 222737 220301 217952 216522 216768 218629 221043 222713 222979 221944 220010
66305 220010 217620 215389 213952 213368 212914 211929 210807 210683 212047 213986 215001 214186 211608 208079 204991
66290 204991 203833 205031 207244 208433 207805 206377 205635 206030 206879 207290 207007 206592 206878 208046 209283 209707
66274 209707 209486 209491 209866 209688 208375 206717 205939 206184 206503 206052 204742 202958 201268 200391 200833 202375 204107
66257 204107 205075 204822 203635 202480 202306 202951 203076 201785 200026 199531 200447 200966 199582 196901 194697 193794
66241 193794 193503 192841 191714 190923 191216 192270 192618 191028 188124 186073 186238 187626 188216 187463 186710 187218 188583
66224 188583 189387 188961 188077 187992 189044 190312 190661 190004 189314 189447 190369 191636 193016 194224 194539 193429 191407
66207 191407 189636 188658 188050 187346 186707 186545 186928 187573 188117 188224 187743 186934 186343 186413 187334 189084 191227 192823
66189 192823 193095 192301 191510 191468 192088 192975 193759 193836 192597 190316 188172 187026 186740 187044 188149 189848 190830
66172 190830 190083 188517 188016 188978 190005 190114 189945 190311 190808 190824 191070 192726 195278 196442 194656 190834 187172
66155 187172 184788 183173 181605 180358 180379 182246 185697 189801 193339 195263 195239 193815 191924 190291 189348
66140 189348 189338 190025 190420 189406 186822 183624 180830 178670 176870 175187 173293 170613 166939 163157 160808
66125 160808 160743 162371 164164 164755 163757 161924 160511 160202 160675 161378 162455 164370 166649 167794 166925 165133
66109 165133 164509 165720 167165 166942 165329 164576 166102 168696 170108 169833 169202 168897 167887 165466 163064 162699
66093 162699 164208 165474 165301 164677 164876 165539 165439 164327 163085 162382 162003 161520 161068 161233 162331 163871 164795
66076 164795 164387 162988 161624 160957 160864 160967 161107 161258 161447 161902 162703 163221 162631 161390 161288 163259 165805
66059 165805 166676 165739 164947 165500 166412 166348 165634 165439 165793 165598 164323 162569 160972 159613 158741 158981 160178
66042 160178 160863 159863 158038 157435 158813 160980 162667 164089 166235 169420 173124 176655 179309 180403 179889
66027 179889 178583 177174 175410 173144 171681 172885 176886 181778 185737 188353 189691 189430 187717 185786
66013 185786 184642 183829 182416 180569 179086 177974 176810 176118 176869 178525 179154 178013 176698 176944 178358
65998 178358 179410 179835 180629 181961 182556 181496 179595 178363 178286 178799 179485 180407 181287 181170 179373 176384 173419
65981 173419 171265 169948 169424 169999 171814 174312 176612 178299 179565 180600 181172 180850 179553 177839 176769
65966 176769 177327 179657 182715 184843 184928 183136 180679 179011 179094 181024 183998 186600 187451 185971 182817 179488
65950 179488 177271 176461 176653 177631 179553 182149 184218 184458 182758 180378 178882 179052 180601 182564 183958
65935 183958 184449 184421 184261 183701 182280 180366 179100 179107 179692 179757 179196 178941 179637 180664 180594 178563 175251 172602
65917 172602 172416 174876 178307 180493 180352 178398 175801 173295 171059 169345 168805 170055 173026 176844 180314
65902 180314 182522 183126 182316 180629 178833 177872 178523 180562 182241 181318 177348 172702 170435 171065 172249 171884
65886 171884 170557 170213 171246 172136 171697 170411 169302 168558 167855 167278 167152 167353 167513 167719 168306 168946 168625
65869 168625 166925 164925 164288 165514 167547 169125 169944 170137 169390 167604 166167 167122 170506 173747 174610 173807
65853 173807 173454 173825 173357 171528 169782 169323 169773 170680 172578 175458 177688 177992 177414 177773 178903 179126 177951
65836 177951 176485 175336 173987 172570 172441 174112 175984 176182 174789 173327 172679 172431 171857 170733 169443
65821 169443 168889 169932 172273 174256 174543 173816 174031 176033 178629 180179 180398 180287 180738 181724 182738 183635
65805 183635 184896 187054 189849 191983 191865 188879 184138 180004 178555 180044 182709 184277 183820 182182 180804
65790 180804 180520 181462 183540 186467 189480 191547 192068 191369 190450 190106 190222 190075 189470 189272 190303 191947 192623
65773 192623 191713 190150 188807 187256 184813 182006 179963 178810 177741 176478 175595 175385 175430 175431 175445 175103 173633
65756 173633 171210 169298 168928 169369 169302 168596 167932 167207 165612 163251 161463 161186 161891 162520 162676 162311 161047
65739 161047 158736 156325 155138 155278 155569 155350 155451 156805 158703 159428 158483 157237 157132 157993 158660 158616 158247
65722 158247 157822 157105 156003 154853 153889 153019 152260 151750 151154 149791 147720 145967 145120 144443 143206 142314 143406
65705 143406 146473 149472 150583 149977 149131 149188 150421 152497 154628 155931 156254 156357 156851 157332 157143 156538 156369
65688 156369 156726 156720 155773 154437 153549 153059 152239 150999 150413 151549 153917 155562 155067 153170 151873 152029 152522
65671 152522 151982 150433 148699 147005 145157 143704 143636 144818 145797 145549 144632 144142 144225 144266 144085 144258 145319
65654 145319 147010 148340 148325 146980 145573 145491 146799 148550 150504 153526 157753 161468 162921 162582 162353 162908
65638 162908 163128 162070 160177 158316 156892 156314 157093 158737 159583 158697 157251 157042 158222 159496 160184 160922
65622 160922 162357 164214 165938 167352 168279 168190 166834 164785 162790 160773 158039 154584 151655 150613 151349
65607 151349 152298 152257 151736 152035 153279 154258 154289 154306 155441 157277 158321 157764 155891 153155 149993 147494 146986
65590 146986 148504 150542 151828 152566 153434 154137 153748 151995 149465 146831 144571 143221 143181 144292 146096 148477
65574 148477 151517 154811 157423 158583 158092 156250 153904 152376 152534 153748 154346 153363 151334 149163 146876
65559 146876 143919 140246 136474 133213 130727 129193 128813 129547 130926 132218 132794 132602 132409 133252 135335 137743
65543 137743 139591 141069 142823 144634 145639 145834 146288 147342 147556 145361 141315 137677 135908 135578 135890
65528 135890 137151 140039 143986 147137 147946 146538 144690 144614 147292 151482 154680 155564 155255 155755 157587 159740
65512 159740 161535 163358 165451 167226 168312 169238 170288 170542 169086 166709 165177 165004 165036 164418 163866 164567
65496 164567 166614 169125 171433 173522 175622 177857 180133 182037 183033 183145 183191 183897 184981 185674 186069 187235
65480 187235 189731 192608 194481 195292 196288 198229 200363 201641 202397 203993 206882 209937 212004 213336 214731
65465 214731 215865 215559 213674 211602 210413 209395 207140 203500 199551 195958 192398 188763 185951 184867
65451 184867 185167 185604 185398 184737 184081 183559 183174 183054 183184 183133 182379 180827 178832 176796 174966 173559 172779
65434 172779 172545 172349 171483 169466 166333 162705 159525 157502 156568 155920 154695 152702 150596 149433 149912 151711
65418 151711 153500 153861 152531 150769 150345 152020 154813 156666 156076 153467 151016 150741 152623 154847 155907
65403 155907 156002 156174 156795 157638 159019 161772 165832 169612 171481 171549 171378 171951 172571 172159 171236 171775 174869
65386 174869 179213 182595 184530 186473 189487 192838 195396 197324 199456 201769 203739 205853 209448 214941
65372 214941 221305 227503 233408 239071 244258 249358 255736 264260 274053 283684 293113 303408 314608 324968
65358 324968 332667 337588 340849 342950 343027 340085 334522 327961 321664 315681 309864 304987 301968 300192 297698
65343 297698 293376 288217 284024 281615 280714 280776 281051 280308 277459 272472 266243 259741 253635 248304 243558
65328 243558 238594 232892 226986 221765 217208 212454 207036 201448 196586 193173 191544 191224 190757 188735 185218
65313 185218 181649 179314 178365 178245 178315 177990 177063 176128 175960 176213 175446 172836 169224 165946 163237 160360 156898
65296 156898 153264 150168 148194 147768 148991 151397 154106 156178 156786 155497 152768 149865 147784 146372 144922
65281 144922 143464 142865 143558 144728 145066 143999 141947 139673 137854 137218 138426 141294 144342 145808 145401
65266 145401 144684 145332 147301 149167 150000 150180 150389 150662 150888 151586 153422 156110 158465 159613 159791 159901 160608
65249 160608 162060 164188 166885 169767 172000 172786 172303 171976 173372 176645 180247 182313 182165 180474 178273
65234 178273 176151 174268 172774 171924 171713 171551 170615 168763 166918 166217 166807 167777 168192 167809 166796 165262
65218 165262 163259 160830 157994 155085 153142 153292 155353 157611 158452 157747 156192 153902 150541 146479 142791
65203 142791 140024 137785 135801 134604 134681 135526 136108 136055 135918 136405 137764 139841 142287 144520 145771 145546
65187 145546 144208 142929 142745 143446 143692 142525 140637 139713 140608 142697 145131 147880 150963 153257 153166 150471
65171 150471 146654 143180 140248 137612 135766 135425 136337 137607 139003 140898 142898 143705 142923 142037 142754 144938
65155 144938 147009 148003 148305 148515 148601 148372 148019 147761 147416 146709 145725 144772 144025 143438 142991 142963 144012 146719
65137 146719 150798 154924 157647 158441 157737 156342 155078 154357 153491 151136 147472 145344 147692 153877 160046
65122 160046 163380 164387 164614 164067 162249 160227 159739 160828 161951 162190 161950 161735 161629 162006 163419 165557
65106 165557 167387 168595 169918 171821 173884 175845 178342 182058 186821 192027 197396 202914 208552 214461
65092 214461 220965 228055 235238 242150 248809 255128 260785 265911 271230 276985 282216 285655 287073 287328
65078 287328 287360 287471 287325 286308 284165 281499 279198 277079 273701 268129 261481 255959 252507 249948 246370
65063 246370 240804 233638 226005 218943 212789 207258 202192 197977 194825 191975 188284 183645 179157 175777
65049 175777 173424 171633 170291 169190 167457 164368 160564 157592 156117 155232 153834 152034 150683 149952 149027
65034 149027 147163 144512 141856 139881 138744 138064 137370 136855 137431 139487 141760 142347 140994 139525 139562 140732
65018 140732 141709 142097 142157 141403 139005 135594 133308 133595 135847 138511 140607 141712 141435 139797 137812 137067
65002 137067 138777 143165 149043 153829 154948 152071 147514 143828 141453 139298 136920 135103 134664 135753
64988 135753 138242 141751 145160 147023 146882 145568 143962 142140 140064 138367 137738 137824 137462 136090 134518
64973 134518 134143 135543 137898 139675 139887 138742 137219 136092 135368 134520 133170 131585 130628 131111 133099 135926
64957 135926 138794 141053 141936 140727 137728 134574 132843 132473 132255 131766 131941 133571 136163 138784 141256
64942 141256 143739 145567 145526 143439 140786 139428 139881 140976 141037 139334 136537 133853 131873 130435 129535 129788
64926 129788 131565 134124 136227 137407 137963 137881 136788 135189 134679 136148 138441 139701 139598 139220 139060 138432
64910 138432 137072 136021 136151 136686 136143 134335 132504 131685 131744 131945 131774 131184 130655 131030 132752 135204 137310
64893 137310 138706 139618 139754 138295 135312 132346 131039 131762 133810 136184 137775 137777 136734 136426 137791 139608
64877 139608 140292 140287 141222 143030 143691 142197 140229 139935 141144 141833 140810 138920 137769 138053 139203 140226
64861 140226 140680 140902 141249 141358 140672 139541 139063 139619 140420 140823 141130 141451 140738 138159 134909 133337 134271
64844 134271 136205 137224 136751 135334 133819 133262 134714 138226 142340 145089 145461 143825 141401 139581 139217
64829 139217 140050 141006 141266 140764 139558 137448 134761 132917 133273 135532 138067 139819 141122 142522 143538
64814 143538 143129 141055 138288 136209 135686 136743 138698 140592 141795 142446 143192 144425 145812 146643 146541 145677
64798 145677 144383 142815 141116 139630 138665 138108 137535 136779 136258 136753 138825 142174 145414 146931 146493 145710
64782 145710 146211 147597 148156 147583 147693 149795 152496 153204 151163 147878 144945 142733 141171 140516 140862 141689
64766 141689 142336 142442 141786 140332 138665 137766 138003 138848 139736 140692 141853 143031 144026 144843 145341 145273 144967 145265
64748 145265 146369 147380 147494 147068 146941 147288 147826 148582 149630 150441 150299 149222 147820 146516 145539 145311 145951
64731 145951 146617 146322 145434 145463 147197 149887 152449 154642 156619 158081 158509 157893 156717 155405 154092 152758
64715 152758 151318 149699 148013 146550 145651 145710 147193 150231 154193 158053 161248 163780 165477 165798 164704
64700 164704 163199 162418 162384 162100 160852 159060 157808 157791 158864 160423 161978 163309 164337 165165 166143 167477
64684 167477 168689 168920 167931 166318 164481 162008 158710 155644 154198 154432 155178 155646 155963 156235 156216 156219 157270
64667 157270 159799 162939 165639 167708 169262 170021 169995 170176 171370 172667 172235 169742 166995 165796 165945 165901
64651 165901 164915 163728 163298 163555 163731 163498 163258 163404 163724 163640 162693 160757 158281 156446 156412 157875 158978
64634 158978 158405 157165 157421 159803 162840 164924 165734 165666 165052 164409 164452 165192 165764 165697 165577 165832 165654 164042
64616 164042 161456 159536 159407 160898 163160 165314 166622 166713 165750 164110 162042 159950 158631 158699 159907 161434
64600 161434 162701 163564 164024 164261 164765 165935 167559 168969 169686 169777 169800 170507 172201 174196 175327 175240 174639
64583 174639 174035 173017 171287 169659 169149 169508 169577 168861 167964 167498 167316 166928 166190 165526 165621 166705 167982 168248
64565 168248 167336 166366 166220 166619 167209 168465 170489 171918 171520 170243 169992 170705 170468 168648 166999 167086 168250
64548 168250 169105 169708 170975 172742 173787 173597 173169 173871 175881 177881 178299 177087 176108 177186 179869 181993
64532 181993 182503 182665 183970 185945 186914 186143 184120 181195 177218 172622 168846 167152 167474 168677 169602 169693
64516 169693 169030 168192 167974 168834 170403 171680 171923 171385 170967 171154 171548 171611 171513 171845 172657 173333 173439 173263 173252
64497 173252 173205 172412 170597 168484 167189 167093 167662 168612 170744 174906 180312 184870 187345 188227 188235 187218 185340
64480 185340 184079 184660 186246 187100 187047 187236 187743 187166 184841 181986 180138 179627 180001 180777 181206 180478 178976
64463 178976 178513 180450 183988 186848 187313 185379 182484 180423 179970 180313 180251 179860 180195 181489 182752 183292
64447 183292 183424 183404 183028 182801 184072 187038 189776 190370 189104 187525 186333 185421 185196 186269 188153 189628
64431 189628 190334 190878 191410 191222 189988 188540 188036 188799 190086 190684 189903 188349 187557 188414 190146 191187 190844
64414 190844 189797 189389 190757 194155 198491 201894 203286 203190 202657 201987 200979 199861 199211 199295 200032 201113
64398 201113 201727 200931 199070 198038 199042 200785 201169 200360 200657 203383 207359 210723 212910 214280 214856 214339
64382 214339 212878 211156 209806 208960 208277 207392 206541 206537 207809 209778 211615 213230 214815 215804 215338 213802
64366 213802 212862 213539 214932 215316 214067 212048 210359 209114 207662 205892 205026 206565 210433 214829 218151
64351 218151 220299 221706 222173 221686 221497 222957 225550 227453 227921 227838 227984 228248 228882 230980 234799 238612
64335 238612 240325 239832 239046 239851 242533 246007 249062 251295 253032 254559 255710 256309 256561 256681 256617 256631 257510
64318 257510 259380 260846 260402 258442 256694 255873 255224 254474 254716 256769 259715 261772 261969 260612 258846 258080
64302 258080 259061 261150 263148 264875 266952 268979 269419 267981 266812 268291 272488 277733 282843 287674 292228
64287 292228 296534 301181 306776 312824 317989 321647 324606 328189 332938 338184 342639 345598 347794 350830
64273 350830 355499 360961 365736 369095 371210 372465 373037 372780 371161 367709 362840 357895 354115 351990 351573
64258 351573 352535 353660 353437 351921 351130 352655 355593 357790 358433 358259 357835 357079 356312 356363 357368 358637 360065
64241 360065 362643 367061 372476 377242 380449 382491 384604 388065 393321 399449 404795 408526 411408 414877
64227 414877 419544 424767 429408 432732 434690 435606 435727 435089 433714 431742 429317 426565 423833 421698 420476
64212 420476 419823 419030 417636 415648 413415 411441 410017 408857 407401 405830 405379 407163 410834 414863 418054
64197 418054 420367 422363 424331 426090 427271 427617 427193 426436 425980 426395 427941 430288 432449 433400 433022 432293
64181 432293 432447 434198 437675 442535 447935 453010 457708 462600 467583 471580 474133 476470 480002 484372
64167 484372 488138 491021 494240 498763 504576 511794 521073 532238 543659 553979 563870 575235 589087
64154 589087 604985 622123 639981 657898 674920 690634 705786 721546 738122 754283 768393
64143 768393 779873 789528 798403 806498 812807 816428 817230 815434 811037 804034 795002 785129 775639 767254
64129 767254 760058 753529 746803 739371 731777 725328 720708 717015 712615 706963 701000 695621 690555 685369
64115 685369 680918 678648 678628 679469 680387 682224 685840 690482 694636 697832 700658 703480 706259 709488 714188
64100 714188 720729 728470 736912 746573 758331 772277 787626 803539 819668 835931 852010 867302
64088 867302 881516 895195 909280 924023 938656 952231 964264 974177 980818 983406 982843 981238 980026
64075 980026 979052 977486 974943 971481 967163 962132 956912 952318 949062 947482 947372 947937 948142 947465 946394
64060 946394 946140 947724 951260 956254 962648 971212 982295 994502 1005561 1014858 1024188 1035415 1048149
64047 1048149 1060631 1072382 1085062 1100934 1121233 1145703 1172773 1200271 1226817 1252617 1278459
64036 1278459 1304325 1329720 1354769 1379753 1403801 1425448 1444598 1462627 1480327 1497119 1512807
64025 1512807 1528719 1546264 1565293 1584731 1603916 1622393 1639180 1653377 1665280 1676049 1686420
64014 1686420 1696159 1704428 1710411 1714111 1716915 1720666 1725770 1731156 1736727 1744661 1756975 1772648 1788693
64001 1788693 1803697 1818710 1834818 1851687 1869042 1888124 1910627 1936963 1966408 1998461 2033392
63990 2033392 2071727 2113756 2159423 2208424 2260626 2316564 2377331 2443909 2516816 2596241 2681974
63979 2681974 2773206 2869230 2970602 3079069 3196217 3323037 3461198 3613740 3783561 3971807
63969 3971807 4178742 4405961 4656896 4935513 5245667 5591896 5979908 6415989 6906589
63960 6906589 7458508 8078456 8771833 9542506 10394067 11330283 12353410 13462283 14652554
63951 14652554 15918175 17251731 18643308 20079307 21541811 23008614 24454690 25855106
63943 25855106 27186864 28427846 29555207 30546719 31384092 32053968 32545906 32851288 32965193
63934 32965193 32888361 32626721 32190217 31592936 30852946 29990119 29024013 27974366 26862467
63925 26862467 25710233 24537703 23362020 22197954 21057570 19949263 18878481 17849739
63917 17849739 16866904 15931473 15042107 14196603 13393466 12631107 11906622 11216374 10557399
63908 10557399 9927793 9326398 8752793 8207159 7689606 7199837 6737688 6303290 5896124
63899 5896124 5514449 5156356 4821159 4509292 4221064 3955804 3711764 3486334 3276790
63890 3276790 3081477 2900214 2733230 2579891 2438716 2308210 2187256 2075142 1971743
63881 1971743 1877284 1791265 1711823 1636797 1565353 1498078 1435727 1378496 1326257 1278605 1234539
63870 1234539 1192918 1153592 1117482 1085112 1055482 1026925 998805 971903 947277 925302 905871
63859 905871 888954 874555 862370 851951 843120 835807 829495 823454 817738 813403 811241 810621 810092 808773
63845 808773 806556 803254 798387 791849 784073 775432 766068 756253 746152 735180 722440 708000 692979
63832 692979 678153 663375 648603 634406 620930 607391 593336 579579 567080 555753 545256
63821 545256 536020 528301 520863 512066 501946 492012 483224 475423 468553 462945 458164 452918 446550 439662
63807 439662 432942 426352 419815 413766 408545 404066 400382 397577 394776 390473 384648 379426 376597 375342
63793 375342 373618 371085 369185 368549 367876 365646 361811 357363 353233 350138 348708 348889 349630 349790 349178 348242
63777 348242 347102 345521 343665 342108 340945 339474 337041 333781 330327 327229 324979 324047 324254 324421 323408
63762 323408 321502 320140 320157 321054 322149 323598 325722 328056 329927 331555 333683 336249 338303 339297 339720
63747 339720 340261 341122 342482 344899 348687 353379 358552 364943 373975 386028 399716 413186 425805 438345
63733 438345 451807 466501 482178 498509 515178 531815 548191 564316 580024 594634 607395
63722 607395 618181 627165 633830 636939 635748 630739 622925 613068 601974 590839 580501 570698 560807
63709 560807 551004 541887 533209 524008 514053 504234 495274 486973 479163 472615 468204 465604 463502 461030
63695 461030 458509 456742 455828 454706 451976 447485 443149 441686 444223 449467 455485 461884 469782 479975
63681 479975 491822 503997 515889 528064 541488 556379 571760 586276 599562 612587 626305
63670 626305 640016 651415 658386 660622 659449 656306 651581 644769 635368 623451 609562 594550 579641
63657 579641 566317 555523 546905 539111 531077 522917 515498 509424 504622 500728 497455 494414 490884 486243
63643 486243 480844 476213 473946 474300 476163 478410 480905 484039 487839 492088 496986 503045 510351 518549
63629 518549 527668 538550 552177 568770 587596 607467 627453 647502 668485 691455 716808 744169
63617 744169 772831 801945 830504 857649 883026 906505 927595 945487 959516 969246 974460 975750
63605 975750 974960 974194 974275 974802 975541 976710 977687 976648 972242 964985 956359 947106 936944 925409 912337
63590 912337 897861 882608 867682 854006 841795 830722 820173 809241 797317 785053 773924
63579 773924 764386 755374 746248 738234 732941 730255 728868 728214 728613 730092 732547 736762 743780 753315 764236
63564 764236 776672 792105 811092 832344 854527 877636 902033 927486 954083 982938 1014828
63553 1014828 1048693 1082325 1114020 1142983 1168920 1192140 1213508 1233468 1251463 1266979 1280698
63542 1280698 1293964 1307613 1321948 1337184 1352964 1367812 1379963 1388486 1393006 1392917 1387874 1378614 1366053
63529 1366053 1349700 1328126 1301076 1270094 1236871 1201955 1165371 1127728 1090296 1054472 1021300
63518 1021300 990913 962394 934847 908667 885067 864293 845179 826663 808855 792187 776347
63507 776347 760607 744702 729060 714703 703185 695753 692054 690232 688858 688201 689264 692401 697561
63494 697561 705021 714865 726254 738311 751442 766754 784309 802954 821905 841448 861792 882093
63482 882093 901055 917936 932486 944325 952929 958104 960135 959419 956062 949852 940642 928686 914573
63469 914573 898961 882718 867254 854094 843803 835732 828943 822785 816370 808589 799531 791056 784716
63456 784716 779523 773076 764727 756356 749954 745737 742866 740701 738877 737356 737123 739781 745619 752950
63442 752950 760306 768547 779803 794828 812482 831580 852234 875382 901767 931436 963545 996528
63430 996528 1029016 1060876 1093220 1127403 1164067 1202707 1241651 1278681 1312302 1342438 1369543
63419 1369543 1393126 1411647 1423922 1430256 1432098 1430940 1427687 1422849 1416942 1410380 1402918 1393561 1381513
63406 1381513 1367168 1351690 1335601 1318290 1298878 1276965 1252463 1225612 1197470 1169532 1142349
63395 1142349 1115354 1088519 1063226 1040709 1020586 1001994 985283 971178 958886 946683 934406
63384 934406 923894 916795 913105 912058 913279 916668 922172 930041 940466 952732 965724 979620 996094
63371 996094 1016359 1039905 1065663 1093518 1123990 1157147 1192502 1229341 1266539 1302615 1336552
63360 1336552 1368050 1396447 1420051 1437241 1447874 1453093 1454269 1452653 1449391 1445092 1439710 1433403 1426981
63347 1426981 1420789 1413762 1404536 1393145 1380620 1367179 1351874 1334023 1313935 1292057 1268348 1242883
63335 1242883 1216348 1189425 1162121 1134109 1105525 1077246 1050569 1026562 1005332 985972 967717
63324 967717 951130 937440 926534 916390 905070 892759 881161 871159 861906 852327 842802 834893
63312 834893 829569 826076 822535 817523 811141 804797 799963 796859 794231 790566 785676 780898 777575 775565
63298 775565 773565 770700 767279 764038 761321 759254 758149 758215 759153 760605 762819 766345 771022 775730 779370
63283 779370 781851 783869 785867 787510 788271 788419 789153 791516 795145 798297 799314 798125 796246 795355 795902
63268 795902 797163 798499 800231 802959 806275 808818 809847 810200 811306 813702 817108 821437 826865 833087
63254 833087 839425 845791 852737 860427 868305 876014 883977 892869 903109 915000 928522 942818 956910
63241 956910 971296 987861 1007594 1029381 1051871 1075570 1102035 1131730 1163934 1198293 1235103
63230 1235103 1274121 1314310 1355028 1396596 1439486 1483535 1528014 1571834 1613709 1652854 1689749
63219 1689749 1725729 1761741 1797794 1833350 1867600 1899589 1928892 1956155 1982234 2006690 2027719
63208 2027719 2043515 2053116 2056127 2052563 2043071 2028446 2008769 1983804 1954351 1922285 1889012 1854738
63196 1854738 1819584 1784442 1750272 1717570 1687229 1660942 1639675 1622307 1606892 1593043 1582106
63185 1582106 1575137 1571706 1570785 1571882 1574992 1580220 1587947 1598811 1612818 1628711 1644900 1661052 1678210
63172 1678210 1697119 1716950 1736170 1754311 1772159 1790133 1807239 1822014 1834034 1843969 1852509 1859689
63160 1859689 1864937 1867151 1864964 1857729 1846300 1832158 1815508 1794822 1768691 1737893 1705328 1673975
63148 1673975 1645047 1617947 1591756 1566443 1542415 1519251 1495750 1471583 1448198 1427526 1410257
63137 1410257 1395874 1383639 1372700 1361883 1350626 1339792 1330324 1321382 1311282 1300283 1290809 1284485
63125 1284485 1280329 1276501 1272501 1268881 1266090 1264697 1265815 1270055 1276488 1283451 1289863 1295195 1299061 1301846
63111 1301846 1305065 1310069 1316764 1324360 1332626 1341511 1350320 1358573 1367098 1376876 1387185 1396402 1404445 1412788
63097 1412788 1421856 1429910 1435067 1437371 1438410 1439916 1443062 1447984 1453383 1457553 1460475 1463993 1469265 1475115
63083 1475115 1479921 1484290 1490375 1498804 1507772 1515492 1522416 1530325 1539976 1550635 1561794 1574401 1589962
63070 1589962 1608880 1630329 1653647 1679075 1706764 1735628 1764067 1791950 1821252 1854377 1892109
63059 1892109 1933479 1977556 2024903 2076935 2133897 2194122 2255921 2320004 2388962 2463982 2543037
63048 2543037 2623253 2704335 2788408 2876690 2967681 3058871 3149015 3238248 3326994 3415634 3504534
63037 3504534 3593440 3681076 3766082 3848241 3928172 4005884 4080253 4150086 4215189 4275912 4331632
63026 4331632 4379946 4417698 4442889 4455297 4455148 4441885 4415012 4375755 4326650 4269251 4203529 4130174
63014 4130174 4052348 3973916 3896595 3820270 3745815 3675949 3612756 3555729 3503234 3455167 3413034
63003 3413034 3377775 3348777 3325404 3308608 3300129 3300125 3306096 3314368 3322624 3331085 3341482 3354983 3371040
62990 3371040 3388141 3405497 3423777 3444021 3466065 3488316 3508888 3526450 3540040 3548790 3552278 3550612
62978 3550612 3543601 3530200 3509313 3480894 3445564 3403325 3353467 3295805 3231381 3161833 3088688
62967 3088688 3013398 2937347 2861572 2786923 2714595 2645798 2580645 2518137 2457567 2399294 2343841
62956 2343841 2291101 2240953 2193724 2149225 2106157 2063540 2022131 1983263 1946782 1911450 1877154
62945 1877154 1845139 1815811 1787658 1758908 1729236 1699300 1669606 1640615 1613273 1588510 1566439
62934 1566439 1546548 1528318 1511234 1494649 1478180 1462022 1446494 1431675 1417822 1405550 1395006
62923 1395006 1385316 1375543 1365866 1357097 1349287 1341536 1333025 1323495 1312939 1301768 1291315 1283052 1276874
62910 1276874 1271042 1264405 1258048 1253928 1252253 1251005 1248026 1242974 1237222 1232359 1228934 1226269 1223265 1219547
62896 1219547 1215920 1213514 1212476 1211735 1210036 1206873 1202246 1196048 1188303 1179928 1172608 1167509 1164321 1161808
62882 1161808 1159149 1156491 1154297 1152569 1150871 1148921 1146964 1145562 1145057 1145242 1145574 1145740 1145894 1146288 1146861 1147393
62866 1147393 1147878 1148443 1148933 1148921 1148196 1146921 1145366 1143922 1143426 1144795 1147882 1151113 1152886 1153149 1153044 1153124 1152633
62849 1152633 1150743 1147914 1145472 1144071 1143099 1141725 1140092 1139146 1139438 1140533 1141685 1142642 1143499 1144191 1144657 1145180
62833 1145180 1145836 1145778 1143942 1140542 1136912 1133636 1129941 1125480 1121588 1119714 1119463 1119318 1118671 1117846 1116666 1114663
62817 1114663 1112570 1111929 1112856 1113670 1113248 1112439 1112489 1113411 1114861 1117506 1122251 1128723 1135672 1142595 1150143 1159173
62801 1159173 1170036 1182447 1195504 1208334 1221307 1236033 1253472 1272769 1292819 1314193 1338295
62790 1338295 1365296 1394494 1426516 1463394 1506057 1553173 1603187 1656431 1714586 1778933 1849905
62779 1849905 1927601 2011847 2102167 2198457 2301424 2411751 2528905 2651257 2777190 2905603
62769 2905603 3035306 3164416 3290504 3411147 3524191 3627615 3719402 3797636 3860664 3906972
62759 3906972 3935036 3943782 3933419 3905543 3862253 3805450 3737026 3658977 3572799 3479312 3379738
62748 3379738 3276517 3172421 3069282 2968172 2870037 2775025 2681843 2589299 2498318 2410955
62738 2410955 2327551 2246558 2167363 2091372 2019630 1951248 1885264 1822392 1763426 1707267 1652380
62727 1652380 1599337 1550103 1505254 1463656 1424598 1388417 1354978 1323339 1293487 1266894 1244627
62716 1244627 1226037 1209998 1196475 1186108 1179141 1175642 1176050 1180553 1188351 1198542 1211494 1228385
62704 1228385 1249464 1273790 1300992 1332350 1369427 1412221 1459490 1510657 1566344 1626866 1691239
62693 1691239 1758470 1829153 1904682 1984945 2067745 2150598 2232079 2311063 2385687 2454011 2515155
62682 2515155 2568839 2613955 2648375 2670296 2679369 2676553 2663252 2640521 2608780 2568272 2519911 2465442
62670 2465442 2406685 2344996 2281622 2217894 2154585 2091657 2029139 1967700 1907747 1848717 1790181
62659 1790181 1733016 1678387 1626123 1575443 1526901 1481903 1440237 1399825 1359421 1319936 1282282
62648 1282282 1245499 1208362 1171723 1137696 1107037 1078781 1052100 1027001 1003124 979349 955245
62637 955245 932052 911489 894028 878744 864521 850940 838238 826813 816712 807457 798502 790085
62625 790085 783405 779530 778028 776984 774599 770722 766712 764007 763178 764235 767120 771408 775955 779777
62611 779777 783456 789010 797902 809474 821746 833544 845393 858370 872695 887915 904304 923439
62599 923439 946935 974840 1005807 1038904 1074679 1114272 1158178 1206393 1259085 1316171 1376546
62588 1376546 1438787 1502612 1568560 1636017 1702626 1766159 1826007 1882037 1932821 1976088 2010684
62577 2010684 2037222 2056803 2069719 2075304 2072453 2060266 2038798 2009347 1973874 1934323 1892651 1850876
62565 1850876 1810129 1769793 1728464 1686005 1643981 1603862 1565492 1527729 1490025 1452821 1416752
62554 1416752 1382034 1348550 1316079 1284357 1253126 1222165 1191207 1159988 1128580 1097590 1067842
62543 1067842 1039911 1013993 990109 968222 948255 930163 913944 899486 886568 875135 865432
62532 865432 857569 851091 845398 840602 837578 836935 838218 840506 843682 848720 856580 867078 879082 891797
62518 891797 905612 921582 940211 961075 983867 1009471 1039459 1074351 1112820 1153016 1194331
62507 1194331 1237347 1282271 1328210 1374070 1419286 1463146 1504040 1540240 1571244 1597588 1619330
62496 1619330 1635443 1644903 1647734 1644629 1636039 1622134 1603381 1580621 1554737 1526753 1498129 1470289
62484 1470289 1443520 1416817 1389285 1361547 1335338 1311765 1290412 1270209 1250760 1232432 1215475
62473 1215475 1199565 1184313 1169929 1157169 1146618 1137942 1129862 1121159 1112028 1104264 1099727 1098699 1100034
62460 1100034 1102645 1106248 1110754 1115811 1121221 1127207 1133961 1141529 1150333 1161021 1173297 1185638 1196823
62447 1196823 1207031 1216677 1224967 1230842 1234832 1238472 1241744 1242383 1238101 1228492 1214437 1196824 1176767
62434 1176767 1156297 1137628 1121606 1107301 1093224 1078869 1065209 1053671 1044479 1036265 1027814 1019908
62422 1019908 1014528 1012187 1011118 1009433 1007123 1005351 1004772 1005518 1008109 1013102 1019936 1027213 1034371 1042387
62408 1042387 1052552 1064933 1078233 1090857 1101990 1111832 1120905 1129271 1136579 1142798 1148391 1153575 1157832
62395 1157832 1160457 1161116 1159575 1155532 1149476 1143378 1139529 1138495 1138662 1137957 1135742 1133126 1131894 1133150 1136694
62380 1136694 1141723 1148349 1158154 1172737 1191852 1213637 1236806 1262047 1291066 1324807 1363041 1405258
62368 1405258 1451331 1501376 1555497 1613945 1677064 1744585 1815056 1886486 1957766 2029002 2100087
62357 2100087 2169374 2234270 2292760 2343589 2385346 2416642 2437537 2449707 2454531 2451852 2441257 2423751
62345 2423751 2401200 2374672 2344338 2310591 2274235 2235825 2195884 2155698 2116815 2079602 2043160
62334 2043160 2006770 1970535 1934471 1898039 1861092 1824459 1789004 1754683 1721111 1688516 1657538
62323 1657538 1628412 1600856 1574567 1549443 1525624 1503686 1484424 1467950 1453238 1439108 1425425
62312 1425425 1412726 1400796 1388400 1374744 1360618 1347551 1336098 1325472 1314738 1303730 1292634
62301 1292634 1281306 1269633 1258216 1247943 1238819 1229978 1221071 1212981 1206713 1202249 1199132 1197677 1198677
62288 1198677 1202112 1207044 1212841 1219687 1227674 1236200 1244769 1253856 1264437 1276904 1290885 1306050 1322735
62275 1322735 1341688 1363324 1387347 1413224 1441061 1471789 1506318 1544620 1585822 1628970 1673530
62264 1673530 1719539 1767727 1819251 1874750 1933823 1995813 2060668 2128185 2196597 2262824 2324259
62253 2324259 2379620 2428068 2468510 2500085 2522523 2535698 2539575 2534898 2522988 2504349 2478281 2444620
62241 2444620 2405226 2363093 2320501 2278571 2237823 2198159 2158765 2119116 2080037 2043153 2009520
62230 2009520 1979433 1953101 1930499 1910628 1891945 1873636 1855813 1838538 1821573 1805196 1790322
62219 1790322 1777363 1765493 1753354 1740106 1725774 1711224 1697962 1687261 1679138 1672728 1667842 1665411
62207 1665411 1666062 1669019 1673165 1678621 1686520 1697531 1711255 1726910 1743984 1762406 1782823 1806700
62195 1806700 1835472 1869271 1906842 1946760 1988331 2031216 2074713 2117838 2159991 2201281 2242121
62184 2242121 2282440 2321103 2356197 2386267 2411358 2432674 2451281 2467649 2482591 2498028 2516157
62173 2516157 2537947 2562910 2590318 2620185 2652997 2688983 2727877 2768983 2810942 2851489 2887984
62162 2887984 2918650 2943409 2963490 2980174 2993858 3004112 3010445 3012884 3011909 3007995 3001463 2992828 2983174
62149 2983174 2973882 2965743 2958340 2950569 2942000 2933566 2926626 2921355 2916497 2910921 2905136 2900874 2899274 2899788
62135 2899788 2900828 2901195 2900906 2901059 2903038 2907570 2914343 2922618 2932273 2944039 2958642 2975976 2995315 3016215
62121 3016215 3039019 3064543 3093346 3125228 3159427 3195413 3233367 3273612 3315674 3358359 3400832
62110 3400832 3443156 3485751 3528957 3573509 3620658 3671177 3724640 3780299 3838261 3898921 3961582
62099 3961582 4024751 4088028 4152864 4221142 4293648 4370150 4450153 4533016 4617884 4704144 4791668
62088 4791668 4880191 4968894 5057238 5146033 5237050 5331462 5428871 5527607 5625559 5720831 5812311
62077 5812311 5899996 5984699 6067380 6148694 6228912 6307889 6385202 6460755 6535292 6609991 6685416
62066 6685416 6761082 6836067 6909637 6981039 7049089 7112530 7170913 7224794 7274828 7320699 7361057
62055 7361057 7394611 7421390 7443011 7461544 7477861 7490910 7498750 7500479 7497230 7491355 7484725 7477807
62043 7477807 7469995 7460354 7448108 7432997 7415641 7397391 7379463 7362146 7344960 7327435 7309430 7290825
62031 7290825 7271424 7251471 7231967 7214062 7198003 7182844 7167287 7150795 7133990 7118198 7104622
62020 7104622 7093649 7084594 7076210 7067892 7060493 7055608 7053891 7054534 7056694 7060836 7067979 7078094 7090386
62007 7090386 7105022 7123204 7144956 7167995 7189795 7210035 7229933 7249609 7267235 7280507 7287765
61996 7287765 7287674 7279051 7261527 7235550 7201342 7158632 7107934 7051384 6991504 6929448 6865088 6798560
61984 6798560 6730999 6663738 6597325 6531697 6467117 6404584 6345024 6288030 6231687 6174002 6114634
61973 6114634 6055037 5997045 5941526 5888244 5836436 5785321 5734498 5684295 5635698 5589699 5546597
61962 5546597 5505881 5466694 5428485 5391356 5355764 5321945 5289831 5259647 5232132 5207926 5187104
61951 5187104 5169641 5155843 5145891 5139559 5137060 5139346 5146389 5155687 5164148 5171655 5181316 5195802 5214766
61938 5214766 5236417 5260092 5286216 5314922 5346147 5380384 5418095 5458790 5501947 5548513 5600235
61927 5600235 5657631 5719940 5787373 5862397 5948336 6047475 6161032 6290380 6437721 6605778
61917 6605778 6797246 7014477 7259523 7534562 7842376 8186321 8569803 8995800 9466863
61908 9466863 9985302 10553019 11170883 11838197 12552994 13312602 14112704 14944227 15790582
61899 15790582 16628250 17429929 18166786 18809025 19327787 19699713 19910846 19956800 19840856
61890 19840856 19573273 19171563 18659328 18063495 17411709 16730164 16041193 15361600 14703137
61881 14703137 14074007 13479100 12919357 12392461 11894874 11423062 10973464 10542752 10128680
61872 10128680 9730140 9346305 8976302 8619577 8275643 7943423 7621837 7311367 7014240
61863 7014240 6732777 6468198 6221166 5992455 5782404 5590340 5415225 5256722 5115358
61854 5115358 4991781 4885841 4795899 4718993 4652187 4593838 4543102 4498515 4458065 4420753 4386936
61843 4386936 4356607 4328343 4300730 4274180 4250510 4231109 4216134 4205135 4197784 4194054 4193994 4197139
61831 4197139 4202042 4207052 4211887 4217810 4225530 4233456 4238749 4239821 4237114 4231680 4223882 4213583 4200987
61818 4200987 4187059 4173355 4161451 4152344 4146457 4144360 4147137 4155788 4170685 4192038 4220455 4256367
61806 4256367 4299276 4348514 4404834 4470373 4546671 4633307 4728955 4833441 4948309 5075639 5216896
61795 5216896 5373082 5545625 5736762 5948954 6184096 6443596 6729480 7045480 7396925
61786 7396925 7789327 8226888 8712415 9248918 9841357 10496655 11221920 12022860 12903984
61777 12903984 13869610 14923826 16069344 17306680 18633812 20045035 21528668 23064895
61769 23064895 24624397 26167542 27644973 29001492 30182685 31140772 31837580 32246526
61761 32246526 32355506 32169083 31707565 31003994 30101306 29048948 27897214 26691400 25469798
61752 25469798 24264967 23103244 22001132 20963539 19987700 19069193 18204045 17386900 16610156
61743 16610156 15866156 15149478 14456819 13785884 13135211 12504296 11892842 11300108 10725724
61734 10725724 10170760 9637099 9125885 8637609 8173735 7737009 7329338 6950054 6597057
61725 6597057 6269047 5965634 5685591 5426458 5186338 4965168 4763347 4579527 4410494
61716 4410494 4253273 4106915 3972167 3849596 3738159 3635546 3539866 3450759 3368662 3293181
61706 3293181 3222758 3155992 3092662 3033160 2977463 2925113 2875808 2829373 2785342 2743134 2702579
61695 2702579 2663836 2626847 2591335 2557220 2524554 2493068 2462407 2432993 2406035 2382344 2361437
61684 2361437 2342121 2323613 2305760 2288516 2271762 2255521 2239907 2224860 2210304 2196549 2184042
61673 2184042 2172552 2161104 2149093 2137135 2126348 2117024 2108491 2100214 2092309 2084802 2076986 2068005 2057763
61660 2057763 2046920 2036332 2026829 2019073 2012958 2007400 2001575 1996306 1993364 1993127 1993766 1993219 1991376 1989698
61646 1989698 1989207 1989679 1990673 1992480 1995674 2000166 2005120 2009804 2014305 2019283 2025162 2031845 2039479 2049104 2061756
61631 2061756 2076821 2092024 2105607 2118040 2130965 2144878 2158597 2170676 2180302 2186697 2188801 2186241
61619 2186241 2180014 2171538 2161408 2149737 2137191 2124660 2111943 2097959 2082743 2068258 2056269 2045985
61607 2045985 2034936 2022001 2008317 1995049 1981712 1967602 1953728 1941844 1931952 1922340 1912189 1902732
61595 1902732 1895225 1888959 1882268 1874872 1868254 1863892 1861960 1861684 1862386 1864067 1867312 1872728 1880371 1889862
61581 1889862 1901131 1914645 1930685 1948921 1969116 1991756 2017367 2045598 2075734 2107861 2142671
61570 2142671 2180184 2219499 2259906 2301439 2344165 2387694 2431761 2476624 2522284 2567817 2612075
61559 2612075 2654847 2696856 2738688 2780035 2819921 2857571 2893215 2928101 2963254 2998003 3030118
61548 3030118 3057833 3081438 3102526 3122056 3139664 3154489 3165832 3172895 3174706 3170841 3162106 3150284
61536 3150284 3137275 3124379 3112090 3100463 3089818 3080957 3074430 3069868 3066690 3065446 3067689 3074302 3084752
61523 3084752 3098454 3116099 3138970 3167625 3202229 3243723 3293489 3352047 3419310 3496252 3585078
61512 3585078 3687395 3803421 3933557 4079453 4242410 4421792 4616519 4827698 5058182
61503 5058182 5309433 5579954 5866906 6167785 6479720 6797973 7116018 7426788 7723171
61494 7723171 7997657 8242440 8450440 8616336 8736748 8809831 8835355 8815726 8756704 8666000
61484 8666000 8550442 8414942 8264624 8106795 7949218 7796550 7649812 7509365 7376983
61475 7376983 7254683 7143088 7041879 6950851 6869658 6797487 6734008 6680005 6636035 6600967 6572844
61464 6572844 6550911 6535956 6528920 6529913 6538309 6553067 6573129 6598054 6627837 6661616 6697359 6733941
61452 6733941 6772893 6816722 6865710 6917662 6970841 7025773 7083957 7146178 7212657 7283627 7358736
61441 7358736 7436469 7514949 7593054 7670345 7746295 7819940 7889809 7953816 8009707 8056082 8092723
61430 8092723 8119629 8136196 8141729 8136361 8120958 8096441 8063723 8024136 7979443 7931461 7881915 7832455
61418 7832455 7784432 7738708 7696013 7657451 7624334 7597329 7575799 7558023 7542230 7527747 7515314
61407 7515314 7506091 7500185 7496126 7491770 7485611 7477355 7467497 7456430 7443934 7429819 7415349 7403660 7398025
61394 7398025 7399696 7408148 7423687 7449115 7488422 7544510 7618886 7713123 7829582 7970457 8136599
61383 8136599 8327523 8542258 8779962 9039854 9320729 9620546 9936347 10264220 10598814
61374 10598814 10932562 11255786 11558429 11832308 12071779 12272362 12429244 12537738 12595310
61365 12595310 12602781 12563344 12480785 12358911 12202141 12015616 11804443 11573356 11327156 11070624
61355 11070624 10807363 10539239 10267627 9994925 9724317 9458514 9199407 8948495 8706624
61346 8706624 8473303 8247378 8028788 7819213 7620868 7435136 7262419 7102614 6955507
61337 6955507 6821196 6700209 6592823 6498461 6416449 6347103 6291048 6247495 6214464 6191000 6177772
61326 6177772 6174811 6179984 6190814 6206760 6228350 6254734 6283582 6313114 6343005 6373451 6404690 6437377
61314 6437377 6472052 6507715 6541966 6573127 6601564 6628517 6654356 6678364 6699446 6716311 6727432
61303 6727432 6731642 6728727 6718996 6702362 6678229 6646180 6606384 6559305 6505425 6445440 6380608 6312663
61291 6312663 6243149 6172731 6101194 6028383 5955244 5883900 5816631 5754825 5698735 5647994 5602214
61280 5602214 5561239 5524989 5493106 5464741 5438642 5413514 5388528 5363831 5340464 5319212 5299170
61269 5299170 5277935 5253846 5227913 5203004 5181184 5162475 5146202 5132748 5123578 5120067 5122877 5132115
61257 5132115 5147715 5170027 5200578 5241991 5296417 5364123 5444253 5536878 5643243 5763493 5894822
61246 5894822 6032445 6171780 6308884 6439349 6558107 6660526 6742727 6800435 6828662 6823634
61236 6823634 6784931 6715200 6618107 6497164 6356290 6200614 6036290 5869387 5704462 5543619
61226 5543619 5387204 5235870 5091711 4956835 4831411 4714101 4604081 4501298 4404722 4311998
61216 4311998 4221721 4134939 4053322 3976552 3902706 3830911 3762483 3699460 3642856 3592551 3548258
61205 3548258 3510178 3478776 3453959 3434603 3419343 3408008 3401571 3400128 3401402 3401965 3399673 3394392 3386927
61192 3386927 3378198 3369196 3360518 3351531 3340603 3326410 3308649 3287760 3264640 3240458 3215760 3189553
61180 3189553 3160161 3127241 3092128 3055949 3018457 2979295 2939417 2900191 2861590 2822372 2781936
61169 2781936 2741053 2700539 2660008 2618442 2575749 2533220 2492313 2453115 2414355 2375063 2335822
61158 2335822 2297929 2261570 2225644 2189470 2153754 2119328 2085722 2051879 2017864 1984859 1953405
61147 1953405 1922488 1890734 1858078 1825984 1796202 1769401 1744816 1721272 1698765 1678950 1663728
61136 1663728 1653359 1646313 1640911 1636594 1633628 1632260 1632636 1635069 1639773 1646443 1654570 1664044 1675009 1687171
61122 1687171 1699887 1713151 1728014 1745585 1765800 1787459 1809198 1830049 1849373 1867050 1883842
61111 1883842 1900832 1917998 1933785 1946656 1956859 1966038 1975137 1983231 1988571 1990351 1989189 1986209 1982008
61098 1982008 1976549 1969796 1962234 1954527 1946566 1937202 1925293 1910992 1895699 1880821 1866882 1853685
61086 1853685 1840774 1827649 1814045 1800282 1787028 1774563 1762611 1750936 1739658 1728855 1718542
61075 1718542 1709406 1702881 1699686 1698596 1697435 1695352 1693531 1693660 1696183 1700157 1704285 1707818 1710748 1713545
61061 1713545 1716769 1720759 1725570 1731029 1736827 1742731 1748784 1755212 1762123 1769549 1777737 1786984 1797067 1807327
61047 1807327 1817509 1828064 1839387 1851450 1864631 1880148 1898740 1919386 1940316 1961091 1982644
61036 1982644 2005420 2028641 2051755 2075552 2101201 2128774 2157298 2185877 2214385 2243285 2272973
61025 2272973 2302996 2331960 2358739 2383893 2409324 2436420 2465167 2495160 2526599 2559900 2595153
61014 2595153 2632598 2673014 2717021 2764494 2815204 2869551 2928147 2991248 3059300 3133562 3215382
61003 3215382 3305049 3402023 3506198 3618459 3740164 3872539 4016549 4173181 4344173 4532608
60993 4532608 4742279 4976401 5237617 5529512 5857394 6227508 6646783 7123830 7668761
60984 7668761 8291097 8999031 9801447 10709278 11734772 12893098 14207877 15713656 17450757
60975 17450757 19458450 21768646 24386233 27250577 30212270 33072348 35672988 37957827
60967 37957827 39940186 41623657 42978323 44000074 44763222 45377423 45885203 46220972 46280922
60958 46280922 46017824 45451576 44599851 43430164 41895553 40005703 37849752 35555750
60950 35555750 33240121 30989379 28865208 26908377 25138856 23560345 22165533 20934482
60942 20934482 19832185 18816388 17852203 16919621 16009850 15119165 14246743 13394148 12563775
60933 12563775 11757899 10979119 10230251 9513608 8831449 8186735 7581696 7015789 6486789
60924 6486789 5993896 5538151 5119963 4738314 4392513 4082450 3806332 3560052 3339758
60915 3339758 3143491 2969450 2814241 2674109 2546853 2431581 2327583 2234319 2151474 2078007
60905 2078007 2011876 1951513 1896808 1847936 1804018 1763693 1726315 1691898 1660602 1632911 1609525
60894 1609525 1590334 1574154 1560119 1548637 1540363 1535011 1531729 1529838 1528505 1526601 1523762 1520810 1518306
60881 1518306 1515450 1511245 1505954 1500423 1494728 1488535 1482088 1475563 1467966 1458063 1446325 1434848 1425291
60868 1425291 1417653 1410884 1403847 1395863 1387215 1379179 1372960 1368680 1365817 1364197 1363913 1364762 1366565 1369640
60854 1369640 1374126 1379317 1384721 1391424 1401212 1414463 1430018 1447074 1466003 1487122 1509814 1533286
60842 1533286 1557303 1581730 1606059 1629728 1652244 1672829 1690798 1706720 1722428 1739165 1756225
60831 1756225 1771993 1785903 1798586 1810277 1819900 1826247 1829730 1832455 1836325 1841217 1845280 1846880 1845835
60818 1845835 1842801 1838185 1832118 1825004 1817416 1809597 1801504 1793168 1784511 1774935 1763597 1750215 1735412
60805 1735412 1720401 1706459 1694364 1683943 1674387 1665293 1657102 1650274 1644543 1639603 1636187 1635666 1638604
60792 1638604 1644182 1651042 1658285 1665741 1673640 1682094 1690853 1699752 1709301 1720211 1732181 1743950 1754939
60779 1754939 1765968 1777673 1789114 1798865 1806817 1813926 1820856 1827992 1836167 1845876 1855999 1864775 1872175
60766 1872175 1880040 1889700 1900590 1911534 1922261 1933154 1944266 1955071 1964703 1972282 1977560 1981336
60754 1981336 1984717 1988138 1991591 1995370 1999545 2003059 2004675 2004778 2004910 2005455 2005234 2003677 2001876 2000855 2000131
60739 2000131 1998822 1996927 1994542 1990887 1985290 1978527 1971982 1965858 1959183 1951391 1943190 1935937 1930550 1926758
60725 1926758 1923044 1917708 1910410 1902356 1894767 1887712 1880644 1873241 1865142 1855620 1844368 1832295 1820893
60712 1820893 1811047 1802769 1795491 1788115 1779410 1769237 1759181 1751350 1746641 1744431 1743476 1742642 1741305 1739632
60698 1739632 1738138 1736492 1733348 1727949 1721285 1714765 1708162 1699963 1689587 1678225 1667222 1656477 1644860
60685 1644860 1631778 1617921 1604508 1592036 1579951 1567757 1556129 1546230 1537764 1528713 1517697 1505926
60673 1505926 1495942 1488897 1484045 1480592 1478795 1479051 1480847 1483045 1484724 1485617 1486345 1488384 1493051 1500030 1507272
60658 1507272 1512826 1516641 1520313 1525303 1531678 1538460 1544892 1551197 1558140 1566010 1574294 1582471 1590819 1600178
60644 1600178 1611075 1623394 1636726 1650545 1664148 1676999 1689396 1702407 1716893 1732739 1749238
60633 1749238 1765951 1782957 1800515 1818767 1837681 1856878 1875489 1892592 1907942 1921996 1935048
60622 1935048 1946572 1955797 1962641 1967635 1971027 1972519 1971884 1969255 1964749 1958593 1951875 1946267 1942309 1938781
60608 1938781 1934711 1931397 1931142 1934198 1938292 1941371 1943600 1946214 1949443 1952265 1953492 1952358 1948547 1942326
60594 1942326 1934478 1925632 1915872 1905317 1894831 1885848 1879594 1876581 1876481 1878331 1881149 1884486 1888210 1891899
60580 1891899 1894986 1897454 1899778 1902100 1904149 1906068 1908467 1911312 1913462 1913766 1912125 1909231 1905835 1902528
60566 1902528 1899537 1896333 1892119 1886967 1881771 1876732 1870824 1863256 1854573 1845729 1837035 1828796 1821984 1817142
60552 1817142 1813440 1810049 1807934 1809001 1813868 1821831 1832855 1848112 1868256 1892343 1919025 1947958
60540 1947958 1979631 2014496 2052839 2095139 2142003 2193648 2249334 2307053 2363859 2416835 2463747
60529 2463747 2502755 2532142 2551097 2560556 2562462 2558098 2547761 2532209 2513767 2495647 2480499 2469866
60517 2469866 2464597 2465183 2471487 2482415 2496352 2512265 2530286 2550897 2573683 2597365 2621046 2644900
60505 2644900 2669727 2696667 2727608 2764982 2810639 2865446 2930331 3006926 3096669 3200302 3319141
60494 3319141 3456005 3613715 3793144 3993833 4216137 4461664 4731948 5028137 5352119
60485 5352119 5706724 6094259 6515318 6968680 7450609 7952835 8461149 8956375 9416935
60476 9416935 9821242 10149339 10384104 10512576 10527741 10430335 10229197 9939504 9580230 9172451
60466 9172451 8737933 8296706 7864399 7451394 7064016 6705950 6378745 6081836 5812580
60457 5812580 5566481 5338071 5122590 4917168 4720388 4531077 4347884 4169687 3995856
60448 3995856 3826286 3661505 3502237 3348381 3198969 3053675 2913763 2780788 2655095
60439 2655095 2536642 2426581 2326522 2236350 2154169 2078550 2009668 1948054 1893294 1844307 1800003
60428 1800003 1759473 1722351 1689158 1660507 1635943 1614379 1595545 1579854 1566830 1555039 1543929
60417 1543929 1534442 1527292 1521812 1517183 1513665 1511834 1511552 1512529 1514928 1518452 1521724 1523756 1525502 1528742
60403 1528742 1533761 1539296 1544604 1550391 1557602 1566330 1576195 1586820 1597485 1607089 1615145 1622366 1629608
60390 1629608 1636639 1642707 1648075 1653940 1660551 1666442 1670228 1672355 1674009 1674868 1673495 1670018 1666824 1665891
60376 1665891 1666708 1667761 1668938 1671161 1674419 1677743 1680811 1684164 1687735 1690498 1691942 1692955 1694741 1697459
60362 1697459 1700340 1702842 1705501 1709696 1716316 1724540 1732453 1739285 1746312 1754978 1764985 1775252 1785983
60349 1785983 1798398 1812881 1828721 1845418 1862830 1880169 1896294 1911102 1925495 1939992 1954587
60338 1954587 1969752 1986105 2003086 2019525 2035661 2053118 2072748 2094009 2116623 2141040 2166994
60327 2166994 2193454 2220556 2249629 2280506 2310681 2338108 2362921 2385124 2402487 2412503 2414993
60316 2414993 2411117 2401193 2385488 2366109 2345882 2325747 2305075 2284075 2264027 2245330 2227330 2210317
60304 2210317 2196056 2185731 2178533 2172803 2167618 2162861 2158533 2154641 2151383 2149057 2147775 2147274 2147032 2146829
60290 2146829 2147210 2148843 2151358 2153718 2155910 2159083 2163380 2167035 2168840 2170362 2174066 2179930 2185675 2189991
60276 2189991 2193755 2198071 2203014 2208815 2216717 2227765 2241720 2257822 2275702 2295014 2315195 2336511
60264 2336511 2360546 2388576 2419847 2452564 2486556 2523959 2567041 2616215 2670750 2730609 2796498
60253 2796498 2868371 2945305 3027319 3116259 3213910 3320161 3434227 3556954 3690129 3833605
60243 3833605 3984877 4141828 4304223 4471834 4642851 4815338 4988796 5162801 5335040
60234 5335040 5502097 5661312 5810460 5946587 6067136 6172019 6262782 6339653 6400946 6445589
60224 6445589 6474836 6491175 6496928 6494492 6486600 6475348 6461622 6446355 6432072 6422571 6421231 6429926
60212 6429926 6449299 6479538 6520833 6573417 6637667 6714378 6804657 6908924 7025949 7153363 7289199
60201 7289199 7432225 7580649 7731423 7881253 8027267 8166083 8293453 8406141 8503399 8585207
60191 8585207 8649624 8693486 8715564 8717532 8701696 8669238 8621134 8559627 8488148 8410444 8330158
60180 8330158 8250449 8173628 8101636 8037083 7983124 7942020 7914405 7900234 7899916 7914201 7943346 7986719
60168 7986719 8042972 8110449 8187583 8272774 8363618 8456428 8546880 8631065 8705795 8768612 8818322
60157 8818322 8855212 8879903 8892224 8892033 8880974 8862503 8840172 8816768 8795074 8778416 8770151 8773329
60145 8773329 8791014 8826094 8880436 8954877 9050405 9168873 9312322 9482088 9678715 9902413
60135 9902413 10153562 10433223 10742998 11083786 11454730 11853909 12279675 12730336 13202601
60126 13202601 13691440 14191448 14697074 15201181 15694761 16169120 16617704 17035304 17416348
60117 17416348 17754920 18045883 18285147 18469213 18595405 18662590 18671263 18623092 18520755 18367913
60107 18367913 18168802 17928265 17652892 17351977 17036277 16715261 16395772 16083359 15784174
60098 15784174 15504782 15250353 15023775 14826693 14660718 14527082 14425637 14354977 14313441 14299172
60088 14299172 14309110 14338670 14382715 14436257 14494058 14550451 14600090 14638404 14661006 14663538 14642808
60077 14642808 14597488 14527203 14431709 14311671 14169341 14007390 13827718 13632459 13425343 13210500
60067 13210500 12990164 12764974 12536452 12307758 12081925 11860812 11646325 11441465 11249451
60058 11249451 11072469 10911773 10768507 10644114 10540210 10458036 10397612 10357736 10337487 10337431 10358471
60047 10358471 10399758 10458653 10532357 10618193 10712405 10810223 10907545 11001340 11087998 11162602 11220452
60036 11220452 11258241 11273234 11262643 11225046 11161834 11076337 10971843 10850855 10715576 10568385
60026 10568385 10412279 10251408 10090701 9934269 9784373 9642409 9510641 9392492 9291229
60017 9291229 9208556 9144392 9097988 9069499 9060388 9072081 9104597 9157183 9230012 9324361 9440917
60006 9440917 9578598 9735033 9907513 10093394 10290133 10494808 10702885 10907739 11102459
59997 11102459 11282153 11443635 11583266 11696650 11780655 11834305 11857307 11849216 11810827 11745157
59987 11745157 11656050 11546560 11419367 11278154 11128053 10975287 10826401 10686699 10558976
59978 10558976 10444641 10346091 10266570 10207443 10167413 10145200 10141379 10156602 10189749 10239266 10304767
59967 10304767 10385399 10477597 10576465 10678976 10784261 10891150 10997034 11098986 11194551 11281572
59957 11281572 11358600 11425652 11483579 11532814 11573720 11607955 11638351 11667574 11698032 11733030 11776698
59946 11776698 11832560 11903272 11992120 12103801 12243224 12414147 12619287 12861077 13141796 13463238
59936 13463238 13826451 14231385 14676400 15158133 15671724 16210911 16767727 17332077 17891450
59927 17891450 18431213 18935890 19390688 19781943 20096799 20324164 20457174 20494591 20439502 20297503
59917 20297503 20076790 19788993 19448369 19069805 18667605 18255002 17843300 17441473 17057240
59908 17057240 16697969 16369352 16073628 15810528 15580002 15382996 15219822 15089514 14991298
59899 14991298 14925310 14891106 14886588 14909236 14957415 15029249 15120749 15226136 15339712 15456082 15568355
59888 15568355 15667309 15743161 15787766 15794633 15757693 15671665 15534259 15347422 15115802 14844438
59878 14844438 14538481 14204573 13851236 13487471 13121299 12759457 12407420 12069034 11746484
59869 11746484 11440961 11153156 10883136 10630315 10393742 10171913 9962178 9761106 9565991
59860 9565991 9375614 9189382 9006424 8826053 8648643 8475400 8307469 8145648 7990824
59851 7990824 7844385 7708221 7584156 7473007 7374253 7286867 7209981 7142013 7079681 7019221
59841 7019221 6958546 6896990 6833289 6765761 6694775 6622878 6551530 6479700 6407164 6337273 6274415
59830 6274415 6219914 6172592 6132509 6101732 6081677 6071896 6071857 6082105 6103066 6134108 6174382 6223575
59818 6223575 6281307 6346552 6418083 6494875 6575834 6659668 6745136 6830995 6915746 6997931 7076530
59807 7076530 7150520 7218255 7277864 7328170 7369061 7401727 7429218 7455955 7485571 7519631 7559244
59796 7559244 7607074 7666411 7738976 7825415 7927740 8049519 8193528 8360968 8553362 8773450
59786 8773450 9023294 9302871 9611718 9951153 10323845 10731364 11172285 11641143 12127362
59777 12127362 12614834 13083658 13513610 13886992 14189486 14409881 14540645 14579842 14532530 14409652
59767 14409652 14225334 13995447 13737701 13470357 13208603 12962120 12736545 12536100 12363634
59758 12363634 12219229 12100851 12006381 11933801 11879984 11841422 11816773 11807536 11815841 11842553 11887695
59747 11887695 11951642 12035513 12141145 12270827 12426398 12608806 12819391 13061367 13338951 13655350
59737 13655350 14012653 14413202 14859353 15352012 15891244 16478616 17117111 17808069 18549574
59728 18549574 19338245 20170750 21042493 21946055 22872115 23811084 24753312 25689109 26610092
59719 26610092 27510543 28387323 29239585 30069417 30882182 31685729 32489661 33304967 34142338
59710 34142338 35009303 35909010 36841300 37803014 38786313 39778109 40762354 41722201 42639570
59701 42639570 43494759 44268921 44947274 45519901 45981313 46331236 46575580 46725553 46796305
59692 46796305 46807059 46780861 46741517 46710103 46704880 46743496 46843294 47019224 47282540 47641341 48101123
59681 48101123 48664962 49334438 50110316 50990887 51969360 53033642 54168036 55352782 56560902
59672 56560902 57756601 58897619 59938892 60834968 61542661 62025394 62256978 62222560 61918627
59663 61918627 61354595 60554213 59553117 58393212 57118183 55771545 54394390 53021001
59655 53021001 51674747 50367003 49098308 47859981 46636609 45410386 44165289 42888407
59647 42888407 41569482 40202180 38787105 37332697 35852391 34361402 32875951 31413018
59639 31413018 29987934 28611589 27290592 26029570 24832012 23699117 22629390 21620161
59631 21620161 20669034 19774029 18933356 18145390 17408256 16719352 16075932 15476113 14918531
59622 14918531 14401058 13920804 13475422 13063359 12682621 12330365 12004029 11701722 11420863
59613 11420863 11157401 10907176 10667474 10436648 10213012 9994896 9781332 9571975 9366681
59604 9366681 9165625 8969422 8778577 8593277 8414292 8243753 8084362 7937844 7804448
59595 7804448 7683618 7574711 7477271 7391099 7316040 7251580 7196781 7150766 7113060 7083341 7061042
59584 7061042 7045302 7035188 7030095 7030076 7035427 7045586 7058915 7074255 7092266 7114390 7140980 7171655
59572 7171655 7207276 7250069 7301584 7361902 7431325 7511524 7604387 7710918 7831971 7968923 8122767
59561 8122767 8293501 8481384 8688081 8915725 9165568 9438327 9734978 10056061 10400594
59552 10400594 10766548 11152110 11555845 11976065 12410784 12857847 13314293 13775745 14236955
59543 14236955 14692903 15139476 15573816 15994266 16399103 16785033 17148042 17486379 17801640
59534 17801640 18096177 18370773 18626004 18864761 19091813 19311462 19527062 19742121 19959799
59525 19959799 20180801 20402688 20621216 20831211 21026001 21197015 21334428 21428011 21468011 21446460
59515 21446460 21358120 21200074 20971107 20672513 20309161 19888659 19419423 18910274 18371460
59506 18371460 17814472 17250131 16687124 16132228 15591026 15068175 14567584 14092380 13644225
59497 13644225 13222862 12827075 12456148 12109940 11788031 11489807 11215258 10964622 10737178
59488 10737178 10531475 10347035 10185005 10046933 9933899 9847180 9788647 9759640 9760021 9789131
59478 9789131 9847356 9936054 10056050 10206771 10386832 10594904 10829692 11089178 11370042 11667735
59468 11667735 11976796 12290810 12602199 12902475 13182950 13435048 13650011 13819040 13934520
59459 13934520 13991527 13988513 13927144 13811636 13647571 13440702 13196812 12922515 12625230 12311947
59449 12311947 11988575 11660860 11334836 11015277 10704180 10401797 10108905 9827155 9557583
59440 9557583 9300018 9054075 8819694 8596426 8383179 8179188 7984741 7800616 7627172
59431 7627172 7464192 7311158 7167523 7033211 6909125 6796694 6696568 6607943 6529380 6460082
59421 6460082 6400229 6350394 6310995 6282292 6264588 6257978 6261696 6273833 6292117 6315251 6343379 6377229
59409 6377229 6417051 6462448 6513007 6569037 6632085 6704932 6790832 6892429 7011172 7147305 7300082
59398 7300082 7468694 7654071 7859687 8089526 8345148 8625925 8932447 9268461 9639019
59389 9639019 10048155 10499315 10996608 11543828 12142495 12791806 13489829 14233384 15016984
59380 15016984 15832935 16672302 17524938 18379138 19222759 20045061 20836985 21590176 22297127
59371 22297127 22952561 23553956 24100648 24593029 25032275 25419681 25755685 26039696 26270468
59362 26270468 26445873 26562573 26617006 26607201 26533489 26397880 26203579 25955157 25658583 25320937
59352 25320937 24950148 24554305 24140120 23711781 23271407 22820073 22357843 21883347 21394355
59343 21394355 20888935 20366030 19825762 19270186 18703385 18130087 17554573 16981492 16416782
59334 16416782 15866440 15334662 14824196 14337986 13879026 13448706 13046574 12671724 12323410
59325 12323410 12000524 11701843 11426995 11176225 10949197 10745056 10563561 10404823 10267729
59316 10267729 10149773 10048848 9964402 9896664 9845501 9809954 9787881 9775922 9770704 9770183 9773087
59305 9773087 9777385 9780566 9781278 9779256 9773571 9762442 9745185 9722999 9697418 9669362 9640332 9613232
59293 9613232 9591134 9576105 9569895 9574665 9592130 9622765 9666863 9725918 9802213 9897304 10011244
59282 10011244 10142841 10290330 10452392 10628903 10820071 11024340 11237602 11454742 11671394
59273 11671394 11883792 12087549 12277274 12447366 12593153 12711622 12801309 12861363 12891060 12890731
59263 12890731 12862977 12812327 12743830 12662447 12573056 12479601 12384014 12286809 12188575 12089925 11990529
59252 11990529 11889798 11788563 11688490 11589702 11490774 11391560 11294349 11201638 11114672 11035349
59242 11035349 10967930 10917382 10887074 10879281 10896732 10942223 11017686 11125238 11268400 11450644 11673183
59231 11673183 11935524 12237578 12579389 12958910 13371593 13812071 14274238 14748805 15222065
59222 15222065 15678121 16101868 16479572 16797849 17043725 17206189 17277685 17254703 17137944 16932243
59212 16932243 16645953 16289910 15876643 15419927 14933913 14431552 13923454 13418347 12924334
59203 12924334 12448756 11996354 11568149 11162734 10778506 10414363 10069089 9741159 9429133
59194 9429133 9131557 8846642 8572826 8309604 8057077 7814843 7582141 7359043 7146599
59185 7146599 6945715 6756642 6579618 6415184 6263698 6125226 5999928 5887913 5788809 5702296
59175 5702296 5628893 5569228 5522633 5487524 5463060 5449289 5445812 5451876 5467817 5494570 5531142 5574484
59163 5574484 5623053 5679038 5745551 5822583 5907197 5997024 6092065 6193118 6299747 6410023 6521563
59152 6521563 6632502 6741711 6848106 6949768 7044147 7129175 7203849 7267762 7320649 7362332
59142 7362332 7392409 7410165 7415776 7411687 7401708 7388594 7373565 7358206 7345141 7336281 7332048 7333368
59130 7333368 7343035 7363884 7396753 7441636 7499905 7573803 7664279 7770941 7894144 8035758 8197587
59119 8197587 8379878 8581682 8802192 9041379 9299478 9576044 9869813 10179748 10505633
59110 10505633 10846589 11199100 11557562 11916752 12272341 12618602 12947109 13248463 13514170
59101 13514170 13736346 13907481 14022273 14079080 14078648 14022240 13911970 13751824 13547011 13303070
59091 13303070 13026646 12725937 12408478 12078695 11738811 11391662 11041418 10692213 10347513
59082 10347513 10010323 9682286 9362644 9049599 8742897 8444092 8154547 7874520 7604078
59073 7604078 7343354 7091671 6847810 6611804 6385547 6171103 5968968 5778076 5596702
59064 5596702 5423269 5257367 5100507 4955082 4821938 4699378 4584893 4477309 4376774
59055 4376774 4283277 4196145 4115003 4040296 3972179 3909128 3848497 3788732 3730514 3675266 3623177
59044 3623177 3573578 3526892 3485020 3449542 3420345 3396208 3376046 3359530 3347321 3340683 3339897 3343113
59032 3343113 3347941 3354323 3364505 3380036 3400332 3424394 3451742 3480567 3507066 3528450 3545432 3560161
59020 3560161 3572915 3582660 3589896 3596838 3605188 3615513 3628349 3643969 3661118 3677967 3694774 3714065
59008 3714065 3737537 3763862 3790066 3814183 3836104 3856554 3875858 3893451 3908161 3918880 3924943
58997 3924943 3926179 3923309 3918287 3913146 3907991 3901203 3892403 3884114 3879361 3878459 3879547 3881680 3885907 3893419
58983 3893419 3904009 3916622 3930523 3945700 3962612 3981625 4002560 4025145 4049917 4077882 4109015
58972 4109015 4142197 4177134 4215065 4256800 4301464 4348323 4398513 4453440 4512478 4573835 4636818
58961 4636818 4701650 4767841 4834522 4901879 4970646 5040688 5111610 5184195 5259594 5337707 5418147
58950 5418147 5502330 5592693 5690112 5793993 5904683 6023904 6152927 6292299 6443306 6607700
58940 6607700 6785800 6976883 7181770 7403093 7642630 7900439 8177307 8476175 8800266
58931 8800266 9151471 9531540 9943244 10389187 10870795 11389841 11950020 12555669 13209330
58922 13209330 13911491 14662334 15462959 16314914 17218624 18171781 19168984 20203205 21267301
58913 21267301 22353106 23448669 24536863 25596687 26605443 27540283 28379379 29102693
58905 29102693 29692045 30131660 30410575 30525289 30479660 30282544 29946346 29487164 28924145
58896 28924145 28277451 27566848 26811463 26028968 25234001 24437880 23649794 22877300 22125494
58887 22125494 21396763 20691850 20010666 19352248 18714918 18096711 17495213 16907553 16331912
58878 16331912 15768900 15220241 14686097 14165036 13656772 13163553 12688409 12233050 11797837
58869 11797837 11382755 10987969 10614127 10262426 9933770 9627884 9343858 9081234 8839554
58860 8839554 8617118 8411530 8221702 8048576 7893883 7758747 7642830 7543734 7457896 7383580
58850 7383580 7322593 7277626 7248421 7232297 7227850 7235919 7257095 7290795 7337290 7398333 7474848 7565776
58838 7565776 7670097 7788411 7921812 8070864 8236612 8421196 8626567 8853855 9104669
58829 9104669 9381619 9686662 10020199 10382713 10776330 11204150 11669213 12174695 12723891
58820 12723891 13319164 13961833 14653523 15396256 16190550 17034604 17925921 18862119 19838900
58811 19838900 20847907 21877178 22912380 23936524 24929404 25868668 26731698 27496868 28144659
58802 28144659 28658765 29026286 29237572 29287805 29179557 28922766 28531640 28022377 27413582
58793 27413582 26726375 25982017 25199281 24393945 23579225 22765622 21961007 21171323 20400556
58784 20400556 19650042 18919255 18207975 17516858 16845907 16193856 15559548 14942669 14342741
58775 14342741 13758813 13190662 12639001 12103972 11584835 11081702 10596292 10130425 9685021
58766 9685021 9260818 8858465 8477439 8116543 7776189 7458534 7164701 6893382 6642699
58757 6642699 6411487 6197998 5999515 5814696 5644575 5489824 5348574 5218363 5098758
58748 5098758 4990347 4892255 4802214 4718366 4639727 4565639 4495831 4430375 4368827 4310211 4254256
58737 4254256 4201356 4150752 4100363 4049244 3998684 3949867 3902086 3854417 3807521 3762274 3717866
58726 3717866 3672699 3626154 3578320 3529158 3479143 3429570 3381051 3332754 3284049 3235579 3187727
58715 3187727 3139637 3091131 3044069 3000270 2959345 2920018 2882309 2846872 2813264 2780446 2748102
58704 2748102 2716265 2684676 2653680 2624522 2597601 2571812 2546783 2524082 2504634 2486627 2467830
58693 2467830 2448597 2430653 2414209 2398254 2382548 2367265 2351596 2334727 2317383 2300622 2283959
58682 2283959 2266520 2249062 2232950 2218074 2203798 2191092 2181538 2174772 2169061 2164001 2160670 2159422
58670 2159422 2159361 2159777 2160460 2160891 2160704 2160658 2161770 2163940 2166656 2170215 2174745 2178946 2181585 2183437 2185902 2188528
58654 2188528 2190007 2191020 2193818 2199250 2206423 2215249 2227142 2242829 2261261 2281256 2302951 2327291
58642 2327291 2355066 2386506 2421036 2457755 2497036 2541055 2591589 2647948 2708374 2772892 2843449
58631 2843449 2921871 3009144 3106125 3213347 3330483 3457525 3596232 3749058 3916983 4099709
58621 4099709 4297645 4512358 4745266 4997002 5267593 5555972 5859440 6174357 6496758
58612 6496758 6821365 7140614 7445505 7726798 7975164 8182076 8342082 8453033 8513137 8519819
58602 8519819 8473477 8380756 8251662 8094273 7914082 7717048 7510386 7300549 7092348 6889557
58592 6889557 6694459 6507240 6327513 6156048 5993710 5839859 5693450 5554529 5422893
58583 5422893 5296645 5174269 5056820 4945821 4840200 4737823 4638799 4544403 4453618 4363676
58573 4363676 4273519 4184121 4096127 4010009 3927881 3851984 3781516 3713775 3648284 3587018 3530857
58562 3530857 3478727 3430150 3385475 3343407 3301319 3258583 3216973 3177407 3138942 3101397 3066153
58551 3066153 3033581 3002227 2971463 2942662 2916735 2892410 2867836 2842293 2815776 2788463 2761104
58540 2761104 2734536 2708603 2682896 2658309 2636260 2616626 2598071 2579899 2561778 2542397 2520899
58529 2520899 2499217 2480486 2465268 2451626 2438467 2426100 2413752 2399591 2383548 2367568 2352784
58518 2352784 2338917 2326490 2316825 2309525 2302610 2295704 2290604 2288206 2287272 2286709 2286834 2288057 2290439 2294600
58504 2294600 2300831 2307513 2313023 2318963 2328539 2341821 2355854 2369601 2385242 2403900 2423607 2442604
58492 2442604 2461377 2480135 2497389 2512704 2528204 2545634 2564000 2581459 2597379 2611363 2622395
58481 2622395 2630225 2635743 2639015 2638859 2635248 2630190 2625419 2621085 2617255 2614547 2612559 2609782 2605837 2601896
58467 2601896 2598411 2594548 2590313 2587057 2585356 2584415 2583807 2583620 2582914 2580637 2578265 2578818 2582847 2587994 2592669
58452 2592669 2597305 2601791 2604992 2607518 2611956 2619637 2629924 2643054 2660392 2681267 2702871 2724187
58440 2724187 2746871 2771558 2796633 2821421 2847068 2873337 2898085 2920983 2944059 2967373 2987957
58429 2987957 3004636 3020087 3036252 3051263 3063071 3072784 3082234 3091227 3099401 3108105 3118424 3129785
58417 3129785 3142089 3156600 3173278 3190039 3206009 3222661 3240593 3258486 3276530 3297245 3321214
58406 3321214 3345453 3367774 3389196 3410359 3429300 3444928 3459037 3472616 3483733 3491502 3498582 3507232
58394 3507232 3516218 3524104 3532212 3541777 3551620 3561404 3573760 3590228 3608227 3625052 3641919 3661023
58382 3661023 3681442 3700997 3719723 3738802 3758457 3779167 3802359 3827764 3852915 3877183 3902977
58371 3902977 3931037 3958427 3983654 4009698 4039065 4069805 4099661 4130175 4163071 4196312 4227726
58360 4227726 4259145 4293063 4328344 4363116 4398778 4437100 4476231 4513670 4550450 4588475 4626365
58349 4626365 4661879 4695922 4730302 4764005 4795434 4825759 4856368 4885723 4912653 4940085 4971377
58338 4971377 5005396 5039314 5073853 5111617 5152436 5194625 5238958 5287258 5338485 5389807 5440252
58327 5440252 5490446 5540681 5591901 5646147 5703168 5759267 5812464 5865963 5923580 5984920 6048104
58316 6048104 6113655 6181888 6249867 6314988 6378690 6442965 6506252 6566399 6624461 6681935 6737727
58305 6737727 6791622 6847082 6906627 6968022 7028886 7091112 7156559 7222581 7286549 7350999 7419600
58294 7419600 7491681 7565135 7640648 7718378 7794842 7868198 7942529 8021907 8104436 8187143 8271923
58283 8271923 8361098 8451984 8542071 8635060 8735412 8841305 8949262 9061234 9180263 9303412
58273 9303412 9425969 9548808 9674945 9802852 9929885 10058096 10189811 10321864 10451364
58264 10451364 10582807 10722227 10868603 11018132 11172151 11333202 11498174 11663542 11832842
58255 11832842 12010841 12194915 12380345 12569324 12766352 12969688 13176029 13388610 13611870
58246 13611870 13843163 14078605 14321655 14576817 14840613 15108179 15382883 15669951 15967418
58237 15967418 16273480 16595493 16940608 17304840 17682899 18081089 18508185 18961706 19436505
58228 19436505 19938896 20478301 21053160 21659827 22307030 23006102 23755600 24551900 25406183
58219 25406183 26333840 27336521 28413169 29579660 30858585 32259614 33790641 35478697
58211 35478697 37359419 39457601 41801644 44446503 47459433 50896934 54823193 59340281
58203 59340281 64576086 70659307 77732188 85961469 95495391 106425932 118830354 132833381
58195 132833381 148606424 166363980 186435232 209315612 235582491 265746774 300080743
58188 300080743 338210415 378464287 417672989 452138632 479243807 498136956 508824472
58181 508824472 510922805 503685502 487188114 463110474 434228060 403309294 372473776
58174 372473776 343168686 316313335 292402064 271636124 254031559 239386349 227215651
58167 227215651 216850555 207658212 199183314 191155218 183450935 176050232 168965691 162193903
58159 162193903 155737504 149645368 144004394 138907847 134422535 130505325 126900114 123187737
58151 123187737 119034518 114383200 109345112 103943918 98061064 91634982 84824910 77946121
58143 77946121 71301357 65097033 59450969 54410053 49967207 46095952 42770100 39943805
58135 39943805 37532944 35435026 33560319 31839898 30223976 28687691 27227544 25840402
58127 25840402 24511689 23226161 21977347 20761494 19574513 18419949 17308521 16245157
58119 16245157 15226941 14256472 13345129 12499718 11717694 10998992 10350323 9773111 9257968
58110 9257968 8795462 8382305 8013401 7678368 7370396 7089382 6832817 6592970 6366545
58101 6366545 6157717 5967805 5790756 5622537 5466424 5325022 5194810 5072189 4957655
58092 4957655 4850872 4748667 4650618 4559745 4475452 4392852 4311004 4234439 4164494 4096717 4029092
58081 4029092 3965186 3906622 3849870 3793278 3740190 3692260 3646447 3601345 3559878 3523036 3487351
58070 3487351 3451248 3417655 3388011 3359938 3333118 3310910 3293508 3276048 3256418 3238724 3226005
58059 3226005 3215535 3204412 3193875 3184658 3173630 3158826 3143187 3129999 3118804 3108503 3100194 3094223
58047 3094223 3088616 3082752 3078656 3076764 3074656 3071777 3070965 3073509 3077110 3080390 3084867 3090864 3096299 3101282
58033 3101282 3109005 3120093 3130916 3139570 3148560 3159357 3169297 3176588 3183708 3192957 3202740 3210945 3218142
58020 3218142 3225188 3231632 3238618 3249074 3262605 3274375 3281527 3286735 3293008 3299210 3303473 3307023 3311641
58007 3311641 3316913 3322773 3331368 3343472 3356125 3366424 3374839 3382678 3389460 3395010 3400878 3407279 3411655
57994 3411655 3412582 3412240 3412989 3414478 3416189 3419688 3426039 3433676 3440947 3448229 3455959 3463353 3470614 3479544 3490533
57979 3490533 3501891 3513272 3526370 3541087 3554830 3566945 3579722 3593315 3604173 3610873 3617182 3626492
57967 3626492 3637111 3646121 3654217 3663388 3673009 3681642 3690165 3700033 3710717 3721373 3732604 3744345 3754689
57954 3754689 3763062 3771763 3782123 3792173 3800483 3809096 3820087 3832278 3844204 3857155 3872358 3888083
57942 3888083 3902706 3917784 3934787 3951517 3965246 3977068 3989632 4002723 4014513 4025366 4036937
57931 4036937 4048958 4060022 4070209 4080195 4089217 4096627 4104088 4113712 4125333 4137706 4150727 4164474
57919 4164474 4178057 4191638 4207452 4226420 4245981 4263795 4281390 4301487 4324081 4348054 4374299
57908 4374299 4403833 4434703 4464193 4492565 4521400 4549869 4576090 4600844 4626412 4652718 4677932
57897 4677932 4701997 4726271 4750235 4771869 4791060 4809910 4829692 4849791 4869350 4887886 4904753
57886 4904753 4919901 4934642 4950022 4965447 4980428 4996136 5013195 5029664 5043790 5057279 5073164
57875 5073164 5091630 5110883 5131042 5154082 5180437 5208525 5237377 5267138 5297218 5326451 5355041
57864 5355041 5384331 5414774 5445834 5477385 5509420 5541012 5571347 5601062 5630764 5659215 5685107
57853 5685107 5709772 5735794 5763418 5790401 5814992 5837194 5857744 5877724 5898495 5920105 5940490
57842 5940490 5958139 5974766 5993436 6014948 6038126 6062670 6089123 6116535 6142703 6166759 6189602
57831 6189602 6211960 6233872 6255738 6278039 6300134 6320906 6340352 6359202 6377579 6395381 6413302
57820 6413302 6431995 6451096 6470478 6491481 6515221 6540706 6566237 6591630 6617394 6643065 6668294
57809 6668294 6694413 6722820 6752910 6783564 6815439 6849602 6885091 6920234 6955295 6991530 7028812
57798 7028812 7066665 7106433 7149589 7194949 7240328 7285943 7333121 7380554 7425232 7466750 7507419
57787 7507419 7548181 7587543 7624646 7660509 7696050 7731647 7768656 7808417 7849506 7888778 7925570
57776 7925570 7962158 7999749 8036872 8072339 8106996 8141764 8176573 8212157 8250351 8291284 8332417
57765 8332417 8371692 8410078 8450073 8493325 8540441 8591371 8644915 8699163 8753249 8807632 8862457
57754 8862457 8917128 8971798 9027597 9084855 9142515 9199729 9256696 9313586 9370067 9426293 9483085
57743 9483085 9540867 9599542 9659411 9720789 9782798 9844063 9904589 9965403 10026491 10086992 10147556
57732 10147556 10210492 10277025 10345987 10415735 10485921 10556982 10629307 10703358 10779307 10856269 10933084
57721 10933084 11010132 11089223 11171575 11256908 11344324 11432925 11521866 11611242 11702751 11798160 11897359
57710 11897359 11999190 12103686 12212031 12324949 12442849 12567030 12698970 12838879 12986651
57701 12986651 13143464 13310464 13486881 13671876 13867464 14076814 14300203 14535729 14783822
57692 14783822 15047922 15330506 15631460 15950539 16287973 16641782 17007489 17381424 17761440
57683 17761440 18143171 18518312 18877823 19214415 19520967 19789769 20015804 20199395 20344579
57674 20344579 20456964 20544337 20616832 20683862 20750873 20818646 20883252 20936080 20967020 20969957 20943959
57663 20943959 20888633 20801099 20679440 20527246 20353140 20167606 19981536 19805197 19645525 19504886
57653 19504886 19383718 19283120 19203657 19143489 19099722 19070532 19054544 19049545 19053740 19067346 19091430
57642 19091430 19126132 19171498 19229055 19301002 19388469 19491749 19611380 19747892 19901461 20072984
57632 20072984 20264442 20476947 20709324 20959745 21227794 21513640 21815850 22130950 22454089
57623 22454089 22778932 23097597 23401852 23684099 23937108 24154248 24331043 24465718 24557769
57614 24557769 24607339 24616681 24590864 24536228 24459309 24367587 24269002 24169164 24070328 23974104 23883565
57603 23883565 23801505 23728330 23663114 23605249 23553711 23506532 23462826 23423965 23391024 23362556 23336727
57592 23336727 23314237 23296922 23284557 23275307 23268596 23265376 23266109 23270626 23279849 23295761 23319591 23351226
57580 23351226 23390135 23435601 23486435 23541815 23602206 23668567 23741088 23819619 23904434 23995446 24091438
57569 24091438 24191315 24295316 24403859 24516278 24632224 24753259 24881106 25014826 25151549
57560 25151549 25289759 25430321 25574570 25722994 25875725 26032844 26194013 26358769 26527207
57551 26527207 26699710 26876595 27058785 27248036 27445343 27649893 27860833 28079272 28307122
57542 28307122 28544756 28791562 29048351 29317361 29599907 29895558 30203577 30523628 30854839
57533 30854839 31195443 31543615 31897619 32254754 32610848 32960842 33299338 33620871 33920460
57524 33920460 34193861 34436852 34644865 34814353 34944747 35038946 35102397 35141800 35163474 35171997
57514 35171997 35170773 35164103 35157446 35155046 35158689 35169521 35189317 35218528 35254840 35295844 35342214 35396359
57502 35396359 35458785 35527906 35602832 35684075 35771600 35864238 35961323 36063413 36171183 36284966
57492 36284966 36405581 36534472 36672856 36821425 36980570 37149985 37328558 37515678 37712118
57483 37712118 37918637 38134420 38358209 38590248 38831773 39083280 39344802 39617116 39900913
57474 39900913 40195208 40498214 40809225 41127938 41452457 41779833 42107861 42433947 42752263
57465 42752263 43054404 43333292 43584738 43805394 43991899 44143144 44261611 44351481 44416660 44461198
57455 44461198 44490137 44508985 44523064 44537469 44556306 44581479 44613261 44652366 44700339 44757895 44824307
57444 44824307 44898773 44980968 45069883 45163585 45260904 45362292 45468427 45578918 45692776 45809103
57434 45809103 45926891 46045235 46164378 46285786 46410740 46539455 46671573 46806730 46944651
57425 46944651 47085719 47231382 47382685 47538178 47694614 47850147 48005768 48163286 48323162
57416 48323162 48484890 48648325 48813763 48981273 49150449 49320335 49489572 49657365 49824401
57407 49824401 49992074 50160972 50331115 50503413 50679340 50858920 51040471 51222789 51406330
57398 51406330 51591654 51777951 51963864 52149028 52334174 52520429 52708630 52898385 53087484
57389 53087484 53273323 53455353 53635171 53813808 53990166 54162782 54332107 54500194 54668843
57380 54668843 54838740 55009703 55180992 55351828 55522165 55692726 55864037 56035957 56208295
57371 56208295 56381150 56554213 56726386 56896526 57064097 57228748 57389726 57546075 57697131
57362 57697131 57842657 57982731 58117455 58246378 58368509 58483580 58593138 58699682 58804748
57353 58804748 58908445 59010623 59111489 59211198 59309840 59408077 59507055 59607583 59710088 59815251
57343 59815251 59923824 60035672 60149654 60264523 60379381 60493564 60606825 60719454 60831402
57334 60831402 60941462 61047967 61149824 61246036 61334795 61414265 61483932 61544259 61595665 61639098
57324 61639098 61676883 61711348 61743003 61771703 61799158 61828372 61860853 61896330 61935218 61979292 62029708
57313 62029708 62086281 62149047 62218673 62294927 62376580 62463310 62555905 62654066 62755665 62858540 62961157
57302 62961157 63061179 63155497 63242435 63321947 63392752 63451288 63494522 63522086 63534686 63532266 63514813
57291 63514813 63483154 63437776 63378606 63307236 63227620 63143182 63054947 62963843 62872908 62785169 62700760
57280 62700760 62618116 62536757 62456744 62376217 62291641 62200237 62100790 61992891 61877261 61756553
57270 61756553 61634279 61513117 61395347 61284309 61183744 61095711 61020244 60956813 60905096 60864548
57260 60864548 60834277 60813087 60798790 60787889 60776870 60763444 60745576 60719848 60682115 60629820 60562760
57249 60562760 60481643 60386881 60279056 60159947 60032530 59899699 59762685 59620779 59472886 59318946
57239 59318946 59158943 58990852 58811210 58618254 58413519 58199852 57978942 57751122 57516282
57230 57516282 57274194 57024990 56769996 56511086 56248713 55981717 55709414 55432416 55150745
57221 55150745 54862920 54568062 54267383 53962234 53651892 53334655 53010017 52678449 52340039
57212 52340039 51994755 51643250 51286263 50924074 50557674 50189438 49821186 49452206 49080140
57203 49080140 48702821 48318187 47923798 47518253 47102377 46677369 46242244 45794473 45332554
57194 45332554 44856575 44366830 43863457 43347265 42819629 42281499 41733100 41174233 40604235
57185 40604235 40022510 39429982 38829478 38224103 37616317 37009418 36408722 35820034 35247828
57176 35247828 34695914 34168776 33670978 33206223 32778126 32390686 32046427 31744843 31483916
57167 31483916 31262212 31078087 30927803 30805995 30707244 30625855 30554849 30486517 30413299 30327019
57157 30327019 30218446 30079142 29902960 29684571 29417726 29096602 28717901 28280251 27782874
57148 27782874 27226874 26616999 25960153 25262688 24530854 23773411 23002373 22231608 21475879
57139 21475879 20750261 20068752 19443403 18884868 18401977 17999444 17677134 17432145 17259279
57130 17259279 17147847 17080203 17035533 16993786 16935301 16840478 16693661 16486253 16214261 15875635
57120 15875635 15473116 15017369 14523734 14007606 13485828 12979642 12511152 12097140 11748807
57111 11748807 11474798 11279652 11160239 11107680 11111960 11161842 11243411 11344332 11459246 11588124
57101 11588124 11732783 11900598 12109316 12382403 12741421 13207384 13803924 14548742 15442577
57092 15442577 16474152 17633530 18911922 20292364 21752361 23272213 24829181 26399245
57084 26399245 28007146 29792848 31995072 34824662 38341151 42449764 46982195 51730826
57076 51730826 56404328 60610146 63946074 66142557 67136295 67034361 66025083 64307581
57068 64307581 62071479 59518657 56892025 54467098 52490012 51096985 50272171 49871171
57060 49871171 49692741 49560080 49375191 49123216 48829971 48506762 48123479 47622669 46951936
57051 46951936 46084068 45013813 43742333 42266663 40582464 38695257 36629335 34428400
57043 34428400 32149674 29855484 27604577 25445370 23413661 21533730 19818812 18270153
57035 18270153 16878247 15627583 14501148 13481919 12553556 11702312 10918166 10193407 9520904
57026 9520904 8894271 8308449 7759033 7241877 6754231 6295284 5864560 5460515 5081708
57017 5081708 4728561 4402719 4105079 3835379 3593168 3377943 3188412 3022732 2879781
57008 2879781 2759537 2661982 2586178 2530861 2495859 2482870 2495062 2536091 2608759 2712525 2839955
56997 2839955 2975341 3099166 3196466 3261172 3291877 3284892 3233965 3137066 3001630 2842399 2675158
56986 2675158 2512305 2361623 2226701 2108380 2006716 1921581 1851223 1791160 1735635 1680354
56976 1680354 1623761 1566284 1509009 1452828 1398175 1345224 1294226 1245568 1199676 1157131 1118647
56965 1118647 1084347 1053192 1023822 996125 971537 951781 937652 928778 923846 921101 919236 917706
56953 917706 915655 910989 901598 887345 869693 849494 826614 802115 779171 760690 746878 736003
56941 736003 726828 719444 714573 713204 716502 724994 737895 754026 773153 795509 819965 843586 863391
56928 863391 878072 887610 891520 888014 875099 852525 822558 788723 753847 719431 686545 656483
56916 656483 630164 607413 587504 570136 555234 541916 528531 514252 500137 488034 478510 470415
56904 470415 462392 454150 445983 437714 428832 419403 410155 401753 394553 388893 384913 382145 380282 380581
56890 380581 385542 396672 413161 433132 455277 478629 501622 522467 540178 554489 565117 571862
56878 571862 575111 575656 574464 573236 574493 579943 589083 600509 614381 632446 655773 683907 716561
56865 716561 754909 800443 853432 913169 978895 1049245 1120844 1188408 1246891 1293600 1328052
56854 1328052 1350045 1358482 1352635 1334354 1308270 1279585 1252081 1228126 1209505 1197505 1192897 1196593
56842 1196593 1209943 1233742 1267471 1310148 1361662 1422829 1494708 1577965 1671341 1769346 1862411
56831 1862411 1941253 2001163 2041209 2060224 2055736 2026996 1977225 1912195 1837867 1759991 1684615
56820 1684615 1617564 1563142 1523118 1496395 1479980 1471426 1470705 1479178 1497102 1523285 1557008 1598615
56808 1598615 1647427 1699923 1750456 1793146 1823104 1837203 1834434 1815015 1779022 1726902 1661583
56797 1661583 1588859 1514864 1443701 1377579 1317908 1265475 1220648 1184395 1158457 1143472 1137474
56786 1137474 1137106 1140240 1146995 1158607 1175614 1196432 1217089 1232875 1240998 1241356 1234438 1219263 1194079
56773 1194079 1158570 1114660 1065531 1014569 964748 917916 874455 834074 796905 763583 734451
56762 734451 709137 686776 666393 647357 629832 614424 600969 587954 573749 558298 543061
56751 543061 529287 516716 504001 490118 475288 460729 447499 435486 423676 411461 399464
56740 399464 388840 380005 372404 365411 358991 353293 347895 341944 335182 328527 323286 319856 317578 315709
56726 315709 313954 312021 309422 306108 302615 299100 294920 289866 285129 282184 281140 281022 281103 280899 279391
56711 279391 275796 271113 267587 266421 266998 268340 269860 270456 268582 264150 259159 255418 252596 249574 246796
56696 246796 245767 246563 247361 246800 245673 245674 247133 248912 250358 252323 255668 259483 261892 262609 263465 265888
56680 265888 269014 271172 272212 272964 273195 271871 269415 267942 268849 271444 274316 276816 278677 279348 278557
56665 278557 276855 275065 273743 273342 273996 274832 274472 272818 271514 272098 274340 276894 278854 280126 280909 281426
56649 281426 281842 282108 282269 282975 284953 287865 290444 291918 292408 291829 289622 286092 282898 281427 281411 281774
56633 281774 282109 282725 283853 285297 286290 285568 282595 279067 277955 280292 283920 286194 286865 287320 288036 288205
56617 288205 287384 286182 285407 285428 286236 287403 288118 287924 287305 287108 287633 288661 289991 291530 293139 294783 296542
56600 296542 298315 299995 301969 304741 307923 310581 312794 315712 319556 322849 324483 325386 326982 328937
56586 328937 329835 329445 328970 329308 330369 332001 334431 337541 340606 343100 345312 347983 351607 356098 360949
56571 360949 365758 370614 375808 381283 386797 392428 398215 403449 407324 410342 413943 418507 422986 426947
56557 426947 431567 437770 444598 450551 455668 461137 467497 474160 480188 484785 487634 489419 491281 493142
56543 493142 493506 491737 489412 488358 488165 486856 483359 478193 472467 467391 464140 462811 461914 460016 457465
56528 457465 455448 453933 451861 448994 446133 443570 440583 436597 431975 427607 424344 422567 421595 419802
56514 419802 416032 410632 404596 398427 392578 388157 385910 385094 384566 384516 385727 387462 387616 385138 381098
56499 381098 377210 374305 372399 371260 370532 369971 369803 370477 372108 374602 378064 382473 387149 391176 394310
56484 394310 397060 400052 403584 407510 411336 414914 419214 425545 433733 442036 449339 456252 463409 470078
56470 470078 475533 480518 485887 490857 494278 496922 500718 506041 511253 514827 516629 517387 518126 519916 522941
56455 522941 526003 528060 529987 533598 539067 544458 547837 548928 548838 549019 550368 552598 554607 555878 556952
56440 556952 558130 558744 558501 558417 559329 560540 561217 561991 563702 565518 566014 565312 564384 562994 560202 556469 553376
56423 553376 551464 549861 547781 545002 541477 537996 536505 537987 540616 541868 541760 541985 542569 541986 540317
56408 540317 539700 541242 543780 546087 548353 551061 554243 558226 563346 568666 572699 575554 578621 582115
56394 582115 584909 586908 589316 592118 593536 592827 591725 592298 594991 599433 605449 612487 619500 626108 632486
56379 632486 637796 640431 640435 640014 641027 643536 647410 653549 662517 673339 684589 695564 705861 715065
56365 715065 723326 730970 737222 740892 742769 745650 751251 758579 765996 773337 781150 789289 797236 804771
56351 804771 811721 818080 824798 833199 843203 853357 862855 872163 881492 890341 898922 908389 919174
56338 919174 930634 942572 955397 968580 980962 992922 1006055 1020248 1033522 1045577 1058907
56327 1058907 1075192 1092933 1110110 1126968 1144484 1162117 1179010 1195639 1212371 1227915 1241043
56316 1241043 1252510 1263389 1272892 1279890 1285532 1292219 1300522 1308869 1315814 1321072 1324896 1327950 1331477
56303 1331477 1336325 1342066 1348051 1354768 1363176 1373188 1383841 1394532 1405253 1416194 1427973 1441693
56291 1441693 1457908 1476006 1495258 1515873 1538346 1562469 1587824 1614778 1644253 1676803 1712352
56280 1712352 1750602 1791519 1835814 1884793 1939202 1998595 2062669 2132720 2210508 2296223 2389186
56269 2389186 2490124 2600866 2722115 2853799 2997645 3156747 3331952 3521032 3722337
56260 3722337 3936985 4166402 4409845 4665684 4933171 5211395 5497771 5788623 6079922
56251 6079922 6366675 6643144 6904545 7147162 7366434 7557061 7715893 7842885 7938545 8002609
56241 8002609 8036127 8042483 8025033 7985731 7927158 7853622 7768753 7673920 7570215 7459913 7344653
56230 7344653 7224289 7098812 6969142 6834755 6693122 6543303 6387648 6228206 6064077
56221 6064077 5894497 5721961 5549567 5377412 5204389 5031757 4862080 4696069 4533276
56212 4533276 4374816 4222816 4078007 3940114 3809798 3688029 3574162 3466424 3363737
56203 3363737 3265879 3172999 3086171 3006964 2935215 2868819 2806865 2750800 2701005 2654785 2609910
56192 2609910 2567922 2531523 2500711 2473918 2450811 2431362 2414094 2398210 2385820 2379191 2377327 2378078
56180 2378078 2381895 2390282 2401956 2414024 2426186 2440559 2457799 2476305 2494858 2513485 2532009 2549981
56168 2549981 2567607 2584802 2600189 2613024 2625033 2638176 2651817 2664397 2676613 2690311 2705327
56157 2705327 2720218 2735408 2752966 2773795 2797294 2823278 2852236 2884403 2920394 2961693 3008740
56146 3008740 3059830 3113889 3172874 3239424 3313793 3395425 3485813 3587329 3700817 3826748 3966751
56135 3966751 4121056 4286046 4457188 4632656 4811210 4988638 5160082 5324568 5483705
56126 5483705 5637090 5782340 5918330 6044729 6159325 6259440 6345377 6419217 6480965 6528925
56116 6528925 6562877 6583624 6590433 6582202 6560278 6526822 6481294 6421796 6349087 6266425 6176643 6082378
56104 6082378 5987533 5894855 5803318 5711361 5621411 5537729 5461358 5390902 5326460 5268476 5214237
56093 5214237 5160357 5107894 5060499 5018349 4978522 4940690 4907573 4879932 4855746 4834467 4817849
56082 4817849 4806329 4798480 4794248 4795066 4800688 4809316 4820718 4836129 4855635 4878678 4906114 4938478
56070 4938478 4973507 5008906 5046009 5087050 5130671 5174349 5219226 5267750 5318337 5367483 5415719
56059 5415719 5466247 5519108 5572103 5626224 5684443 5745893 5806804 5866639 5928148 5992175 6057612
56048 6057612 6125494 6197725 6272733 6347758 6424231 6505315 6589560 6673004 6756225 6843247 6934774
56037 6934774 7028831 7126591 7230841 7339855 7449620 7560820 7676842 7796423 7915659 8035753
56027 8035753 8160949 8290228 8419234 8549124 8684871 8825778 8966730 9108163 9255542
56018 9255542 9409248 9564372 9720441 9881938 10049083 10217633 10388103 10565697 10750937
56009 10750937 10940005 11134181 11338745 11552542 11769384 11989954 12221261 12464021 12712130
56000 12712130 12965238 13229849 13507191 13792500 14087529 14401012 14735078 15083983 15447884
55991 15447884 15834545 16245664 16675295 17123991 17600616 18108201 18642523 19206701 19812004
55982 19812004 20462086 21152521 21888537 22686695 23556446 24497364 25517323 26635283 27863770
55973 27863770 29208628 30689634 32341433 34191763 36261568 38590454 41238949 44263379
55965 44263379 47715922 51675446 56253315 61567517 67741307 74926166 83284164 92937322
55957 92937322 103970416 116490811 130652955 146641192 164705156 185234948 208745007
55950 208745007 235754298 266649533 301420753 339097612 377253611 412403848 441425643
55943 441425643 462804417 476432355 482321404 479888077 468646945 449333264 424075926
55936 424075926 395546402 366071065 337335876 310470990 286157405 264726607 246285212
55929 246285212 230751262 217781990 206776168 197051605 188050776 179413249 170942699
55922 170942699 162561538 154259661 146028044 137829725 129633378 121447628 113309401 105263261
55914 105263261 97365258 89680921 82259768 75127528 68315261 61878132 55873768 50338750
55906 50338750 45295274 40759835 36729274 33171538 30042653 27302303 24906284 22800753
55898 22800753 20937707 19286790 17823897 16519894 15349115 14297455 13352740 12496625
55890 12496625 11713679 10998697 10347580 9750082 9198156 8691876 8230226 7804894 7409548
55881 7409548 7046227 6716001 6411942 6127838 5865575 5627341 5408138 5202298 5010277
55872 5010277 4833125 4667198 4509896 4363868 4230227 4104115 3981927 3866475 3760288
55863 3760288 3660364 3564132 3474156 3392364 3316042 3243884 3179552 3124794 3075348 3027919 2984764
55852 2984764 2946970 2909727 2868857 2825930 2782427 2735066 2681588 2625347 2569619 2513043 2454922
55841 2454922 2399020 2347620 2297642 2247054 2199125 2155649 2112064 2064464 2015768 1969722 1924364
55830 1924364 1876909 1829911 1786908 1746666 1707243 1671099 1640517 1612185 1581991 1551403 1523710
55819 1523710 1497746 1470816 1444321 1420969 1399540 1377767 1357502 1341805 1329518 1317722 1307102
55808 1307102 1300009 1295435 1290636 1285698 1282137 1278878 1273708 1266878 1259545 1250717 1239362 1227297 1216314
55795 1216314 1204545 1189342 1171653 1154102 1136971 1119487 1102743 1087724 1072601 1055576 1038428
55784 1038428 1023866 1011394 998986 986658 975097 963090 949766 937196 927197 917482 904327 887133
55772 887133 867373 845388 821695 799139 779949 762479 744380 726975 712812 700865 688113
55761 688113 674367 661636 650004 637958 625838 615314 606122 596439 585800 574784 562803 549092
55749 549092 535046 522896 512837 503782 495641 488431 480594 470934 460943 452644 445482 437952 430738
55736 430738 425383 421161 416244 410901 406835 404317 402565 401897 402947 404700 405645 405755 405129 402238 396137
55721 396137 389076 384148 381396 378666 375140 371488 367774 363895 361056 360282 360398 359740 358844 359310 361392
55706 361392 364966 371274 381062 392364 402771 412563 423067 433390 441636 448057 453969 458629 460220
55693 460220 459141 457571 456470 455458 454668 454132 452447 448802 445363 444862 446676 448029 448202 448748 450380
55678 450380 452520 455364 459585 464425 468492 471864 475082 477004 476295 474280 473650 474915 476622 478268 480410
55663 480410 482655 484235 485944 488817 491569 491996 490363 488859 488371 488257 488458 489019 488339 484784 479448 474478
55647 474478 469374 461985 452461 442910 433558 422679 410333 398852 389296 380285 370643 360495 349696
55634 349696 338000 326928 318506 311836 303786 293652 284374 278332 274331 269588 262699 254053 245062
55621 245062 237326 230943 223799 214288 204267 197127 193391 190730 187932 185906 184738 182768 179212 175187
55607 175187 171607 168350 165826 164898 164721 163013 159122 154827 151652 149474 147995 147459 147504 147432 147845 149922
55591 149922 152930 154742 155059 155751 157741 159958 161689 163462 165061 165152 163612 161978 160987 159975 159259 160580
55575 160580 164300 168509 171857 175116 179057 182985 186409 190120 194540 198895 202986 207924 214159 220525
55561 220525 225968 230416 233236 233013 229885 226066 222888 219178 213794 207924 203433 200313 197098 192662
55547 192662 186676 179528 172693 168000 165733 164479 163285 162589 162729 163288 164496 167498 172300 177040 180228
55532 180228 182349 184594 187387 190789 194747 198170 199333 198034 195999 194530 193186 191370 189490 187839
55518 187839 185973 183981 182810 182551 181986 180526 178861 176983 173453 167667 161042 154870 148673 141942 135754
55503 135754 131174 127426 123111 118281 114111 111494 110785 111776 113044 112493 109433 104988 100009 94274 88430
55488 88430 84628 83798 84008 83079 81462 80901 81552 82112 81831 80798 79030 76728 74769 73630 72481 70405
55472 70405 67749 65220 62578 59585 57388 57399 59069 60077 58656 54991 50570 46917 44775 43939 43926 44717
55456 44717 46289 47579 47094 44709 41776 39225 36848 34668 33395 32869 31591 28776 25659 23948 24045
55441 24045 25440 27525 29312 29798 29592 30839 34501 38936 42058 43574 44116 43736 42635 42050 42836 44159
55425 44159 44999 45937 47990 50528 51882 51475 50048 48329 46652 45377 44529 43451 41679 39709 38108
55410 38108 36665 35281 34886 36333 38961 41305 42814 44035 45498 47090 48122 47657 45485 43069 42506
55395 42506 44144 46280 47639 48739 50164 51146 50937 50202 49796 49286 47939 46077 44475 43602 44490 48680
55379 48680 55775 62371 65243 64679 63173 62029 61014 60118 59396 57790 54382 50474 48306 47816 46672
55364 46672 43627 40016 37611 36680 36600 36957 37361 37313 36862 36754 37460 38507 38925 38049 36023 33966 33301 34395
55346 34395 36081 36997 36968 36566 35937 34838 33426 32231 31608 31769 32946 34930 36852 37844 37571 35947 33155
55329 33155 30240 28620 28451 28510 28212 28448 29686 30665 30173 28892 28147 27903 27438 27064 27653 29166 31105
55312 31105 33711 37296 40998 43655 45431 47156 48553 48554 47029 44968 43309 42645 43472 45451 47007 46995
55296 46995 46205 46032 46402 46441 46344 46837 47433 47183 46784 47932 50577 52688 52876 51533 49275 46046 42308
55279 42308 39514 38658 39303 40375 41033 40593 38759 36290 34588 34310 35031 36252 37996 40474 43816 47869
55263 47869 51564 53088 51761 49221 47574 46878 45739 43851 42231 41264 40385 39776 40461 42262 43357 42586
55247 42586 40909 39887 39767 39839 39777 39966 40973 43039 45669 47712 48477 48660 49349 50328 50440 49584 49153 50260
55229 50260 52588 55323 58202 61124 63420 64107 62639 59387 55657 53017 52117 52377 53148 54549 56495
55214 56495 57800 57407 55889 54519 53378 51751 49975 49322 50146 51560 52813 53730 54084 53934 54304 55850
55198 55850 57180 56355 53970 52654 53342 54233 53917 53304 53564 54255 54621 54932 55170 54169 51640 49661 50330
55181 50330 52946 55184 56246 57022 57684 57141 55000 52428 50530 49034 47243 45563 45421 47807 52206
55166 52206 56820 59743 60117 58431 55915 53784 52862 53510 55540 58175 60177 60288 58128 54856 52542
55151 52542 52450 54147 56440 58616 60320 61053 60623 59687 59005 58594 58335 58798 60363 61973 62040 60375 58089
55134 58089 55931 54013 52936 53554 55475 57260 58338 59399 60672 61382 61473 62397 65248 69155 72349 73936
55118 73936 73965 72629 70282 67680 65470 63881 63276 64341 67137 70443 72617 72904 71777 70403 69961 70981
55102 70981 73140 75912 79120 82443 84955 86180 87141 89190 91956 93841 94425 94934 96224 97907 99815
55087 99815 102690 106742 110896 114141 116460 117995 118612 118963 120459 123318 125968 127203 127527 127436 126033 122786
55071 122786 119330 117762 118024 118643 119304 120906 123430 125501 126061 125217 123571 121854 120970 121056 120683 118422
55055 118422 115212 113600 114280 114961 113415 110314 107899 106775 105514 103131 100500 98920 98320 97654 96566
55040 96566 95775 95916 96776 97932 99511 101865 104802 107543 109231 109401 108455 107912 109403 112715 115494 115765
55024 115765 114296 113437 114055 114793 114192 112264 109831 107532 105800 104800 104021 102788 101450 101174 102326 104043
55008 104043 105745 108009 111297 114658 116396 115603 112733 109205 106627 105689 105561 105116 104841 106603 111181
54993 111181 117045 122080 125589 128067 129900 131123 131903 132435 132620 132260 131350 130046 128765 128276 128947 129882
54977 129882 129665 128162 126769 126762 128315 131238 135530 140743 145894 150641 155790 162301 170435 179903 189887
54962 189887 198914 206069 212508 220421 230381 241392 253730 269363 288581 308452 326298 342854
54950 342854 360085 377366 392046 402821 410336 414990 416333 414512 410300 403442 392612 377520 360010
54937 360010 342681 327178 313867 302360 292155 283170 275651 269379 263507 257570 251901 246606 241169
54924 241169 235917 232677 232642 234429 235816 236692 238628 242035 245686 249133 253822 261326 271810 284604
54910 284604 299087 314501 329931 344982 359694 373400 384503 391792 395270 395306 391770 384538 374294
54897 374294 362197 349045 335221 321304 308216 296600 286155 275762 264565 253025 242679
54886 242679 234734 229047 224530 220129 215255 209771 204029 198703 194229 190528 187255 183957 180017 175041
54872 175041 169407 163833 158415 152907 147936 144705 143068 141202 137910 134044 130759 127612 123747 119974
54858 119974 118028 118090 118518 118011 116845 115893 115397 114942 114085 113038 112943 115051 119109 123109 125207 125384 124700
54841 124700 123730 122551 121431 120402 118707 115808 112550 110258 109090 108361 108181 109538 112822 117224 121603
54826 121603 125195 127645 129077 130061 130990 131749 132371 133350 134766 135911 136607 138046 141332 146002 151005 156284
54810 156284 162160 168101 173620 179762 188055 198439 209812 222247 236972 254284 273027 292114
54798 292114 311161 329774 347614 365108 382718 399485 413498 423611 429492 430555 426531 418861
54786 418861 409761 399981 389057 377456 366548 356532 346569 337040 329506 324078 319155 314365 311446
54773 311446 311206 311864 311758 311743 313272 315675 317183 317536 317946 319253 321604 325299 330623 337342 345520 356311
54757 356311 370801 388414 407486 427029 447007 467124 486288 503195 516920 527048 533649 536978
54745 536978 537002 533557 526881 517309 504441 487713 468190 448663 431277 415815 400901 385961 371317
54732 371317 357258 344041 332243 322215 313577 305813 298897 292721 286502 279449 271675 263887 256538
54719 256538 249679 243153 236638 230117 224541 221107 219439 217504 213984 209735 206056 202651 198542 194205
54705 194205 191253 190246 190099 189542 188101 185649 182199 178415 175545 174356 174531 175266 176067 176914 178004 179464
54689 179464 181205 183038 184887 186646 187840 187973 187461 187600 189141 191299 192727 193153 193563 194887 196910
54674 196910 198567 199225 199792 202339 208126 215977 223350 229076 234300 240514 247666 254621 260566 265243 268653
54659 268653 271491 275224 280697 286947 292307 296524 300980 307019 314770 323499 332398 341009 349471 358455
54645 358455 368512 379540 391112 402983 414894 426290 436859 446950 456668 464738 469141 469041
54633 469041 465442 459826 452750 444020 433581 421703 408652 394866 381533 370402 362459 356738 350908
54620 350908 343356 334576 326332 319701 314327 309302 304176 299108 294645 291510 290078 289732 289073 287006 283545
54605 283545 279594 276207 273886 272151 269843 266216 261647 256775 251375 244890 237824 231574 226808 223030
54591 223030 219793 217195 214819 211473 206706 201675 197721 194743 191602 187438 182118 176195 171056 168192
54577 168192 167445 166793 164797 162531 161929 162857 163256 161989 160121 159087 158743 157897 156158 154553 154425 155948
54561 155948 157843 158619 158063 157310 157310 157637 157034 154894 151886 149324 148124 148180 148671 149114 150054 152260 155409
54544 155409 158322 160629 163367 167588 173139 179215 185255 190697 194670 196950 198892 202471 208393 215596
54530 215596 222454 227987 232138 235430 238454 241451 244267 246551 247758 247210 244672 240758 236198 230944
54516 230944 224885 219131 215214 212836 209881 205270 200496 197479 196094 194717 192330 189080 185577 182563
54502 182563 180588 179305 177840 176358 176012 176630 176111 173465 170878 170800 172243 172294 170556 169513 170661 172831
54486 172831 174748 176860 179690 182320 183852 185004 186922 189237 190547 190341 189508 189158 189590 190322 190755 190814
54470 190814 191033 191793 192684 193133 193449 194412 195757 196058 194609 192748 192595 194652 197058 197231 194150 189157
54454 189157 184666 182128 181344 181445 181786 181676 180353 178148 176967 178305 181028 182372 181215 179082 177662
54439 177662 176575 174350 170788 167340 165347 164649 164104 163113 162281 162397 163055 162895 161432 159886 159647 160555
54423 160555 161508 162228 163273 164497 164744 163350 161053 159168 158557 159525 161904 164943 167785 170393 173466
54408 173466 177324 181563 186011 191184 197276 203384 208329 211929 214993 218383 222489 227271 232319 236946
54394 236946 240744 244143 248151 253377 259280 264399 267398 268001 267003 265381 263497 261135 258138 254731 251211
54379 251211 247378 242553 236501 230395 226201 224589 223955 222280 219452 216756 214554 212043 209215 207127
54365 207127 205680 203079 198601 194281 192418 192706 193334 193717 194355 195051 195302 195863 197933 201046 203558 205089
54349 205089 206802 209465 212904 217179 222431 227619 231312 233904 237199 241584 245529 248209 250586 253312
54335 253312 255618 257169 259061 261712 263469 262781 260398 257908 255173 250797 244406 237115 230147 224053
54321 224053 218803 213758 208079 201999 197044 194154 192280 189789 186552 183605 181279 178842 175732 172126
54307 172126 168417 164905 161794 158908 155651 151808 147939 144417 140691 136273 131799 128135 124984 121651
54293 121651 118905 118690 121641 125899 128788 129068 127321 124806 122453 120650 119528 119220 119750 120721 121608 122516
54277 122516 124094 126205 127377 126443 124449 123877 125954 129636 133361 136753 140055 142948 145014 146866 149520
54262 149520 152515 153799 152070 148445 145056 142754 141167 140453 141377 143516 145064 145081 144588 144431 143465 140441
54246 140441 136646 134633 134703 134851 134340 135125 138733 143444 146053 145476 143372 141823 141653 142697 144526 146580
54230 146580 148187 148763 148043 146391 144964 145011 146633 148505 149169 148381 147058 146250 146299 146674 146468 145429 144560
54213 144560 145161 147106 148557 147732 144744 141568 140456 142236 145668 148355 148686 147027 144947 143697 143757
54198 143757 145069 146813 147479 146393 144877 144679 145502 145483 143902 141849 140166 138537 137008 136627 137850 139827
54182 139827 141941 144492 147089 148054 146611 144232 142588 141517 140247 139127 138583 137662 135514 133350 132987
54167 132987 134172 135348 136523 139096 142890 145576 145661 144356 143650 143836 143800 142814 141130 139316 137785 136890
54151 136890 137001 138340 140660 143065 144408 144207 143072 142089 142008 142925 144174 144455 142863 140114 137979 137165
54135 137165 136744 136090 136070 137343 138634 138157 136140 134585 134787 136148 137203 136878 135106 133035 132181 132570
54119 132570 132388 130367 127671 126182 125793 125095 124135 124471 126477 128459 128847 127816 126324 124898 123919 123900
54103 123900 124759 125559 125514 124732 123771 123092 123063 123798 124806 125368 125329 125066 124883 125060 126052 127879 129595 130297 130152
54084 130152 129424 127215 122897 118520 117681 121479 127104 131017 132187 131722 130904 130565 131160 132213 132316 130606
54068 130606 127814 125381 124087 123996 125029 126975 129439 132222 135222 137741 138803 138613 138851 140748 143520
54053 143520 145510 146484 147903 151009 155234 158780 160660 161977 164814 169730 174967 178658 181091 183805
54039 183805 187129 190160 192899 196552 201469 206565 211499 217792 226745 237487 248110 257610 265727 272089
54025 272089 276901 281600 287458 294053 300216 305809 311323 316460 320683 324818 330328 336887 342206 344802
54011 344802 345750 347050 349161 350905 351288 350685 350257 350561 350868 349945 347572 344895 342885 340895 337537 332900
53995 332900 328923 327182 326989 326246 323779 320212 316721 313678 310765 307894 305389 303260 300802 297228 292501
53980 292501 287306 282362 278056 274598 272090 270429 269439 269061 269134 269165 268819 268553 269146 270507 271632 272035 272588
53963 272588 274430 277412 280157 281553 281794 281906 282491 283034 282516 280758 278885 278210 278990 280698 283215 286862
53947 286862 291345 295628 299215 302754 306911 311351 315345 318843 322312 325946 329676 333626 337936 342308
53933 342308 346226 349423 351716 352649 351923 350072 348135 346566 344984 343161 341863 342334 345056 349251 353662
53918 353662 357597 361065 364127 366740 369402 373324 379350 386977 395091 403421 412531 422429 432114 440680
53904 440680 448176 455144 461966 468898 475998 482527 487049 488716 488174 486872 485772 484930 483876 482065 479339
53889 479339 476223 473453 471169 468989 466701 464032 459759 452378 442264 432076 424103 417975 411922 405440
53875 405440 399433 394195 388740 382311 375461 369196 363694 358242 352099 345238 338398 332357 326970 321163
53861 321163 314145 306341 298799 292095 286359 281922 279091 277305 275313 272389 268996 266156 264459 263693
53847 263693 263047 261596 258813 254759 249868 244814 240516 237692 236097 234643 232663 230582 228964 227571
53833 227571 225998 224643 224145 224187 223861 223125 223013 224325 226747 229274 230856 230765 229178 227496 227262 228551
53817 228551 230123 231206 232299 233911 235481 236142 235884 235267 234508 233667 233466 234991 238378 242348 245425 247418
53801 247418 249511 253064 258479 265181 272358 279518 286469 293167 299731 306371 313077 319584 325792 331936
53787 331936 338070 343727 348569 353082 357969 362938 366803 368965 370192 371675 373843 376426 379075 381413
53773 381413 382829 382869 381745 380006 377873 375389 373026 371437 370440 368876 365850 361767 357859 355078 353697
53758 353697 353493 353653 352837 350099 345905 341679 338325 335753 333792 332739 332573 332257 330378 326229 320135
53743 320135 313307 307748 305470 306914 310348 313391 314917 315116 314442 313264 312001 310623 308463 305447 303008
53728 303008 302553 303344 303373 302215 301426 301923 302690 302759 302999 304804 307968 310846 312059 311430 309945 309345 310942
53711 310942 314149 316904 318047 318408 319069 319797 320153 321013 323669 328108 333368 338915 344501 349382 353127
53696 353127 356713 361351 366544 370822 374315 378964 385884 393881 401066 406862 411953 417185 423097 429831
53682 429831 436880 443294 448462 452395 455248 457111 458377 459837 462167 465609 470055 474999 479515 482825
53668 482825 484912 486239 487112 487735 488530 489659 490463 490253 489524 489474 490268 490679 489789 488235 487364 487660 488406 488651
53650 488651 488261 488056 488835 490283 491313 491697 492666 495197 498358 500256 500184 498875 497037 494796 492389 490200
53634 490200 488086 485758 483761 483046 483681 485215 488137 493345 499917 505175 507758 509190 511482 514435 516495
53619 516495 517258 517893 519716 523472 529523 537440 545553 551963 556271 559826 564292 570348 577612 585342 593114
53604 593114 600970 608893 616390 623068 629571 637223 646522 656619 666522 676115 685719 695451 705428 715830
53590 715830 726297 736020 745024 754566 765527 777108 787870 797435 806371 815060 823653 832579 841868
53577 841868 850269 856259 859972 863138 867010 871262 875137 878706 882468 886434 890160 893455 896555 899729
53563 899729 903003 906220 909169 911579 913037 913175 912191 911126 911155 912464 914161 915415 916259 917071 917892 918712
53547 918712 919942 921988 924632 927397 930249 933409 936667 939448 941502 943045 944349 945563 946843 948320
53533 948320 950207 953193 958169 964903 971594 976792 981516 988315 998142 1009375 1020309 1031395 1044183
53520 1044183 1058979 1074698 1090575 1106818 1123663 1140900 1158720 1178126 1199936 1223817 1248804
53509 1248804 1274397 1300665 1327708 1355732 1385417 1417408 1451345 1486127 1521389 1558055 1597128
53498 1597128 1638580 1681766 1726279 1771833 1817950 1864558 1912423 1962223 2013577 2065710 2118538
53487 2118538 2172028 2225045 2276304 2326376 2377226 2429543 2482047 2533961 2586526 2641047 2696698
53476 2696698 2751589 2805137 2858076 2910724 2962605 3013532 3063771 3113100 3160641 3205703 3248125
53465 3248125 3287951 3325568 3361994 3398051 3433054 3465089 3492883 3516942 3538723 3559180 3578178
53454 3578178 3594776 3607905 3617154 3623076 3626433 3627038 3623655 3615146 3601538 3583957 3563718 3541465 3517105
53441 3517105 3490514 3462106 3432297 3400561 3365861 3328276 3289339 3250084 3209512 3165990 3119759
53430 3119759 3073031 3027826 2984659 2943257 2903549 2865620 2829403 2794793 2761758 2730388 2701175
53419 2701175 2674902 2651724 2630652 2610779 2592697 2577746 2566031 2556365 2548267 2542716 2540522 2541114
53407 2541114 2543683 2548657 2557262 2570263 2587783 2609740 2635675 2664622 2696026 2730549 2769208 2811925
53395 2811925 2857617 2905617 2956242 3010034 3067218 3128134 3193470 3263564 3337862 3415649 3497110
53384 3497110 3583104 3673789 3768052 3864601 3963223 4064426 4168202 4274008 4381999 4493220
53374 4493220 4607925 4724458 4840587 4955429 5069114 5180974 5289373 5393434 5493808
53365 5493808 5591377 5686062 5777248 5864407 5946591 6022079 6089439 6148633 6200506 6245506 6283469
53354 6283469 6314253 6337852 6354013 6362376 6362985 6356111 6341636 6319103 6288328 6249334 6201650 6144400
53342 6144400 6077564 6002793 5922502 5838337 5750926 5660941 5569659 5478075 5385858 5291837 5195496
53331 5195496 5097490 4998640 4899120 4799109 4699719 4602413 4507536 4414114 4321300 4229538 4140070
53320 4140070 4053688 3970286 3889382 3810802 3734884 3662092 3592489 3525767 3461856 3401179 3343960
53309 3343960 3289673 3237727 3188398 3142405 3099784 3059983 3022954 2989120 2958211 2929285 2902255
53298 2902255 2878246 2857813 2839933 2823701 2810043 2800486 2794786 2791201 2788922 2788901 2792146 2798393 2806974
53285 2806974 2818094 2832627 2851126 2873499 2899349 2928267 2959966 2994388 3031534 3071203 3113039
53274 3113039 3156705 3201695 3247101 3292002 3336035 3379128 3420785 3460327 3497870 3534287 3569826
53263 3569826 3603454 3634070 3661834 3687635 3711541 3732519 3749619 3762751 3772103 3777373 3778074 3774371
53251 3774371 3767147 3757025 3743492 3725233 3701370 3672279 3639191 3603243 3565050 3524841 3482535
53240 3482535 3437717 3390062 3339953 3288340 3235763 3181900 3126301 3069338 3012111 2955600 2900170
53229 2900170 2845683 2791652 2737471 2683013 2629089 2576846 2526453 2476650 2425946 2374160 2322600
53218 2322600 2272806 2225268 2179314 2134027 2089251 2045839 2004967 1967022 1931160 1896087 1861324
53207 1861324 1827398 1794584 1761795 1727409 1691239 1654992 1620313 1586923 1553528 1520251 1488914
53196 1488914 1460509 1433438 1405302 1375896 1347287 1320992 1296220 1271254 1245594 1220031 1195303
53185 1195303 1171521 1148490 1125634 1101709 1075524 1047269 1018493 990584 963809 938076 913904
53174 913904 892046 872565 854831 838126 821760 804933 787239 769275 752181 736518 722069
53163 722069 708653 696432 685302 674648 664028 653463 642800 631490 619588 608339 598892 590784
53151 590784 582546 573642 564912 557082 549911 543123 537176 532387 527968 522826 516998 511467 506745 502496
53137 502496 498598 495702 494275 493670 492743 491088 489258 487931 487372 487674 488988 491202 493696 495728 497051
53122 497051 497936 498679 499421 500523 502676 506142 509934 512218 511790 508955 504866 500377 495811 491392 487235
53107 487235 482927 477653 471015 463557 456489 451019 447690 445812 443596 439517 433825 428273 424136 421008
53093 421008 417707 413640 408794 403124 396850 390958 386345 382465 377757 371693 365595 360960 357557 353806
53079 353806 348727 342954 337856 334099 331252 328554 325819 323424 321545 319724 317409 314723 312378 310907
53065 310907 310275 310131 310134 310008 309552 308668 307315 305715 304721 305410 307677 309619 309292 306992 304897 304352 304478
53048 304478 303692 301569 298656 295454 292439 290415 289962 290856 292637 295171 297936 299467 298698 296498 294707
53033 294707 293751 292370 289707 286466 283684 281589 280227 280132 281357 282501 281771 278915 275379 272604 270843
53018 270843 269587 268503 267684 267367 267686 268461 269026 268531 266753 264586 263474 264111 265772 266965 266757 265392
53002 265392 263758 262541 261947 261963 262600 263942 266083 268930 271970 274387 275694 276195 276698 277858 279895 282698
52986 282698 285882 288870 291299 293404 295750 298572 301647 304763 308043 311686 315673 319776 323711 327281
52972 327281 330655 334483 339394 345179 350759 355237 358748 361972 364947 366806 366851 365495 363847 362579 361607
52957 361607 360733 359990 359245 358085 356495 355105 354228 353203 351552 350274 350821 352847 354286 353870 352297 350425
52941 350425 347740 343608 338961 335463 333650 333063 333597 335417 337821 339472 339699 338687 336661 333918 331451
52926 331451 330311 330376 330716 330958 331190 330902 329562 328243 328995 332261 336382 340004 343368 346705 349119 350103
52910 350103 350651 351687 352617 352661 352428 352837 353505 353803 354591 357133 360700 362995 362981 361924 361674 363120 366240
52893 366240 370315 373921 375903 376541 376929 377325 377305 377302 378447 380616 382208 382512 382815 384284 386016 386423 385617
52876 385617 385085 385500 386243 387015 388650 391928 396313 400251 402432 402697 402120 402310 404264 407663 411423 414887
52860 414887 418233 421793 425474 429043 432538 436064 439412 442362 445274 448850 453192 457526 461194 464473
52846 464473 467954 471398 473877 474943 475033 474634 473829 472901 472588 473168 473876 473858 473306 472900 472480 471038 467963
52829 467963 463646 458775 453590 447935 441657 434911 428297 422624 418301 415143 412933 411657 410825 409226
52815 409226 406132 402262 398747 395619 392289 388974 386262 383613 379887 375410 371764 369204 366174 362126
52801 362126 358883 357724 356745 353139 347214 342045 339410 338015 335842 332521 328968 326214 325230 326594 329384
52786 329384 331183 330081 326322 321534 316991 313145 310168 308039 306250 304154 301642 299175 297219 295927
52772 295927 295153 294482 293314 291242 288254 284523 280283 276084 272723 270525 268951 267258 265237 262940 260076
52757 260076 256303 252002 248080 244967 242340 239900 237882 236573 235781 235094 234338 233524 232598 231512 230356
52742 230356 229126 227536 225388 223026 221157 220110 219406 218116 215627 212182 208745 206258 204943 204338 203986
52727 203986 203877 204145 204553 204641 204324 204124 204649 205875 206906 206507 204154 200776 198275 197944 199331 200875 201685
52710 201685 202325 203707 205616 206862 206964 207168 209423 214458 221213 228069 234105 238958 242135 243272 242954
52695 242954 242472 242484 242354 241085 238419 234825 230945 227435 224788 222756 220335 217020 213794 212227 212700
52680 212700 214157 215378 215792 215127 213204 210292 207004 203598 199920 196147 192796 189805 186453 182648 179542
52665 179542 178255 178528 179251 179772 180093 180185 179928 179455 178838 177642 175442 172612 169986 167837 165816 163787
52649 163787 162061 160823 160010 159783 160442 161660 162481 162482 162525 163845 166479 168960 169774 169079 168775 170488 173589
52632 173589 175857 176254 176176 177248 178786 178733 176688 174451 173363 172658 171124 169145 168071 168399 169680 171620
52616 171620 174078 176321 177471 177729 178141 178934 179024 177489 174753 171954 169979 169691 172201 177653 183945 187870
52600 187870 188036 186043 184451 184238 184893 186287 189226 193960 199137 202835 204259 204040 203399 203505 205115 207986
52584 207986 210817 212583 213896 216216 219554 221916 221588 219396 217977 219043 221976 224927 226692 227498 228535
52569 228535 230995 235290 240841 246495 251181 254360 256225 257611 259399 261680 263638 264589 264994 266106 268625
52554 268625 271973 274854 276205 275718 273992 272377 272219 273816 276116 277672 277877 277293 277074 278159 280711
52539 280711 283953 286741 288604 290093 291744 293035 293059 292175 292145 294211 297721 301235 304362 307665 311167
52524 311167 314040 315854 317096 318171 318724 318460 317836 317326 316629 315340 313974 313442 313739 313961 313622 313167 313143
52507 313143 313457 313637 313295 312211 310465 308608 307312 306738 306702 307331 308854 310726 311865 312082 312451 313697
52491 313697 315003 315259 314913 315513 317538 319717 320743 320996 322077 324972 329006 332520 334412 334971 335238 335641
52475 335641 335671 335009 334403 334718 335414 334886 332535 329762 328488 329250 331229 333639 336282 338996 341451 343765
52459 343765 346632 350385 354243 357032 358466 359340 360510 362143 364041 366196 368680 371149 372858 373211 372168
52444 372168 370144 367796 365912 365193 365806 367097 367918 367447 365685 363158 360255 357047 353750 351015 349478
52429 349478 349174 349634 350380 350975 350797 349409 347329 345799 345449 345637 345487 345100 345177 345810 346354 346401 346208 346221 346713
52410 346713 347869 349566 350946 350858 349086 346734 345204 345192 346702 349373 352365 354559 355466 355737 356326 357452
52394 357452 358809 360356 362192 363834 364462 364117 364076 365698 369161 373505 377622 380962 383589 385939 388492
52379 388492 391372 394229 396757 399362 403047 408373 414678 420663 425735 430458 435491 440497 444379 446441
52365 446441 446975 446935 447533 449946 454605 460500 465777 469595 473042 477721 483663 489172 492733 494567 496233
52350 496233 499094 503315 508026 512129 515215 517991 521848 527682 535012 542385 548762 554454 560462 566879
52336 566879 572256 574932 575087 575229 578269 584991 593433 600850 606191 610547 615323 620439 624688 627508 629787
52321 629787 632802 636945 641785 646911 652272 657967 664162 671028 678456 686056 693860 702683 713221 724987
52307 724987 736810 748323 760276 773361 787514 802598 819010 837237 857279 878829 901535
52296 901535 924815 948002 971100 994950 1020194 1046496 1073264 1100610 1128925 1157812 1186199
52285 1186199 1213548 1240346 1267373 1294985 1323302 1352570 1382947 1414012 1444721 1473946 1501151
52274 1501151 1526657 1551275 1575634 1599829 1623543 1646222 1667147 1685703 1701854 1716247 1729677
52263 1729677 1742525 1754658 1765575 1774647 1781643 1787195 1792281 1796967 1800053 1800486 1798910 1797376 1797507 1799260
52249 1799260 1801397 1802734 1802859 1802041 1800936 1800506 1801847 1805578 1811217 1817557 1823977 1830999 1839143 1847908 1856793
52234 1856793 1866902 1880107 1896422 1913571 1929727 1945406 1961802 1978567 1994645 2010401 2027144
52223 2027144 2044767 2061461 2075907 2088372 2099395 2108830 2116867 2124701 2133048 2140701 2145654 2147379 2147050
52210 2147050 2145669 2142982 2138435 2132271 2124997 2116332 2105528 2092708 2079073 2065451 2051240 2035288
52198 2035288 2017390 1998240 1978308 1957772 1937487 1918907 1902590 1887647 1873204 1859610 1847577
52187 1847577 1836876 1826662 1816531 1806367 1795776 1784632 1773843 1764470 1756325 1748450 1740670 1733445
52175 1733445 1726279 1717846 1708159 1699264 1692871 1688086 1682408 1674469 1665028 1655665 1647341 1640218 1634169 1629085
52161 1629085 1624705 1620218 1614347 1606338 1596895 1587711 1579902 1573356 1567628 1562698 1558397 1553746 1547701 1540438
52147 1540438 1533268 1527172 1521781 1515949 1509135 1502056 1495981 1491352 1487185 1482036 1475520 1468650 1462634 1457596
52133 1457596 1452677 1447120 1440898 1434335 1427513 1420432 1413681 1408331 1404637 1401139 1395899 1388749 1381467 1375412
52119 1375412 1370028 1364527 1360006 1358240 1358701 1358521 1355932 1352435 1350899 1352501 1356305 1361027 1366132 1371675
52105 1371675 1378053 1385975 1395967 1407774 1420600 1434034 1448510 1464819 1483306 1503582 1525091 1548017
52093 1548017 1573352 1601736 1632435 1663971 1695583 1727461 1759766 1792446 1826154 1862129 1900467
52082 1900467 1939330 1976663 2012152 2046668 2080269 2111724 2139955 2165173 2188454 2210690 2232102
52071 2232102 2252383 2271116 2288085 2303135 2315817 2325544 2332165 2336013 2337318 2336133 2332940 2328572 2323065
52058 2323065 2315399 2305148 2293774 2283331 2274284 2265536 2256293 2246692 2236675 2225632 2213798 2202964
52046 2202964 2194804 2188910 2183285 2176621 2169464 2163152 2158323 2154874 2152983 2153483 2157032 2163140 2170344 2177257
52032 2177257 2183268 2188397 2192981 2197664 2203199 2209898 2217352 2224920 2232260 2239185 2245293 2250222 2254211 2257978
52018 2257978 2261873 2265301 2267070 2266291 2262935 2257540 2250389 2241135 2229412 2215663 2200885 2185376 2168116
52005 2168116 2147624 2123263 2095538 2065383 2033409 1999824 1964861 1929264 1894031 1859406 1824248
51994 1824248 1787026 1747511 1707012 1666835 1627097 1587260 1547123 1506862 1466725 1427226 1389147
51983 1389147 1352695 1317007 1281046 1244695 1208415 1172249 1135933 1099781 1064785 1031828 1001315
51972 1001315 973356 947682 923442 899718 876311 853642 831982 811274 791635 773355 756287
51961 756287 739774 723326 707041 691396 677049 664786 654943 646578 637712 626941 614749 603023
51949 603023 593261 585237 577357 568340 558580 549697 542794 537463 532657 528035 524115 521432 519950 518954
51935 518954 517153 513385 507871 502398 498470 495425 491133 484519 476700 469670 464564 461202 458571 455601
51921 455601 452042 448784 446802 445895 444990 443623 442271 441184 439768 437375 433969 429798 425182 420887 417802
51906 417802 415805 413711 410875 408052 406081 404509 402408 399883 397788 396368 395204 394249 393761 393251 391641
51891 391641 388752 385701 383334 381139 378435 375905 374903 375384 375614 374229 371842 370031 369274 368633 367247
51876 367247 365340 363701 362902 363327 365243 368295 371355 373458 374623 375249 375183 374160 372885 372696 374026 375954
51860 375954 377491 378629 379907 381639 383938 386859 390014 392519 393851 394573 395799 398118 401184 404104
51846 404104 406040 406843 407405 408956 411678 414320 415553 415351 414651 414036 413374 412616 412280 413067 415350 419043
51830 419043 423563 427816 430586 431242 430028 427728 425251 423531 423391 425053 427726 430049 431238 431698 432201
51815 432201 432682 432435 431566 431386 432763 434685 435404 434701 434057 434542 435577 436013 435496 434306 432633 430705 429106
51798 429106 428420 428756 429872 431310 432188 431633 429932 428675 429072 430602 432036 433251 435214 438351 441857
51783 441857 444594 446014 446200 445662 445263 445781 447333 449429 451548 453409 454928 456390 458534 461910 466105
51768 466105 470026 473012 475312 477593 480376 484006 488653 494144 500043 506109 512595 520037 528781 538508
51754 538508 548176 556776 564370 572025 580362 588479 594694 598003 598465 596669 593504 590001 586537 582403
51740 582403 576998 571290 567231 565689 565799 566363 566910 567281 567302 567360 568411 570769 573572 575933 577862 579415
51724 579415 579794 578374 576170 575061 575494 575828 574255 570724 566635 563029 559521 554971 549053 543027 538848
51709 538848 537432 537901 538477 537818 535423 531378 526324 521471 517876 515436 512962 509427 505007 500764 497575
51694 497575 495529 494230 493395 493089 493478 494540 496034 497647 499167 500657 502477 504883 507420 509058 509407
51679 509407 509674 511841 516704 523094 529156 533980 537862 541492 545358 549656 554274 558791 562724 565788
51665 565788 567960 569420 570438 571059 570935 569864 568438 567527 566934 565249 561486 556239 550681 544943 538232
51650 538232 530224 521546 513103 505621 499682 495331 491665 487611 483245 479599 477010 474390 470382 464710
51636 464710 458180 452038 447497 445046 443704 441582 437903 434071 432080 432147 432466 431082 427487 422694 418380
51621 418380 415801 414839 414022 411978 409010 406868 406883 408608 410287 410320 408368 405407 402918 401785 401864 402654
51605 402654 404109 406481 409629 413018 416309 419381 421869 423398 424461 426315 429656 433969 438526 443402
51591 443402 448902 454592 459800 464826 470787 478076 485713 492578 498792 505416 512994 520685 526916 530840
51577 530840 533232 535937 540272 545966 551601 555911 558470 559466 559397 559021 559111 559977 561388 563008 564719 566623
51561 566623 569117 572847 578017 583637 588197 591419 594700 599284 604606 609201 612830 616756 621979 628058
51547 628058 633863 638712 642499 645309 647385 649080 650518 651603 652601 654326 657390 661518 665824 669490
51533 669490 671996 673191 673506 673778 674379 674939 675306 676218 678238 680307 680441 678009 674463 671409 668707 665044
51517 665044 659841 653853 648013 642351 636265 629525 622757 616924 612406 608691 604959 600827 596372 591709
51503 591709 586999 582703 579218 576092 572236 567246 562034 557765 554562 551765 549032 546551 544325 541988
51489 541988 539462 537287 536125 536201 537348 539297 541812 544772 548196 552021 555861 559235 562064 564740 567746
51474 567746 571459 576304 582667 590404 598600 606156 612688 618843 625671 633619 642161 650440 658200 665839
51460 665839 673703 681755 689981 698538 707174 715012 721363 726407 730602 733891 736073 737587 739203 741185
51446 741185 743426 745979 748600 750079 749152 746097 742380 738705 734550 729737 725073 720879 716139 709969
51432 709969 702914 695851 688480 680037 670939 662566 655570 649267 642553 634784 626078 617467 610528 606082
51418 606082 603343 600813 597779 594552 591778 590174 590404 592294 594517 595930 596907 598422 600152 600685 599595
51403 599595 598218 598060 599215 600484 600387 597939 593124 586765 579523 571170 561377 550776 540379 530197
51389 530197 519510 508389 497883 488752 481055 474850 469947 464971 458173 449650 441453 435097 430253
51376 430253 426228 423079 420409 416709 411175 404958 399228 393147 385358 376670 369403 364319 359819 354270
51362 354270 347779 341494 336258 332252 329140 326290 323413 321002 319640 319026 318351 317408 316611 316108 315781 315968
51346 315968 317199 319101 320492 320973 321668 323976 327979 332345 335503 336813 336872 336847 337444 338731 340937 344643
51330 344643 349697 354730 358836 363135 369377 377196 384269 389421 394096 400090 407027 413005 416977 419460
51316 419460 421351 422887 423744 423551 422292 420479 418749 417118 414824 411091 405806 399442 392754 386681 381878
51301 381878 377944 373573 367947 361686 356049 351465 347277 342726 337805 333210 329662 327220 325148 322687
51287 322687 319940 317643 316090 314839 313695 313268 313999 315187 315698 315368 315091 315633 317014 318867 320705 321741
51271 321741 321143 318803 315491 312004 308551 305179 302403 300901 300801 301674 303096 304658 305376 303828 299537
51256 299537 293928 289237 286323 284137 281531 279009 278231 280120 283927 287921 290541 291057 289702 287227 284060
51241 284060 280048 275385 271470 270122 271840 275345 278906 281571 283149 283722 283563 283110 282746 282893 284168
51226 284168 286776 289652 291044 290406 289056 288486 288699 288856 288933 289735 291463 293273 294410 295070 295860 296946
51210 296946 298139 299531 301553 304334 307304 309665 311241 312589 314138 315573 316460 317196 318670 320984 323298
51195 323298 325163 327188 329759 331764 331551 329041 326074 324561 324767 325575 325921 325654 325262 325236 325891 327541
51179 327541 330366 333847 336774 338281 338752 339196 339902 340400 340524 340503 339909 337785 334327 331323 330001 329379
51163 329379 327759 325165 323127 322566 323049 323762 323963 322807 320068 317084 315665 315934 316376 316101 315688 315493
51147 315493 314664 312674 310691 310321 311690 313610 315170 316342 317495 318994 320974 322969 324166 324473 324793
51132 324793 325722 326573 326393 325345 324303 323573 322867 322101 321221 319552 316421 312394 308976 307106 306749 307751
51116 307751 309906 312088 312667 311417 310053 310229 311725 313280 314436 315601 316789 317419 317391 317466 318293 319566
51100 319566 320483 320701 320645 321042 322411 324969 328753 333504 338320 341789 343067 342876 342918 344070 345633 346623
51084 346623 347186 348080 349216 349661 349125 348605 349251 351210 353952 357229 361164 365702 370498 375173 379190 381624
51068 381624 381799 380438 379599 380892 383874 386616 387836 388115 388965 391148 394123 396797 398492 399384 400415
51053 400415 402626 406222 410293 413806 416755 419829 423063 425524 426660 427244 428421 430293 432110 433548
51039 433548 435042 437002 439392 442151 445341 448709 451664 453959 455943 457924 459658 460781 461409 462069 463350
51024 463350 465758 469522 474199 478757 482281 484451 485317 485109 484540 484686 486126 488575 491733 495936 501342
51009 501342 507107 512394 517919 525288 534577 543674 550584 555588 560463 566217 572562 579263 586889 595911
50995 595911 605775 615544 625251 636154 649529 665376 682376 699030 714967 731346 750118 772640
50983 772640 798696 826823 855868 886247 919528 956835 998096 1043011 1092166 1146568 1206282
50972 1206282 1270267 1337751 1409298 1486156 1568833 1656601 1748174 1842476 1938894 2037215 2137468
50961 2137468 2239467 2342119 2443319 2540801 2633126 2719507 2798783 2869287 2930181 2982390 3027429
50950 3027429 3065446 3095176 3115815 3128128 3133607 3133573 3129547 3123499 3116695 3108774 3098806 3086926 3074083
50937 3074083 3060377 3044615 3025589 3003091 2977530 2949052 2917142 2880684 2838438 2789897 2735580
50926 2735580 2676356 2612924 2546359 2478287 2409481 2338900 2265504 2190752 2117814 2048329 1981489
50915 1981489 1916658 1855246 1799182 1748733 1702622 1659261 1617255 1576002 1536700 1501604 1471238
50904 1471238 1443483 1416570 1391707 1371116 1354429 1339026 1323434 1308386 1294630 1281790 1269841
50893 1269841 1259868 1252404 1246290 1240224 1234673 1231419 1231592 1234617 1238677 1242020 1244379 1247320 1252728 1261028
50879 1261028 1271548 1284277 1299880 1317928 1336813 1356139 1377710 1402947 1430568 1458337 1486354
50868 1486354 1517014 1552160 1591947 1636364 1686091 1741328 1801343 1866163 1937856 2019115 2110954
50857 2110954 2212542 2323093 2443304 2575095 2720328 2879487 3051083 3232505 3422075
50848 3422075 3620274 3828409 4045868 4269093 4493437 4715626 4934078 5147069 5351194
50839 5351194 5541796 5714661 5867139 5997862 6105813 6190030 6250312 6288171 6306878 6310398
50829 6310398 6302066 6284126 6258411 6227387 6194417 6162719 6133802 6106947 6080376 6052746 6023087
50818 6023087 5989537 5949148 5899429 5839274 5767628 5682041 5580000 5461742 5330437 5189238
50808 5189238 5039320 4881378 4717812 4552224 4387454 4225311 4067755 3916985 3774246
50799 3774246 3639622 3513274 3396096 3288947 3191915 3104624 3026654 2957473 2896575 2844056
50789 2844056 2800425 2765469 2737609 2714617 2694667 2676682 2660352 2646153 2634750 2625848 2617883 2609192
50777 2609192 2599112 2587675 2574708 2559718 2542295 2522196 2499500 2475267 2451582 2430071 2410303
50766 2410303 2390291 2368540 2345095 2320662 2295661 2270538 2246383 2224625 2206260 2191734 2181264
50755 2181264 2174790 2171713 2171195 2172916 2177319 2185134 2196956 2213371 2234975 2261811 2292949 2327339 2365394
50742 2365394 2409511 2462593 2526094 2599621 2682268 2773878 2874939 2985658 3105588 3233989
50732 3233989 3370040 3512388 3658812 3806803 3954551 4100874 4243853 4379872 4504548
50723 4504548 4614662 4708858 4786594 4847087 4889552 4913920 4920940 4912000 4889283 4855643 4813696
50712 4813696 4765202 4711850 4656346 4601969 4550961 4503905 4460635 4420968 4384304 4349229 4314098
50701 4314098 4277687 4238797 4195427 4144805 4084499 4013616 3933201 3845555 3752997 3657052 3558759
50690 3558759 3459425 3360746 3264272 3171271 3083190 3001739 2928246 2863176 2806413 2757719 2716755
50679 2716755 2683153 2656943 2638813 2629725 2630341 2640781 2660602 2688824 2724254 2765959 2813298 2865497
50667 2865497 2921458 2980027 3040088 3100408 3159822 3217692 3273667 3326881 3375892 3419806 3459041
50656 3459041 3494720 3527713 3558482 3587273 3613910 3637885 3659177 3678552 3696515 3712484 3725813
50645 3725813 3737395 3749445 3763680 3780434 3799506 3821091 3845630 3873358 3904258 3937954 3973369
50634 3973369 4009048 4044241 4079450 4115498 4152228 4188300 4222025 4252191 4278415 4301248 4322091
50623 4322091 4342616 4363920 4386133 4409002 4432970 4459636 4490928 4527587 4568526 4611736 4655664
50612 4655664 4699537 4742454 4782543 4817140 4843738 4860780 4867861 4865347 4853668 4832608 4801170 4758321
50600 4758321 4704169 4640323 4568766 4490194 4403891 4309564 4208886 4104625 3998530 3890915
50590 3890915 3782270 3674170 3568167 3464833 3364746 3269589 3180939 3098209 3018974 2941498
50580 2941498 2866096 2793996 2726003 2662751 2605150 2553627 2507318 2464878 2425972 2391505 2362510
50569 2362510 2339383 2322000 2309961 2302689 2299908 2302233 2310859 2326313 2347801 2374096 2404931 2441327
50557 2441327 2484788 2536354 2595992 2662346 2733223 2807131 2884637 2967665 3056982 3150686 3245547
50546 3245547 3339481 3432224 3524028 3614597 3703372 3790146 3875080 3958539 4041021 4122827 4203802
50535 4203802 4284087 4365071 4448618 4534890 4621926 4708093 4794160 4882087 4972597 5065192 5160049
50524 5160049 5258220 5359619 5462149 5563429 5662522 5759401 5853478 5943271 6026941 6102423 6167432
50513 6167432 6220020 6259142 6284347 6295144 6291022 6271921 6238455 6191954 6134592 6069160 5998364
50502 5998364 5924504 5849937 5777322 5708858 5645698 5588820 5540256 5502518 5476449 5460097 5449969
50491 5449969 5443128 5437982 5433661 5429149 5422837 5412336 5394544 5366222 5324850 5269126 5198704 5113609
50479 5113609 5014125 4901253 4777044 4644136 4504951 4361533 4216211 4071849 3931025 3794979
50469 3794979 3663767 3537472 3416994 3303619 3198104 3100318 3009500 2924671 2845083 2770649
50459 2770649 2701884 2639180 2582192 2530269 2483397 2442248 2407012 2376693 2349992 2326711 2307811
50448 2307811 2294174 2285891 2282719 2284549 2291131 2302004 2317252 2337790 2364118 2395093 2428812 2464786
50436 2464786 2504444 2549226 2598859 2651746 2706372 2761856 2817862 2874787 2933703 2995250 3058651
50425 3058651 3122345 3185434 3247852 3309372 3369525 3428723 3488448 3549703 3611889 3673849 3735431
50414 3735431 3797258 3859415 3921332 3982835 4044385 4106017 4166637 4224584 4278353 4326714 4368812
50403 4368812 4404497 4433945 4456621 4471139 4476459 4472623 4459799 4437310 4404402 4361532 4309921 4249965
50391 4249965 4181138 4103636 4019286 3930445 3838634 3744574 3648970 3552840 3457616 3365519 3279407
50380 3279407 3201495 3132121 3070213 3014985 2966828 2926558 2894171 2868587 2848335 2832153 2818805
50369 2818805 2806533 2793101 2776643 2756470 2732840 2705984 2675430 2640263 2599840 2554239 2504134
50358 2504134 2450349 2393597 2334848 2275780 2218291 2163252 2110250 2059006 2010489 1965874 1924865
50347 1924865 1886144 1849320 1815242 1784237 1755297 1727566 1701562 1678178 1657325 1638330 1621022
50336 1621022 1605656 1592370 1581476 1573701 1569262 1567259 1566920 1568982 1574858 1584697 1597260 1611434 1626900
50323 1626900 1643650 1662060 1683378 1708782 1737644 1767725 1797471 1827251 1858095 1890288 1923632
50312 1923632 1958129 1993647 2029582 2065500 2101589 2137905 2173669 2207920 2240404 2271054 2298853
50301 2298853 2322041 2339640 2352522 2362847 2372474 2381698 2389376 2394243 2395958 2394632 2389799 2380738 2367835
50288 2367835 2352614 2335846 2316328 2292192 2262908 2229434 2192902 2153962 2113279 2071913 2030958
50277 2030958 1990999 1951920 1913098 1874088 1835252 1797415 1760765 1724721 1689217 1655329 1623961
50266 1623961 1594497 1565711 1537638 1511521 1487968 1466239 1445558 1426124 1408464 1392571 1378236
50255 1378236 1365615 1354827 1345376 1336682 1329059 1323611 1321122 1321274 1322867 1324435 1324783 1323418 1320746 1317747
50241 1317747 1315271 1313584 1312447 1311512 1310532 1309327 1307610 1305055 1301653 1297943 1294562 1291465 1287965 1283799
50227 1283799 1279767 1276763 1274318 1270805 1265314 1258773 1252971 1249021 1247117 1247060 1248179 1249225 1249379 1249346 1250539
50212 1250539 1253205 1256395 1259921 1264968 1272053 1279624 1285873 1291122 1297032 1303855 1309981 1314166 1316812 1318644
50198 1318644 1319424 1318721 1317100 1315655 1314801 1314124 1313164 1311812 1310064 1307776 1304593 1299985 1293606 1285745 1277271
50183 1277271 1269003 1261318 1254251 1247518 1240453 1232435 1223520 1214302 1205258 1196697 1189116 1182711 1176498 1169005
50169 1169005 1160287 1152401 1147343 1145209 1144766 1144915 1144843 1143525 1140086 1134393 1126747 1117509 1107561 1098362 1090572
50154 1090572 1083218 1075222 1067302 1061236 1057553 1055079 1052586 1049689 1046208 1042003 1037782 1034865 1033529 1032382
50140 1032382 1029939 1026236 1022490 1019703 1018051 1017155 1016559 1016289 1017211 1020414 1026010 1032917 1040122 1047697 1056268
50125 1056268 1065848 1075613 1084725 1093206 1101989 1111946 1122654 1132379 1139759 1145153 1149779 1153944 1157137 1159537
50111 1159537 1161974 1164293 1165347 1165265 1166133 1169296 1173273 1175851 1177267 1179536 1183213 1186855 1189676 1192770 1197042
50096 1197042 1201667 1205714 1210126 1216732 1225959 1236712 1248194 1260563 1273766 1286949 1299608 1312624
50084 1312624 1327426 1344352 1362477 1381072 1400587 1421789 1444362 1467030 1489092 1511077 1533522
50073 1533522 1555843 1577249 1598356 1620788 1645041 1669705 1693146 1715146 1736403 1757321 1778141
50062 1778141 1799619 1822522 1846675 1871491 1897288 1925091 1955048 1986138 2017896 2051568 2088855
50051 2088855 2130098 2174434 2221337 2271323 2325313 2383999 2447903 2517492 2592856 2673342 2757496
50040 2757496 2843378 2929188 3013685 3095686 3173082 3242999 3303731 3356262 3403107 3445547 3482712
50029 3482712 3513579 3539108 3561695 3582723 3601261 3615057 3622170 3621363 3611493 3591362 3560344 3518551
50017 3518551 3466073 3402618 3328776 3247328 3162258 3076045 2988868 2901004 2815025 2734540 2661135
50006 2661135 2593687 2530565 2471388 2416332 2364813 2315597 2267803 2221241 2175925 2131584 2087625
49995 2087625 2043569 1999728 1957346 1917612 1880451 1844605 1808986 1773653 1739510 1707463 1677826
49984 1677826 1650093 1623267 1596887 1571687 1548705 1527860 1508102 1489030 1471512 1456536 1444189
49973 1444189 1434024 1425598 1418319 1411535 1405254 1400085 1396079 1392457 1389055 1387127 1387854 1390583 1393493 1395620
49959 1395620 1397514 1400261 1404597 1410653 1417773 1424798 1431189 1437684 1445369 1454435 1464369 1474942 1486349
49946 1486349 1498892 1513318 1530927 1552365 1576552 1601794 1627851 1656199 1688605 1726390 1770642
49935 1770642 1821811 1879063 1941192 2008479 2082771 2165687 2257663 2358694 2468703 2586878 2711659
49924 2711659 2841853 2976746 3114846 3253599 3390886 3525711 3656929 3782433 3900545
49915 3900545 4011322 4115617 4213614 4305271 4391438 4473154 4550013 4620112 4681324 4731617 4768225
49904 4768225 4787658 4787133 4765889 4725249 4667764 4596005 4511671 4415883 4310498 4198488 4082426
49893 4082426 3963085 3840383 3715353 3590230 3466777 3345517 3226555 3110228 2996906
49884 2996906 2887117 2781966 2682348 2587569 2495914 2407046 2322602 2243752 2169366 2097723 2028886
49873 2028886 1963872 1902205 1842205 1783599 1728032 1676549 1628087 1581209 1535980 1493144 1452522
49862 1452522 1413462 1376273 1342032 1311252 1283624 1258705 1236018 1214867 1195046 1177372 1162483
49851 1162483 1149341 1136138 1122619 1110277 1100164 1091701 1083886 1076469 1069583 1063376 1058463 1055576 1054148
49838 1054148 1052280 1048832 1044660 1041228 1039051 1038068 1038364 1039588 1040859 1042262 1045323 1050858 1057545 1064024
49824 1064024 1071148 1080362 1091046 1101769 1113536 1129198 1149568 1172525 1196410 1222026 1250576 1281786
49812 1281786 1315335 1352534 1395190 1443902 1498559 1559501 1627124 1701231 1781623 1868353 1960392
49801 1960392 2055020 2149669 2243515 2336145 2425503 2508707 2584523 2653682 2716889 2773802 2824096
49790 2824096 2868453 2908172 2944414 2978016 3009344 3037810 3061429 3076844 3080084 3068095 3040133
49779 3040133 2997396 2941174 2872042 2791270 2702022 2608135 2512162 2415520 2320033 2228044 2140930
49768 2140930 2058595 1980776 1907936 1840458 1777661 1718326 1661959 1609081 1560212 1514890 1471804
49757 1471804 1429752 1388409 1348284 1310160 1274642 1241894 1211554 1183130 1156758 1133210 1112683
49746 1112683 1094094 1076414 1060308 1047190 1036705 1026577 1015462 1004628 995976 989489 983820 978581
49734 978581 974728 972832 971981 970519 967418 963131 959486 958238 959134 959851 958450 955360 952326 950043 947787
49719 947787 944973 941968 939402 937539 936395 935904 935886 936209 936760 936976 936012 933911 932085 931911 933368 935724
49703 935724 938707 941961 944176 944396 943938 945306 948963 952617 954177 954172 954622 956595 959660 963015 966232 969226
49687 969226 972113 975062 977955 980363 981984 983022 984061 985672 987917 990087 991305 991746 992839 995660
49673 995660 999588 1003238 1006249 1009192 1012205 1014989 1018034 1022379 1027772 1032319 1034602 1035280 1036065 1037824 1040238
49658 1040238 1042672 1044817 1046882 1049594 1053591 1058534 1063206 1066744 1069293 1071340 1072983 1074120 1074880 1075697
49644 1075697 1077371 1080983 1086930 1093899 1099658 1103221 1105483 1107487 1109069 1109790 1110287 1111804 1114772 1118597
49630 1118597 1122506 1126160 1129790 1134220 1140288 1147771 1155289 1161746 1167407 1173101 1178974 1184854 1191352 1199510
49616 1199510 1209329 1219520 1229028 1238237 1248274 1259531 1271380 1283299 1295705 1309339 1324123 1339259
49604 1339259 1354536 1370779 1388598 1407479 1426834 1447170 1469105 1491810 1514042 1536554 1561665
49593 1561665 1589969 1619223 1647421 1675374 1705046 1736732 1769648 1804348 1842474 1884128 1927324
49582 1927324 1970499 2014321 2060394 2109035 2159014 2208999 2258830 2309653 2363064 2419911 2479657
49571 2479657 2540939 2602647 2664474 2726783 2790255 2855308 2921402 2987118 3051355 3114264 3176698
49560 3176698 3239121 3301467 3363542 3424757 3483681 3538658 3588799 3633849 3673524 3708031 3739020
49549 3739020 3768624 3796975 3821679 3840494 3853910 3864413 3873772 3881939 3888210 3892328 3894126 3893032
49537 3893032 3888811 3882645 3876776 3872724 3870124 3867625 3864815 3862807 3863026 3865948 3871343 3879366 3890763 3905894
49523 3905894 3923885 3943068 3962312 3981940 4003263 4027194 4053430 4081083 4109695 4139084 4168375
49512 4168375 4196051 4221190 4243920 4264207 4280930 4292914 4300391 4304501 4305510 4302349 4293859 4279599
49500 4279599 4259332 4232706 4200090 4163137 4123645 4081771 4035859 3984227 3926997 3866055 3803424
49489 3803424 3739988 3675896 3611679 3548273 3485983 3424134 3362108 3300062 3238146 3175677 3112001
49478 3112001 3047833 2984795 2923673 2864111 2806151 2750903 2699060 2649519 2600374 2550979 2502423
49467 2502423 2456252 2413428 2374257 2338300 2304036 2269476 2233902 2198750 2166239 2137237 2110947
49456 2110947 2086442 2063663 2042706 2023062 2004326 1987231 1972983 1961579 1951610 1941874 1932455 1923902
49444 1923902 1916107 1908665 1901779 1896110 1891917 1889124 1888121 1889636 1893502 1898134 1901837 1904539 1907870 1913481
49430 1913481 1921680 1932040 1945020 1962085 1983578 2007020 2028668 2047037 2064006 2081998 2100909
49419 2100909 2118625 2133857 2147279 2159999 2172222 2183891 2195826 2209480 2225905 2245297 2267237
49408 2267237 2290899 2315309 2339982 2365411 2392496 2421307 2450622 2478893 2505582 2531466 2557744
49397 2557744 2585020 2612979 2640660 2667009 2691655 2715439 2739807 2765264 2790772 2815181 2838900
49386 2838900 2863385 2889181 2915495 2941789 2968642 2996489 3024476 3051425 3077270 3102774 3128419
49375 3128419 3154593 3182350 3212797 3245690 3279644 3313860 3348874 3385508 3424013 3464526 3507513
49364 3507513 3553102 3600466 3648404 3696322 3744390 3793172 3843555 3896696 3953382 4013345 4075608
49353 4075608 4139561 4205339 4272950 4341497 4409922 4478661 4549972 4626050 4706986 4791038 4876752
49342 4876752 4964100 5053596 5145263 5239011 5335245 5434298 5535639 5638368 5742191 5847341
49332 5847341 5953744 6060906 6168358 6275500 6381189 6484255 6584404 6681870 6776121 6865663
49322 6865663 6949387 7027549 7101126 7170603 7235562 7295146 7348737 7396345 7438261 7474174 7502957
49311 7502957 7523785 7537306 7545244 7549060 7549539 7547392 7543421 7538129 7531729 7524474 7516364 7506832 7495696
49298 7495696 7484271 7474489 7466876 7460494 7454919 7450922 7448940 7448485 7449922 7455275 7465757 7479523 7493599
49285 7493599 7507623 7523933 7543897 7565801 7587030 7607060 7627212 7648060 7668245 7685861 7700172
49274 7700172 7711537 7720046 7724819 7724561 7718245 7704961 7683658 7653751 7615980 7572100 7523665 7471419
49262 7471419 7415698 7356738 7294484 7228781 7159982 7088782 7015360 6939405 6861299 6782478 6704109
49251 6704109 6626138 6548237 6470915 6394890 6319958 6245493 6171839 6100260 6031689 5966248 5903700
49240 5903700 5843303 5783325 5721993 5659496 5598273 5540670 5486613 5434033 5381280 5328688 5277909
49229 5277909 5230050 5184675 5140705 5098074 5057993 5021329 4987338 4954661 4923133 4893693 4866738
49218 4866738 4841660 4818150 4796780 4777765 4760150 4743040 4726947 4712956 4701008 4689989 4679315
$$ [...]
##END NTUPLES=NMR SPECTRUM
##END=
