
##TITLE=AC1243_NTAAH12033_6945137_80XQF47wmx
##JCAMPDX= 6.0         $$ Bruker NMR JCAMP-DX V2.0
##DATA TYPE= NMR SPECTRUM
##DATA CLASS= NTUPLES
##ORIGIN= BRUKER
##OWNER= Administrator
$$ 1.72 TOPSPIN		Version 2.1
$$ 2012-12-11 20:55:46.273 -0500  Administrator@X
$$ Compression mode = diff/dup
##.OBSERVE FREQUENCY= 400.02188249412
##.OBSERVE NUCLEUS= ^1H
##.ACQUISITION MODE= SIMULTANEOUS (DQD)
##.ACQUISITION SCHEME= undefined
##.AVERAGES= 8
##.DIGITISER RES= 22
##SPECTROMETER/DATA SYSTEM= spect
##.PULSE SEQUENCE= zg30
##.SOLVENT NAME= COFFEE_meoh
##.SHIFT REFERENCE= INTERNAL, COFFEE_meoh, 1, 14.98509
##AUDIT TRAIL= $$ (NUMBER, WHEN, WHO, WHERE, PROCESS, VERSION, WHAT)
$$ ##TITLE= Audit trail, TOPSPIN		Version 2.1
$$ ##JCAMPDX= 5.01
$$ ##ORIGIN= Bruker BioSpin GmbH
$$ ##OWNER= Administrator
$$ $$ E:\/data/COFFEE/nmr/AC1243_NTAAH12033_6945137_80XQF47wmx/20/pdata/1/auditp.txt
$$ ##AUDIT TRAIL=  $$ (NUMBER, WHEN, WHO, WHERE, PROCESS, VERSION, WHAT)
(   1,<2012-12-11 20:55:37.332 -0500>,<Administrator>,<X>,<go>,<TOPSPIN 2.1>,
      <created by zg
	started at 2012-12-11 20:54:30.614 -0500,
	POWCHK enabled, PULCHK disabled,
       configuration hash MD5:
       86 BA 57 50 F2 9D 5C 9B 26 00 A9 28 5F 66 2E 89
       data hash MD5: 64K
       C7 A7 33 6E A4 E5 43 3D 02 2C FB 32 B7 4B CB 53>)
(   2,<2012-12-11 20:55:40.872 -0500>,<Administrator>,<X>,<proc1d>,<TOPSPIN 2.1>,
      <Start of raw data processing
       efp LB = 0 FT_mod = 6 PKNL = 1 PHC0 = 0 PHC1 = 0 SI = 32K 
       data hash MD5: 32K
       24 B4 38 B4 CC DB 56 C2 D2 5C 05 18 CD 95 39 88>)
(   3,<2012-12-11 20:55:41.422 -0500>,<Administrator>,<X>,<proc1d>,<TOPSPIN 2.1>,
      <pk PHC0 = 95.96558 PHC1 = 0 
       data hash MD5: 32K
       29 32 10 41 A1 31 01 D6 2E 96 66 A5 AE 2A AF B1>)
(   4,<2012-12-11 20:55:41.680 -0500>,<Administrator>,<X>,<proc1d>,<TOPSPIN 2.1>,
      <abs ABSG = 1 
       data hash MD5: 32K
       A5 5C C6 E2 F8 B6 51 10 95 4E 71 47 A0 DB E0 E7>)
(   5,<2012-12-11 20:55:41.849 -0500>,<Administrator>,<X>,<proc1d>,<TOPSPIN 2.1>,
      <abs ABSG = 2 
       data hash MD5: 32K
       34 93 35 B3 25 AD 62 27 92 DF FA EF 2F F3 86 D0>)
(   6,<2012-12-11 20:55:42.034 -0500>,<Administrator>,<X>,<proc1d>,<TOPSPIN 2.1>,
      <abs ABSG = 3 
       data hash MD5: 32K
       7D F0 9A 13 D2 8E 5D 10 43 E8 BE 19 CB 8F 67 AA>)
(   7,<2012-12-11 20:55:42.204 -0500>,<Administrator>,<X>,<proc1d>,<TOPSPIN 2.1>,
      <abs ABSG = 4 
       data hash MD5: 32K
       B0 9B 81 EC 2B 03 7D 87 8B 1A 7B 60 A6 5A CC FF>)
(   8,<2012-12-11 20:55:42.359 -0500>,<Administrator>,<X>,<proc1d>,<TOPSPIN 2.1>,
      <abs ABSG = 5 
       data hash MD5: 32K
       B1 DF CF AD F6 DF BC 4E B5 22 28 73 EA FC 66 BF>)
$$ ##END=
$$ 
$$ $$ hash MD5
$$ $$ 9A D7 17 55 E0 6B 56 CE 10 7E 45 FE 63 BD E1 A8
##$RELAX= 
##$RELAX= 
##$RELAX= 
##$RELAX= 
##$RELAX= 
##$RELAX= 
##$RELAX= 
##$RELAX= 
$$ Bruker specific parameters
$$ --------------------------
##$DU= <E:\>
##$EXPNO= 20
$$ [...]
##$TP= (0..7)
150 150 150 150 150 150 150 150
##$TP07= 0
##$TPNAME0= <>
##$TPNAME1= <>
##$TPNAME2= <>
##$TPNAME3= <>
##$TPNAME4= <>
##$TPNAME5= <>
##$TPNAME6= <>
##$TPNAME7= <>
##$TPOAL= (0..7)
0.5 0.5 0.5 0.5 0.5 0.5 0.5 0.5
##$TPOFFS= (0..7)
0 0 0 0 0 0 0 0
##$TUNHIN= 0
##$TUNHOUT= 0
##$TUNXOUT= 0
##$USERA1= <user>
##$USERA2= <user>
##$USERA3= <user>
##$USERA4= <user>
##$USERA5= <user>
##$V9= 5
##$VALIST= <valist>
##$VCLIST= <CCCCCCCCCCCCCCC>
##$VD= 0
##$VDLIST= <DDDDDDDDDDDDDDD>
##$VPLIST= <PPPPPPPPPPPPPPP>
##$VTLIST= <TTTTTTTTTTTTTTT>
##$WBST= 2048
##$WBSW= 25
##$XGAIN= (0..3)
0 0 0 0
##$XL= 0
##$YL= 0
##$YMAX_a= 678508
##$YMIN_a= -576926
##$ZGOPTNS= <>
##$ZL1= 120
##$ZL2= 120
##$ZL3= 120
##$ZL4= 120
##$ABSF1= 14.98509
##$ABSF2= -5.573092
##$ABSG= 5
##$ABSL= 3
##$ALPHA= 0
##$AQORDER= 0
##$ASSFAC= 0
##$ASSFACI= 0
##$ASSFACX= 0
##$ASSWID= 0
##$AUNMP= <proc_prof1d_extract_pilot.lims>
##$AXLEFT= 0
##$AXNAME= <>
##$AXNUC= <1H>
##$AXRIGHT= 0
##$AXTYPE= 0
##$AXUNIT= <>
##$AZFE= 0.1
##$AZFW= 0.1
##$BCFW= 0
##$BC_mod= 0
##$BYTORDP= 0
##$COROFFS= 0
##$CY= 15
##$DATMOD= 1
##$DC= 0
##$DFILT= <>
##$DTYPP= 0
##$F1P= 0
##$F2P= 0
##$FCOR= 0.5
##$FTSIZE= 32768
##$FT_mod= 6
##$GAMMA= 0
##$GB= 0
##$INTBC= 1
##$INTSCL= 1
##$ISEN= 128
##$LB= 0
##$LEV0= 0
##$LPBIN= 0
##$MAXI= 10000
##$MC2= 0
##$MEAN= 0
##$ME_mod= 0
##$MI= 0
##$NCOEF= 0
##$NC_proc= -8
##$NLEV= 6
##$NOISF1= 0
##$NOISF2= 0
##$NSP= 0
##$NTH_PI= 0
##$NZP= 0
##$OFFSET= 14.98509
##$PC= 1
##$PHC0= 95.96558
##$PHC1= 0
##$PH_mod= 1
##$PKNL= yes
##$PPARMOD= 0
##$PPDIAG= 0
##$PPIPTYP= 0
##$PPMPNUM= 2147483647
##$PPRESOL= 1
##$PSCAL= 4
##$PSIGN= 0
##$PYNMP= <proc.py>
##$REVERSE= no
##$SF= 400.02
##$SI= 32768
##$SIGF1= 0
##$SIGF2= 0
##$SINO= 400
##$SIOLD= 32768
##$SPECTYP= <>
##$SREGLST= <1H.CDCl3>
##$SSB= 0
##$STSI= 32768
##$STSR= 0
##$SW_p= 8223.68421052631
##$SYMM= 0
##$S_DEV= 0
##$TDeff= 65536
##$TDoff= 0
##$TI= <>
##$TILT= no
##$TM1= 0
##$TM2= 0
##$TOPLEV= 0
##$USERP1= <user>
##$USERP2= <user>
##$USERP3= <user>
##$USERP4= <user>
##$USERP5= <user>
##$WDW= 1
##$XDIM= 32768
##$YMAX_p= 485546128
##$YMIN_p= -766386
##$CURPLOT= <Network HP LaserJet P1505>
##$CURPRIN= <$Network HP LaserJet P1505>
##$DFORMAT= <normdp>
##$LAYOUT= <+/1D_H.xwp>
##$LFORMAT= <normlp>
##$PFORMAT= <normpl>
##$SURQMSG= 1
$$ End of Bruker specific parameters
$$ ---------------------------------
##NTUPLES= NMR SPECTRUM
##VAR_NAME=  FREQUENCY,     SPECTRUM/REAL,   SPECTRUM/IMAG
##SYMBOL=    X,             R,               I
##VAR_TYPE=  INDEPENDENT,   DEPENDENT,       DEPENDENT
##VAR_FORM=  AFFN,          ASDF,            ASDF
##VAR_DIM=   32768,         32768,           32768
##UNITS=     HZ,            ARBITRARY UNITS, ARBITRARY UNITS
##FACTOR=    0.250966925370066, 1,           1
##FIRST=     8223.43324360094, 4930,         -227302
##LAST=      0,             -64896,          1235
##MIN=       0,             -766386,         0
##MAX=       8223.43324360094, 485546128,    0
$$ Real data points
##PAGE= N=1
##DATA TABLE= (X++(R..R)), XYDATA
$$ [...]
$$ plain form
19544 77568 -101737 137868 38374 276684 -221660 209180 -154880 -167052 64506 217178
19534 217178 218815 -294450 -107998 -85122 -40425 -330899 120245 80541 -241021 -57988 -139028
19523 -139028 26801 60209 -41085 106174 15756 -291904 -360620 41331 156056 -73196 -229034
19512 -229034 -194706 36205 569190 -35976 -73491 -119204 -5295 16731 -23021 -55203 -242522
19501 -242522 70765 -146155 -523025 33971 -26867 184574 -181724 -242859 426542 -192656
19490 -69572 61834 -85262 -190719 -4836 -222325 -368183 24646 35608 -232078 58864 -5257
19478 -116012 88839 286432 -293447 -4071 -292913 -326110 -159807 23071 -47761 -104328 32282
19466 -123085 286109 -107143 100493 67021 -413366 -262493 87863 -271826 -126729 -156793
$$ packed form
19544G7568a01737A37868C8374K38310b21660B09180a54880j2172F4506J52672
19534B17178J637b94450a07998K2876d0425k90474A20245l9704b41021e7988q1040
19523a39028B6801L3408d1085A06174A5756b91904o8716D1331J14725g3196j55838
19512b29034L4328C6205N32985c5976l7515m5713e295A6731b3021l2182j87319
19501b42522G0765a46155l76870C3971b6867A84574a81724o1135D26542a92656
19490f9572F1834h5262j05457d836k17489j45858B4646J0962b32078E8864e257
19478a16012H8839J97593b93447d071k88842l3197a59807B3071d7761n6567C2282
19466a23085B86109a07143A00493l3472d13366J50873H7863b71826a26729l0064
$$ plain form
19456 -156793 100168 -210523 166782 -53069 17372 -159900 88746 -165132 -17246 -267507
19446 -267507 18365 253361 -29799 77455 -99129 27929 -72170 -168416 -189758 -408678 -43344
19434 -138698 59606 -74937 -112189 107014 7353 -307330 42619 -86094 2845 42175 -154123
19422 -155743 84730 -333220 108997 83482 57086 -1222 141347 54269 -37731 -115606 -29060
19410 228541 43570 146980 -334473 -27899 27923 17867 -39682 -254529 42665 -304160 186209
19398 -301232 245281 -103971 -166500 -63499 -90618 223446 213734 -458527 -277486 -324193 -116195
19386 88341 155773 44792 -171300 -197673 -329621 -81802 127259 -51658 -129381 243045 -156904
19374 -114239 -34462 -102235 -144672 -258900 80852 -87624 -101585 391061 -4771 -118312 -45402
$$ packed form
19456a56793A00168b10523A66782e3069A7372a59900H8746a65132a7246k50261
19446b67507A8365K34996b9799G7455i9129B7929g2170r6246k1342k18920d3344
19434a38698E9606g4937l7252A07014G353c07330D2619h6094B845L9330a54123
19422a55743H4730c33220A08997k5515k6396a222A41347E4269c7731p7875b9060
19410B28541D3570J03410c34473b7899B7923j0056c9682k14847D2665c04160A86209
19398c01232B45281a03971o2529f3499k7119B23446r712d58527J81041m6707a16195
19386H8341O7432D4792a71300k6373j31948h1802A27259e1658p7723B43045a56904
19374a14239c4462o7773m2437j14228H0852h7624j3961C91061d771j13541d5402
$$ plain form
19362 -89334 -172449 -1436 -9412 329910 -7587 -513426 -23269 -19974 154598 -319785 2627 -23935
19349 22272 124352 -242772 59665 -61978 -78792 -438328 76965 -225970 -305318 -74642 409456
19337 -212052 -216349 -129336 51977 -44600 -213645 139888 -243658 -169624 102585 235190 -169551
19325 -261971 156799 -18955 67013 1383 -80831 -233474 60408 55908 78031 -402389 -175490
19313 -298979 -47876 34269 -67923 -236720 -207245 -148848 -232296 -161583 -412020 67831 -255243
19301 58316 -117847 245093 -77394 -87121 -222836 62387 -8829 -55455 -145938 -264525 35144
19289 -137832 -186273 90891 -54496 52759 -173665 -360473 -213000 -17389 -382158 -16404 -111192
19278 -111192 53106 -211955 -164224 -45518 57528 -36288 16155 -304899 -80818 -66421 40222
$$ packed form
19362h9334q3115a436p976C29910g587n05839b3269L295A54598c19785B627b3935
19349B2272J02080b42772E9665f1978j6814l59536G6965b25970p9348g4642D09456
19337b12052m297Q7013E1977d4600j69045A39888b43658P4034A02585J32605a69551
19325b61971A56799a8955F7013A383h0831j52643F0408m500K2123d02389a75490
19313b98979d7876C4269f7923j68797K9475N8397q3448P0713k50437F7831b55243
19301E8316a17847B45093g7394r727j35715F2387h829m6626r0483j18587C5144
19289a37832m8441I0891e4496E2759a73665j86808J47473a7389l64769a6404r4788
19278a11192E3106b11955M7731d5518E7528c6288A6155c04899h0818J4397D0222
$$ plain form
19266 228679 137489 -58029 121206 311924 -200149 -28319 -319410 114749 -537682 45744
19255 -46950 -334357 13179 87061 193949 -137991 -241556 -97297 -96661 -174128 104022 -259367
19243 -186813 -197583 143614 -381101 176149 84188 -24804 4936 -276316 -177278 74155 35716
19231 158411 -74785 -95485 -71768 -174202 -9315 32564 -148999 21369 56292 29073 59276
19220 59276 -157684 180871 -374619 -995 82669 -171002 21464 -3260 248655 -184347 -147800
19209 -147800 240300 -263099 -22780 139070 -338887 -379061 -116700 148028 257275 8580
19198 -122385 110966 -402256 -117975 -317566 456693 -307 -234269 -12466 -88004 51520 -152872
19186 48652 -59598 -138996 -198327 -101673 -88654 -144012 -570068 -69713 9583 32102 -40049 -160961
$$ packed form
19266B28679r1190e8029A21206J90718b00149b8319k91091A14749e37682D5744
19255d6950k87407A3179P3882J06888a37991j03565i7297O36p7467A04022b59367
19243a86813j0770A43614c81101A76149H4188b4804D936b76316R9038G4155C5716
19231A58411g4785k0700K3717j02434i315C2564a48999B1369L4923k7219L0203
19220E9276a57684A80871c74619i95H2669a71002B1464c260B48655a84347L6547
19209a47800B40300b63099b2780A39070c38887m0174a16700A48028J09247H580
19198a22385A10966d02256a17975j99591D56693c07k33962a2466p5538E1520a52872
19186D8652e9598p9398n9331R6654J3019n5358m26056f9713I583K2519d0049j20912
$$ plain form
19174 -160961 -237432 -40757 -246606 253375 69554 -81171 -151118 455629 81647 42213 19673
19162 305309 -152828 -498977 83135 -136630 -258108 -224190 -86763 13294 -17074 40364 -251253
19150 -65861 -342996 148629 -42048 31802 -62113 -223417 143137 29665 228303 1561 -216878
19138 -75333 242460 -181992 -370977 -198204 -113474 15045 -78588 -74584 -195683 101562 -8303
19126 202793 -31125 -67386 122045 21982 258242 -173269 274838 140727 120883 299522
19116 299522 21378 -239583 -222540 -128070 -17896 -36884 -54170 -173267 -307185 -179336 145079
19104 -269228 -111292 39958 -164952 -21086 10491 -97866 -72314 -21041 142382 11242 57622
19093 57622 139326 275494 15172 22982 -211346 6393 -331283 132663 -134203 158938 -102814
$$ packed form
19174a60961p6471d0757k05849B53375F9554h1171o9947D55629H1647l9434A9673
19162C05309a52828l46149H3135a36630j21478L3918h6763A3294a7074D0364b51253
19150f5861k77135A48629d2048C1802f2113j61304A43137B9665J98638A561b16878
19138g5333B42460a81992j88985J72773Q4730A5045g8588M004j21099A01562h303
19126B02793c1125l6261A22045B1982K36260a73269B74838j34111j9844J78639
19116B99522B1378b39583J7043R4470a7896j8988j7286j19097j33918J27849A45079
19104b69228a11292C9958a64952b1086A0491i7866K5552b1041A42382A1242M6380
19093E7622Q1704J36168A5172P810b11346F393c31283A32663a34203A58938a02814
$$ plain form
19081 -289413 -4126 -35861 -106674 -120864 13969 249512 -636628 7167 -164635 5803 -5454 248676
19068 81700 168999 -97633 75531 272229 -82986 115564 -217796 60268 1350 -74174 186398
19056 82620 107364 -171073 320650 55530 -395912 -15065 -186885 -145699 59526 -49356 -102478
19045 -102478 36511 -115010 -218952 61963 -392992 298882 -133471 42317 -122380 -66013
19035 -66013 -133729 -54235 -14661 -35262 52956 -6113 120706 115331 158731 85454 -355851 -288446
19023 -288446 -131495 -293281 -192083 8626 140636 138162 -9568 -33357 64463 -40648 -417025
19012 -417025 -72687 -377119 -84038 -130898 71334 -336981 -11848 247312 -34263 73205 18536
19000 113682 -150943 103419 182598 80816 -51617 -15292 22402 201430 -194440 -70281 53313
$$ packed form
19081b89413d126l1735p0813j4190A3969K35543f36628G167a64635E803e454B48676
19068H1700Q7299i7633G5531J96698h2986A15564b17796F0268A350g4174A86398
19056H2620K4744a71073C20650E5530c95912a5065j71820M1186E9526d9356n3122
19045a02478C6511a15010j03942F1963c92992B98882a33471D2317a22380N6367
19035f6013o7716e4235a4661k0601E2956f113A20706n375M3400p3277c55851O7405
19023b88446a31495j61786J01198H626J32010k474i568k3789F4463d0648l76377
19012d17025g2687l04432h4038m6860G1334c36981a1848B47312c4263G3205A8536
19000A13682a50943A03419P9179H0816e1617a5292B2402J79028a94440g0281E3313
$$ plain form
18988 -167894 222776 190272 85932 -106839 -108991 -79467 77647 -228543 -198303 -11963 -168475
18977 -168475 -114059 -19421 -53916 -396899 87099 -235597 -380673 189120 -5958 217284 127800
18966 127800 132876 114932 -158078 -160253 -206331 -23722 435397 -114498 207713 -122534 -378706
18955 -378706 -134 73581 313903 281266 127756 -23706 71494 -52163 21126 241341 -140470
18943 -209391 113753 3629 -289029 -291695 81768 -198767 -154399 -79414 -23577 -20282 17249
18931 296646 -178257 153643 -21912 -134084 -49398 -2027 19994 84178 -373346 -66395 -133159
18920 -133159 -87335 -232039 11138 -248639 176598 -112498 -22601 -326296 -174883 -99847
18910 -99847 -185519 -269157 351398 -92055 -181008 -56 -59859 125723 -217908 -70428 156456
$$ packed form
18988a67894B22776l2504H5932a06839k152K9524G7647b28543L0240a1963j56512
18977a68475N4416a9421l4495l42983H7099b35597j45076A89120e958B17284q9484
18966A27800N076j7944a58078k175m6078b3722D35397a14498B07713a22534k56172
18955c78706a34G3581K40322l2637A27756b3706G1494e2163B1126K20215a40470
18943b09391A13753C629b89029k666H1768a98767M4368P4985b3577L295A7249
18931B96646a78257A53643b1912j12172d9398b027A9994O4184c73346f6395o6764
18920a33159M5824j44704A1138b48639A76598a12498b2601l03695J51413P5036
18910i9847q5672q3638C51398i2055q8953e6n9803A25723b17908g0428A56456
$$ plain form
18898 45138 -162955 -89189 -150010 -259753 240035 -62305 172081 -84672 -192619 -54667 -341642
18887 -341642 118842 307282 -23491 -98901 -356542 318408 89053 -192306 18506 -176839
18876 -179238 -396166 203989 83458 -48473 -58022 -313687 18684 -128926 -239963 391655
18865 112573 -224026 -33248 -102282 165488 -57932 -232635 34186 -226655 -279135 -469219
18855 -469219 -63445 -57453 -6036 -87111 263956 -7562 193874 -30445 219247 52915 -81321
18843 -238250 -226122 -263915 -232346 271374 88504 20696 210719 13354 398035 -257663 -12365
18831 295984 216246 42362 -276709 -100040 -8566 -33726 55075 -104953 -43039 140910 156515
18820 156515 150019 32519 -112975 -110683 137778 -31277 -25353 119329 40624 498222 53478
$$ packed form
18898D5138a62955P3766o0821j09743B40035f2305A72081h4672j07947e4667k86975
18887c41642A18842J88440b3491p5410k57641C18408H9053a92306A8506a76839
18876a79238k16928B03989H3458d8473r549k55665A8684a28926j11037C91655
18865A12573b24026c3248o9034A65488e7932j74703C4186b26655n2480j90084
18855d69219f3445N992f036q1075B63956g562A93874c0445B19247E2915h1321
18843b38250J2128l7793L1569B71374H8504B0696J90023A3354L84681b57663a2365
18831B95984p9738D2362b76709a00040h566k5160E5075a04953d3039A40910J5605
18820A56515o496C2519a12975K292A37778c1277N924A19329D0624M57598E3478
$$ plain form
18808 -88757 164075 -74214 146221 -16970 -28100 -217543 31652 90794 8388 -73743 -161607
18797 -161607 -120158 -367957 -208741 76145 68739 128829 60962 -367649 285525 49275 -29563
18785 -400499 -61473 -204423 -194805 352209 -90570 -120217 11832 -70429 54392 149629 155823
18774 155823 68698 100115 257617 43541 164823 -135196 439843 -287454 -467454 -105613
18763 -115514 -286754 -317039 112032 -80405 -207949 169128 51937 315200 -234331 175295
18752 -267414 -278974 -79774 80311 -309517 49975 465254 138567 -10124 246419 23564 48714
18741 48714 -138962 -110089 -366504 -203315 -109003 -25066 316169 4886 -265926 -174037 6246
18729 282481 268596 -36471 -67033 141471 26130 71092 -303874 -180647 -364489 -126606
$$ packed form
18808h8757A64075g4214A46221a6970j1130j89443C1652N9142H388g3743q7864
18797a61607M1449k47799J59216G6145p406O0090F0962c67649B85525D9275b9563
18785d00499f1473j42950R618C52209i0570k9647A1832g0429E4392R5237O194
18774A55823F8698L1417J57502D3541J21282a35196D39843b87454j80000a05613
18763a15514j71240l0285A12032h0405j27544A69128E1937K63263b34331A75295
18752b67414j1560g9774H0311c09517D9975M15279A38567a0124B46419B3564K5150
18741D8714a38962K8873k56415J63189R4312b5066C16169D886b65926R1889F246
18729B82481j3885c6471l0562A41471B6130M4962c03874J23227j83842a26606
$$ plain form
18718 -279351 27469 -346517 288830 158923 -343206 233065 -81492 -320038 486 -20192 119307
18706 -244604 -187065 -168678 -251527 109569 13677 -47239 -180676 46069 -90753 12883 -127293
18694 -193976 -57705 -274006 -128064 -21387 -152285 24794 107824 -186390 -242638 -262155 -443988
18683 -443988 -227582 -209693 -116246 -9899 341153 10040 -400498 -70227 -47746 208856 -131051
18671 -141984 -46104 -213529 -294205 -43155 227855 -27278 -160083 310493 -278130 -122446
18660 88492 62428 68868 -47392 -178503 3916 -54083 -310099 -49642 149075 54266 -47792
18648 67487 -86520 239745 -231856 -237111 -231792 -154952 -13269 103040 -270870 -317026 135523
18636 -42483 218174 -164080 -68567 -10466 -38758 292171 41592 -146165 130353 -186346
$$ packed form
18718b79351B7469c46517B88830j29907c43206B33065h1492k38546D86b0192A19307
18706b44604N7539J8387q2849A09569A3677d7239j33437D6069i0753A2883a27293
18694a93976e7705k16301a28064b1387j30898B4794Q3030a86390n6248j9517j81833
18683d43988K16406J7889R3447i899C41153A0040d00498g0227K2481B08856a31051
18671a41984d6104j67425q0676d3155B27855b7278j32805C10493b78130a22446
18660H8492k6064O440d7392j31111C916e4083k56016d9642A49075E4266d7792
18648F7487h6520B39745b31856n255N319P6840a3269A03040b70870m6156A35523
18636d2483B18174a64080f8567a0466k8292B92171D1592a46165A30353a86346
$$ plain form
18625 -193253 -295146 -222686 83426 -346197 204130 -260311 31056 -53307 38273 171311
18615 171311 16677 852 -179947 -235031 -23811 -427783 143008 691 -64898 86680 238535
18604 238535 109617 -16770 -96086 176238 73994 -401974 -160047 -461426 -276957 312413
18593 -179196 -54324 -239547 -204584 -324296 -6343 -79149 -146458 -33901 -90782 -170180 -58143
18581 85315 131620 -123260 -60156 -133121 -318029 39956 -175928 -375137 -46690 -70687 477720
18569 -236837 52987 84705 -257645 155007 -354381 -20845 -89263 -106868 159794 -180685
18558 -281051 -217602 120455 -65410 -80526 -80609 -101158 102258 228005 -193226 -128082 227157
18546 167560 -385615 -25972 -53899 -76229 271436 -3115 -203133 -213001 8203 -141729 -250508
$$ packed form
18625a93253j01893P2460H3426c46197B04130b60311C1056e3307C8273J33038
18615A71311A6677H52a79947n5084b3811m03972A43008F91f4898H6680J51855
18604B38535A09617a6770p9316A76238G3994d01974a60047l01379J84469C12413
18593a79196e4324j85223L4963j19712f343p2806o7309c3901n6881p9398e8143
18581H5315M6305a23260f0156p2965j84908C9956a75928j99209d6690k3997D77720
18569b36837E2987L1718b57645A55007c54381b0845o8418j7605A59794a80685
18558b81051O3449A20455f5410j5116q3k0549A02258J25747a93226O5144B27157
18546A67560c85615b5972k7927k2330B71436c115k00018r868H203a41729j08779
$$ plain form
18535 -250508 -68820 -185362 142407 250800 -329977 14634 15782 222269 -223166 7679 -487157
18523 -209524 -224355 -75113 -154496 16120 -216273 -151058 -94120 -191298 -209708 -526149 -31037
18511 325862 96788 59438 -62553 -58078 4977 -46299 -159407 -362046 -410489 -38018 -102258
18500 -102258 -337900 69927 -57627 -7426 -91590 -201895 -25855 267976 103844 -428360 -170897
18488 2343 -59285 -26700 135556 325320 -65118 -54044 -47302 155028 73617 -30487 -71660
18477 -71660 -95785 39920 55174 83758 -133679 154899 -138048 75386 41039 36332 -199352
18465 -122136 -164420 183513 -207257 81836 -53050 61428 48319 171941 -199790 -136492 -8246
18453 241556 18767 -231448 -249354 -41350 -83591 -57970 -57364 -225016 -12519 -159286 11675
$$ packed form
18535b50508f8820j16542A42407J08393c29977A4634J148K06487b23166G679d87157
18523b09524j4831g5113p9383A6120b16273O5215N6938r7178j8410l16441c1037
18511C25862I6788l7350f2553M475D977d6299j13108k02639m8443c8018o4240
18500a02258k35642F9927e7627g426q4164j10305b5855B67976A03844d28360a70897
18488B343e9285b6700A35556J89764f5118J1074O742A55028G3617c0487m1173
18477g1660k4125C9920J5254K8584a33679A54899a38048G5386l4347m707a99352
18465a22136m2284A83513b07257H1836e3050F1428j3109J23622a99790O3298h246
18453B41556A8767b31448j7906d1350m2241K5621O06j67652a2519j46767A1675
$$ plain form
18441 98534 -196895 28357 -111522 -207817 -154301 38143 59 55081 288832 -290431 8145 -113758
18428 -115467 345089 -357793 -361823 257147 -138258 -311414 -246303 94816 -181234 290816
18417 84558 -334293 -164811 70336 65587 -83611 -209983 207156 294167 79238 45956 -138874
18405 539125 309960 69587 113415 -56144 -6185 -203940 -55368 -305955 -91678 -165983 98794
18393 -346008 102005 -42046 -21016 249060 214230 216951 -57815 -190473 -404395 -130405 72567
18381 -330986 -276239 23999 -115909 397943 331620 43190 -115812 -126412 141318 14133 -62873
18369 -251587 -91308 -66291 -163967 -33243 30192 -152438 -72459 -22043 230457 28388 335373
18358 335373 -179830 229289 -282869 -49517 34722 -86979 -96831 343504 -282834 313732
$$ packed form
18441I8534a96895B8357a11522r6295N3516C8143E9N5022K33751b90431H145a13758
18428a15467C45089c57793m030B57147a38258j73156O5111I4816a81234B90816
18417H4558c34293a64811G0336m749h3611j26372B07156Q7011G9238l3282a38874
18405E39125k29165F9587M3828e6144f185j97755e5368k50587i1678p4305I8794
18393c46008A02005d2046b1016B49060l4830K721e7815j32658k13922a30405G2567
18381c30986N4747B3999a15909C97943o6323D3190a15812j0600A41318A4133f2873
18369b51587i1308K5017r7676c3243C0192a52438g2459b2043B30457B8388L06985
18358C35373a79830B29289b82869d9517C4722h6979r852C43504b82834C13732
$$ plain form
18347 -311498 -9556 -4595 19545 -35455 9744 7404 -266054 65410 -128816 42865 -62465 -1429
18334 46782 -123222 213372 14589 66776 92240 -170770 33240 -57676 -77242 14624 -295818
18322 2228 -33834 -228378 -9047 -49401 -113773 -108989 -29218 172430 -33087 83585 529178 -270859
18309 -62881 -196041 -85984 -136043 91922 -396982 -224611 169358 -98582 -294809 -50478 -348931
18298 -348931 -4853 -178077 -51467 -103945 150251 -15777 -324400 32935 -146229 38644 -187905
18286 187945 -410484 59343 -198171 121366 -239979 -315449 311026 115189 126079 -52317
18275 -135262 -236650 -134428 -256416 -155633 -428620 252275 224820 70984 -150071 60380
18264 51212 63331 174458 57618 191 -247411 -142466 -2142 175968 87673 -25732 -253103
$$ packed form
18347c11498i556d595A9545c5455I744k340b66054F5410a28816D2865f2465a429
18334D6782a23222B13372A4589N2187K5464a70770C3240e7676j9566A4624b95818
18322B228c3834j94544i047m0354o4372M784b9218A72430c3087H3585M45593b70859
18309f2881j33160h5984n0059I1922c96982J72371A69358i8582j96227e0478k98453
18298c48931d853j73224e1467n2478A50251a5777l08623C2935a46229C8644a87905
18286A87945d10484E9343a98171A21366b39979p5470C11026A15189J0890e2317
18275a35262j01388J02222j21988J00783k72987B52275k7455G0984a50071F0380
18264E1212J2119J11127E7618A91b47411J04945b142A75968H7673b5732k27371
$$ plain form
18253 -253103 188023 -44896 -99216 -59013 -116810 102629 -187240 -189302 -129013 164958 69521
18241 79856 55878 241105 94686 65735 263574 -38442 -14947 -94546 204253 179834 -228403
18229 -376176 -73368 45622 -657481 -124647 -224418 118103 159721 203323 -192588 -208072 -319057
18218 -319057 187661 -63842 -78733 112527 -172420 -79338 315771 -38065 -73461 -255455
18208 -255455 -34743 -289536 -86463 -1260 229023 124362 73294 -270795 -178149 -213538 -150039
18197 -150039 -84409 -55263 -145067 -275326 177183 31840 -46947 -150116 10666 46726 385903
18186 385903 -141465 -261585 24557 -277667 353476 119368 -84127 -64692 13473 138219
18176 138219 54697 2903 -260799 66459 -18641 214033 -33298 218313 73082 163697 -25422
$$ packed form
18253b53103A88023d4896n4320M0203n7797A02629a87240k062O0289A64958F9521
18241G9856k3978J85227I4686k8951J97839c8442a4947p9599B04253k4419b28403
18229c76176g3368D5622f57481a24647r9771A18103M1618M3602a92588j5484j10985
18218c19057A87661f3842j4891A12527a72420g9338C15771c8065l5396j81994
18208b55455c4743k54793h6463a260B29023j04661n1068b70795R2646l5389O3499
18197a50039O5630K9146q9804j30259A77183C1840d6947j03169A0666L6060L39177
18186C85903a41465j20120B4557b77667C53476A19368h4127J9435A3473J24746
18176A38219E4697B903b60799F6459a8641B14033c3298B18313G3082R0615b5422
$$ plain form
18164 -15527 -25906 293652 -280922 -379704 -4687 -61899 -184056 -99475 36454 -121569 7218
18152 -321942 -33710 91000 -43885 72028 99353 -71369 -247923 -30085 88623 97331 43990
18140 -97943 -1629 92623 402209 -166610 -57978 12470 38191 -157009 -333982 -80599 317447
18128 285363 -75438 -31593 310864 -97658 -371893 -38792 -165037 -39764 169280 -112010
18117 -72356 192373 -256477 74631 140338 -171597 32767 -209549 -218436 -133170 316546 -84388
18105 190839 -100134 336505 -54891 -132375 17753 -70 29694 -23909 64008 -167591 121744
18093 -3928 37958 -155663 93874 -503614 -246658 -90170 27654 304146 -139394 163975 192742
18082 192742 120039 -94466 36667 20435 73900 21275 -134022 -48669 -87240 -94662 248221
$$ packed form
18164a5527j0379B93652b80922r8782d687n7212j22157Q4581C6454a21569G218
18152c21942c3710I1000d3885G2028K7325g1369j76554c0085H8623Q708D3990
18140i7943a629I2623L09586a66610e7978A2470K5721a57009j76973h0599C17447
18128B85363g5438c1593C10864i7658k74235c8792j26245c9764A69280a12010
18117g2356A92373b56477G4631O5707a71597C2767b09549q887Q5266C16546h4388
18105A90839a00134C36505e4891p7484A7753g0B9694b3909F4008a67591A21744
18093c928C7958a55663I3874e03614b46658i0170B7654K76492a39394A63975K8767
18082A92742p2703i4466C6667j6232N3465B1275a34022d8669l8571p422B48221
$$ plain form
18070 -471817 263957 -161679 -90978 -46642 -40541 38249 -47981 78609 38802 102237 104303
18059 104303 366604 -79901 -26581 -122387 -83631 -193350 30060 95319 36870 -131837 302410
18047 8174 16103 28040 93446 -137195 259520 -54911 -207307 143570 44777 107500 -230702
18035 -295545 -150387 -83122 -262784 150445 123993 102361 -503492 147546 -381128 278755
18024 3671 -83440 190054 236520 -343214 158169 25395 84536 -45197 7266 28461 278059
18013 278059 -161998 124304 166801 7047 225718 66226 45297 -15424 319728 -31226 -247250
18002 -247250 -301925 -215653 72816 -63279 -171467 120526 13604 67360 445716 -116412 79182
17990 21412 71477 -292737 93956 -118280 -12449 -203010 396973 -94446 -166025 111636 -116902
$$ packed form
18070d71817B63957a61679P0701M4336O101C8249d7981G8609C8802O3435K066
18059A04303K62301g9901b6581r5806L8756j09719C0060O5259C6870a31837C02410
18047H174P929J1937O5406a37195B59520e4911j52396A43570D4777O2723b30702
18035b95545J45158O7265j79662A50445k6452k1632e03492A47546c81128B78755
18024C671h3440A90054M6466c43214A58169B5395N9141d5197G266K1195K49598
18013B78059a61998A24304M2497G047K18671F6226k0929a5424C19728c1226k16024
18002b47250n4675Q6272G2816f3279j08188A20526A3604N3756L78356a16412G9182
17990B1412N0065b92737I3956a18280a2449j90561C96973i4446p1579A11636a16902
$$ plain form
17978 -98881 -183610 -86191 63313 245239 30474 272269 -319449 -267539 232162 -72297 38183
17966 -216804 39557 230667 -295625 65536 190201 218906 -89163 -136701 160058 233557 -97014
17954 -22111 216443 -92262 43938 -83963 -29774 -90067 -124669 -356664 78377 -200547 97001
17942 -55416 92663 -250448 5587 128320 66994 2420 -128909 -16998 86020 181013 -208868
17930 162746 13387 71032 -3780 87865 17348 -532964 228168 -52096 9800 66084 82139
17919 82139 40433 208547 -15605 -36389 -191667 -217763 263602 336146 90782 -19241 -79601
17908 -79601 -5414 -55476 -239632 61224 -213896 -143813 139556 141944 89107 71287 -169901
17896 50007 -214410 139308 39176 -111051 593 -193147 18134 -243674 -232703 -225765 366331
$$ packed form
17978i8881q4729h6191F3313J81926C0474K41795c19449N1910B32162g2297C8183
17966b16804C9557J91110b95625F5536J24665K8705h9163m7538A60058P3499i7014
17954b2111B16443i2262D3938h3963b9774o0293l4602k31995G8377b00547I7001
17942e5416I2663b50448E587J22733o1326B420a28909a6998H6020R4993b08868
17930A62746A3387N7645c780H7865A7348e32964B28168e2096I800N6284J6055
17919H2139D0433J68114a5605k0784j55278k6096B63602P2544I0782a9241o0360
17908g9601e414n0062j84156F1224b13896P0083A39556K388n2837j7820a69901
17896E0007b14410A39308C9176a11051E93a93147A8134b43674J0971O938C66331
$$ plain form
17884 -55816 -72693 328640 260547 145781 419094 -261264 175027 -235106 247012 88840
17873 81957 66524 64513 -102556 -57519 264186 -352937 -33069 -43596 183913 3781 12225
17862 12225 125478 240974 -137119 4094 20091 7323 -414903 -168867 -65583 4573 172350
17851 172350 -308888 -168376 -428299 -72146 -20155 -109916 164663 -99703 -214434 -11455
17840 73665 -504718 31805 -433710 207616 67012 132163 85577 -340013 -7634 23500 -349777
17828 44579 161074 -64133 48963 66703 -247675 86443 255152 88061 289429 -2732 147504
17816 -13092 124478 183630 -130860 -106557 70321 105993 139079 21478 -38958 303981 -184666
17804 -93663 452745 -263711 73516 -102911 -285234 4625 258823 -77175 169755 33927 366497
$$ packed form
17884e5816j6877C28640o8093j14766K73313b61264A75027b35106B47012H8840
17873H1957j5433k011a02556M5037B64186c52937c3069j0527A83913C781Q444
17862A2225J13253J15496a37119D094J5997G323d14903a68867f5583D573J67777
17851A72350c08888J40512k59923g2146b0155q9761A64663i9703j14731a1455
17840G3665e04718C1805d33710B07616F7012O5151m6586c40013g634B3500c49777
17828D4579J16495f4133D8963J7740b47675H6443J68709H8061K01368b732A47504
17816a3092A24478N9152a30860K4303G0321L5672L3086B1478c8958C03981a84666
17804i3663D52745b63711G3516a02911j82323D625K54198g7175A69755C3927L32570
$$ plain form
17793 366497 136833 -261797 -47142 -271678 -229584 153393 -89608 268966 154327 134287
17783 134287 122017 -11423 -111416 -61039 42686 -36994 -71897 236482 -42993 46256 2189
17771 249569 -168082 146160 107476 -348908 -208320 58609 -171423 64008 -104760 92006
17760 -98085 221028 -102437 -107125 -79668 220853 196604 -95926 67302 -112408 -197410 252840
17748 -189419 66174 146370 167684 292292 -59595 -149020 96936 350912 -120442 342255 133303
17736 19368 -118242 -146236 -209055 -84142 -126373 527379 32946 -110820 188568 155709 -304267
17724 219629 -9366 117203 -11146 -55691 100491 -33182 140863 -24211 155069 201554 -92299
17712 305213 384513 315643 -86310 61131 -116313 -344723 95072 -125321 258668 115005
$$ packed form
17793C66497A36833b61797d7142k24536M2094A53393h9608B68966j14639k0040
17783A34287j2270a1423r9993N0377D2686c6994l4903B36482d2993D6256B189
17771B49569a68082A46160l8684c48908J40588E8609a71423F4008a04760I2006
17760i8085B21028a02437m688K7457B20853k4249i5926F7302a12408q5002B52840
17748a89419F6174Q0196K1314J24608e9595q9425I6936K53976a20442C42255A33303
17736A9368a18242k7994o2819h4142m2231E27379C2946a10820A88568l2859c04267
17724B19629i366A17203a1146m4545A00491c3182A40863b4211A55069M6485i2299
17712C05213P9300o8870h6310F1131a16313k28410I5072a25321B58668A15005
$$ plain form
17701 -200884 -31856 -94214 -1342 184525 -300057 -26024 334644 -57806 -110958 81139 8097
17689 282176 -105269 37983 -53126 -75239 202250 -75855 -206923 56408 -100357 -61292 115132
17677 112604 -112738 40737 116199 84591 110843 -87207 183635 22746 -90744 145322 -269450
17665 108621 244476 -204329 377239 -172862 -109864 245552 67838 -367965 -194936 277419
17654 -109677 -182582 -223717 -176602 40782 63563 35577 -78537 137844 186602 317128 176700
17643 176700 50585 175500 -33786 -135078 -74488 -235776 -17902 -276537 329710 158011
17632 -59225 -96890 213504 235082 -390470 431861 353145 -276376 157399 31919 -31584 567757
17620 26829 223410 -197843 -85297 -244267 217578 1754 249427 -34405 223228 267003 -123679
$$ packed form
17701b00884c1856o2358a342A84525c00057b6024C34644e7806n3152H1139H097
17689B82176a05269C7983e3126k2113B02250g5855j31068E6408a00357L9065A15132
17677A12604a12738D0737P5462l1608K6252h7207A83635B2746i0744A45322b69450
17665A08621J35855b04329C77239a72862O2998B45552F7838c67965J73029B77419
17654a09677p2905m1135M7115D0782K2781k7986g8537A37844M8758J30526j40428
17643A76700E0585J24915c3786j01292O0590j61288a7902k58635C29710A58011
17632e9225l7665B13504K1578c90470D31861p8716b76376A57399C1919c1584E67757
17620B6829J96581a97843h5297j58970B17578A754K47673c4405B23228M3775a23679
$$ plain form
17608 -75710 34243 -201474 -54358 270268 -94010 -253664 -1173 -132852 -286090 -83671 39049
17596 -1679 -189080 70699 35624 -94948 197482 86407 88037 -24924 26391 -199532 -224590
17585 -224590 -14266 -41025 174250 38681 466298 194808 279444 -71548 7015 -132807 188298
17573 225352 45298 -8335 -346308 451459 -45612 -85749 -47761 -48618 -93527 -15967 134386
17561 -59828 137619 -264950 122977 293809 251567 -126 -26234 36667 -256157 -227336 293074
17549 -116402 -1703 270466 137616 279770 398747 57024 173030 309029 9336 174562
17539 174562 22034 -25776 422563 -259592 56722 -96037 175502 296879 -10555 101823
17528 -162865 216901 -20286 -1906 39030 459416 297407 -117008 240516 117830 -96266
$$ packed form
17608g5710C4243b01474e4358B70268i4010j59654a173j31679j53238h3671C9049
17596a679j87401G0699l5075i4948A97482H6407J630b4924B6391a99532k5058
17585b24590a4266k6759A74250C8681M27617A94808Q4636g1548G015a32807A88298
17573B25352D5298h335l37973D51459d5612m0137L7988q57m4909a5967A34386
17561e9828A37619b64950A22977J70832m2242a26k6108C6667b56157K8821B93074
17549a16402a703B70466j32850J42154J18977E7024J16006J35999I336J65226
17539A74562B2034b5776D22563b59592E6722i6037A75502J21377a0555A01823
17528a62865B16901b0286a906C9030M20386j62009a17008B40516A17830i6266
$$ plain form
17517 -113992 10505 147026 142001 12300 74824 -9792 172947 217802 272255 181760 -28870
17505 -141543 50286 157840 214545 -313747 -446415 65966 -191357 -70077 250675 185189
17495 185189 -222828 -124507 66310 121052 427576 455128 45453 -163406 89278 341485 442696
17484 442696 243985 184621 406264 84201 220175 296609 -20053 182656 117227 169852 121883
17473 121883 255066 87237 262765 -69402 203653 492419 -49270 -188404 178606 -25405
17462 192791 -89745 195693 20486 126646 88914 108325 16373 51587 323653 -11306 75151
17450 139954 316044 159280 145347 378476 351209 148183 -90149 -101384 287702 207967
17440 207967 169958 98840 372671 510074 -191557 -4458 104404 105668 434550 278109 389146
$$ packed form
17517a13992A0505J36521n025A2300O2524i792A72947M4855N4453r0495b8870
17505a41543E0286J07554N6705c13747j32668F5966a91357g0077B50675o5486
17495A85189b22828R8321F6310N4742L06524K7552D5453a63406H9278K52207J01211
17484D42696j98711n9364K21643H4201J35974P6434b0053A82656o5429N2625m7969
17473A21883J33183H7237J75528f9402B03653K88766d9270j39134A78606b5405
17462A92791h9745A95693B0486J06160l7732J9411A6373L5214K72066a1306G5151
17450A39954J76090j56764j3933K33129k7267A48183i0149j1235B87702p9735
17440B07967l8009p1118K73831J37403a91557d458A04404J264L28882j56441J11037
$$ plain form
17429 389146 230852 -98660 405682 50106 353101 510381 313613 190228 255352 606873
17419 606873 27868 361365 188248 374280 228437 232920 41115 10851 295803 -48272 212505
17407 70845 26845 241853 273073 390108 201528 333299 208352 15540 200585 31718
17396 -191296 319316 186243 94251 154030 338620 469972 443102 421442 295758 -66859
17385 83992 -300916 174972 23494 66349 424641 85723 196523 126488 85352 51923 285612
17374 285612 -78595 107180 191905 268899 98494 36356 181358 -57629 160591 323930 -286260
17362 -40847 38697 -76447 182940 358671 -42355 88951 -232166 86575 106561 143539 104010
17351 104010 436588 315159 105682 219138 8685 73798 443552 17362 185806 371394
$$ packed form
17429C89146j58294i8660D05682E0106L02995J57280j96768j23385O5124L51521
17419F06873B7868L33497j73117J86032j45843M483D1115A0851K84952d8272B12505
17407G0845B6845K15008L1220J17035j88580J31771j24947A5540J85045C1718
17396a91296C19316j33073r1992N9779J84590J31352k6870k1660j25684f6859
17385H3992c00916A74972B3494M2855L58292H5723J10800p0035m1136l3429K33689
17374B85612g8595A07180Q4725P6994I8494C6356J45002e7629A60591J63339b86260
17362d0847C8697g6447A82940J75731d2355H8951b32166H6575J9986L6978l9529
17351A04010L32578j21429A05682J13456H685O5113L69754A7362J68444J85588
$$ plain form
17341 371394 235553 195209 460279 291924 136088 16382 208515 293402 273639 188663
17331 188663 133378 -112994 66182 -85040 251312 189399 2317 88615 -227548 347562 381054
17320 381054 161603 476753 466282 42913 -82653 167448 369500 199679 -113412 188260
17309 145513 53812 266244 -307615 172170 -86256 349615 958102 190442 506261 452061
17299 452061 362083 160432 510151 -96122 200195 190933 430017 222798 158433 577612
17289 577612 213691 183827 6419 60755 160405 373268 259354 176702 129367 71522 118529
17278 118529 -56907 472322 184803 166107 66674 129779 233379 52949 263002 226853 154202
17267 154202 113686 393433 408513 43937 178456 -207236 427708 110200 187072 373503
$$ packed form
17341C71394j35841m0344K65070j68355A36088A6382J92133Q4887j9763q4976
17331A88663n5285a12994F6182h5040B51312o1913B317Q6298b27548C47562L3492
17320C81054A61603L15150j0471D2913h2653A67448K02052j69821a13412A88260
17309A45513E3812K12432c07615A72170h6256C49615O08487A90442L15819n4200
17299D52061q9978A60432L49719i6122B00195r262K39084k07219o4365M19179
17289E77612B13691k9864F419N4336R9650K12863j13914q2652m7335n7845M7007
17278A18529e6907D72322A84803j8696F6674O3105J03600E2949K10053l6149p2651
17267A54202m0516K79747J5080D3937J34519b07236D27708A10200P6872J86431
$$ plain form
17257 373503 -83022 490790 257414 116779 286502 394856 290929 315662 272383 105221
17246 401367 273210 305064 -74356 100017 294474 251467 374896 -39489 159157 47854
17235 615547 65988 330697 148429 85830 278218 156388 261493 170473 337310 231664
17225 231664 237232 764463 165636 120203 40375 90587 41779 286405 287640 -46915 160076
17213 205689 158637 191733 244160 161879 126168 250114 -66983 107380 201742 305454 388889
17202 388889 -27702 385441 176320 197714 587591 355961 17594 292883 194555 103353
17192 103353 178267 265461 358980 229644 433680 451834 460309 529717 184793 178965 474184
17181 474184 402342 102932 154979 -64856 324718 602650 100270 177520 510329 144014
$$ packed form
17257C73503h3022D90790k33376A16779J69723J08354j03927K4733m3279A05221
17246D01367j28157L1854g4356A00017J94457m3007J23429c9489A59157D7854
17235F15547F5988K64709A48429o2599J92388j21830J05105r1020J66837j05646
17225B31664N568N27231A65636m5433D0375N0212D1779K44626J235d6915A60076
17213B05689m7052L3096N2427q2281l5711J23946f6983A07380R4362J03712Q3435
17202C88889b7702C85441A76320K1394L89877k31630A7594K75289r8328r1202
17192A03353P4914Q7194R3519j29336K04036J8154Q475O9408A84793n828K95219
17181D74184p1842A02932N2047f4856C24718K77932A00270P7250L32809A44014
$$ plain form
17170 398522 292061 311440 300071 227632 291345 652668 338730 218695 369234 118498
17159 472953 167636 92248 398351 259078 227024 243933 419685 125214 -40831 455921
17148 477321 262128 183603 215864 519290 74727 404276 372656 336646 323232 150120 -104756
17136 373209 262608 491702 520473 441177 459411 178916 637489 167638 436167 135728
17125 458522 713353 272329 435426 498584 422269 404537 419817 405910 512145 -142450
17114 707892 504748 182272 388096 540488 217916 729901 339786 307343 650029 684146
17104 684146 562599 538925 312083 501668 156874 573828 279598 270950 633863 418533
17094 418533 331533 224302 158745 646292 459481 412211 363607 344376 183339 341923
$$ packed form
17170C98522j06461J9379j1369p2439O3713L61323l13938j20035J50539A18498
17159D72953A67636p5388L06103j39273l2054J6909J75752A25214d0831D55921
17148D77321k15193p8525L2261L03426G4727L29549l1620l6010j3414A50120a04756
17136C73209j10601K29094K8771p9296J8234A78916M58573A67638K68529A35728
17125D58522K54831B72329J63097O3158p6315j7732J5280j3907J06235a42450
17114G07892k03144A82272K05824J52392B17916N11985C39786l2443L42686L4117
17104F84146j21547k3674k26842J89585A56874M16954B79598q648L62913k15330
17094D18533q7000j07231o5557M87547j86811m7270m8604j9231j61037J58584
$$ plain form
17084 341923 629524 478615 536118 339472 629672 841440 147932 788231 601281 641015
17074 641015 694908 511108 388664 431488 435271 654381 422765 296066 518532 623442
17064 623442 508307 602482 773590 660169 686059 295649 431702 476615 456456 671204
17054 671204 646865 826667 608790 534977 572968 307712 446786 662706 567793 751419
17044 751419 845007 698607 550831 588381 897130 565901 570730 652453 620909 897354 475889
17033 475889 702515 587202 556462 580043 1027271 687301 841331 641272 742602 1036211
17023 1036211 671013 1307096 866169 540101 655888 797060 1025289 1370030 488994
17013 794114 854516 812214 476909 769981 936163 604081 545694 1104423 549054 716236
$$ packed form
17084C41923K87601j50909N7503j96646K90200K11768A47932O40299j86950L9734
17074F41015N3893j83800j22444M2824L783K19110k31616j26699K22466J04910
17064F23442j15135R4175J71108j13421K5890B95649J36053M4913k0159K14748
17054F71204k4339J79802k17877p3813L7991k65256J39074K15920r4913J83626
17044G51419R3588j46400j47776L7550L08749l31229M829Q1723l1544K76445m21465
17033D75889K26626j15313l0740K3581M47228l39970J54030k00059J01330K93609
17023A036211l65198O36083m40927l26068J15787J41172K28229L44741D88994
17013G94114O0402m2302l35305K93072J66182l32082n8387N58729E49054J67182
$$ plain form
17003 716236 595103 1055443 842543 930521 982688 618964 967545 827568 530774 612530
16993 612530 618986 994976 923959 1044638 679023 1147688 1040435 653189 1119102 766644
16983 766644 1310680 663174 1006534 1049378 847987 1287858 1097088 525468 1164622 1010672
16973 1010672 1165167 1143063 1052309 1099501 1378748 1205149 1033320 802047 1141460 1172100
16963 1172100 927658 1202083 1206395 1369367 775941 904201 911000 906511 1116285 1549750
16953 1549750 1409295 988699 1203077 1480083 1086273 1237589 1091947 1436884 1411478 1379373
16943 1379373 1127598 1075079 1297359 1492804 1330914 1432903 1319889 1026153 1380257 1417350
16933 1417350 1423166 1320862 1339083 1341081 1411668 1604960 1588488 1811952 1298792 1834670 1714634
$$ packed form
17003G16236j21133M60340k12900Q7978N2167l63724L48581j39977k96794Q1756
16993F12530O456L75990p1017J20679l65615M68665j07253l87246M65913l52458
16983G66644N44036o47506L43360M2844k01391M39871j90770E25468O39154j53950
16973A010672J54495k2104r0754M7192K79247j73599j71829k31273L39413L0640
16963A172100k44442K74425M312J62972n93426J28260O799m489K09774M33465
16953A549750j40455m20596K14378K77006l93810J51316j45642L44937k5406l2105
16943A379373k51775n2519K22280J95445j61890J01989j13014k93736L54104L7093
16933A417350N816j02304J8221J998P0587J93292j6472K23464n13160N35878j20036
$$ plain form
16922 1714634 1572325 1728200 1770969 1666366 1589989 1641641 1246161 1525560 1379396 1827494
16912 1827494 1609684 1864278 1628795 1706895 2020549 1683795 1563531 1735090 1805977 2205751
16902 2205751 1895868 2273761 1974317 2011908 1950437 2201283 2010570 2408463 2047413 2261582
16892 2261582 1807509 2314917 1956005 2015860 1951337 1975092 2545732 2629123 2402486 2409115
16882 2409115 2571712 2319167 2627993 2430019 2687589 2840010 2457010 2806436 2822244 2660223
16872 2660223 2676228 2798798 2981698 2554971 2662520 3244526 3051049 2840289 3080617 3447899
16862 3447899 3100625 3174050 3005920 3053324 3526230 3275953 3419530 3440244 3281143 3853389
16852 3853389 3580204 3702197 3563680 3567273 3677304 4202843 3927536 3948643 4218782 4142838
$$ packed form
16922A714634j42309J55875M2769j04603p6377N1652l95480K79399j46164M48098
16912A827494k17810K54594k35483P8100L13654l36754j20264J71559P0887L99774
16902B205751l09883L77893k99444L7591o1471K50846j90713L97893l61050K14169
16892B261582m54073N07408l58912N9855o4523K3755N70640Q3391k26637O629
16882B409115J62597k52545L08826j97974K57570J52421l83000L49426J5808j62021
16872B660223J6005J22570J82900m26727J07549N82006j93477k10760K40328L67282
16862C447899l47274P3425j68130M7404M72906k50277J43577K0714j59101N72246
16852C853389k73185J21993j38517L593J10031N25539k75307K1107K70139p5944
$$ plain form
16842 4142838 4124304 4465652 4455073 4681306 4298501 4506729 4276358 4828506 4951603 4935821
16832 4935821 5112250 5334645 5367896 5154015 5032472 5631105 5317722 5515478 5824134 5715471
16822 5715471 6023091 5966802 6203432 6242432 6400677 6334095 6683559 6844262 6965295 7150987
16812 7150987 7310058 7392392 7545665 7341502 7778925 7738570 8254712 8046498 8481620 8769295
16802 8769295 8588546 8864315 9303959 9759963 9606790 9685527 10401163 10443270 10945804 10893135
16792 10893135 11421588 11659542 11680180 12044952 12450343 12466277 12909067 13269604 13579033 13923910
16782 13923910 14460002 15116484 15501710 15816267 16361831 17096033 17331931 18023723 18385224
16773 18385224 19174111 19807796 20195225 21102591 21935638 22428069 23549667 24326869 25443278
$$ packed form
16842D142838j8534L41348j0579K26233l82805K08228k30371N52148J23097j5782
16832D935821J76429K22395L3251k13881j21543N98633l13383J97756L08656j08663
16822E715471L07620n6289K36630L9000J58245o6582L49464J60703J21033J85692
16812G150987J59071Q2334J53273k04163M37423m0355N16142k08214M35122K87675
16802H769295j80749K75769M39644M56004j53173P8737P15636M2107N02534n2669
16792A0893135N28453K37954K0638L64772M05391J5934M42790L60537L09429L44877
16782A3923910N36092O56482L85226L14557N45564P34202K35898O91792L61501
16773A8385224P88887O33685L87429R07366Q33047M92431J121598P77202J116409
$$ plain form
16764 25443278 26198619 27206267 28299125 29174369 30616290 31887715 33387309 34277727
16756 34277727 36174315 37572638 39215065 40605525 42890589 44557176 46734799 49017386
16748 49017386 51505986 53789730 56560128 59446618 62632933 65796683 69450524 72755901
16740 72755901 77075862 81284011 85813475 89946904 95047222 100470296 106083425 111638029
16732 111638029 117687369 124204361 130725320 137524228 143672255 150966292 157520611 163654902
16724 163654902 170148964 175180877 180184514 184704991 187520735 190180917 191223164 191424975
16716 191424975 189967354 187957346 184825929 180634852 175766024 170288226 163854116 157306353
16708 157306353 150273766 143355071 136528779 129335030 122842096 116556373 110074382 103936638
$$ packed form
16764B5443278P55341J007648J092858Q75244J441921J271425J499594Q90418
16756C4277727J896588J398323J642427J390460K285064J666587K177623K282587
16748D9017386K488600K283744K770398K886490L186315L163750L653841L305377
16740G2755901M319961M208149M529464M133429N100318N423074N613129N554604
16732A11638029O049340O516992O520959O798908O148027P294037O554319O134291
16724A63654902O494062N031913N003637M520477K815744K660182J042247K01811
16716A91424975j457621k010008l131417m191077m868828n477798o434110o547763
16708A57306353p032587o918695o826292p193749o492934o285723o481991o137744
$$ plain form
16700 103936638 98535024 92927561 87745692 82759092 78376396 73988099 70289853 66603856
16692 66603856 62947589 59781595 56780349 54136152 51105562 48599196 46608142 43855013
16684 43855013 41873656 40021647 37907747 36786652 35096697 33308421 31942715 30504869
16676 30504869 29228954 28048495 27148625 25664466 25051517 24237378 23179931 22107446
16668 22107446 21262080 20910646 20303943 19327566 18440303 18285841 17528994 16869902 16255042
16659 16255042 16125544 15374876 14653398 14502957 14109171 13328237 13105588 12812631 12178617
16650 12178617 12308082 11871386 11243730 11136589 10764342 10719200 10201970 9800853 9913723
16641 9913723 9469752 9311234 9276619 9063031 8480284 7942463 8220937 7925352 7570565 7685455
$$ packed form
16700A03936638n401614n607463n181869m986600m382696m388297l698246l685997
16692F6603856l656267l165994l001246k644197l030590k506366j991054k753129
16684D3855013j981357j852009k113900j121095j689955j788276j365706j437846
16676C0504869j275915j180459q99870j484159o12949q14139j057447j072485
16668B2107446q45366l51434o06703r76377q87263j54462p56847o59092o14860
16659A6255042j29498p50668p21478j50441l93786p80934k22649k92957o34014
16650A2178617J29465m36696o27656j07141l72247m5142n17230m01117J12870
16641I913723m43971j58518l4615k13588n82747n37821K78474k95585l54787J14890
$$ plain form
16631 7685455 7585792 7235250 6701464 7076602 6547575 6634007 6542643 6054029 6245321 5923472
16621 5923472 6041927 5827746 5574671 5453263 5598444 5219222 5299811 5011863 5327086 4728611
16611 4728611 4610468 4739666 4613979 4326127 4027001 4785496 4364511 4147436 4161683 4070898
16601 4070898 4009172 4150272 3863115 3848912 3705424 3638096 3394146 3775650 3409607 3031195
16591 3031195 3216460 3114293 3200383 3497586 3149303 3173060 3273509 3255331 3073147 2743942
16581 2743942 2912650 2798007 2839022 2622055 2886414 2516859 2518082 2818381 2354851 2522946
16571 2522946 2717581 2822054 2248027 2534190 2410549 2358466 2082745 2213639 2347784 1930186
16561 1930186 2165185 2104301 1831346 2076067 2095587 1763372 2063047 1946886 2213409 1755149
$$ packed form
16631G685455r9663l50542n33786L75138n29027Q6432r1364m88614J91292l21849
16621E923472J18455k14181k53075j21408J45181l79222Q0589k87948L15223n98475
16611D728611j18143J29198j25687k87852k99126P58495m20985k17075J4247r0785
16601D070898o1726J41100k87157j4203j43488o7328k43950L81504l66043l78412
16591C031195J85265j02167Q6090K97203l48283K3757J00449j8178j82184l29205
16581B743942J68708j14643M1015k16967K64359l69555J223L00299m63530J68095
16571B522946J94635J04473n74027K86163j23641n2083k75721J30894J34145m17598
16561A930186K34999o0884k72955K44721J9520l32215K99675j16161K66523m58260
$$ plain form
16551 1755149 1906371 2003075 1652282 1969091 1721090 1931046 2014377 1886785 1411076 1513523
16541 1513523 1835255 1722983 1367837 1542940 1725418 1212906 1525288 1303084 1844440
16532 1844440 1414790 1528793 1449139 1598909 1607585 1469659 1541543 963372 1424456 1301718
16522 1301718 1461440 1294265 1132948 1166979 1288122 1218578 1379492 1512351 1368129 1029470
16512 1029470 1226771 918388 1258859 937854 1133020 977848 1233066 858313 1058669
16503 1058669 1216922 1219706 1047118 1381138 1195496 1025123 1390257 537950 785215 989869
16493 989869 798685 785825 1480608 640076 1060731 1042159 895270 1013549 1049050 1078283
16483 1078283 1119599 902838 1069275 685785 1140959 1297125 853029 577298 864147 575705
$$ packed form
16551A755149J51222R6704l50793L16809k48001K09956Q3331j27592m75709J02447
16541A513523L21732j12272l55146J75103J82478n12512L12382k22204N41356
16532A844440m29650J14003p9654J49770Q676j37926P1884n78171M61084j22738
16522A301718J59722j67175j61317L4031J21143o9544J60914J32859j44222l38659
16512A029470J97301l08383L40471l21005J95166j55172K55218l74753K00356
16503A058669J58253K784j72588L34020j85642j70373L65134E37950K47265K04654
16493I89869j91184j2860O94783F40076M20655j8572j46889J18279L5501K9233
16483A078283M1316k16761J66437l83490M55174J56166m44096k75731K86849k88442
$$ plain form
16473 575705 1144761 744367 824003 423057 832047 866870 650666 552774 834008 955001
16463 955001 416131 1177929 632571 710919 773387 703224 868881 363953 518251 531584
16453 531584 756471 547319 779875 838404 154251 380334 530836 496025 538135 916909
16443 916909 628649 438562 583884 568305 730436 577887 568274 759555 1055070 487605
16432 853717 543947 306842 322966 839276 488817 572918 509690 599358 791494 -161087
16421 581058 738440 669413 469289 268704 728800 589712 494755 528232 850687 472887
16411 472887 313446 630093 194030 694180 332101 267925 164273 156559 770364 306391
16400 333185 359921 548906 365773 302550 226174 302456 376712 511921 437244 399243 166958
$$ packed form
16473E75705N69056m00394P9636m00946M08990L4823k16204r7892K81234J20993
16463I55001D16131P61798n45358P8348O2468p0163J65657C63953J54298J3333
16453E31584K24887k09152K32556N8529A54251K26083J50502l4811M2110L78774
16443I16909k88260j90087J45322j5579J62131j52549r613J91281K95515D87605
16432H53717l09770k37105J6124N16310l50459Q4101o3228Q9668J92136a61087
16421E81058J57382o9027k00124k00585M60096j39088r4957L3477L22455l77800
16411D72887j59441L16647A94030N00150C32101o4176j03652p714O13805C06391
16400C33185K6736J88985j83133o3223p6376P6282P4256J35209p4677l8001A66958
$$ plain form
16388 419507 273016 197982 410229 199634 -190528 394244 310877 366426 653442 310823
16377 409160 435822 132830 334189 412618 395623 348700 -72366 411871 153244 376058
16367 376058 219156 220645 346579 458610 419300 335044 135397 504226 191083 662676
16357 662676 118682 24088 137375 359494 21414 114758 75953 306520 30544 368169
16347 368169 375342 28663 236557 319541 169699 -383783 456489 1013 357362 -69103 636474
16335 229555 284406 358714 294982 238380 600205 410338 212554 375798 166736 269381
16325 269381 30426 262346 322096 -113640 -6013 1024 39215 118870 34445 98031 -21309
16313 202876 169711 255210 257557 206161 234440 302303 324155 284242 437610 259061 23549
$$ packed form
16388D19507j46491p5034K12247A99634a90528C94244q3367N5549K87016C10823
16377D09160K6662A32830K01359P8429j6995m6923g2366D11871A53244K22814
16367C76058j56902J489J25934J12031l9310q4256A35397L68829A91083M71593
16357F62676A18682B4088J13287K22119B1414R3344l8805K30567C0544L37625
16347C68169P173B8663K07894Q2984j49842c83783D56489A013L56349f9103F36474
16335B29555N4851P4308o3732n6602L61825j89867j97784J63244A66736J02645
16325B69381C0426K31920N9750a13640f013A024L8191P9655C4445O3586b1309
16313B02876l3165Q5499K347n1396K8279O7863K1852l9913J53368j78549B3549
$$ plain form
16301 75879 376814 320175 317892 -128600 528140 -143661 61859 217879 99418 506492 104298
16289 402760 372804 16139 314211 121589 167307 173057 245957 537783 229329 380172 215293
16278 215293 708319 267747 62923 161387 60792 370379 65192 167114 406661 177380
16267 384172 -236820 239133 101936 136683 319098 36663 87948 -25565 677187 42844
16256 73178 300129 15289 -6710 387158 -8384 61342 111252 205771 21472 69206 68200 -2740
16243 406151 209511 -203680 6998 219553 256747 413303 79280 209287 72357 -35738 70838
16231 82725 317069 82445 167837 -12764 64314 211269 -163580 104722 198418 454328 400566
16220 400566 -54007 218187 65656 50086 -46177 19070 -119730 -51550 -81351 -43582 16803
$$ packed form
16301G5879L00935n6639k283a28600E28140a43661F1859J56020I9418M07074A04298
16289D02760k9956A6139K98072A21589M5718N750P2900K91826B29329J50843j64879
16278B15293M93026B67747F2923R8464F0792L09587F5192J01922K39547A77380
16267C84172b36820B39133A01936L4747J82415C6663N1285b5565F77187D2844
16256G3178K26951A5289f710C87158h384F1342M9910R4519B1472M7734j006b740
16243D06151j96640b03680F998K12555L7194J56556G9280J30007G2357c5738G0838
16231H2725K34344H2445Q5392a2764F4314J46955a63580A04722R3696K55910n3762
16220D00566e4007B18187F5656j5570d6177A9070a19730e1550k9801L7769A6803
$$ plain form
16208 -37391 -107472 352246 -16891 9912 -130100 -23448 437066 180970 79028 223070 241308
16197 241308 -55421 -57694 271272 129553 -66955 20736 120529 -148947 89655 158174 149195
16186 149195 190468 104425 144851 -22531 231006 -102269 -178079 -20131 -82811 36788 47903
16175 47903 -56623 -12848 255871 -105438 -119833 -145821 -138636 -107756 415004 263029 -38056
16163 174532 247673 -260469 -214078 -25047 -1661 16604 -333718 213532 -15899 37531 28565
16152 28565 136001 -282689 6683 478745 -110024 179974 -48084 163949 76707 -221845
16141 -19894 -84739 22739 210351 66095 62069 -73327 -62667 74055 -267098 -224761 187139
16129 130206 52427 -137858 -33432 419398 -154285 -158658 -219837 181437 209346 -162926 395694
$$ packed form
16208c7391p0081C52246a6891I912a30100b3448D37066A80970G9028J44042J8238
16197B41308e5421k273B71272A29553f6955B0736R9793a48947H9655O8519q979
16186A49195M1273q6043M0426b2531B31006a02269p5810b0131o2680C6788J1115
16175D7903e6623a2848B55871a05438j4395k5988P185L0880D15004j51975c8056
16163A74532P3141b60469M6391b5047a661A6604c33718B13532a5899C7531q966
16152B8565J07436b82689F683M72062a10024A79974d8084A63949G6707b21845
16141a9894o4845B2739J87612F6095m026g3327J0660G4055b67098M2337A87139
16129A30206E2427a37858c3432D19398a54285m373o1179A81437K7909a62926C95694
$$ plain form
16117 -71660 -74413 -51779 143185 -154675 -28100 -98409 -72141 -79659 53853 -88442 -144837 110501
16104 -342100 -47082 15110 -17670 566946 -360236 161321 36023 225922 48437 -90435 -48724
16093 -48724 -145183 -188777 285362 45189 277952 -48643 96070 -103117 72532 49606 180014
16082 180014 377293 81582 -194545 44981 -82400 24975 93467 -132708 -162399 23855 51807
16071 51807 51782 -212032 257002 -112218 55614 -1518 71210 -3804 -141365 -95676 -79356 -229578
16059 -229578 37957 10232 8486 139059 -130799 48263 438878 198683 -90879 -146850 -191118
16048 -191118 57807 -159673 -283237 -112468 -223142 50740 26749 8647 -258534 333633
16037 188929 35429 167844 31631 153701 -104176 -153535 -392337 -153188 -222130 209317
$$ packed form
16117g1660k753K2634A43185a54675b8100p0309K6268p518E3853h8442n6395A10501
16104c42100d7082A5110a7670E66946c60236A61321C6023J89899D8437i0435M1711
16093d8724r6459m3594B85362D5189K32763d8643I6070a03117G2532k2926J30408
16082A80014J97279H1582a94545D4981h2400B4975O8492a32708k9691B3855K7952
16071E1807k5b12032B57002a12218E5614a518G1210c804j37561M5689J6320j50222
16059b29578C7957A0232j746J30573a30799D8263L90615A98683i0879n5971m4268
16048a91118E7807a59673j23564a12468j10674E0740k3991H647b58534C33633
16037A88929C5429J32415C1631J22070a04176m9359k38802a53188o8942B09317
$$ plain form
16026 -11354 -360353 -49470 25692 477 169971 -299516 -112680 41555 -218830 131946 -188335
16014 -330198 136471 -144146 -80506 -75335 -64924 17541 157363 -67818 -63192 -44873 360706
16002 15045 -171934 60615 -77609 -173968 72650 -57090 47206 351601 129753 204641 -26048
15990 -57 546275 181917 125437 1191 -383945 128387 384721 431998 348809 243053 286968
15979 286968 -243492 111760 105354 -63323 220237 -221936 -253972 -184778 -295712 -41033 -76359
15968 -76359 -351561 -148406 118675 59491 -111766 104818 314136 241258 -141804 116707
15957 93 193984 103207 343206 78679 -59725 -7493 -112217 -3437 337205 15601 -236455 -107318
15944 10843 43441 -381669 -19114 -76123 113512 -318140 155781 -18560 -230733 -281884 -110046
$$ packed form
16026a1354l48999d9470B5692D77J69494b99516a12680D1555b18830A31946a88335
16014c30198A36471a44146O3640N171J0411A7541J39822f7818M626J8319C60706
16002A5045a71934F0615g7609r6359G2650e7090D7206L04395A29753P4888b6048
15990e7E46275A81917n6480A191c83945A28387K56334M7277q3189j05756M3915
15979B86968b43492A11760o406f3323B20237b21936l2036O9194j10934d1033l5326
15968g6359k75202a48406A18675n9184a11766A04818K09318p2878a41804A16707
15957I3J93891r0777K39999G8679e9725g493j04724c437C37205A5601b36455a07318
15944A0843L2598c81669a9114n7009A13512c18140A55781a8560k12173n1151a10046
$$ plain form
15932 75138 -133878 225232 -104110 -64537 -107627 -27545 65918 -535979 -330771 -331816 -182590
15921 -182590 -253634 -39036 -266561 -165990 -243426 -78184 -264336 -64658 26549 -63510 -111847
15910 -111847 27523 -156213 -59356 -522840 -134237 -95371 152391 -254535 62671 -260045
15899 130524 358465 69067 -27122 52639 -394419 -32716 -186030 443085 -89201 -243703
15889 -243703 -142892 -36785 -220163 -249044 4326 56744 -76508 205294 16615 -488429 -147603
15877 143838 -76538 156119 225194 -61652 -57979 71204 238749 137322 -241979 60004 129209
15866 129209 -96714 42579 -32899 -12322 76564 -497132 -43269 15257 -191362 182590 116287
15855 116287 -49072 182831 193798 162322 208282 100721 84418 -291079 202117 -277351
$$ packed form
15932G5138a33878B25232a04110L9573m3090b7545F5918e35979K05208j045J49226
15921a82590p1044c9036k27525J00571p7436g8184j86152f4658B6549f3510m8337
15910a11847B7523a56213e9356m63484a34237L8866A52391b54535F2671b60045
15899A30524K27941F9067b7122E2639c94419c2716j53314D43085h9201j54502
15889b43703J00811c6785j83378k8881D326N2418g6508B05294A6615d88429a47603
15877A43838g6538A56119O9075f1652L673G1204J67545j01427b41979F0004O9205
15866A29209i6714D2579c2899a2322G6564d97132d3269A5257a91362A82590o6303
15855A16287d9072A82831J0967l1476M5960A00721j6303b91079B02117b77351
$$ plain form
15844 270799 73252 232138 -35619 -203116 -235695 23540 -126249 391782 -13406 -2784 61628
15832 -49965 -103106 -311616 81038 229867 -66004 -111228 -175591 40297 260147 251318 36181
15820 -133596 -41788 372548 -113972 -356226 -101960 68658 -56150 19640 -206521 -440330
15810 -440330 349711 138005 227118 -424444 192590 -88357 -186003 70583 25030 -207387
15799 -117363 -357494 -36580 -32942 -188587 71130 -368769 -231644 -21277 240398 95867 254831
15788 254831 35013 90552 -278785 512511 103177 20157 -45775 -4353 -259187 -267923 -24717
15776 -188966 -80147 -77200 -5493 43611 127375 -145694 146503 94123 -170527 -128591 -189200
15765 -189200 260528 19491 -144017 245238 -31437 6987 -429573 -58462 -38478 89083 -897
$$ packed form
15844B70799G3252J58886c5619j67497l2579B3540a26249C91782a3406b784F1628
15832d9965n3141k08510H1038J48829f6004m5224o4363D0297K19850q829C6181
15820a33596d1788C72548a13972k42254a01960F8658e6150A9640b06521k33809
15810d40330C49711A38005Q9113d24444A92590h8357r7646G0583B5030b07387
15799a17363k40131c6580L638j55645G1130c68769J37125b1277B40398I5867J58964
15788B54831C5013N5539b78785E12511A03177B0157d5775d353k54834q736b4717
15776a88966h0147K947e493D3611Q3764a45694A46503n2380a70527M1936o0609
15765a89200B60528A9491a44017B45238c1437F987d29573e8462J9984H9083h97
$$ plain form
15753 93018 363364 -36774 418 383847 -178847 -177177 445676 -184850 266700 199525 85975
15741 196887 -187767 -243863 86363 140395 -76341 -67225 -123137 13081 -344897 14645 -1685
15729 -402326 -69802 -47135 -67942 21101 -224537 -290803 261100 73671 24020 -2206 -30584
15718 -30584 33083 -169247 331985 -197988 -195549 -252466 5992 130662 -166707 126982 416971
15707 416971 -406369 23584 -202127 -15626 208533 -74592 -173035 145597 62401 51186 -213418
15695 -146843 -88206 -82668 -220170 -24810 388929 242582 481795 169549 82828 -194768
15684 -97578 -77445 35671 80909 -162963 170984 -37937 179085 134215 -55936 -307674 116857
15672 56643 350374 31312 144597 456894 92468 23501 -254154 10566 -238699 120961
$$ packed form
15753I3018K70346c6774D18L83429a78847J670D45676a84850B66700o7175H5975
15741A96887a87767n6096H6363N4032g6341R116n5912A3081c44897A4645a685
15729d02326f9802K2667k0807B1101b24537o6266B61100G3671B4020b206k8378
15718c0584C3083a69247C31985a97988K439n6917E992J24670a66707A26982K89989
15707D16971d06369B3584b02127a5626B08533g4592r8443A45597F2401j1215b13418
15695a46843N8637N538j37502b4810C88929j46347K39213A69549H2828a94768
15684i7578K0133C5671M5238a62963A70984c7937A79085m4870e5936k51738A16857
15672E6643K93731C1312J13285L12297I2468B3501b54154A0566b38699A20961
$$ plain form
15661 113157 -66873 -139872 -119738 -31838 -323462 52609 -325705 -85938 -245767 -76147 -125908
15650 -125908 101392 28184 -18821 -117335 241009 -361860 -201237 -169171 -123240 -111004 194574
15638 -298126 -187470 -116282 -34698 -56335 223776 -161292 -104361 -235577 60396 192468
15628 192468 123909 -164199 280697 204156 75061 -256704 -48683 134685 -149440 -150886 -173014
15617 -173014 114530 175622 -271318 -115394 -1161 -49017 -49460 -150918 52691 94021 174360
15606 174360 -10078 136595 6410 -89048 69311 -13666 34328 35725 215123 -215677 -174611
15595 -174611 -41187 -90432 269704 31051 97241 452772 153194 105753 -7762 -94693 -130865
15584 -130865 -110942 -67159 291346 -19640 -112989 -132400 67623 -112168 -185066 20482 -159977
$$ packed form
15661A13157f6873p2999K0134c1838k91624E2609c25705h5938j59829g6147m9761
15650a25908A01392B8184a8821r8514B41009c61860J60623L2066M5931J2236A94574
15638b98126J10656P1188c4698k1637B23776a61292N6931j31216F0396J32072
15628A92468o8559a64199B80697p6541G5061b56704d8683A34685a49440j446k2128
15617a73014A14530O1092b71318a15394a161m7856m43j01458E2691M1330Q0339
15606A74360a0078A36595F410h9048F9311a3666C4328J397J79398b15677M1066
15595a74611d1187m9245B69704C1051O6190L55531A53194m7441g762q6931l6172
15584a30865J9923M3783B91346a9640r3349j9411F7623a12168p2898B0482a59977
$$ plain form
15572 -231036 249277 174730 -61643 -121248 -95479 -267249 -122634 9414 -5118 -175280 334477
15560 390984 304014 52211 39728 163307 -46565 233252 77805 -421493 206460 5465 -71041
15548 -191547 13151 -32136 -390884 183824 -44101 214381 -119287 121230 216428 -301110
15537 37053 -286288 -163430 -6740 -94029 -419922 -175623 -132830 127178 20893 7431 81009
15526 81009 67664 -46962 -356263 192287 -298084 -17692 159384 234728 206841 168955 55563
15514 -53485 112215 -238530 161415 84738 76840 148794 -25709 -22924 -288306 -75969 136490
15502 -32336 -218715 8277 26778 364543 -62479 144496 -100816 28867 -248770 98832 -120306
15490 -76999 -94167 302124 -23719 -22089 -22370 275895 -113098 -43669 9630 -46995 117419 -166097
$$ packed form
15572b31036B49277p4547f1643n9605K5769j71770a22634I414e118j70162C34477
15560C90984q6970E2211j2483J23579d6565B33252G7805d21493B06460E465g1041
15548a91547A3151c2136l58748A83824d4101B14381a19287A21230R5198c01110
15537C7053b86288J22858f740q7289l25893a75623M2793A27178B0893G431P3578
15526H1009j3345d6962l09301A92287b98084a7692A59384P5344k7887l7886E5563
15514e3485A12215b38530A61415p6677p898P1954b5709K785k65382g5969A36490
15502c2336j86379H277J8501L37765f2479A44496a00816B8867b48770I8832a20306
15490g6999j7168C02124b3719J630k81B75895a13098d3669I630d6995A17419a66097
$$ plain form
15477 20122 -425590 -244087 -82533 197792 -121724 -87004 -18499 -141420 -5231 -191236 31101
15465 9117 304904 -104916 144249 141748 4711 -328339 240215 -260704 -17469 136386 -285437
15453 -94619 40288 159017 81057 236538 -120371 -231071 71280 -59587 312931 261332 80136
15441 41010 -236565 -30534 -2785 56483 84634 -62522 351394 105024 51641 -124417 362591
15429 269771 13786 220357 -443100 -72453 -104493 -163178 -83497 -151957 425151 -35139 -42611
15418 -42611 116275 80007 -117325 105703 39958 -126174 12807 -104193 233270 72614
15407 339718 199603 149786 -104442 62559 -23839 -166206 66739 -129943 -78695 243838
15396 -180358 -17592 177081 -125528 72407 42751 -256350 43244 120008 151513 241731 256833
$$ packed form
15477B0122d25590J81503h2533A97792a21724L4720a8499j22921e231j86005C1101
15465I117K95787a04916A44249k501D711c28339B40215b60704a7469A36386b85437
15453i4619D0288J18729p7960J55481a20371j10700G1280e9587C12931n1599H0136
15441D1010b36565c0534b785E6483K8151f2522C51394A05024E1641a24417C62591
15429B69771A3786K06571d43100g2453l2040n8685P9681o8460D25151c5139p472
15418d2611A16275l6268a17325A05703C9958a26174A2807a04193B33270G2614
15407C39718j40115m9817a04442F2559b3839j42367F6739a29943N1248B43838
15396a80358a7592A77081a25528G2407k9656b56350D3244P6764L1505R0218J5102
$$ plain form
15385 256833 -3059 5645 -106308 133145 -188888 1517 -267727 -260849 -60370 73632 -53139
15373 -105489 263408 102970 109786 -218698 36319 299250 49792 -32963 -48919 -3159 260984
15361 -126813 -123602 -163523 152425 506461 -9590 139425 83270 -8757 -25554 -109076 -37854
15349 54909 51842 137056 35943 -313332 -236785 -386715 -53982 -20249 104019 -123129 87047
15337 277603 -23780 234014 -574442 -196281 68065 450900 267800 -85252 -74999 -82659 -192757
15326 -192757 84293 27427 287261 275463 -123233 248589 29559 -219653 -115254 8988 249049
15315 249049 -124669 104362 166549 206941 -78541 -180247 -415430 32720 -1131 -45596 -358405
15304 -358405 124385 80490 -376364 135946 268184 164486 307468 62817 125060 -70543
$$ packed form
15385B56833c059E645a06308A33145a88888A517b67727O878f0370G3632e3139
15373a05489B63408A02970O816b18698C6319K62931D9792c2963j5956c159B60984
15361a26813L211l9921A52425L54036i590A39425n6155h757j6797q3522c7854
15349E4909l067Q5214C5943c13332P6547j49930e3982b0249A04019a23129H7047
15337B77603b3780B34014e74442a96281F8065L82835j83100h5252J0253p660j10098
15326a92757H4293B7427K59834j1798a23233B48589B9559b19653J04399H988K40061
15315B49049a24669A04362O2187M0392g8541j01706k35183C2720a131m4465l12809
15304c58405A24385m3895c76364A35946J32238j03698J42982F2817O2243g0543
$$ plain form
15293 -56300 -160113 7751 -106288 247623 -21611 -226663 -57931 -162714 20026 184707 92450
15282 92450 -313819 -16433 266004 156455 170105 -160428 182469 131026 62752 -14832 -15440
15271 -15440 -65475 -288688 -84286 125589 -111796 317871 81372 285400 135814 328446
15261 328446 223167 235542 158948 -93381 68822 89184 211797 383152 410311 326057 367457
15250 367457 249273 985646 1605938 1294793 938261 1653582 305094 130722 -181994 11065
15239 107353 30913 -63016 137616 61352 267341 102825 -205539 320026 -92028 55455
15228 157177 -297974 161289 304069 121570 -104618 322201 -56028 67397 166500 273893
15218 273893 -1708 3228 76710 -163943 43098 232328 275722 43799 76268 180809 252824
$$ packed form
15293e6300j03813G751a06288B47623b1611k05052e7931j04783B0026J64681r2257
15282I2450c13819a6433B66004j09549J3650a60428A82469n1443F2752a4832o08
15271a5440n0035k23213h4286A25589a11796C17871H1372K04028A35814J92632
15261C28446j05279J2375p6594i3381F8822K0362J22613J71355K7159q4254M1400
15250C67457j18184P36373O20292l11145l56532P15321C05094A30722a81994A1065
15239A07353C0913f3016A37616F1352K05989A02825b05539C20026i2028E5455
15228A57177b97974A61289J42780A21570a04618C22201e6028F7397R9103J07393
15218B73893a708C228P3482a63943D3098J89230M3394D3799L2469J04541P2015
$$ plain form
15207 252824 -199417 255226 -74532 -69010 119192 179151 95473 -84009 104248 318002 175494
15196 175494 -112311 42886 187274 -46608 -139531 -80169 55296 49344 90111 345147 216289
15185 216289 93605 275518 377319 -341148 429616 130485 264449 182489 -2529 -80015
15175 -80015 -271256 30445 -33218 -100016 -90208 -82777 73491 -7728 -299476 167791 162321 -91803
15162 33034 53621 -149673 114179 22384 80649 -28673 229910 153234 256778 -4602 -192473
15151 -192473 467311 27479 72183 298002 378490 87372 128370 236836 -120042 365336
15140 257774 11394 298672 160590 145627 74783 136790 -319753 37496 -124674 149031
15129 650277 -21120 -22651 331178 -39537 -193866 385127 243702 -16635 -220044 248983
$$ packed form
15207B52824a99417B55226g4532N522A19192N9959q3678h4009A04248K13754j42508
15196A75494a12311D2886J44388d6608r2923N9362E5296n952M0767K55036j28858
15185B16289I3605J81913J01801c41148D29616A30485J33964q1960b529p7486
15175h0015j91241C0445c3218o6798R808P431G3491g728k91748A67791n470i1803
15162C3034K0587a49673A14179B2384N8265b8673B29910p6676J03544d602j87871
15151a92473D67311B7479M4704K25819Q0488H7372M0998J08466a20042C65336
15140B57774A1394K87278j38082j4963p0844O2007c19753C7496a24674A49031
15129F50277b1120j531C31178c9537j54329C85127j41425a6635k03409B48983
$$ plain form
15118 213936 -29592 19980 -197995 238852 -2673 163252 60356 -12971 75987 172979 -99588
15106 146623 -34922 -38821 4510 409307 57965 -20442 -21174 448007 -162547 -90226 72618 235163
15094 235163 -126982 17879 146344 424571 273508 57361 -155709 153398 53403 517168
15084 517168 78762 76037 413218 89424 351742 624068 116261 -44132 505021 264403
15074 264403 161690 239350 14002 198453 37038 198706 188003 161682 13554 -14797 275696
15062 -65186 341310 446461 312631 174737 88200 279908 399038 36511 192515 101469
15052 101469 227420 160598 491927 240970 -20473 98378 21270 35927 135384 228987 128934
15041 128934 214701 -493654 244296 345478 13479 175121 248475 298259 315767 208547
$$ packed form
15118B13936b9592A9980a97995B38852b673A63252F0356a2971G5987R6992i9588
15106A46623c4922l899D510M04797E7965b0442p32D48007a62547P2321G2618J62545
15094B35163a26982A7879J28465K78227j51063E7361a55709A53398E3403M63765
15084E17168G8762k725L37181H9424K62318K72326A16261d4132E05021k40618
15074B64403j02713P7660A4002J84451C7038J61668j0703k6321A3554a4797B75696
15062f5186C41310J05151j33830j37894q6537J91708J19130C6511J56004r1046
15052A01469J25951o6822L31329B40970b0473I8378B1270J4657R9457R3603j00053
15041A28934Q5767d93654B44296J01182A3479J61642P3354M9784J7508j07220
$$ plain form
15031 208547 142457 236802 48044 395525 391843 226301 79781 324068 337207 362746 145017
15019 136125 504961 98871 378341 -17408 159972 173152 259298 426275 283199 100867
15008 513243 71059 105488 281000 58571 95213 209264 112923 212558 591090 258986 573743
14997 573743 227557 433560 77767 279938 254062 142837 369173 47566 280869 343358
14987 343358 125980 127347 313708 89214 257910 346516 115245 285696 56135 311658
14977 311658 264981 161190 -7029 62642 183582 352594 33976 148901 445507 251287
14967 251287 336576 166761 164437 160100 481135 154423 426437 373790 166282 154736 214739
14956 214739 104851 352435 13444 346093 332046 7877 -164856 85684 253340 351462 314023
$$ packed form
15031B08547o6090R4345D8044L47481l682j65542G9781K44287J3139K5539A45017
15019A36125L68836I8871K79470a7408A59972J3180Q6146J66977j43076A00867
15008E13243G1059L4429J75512E8571L6642J14051r6341R9635L78532B58986L14757
14997E73743B27557K06003G7767K02171k5876j11225K26336D7566K33303O2489
14987C43358A25980J367J86361H9214J68696Q8606A15245J70451E6135K55523
14977C11658m6677j03791g029F2642J20940J69012C3976J14925K96606j94220
14967B51287Q5289A66761k324m337L21035A54423K72014n2647A66282j1546O0003
14956B14739A04851K47584A3444L32649j4047G877a64856H5684J67656R8122l7439
$$ plain form
14945 314023 577076 180584 361803 463446 444570 350806 113366 150817 367694 167672
14934 62589 418984 218074 264743 41584 422117 625952 190003 344331 538308 565097
14924 565097 291343 437573 580997 75224 451997 179735 72357 245501 729675 663649
14914 663649 309327 684392 401988 79967 248449 335102 185450 247258 721059 151082
14903 789828 429288 437702 541662 317473 352384 549671 282135 404732 511142 337743
14893 337743 531691 410215 558357 487740 233644 374387 254701 432760 67382 421755
14883 421755 95957 352187 263691 539466 625671 607300 487515 464504 160043 555391
14873 555391 343480 83435 427268 212210 245421 306409 247191 418784 507688 647140
$$ packed form
14945C14023K63053A80584J81219J01643j8876r3764A13366L7451K16877A67672
14934F2589L56395k00910M6669D1584L80533K03835A90003J54328J93977K6789
14924E65097k73754J46230J43424G5224L76773A79735G2357J73144M84174o6026
14914F63649C09327L75065k82404G9967J68482Q6653j49652O1808M73801A51082
14903G89828l60540Q414J03960k24189L4911J97287k67536J22597J06410j73399
14893C37743J93948j21476J48142p0617B33644J40743j19686J78059F7382L54373
14883D21755I5957K56230q8496K75775Q6205j8371j19785k3011A60043L95348
14873E55391k11911H3435L43833B12210L3211O0988n9218J71593Q8904J39452
$$ plain form
14863 647140 630227 763974 416866 452662 186882 435523 398654 208489 162210 637358
14853 637358 448189 548379 600279 476866 289127 667257 274835 190924 934608 286695
14842 829475 397498 365151 209948 86983 687775 693837 837927 528459 378284 441013
14832 441013 360952 457414 423779 429377 349243 544496 160296 70942 204711 482512 724324
14821 724324 346146 226720 536973 284526 222580 736733 193117 384620 503899 316731
14811 316731 143263 643875 387952 537250 327003 672633 425690 495979 565654 689689
14801 689689 643958 347385 171441 354020 759648 564797 778874 524258 936600 540112
14791 540112 662268 414293 828185 605793 895236 269892 430672 713704 637286 475363
$$ packed form
14863F47140j6913J33747l47108L5796A86882K48641l6869j90165m6279M75148
14853F37358j89169J00190N1900j23413j87739L78130B74835q3911P43684B86695
14842H29475C97498l2347j55203H6983O00792O062J44090l09468j50175O2729
14832D41013q0061R6462l3635N598q0134J95253A60296G0942J33769K77801K41812
14821G24324C46146j19426L10253k52447o1946N14153A93117J91503J19279j87168
14811C16731A43263N00612k55923J49298k10247L45630k46943P0289O9675J24035
14801F89689m5731k96573A71441J82579M05628j94851K14077k54616M12342l96488
14791E40112J22156k47975M13892k22392K89443B69892J60780K83032p6418j61923
$$ plain form
14781 475363 841608 747971 465088 537362 281553 795690 507810 709691 875446 778712
14771 778712 453558 532176 505590 686958 733462 898591 1020629 769068 439933 443454
14761 443454 751075 477012 973481 472182 359810 503449 719298 696783 1010096 674558
14751 674558 647161 780419 878909 751923 903773 625345 536155 664978 879294 582583
14741 582583 449805 642432 622467 872241 801168 806617 746601 945836 941413 915812 596290
14730 596290 711765 782711 697676 1024113 1001920 1001495 790260 533107 1007385 865541 1089609
14719 1089609 536017 1061093 1044497 602133 781009 652076 652090 677204 671812 964944 1039981
14708 1039981 786921 1029856 722485 865626 944048 825189 1053405 828160 799931 1021396
$$ packed form
14781D75363L66245r3637k82883P2274k55809N14137k87880K01881J65755r6734
14771G78712l25154P8618k6586J81368M6504J65129J22038k51561l29135L521
14761D43454L07621k74063M96469D72182j12372J43639K15849k2515L13313l35538
14751F74558k7397J33258R8490j26986J51850k78428q9190J28823K14316k96711
14741E82583j32778J92627j9965K49774p1073N449o0016J99235m423k5601l19522
14730E96290J15475P0946q5035L26437k2193m25k11235k57153M74278j41844K24068
14719A089609E36017N25076j6596m42364J78876j28933J4K5114n392K93132P5037
14708A039981k53060K42935l07371J43141P8422j18859K28216k25245k8229K21465
$$ plain form
14698 1021396 574787 1072550 1023583 1082854 980842 1197693 1102760 1160853 1103657 951127
14688 951127 802009 1073621 1030197 1027359 942690 1034772 654525 1272286 862960 1113513
14678 1113513 1001384 1147776 859404 771573 742175 1023104 1061977 959579 989005 877774
14668 877774 1102666 1008007 1352975 1200610 1197919 629624 916510 1656284 1074382 961251
14658 961251 1372764 1097698 1055004 1365771 1217310 1145493 768077 1477230 1135625 1229362
14648 1229362 1073207 1205773 1142284 1204493 1171103 1379559 1081333 1521291 1338488 1063166
14638 1063166 1614972 1302836 1383879 1361298 1315214 1302709 1076080 1185923 1447075 1470673
14628 1470673 1332933 1465975 1576120 1548168 1246793 1625469 1519858 1717831 1639003 1558402
$$ packed form
14698A021396m46609M97763m8967N9271j02012K16851r4933N8093n7196j52530
14688I51127j49118K71612m3424k838q4669R2082l80247O17761m09326K50553
14678A113513j12129J46392k88372q7831k9398K80929L8873j02398K9426j11231
14668H77774K24892r4659L44968j52365k691n68295K86886P39774n81902j13131
14658I61251M11513k75066m2694L10767j48461p1817l77416P09153l41605R3737
14648A229362j56155J32566o3489O2209l3390K08456k98226M39958j82803k75322
14638A063166N51806l12136Q1043k2581m6084j2505k26629J09843K61152K3598
14628A470673j37740J33042J10145k7952l01375L78676j05611J97973p8828q0601
$$ plain form
14618 1558402 1525521 1281606 1518535 1742510 1718551 1268233 1434790 1445655 1457006 1616239
14608 1616239 1494025 1643394 1495952 1612357 1655174 1651337 1625113 2030846 1914834 1818232
14598 1818232 1884575 1728251 1783099 1691284 2243473 1897584 1780223 1787344 1676871 2089665
14588 2089665 1963613 1935373 2192932 1892932 2340342 1965347 1676521 2426163 2323385 2422545
14578 2422545 2223405 2347331 2084017 2021205 2141897 1859824 2407365 2653467 2252837 2488332
14568 2488332 2377428 2815808 2508041 2292601 2588333 2940122 2456714 2704639 2982392
14559 2982392 2869349 3091207 3320629 3216401 3286059 3550242 3834720 4635085 4819703 6070515
14549 6070515 7532180 11439821 20447938 41536654 56044077 22671461 7941508 3856546
$$ packed form
14618A558402l2881k43915K36929K23975k3959m50318J66557J0865J1351J59233
14608A616239j22214J49369j47442J16405M2817l837k6224M05733j16012r6602
14598A818232O6343j56324N4848r1815N52189l45889j17361P121j10473M12794
14588B089665j26052k8240K57559l00000M47410l74995k88826P49642j02778R9160
14578B422545j99140J23926k63314o2812J20692k82073N47541K46102m00630K35495
14568B488332j10904M38380l07767k15440K95732L51789m83408K47925K77753
14559B982392j13043K21858K29422j04228O9658K64183K84478Q00365J84618J250812
14549F070515J461665L907641R008117K1088716J4507423B2671461G941508C856546
$$ plain form
14540 2560690 2310338 2140027 2026406 2316239 2084493 1998878 2144205 2392711 2247738 2219298
14530 2219298 2466266 2232568 2255939 2408382 2580884 2502674 2310474 2178045 2588448 2726587
14520 2726587 2853783 2871991 2656924 2668522 2831224 2627432 2864888 2528024 3061048 2526245
14510 2526245 2697565 3004843 3204748 2997996 3034378 3115885 3188762 3707342 3108825 3390282
14500 3390282 3310060 3029654 3526962 3520825 3604225 3341816 3672468 3814145 3837479 3769427
14490 3769427 4049349 3684836 3580862 3870790 3961912 4079611 4146554 3746382 4322343 3769644
14480 3769644 4176169 4121325 4130843 4493977 4337672 4372900 4280152 4480326 4621219 4599562
14470 4599562 4560539 4506099 4452614 4808776 4814845 4926691 4816083 4706069 5065324 5007245
$$ packed form
14540B560690k50352j70311j13621K89833k31746q5615J45327K48506j44973k8440
14530B219298K46968k33698K3371J52443J72502p8210j92200j32429M10403J38139
14520B726587J27196J8208k15067J1598J62702k03792K37456l36864N33024n34803
14510B526245J71320L07278J99905k06752L6382Q1507P2877N18580n98517K81457
14500C390282q0222k80406M97308o137Q3400k62409L30652J41677K3334o8052
14490C769427K79922l64513j03974K89928R1122J17699O6943m00172N75961n52699
14480C769644M06525n4844R518L63134j56305L5228r2748K00174J40893k1657
14470D599562l9023n4440n3485L56162O069J11846j10608j10014L59255n8079
$$ plain form
14460 5007245 5035509 4983471 5371889 5357775 5299524 5123848 5652977 5645863 5873513 5780066 5915978
14449 5915978 6078064 6291026 5797113 6060165 6233314 6168197 6446265 6369614 6221387 6646575
14439 6646575 6405270 6125027 6581658 6549207 7115253 6640663 7324701 7360772 7419850 7353238
14429 7353238 7662929 7254505 7730464 7837327 7961650 8016918 8471544 8234916 8016191 8135724
14419 8135724 8610418 8380160 9069656 9405423 9183574 9447289 9314987 9169646 9646415
14410 9646415 9982280 9848819 10053818 10079444 10408720 10684684 10644514 10806607 10783975 11046977
14400 11046977 11264010 11598074 11772444 11837224 12256451 12048887 12513086 12702811 13077072
14391 13077072 13018163 13481282 13520427 13935505 14328806 14251469 14685897 14935386 15201071 15322198
$$ packed form
14460E007245K8264n2038L88418j4114n8251j75676N29129p114K27650r3447J35912
14449E915978J62086K12962m93913K63052J73149o5117K78068p6651j48227M25188
14439F646575k41305k80243M56631l2451N66046m74590O84038L6071N9078o6612
14429G353238L09691m08424M75959J06863J24323N5268M54626k36628k18725J19533
14419H135724M74694k30258O89496L35767k21849K63715j32302j45341M76769
14410I646415L35865j33461K04999K5626L29276K75964m0170J62093k2632K63002
14400A1046977K17033L34064J74370O4780M19227k07564M64199J89725L74261
14391A3077072n8909M63119L9145M15078L93301p7337M34428K49489K65685J21127
$$ plain form
14381 15322198 15661147 16091825 16426622 16371790 16719999 17157494 17531482 17590064 18339073 18833896
14371 18833896 19004337 19230801 19476798 20282677 20652605 20910904 21424096 21780252 22354831
14362 22354831 22971673 23409284 23934766 24231177 24735462 25286346 25843405 26666268 27336720
14353 27336720 27800891 28687371 29097708 29689129 30852637 31074227 31881476 32795044 33833986
14344 33833986 34506084 35604115 36426635 37463813 38380754 39448870 40480550 41516364
14336 41516364 42993144 44045665 45442287 46679312 48330448 49833544 51322660 52970844
14328 52970844 54659382 56275399 58392520 59912138 62087283 64186282 66527457 68968809
14320 68968809 71264458 74077290 76905467 79500190 82282787 85744113 88988086 92475047
$$ packed form
14381A5322198L38949M30678L34797n4832L48209M37495L73988N8582P49009M94823
14371A8833896J70441K26464K45997Q05879L69928K58299N13192L56156N74579
14362B2354831O16842M37611N25482K96411N04285N50884N57059Q22863O70452
14353B7336720M64171Q86480M10337N91421J163508K21590Q07249R13568J038942
14344C3833986O72098J098031Q22520J037178R16941J068116J031680J035814
14336D1516364J476780J052521J396622J237025J651136J503096J489116J648184
14328E2970844J688538J616017K117121J519618K175145K098999K341175K441352
14320F8968809K295649K812832K828177K594723K782597L461326L243973L486961
$$ plain form
14312 92475047 96130502 100158626 104234279 108997904 113632192 118515411 123596531 128812750
14304 128812750 134542678 140951431 147214344 154371880 161368128 168952684 177111319 185934489
14296 185934489 194741862 204021963 214453848 225003404 236156650 248148438 260241282
14289 260241282 273418793 286426724 300559922 314883944 330195128 345037027 360324070
14282 360324070 375433005 391174921 406449523 420697635 434878805 447811100 459586631
14275 459586631 469868331 478464453 484263085 485546128 483627769 482172519 481508164 476389078
14267 476389078 470117552 462035239 451148102 438901068 424958232 410409222 394614253
14260 394614253 378780224 362220180 346180027 329939866 313932817 299409325 285110358
$$ packed form
14312I2475047L655455M028124M075653M763625M634288M883219N081120N216219
14304A28812750N729928O408753O262913P157536O996248P584556Q158635Q823170
14296A85934489Q807373R280101J0431885J0549556J1153246J1991788J2092844
14289B60241282J3177511J3007931J4133198J4324022J5311184J4841899J5287043
14282C60324070J5108935J5741916J5274602J4248112J4181170J2932295J1775531
14275D59586631J0281700Q596122N798632J283043j918359j455250o64355n119086
14267D76389078o271526q082313j0887137j2247034j3942836j4549010j5794969
14260C94614253j5834029j6560044j6040153j6240161j6007049j4523492j4298967
$$ plain form
14253 285110358 270940873 257455452 244698899 232492283 220921873 210010788 199872154
14246 199872154 189738358 180842714 172958515 164355984 156768195 149130041 142192730 136218148
14238 136218148 130747567 124802151 119264279 114443402 109652684 105042627 100894522 97302608
14230 97302608 93530282 89758448 86263934 83105977 79800721 77199070 74310556 71884938
14222 71884938 69224804 66804915 64591818 62490627 60458618 58448917 56501743 54553569
14214 54553569 53523603 51831163 50570003 48679503 47028939 45498543 44701831 43941824
14206 43941824 42727657 41260306 40024280 38443642 37761391 36767640 36670929 35296044 33860022
14197 33860022 32928811 32158733 31860390 30984319 30439639 29318248 28342177 27412608 27191135
$$ packed form
14253B85110358j4169485j3485421j2756553j2206616j1570410j0911085j0138634
14246A99872154j0133796q895644p884199q602531p587789p638154o937311n974582
14238A36218148n470581n945416n537872m820877m790718m610057m148105l591914
14230I7302608l772326l771834l494514l157957l305256k601651k888514k425618
14222G1884938k660134k419889k213097k101191k032009k009701j947174j948174
14214E4553569j029966j692440j261160j890500j650564j530396p96712p60007
14206D3941824j214167j467351j236026j580638o82251r93751r6711j374885j436022
14197C3860022r31211p70078k98343q76071n44680j121391r76071r29569k21473
$$ plain form
14188 27191135 26594074 26010703 25509762 24823273 24158281 23737465 23173813 22658637 22411289
14179 22411289 21835354 21331097 20990432 20495712 19847855 19618592 19290091 18913294 18370352
14170 18370352 18053344 17433861 17556533 16956915 16629296 16194790 15988616 15995256 15430860 14992118
14160 14992118 14869841 14741723 14700253 14557472 14114349 13715507 13917815 13227886 13118357
14151 13118357 13236862 12724877 12514931 12205705 11951349 11909397 11667291 11617784 11634767 11437525
14141 11437525 11034025 11004678 10873182 10710141 10499871 10169112 10135618 10008037 9478676 9654110
14131 9654110 9478599 9414576 9315096 8886691 9089585 8962676 8980383 8911677 8596099 8284856
14121 8284856 8779525 8158064 8231876 7806781 8000830 7596200 7569418 7864552 7515768 7220898
$$ packed form
14188B7191135n97061n83371n00941o86489o64992m20816n63652n15176k47348
14179B2411289n75935n04257l40665m94720o47857k29263l28501l76797n42942
14170A8370352l17008o19483J22672n99618l27619m34506k06174O640n64396m38742
14160A4992118j22277j28118m1470j42781m43123l98842K02308o89929j09529
14151A3118357J18505n11985k09946l09226k54356m1952k42106m9507J6983j97242
14141A1437525m03500k9347j31496j63041k10270l30759l3494j27581n29361J75434
14131I654110j75511o4023r9480m28405K02894j26909J7707o8706l15578l11243
14121H284856M94669o21461P3812m25095J94049m04630k6782K95134l48784k94870
$$ plain form
14111 7220898 7400029 7031539 7058954 7243693 7183406 7164165 6973259 7000029 6628524 6416451
14101 6416451 6703221 6418242 6269958 5878262 6229922 6013270 5977420 6243568 5931642 5597296
14091 5597296 5579768 5932727 5668528 5738371 5294485 5763692 5444196 5017520 5495146 5302632
14081 5302632 5243889 5165083 5105765 5031735 5031081 4832718 4859796 4880255 4906040 4823512 4625923
14070 4625923 4799365 4310872 4689340 4632225 4555201 4400118 4565086 4401081 3873191 4349338
14060 4349338 4482048 4504374 4320337 3983871 4000635 4256397 4102992 3949771 3794938 3912230
14050 3912230 3825355 3743746 3597579 3538297 3492248 3630733 3757355 3599526 3564688 3508921
14040 3508921 3317881 3424039 3479468 3426734 3180190 3269973 3183668 3318770 3510974 3422774
$$ packed form
14111G220898J79131l68490K7415J84739o0287j9241j90906K6770l71505k12073
14101F416451K86770k84979j48284l91696L51660k16652l5850K66148l11926l34346
14091E597296j7528L52959k64199O9843m43886M69207l19496m26676M77626j92514
14081E302632n8743p8806n9318p4030o54j98363K7078K0459K5785q2528j97589
14070D625923J73442m88493L78468n7115p7024j55083J64968j64005n27890M76147
14060D349338J32710K2326j84037l36466J6764K55762j53405j53221j54833J17292
14050C912230q6875q1609j46167n9282m6049J38485J26622j57829l4838n5767
14040C508921j91040J06158N5429n2734k46544Q9783q6305J35102J92204q8200
$$ plain form
14030 3422774 3307068 3123057 3128413 3297198 3243711 3017733 2790397 2807158 2557177 2701085
14020 2701085 2705521 2911164 3029776 3027456 2597666 2767297 2893975 2542890 2646922 2698929
14010 2698929 2720697 2576728 2690346 2659149 2494794 2342875 2515741 2505272 2442090 2396908
14000 2396908 2407164 2241777 2627926 2222818 2349518 2442371 2005932 2355445 2100043 2197632
13990 2197632 2811396 3302874 5325277 12672472 31596913 57028078 27601205 13195259
13981 8156378 5861214 4602173 4236944 3671869 3522311 3544286 3104439 3282715 2936190
13972 2936190 3069189 2971908 2531113 2628395 2446917 2315801 2564053 2552298 2323270 1905877
13962 1905877 2261269 2305340 2392271 2643905 2104097 2091172 2377516 2250466 1906234 1994686
$$ packed form
14030C422774j15706j84011N356J68785n3487k25978k27336J6761k49981J43908
14020B701085M436K05643J18612k320m29790J69631J26678l51085J04032N2007
14010B698929K1768j43969J13618l1197j64355j51919J72866j0469o3182m5182
14000B396908J0256j65387L86149m05108J26700R2853m36439L49513k55402R7589
13990B197632O13764M91478K022403P347195J8924441K5431165B7601205A3195259
13981H156378k295164j259041l65229n65075j49558K1975m39847J78276l46525
13972B936190J32999r7281m40795R7282j81478j31116K48252j1755k29028m17393
13962A905877L55392M4071Q6931K51634n39808j2925K86344j27050l44232Q8452
$$ plain form
13952 1994686 1923379 1863729 2032861 1852448 2049686 2372901 2238037 2070151 2171461 1942419
13942 1942419 1897491 1664879 1997622 1751937 1975952 1920978 2229091 1792302 1471009 1967255
13932 1967255 1953363 1739169 1577106 1687340 1840805 1882191 1885229 1618532 1534723 1403514
13922 1403514 1863965 1525298 1499853 1698604 1731351 1523098 1459539 1778684 1432347 2027281
13912 2027281 1912966 1558886 1602940 1434683 1403870 1467260 1144723 1546369 1269556 1358269
13902 1358269 1274292 1425989 1269812 1579038 1524863 1398503 1397873 1428675 1648233 881329
13892 881329 1332368 1594484 1507556 966365 1551445 1142561 1268935 1332688 1407449 1086990
13882 1086990 1418026 1378477 1408600 1442555 1216985 1330794 1113120 1298222 1351188 1361065
$$ packed form
13952A994686p1307n9650J69132j80413J97238L23215j34864j67886J01310k29042
13942A942419m4928k32612L32743k45685K24015n4974L08113m36789l21293M96246
13932A967255j3892k14194j62063J10234J53465M1386L038k66697q3809j31209
13922A403514M60451l38667k5445J98751L2747k08253o3559L19145l46337N94934
13912B027281j14315l54080M4054j68257l0813O3390l22537M01646k76813Q8713
13902A358269q3977J51697j56177L09226n4175j26360o30L0802K19558p66904
13892H81329M51039K62116q6928n41191N85080m08884J26374O3753P4761l20459
13882A086990L31036l9549L0123L3955k25570J13809k17674J85102N2966R877
$$ plain form
13872 1361065 1062388 1295768 1347298 1292545 1182048 914486 1176754 1021599 1200486 1242910
13862 1242910 966269 1403363 1532552 1163275 1048060 909225 1114789 1281788 905955
13853 905955 884027 971770 1460822 965332 1127534 1036237 1074412 1414614 1214069 900895
13843 900895 865228 732367 716891 1304991 1133264 967531 888916 1005546 849836 1212332
13833 1212332 942298 839105 1016387 1164684 903458 1026158 1057637 830766 841732 1043854
13823 1043854 955383 1384732 948312 978188 1075779 834854 856561 728510 779082 1133608
13813 1133608 693740 1104918 1026554 798669 782515 516365 853459 910497 1040936 1014383
13803 1014383 1236238 1064264 1183763 808185 791888 884675 907233 833636 1119935 1219882
$$ packed form
13872A361065k98677K33380N1530n4753j10497k67562K62268j55155J78887M2424
13862A242910k76641M37094J29189l69277j15215j38835K05564J66999l75833
13853I05955k1928Q7743M89052m95490J62202r1297L8175L40202k00545l13174
13843I00895l5667j32861j5476N88100j71727j65733p8615J16630j55710L62496
13833A212332k70034j03193J77282J48297k61226J22700L1479k26871J0966K02122
13823A043854q8471M29349m36420K9876R7591k40925K1707j28051N0572L54526
13813A133608m39868M11178p8364k27885j6154k66150L37094N7038J30439k6553
13803A014383K21855j71974J19499l75578j6297R2787K2558p3597K86299R9947
$$ plain form
13793 1219882 836186 906206 1054133 892129 915366 856550 1014157 1006889 520606 789461
13783 789461 1012654 1011956 845406 829619 973366 727717 698264 773104 702111 690991 675645
13772 675645 868247 823361 731227 953452 722034 760615 561267 704472 685890 602033
13762 602033 846696 745333 338531 805668 547723 1020252 813255 559540 778772 834218
13752 834218 948248 700383 777278 631791 699246 559889 650044 1104332 745583 732498
13742 732498 488615 687729 608427 389499 673605 726355 761282 481906 761652 707174
13732 707174 570765 867295 401330 525483 600198 990443 688848 482940 287475 577383
13722 577383 435342 431249 809825 393318 695953 750062 692518 647404 667791 801425 639050
$$ packed form
13793A219882l83696P0020J47927j62004K3237n8816J57607p268m86283K68855
13783G89461K23193o98j66550j5787J43747k45649k9453P4840p0993j1120j5346
13772F75645J92602m4886r2134K22225k31418L8581j99348J43205j8582q3857
13762F02033K44663j01363C38531M67137k57945M72529k06997k53715K19232N5446
13752H34218J14030k47865P6895j45487O7455j39357R0155M54288l58749j3085
13742G32498k43883J99114p9302k18928K84106N2750L4927k79376K79746n4478
13732G07174j36409K96530D01330J24153P4715L90245l01595k05908j95465K89908
13722E77383j42041m093L78576C93318L02635N4109n7544m5114K0387J33634j62375
$$ plain form
13711 639050 530185 533379 790435 407545 507635 209472 367585 429083 484969 365678
13701 365678 773096 925666 675893 289747 614597 579100 475350 85983 748525 684880
13691 684880 684071 984977 586504 414943 505843 544850 760704 745343 375386 431831 660119
13680 660119 842470 568634 281519 505099 384176 948984 310245 146344 612616 490977
13670 490977 374092 450603 359313 469887 276732 105119 422511 598426 668141 146948
13659 417837 475329 619567 510713 391387 376945 632375 274813 288177 489454 407545
13649 407545 329247 622863 770843 265683 334967 517563 423075 264458 674900 -67249
13638 632748 305071 648666 372758 698133 498271 494818 236200 276679 467522 473868
$$ packed form
13711F39050j08865L194K57056l82890J00090B09472J58113O1498N5886j19291
13701C65678M07418J52570k49773B89747L24850l5497j03750H5983O62542o3645
13691F84880q09L00906l98473j71561R0900L9007K15854j5361l69957N6445K28288
13680F60119J82351k73836B81519K23580j20923N64808C10245A46344M66272j21639
13670D90977j16885P6511r1290J10574j93155A05119L17392J75915O9715A46948
13659D17837N7492J44238j08854j19326j4442K55430B74813J3364K01277q1909
13649D07545p8298K93616J47980B65683O9284J82596r4488j58617M10442f7249
13638F32748C05071L43595k75908L25375j99862l453B36200M0479J90843O346
$$ plain form
13628 473868 241490 440671 192636 401850 333833 324403 551689 304121 359468 422186
13618 422186 342686 643121 238694 378552 157389 140567 377320 567974 626484 311338
13607 242181 336425 654630 169297 295529 693109 389237 414365 38474 506711 408893
13597 408893 435913 176925 653195 160411 345436 628180 717603 459333 624365 331275
13587 331275 407001 197456 188640 234708 126742 -175844 156821 719513 679283 400927
13577 400927 576684 114972 310597 575576 561353 122732 542014 -24541 204885 634489
13567 634489 251684 299595 713480 124219 405607 476894 463827 294168 448415 280919
13557 280919 391387 286133 510279 392178 -90483 204960 316219 605576 490456 11641
$$ packed form
13628D73868k32378J99181A92636K09214o8017r430K27286k47568N5347O2718
13618D22186p9500L00435B38694J39858A57389j6822K36753J90654N8510C11338
13607B42181R4244L18205A69297J26232L97580l03872K5128C8474M68237r7818
13597D08893K7020A76925M76270A60411J85025K82744Q9423k58270J65032k93090
13587C31275P5726A97456q816M6068j07966a75844A56821N62692m0230k78356
13577D00927J75757A14972J95625K64979j4223A22732M19282b4541B04885M29604
13567F34489B51684M7911M13885A24219K81388P1287j3067j69659J54247j67496
13557B80919J10468j05254K24146j18101i0483B04960J11259K89357j15120A1641
$$ plain form
13546 185084 498117 170276 401645 184645 267271 499574 542209 313350 232740 144212
13536 144212 338692 242589 494026 371268 83917 463177 187847 352091 672908 376747
13526 376747 145995 226181 277037 136118 366989 619213 371940 -58147 272968 538985
13516 538985 320843 -15116 541419 289113 321987 216826 173887 420065 241389 342725
13506 342725 348836 245253 134732 -116 394603 264648 102567 204383 217539 185257 425283
13495 425283 498817 104384 205045 264832 202768 305499 90264 294952 113823 187242
13485 187242 410162 85920 235192 300643 127734 382528 -7234 105953 -15938 261519
13474 421973 216988 163816 240866 326711 130875 352436 86303 239728 -266504 189257
$$ packed form
13546A85084L13033A70276K31369A84645Q2626K32303M2635k28859q0610q8528
13536A44212J94480r6103K51437j22758H3917L79260A87847J64244L20817k96161
13526C76747A45995Q0186N0856A36118K30871K52224k47273e8147B72968K66017
13516E38985k18142a5116E41419k52306L2874j05161m2939K46178j78676J01336
13506C42725O111j03583j10521a16C94603j29955A02567J01816J3156l2282K40026
13495D25283P3534A04384J00661N9787o2064J02731I0264K04688A13823P3419
13485A87242K22920H5920J49272O5451A27734K54794g234A05953a5938B61519
13474D21973k04985n3172P7050Q5845A30875K21561H6303J53425b66504A89257
$$ plain form
13463 145178 169740 107353 486976 199714 631898 104024 347985 223114 414585 302907
13453 302907 301371 173980 209835 118609 427347 385804 13142 345616 364639 89437 394602
13442 394602 408547 41757 310416 286685 375860 83825 433974 182980 11299 91228 308154
13431 308154 143126 406029 128034 32774 143189 133645 167396 515423 246448 348971
13421 348971 -52608 -63079 63586 410248 -423269 310016 66053 321063 392222 430724 324270
13410 324270 475618 30901 349052 53992 191016 403813 -44438 196198 -26784 -116283
13400 -116283 237247 37870 408469 217079 177805 77746 -56344 -78003 242189 59453 53201
13389 53201 450520 682746 223902 412284 -38797 233516 656313 167360 111706 190601
$$ packed form
13463A45178K4562o2387L79623A99714M32184A04024K43961j24871J91471j11678
13453C02907j536j27391L5855r1226L08738m1543A3142L32474J9023H9437L05165
13442C94602J3945D1757K68659k3731Q9175H3825L50149A82980A1299P9929K16926
13431C08154A43126K62903A28034C2774J10415r544L3751L48027B46448J02523
13421C48971e2608j0471F3586L46662d23269C10016F6053K55010P1159L8502j06454
13410C24270J51348C0901L18151E3992J37024K12797d4438A96198b6784q9499
13400a16283B37247C7870L70599j91390l9274G7746e6344k1659B42189E9453o252
13389E3201L97319K32226B23902J88382c8797B33516M22797A67360n5654P8895
$$ plain form
13379 190601 83743 178594 256845 -15006 109057 509877 260084 232396 233284 279638 180310
13368 180310 -17772 371881 63033 455855 318322 422759 117235 143690 -71296 152057
13357 248964 169819 574239 -141239 189784 3660 156652 242729 233051 466432 345178 242831
13346 242831 -9962 152075 39295 318797 550202 221792 262263 71689 420119 -64770 189348
13334 343578 113633 78064 203954 195447 106119 49371 564117 124100 -7765 184604 190461
13323 190461 321443 -60898 117520 258210 91716 82010 274821 135037 224653 177775 14246
13311 329398 348413 168143 306528 237952 123769 147993 153782 231583 -72643 338802 201821
13300 201821 132347 -53756 423061 -158557 324969 180160 123932 178551 -246115 534538
$$ packed form
13379A90601H3743R4851P8251a5006A09057M00820k49793k7688Q88M6354r9328
13368A80310a7772C71881F3033L92822j37533J04437A17235K6455g1296A52057
13357B48964p9145M04420a41239A89784C660J52992Q6077r678K33381j21254j02347
13346B42831i962A52075C9295K79502K31405B21792M0471G1689L48430f4770A89348
13334C43578A13633l5569J25890q507q9328D9371N14746A24100g765A84604N857
13323A90461J30982f0898A17520J40690I1716r706J92811A35037Q9616m6878A4246
13311C29398J9015A68143J38385o8576j14183K4224N789P7801g2643C38802j36981
13300B01821o9474e3756D23061a58557C24969j44809n6228N4619b46115E34538
$$ plain form
13289 -207312 -211673 317131 -13280 326623 87469 142531 -127350 17780 -26781 -100614 380642
13277 117635 400170 96069 -249717 305511 497026 42025 221368 103099 5214 280494
13267 280494 270761 -208190 -171018 382882 26663 70687 17119 75302 -84148 310408 89773
13255 134599 -55091 141743 57303 353761 523230 231079 222364 316842 232804 74593 297544
13244 297544 178726 58020 167748 178667 80948 494274 -140477 221886 -475208 263688
13233 102117 392946 277818 120687 46566 169667 1057 -131379 135843 228794 468826
13223 468826 253440 191284 460670 175461 215718 341487 183515 225615 98980 283550
13213 283550 33231 56159 -191826 247553 587740 -60736 81436 61216 -81509 133527 304170
$$ packed form
13289b07312m361C17131a3280C26623H7469N5062a27350A7780b6781p3833C80642
13277A17635K82535I6069b49717C05511J91515D2025J79343A03099E214K75280
13267B80494r733b08190L7172C82882B6663M4024A7119N8183h4148C10408H9773
13255A34599e5091A41743E7303K96458J69469B31079q715R4478q4038G4593K22951
13244B97544j18818E8020J09728J0919H0948M13326a40477B21886d75208B63688
13233A02117K90829j15128A20687D6566J23101A057a31379A35843R2951K40032
13223D68826k15386o2156K69386A75461M0257J25769j57972M2100I8980J84570
13213B83550C3231K2928a91826B47553L40187f0736H1436k0220h1509A33527J70643
$$ plain form
13202 304170 33390 -52690 42482 212299 309624 25030 -229334 -54009 362620 114810 231979
13191 231979 204753 98677 233902 271935 -118340 -257813 198321 311081 30600 93172
13181 93172 173207 -281532 -19300 -45473 22138 -316122 22679 42016 124645 65786 -110673
13169 -10298 -49554 137318 -116671 81930 -303776 -120419 121408 252308 115872 193228
13159 193228 60143 49245 78814 325276 241102 182614 -403586 93695 -128371 44822 263542
13148 263542 166363 330366 444256 256794 -162215 -89370 92989 -85448 247909 -20985
13137 119666 160412 -28178 102592 87561 57682 -100339 22316 194071 -2505 -4300 72077
13125 -44286 -3633 291306 178771 10654 212125 -340044 5243 529352 194387 25232 22763
$$ packed form
13202C04170C3390e2690D2482J69817R7325B5030b29334e4009C62620A14810J17169
13191B31979k7226I8677J35225L8033a18340j39473A98321J12760C0600O2572
13181I3172Q0035b81532a9300k6173B2138c16122B2679J9337Q2629n8859a10673
13169a0298l9256A37318a16671H1930c03776a20419A21408J30900A15872P7356
13159A93228F0143j0898K9569K46462q4174n8488d03586I3695a28371D4822K18720
13148B63542r7179J64003J13890j87462a62215P2845I2989h5448B47909b0985
13137A19666M0746b8178A02592j5031k9879a00339B2316J71755b505j795G2077
13125d4286c633B91306j12535A0654K01471c40044E243N24109A94387B5232k469
$$ plain form
13114 22763 71990 245287 291475 289051 336837 459759 118732 -228128 121394 216872 129699
13103 129699 -224479 2396 149159 -99512 -347952 96757 81823 -114114 -56929 -220192 79345
13091 250468 178423 215583 73676 78218 -256881 -66977 207138 231315 5141 186508 -55285
13079 91905 -72168 151637 -4793 240495 -196127 8418 107723 517147 167451 -11056 -142333
13068 -142333 30344 17970 -114365 119506 393339 19590 781 45571 124411 -4826 269279
13056 368 -52789 145275 95443 101306 207335 311069 76062 -101771 53911 384452 39306
13044 142425 257717 176083 80558 17351 530662 71173 287365 265505 -70304 -66487 92025
13032 -40292 61803 388622 204357 -78233 78982 228870 50104 -69414 616643 54004 -50326
$$ packed form
13114B2763M9227J73297M6188k424M7786J22922A18732b28128A21394R5478q7173
13103A29699b24479B396J46763i9512k48440I6757j4934a14114e6929j63263G9345
13091B50468p2045L7160G3676M542b56881f6977B07138K4177E141J81367e5285
13079I1905g2168A51637d793B40495a96127H418R9305M09424A67451a1056j31277
13068a42333C0344j2374a14365A19506K73833A9590G81M4790P8840d826B69279
13056C68e2789A45275m9832N863J06029J03734G6062a01771E3911L30541C9306
13044A42425J15292q1634H0558A7351N13311G1173K16192k1860g0304L817I2025
13032d0292F1803L26819j84265g8233G8982J49888E0104f9414F16643E4004e0326
$$ plain form
13020 52637 -60971 463363 103731 354589 126533 -68882 296061 343741 -339755 605593
13009 -170354 424102 -108630 45284 -4506 162357 303929 10584 117760 -399675 -138258
12998 167641 191533 -51989 -287262 346090 104700 -103902 -87184 37152 64266 -155042
12987 119583 -298816 -242327 362644 -35255 114191 17844 -20413 -171039 68594 -13384 68129
12975 -101350 314738 -84342 -47978 196372 -216730 58804 -139146 96379 211887 207197 -208989
12963 480903 108677 178822 -37454 -197654 157685 221057 287652 21606 -106110 108256
12952 -131802 226706 -119609 105670 164383 -109996 -154503 98770 254032 42081 -249198
12941 -37013 230628 -122453 151787 12140 -23614 -139189 -80884 242627 351615 -121889
$$ packed form
13020E2637f0971D63363A03731K50858A26533f8882B96061M7680c39755F05593
13009a70354D24102a08630D5284d506A62357J41572A0584J07176c99675a38258
12998A67641K3892e1989k35273C46090A04700a03902J6718C7152K7114a55042
12987A19583b98816N6489C62644c5255A14191A7844b0413j50626F8594a3384F8129
12975a01350C14738h4342L6364A96372b16730E8804a39146I6379J15508m690b08989
12963D80903A08677P0145c7454j60200A57685O3372O6595B1606a06110A08256
12952a31802B26706a19609A05670N8713a09996m4507I8770J55262D2081b49198
12941c7013B30628a22453A51787A2140b3614j15575N8305B42627J08988a21889
$$ plain form
12930 -71530 192753 322401 -263896 5021 -18520 -143427 -164778 26731 -193317 -83877 -321508
12919 -321508 -82974 197372 185614 121567 286744 67707 -280361 112879 -207 -266704 -88260
12907 13609 56889 -329424 -130686 -122418 556684 244532 390528 54977 -30856 241573 -146939
12895 117986 61472 46581 -166089 188310 -28263 217133 -347673 332421 48372 427851
12885 427851 271091 22466 -345517 153619 -148107 -107781 205722 303372 106387 161970
12875 161970 83788 -56314 399295 338353 11466 67695 55364 -52037 145989 107647 -126006
12863 -21948 216235 197298 -23511 11618 233286 -344723 69378 40433 -81201 135127 -204912
12851 -193521 -213230 -203006 -158134 -310072 -101849 107769 -3397 202188 208878 102666 330988
$$ packed form
12930g1530A92753J29648b63896E021a8520j24907k1351B6731a93317h3877k37631
12919c21508h2974A97372j1758o4047J65177F7707b80361A12879b07k66497h8260
12907A3609M3280c29424a30686Q268E56684B44532J45996E4977c0856B41573a46939
12895A17986n6514j4891a66089A88310b8263B17133c47673C32421D8372L79479
12885D27851j56760B2466c45517A53619a48107M0326B05722R7650A06387N5583
12875A61970p8182e6314C99295o0942A1466N6229j2331e2037A45989l8342a26006
12863b1948B16235j8937b3511A1618K21668c44723F9378k8945h1201A35127b04912
12851a93521j9709J0224M4872j51938a01849A07769c397B02188O690A02666K28322
$$ plain form
12840 330988 113415 392594 256455 31938 -14235 -13025 -273501 -66613 -230492 49159 -176177
12828 480372 299230 -146900 -40697 176512 79678 -17787 -21505 162160 436188 -87060 -63180
12817 -63180 -193799 90914 144130 198805 -110441 481026 67126 318689 61343 365650 86176
12805 -65862 218940 -221476 -282877 236195 363824 41399 169576 86036 288006 293538 189845
12794 189845 -59967 -333583 410521 -11013 -96127 -342836 76473 -132683 133604 9232 169735
12783 169735 -294813 -165992 -61592 -129107 -85046 111883 -232922 4241 107417 -132 116003
12771 -141917 -216505 272045 -82257 -256692 115413 -191977 211301 -331090 41159 25114
12761 25114 -138433 -74008 76945 51011 316874 -274633 -44849 4277 -18184 180166 325590
$$ packed form
12840C30988A13415K79179j36139C1938a4235J210k60476f6613j63879D9159a76177
12828D80372j81142a46900d0697A76512G9678a7787l718A62160K74028h7060K3880
12817f3180j30619I0914N3216N4675a10441D81026F7126K51563F1343L04307H6176
12805f5862B18940b21476o1401B36195J27629D1399J28177q3540K01970N532j03693
12794A89845e9967k73616D10521a1013q5114k46709G6473a32683A33604I232J60503
12783A69735b94813J28821f1592o7515M4061A11883b32922D241J03176a32A16003
12771a41917p4588B72045h2257j74435A15413a91977B11301c31090D1159j6045
12761B5114a38433O4425G6945k5934K65863b74633d4849D277a8184A80166J45424
$$ plain form
12750 325590 -47777 264231 289532 359690 -101943 -44603 85985 186153 -256554 -182277 5867
12738 57726 93218 98918 164885 309391 88972 244271 7510 -234044 200547 -35989 -231360
12727 -231360 184979 50918 279829 138477 150360 -184426 289420 125334 13535 76772
12717 76772 -172602 112536 22263 -89913 -114039 96536 288544 320302 246697 -62191 206876
12705 307620 167061 38946 252827 175515 -68963 144930 445090 16916 -25517 -185892
12695 -185892 -102701 244265 103371 45711 45509 -46606 -133258 -14336 272731 291178 95083
12683 55847 -45979 375496 294990 92186 272298 328990 149001 -189684 -128967 3832 151255
12672 151255 -90674 10947 -21012 77166 -285476 204374 312333 73553 159535 8381 290180
$$ packed form
12750C25590d7777B64231K5301P0158a01943d4603H5985J00168b56554P4277E867
12738E7726L5492N700O5967J44506H8972J55299G510b34044B00547c5989j95371
12727b31360A84979E0918K28911A38477J1883a84426B89420A25334A3535O3237
12717G6772a72602A12536B2263h9913k4126I6536J92008L1758p3605f2191B06876
12705C07620j40559C8946K13881p7312f8963A44930L00160A6916b5517j60375
12695a85892Q3191B44265A03371D5711k02d6606q6652a4336B72731J8447I5083
12683E5847d5979C75496q0506I2186J80112N6692A49001a89684O0717C832J47423
12672A51255i0674A0947b1012G7166b85476B04374J07959G3553Q5982H381K81799
$$ plain form
12661 290180 206557 257752 83900 1169 113152 270528 189127 254011 133395 -135287 107183
12649 -79812 -126140 280459 206386 -131279 277588 43010 -86801 127666 -57621 -137653 267864
12637 -157554 -220102 138863 333968 136919 101484 154559 -64498 465777 208878 -45760
12626 -3124 142916 301187 -41105 101903 131106 235307 125174 -269046 168712 182497
12616 182497 24765 78091 -218068 47856 -4250 240112 -9035 -213569 -44691 55225 343638
12605 343638 111765 35369 170459 230213 139507 380129 -50815 99473 234016 -249234
12594 -291059 146032 66236 253244 -102704 238623 135714 -144070 -328245 74056 -685
12583 59942 56735 260791 -74753 51420 123813 266832 -155882 -193942 149629 370112 -180971
$$ packed form
12661B90180q3623N1195H3900A169J11983J57376q1401O4884j20616a35287A07183
12649g9812m6328B80459p4073a31279B77588D3010h6801A27666e7621q0032B67864
12637a57554o2548A38863J95105A36919l5435N3075f4498D65777B08878d5760
12626c124A42916J58271d1105A01903K9203J04201j10133b69046A68712J3785
12616A82497B4765N3326b18068D7856d250B40112i035k04534d4691E5225K88413
12605C43638A11765C5369J35090N9754r0706K40622e0815I9473J34543b49234
12594b91059A46032F6236J87008a02704B38623j02909a44070j84175G4056f85
12583E9942l207K04056g4753E1420P2393J43019a55882l8060A49629K20483a80971
$$ plain form
12571 95097 126341 -131517 -145151 229035 321193 39081 -17210 -75703 7020 23039 16368 -259741
12558 18851 -47585 250265 9442 4679 -79777 -59345 67572 -132817 -71462 250878 -335147
12546 -173786 -194702 37536 -197031 -93924 358342 -87317 30279 245211 161834 369319 -69091
12534 304538 48552 23824 167753 229729 215899 37300 146620 -241260 -137238 311119
12523 -75132 14145 71595 56261 64782 445697 179465 149957 142822 175632 -127211 93550
12511 -62746 136115 -176270 -8122 -35722 67620 -87437 401952 13100 -59448 152461 98291
12500 98291 64791 97067 -230842 8729 105725 230823 -157937 -174313 -215310 375001 141846
12488 108768 10 -47232 -96460 116918 112990 332260 35527 -45074 -159802 184525 54287
$$ packed form
12571I5097L1244a31517j3634B29035R2158C9081a7210n8493G020J6019o671b59741
12558A8851d7585B50265I442D679g9777K0432F7572a32817O1355B50878c35147
12546a73786k0916C7536a97031i3924C58342h7317C0279K14932q3377K07485f9091
12534C04538D8552B3824J43929O1976j3830C7300J09320b41260J04022C11119
12523g5132A4145N7450j5334Q521L80915A79465k9508p135L2810a27211I3550
12511f2746A36115a76270h122k7600F7620h7437D01952A3100e9448A52461n4170
12500I8291l3500L2276b30842H729R6996J25098a57937j6376m0997C75001A41846
12488A08768A0d7232m9228A16918l928K19270C5527d5074j14728A84525E4287
$$ plain form
12476 -181164 -262071 -318615 120974 -3613 -105861 -537349 -54116 -182186 -159760 -38862 203848
12464 80063 -201296 -220415 181948 -38532 162830 -144388 -134259 54539 170798 -73425 -31336
12452 373814 122811 -124746 11732 -198015 170728 -11457 -148163 -235580 123721 -333853
12441 -88438 -154841 116380 -21219 5476 -321238 -149270 112200 88274 -57004 29660 258071
12430 258071 -256254 -272478 -117234 11138 79599 38722 69663 37351 90610 -62827 -17176
12418 100958 -294287 -196462 186419 3461 301091 414320 -115918 -86332 150731 -154456
12407 -75378 -52686 351 335721 259454 116717 108977 -159374 147897 -177001 -136332 -110827
12396 -110827 84690 -129122 -77959 92132 154681 -51708 455328 486469 184323 112979 -104055
$$ packed form
12476a81164q0907n6544A20974c613j02248m31488e4116j28070K2426c8862B03848
12464H0063b01296j9119A81948c8532A62830a44388J0129E4539J16259g3425c1336
12452C73814A22811a24746A1732a98015A70728a1457j36706q7417A23721c33853
12441h8438o6403A16380b1219E476c21238a49270A12200k3926e7004B9660K28411
12430B58071b56254j6224a17234A1138O8461C8722L0941l2312N3259f2827a7176
12418A00958b94287R7825A86419C461K97630J13229a15918K9586A50731a54456
12407g5378K2692C51L35370p6267A16717p740a59374A47897a77001M0669K5505
12396a10827H4690a29122N1163I2132O2549e1708D55328L1141A84323p1344a04055
$$ plain form
12384 -137734 8968 72856 -21044 -116961 73945 -120696 237271 181208 -164690 303959 -97230
12372 -12695 221385 -286771 35454 -149618 -11556 -7694 -838 211751 -124802 60658 -121297
12360 29180 -179643 86636 -74841 -101756 -179494 -275029 -96146 -132588 519816 -62783 -151752
12349 -151752 72153 152503 -407150 9561 40080 -55869 -60004 50205 398862 159658 226444
12338 226444 -216609 105271 -212331 -79022 302263 222407 -97667 -51239 237362 120284
12328 120284 -90274 -16456 258589 106086 -33402 -127043 109408 72274 166517 -105715 -118448
12317 -118448 27988 63348 303215 86185 -203025 149932 59006 104343 87880 -60709 139957
12305 124422 109120 -105866 449068 156422 27425 63884 109384 -200551 -60435 14526 6227
$$ packed form
12384a37734H968O3888b1044r5917G3945a20696B37271n6063a64690C03959i7230
12372a2695B21385b86771C5454a49618a1556L862h38B11751a24802F0658a21297
12360B9180a79643H6636g4841k6915p7738r5535i6146l6442E19816f2783q8969
12349a51752G2153Q0350d07150I561L0519e5869m135E0205L48657A59658O6786
12338B26444b16609A05271b12331g9022C02263p9856i7667M6428B37362j17078
12328A20284i0274a6456B58589A06086c3402r3641A09408l7134R4243a05715j2733
12317a18448B7988L5360K39867H6185b03025A49932E9006M5337j6463f0709A39957
12305A24422j5302a05866D49068A56422B7425L6459M5500b00551f0435A4526F227
$$ plain form
12293 31873 -227752 -76912 136133 90530 -14792 -190785 34100 -27728 -40029 30572 -166038
12281 -59466 283320 -205280 -244977 158657 -43552 112920 97391 226646 109961 160848
12271 160848 104803 180372 239420 156336 18996 38947 -96635 18528 -117709 372743 -120938
12259 -53929 -231016 231945 431965 192865 137419 41218 391382 87333 145544 433442
12249 433442 -63263 -73082 -26850 -308892 501246 -242962 10390 403541 333228 -127471 -29615
12237 -194710 -172323 20899 5848 -143424 -214455 78966 -89123 222986 22165 61222 267928
12226 267928 192732 217155 180327 625466 295468 300392 322883 102490 428348 268896 -131673
12214 348536 301603 269248 -19529 -4243 280385 165660 -32616 48946 71104 277559 121945
$$ packed form
12293C1873b27752g6912A36133m5603a4792j75993C4100b7728j2301C0572a66038
12281e9466B83320b05280l9697A58657d3552A12920j5529J29255A09961N0887
12271A60848n6045P5569N9048q3084A8996J9951i6635A8528a17709C72743a20938
12259e3929j77087B31945K00020A92865n5446D1218L50164H7333N8211K87898
12249D33442f3263r819b6850k82042E01246b42962A0390L93151p0313a27471b9615
12237a94710K2387B0899E848a43424p1031G8966h9123B22986B2165L9057K06706
12226B67928p5196K4423l6828M45139B95468M924K2491A02490L25858j59452a31673
12214C48536m6933l2355a9529d243B80385j14725c2616D8946K2158K06455A21945
$$ plain form
12202 357846 264681 95049 -936 -47972 114990 56736 493520 141276 387142 203841 432964
12191 432964 223003 188870 213223 249806 -56015 258371 451880 101971 38659 -200570
12180 326025 261193 40689 -113862 -44255 185360 -172349 391379 509141 127438 49895
12169 163171 168492 123233 263777 36324 375062 -137997 -1267 -138864 197499 306401 169011
12158 169011 -153003 264242 49549 4965 -139305 122008 -31189 -179663 113964 -293632
12147 -25742 56899 -33312 48388 319041 39440 -50874 78373 -8991 349328 -111106 -107552
12136 -107552 247452 219495 -28977 -96174 51191 221055 168897 306418 81328 101569 -68406
12124 89060 -1315 113978 133260 107565 126345 -113831 -450882 -64297 -195216 -313853 -105093
$$ packed form
12202C57846r3165I5049i36m7036A14990E6736M36784A41276K45866j83301K29123
12191D32964k09961l4133K4353L6583e6015B58371J93509A01971C8659b00570
12180C26025o4832D0689a13862d4255A85360a72349C91379J17762A27438D9895
12169A63171N321m5259J40544C6324L38738a37997a267j37597A97499J08902j37390
12158A69011a53003B64242D9549D965a39305A22008c1189j48474A13964b93632
12147b5742E6899c3312D8388K70653C9440e0874G8373h991C49328a11106L554
12136a07552B47452k7957b8977o7197E1191J69864n2158J37521H1328K0241f8406
12124H9060a315A13978J9282k5695J8780a13831l37051f4297j30919j18637a05093
$$ plain form
12112 26793 85777 -36075 -162793 -220307 182068 264960 -82944 255095 -179052 63976 129412
12101 129412 25274 -49703 -90621 175778 -244188 -201094 7746 216604 136251 -314003 -383050
12090 -383050 167685 101202 -95238 -256860 172934 -84297 13575 347447 -185491 107985
12079 -229746 -83424 171129 766783 1260045 2571714 647382 263864 279483 -38634 -259924
12069 -259924 20521 -90818 -175219 -17429 251971 303699 -54763 330006 369734 -332347 227294
12057 22753 -32916 -105632 245435 -12237 226364 -80756 -28735 -95414 446798 46585 -20487
12045 -61908 -302134 -432574 70777 -188252 82409 -181987 -207822 240727 -205800 58370
12034 -116344 105215 -286842 -210280 -333537 -2161 -92875 -102149 183094 1432 -265208 124702
$$ packed form
12112B6793N8984c6075j26718n7514A82068Q2892h2944B55095a79052F3976O5436
12101A29412B5274d9703m0918A75778b44188M3094G746K08858q0353c14003o9047
12090c83050A67685o6483i5238j61622A72934h4297A3575L33872a85491A07985
12079b29746h3424A71129N95654M93262J311669F47382B63864J5619c8634k21290
12069b59924B0521i0818q4401a7429B51971N1728e4763C30006L9728c32347B27294
12057B2753c2916p2716B45435a2237B26364h0756b8735o6679D46798D6585b0487
12045f1908k40226j30440G0777a88252H2409a81987k5835B40727b05800E8370
12034a16344A05215b86842P6562j23257b161r0714r274A83094A432b65208A24702
$$ plain form
12022 -197731 -97932 219306 -229270 174249 3792 190462 -87183 379716 278982 2285 73652
12011 73652 -38887 -67180 159936 199880 19447 -165097 -188573 -23680 87909 122989 -380991
11999 -97924 -938 277646 72356 -140219 -192806 -33868 -87317 66701 279961 63058 -213171
11987 -21966 -123261 -12543 -231038 93445 -124411 -198324 -161134 -140889 46639 -114704 -37227
11975 667090 -18481 249244 -150806 -41335 108877 -124729 -51163 -125639 -25104 -34967 85493
11963 46566 72038 -266687 68095 4730 -402527 -45063 61678 -156127 -394784 -286897 -139896
11951 -216715 134679 190404 229365 24046 226251 -154561 6852 72544 94704 -136585 -210322
11940 -210322 195480 18995 -17618 -245837 -49310 -219938 -45167 83895 121751 298447 29157
$$ packed form
12022a97731i7932B19306b29270A74249C792J86670h7183C79716j00734B285P1367
12011G3652c8887k8293A59936L9944A9447a65097k3476b3680H7909L5080c80991
11999i7924i38B77646G2356a40219n2587c3868n3449F6701K13260F3058b13171
11987b1966j01295a2543k18495I3445a24411p3913L7190K0245D6639a14704c7227
11975F67090a8481B49244a50806d1335A08877a24729e1163p4476b5104r863H5493
11963D6566K5472b66687F8095D730d02527d5063F1678a56127k38657J07887a39896
11951b16715A34679N5725L8961B4046K02205a54561F852O5692K2160a36585p3737
11940b10322A95480A8995a7618k28219d9310j70628d5167H3895L7856J76696B9157
$$ plain form
11928 247644 102569 37092 -127059 212670 -164380 -171038 168161 168622 47674 67295 -14222
11916 -327492 -15728 127203 189268 38243 198559 -132619 18023 -198744 74491 -494856
11905 -64460 -65862 232300 -191902 105200 239920 50091 456118 137678 -22563 168540
11894 -660059 262649 18833 73816 77579 103237 194734 234386 -37278 48799 17825 127604
11883 127604 74369 -165023 373333 -197663 -41095 -309864 73683 -23593 -11825 259122
11872 95420 145353 215546 5662 -61228 40862 52060 -255167 -291494 -265863 -52890 -61434 71764
11859 -64915 -252153 -98279 76654 -132511 70130 -56587 -316996 -370062 -209205 -297862 -177742
11848 -177742 198784 8606 -116947 5809 -50681 35743 222754 229810 -41670 -107218 -71580
$$ packed form
11928B47644A02569C7092a27059B12670a64380o658A68161M61D7674J9621a4222
11916c27492a5728A27203O2065C8243J60316a32619A8023a98744G4491d94856
11905f4460j402B32300a91902A05200J34720E0091M06027A37678b2563A68540
11894f60059B62649A8833N4983L763K5658R1497L9652c7278D8799A7825J09779
11883A27604n3235a65023C73333a97663d1095k68769G3683b3593J1768B59122
11872I5420M9933P0193E662f1228D0862J1198b55167l6327K5631e2890q544G1764
11859f4915j87238i8279G6654a32511G0130e6587k60409n3066J60857q8657J20120
11848a77742A98784H606a16947E809e0681C5743J87011P056d1670o5548L5638
$$ plain form
11837 -71580 66879 -52537 -19188 -202459 -275909 -21496 64252 -33396 -49940 -202925 99223
11825 -35966 -13229 -162172 93077 -413521 100259 -17611 -318289 94649 192848 49579 -130683
11813 265812 64995 -133054 -99857 145863 -78222 -52601 240942 124249 -103473 -173942
11803 -173942 169489 -210801 39337 -442190 277256 47287 12194 -150203 -169754 -173610 -10725
11791 13756 -202336 -168075 12911 370596 44554 73303 -18328 -7594 -246837 -107667 29926
11779 133902 17477 188740 181687 -201290 -254249 -261183 -93233 -292153 123833 -245776 -175680
11768 -175680 1290 29406 138945 -162043 -107803 110699 726 8682 -391821 260026 -88162
11756 -265253 113885 154634 64418 -149396 -181378 -182601 -35861 60577 -28030 -249319 -254675
$$ packed form
11837g1580F6879e2537a9188j83271p3450b1496F4252c3396j6544j52985I9223
11825c5966a3229j48943I3077d13521A00259a7611l00678I4649R8199D9579a30683
11813B65812F4995a33054L3197A45863g8222K5621B40942j16693a03473p0469
11803a73942A69489b10801C9337d42190B77256D7287A2194a50203j9551l856a0725
11791A3756b02336L4261A2911L57685D4554K8749a8328g594k39243a07667B9926
11779A33902A7477J71263p053b01290n2959o934i3233j98920A23833b45776P0096
11768a75680A290K8116J09539a62043N4240A10699G26P956c91821B60026h8162
11756b65253A13885M0749F4418a49396l1982j223c5861F0577b8030k21289n356
$$ plain form
11745 -254675 -134638 159636 -74063 -274713 -143959 204745 242087 280489 -8439 22795 208880
11734 208880 305380 62600 -429278 -153038 -215451 231849 -281387 -47874 231849 237974 210225
11723 210225 135714 80608 -187894 103841 -70333 -27151 300476 98132 112707 62167 132535
11712 132535 105996 115782 -27689 228897 105362 136870 170750 36265 62195 175947 59908
11700 -370466 217768 15729 146615 -92938 -34751 489022 117323 52209 192403 -51608
11689 -58548 163479 269779 171053 413776 -329633 -155444 159608 123311 177465 48325
11678 278539 46135 80872 406490 532730 272458 238979 88411 187849 -98657 306878 -435747
11666 37180 91764 -131223 -241676 122395 93377 -134476 86716 148963 -151994 -107639 -114771
$$ packed form
11745b54675J20037A59636g4063k00650J30754B04745L7342L8402h439B2795J86085
11734B08880R6500F2600d29278a53038o2413B31849b81387d7874B31849O125k7749
11723B10225p4511n5106a87894A03841g0333b7151C00476I8132J4575n0540P0368
11712A32535k6539R786b7689B28897A05362L1508L3880C6265K5930J13752E9908
11700c70466B17768A5729J30886i2938c4751D89022A17323E2209J40194e1608
11689e8548A63479J06300r8726K42723c29633a55444A59608l6297N4154D8325
11678B78539D6135L4737L25618J26240k60272l3479H8411R9438i8657C06878d35747
11666C7180N4584a31223j10453A22395k9018a34476H6716O2247a51994M4355p132
$$ plain form
11655 -114771 65568 -118963 -161718 58808 -142592 199801 286398 31262 -15746 -42917 -54582
11644 -54582 -114480 -37845 300259 82001 348935 18546 257439 173170 213774 130657 -28636
11632 -39272 150951 53447 -88219 -9852 -93844 -17483 123943 12311 23337 275071 44803
11620 -151940 31735 413665 3977 122352 -268739 214636 30499 -357644 -10907 112394
11609 125541 172672 149643 243829 224387 26762 -195974 -210129 8218 -91009 125967 216384
11598 216384 -45621 134612 173131 -125034 74913 24479 42914 -83767 -123483 -11123 63029
11586 -22957 48830 377021 -3393 147940 -19678 -27522 13031 -77939 50376 64776 -206379
11574 -163672 145655 181122 100674 183955 -26728 131082 175964 -157881 140196 -35359 -77978
$$ packed form
11655a14771F5568a18963m2755E8808a42592A99801Q6597C1262a5746k7171j1665
11644e4582n9898c7845C00259H2001K66934A8546K38893q4269M0604q3117b8636
11632c9272A50951E3447h8219i852q3992a7483A23943A2311J1026K51734D4803
11620a51940C1735L81930C977J18375b68739B14636C0499c57644a0907A12394
11609A25541M7131k3029R4186j9442B6762a95974j4155H218i1009A25967R0417
11598B16384d5621A34612L8519a25034G4913B4479J8435h3767l9716a1123F3029
11586b2957D8830L28191c393A47940a9678p844A3031g7939E0376J4400b06379
11574a63672A45655L5467q0448Q3281b6728A31082M4882a57881A40196c5359m2619
$$ plain form
11563 -77978 162376 181759 268526 217700 -134779 -50196 -1158 366965 31340 -43269 -113917
11552 -113917 198461 57631 428153 128792 3530 -55840 341344 -95020 549855 192565
11541 144018 291282 148351 -172177 -36360 557789 -57107 510492 -8071 -40127 -121451 267917
11529 22842 -56097 -5163 -211399 -116102 189156 -39947 -13031 -13323 140546 260297 65537
11517 370345 -137294 189867 93689 187712 324149 436503 -74368 -69544 259160 509287
11507 509287 311554 133559 295695 22065 94702 161206 229649 -24347 471816 -24651 -25152
11496 -25152 27532 -166347 175903 72979 66423 237116 197427 488149 138083 305993 17669
11484 217964 132848 64459 374755 98327 134561 212518 245055 79881 9404 -34523 295165
$$ packed form
11563g7978A62376J9383Q6767n0826a34779e0196a158C66965C1340d3269p0648
11552a13917A98461E7631L70522A28792C530e5840C41344i5020E49855A92565
11541A44018J47264j42931a72177c6360E57789e7107E10492h071l2056q1324B67917
11529B2842e6097e163k06236R5297A89156c9947a3031k92A40546J19751F5537
11517C70345a37294A89867I3689R4023J36437J12354g4368M824B59160K50127
11507E09287j97733A33559J62136B2065P2637O6504O8443b4347D71816b4651n01
11496b5152B7532a66347A75903G2979o556J70693l9689K90722A38083J67910A7669
11484B17964q5116F4459L10296I8327L6234P7957L2537G9881I404c4523B95165
$$ plain form
11472 237052 47551 39492 236594 179752 329480 90164 -310514 -53416 114816 -88860 183836
11460 207821 68313 -250781 -60704 -101090 150868 -93559 42391 -113716 118860 210681 45734
11448 -18189 -188126 226419 97441 238089 788 20144 101404 76699 -179389 -19250 -55265
11437 -55265 -144624 283240 -45408 182148 -62396 608568 51883 93813 119106 -119233 5295
11425 247194 -197554 81173 -160835 -68309 -45886 -61766 24764 92978 156953 183476 -70167
11413 103649 -149760 -239851 161074 173230 105727 58639 6263 -194599 50414 185445 -59427
11401 140194 -101865 -134413 24970 -118208 94516 -7903 -137434 4758 -32490 177822 139611
11390 139611 161696 224422 -257905 -237894 -144265 115467 72301 255193 -32502 -170333 173077
$$ packed form
11472B37052D7551q059J97102n6842J49728I0164c10514e3416A14816h8860A83836
11460B07821F8313b50781f0704m0386A50868i3559D2391a13716A18860R1821D5734
11448a8189j69937B26419I7441J40648G88J9356Q1260k4705a79389a9250l6015
11437e5265q9359B83240d5408A82148f2396F08568E1883M1930K5293a19233E295
11425B47194a97554H1173a60835f8309K2423j5880B4764O8214O3975K6523g0167
11413A03649a49760r0091A61074J2156o7503m7088F263a94599E0414J35031e9427
11401A40194a01865l2548B4970a18208I4516g903j29531D758c2490A77822l8211
11390A39611K2085O2726b57905K0011R3629A15467m3166J82892c2502j37831A73077
$$ plain form
11378 -336071 -64957 -128873 256204 -87519 173158 180150 28974 113994 -119220 -187689 438725
11366 271393 -77496 -58692 -456882 -69145 -123288 289848 107050 77455 -288258 -81688 60298
11354 -104800 -16892 -344917 4303 -167518 -13256 -128385 56352 -53155 -19903 91216 462623
11343 462623 -298702 -82131 170051 -33355 217015 -255638 -48095 -109737 -239023 93477
11332 14846 260376 -136419 -6658 -25615 68499 -85203 -27431 -93681 -2341 -23207 109564
11320 -51833 -9696 141370 263416 238584 -131489 72090 -260386 191434 -22233 53274 -177639
11308 23657 -81542 -133548 27609 -208323 246334 244357 5400 156590 253258 101406 55548
11297 55548 60739 7427 134839 323389 146446 459022 -158480 -136343 185382 120573 -52518
$$ packed form
11378c36071f4957o3916B56204h7519A73158O992B8974Q5020a19220o8469D38725
11366B71393g7496J8804l98190f9145n4143B89848A07050k9595b88258h1688F0298
11354a04800a6892l28025D303a67518a3256j15129E6352e3155a9903I1216L71407
11343D62623b98702h2131A70051c3355B17015b55638d8095o1642j29286I3477
11332A4846K45530a36419f658j8957F8499h5203b7431o6250b341k0866A09564
11320e1833i696A41370J22046k4832a31489G2090b60386A91434b2233E3274a77639
11308B3657h1542n2006B7609b08323B46334j977E400J51190R6668A01406m5858
11297E5548N191G427J27412J88550A46446L12576a58480K2137A85382o4809e2518
$$ plain form
11285 -125804 262800 -20703 -121564 144598 -282977 -169823 -55704 8589 10842 151549 -213365
11273 -49689 96888 126945 -120261 -80645 -84877 -189682 -107592 116201 106267 -29082 -165578
11262 -165578 -159679 -280353 70069 -95158 152521 -184771 85555 -31843 -91264 21116 325596
11251 325596 47813 -150473 -209987 -282848 -265553 64957 216163 -78770 -37961 209483 217763
11240 217763 -212992 120429 -54380 60547 -144580 -360911 -28619 149466 23366 -91326
11229 107792 241430 -410185 -90308 127834 -263120 -56073 53376 32031 274514 -178429
11218 -117588 -304788 -91216 133817 75343 -102665 -85868 -159459 92720 -98582 -125117 -106213
11207 -106213 -12049 -111580 -41163 117135 204701 -115419 -58822 67429 -118730 191461 184897
$$ packed form
11285a25804B62800b0703j00861A44598b82977J13154e5704H589K253J40707b13365
11273d9689I6888L0057a20261L9616m232j04805Q2090A16201r934b9082j36496
11262a65578N899j20674G0069i5158A52521a84771H5555c1843n9421B1116L04480
11251C25596D7813a50473n9514p2861J7295F4957J51206g8770c7961B09483Q280
11240B17763b12992A20429e4380F0547a44580k16331b8619A49466B3366i1326
11229A07792J33638d10185i0308A27834b63120e6073E3376k1345K42483a78429
11218a17588j87200i1216A33817n8474a02665J6797p3591I2720i8582k6535J8904
11207a06213a2049r9531d1163A17135Q7566a15419N6597F7429a18730A91461o564
$$ plain form
11196 184897 124586 -85746 255043 55534 13239 47167 -52030 95445 -114016 -327859 -184800
11185 -184800 -19182 78038 -330481 -184231 99991 -303306 379388 -134991 -272498 138014
11174 -133679 28058 65800 -9973 235161 -27717 147534 23602 79839 -29573 -144230 -44124
11162 -110450 311940 75170 198423 -185304 102216 44866 -96417 -203416 5769 -109844
11151 396922 -225527 108158 -184883 202765 57212 35207 -176577 77295 16073 -59767
11140 3245 -22163 -31591 -49224 -140391 159074 -82429 65146 -90701 -52511 -401065 152418
11128 122454 91375 -53557 227236 -87366 19434 -13387 -50086 388440 -154308 -162611 -390433
11117 -390433 24447 30977 -6242 47602 197223 157365 33861 279642 43003 -113332 274025
$$ packed form
11196A84897o0311h5746B55043E5534A3239L3928e2030I5445a14016k13843J43059
11185a84800a9182G8038c30481J46250I9991c03306C79388a34991j37507A38014
11174a33679B8058L7742i973B35161b7717A47534B3602N6237b9573j14657d4124
11162a10450C11940G5170J23253a85304A02216D4866i6417j06999E769a09844
11151C96922b25527A08158a84883B02765E7212k2005a76577G7295A6073e9767
11140C245b2163r428j7633r1167A59074h2429F5146i0701L8190l48554A52418
11128A22454l1079e3557B27236h7366A9434a3387l6699C88440a54308q303k27822
11117c90433B4447O530f242D7602J49621l9858C3861K45781D3003a13332B74025
$$ plain form
11105 153215 190025 117469 169882 92054 103916 368125 2179 291388 545602 -73550 -177506
11094 -177506 121670 -232617 475038 223888 -132590 412553 47089 327053 284738 111979
11083 98292 27472 21081 -4129 338853 120835 395720 307373 11828 881447 128176 389192
11072 389192 287871 375947 305136 700147 384309 144868 291358 314586 -78330 459693
11061 360108 411928 386068 383774 994310 703473 431458 515578 484114 952278 1035948 604486
11050 604486 975175 930774 859314 967113 593757 890397 730232 561990 638087 682811
11040 682811 340053 760345 628223 604279 838568 666871 483367 657815 780600 666942
11030 666942 583372 685697 863005 625923 868801 551926 742075 718202 454766 1197445
$$ packed form
11105A53215L6810p2556N2413p7828J1862K64209B179K89209K54214g3550j03956
11094a77506A21670b32617D75038B23888a32590D12553D7089K79964m2315A11979
11083I8292B7472o391d129C38853A20835K74885q8347A1828Q69619A28176K61016
11072C89192j01321Q8076p0811L95011l15838A44868J46490K3228g8330D59693
11061C60108N1820k5860k294O10536k90837k72015Q4120l1464M68164Q3670m31462
11050F04486L70689m4401p1460J07799l73356K96640j60165j68242P6097M4724
11040F82811C40053M20292j32122k3944K34289j71697j83504J74448J22785j13658
11030F66942q3570J02325J77308k37082K42878l16875J90149k3873k63436P42679
$$ plain form
11020 1197445 574324 676600 628878 1100917 449397 524865 544369 537677 511908 735853
11010 735853 587516 487881 681468 823978 711889 781332 425953 660140 831136 861505
11000 861505 618268 769895 771910 183220 804190 1068769 690507 877952 790885 1006545
10990 1006545 650202 926763 880081 1169721 1018106 966987 1082042 1205597 918417 1161886
10980 1161886 1352696 1741236 1436244 1526793 1794630 2152318 2502033 2588118 2739796 2944954
10970 2944954 2849459 2432631 2169002 2604573 2152690 2069341 1650184 1862643 1673501 1753308
10960 1753308 1755450 1792183 1720578 1919224 1955258 1751375 2139629 1470152 1246242 1174474
10950 1174474 881195 906646 450841 681379 675060 225316 442774 248403 300027 243471
$$ packed form
11020A197445E74324J02276m7722M72039D49397P5468J9504o692k5769K23945
11010G35853j48337r9635J93587J42510j12089O9443l55379K34187J70996L0369
11000H61505k43237J51627K015A83220O20970K64579l78262J87445q7067K15660
10990A006545l56343K76561m6682K89640j51615n1119J15055J23555k87180K43469
10980A161886J90810L88540l04992R0549K67837L57688L49715Q6085J51678K05158
10970B944954r5495m16828k63629M35571m51883q3349m19157K12459j89142P9807
10960A753308K142L6733p1605J98646L6034k03883L88254o69477k23910p1768
10950A174474k93279K5451D50841K30538o319B25316K17458j94371N1624n6556
$$ plain form
10940 243471 15180 167684 326346 459085 13772 188210 -91297 316141 -10506 181606
10929 352058 355604 203622 215552 26107 58980 152524 -31442 396873 487123 -149809 159259
10917 -53532 156354 156490 -294203 67220 -378320 -73892 104103 51698 -142467 242977 -228076
10905 -95239 94705 294366 -49562 -28793 -118075 133625 154939 -292679 -115306 -42885 -153503
10894 -153503 65181 111967 -136601 337534 239621 -28166 255392 1130 34067 21143 -158979
10882 223034 -94709 52723 2050 -36517 -355663 100632 -66599 74210 290486 -25004 90633
10870 5311 288322 -212743 -106481 29161 -150634 45253 4814 -100901 -78646 -267576 -274318
10859 -274318 80902 101437 -143570 -232919 -58794 -370113 -132691 34072 -153375 15299 134600
$$ packed form
10940B43471A5180J52504J58662J32739A3772J74438i1297C16141a0506A81606
10929C52058L546j51982J1930B6107L2873R3544c1442C96873R0250a49809A59259
10917e3532A56354J36b94203F7220c78320g3892A04103E1698a42467B42977b28076
10905i5239I4705J99661d9562K0769q9282A33625K1314b92679a15306d2885j10618
10894a53503F5181M6786a36601C37534r7913b8166B55392A130L2937j2924a58979
10882B23034i4709E2723B050c6517l19146A00632f6599G4210K16276b5004I0633
10870E311K83011b12743J06262B9161a50634D5253D814a00901K2255j88930o742
10859b74318H0902K0535a43570q9349e8794l11319a32691C4072a53375A5299J19301
$$ plain form
10848 134600 -38958 30275 -157489 -176763 -254233 -181716 24292 177677 -10950 190202 259857
10837 259857 59325 123481 144583 -17885 -163138 -8817 67826 27553 51960 7613 -60108 -282466
10825 -282466 285011 -212255 -89805 -40124 -300391 42197 71842 -219051 -316452 58615 -277991
10813 70249 -198720 -237747 71092 -192083 -206366 -38755 -214683 -146624 -282685 45945 -99725
10801 -65699 -8717 -135696 -128384 -289260 126844 273676 -69207 -170147 222919 -138820 -99539
10790 -99539 -400002 133259 -9443 -168992 -76440 -68067 -97783 -388848 -180820 -40543 -35351
10779 -35351 121023 -221663 132744 -455593 -95423 -144760 -94022 -182378 173361 48626 -553475
10767 22820 -31398 -93961 -192817 -235660 -168682 37272 155851 169491 -47320 -51084 335691
$$ packed form
10848A34600c8958C0275a57489j9274p7470P2517B4292J53385a0950A90202O9655
10837B59857E9325O4156K1102a7885j45253h817F7826B7553K4407G613f0108k22358
10825b82466B85011b12255h9805d0124k60267D2197K9645b19051r7401E8615b77991
10813G0249a98720l9027G1092a92083j4283c8755j75928O8059j36061D5945i9725
10801f5699h717j26979P312j60876A26844J46832f9207j00940B22919a38820L9281
10790i9539l00463A33259i443j59549g6440Q373k9716k91065a80820d0543N192
10779c5351A21023b21663A32744d55593i5423m9337N0738q8356A73361D8626e53475
10767B2820c1398o2563r8856m2843O6978C7272J18579J3640d7320l764C35691
$$ plain form
10755 31091 5218 61690 -74822 358492 -182300 -82872 -3032 -28678 10171 46464 153085
10744 153085 -19043 191913 5392 167110 144459 57907 186585 -10555 379281 43536 -282579
10732 -63380 -186745 112346 240044 -96224 57004 -107686 -160266 -206815 422631 -148493
10721 140866 341741 -43322 297498 -250489 -36780 166782 -116149 -131245 91286 61412
10711 61412 61048 162287 -271235 149433 167968 -370533 12880 -101319 -125096 287492 -67474
10699 -147006 -211415 -391374 -230289 91062 -274025 -502759 -324894 41070 -292536 -161412
10689 -161412 -205973 -270000 -239379 -457130 -184837 -405092 -6913 -58012 207842 -37530 126035
10677 -114196 -40468 -316156 120326 37560 180488 147520 144657 -125248 -63695 -92208 21477
$$ packed form
10755C1091E218N6472g4822C58492a82300h2872c032k5646A0171L6293J06621
10744A53085a9043A91913E392J61718k2651E7907J28678a0555C79281D3536b82579
10732f3380j23365A12346J27698i6224E7004a07686n2580m6549D22631a48493
10721A40866K00875d3322B97498b50489c6780A66782a16149j5096I1286k9874
10711F1412l64J01239b71235A49433J8535c70533A2880a01319k3777B87492f7474
10699a47006o4409j79959J61085I1062b74025k28734J77865D1070b92536J31124
10689a61412m4561o4027L0621k17751a84837k20255f913n1099B07842c7530A26035
10677a14196d0468k75688A20326C7560J42928l2968k863a25248O1553k8513B1477
$$ plain form
10665 -245985 -16559 -222532 -34204 52285 -45141 280543 -32836 165004 -127401 -128544 -46490
10653 -99078 -248881 -104339 68259 176911 -231724 28609 -59448 151795 380662 78215
10642 -190980 75938 470 16307 -269488 -247053 137887 25382 -75042 -118302 -29901 41612
10630 105950 -453840 -256727 -154653 -67315 34299 -37889 127590 -201794 369131 133194
10619 91045 86876 -231290 -51191 22216 -98423 -364017 156532 199683 242460 490546 -360604
10607 -199434 64647 -53768 248634 214202 -64818 -190972 -91087 -32461 -166307 10323 275627
10596 275627 -172572 -386936 -99762 37765 -36335 136953 -182933 196350 325725 115926
10585 -79661 -261179 -50082 -36711 -201813 67048 -164974 -1417 -143483 78456 -352308 6139
$$ packed form
10665b45985a6559k05973c4204E2285d5141B80543c2836A65004a27401j143d6490
10653i9078j49803a04339F8259J08652b31724B8609e9448A51795K28867G8215
10642a90980G5938D70J5837b69488K2435A37887B5382g5042m3260b9901D1612
10630A05950d53840J97113J02074f7315C4299c7889A27590b01794C69131A33194
10619I1045m169b31290e1191B2216i8423k65594A56532M3151M2777K48086c60604
10607a99434F4647e3768B48634l4432f4818j26154i1087c2461j33846A0323K65304
10596B75627a72572k14364i9762C7765c6335A36953a82933A96350J29375A15926
10585g9661j81518e0082J3371j65102F7048a64974a417j42066G8456c52308F139
$$ plain form
10573 -100855 -174550 -514646 -226067 -43340 -57646 -43294 -28673 329835 337267 -10784 -416095
10562 -416095 125261 -143681 154620 -141401 184861 -230808 -244345 -213415 -103878 -12093
10551 76559 -7220 -51503 9692 146814 -549313 -76061 123660 -7616 12540 -248583 -238668 8038
10538 101337 55490 -60467 -340825 -221986 -111204 56120 -49515 -102986 350055 -196222
10527 -133547 -288531 133698 -138161 -76972 -237584 -148562 299274 391903 41472 93429
10517 93429 168122 -348697 120141 183343 -183729 -251297 -122732 217806 5162 -201917 -10005
10505 -212335 -120413 -186172 -313622 1857 -35945 -423820 -227821 -15522 29085 87041 149293
10494 149293 161993 -303106 3953 -185642 271010 -153896 -85971 -26964 334218 179140
$$ packed form
10573a00855p3695l40096b26067d3340j4306J4352J4621C29835P432a0784m05311
10562d16095A25261a43681A54620a41401A84861b30808j3537L0930a03878a2093
10551G6559g220m4283I692J37122e49313g6061A23660g616A2540b48583R915H038
10538A01337m5847f0467k80358J18839J10782E6120d9515n3471C50055a96222
10527a33547j54984A33698a38161O1189j60612Q9022B99274R2629D1472N1957
10517I3429P4693c48697A20141O3202a83729o7568a22732B17806E162b01917a0005
10505b12335R1922o5759j27450A857c5945l87875J95999a5522B9085N7956O2252
10494A49293J2700c03106C953a85642B71010a53896O7925b6964C34218j55078
$$ plain form
10484 179140 105954 137252 121886 403193 805341 492185 553101 554540 89979 304880 97287
10472 102205 -57534 13047 -424 -108257 178574 -112386 285073 158275 159843 -107257 -300716
10461 -300716 -35523 -230598 -154633 -176832 166493 -228782 122722 -160583 -322265 -92694
10450 241284 -248334 -369511 -174502 87853 255308 3084 -6773 -114580 131008 -267179
10439 141840 223889 95297 -163991 -23169 -135772 -22448 -64011 247721 168906 23977 173678
10428 173678 -103321 -130291 -118893 -237621 -66479 -66733 52675 -258522 134190 -1835 15944
10416 -284108 -26800 14598 157585 -68269 96447 12934 -55615 -160210 -115496 -142222 -260971
10405 -260971 249652 -28534 112823 -311183 237085 115954 -171404 -11799 241661 333167
$$ packed form
10484A79140p3186L1298j5366K81307M02148l13156O0916J439H9979K14901I7287
10472A02205e7534A3047d24j07833A78574a12386B85073j26798J568a07257j93459
10461c00716c5523j95075P5965k2199A66493b28782A22722a60583j61682i2694
10450B41284b48334j21177a74502H7853J67455C084f773j07807A31008b67179
10439A41840Q2049I5297a63991b3169j12603b2448m1563B47721p8815B3977J49701
10428A73678a03321k6970J1398j18728f6479k54E2675b58522A34190a835A5944
10416b84108b6800A4598J42987f8269I6447A2934e5615j04595M4714k6726j18749
10405b60971B49652b8534A12823c11183B37085A15954a71404a1799B41661R1506
$$ plain form
10395 333167 271966 260781 -82321 93857 -268661 357967 298802 103085 -118949 -104049 73830
10383 379619 74321 117994 226873 -1458 282480 511607 449062 186262 29276 113138 169190
10372 169190 418935 302357 215327 4926 378803 236446 617542 607082 766455 317596
10361 215140 489139 693690 107592 74285 151002 48680 388991 119132 296910 415534
10351 415534 458041 434708 775393 242702 147507 -22123 249835 549333 469150 390576 384297
10340 384297 441857 328891 366554 219781 156613 29718 48275 143652 66259 134211 94939
10329 94939 -65935 -217782 -142042 234864 193337 402445 126294 576674 175554 139746
10319 139746 72649 218315 -116322 76135 -148723 208737 356154 132936 -253536 24257
$$ packed form
10395C33167o1201j1185h2321I3857b68661C57967n9165A03085a18949J4900G3830
10383C79619G4321M3673J08879a458B82480K29127o2545A86262B9276Q3862N6052
10372A69190K49745j16578q7030D926L73877j42357L81096j0460J59373C17596
10361B15140K73999K04551A07592l3307P6717D8680L40311A19132J77778J18624
10351D15534M2507k3333L40685B42702r5195b2123B49835K99498q0183p8574o279
10340C84297N7560j12966L7663j46773o3168B9718J8557R5377F6259O7952l9272
10329I4939f5935j51847P5740B34864m1527K09108A26294M50380A75554l5808
10319A39746o7097J45666a16322G6135a48723B08737J47417A32936b53536B4257
$$ plain form
10308 8608 -125669 204178 186169 109386 -37588 -281346 340226 -72244 498027 196147 43656
10296 259565 -219446 116490 -148279 33607 -161038 1292 -40387 138118 149964 -1583 -47382
10285 -47382 -52366 -261281 44909 -128116 -437004 22645 -305039 -101722 -46964 -64672 -27781
10273 14314 10042 45366 -4752 260627 87061 -80157 11467 84590 -107079 68555 -57915 91143
10260 195894 600190 393319 393972 553531 226835 -41395 -417385 124687 42603 -180515
10249 335037 -236868 -264384 16760 -61079 -313801 -161670 -32492 -348197 4446 -78268 -6088
10237 -335322 179042 -46930 55686 143680 207113 116882 -24188 -221785 -547946 201279 105120
10226 105120 -166067 -53944 -56985 -227202 75107 -58384 -206495 -441361 -7929 171565 351820
$$ packed form
10308H608a25669B04178j8009p6783c7588k43758C40226g2244D98027A96147D3656
10296B59565b19446A16490a48279C3607a61038A292d0387A38118J1846a583m5799
10285d7382m984k08915D4909a28116l08888B2645c05039a01722d6964j7708b7781
10273A4314m272L5324d752B60627H7061h0157A1467P3123a07079F8555e7915I1143
10260A95894M04296k06871O53J59559B26835d1395l75990A24687D2603a80515
10249C35037b36868k7516A6760f1079k52722J52131c2492l15705D446g8268f088
10237c35322A79042d6930E5686Q7994O3433r0231b4188j97597l26161B01279r6159
10226A05120a66067e3944l041j70217G5107e8384j48111k34866g929A71565J80255
$$ plain form
10215 351820 175350 74980 145071 5787 -4317 -95869 99628 -8297 -152881 -127974 -116657 -409682
10203 -409682 -46680 226102 82973 62028 196737 -299253 -113602 66431 143993 -67139 54640
10191 83138 89337 97871 -233563 397631 -246485 -27916 457 11453 -814 100418 77833 -90290
10178 117651 -309040 91 -136505 -101425 -133746 -234534 -31056 -100105 -322864 -625406 -234217
10166 220187 -240717 -232412 -58202 102496 143969 23901 -198341 -39892 -133133 -72678 27430
10154 -218923 -165967 122474 41910 -83380 -123499 -40417 -141854 -133794 -218248 143001 197678
10143 197678 31008 -131475 -109056 -373200 67614 -7668 151722 -71876 -58363 -323071 -172050
10132 -172050 -354403 -229155 -194604 68020 -208211 204454 -194521 -391894 -83243 -286338
$$ packed form
10215C51820A75350G4980P0091E787d317r1552I9628h297j44584K4907J1317k93025
10203d09682d6680B26102H2973k0945J34709b99253a13602F6431P7562f7139E4640
10191H3138O199Q534b33563C97631b46485b7916D57J0996h14A00418k2585i0290
10178A17651c09040I1a36505L5080l2321j00788c1056o9049k22759l02542b34217
10166B20187b40717Q305e8202A02496M1473B3901a98341c9892r3241O0455B7430
10154b18923N2956A22474D1910h3380m0119d0417j01437Q060q4454A43001N4677
10143A97678C1008a31475K2419k64144F7614g668A51722g1876J3513k64708J51021
10132a72050j82353J25248L4551F8020b08211B04454a94521j97373h3243k03095
$$ plain form
10122 -286338 240517 59903 191319 137848 -229381 -72413 -102865 32931 -36834 -121465 118829
10110 -23913 50135 -110220 -50377 -380305 98382 32428 -398174 -356989 -41381 14213 181418
10099 181418 -332534 8670 79159 -242984 188104 -81245 -71742 84516 -514954 33235 83746
10088 83746 -4534 -101591 61221 63075 -163182 -55593 -5882 52684 -15803 177206 -173799 48978
10075 -62384 -101481 89829 40902 -160259 -242681 33795 27456 31369 91951 64675 223017 -145394
10062 -46415 48644 182098 -209734 -70395 -353583 -448177 -19497 -216302 112235 66884 -68085
10050 -147023 22537 136986 -327759 155217 17500 23017 -45484 15077 -219278 -42664 91378
10038 -172028 11186 -242805 -87726 98657 -52581 -233374 54548 -157038 -56520 -189839 -152026
$$ packed form
10122b86338B40517E9903J31416n3471b29381g2413l0452C2931c6834q4631A18829
10110b3913E0135a10220e0377l29928I8382C2428c98174M1185d1381A4213J67205
10099A81418c32534H670P0489b42984A88104h1245R503H4516e14954C3235N0511
10088H3746d534r7057F1221J854a63182e5593e882E2684a5803A77206a73799D8978
10075f2384l9097H9829D0902a60259q2422C3795o339L913O0582k7276J58342a45394
10062d6415D8644J33454b09734g0395k83188r4594a9497j96805A12235m5351f8085
10050a47023B2537J14449c27759A55217A7500N517d5484A5077b19278d2664I1378
10038a72028A1186b42805h7726I8657e2581j80793E4548a57038e6520j33319L7813
$$ plain form
10027 -152026 -179335 -62902 -134189 277284 -82393 38900 -316029 -167488 -140927 -22836 -98858
10016 -98858 365851 -60763 157955 230130 -310249 -89251 -104993 -197011 -417846 -82417 106372
10004 -90355 -226034 -41251 -369273 14022 18445 -213094 -14186 -225645 93190 79624 -203930
9992 -192923 -264171 22267 -80416 149491 -193202 208367 -519815 54993 48283 171151 -14852
9980 12298 -75753 -245019 -69703 -190998 -177541 -236319 -186024 -30316 163836 -500927 -12434
9968 -97646 -237844 274936 12331 -286754 18161 99089 -111587 -243561 -113539 -132555 106573
9956 -106066 -67509 -22250 191872 -313957 -129438 -1666 138323 -132093 329557 -2874 -176990
9945 -176990 -396981 -8373 -204770 -21583 111573 95620 149234 137513 -53919 -14483 -35584
$$ packed form
10027a52026k7309f2902p1287B77284h2393C8900c16029J48541K6561b2836p6022
10016i8858C65851f0763A57955P2175c10249h9251j5742r2018k20835h2417A06372
10004i0355j35679d1251l28022A4022M423b13094a4186k11459I3190j3566b03930
9992a92923p1248B2267h0416A49491a93202B08367e19815E4993o710J22868a4852
9980A2298g5753j69266f9703j21295J3457n8778N0295c0316A63836e00927a2434
9968i7646j40198B74936A2331b86754A8161Q0928a11587j31974a13539j9016A06573
9956a06066L8557b2250A91872c13957a29438a666A38323a32093C29557b874j74116
9945a76990k19991h373j96397b1583A11573j5953N3614j1721e3919a4483k1101
$$ plain form
9934 -35584 -167573 -41633 -38236 15503 -316884 -85185 254060 -177106 -227351 -83821 -42300
9923 -42300 268035 -292220 -19434 142124 -11259 -203095 37495 -101734 22341 183610 -70070
9911 -41050 26299 289640 143316 -146623 -411976 -148505 170983 -361089 -218876 165618
9900 146122 -332474 421410 186331 -15492 142623 -33281 124719 -227241 -216495 -401528
9890 -401528 335411 382741 -12129 234051 111423 176999 -318186 -99265 118901 59229 134201
9879 134201 218886 128540 128142 -194997 64381 -160643 -304275 -208781 -895 -115833 -31965 -559188
9867 -559188 187324 -312395 256112 -130173 58394 28604 39517 49718 144452 -86150 -31241
9855 92262 -240528 92754 -15779 8946 42573 219268 16052 -75211 177605 -256137 64714
$$ packed form
9934c5584j31989d1633L397A5503c16884h5185B54060a77106n0245h3821M1521
9923d2300B68035b92220a9434A42124a1259j91836C7495a01734B2341J61269g0070
9911d1050B6299K63341A43316a46623k65353a48505A70983c61089J42213A65618
9900A46122c32474D21410A86331a5492A42623c3281A24719b27241J0746j85033
9890d01528C35411M7330a2129B34051A11423O5576c18186i9265A18901E9229P4972
9879A34201Q4685r0346l98a94997F4381a60643j43632R5494h95j14938c1965n27223
9867e59188A87324c12395B56112a30173E8394B8604J0913J0201R4734h6150c1241
9855I2262b40528I2754a5779H946L3627J76695A6052g5211A77605b56137F4714
$$ plain form
9843 -268539 -25210 -243856 -100818 292215 -147078 -553669 -34229 -131387 -136013 230220 -533382
9831 -148568 395044 25932 55160 -132225 24283 -91435 -158162 5863 -19698 99519 3618 -79543
9818 37774 -338872 -555540 -212619 -480208 12663 -170637 -141055 -91373 -139075 -406062 -279727
9807 -279727 32039 -502461 303477 -210998 -12822 104114 -370504 -132715 76753 -33719
9796 141920 -242266 -149253 -199084 89038 102364 279050 -82130 211576 151835 -310258 79013
9784 106831 49238 -331742 81093 -11359 -74932 -148769 -229964 -207538 -90048 -185077 -207758
9773 -207758 141915 3532 -37625 164512 31639 75371 -254727 -131956 -24804 -369015 -98658
9761 -261162 62463 -200857 -84932 -385288 22745 -258634 133547 -244101 164128 77937
$$ packed form
9843b68539b5210k18646a00818B92215a47078m06591c4229r7158m626B30220e33382
9831a48568C95044B5932K9228a32225B4283i1435o6727E863a9698I9519C618g9543
9818C7774c38872k16668b12619k67589A2663a70637K9582M9682m7702k66987J26335
9807b79727C2039e02461C03477b10998a2822A04114c70504a32715G6753c3719
9796A41920b42266R3013m9831H9038J3326J76686h2130B11576n9741c10258G9013
9784A06831D9238c31742H1093a1359o3573p3837q1195K2426i0048r5029k2681
9773b07758A41915C532c7625A64512C1639M3732b54727J22771b4804l44211i8658
9761b61162F2463b00857h4932l00356B2745b58634A33547b44101A64128G7937
$$ plain form
9750 -456792 -34025 -384158 -80816 -11079 -118350 -205218 -23347 89366 -1690 -268087 -162456
9739 -162456 -40890 -81028 90811 4253 -200971 -54590 77841 149563 47123 196593 -144803
9727 150326 -104683 36505 -144529 -202358 169210 -37069 -29661 77483 -23794 -277393 -303820
9716 -303820 -147875 324147 77036 126393 -41712 -332675 -450437 -91118 15918 -109875 36407
9704 98985 -317879 -502325 -251857 -78967 -80279 -300234 -263198 -165023 139462 -117393 -206549
9693 -206549 -14078 -31939 -74864 -153537 160700 280999 -301284 -72158 -96476 99549 45481
9681 186752 45425 197590 -437 100169 -23319 99109 -187678 276817 -199984 248021 -180548
9669 -166476 -329486 -238962 -321157 125501 -169966 -119348 -120481 -237690 295862 106195 218069
$$ packed form
9750d56792c4025l50133h0816a1079j07271q6868b3347H9366a690k66397J05631
9739a62456d0890m0138I0811D253b00971e4590G7841P1722D7123J49470a44803
9727A50326a04683C6505a44529n7829A69210c7069P408G7483b3794k53599k6427
9716c03820a47875C24147G7036M9357d1712k90963j17762i1118A5918a09875C6407
9704I8985c17879j84446K50468g8967j312k19955L7036R8175A39462a17393q9156
9693b06549a4078j7861m2925p8673A60700J20299c01284g2158k4318I9549D5481
9681A86752D5425J52165d37A00169b3319I9109a87678B76817a99984B48021a80548
9669a66476j63010R0524q2195A25501a69966N0618j133j17209B95862A06195J11874
$$ plain form
9658 218069 -109641 -3945 88421 84016 49188 -89612 -85461 -305859 73748 -78823 273894 -82233
9645 149837 -105146 -63202 77227 -187191 169789 -199963 -54635 -75888 -251742 -190444 182538
9633 -180571 -31527 102244 -95138 -59134 142359 244999 -237441 -96337 -237083 -391180
9623 -391180 88382 255670 29365 -36152 -104548 126675 -56594 -204332 -246598 -121752 -93765
9612 -93765 -143270 -111812 -193426 7111 -381068 -264611 131468 -108190 22439 147650 -9608
9600 72947 -150185 174349 -252921 -1078 339117 90437 -251238 -258655 -195425 -382961 53872
9588 -360022 -203673 105459 -138994 -264045 -123637 125843 -130422 109134 217395 -242085
9577 -210712 -686180 -203339 -69425 -125882 -106116 -254307 339896 -426092 268719 -158279
$$ packed form
9658B18069a09641c945H8421m405l4828h9612M151k20398G3748g8823B73894h2233
9645A49837a05146M1944G7227a87191A69789a99963e4635k1253j75854O1298A82538
9633a80571c1527A02244i5138L6004A42359J02640b37441i6337j40746j54097
9623c91180H8382J67288B9365c6152o8396A26675e6594j47738m2266a21752K7987
9612i3765m9505L1458q1614G111c81068J16457A31468a08190B2439J25211i608
9600G2947a50185A74349b52921a078C39117I0437b51238p417O3230j87536E3872
9588c60022J56349A05459a38994j25051a23637A25843a30422A09134J08261b42085
9577b10712m75468b03339f9425n6457J9766j48191C39896d26092B68719a58279
$$ plain form
9566 -175140 -136501 90439 46302 -251998 -105421 64219 -277928 245769 -269454 -137154
9556 -137154 -52609 -203603 14781 -118409 -171769 -152088 89165 -23211 313136 -301314 81025
9544 112287 12029 -243463 -39322 82903 215103 -11223 -108458 69983 -354477 -182381 -343500
9533 -343500 -202659 114594 209230 -416559 -245092 -161974 79748 36442 142360 -574144
9522 -127773 -405121 -274609 -234257 -35730 -138232 -47019 -25765 -85713 -398332 -200468 -60679
9510 70817 139422 164955 -219596 -17776 -34628 -251219 -169204 191667 -194223 27330 -350227
9498 126396 294933 -105830 -303668 -1023 27465 40466 7102 -90875 315802 -236772 89200
9486 -74481 105285 -153181 75883 -170528 -129192 -106184 -110884 -356459 -86378 -111039 6734
$$ packed form
9566a75140L8639I0439m4137b51998a05421F4219b77928B45769b69454J32300
9556a37154e2609j50994A4781a18409n3360J9681H9165b3211C13136c01314H1025
9544A12287A2029b43463c9322H2903J32200a1223r7235F9983c54477J72096j61119
9533c43500J40841A14594R4636d16559J71467Q3118G9748C6442J05918e74144
9522a27773k77348J30512M0352c5730j02502d7019K1254n9948l12619J97864f0679
9510G0817O8605K5533b19596a7776j6852k16591Q2015A91667a94223B7330c50227
9498A26396J68537a05830j97838a023B7465J3001G102i0875C15802b36772H9200
9486g4481A05285a53181G5883a70528M1336K3008m700k45575h6378k4661F734
$$ plain form
9474 -259802 -118729 -149807 -191328 -145211 82998 -65607 -458995 309429 -110918 -130648 -32998
9462 -416830 -7864 -139849 -5177 46019 -413349 -145158 -140919 195367 -67485 393676 -52839
9450 221441 -244565 -173508 46684 -89626 -175642 -32675 -117705 44752 -68042 43190 118928
9439 118928 30211 -85382 -415223 -381014 -16244 155211 140963 -517875 -49260 64867 -54483
9427 38152 -412141 257729 -252630 -116168 -259854 -229028 136567 -237507 322132 334969
9417 334969 -622604 -377577 43203 -72544 152641 -86772 -291724 322466 -28906 -404346
9407 -404346 170159 189173 118325 -208991 -216521 -235432 -525946 -73955 -7831 -215524 -132783
9396 -132783 -33935 -206724 197032 -70643 173223 -83486 11854 40402 -329714 43819 -6752
$$ packed form
9474b59802a18729l1078m1521M6117H2998f5607l93388C09429a10918j9730c2998
9462d16830g864j31985e177D6019d13349a45158M239A95367f7485C93676e2839
9450B21441b44565P1057D6684h9626q6016c2675q5030D4752f8042D3190P5738
9439A18928C0211h5382l29841L4209a6244A55211j4248e17875d9260F4867e4483
9427C8152d12141B57729b52630a16168j43686L0826A36567b37507C22132J2837
9417C34969f22604K45027D3203g2544A52641h6772k04952C22466b8906l75440
9407d04346A70159J9014p0848b08991p530j8911k90514g3955g831k07693Q2741
9396a32783c3935j72789A97032g0643A73223h3486A1854K8548c29714D3819f752
$$ plain form
9384 -15962 -252415 -41085 143118 -131058 17333 23153 -20756 -55526 -414155 -40889 -15204
9372 119305 96553 167268 -54502 -198233 -323986 74907 45986 -53714 -139109 -15250 25697
9360 -200925 275825 -120892 11065 -18342 -150003 -214190 -214860 -245484 367842 169368 -387770
9348 54284 -215963 -33637 -87663 -268454 238494 -265065 -93648 27179 -92491 -126496 -150181
9337 -150181 -106143 43924 87007 64045 98478 79014 -260171 157003 -44640 -252162 -229777
9326 -229777 -92558 -29159 29007 35875 174468 -242063 -47755 -138752 -134845 834 133839 -110809
9313 134276 -209868 334673 -257353 170306 -59247 -238374 -124336 -236038 -106470 318278
9302 -38536 -39343 -203658 -368984 -156445 -291574 -154504 -106724 137604 14316 36162 -48669
$$ packed form
9384a5962k36453d1085A43118a31058A7333N820b0756l4770l58629d0889a5204
9372A19305k2752P0715e4502j43731j25753G4907k8921e3714q5395a5250B5697
9360b00925B75825a20892A1065a8342j31661o4187o70l0624C67842A69368c87770
9348E4284b15963c3637n4026j80791B38494b65065i3648B7179i2491l4005k3685
9337a50181M4038D3924M3083k2962L4433j9464b60171A57003d4640k07522K2385
9326b29777i2558b9159B9007O868J38593b42063d7755r0997L907H34J33005a10809
9313A34276b09868C34673b57353A70306e9247j79127J14038j11702a06470C18278
9302c8536q07j64315j65326a56445j35129J37070M7780A37604A4316K1846d8669
$$ plain form
9290 -337983 -156386 94195 -249680 -388485 -60269 132240 68291 -270233 -427903 37745
9279 -174936 -29324 -134671 -221773 121289 145347 -215351 573935 60388 -103495 58482 -105645
9267 -240111 -35072 -53139 -113425 231451 -111917 -86944 55888 133976 19979 -347245 -365778
9256 -365778 62284 -9680 32987 -237786 -181203 -362954 -158347 -14751 117492 -31707 -80209
9245 -80209 -256575 20432 -125659 6123 246813 164264 -58937 192139 -3071 -178653 -3711
9233 3970 132310 159227 -215693 -344306 -172701 82978 105972 -392381 -65354 -19137 -337772
9222 -337772 5693 160950 -59508 2839 -156916 -44684 -318907 -231689 -99416 77183 -266152
9210 -153568 -149358 -62396 56785 -73819 22046 -153912 -269692 9371 -42334 -118922 326637
$$ packed form
9290c37983a56386I4195b49680j38805f0269A32240o3949b70233j57670C7745
9279a74936b9324j05347q7102A21289K4058b15351E73935F0388a03495E8482a05645
9267b40111c5072j8067o0286B31451a11917K4973E5888P8088A9979c47245j8533
9256c65778F2284i680C2987b37786N6583j81751a58347a4751A17492c1707m8502
9245h0209j76366B0432a25659F123K40690q2549e8937A92139c071j75582c711
9233C970J28340K6917b15693j28613J71605H2978K2994c92381f5354a9137l18635
9222c37772E693J55257e9508B839a56916d4684k74223Q7218i9416G7183b66152
9210a53568M210f2396E6785g3819B2046a53912j15780I371d2334p6588C26637
$$ plain form
9198 117689 -142285 -84539 108963 -9184 -17534 56038 -138567 104579 43085 -267485 -417166
9187 -417166 60579 -351466 90374 75569 -127766 109291 -224787 -47840 145421 -74261 -148845
9176 -148845 141607 26861 -327639 10471 114013 -114862 72520 -27642 -169170 80748 -239697
9164 -58550 329288 178519 24135 -15930 -50232 94856 -36038 -298990 111703 48455 334591
9153 334591 296024 -12750 123733 -40893 -316568 -249447 28691 -48004 -307172 -127208 -240742
9142 -240742 -109431 -266081 10613 -166481 -392411 -99088 -123725 -100768 53079 -287980 -219046
9131 -219046 322155 -58014 -319814 -141230 -43182 -161302 284625 12626 189106 198737 -252613
9119 -142209 -264734 -217196 93573 -213432 -364745 61043 50670 -106767 -24743 -255714 -378435
$$ packed form
9198A17689a42285N7746A08963i184q350E6038a38567A04579D3085b67485j49681
9187d17166F0579c51466I0374j4805a27766A09291b24787d7840A45421g4261p4584
9176a48845A41607B6861c27639A0471J03542a14862G2520b7642j41528H0748b39697
9164e8550C29288j50769B4135a5930l4302I4856c6038k62952A11703D8455K86136
9153C34591l8567a2750A23733d0893k75675O7121B8691d8004k59168a27208j13534
9142b40742a09431j56650A0613a66481k25930i9088k4637K2957E3079b87980O8934
9131b19046C22155e8014k61800a41230d3182j18120B84625A2626J76480R631b52613
9119a42209j22525M7538I3573b13432j51313F1043j0373a06767b4743k30971j22721
$$ plain form
9108 -378435 160272 222530 -18951 210726 -476453 -155699 -49839 143299 -310986 115874
9097 -91707 -342742 450509 -118175 188242 -268632 28764 -74986 -152022 -35863 73212 170613
9086 170613 41142 -465222 -73382 -276578 2116 -166417 3869 14751 -309189 78688 139602
9075 139602 -41741 -150086 -255563 -51557 -131321 -136596 -494837 -43346 -99334 150632 -155675
9063 -126895 250907 -29089 -110402 314730 -169643 -46572 -1950 -172055 59143 89375 95481
9052 95481 -45487 70619 -346812 -319983 127675 -332292 175168 155819 90661 34516 -156263
9040 -161225 -216107 -144004 33212 126648 -136731 362116 168061 45330 -117765 -108132 -111332
9029 -111332 -268593 -226849 196340 -271251 -53805 130780 -116140 205082 -155196 304639
$$ packed form
9108c78435A60272O2258a8951B10726d76453a55699d9839A43299c10986A15874
9097i1707k51035D50509a18175A88242b68632B8764g4986p7036c5863G3212R7401
9086A70613D1142d65222g3382k03196B116a66417C869J0882c09189G8688O0914
9075A39602d1741j08345j05477e1557p9764n275l58241d3346n5988A50632a55675
9063a26895B50907b9089q1313C14730a69643d6572a950j70105E9143L0232O106
9052I5481d5487G0619c46812K6829A27675c32292A75168j9349o5158C4516a56263
9040a61225n4882P2103C3212R3436a36731C62116A68061D5330a17765R633l200
9029a11332j57261M1744A96340b71251e3805A30780a16140B05082a55196C04639
$$ plain form
9018 324652 17562 77096 -413604 346563 -101498 -301855 -47125 -13908 -284339 100815
9007 108778 248547 -258942 76739 228086 -146046 231259 -382361 154518 -88281 -134272
8997 -134272 -23426 -324368 -214823 -221425 3164 208567 210553 156207 -347941 -397844 -49189
8985 -158161 -320352 -56080 58984 -60757 -42388 -89202 -131524 234027 -174744 -274119 -269114
8974 -269114 195944 -101478 -16349 -175389 -134478 -108974 -64631 -401473 -27494 50166 -18129
8962 49974 361016 -147686 -151895 -190835 350159 -148360 112657 -328747 479974 41949 -25940
8950 -138308 -70100 142596 -72572 -360676 19248 127431 167797 -94726 -42699 121211 -230190
8938 -259296 -31986 53461 178516 -74961 448307 143941 333130 281317 -35672 -95617 15522
$$ packed form
9018C24652A7562N9534d13604C46563a01498k00357d7125a3908k70431A00815
9007A08778J39769b58942G6739J51347a46046B31259c82361A54518h8281m5991
8997a34272b3426l00942J09545o602C164K05403J986n4346c47941m9903d9189
8985a58161j62191e6080E8984f0757J8369m6814m2322B34027a74744r9375N005
8974b69114A95944a01478a6349j59040M0911K5504M4343l36842b7494E0166a8129
8962D9974L11042a47686m209l8940C50159a48360A12657c28747D79974D1949b5940
8950a38308O8208A42596g2572k88104A9248J08183M0366i4726d2699A21211b30190
8938b59296c1986E3461J25055g4961D48307A43941J89189n1813c5672n9945A5522
$$ plain form
8926 -112986 354529 -112684 599604 1119526 4910303 10185825 1931242 888107 190858
8916 239548 44262 298807 41123 63303 -102009 174757 385530 -89130 335047 -128916
8905 -30629 39725 -249496 -59052 -87585 -260556 -74792 -121112 -240023 -121506 45268 -88005
8893 253913 -715060 -32728 9582 -103252 -83547 -167015 -87904 123779 -121868 30576 -181829
8881 -249948 -387410 12932 82170 -52700 -162782 -130157 18148 -63443 213205 -245006 -142641
$$ packed form
8926a12986C54529a12684E99604N19922L790777N275522A931242H88107A90858
8916B39548D4262K54545D1123K2180a02009A74757K10773h9130C35047a28916
8905c0629C9725b49496e9052k8533j72971g4792m6320j18911J18517D5268h8005
8893B53913g15060c2728I582a03252J9705q3468P9111A23779a21868C0576a81829
8881b49948j37462A2932O9238e2700j10082L2625A8148f3443B13205b45006J02365
$$ [...]
##END NTUPLES=NMR SPECTRUM
##END=
