
##TITLE=AC1243_NTAAH12033_6945137_80XQF47wmx
##JCAMPDX= 6.0         $$ Bruker NMR JCAMP-DX V2.0
##DATA TYPE= NMR SPECTRUM
##DATA CLASS= NTUPLES
##ORIGIN= BRUKER
##OWNER= Administrator
$$ 1.72 TOPSPIN		Version 2.1
$$ 2012-12-11 21:08:49.397 -0500  Administrator@X
$$ Compression mode = diff/dup
##.OBSERVE FREQUENCY= 400.02188249412
##.OBSERVE NUCLEUS= ^1H
##.ACQUISITION MODE= SIMULTANEOUS (DQD)
##.ACQUISITION SCHEME= undefined
##.AVERAGES= 64
##.DIGITISER RES= 22
##SPECTROMETER/DATA SYSTEM= spect
##.PULSE SEQUENCE= noesygpps1d.comp
##.SOLVENT NAME= COFFEE_meoh
##.SHIFT REFERENCE= INTERNAL, COFFEE_meoh, 1, 14.96098
##AUDIT TRAIL= $$ (NUMBER, WHEN, WHO, WHERE, PROCESS, VERSION, WHAT)
$$ ##TITLE= Audit trail, TOPSPIN		Version 2.1
$$ ##JCAMPDX= 5.01
$$ ##ORIGIN= Bruker BioSpin GmbH
$$ ##OWNER= Administrator
$$ $$ E:\/data/COFFEE/nmr/AC1243_NTAAH12033_6945137_80XQF47wmx/22/pdata/1/auditp.txt
$$ ##AUDIT TRAIL=  $$ (NUMBER, WHEN, WHO, WHERE, PROCESS, VERSION, WHAT)
(   1,<2012-12-11 21:08:43.163 -0500>,<Administrator>,<X>,<go>,<TOPSPIN 2.1>,
      <created by zg
	started at 2012-12-11 20:57:12.835 -0500,
	POWCHK enabled, PULCHK disabled,
       configuration hash MD5:
       86 BA 57 50 F2 9D 5C 9B 26 00 A9 28 5F 66 2E 89
       data hash MD5: 64K
       F7 B8 9D 25 F4 56 47 AE 23 14 EE 39 22 F7 30 CA>)
(   2,<2012-12-11 21:08:46.397 -0500>,<Administrator>,<X>,<proc1d>,<TOPSPIN 2.1>,
      <Start of raw data processing
       efp LB = 0.3 FT_mod = 6 PKNL = 1 PHC0 = 0 PHC1 = 0 SI = 128K 
       data hash MD5: 128K
       8D 46 B9 A5 A1 C8 A1 1D 4B E1 2D 2C 5A FA E0 17>)
(   3,<2012-12-11 21:08:47.554 -0500>,<Administrator>,<X>,<proc1d>,<TOPSPIN 2.1>,
      <pk PHC0 = -81.74927 PHC1 = 0 
       data hash MD5: 128K
       9E 61 A8 22 76 D2 2C 99 F8 62 F3 8E 82 8E EB 9D>)
(   4,<2012-12-11 21:08:48.319 -0500>,<Administrator>,<X>,<proc1d>,<TOPSPIN 2.1>,
      <abs ABSG = 1 
       data hash MD5: 128K
       10 63 8B 79 EB 75 1A B4 06 77 EC FC B9 A8 4B 02>)
(   5,<2012-12-11 21:08:48.507 -0500>,<Administrator>,<X>,<proc1d>,<TOPSPIN 2.1>,
      <abs ABSG = 2 
       data hash MD5: 128K
       18 0D 90 8A 66 F4 1C EC C0 13 D1 D1 39 D4 0E AC>)
(   6,<2012-12-11 21:08:48.679 -0500>,<Administrator>,<X>,<proc1d>,<TOPSPIN 2.1>,
      <abs ABSG = 3 
       data hash MD5: 128K
       C5 D9 B4 35 7D 25 1D 9D 8B 3E C5 CF 5B 74 60 FC>)
(   7,<2012-12-11 21:08:48.851 -0500>,<Administrator>,<X>,<proc1d>,<TOPSPIN 2.1>,
      <abs ABSG = 4 
       data hash MD5: 128K
       CB 29 38 FD 80 59 16 60 D4 4E F6 99 D2 74 0B 47>)
(   8,<2012-12-11 21:08:49.022 -0500>,<Administrator>,<X>,<proc1d>,<TOPSPIN 2.1>,
      <abs ABSG = 5 
       data hash MD5: 128K
       77 C9 4A 84 36 95 1B 38 13 9A 80 19 B0 95 82 A1>)
$$ ##END=
$$ 
$$ $$ hash MD5
$$ $$ AD 06 0F C8 2D 46 3F EF 8D 60 A1 3F EB D8 E4 DA
##$RELAX= 
##$RELAX= 
##$RELAX= 
##$RELAX= 
##$RELAX= 
##$RELAX= 
##$RELAX= 
##$RELAX= 
##$RELAX= 
$$ Bruker specific parameters
$$ --------------------------
##$DU= <E:\>
##$EXPNO= 22
$$ [...]
##$TP07= 0
##$TPNAME0= <>
##$TPNAME1= <>
##$TPNAME2= <>
##$TPNAME3= <>
##$TPNAME4= <>
##$TPNAME5= <>
##$TPNAME6= <>
##$TPNAME7= <>
##$TPOAL= (0..7)
0.5 0.5 0.5 0.5 0.5 0.5 0.5 0.5
##$TPOFFS= (0..7)
0 0 0 0 0 0 0 0
##$TUNHIN= 0
##$TUNHOUT= 0
##$TUNXOUT= 0
##$USERA1= <user>
##$USERA2= <user>
##$USERA3= <user>
##$USERA4= <user>
##$USERA5= <user>
##$V9= 5
##$VALIST= <valist>
##$VCLIST= <CCCCCCCCCCCCCCC>
##$VD= 0
##$VDLIST= <DDDDDDDDDDDDDDD>
##$VPLIST= <PPPPPPPPPPPPPPP>
##$VTLIST= <TTTTTTTTTTTTTTT>
##$WBST= 2048
##$WBSW= 25
##$XGAIN= (0..3)
0 0 0 0
##$XL= 0
##$YL= 0
##$YMAX_a= 6260984
##$YMIN_a= -13165951
##$ZGOPTNS= <>
##$ZL1= 120
##$ZL2= 120
##$ZL3= 120
##$ZL4= 120
##$ABSF1= 14.96098
##$ABSF2= -5.597201
##$ABSG= 5
##$ABSL= 3
##$ALPHA= 0
##$AQORDER= 0
##$ASSFAC= 0
##$ASSFACI= 0
##$ASSFACX= 0
##$ASSWID= 0
##$AUNMP= <proc_prof1d_extract.lims>
##$AXLEFT= 0
##$AXNAME= <>
##$AXNUC= <1H>
##$AXRIGHT= 0
##$AXTYPE= 0
##$AXUNIT= <>
##$AZFE= 0.1
##$AZFW= 0.1
##$BCFW= 0
##$BC_mod= 0
##$BYTORDP= 0
##$COROFFS= 0
##$CY= 15
##$DATMOD= 1
##$DC= 0
##$DFILT= <>
##$DTYPP= 0
##$F1P= 0
##$F2P= 0
##$FCOR= 0.5
##$FTSIZE= 131072
##$FT_mod= 6
##$GAMMA= 0
##$GB= 0
##$INTBC= 1
##$INTSCL= 1
##$ISEN= 128
##$LB= 0.3
##$LEV0= 0
##$LPBIN= 0
##$MAXI= 10000
##$MC2= 0
##$MEAN= 0
##$ME_mod= 0
##$MI= 0
##$NCOEF= 0
##$NC_proc= -2
##$NLEV= 6
##$NOISF1= 0
##$NOISF2= 0
##$NSP= 0
##$NTH_PI= 0
##$NZP= 0
##$OFFSET= 14.96098
##$PC= 1
##$PHC0= -81.74927
##$PHC1= 0
##$PH_mod= 1
##$PKNL= yes
##$PPARMOD= 0
##$PPDIAG= 0
##$PPIPTYP= 0
##$PPMPNUM= 2147483647
##$PPRESOL= 1
##$PSCAL= 4
##$PSIGN= 0
##$PYNMP= <proc.py>
##$REVERSE= no
##$SF= 400.020009643596
##$SI= 131072
##$SIGF1= 0
##$SIGF2= 0
##$SINO= 400
##$SIOLD= 131072
##$SPECTYP= <>
##$SREGLST= <1H.CDCl3>
##$SSB= 0
##$STSI= 131072
##$STSR= 0
##$SW_p= 8223.68421052631
##$SYMM= 0
##$S_DEV= 0
##$TDeff= 65536
##$TDoff= 0
##$TI= <>
##$TILT= no
##$TM1= 0
##$TM2= 0
##$TOPLEV= 0
##$USERP1= <user>
##$USERP2= <user>
##$USERP3= <user>
##$USERP4= <user>
##$USERP5= <user>
##$WDW= 1
##$XDIM= 131072
##$YMAX_p= 501478508
##$YMIN_p= -13462
##$CURPLOT= <Network HP LaserJet P1505>
##$CURPRIN= <$Network HP LaserJet P1505>
##$DFORMAT= <normdp>
##$LAYOUT= <+/1D_H.xwp>
##$LFORMAT= <normlp>
##$PFORMAT= <normpl>
##$SURQMSG= 1
$$ End of Bruker specific parameters
$$ ---------------------------------
##NTUPLES= NMR SPECTRUM
##VAR_NAME=  FREQUENCY,     SPECTRUM/REAL,   SPECTRUM/IMAG
##SYMBOL=    X,             R,               I
##VAR_TYPE=  INDEPENDENT,   DEPENDENT,       DEPENDENT
##VAR_FORM=  AFFN,          ASDF,            ASDF
##VAR_DIM=   131072,        131072,          131072
##UNITS=     HZ,            ARBITRARY UNITS, ARBITRARY UNITS
##FACTOR=    0.0627417313425164, 1,          1
##FIRST=     8223.62146879497, 77,           -59640
##LAST=      0,             1164,            -60152
##MIN=       0,             -13462,          0
##MAX=       8223.62146879497, 501478508,    0
$$ Real data points
##PAGE= N=1
##DATA TABLE= (X++(R..R)), XYDATA
$$ [...]
63869G35807K1591K4267K6863K8727K9469K9354K9003K8817K8691K8081K6420
63858A037090K3792K1047J8887J6913J4035R754M614n59n230r083j2165j5206
63846A103889j9048k3442k7130k9422l1019l2750l4336l5055l5055l5066l5145
63835G66421l4644l3355l1903l0870l0084k8982k7264k5070k2753k0593j8650
63824D62253j6863j5265j3925j2671j1286j0039r459r392q907p616o379o067o148
63811C28236n458l981k843k563k415j701q11n23r43j593k119k514k865l257l706
63796B90944m028l932l440k951k800k898k967k924k908l027l144k924k140j065
63782B49796l33k83n31n13k08OM2J33K74J29l90q72r85r22j094j535j820j541
$$ plain form
63869 735807 757398 781665 808528 837255 866724 896078 925081 953898 982589 1010670 1037090
63858 1037090 1060882 1081929 1100816 1117729 1131764 1141518 1146132 1145573 1140343 1131260 1119095 1103889
63846 1103889 1084841 1061399 1034269 1004847 973828 941078 906742 871687 836632 801566 766421
63835 766421 731777 698422 666519 635649 605565 576583 549319 524249 501496 480903 462253
63824 462253 445390 430125 416200 403529 392243 382204 372745 363353 354446 346830 340451 334384 328236
63811 328236 322778 318797 315954 313391 310976 309275 308464 307941 306998 305405 303286 300772 297907 294650 290944
63796 290944 286916 282984 279544 276593 273793 270895 267928 265004 262096 259069 255925 253001 250861 249796
63782 249796 249463 249180 248649 248136 247928 247934 247976 248109 248383 248512 248122 247250 246265 245343 244249 242714 240894 239353
63764B39353q19k42k66o14n60J03O97N90O6j29J40L49K01m6j20j02j04k6K15N50
63744B39236R52J519K264L033L614L809L543L069K767K603K094J221P88J336K153
63729B74001K153J462J189J788K623L195L792M686N456N594N121M355L569L002
63715C21986K646J951M03j506k672k858k871l137l111k550k268k795l239k397
63701B97582m60J297K112K212K053J897J940K146K129J783J740K576L852M604
63687C27463M563M201L749K968J857Q26Q1n80j223j655j886k172k430k128j005
63672C32629M54J473J643J111M36L29J095K166K529J809O16k90r06j714k864l955
63656C36561m591m770m727m619m473m259l870l152k176j379j229j652k064j965
$$ plain form
63764 239353 238534 238292 238026 237412 236852 236955 237652 238242 238308 238179 238319 238668 238869 238823 238703 238601 238497 238471 238686 239236
63744 239236 240188 241707 243971 247004 250618 254427 257970 261039 263806 266409 268503 269724 270512 271848 274001
63729 274001 276154 277616 278805 280593 283216 286411 290203 294889 300345 305939 311060 315415 318984 321986
63715 321986 324632 326583 326986 325480 322808 319950 317079 313942 310831 308281 306013 303218 299979 297582
63701 297582 297122 298419 300531 302743 304796 306693 308633 310779 312908 314691 316431 319007 322859 327463
63687 327463 332026 336227 339976 342944 344801 345627 345708 345128 343905 342250 340364 338192 335762 333634 332629
63672 332629 333083 334556 336199 337310 337746 338075 339170 341336 343865 345674 346290 346000 345094 343380 340516 336561
63656 336561 331970 327200 322473 317854 313381 309122 305252 302100 299924 298545 297316 295664 293600 291635
63642B91635j272j05J367K665L102K650K264K809L959M805N168N511N761N395
63628C35714M727M950O442Q070Q766Q963R674J1001J2315J3371J4351J5268J6174
63615D69786J7594J9877K2457K4534K6266K8407L0980L3212L4665L5427L5156
63604G78361L2872K8074K1412J4024O786L63m686q239j0540j1657j1433j0172
63592H25165q833q265q712j0191j2832j6447k0246k3382k5573k6902k7317k6670
63580F09795k5039k2751k0113j7287j4344j1398q771o857n566m115j869P06K511
63567D74902L345M214N853P649Q586Q709Q889R428R752R550R495J0453J2450J4769
63553E98044J6909J9120K2001K5846L0488L5647M1186M6757N1176N2316M8027
$$ plain form
63642 291635 290363 290258 291625 294290 297392 300042 302306 305115 309074 313879 319047 324558 330319 335714
63628 335714 340441 345391 351833 359903 368669 377632 387306 398307 410622 423993 438344 453612 469786
63615 469786 487380 507257 529714 554248 580514 608921 639901 673113 707778 743205 778361
63604 778361 811233 839307 860719 874743 881529 881892 877206 868967 858427 846770 835337 825165
63592 825165 816332 808067 799355 789164 776332 759885 739639 716257 690684 663782 636465 609795
63580 609795 584756 562005 541892 524605 510261 498863 490092 483235 477669 473554 471685 472391 474902
63567 474902 478247 482461 488314 495963 504549 513258 522147 531575 541327 550877 560372 570825 583275 598044
63553 598044 614953 634073 656074 681920 712408 748055 789241 835998 887174 939490 987517
63542I87517L7544K2401N998p987j7364k2048k3198k1915j8840j4713j0744q053
63530I08598o945p025q051j0357j4314j9550k4955k9425l2450l4001l4169l3143
63518F54213l1378k9416k7537k5707k3883k2091k0211j7996j5450j2996j1104
63507D16444r875r016q121o955n706m928m920n191m927m016l133k658k150j156
63493C43692j3O63P67N07j34j055j549r79K37J078J266J450K008K555K809L174
63477C56476M036M988N239M514L227K001J255R60O56j40j369k533l386m107m712
63462C67105m779m083l111k561k458k153j189J44J138J502J690K304L231L730
63448C60510L605L790N206P358Q896R509J0296J2114J4441J6471J8493K1460K5622
$$ plain form
63542 987517 1025061 1047462 1053460 1045473 1028109 1006061 982863 960948 942108 927395 916651 908598
63530 908598 901653 894628 886577 876220 861906 842356 817401 787976 755526 721525 687356 654213
63518 654213 622835 593419 565882 540175 516292 494201 473990 455994 440544 427548 416444
63507 416444 406569 397553 389432 382477 376771 371843 366923 361732 356805 352789 349656 346998 344848 343692
63493 343692 343679 344342 345109 345616 345482 344427 342878 341899 342136 343214 344480 345930 347938 350493 353302 356476
63477 356476 360512 365500 370739 375253 378480 380481 381736 382696 383352 383212 381843 379310 375924 371817 367105
63462 367105 362326 358243 355132 352571 350113 347960 346771 346915 348053 349555 351245 353549 356780 360510
63448 360510 364115 367905 373111 380469 389365 398874 409170 421284 435725 452196 470689 492149 517771
63435E17771L0367L4948L8478L9397L6129K8692J9178J0283L590o07k445j916
63423G53865R31N603J1232J7034K2756K8527L4286L9393M2933M4147M2490L7602
63411A080799K9690J9839R532j46q496j4667j7787j7910j6268j4238j2427j1131
63399A026790j1169j3471j7901k3150k7977l2018l5307l7548l8253l7292l4892
63388G17812l1463k7735k4736k3036k2094k0832j8741j6010j2813r194n695l153
63376E02310j590pK195M324N564O384P859J0042J1999J3379J4939J7279J9955
63363F14632K2212K3911K5359K6856K8787L1628L5221L8511M0509M1192M0853
63352I69671L8910L4217K6599J7366Q135k93p589j3128j6203j6874j6016j4519
$$ plain form
63435 517771 548138 583086 621564 660961 697090 725782 744960 755243 758833 758226 755781 753865
63423 753865 754796 760399 771631 788665 811421 839948 874234 913627 956560 1000707 1043197 1080799
63411 1080799 1110489 1130328 1139860 1139714 1131218 1116551 1098764 1080854 1064586 1050348 1037921 1026790
63399 1026790 1015621 1002150 984249 961099 933122 901104 865797 828249 789996 752704 717812
63388 717812 686349 658614 633878 610842 588748 567916 549175 533165 520352 511158 505463 502310
63376 502310 500720 500713 502908 507232 512796 519180 527039 537081 549080 562459 577398 594677 614632
63363 614632 636844 660755 686114 712970 741757 773385 808606 847117 887626 928818 969671
63352 969671 1008581 1042798 1069397 1086763 1094898 1094605 1087016 1073888 1057685 1040811 1024795 1010276
63340A010276j2875j1644j1769j3943j7807k2210k6285k9916l3097l5293l5787
63329G59650l4428l1737k8333k4537k0517j6448j2391q117l341J646N437N892
63317E92776J684o156j4509k0403k2977k3190k2110k0137j7625j5287j3587j2231
63305D06248j0657q740o770m989l555k691k518k713k675k100j309r14j272k160
63291C53185k985l319l230l016k679j997j050m49o72j388j678j055o2K67m45j451
63275C27976j619o14P78J584J600J301R94N10k68r05p70K69J670K738L168L135
63259C41547K968K903L062L468L966M282M337M388M650M903M851M734N115O013
63245D01187O859P466Q398R946J1436J2168J2574J3658J5554J7461J8876K0114
$$ plain form
63340 1010276 997401 985757 973988 960045 942238 920028 893743 863827 830730 795437 759650
63329 759650 725222 693485 665152 640615 620098 603650 591259 583142 579801 581447 586884 592776
63317 592776 594460 588304 573795 553392 530415 507225 485115 464978 447353 432066 418479 406248
63305 406248 395591 386851 380081 375092 371537 368846 366328 363615 360940 358840 357531 356617 355345 353185
63291 353185 350200 346881 343651 340635 337956 335959 334909 334460 333788 332400 330722 329667 329605 329872 329427 327976
63275 327976 326357 325743 326521 328105 329705 331006 332000 332510 332242 331337 330567 330836 332506 335244 338412 341547
63259 341547 344515 347418 350480 353948 357914 362196 366533 370921 375571 380474 385325 390059 395174 401187
63245 401187 408046 415512 423910 433856 445292 457460 470034 483692 499246 516707 535583 555697
63233E55697K1572K3238K4997K6768K8161K8591K8028K7148K6516K6035K5315
63222H42066K4218K2975K2084K2155K3283K4636K5184K4914K4648K4590K3758
63211A104511K1182J6971J1801O028k28o609j2669j8282k3503k8259l2348l5441
63199A003154l7002l6687l4955l2649k9904k6239k1893j8055j5191j2213q136
63188G30230l643L2L037O374R953J2680J4329J5989J8351K0760K2334K3032K3165
63175H96623K2786K2064K1525K1379K1146K0435J9509J8622J7433J5600J3452
63164A110574J1249Q281L511k951r770j5794k0955k5677k9995l3535l5966l7184
63152I21788l7276l6554l5421l4024l2125k9467k6215k2882j9927j7500j5536
$$ plain form
63233 555697 577269 600507 625504 652272 680433 709024 737052 764200 790716 816751 842066
63222 842066 866284 889259 911343 933498 956781 981417 1006601 1031515 1056163 1080753 1104511
63211 1104511 1125693 1142664 1154465 1160493 1160265 1153656 1140987 1122705 1099202 1070943 1038595 1003154
63199 1003154 966152 929465 894510 861861 831957 805718 783825 765770 750579 738366 730230
63188 730230 726587 726619 729656 736030 745983 758663 772992 788981 807332 828092 850426 873458 896623
63175 896623 919409 941473 962998 984377 1005523 1025958 1045467 1064089 1081522 1097122 1110574
63164 1110574 1121823 1130104 1133615 1130664 1120894 1105100 1084145 1058468 1028473 994938 958972 921788
63152 921788 884512 847958 812537 778513 746388 716921 690706 667824 647897 630397 614861
63141F14861j3900j2477j1175r883q416o703n083m157m060m072l332j912p55m07
63127E28529l20L24J527K640L309L666L808L727L734M283N201N679N292M550M140
63112E80089M068L914L603L370L218K897K319J631R07J10o60j169j363j440j585
63097E99909j778j860j707j350r91p93o49l45J9O8k14k57L33J154J566J699K342
63080E97146L838N599O823P257P100O594O054N994O704P803Q561Q772R005R834
63066F97084J1108J2273J3243J4514J6337J8212J9585K0753K2624K5642K9369
63055I00744L3157L6767M0226M3498M6660N0072N3934N7798O0856O2736O3751
63044A450199O4346O4473O3654O1660N9039N6872N5840N5654N5561N5315N5259
$$ plain form
63141 614861 600961 588484 577309 567426 559010 552307 547224 543067 539007 534935 531603 529691 528936 528529
63127 528529 528209 528533 530060 532700 536009 539675 543483 547210 550944 555227 560428 566107 571399 575949 580089
63112 580089 584157 588071 591674 595044 598262 601159 603478 605109 606016 606126 605466 604297 602934 601494 599909
63097 599909 598131 596271 594564 593214 592223 591430 590781 590436 590455 590523 590309 590052 590385 591539 593105 594804 597146
63080 597146 600984 606583 613406 620663 627763 634357 640411 646405 653109 660912 669473 678245 687250 697084
63066 697084 708192 720465 733708 748222 764559 782771 802356 823109 845733 871375 900744
63055 900744 933901 970668 1010894 1054392 1101052 1151124 1205058 1262856 1323712 1386448 1450199
63044 1450199 1514545 1579018 1642672 1704332 1763371 1820243 1876083 1931737 1987298 2042613 2097872
63033B097872N5477N5355N4194N1881M8424M3201L5318K4823J2939P30j2149k6694
63021B441371m2588n7585o9254p6982q1768q4370q4553q2184p7980p2643o5996
63010A645468n7852m9122m1041l3648k6002j7836r891k581M539J1701J8284K3663
62998A465682K7897L1141L3239L4402L5544L7199L8687L9024L8210L7104L6406
62987A854535L6223L6137L5257L2685K8441K3434J8108J1688L327o645j7263k8065
62975B027862l8820m8748n6978o3500o8688p2200p3306p2177o9865o7014o3479
62964A333087n9223n4739n0367m5931m1347l7074l3664l1209k9343k7593k5789
62953H96808k4291k3584k3430k2831k1251j9362j8061j7232j6222j4988j3969
$$ plain form
63033 2097872 2153349 2208704 2262898 2314779 2363203 2406404 2441722 2466545 2479484 2480214 2468065 2441371
63021 2441371 2398783 2341198 2271944 2194962 2113194 2028824 1944271 1862087 1784107 1711464 1645468
63010 1645468 1587616 1538494 1497453 1463805 1437803 1419967 1410076 1407495 1412034 1423735 1442019 1465682
62998 1465682 1493579 1524720 1557959 1592361 1627905 1665104 1703791 1742815 1781025 1818129 1854535
62987 1854535 1890758 1926895 1962152 1994837 2023278 2046712 2064820 2076508 2079835 2073190 2055927 2027862
62975 2027862 1989042 1940294 1883316 1819816 1751128 1678928 1605622 1533445 1463580 1396566 1333087
62964 1333087 1273864 1219125 1168758 1122827 1081480 1044406 1010742 979533 950190 922597 896808
62953 896808 872517 848933 825503 802672 781421 762059 743998 726766 710544 695556 681587
62942F81587j3149j2302j1808j2046j2187j0847q162o003n664o366o514n649m502
62929E66388l715l216k611j812j246j463k343k950k496j278j75M03M21l78j976
62914E41553l267l049j812j322k247l393l619l173k731k265j672j398j600j572
62900E08433q56j41j21k28M33J462J622O29m96q38n33j85q4r2rR5j34q42j379
62881E06736p55J061K804L289K640J752J100O71N35P71J046Q98K45p63k014l096
62865E16920l204k089p21k56o39r15o41j46L50J004J740K181K294K416K601K645
62849E23540K704L178L777L575K267P39l9j56l41q57j352j483j263q26k89J76
62833E33350M07L80K04J0q5k0J33K34L18O45J359K192K696K731K653K897L525
$$ plain form
62942 681587 668438 656136 644328 632282 620095 609248 601086 595083 589419 583053 576539 570890 566388
62929 566388 562673 559457 556846 555034 553788 552325 549982 547032 544536 543258 543083 543486 543907 543529 541553
62914 541553 538286 535237 533425 532103 529856 526463 522844 519671 516940 514675 513003 511605 510005 508433
62900 508433 507577 507436 507315 507087 507520 508982 510604 511233 510737 509899 509366 509181 509097 509005 508996 509091 508957 508115 506736
62881 506736 505981 507042 509846 513135 515775 517527 518627 519298 519833 520604 521650 522548 522793 522030 520016 516920
62865 516920 513716 511627 510906 510650 510011 509096 508455 508309 508659 509663 511403 513584 515878 518294 520895 523540
62849 523540 526244 529422 533199 536774 539041 539780 539741 539585 539244 538387 537035 535552 534289 533463 533174 533350
62833 533350 533757 534137 534341 534351 534266 534246 534379 534613 534931 535576 536935 539127 541823 544554 547207 550104 553629
62816E53629M150M340L954L177K372J950K236L208M399N220N399N070M580M336
62802F08020M695N688O880P855Q725R866J1157J1988J2125J2142J2846J4568J7180
62789G43735K0373K3730K6957L0375L4787M0512M6834N2729N7967O3097O8695
62778A209791P4969Q1928Q9386R6658J02600J06096J06562J04158R9530R3163
62768B164841Q4830P3872O0109M4170K6852Q576j0252k8781m6077o1630p5133
62757B241377q5958r3497r7903j00034j00492r9203r6034r1538q6694q1973p6983
62746A231068p1155o4711n8574n3266m8270m2893l7431l2820k9316k6207k3010
62735G43415k0171j8227j6941j5726j4426j3113j1545r466p170n241l842k735
$$ plain form
62816 553629 557779 562119 566073 569250 571622 573572 575808 579016 583415 588635 594034 599104 603684 608020
62802 608020 612715 618403 625283 633138 641863 651729 662886 674874 686999 699141 711987 726555 743735
62789 743735 764108 787838 814795 845170 879957 920469 967303 1020032 1077999 1141096 1209791
62778 1209791 1284760 1366688 1456074 1552732 1655332 1761428 1867990 1972148 2071678 2164841
62768 2164841 2249671 2323543 2383652 2427822 2454674 2463250 2452998 2424217 2378140 2316510 2241377
62757 2241377 2155419 2061922 1964019 1863985 1763493 1664290 1568256 1476718 1390024 1308051 1231068
62746 1231068 1159913 1095202 1036628 983362 935092 892199 854768 821948 792632 766425 743415
62735 743415 723244 705017 688076 672350 657924 644811 633266 623800 616630 611389 607547 604812
62723F04812j785j036l94L38J265K488M194O288Q201R456J0229J1048J2145J3522
62709F80771J5347J7827K0859K4235K7952L1932L5757L9210M2804M7173N2099
62698A035966N6814O1111O5547P0496P5613Q0261Q3936Q6196Q6582Q4750Q0331
62687A867603P2804O1958M8411L3177J6836l53j7637l3820m8209o0833p1539p9536
62675A788862q4255q6137q6143q4809q2134p8135p3135o7642o2200n7207n2676
62664I74389m8280m3805l9447l5570l2263k9293k6412k3619k1080j8804j6498
62653F39318j3940j1520j0066r910j0331j0272r411q320p667p607p759p450o176
62640E18889m174k398j494j047l03O24Q87J92p86j348j462j367j129q77q88j134
$$ plain form
62723 604812 603027 601991 601597 601935 603200 605688 609882 616170 624371 633827 644056 655104 667249 680771
62709 680771 696118 713945 734804 759039 786991 818923 854680 893890 936694 983867 1035966
62698 1035966 1092780 1153891 1219438 1289934 1365547 1445808 1529744 1615940 1702522 1787272 1867603
62687 1867603 1940407 2002365 2050776 2083953 2100789 2100436 2082799 2048979 2000770 1939937 1868398 1788862
62675 1788862 1704607 1618470 1532327 1447518 1365384 1287249 1214114 1146472 1084272 1027065 974389
62664 974389 926109 882304 842857 807287 775024 745731 719319 695700 674620 655816 639318
62653 639318 625378 613858 603792 593882 583551 573279 563868 555548 547881 540274 532515 525065 518889
62640 518889 514715 512317 510823 509776 509473 510097 510984 511176 510390 509042 507580 506213 505084 504207 503319 502185
62624E02185j184q69n22k67L60J613K864L384L395L707M437M934M934N035N702
62609E39708O484O692O470O569P307Q431R874J1939J4505J6706J8015J9231K1717
62596F93648K5764L0342L4430L7958M1322M4603M7589N0050N1648N1831N0216
62585A159401M6797M1614L4618K6033J6524O683l275j3064k2000k9533l5748m0943
62573A187107m5092m7982m9509m9487m7711m4655m1554l9208l7164l4653l1769
62562G18323k9006k6236k3155k0283j8388j7073j5125j2334r808q409p823p441
62550E23242p093o600n547m058k960k644k436j636o25k99p84j319j182l45O30
62535D86344J015M89m85j005n85N34J928L415M861O035O943P992R608J1852J4417
$$ plain form
62624 502185 501001 500132 499610 499343 499703 501316 504180 507564 510959 514666 519103 524037 528971 534006 539708
62609 539708 546192 552884 559354 565923 573230 581661 591535 603474 617979 634685 652700 671931 693648
62596 693648 719412 749754 784184 822142 863464 908067 955656 1005706 1057354 1109185 1159401
62585 1159401 1206198 1247812 1282430 1308463 1324987 1331670 1328395 1315331 1293331 1263798 1228050 1187107
62573 1187107 1142015 1094033 1044524 995037 947326 902671 861117 821909 784745 750092 718323
62562 718323 689317 663081 639926 619643 601255 584182 569057 556723 546915 538506 530683 523242
62550 523242 516149 509549 504002 499944 496984 494340 491904 490268 489643 489344 488560 487241 486059 485714 486344
62535 486344 487359 487848 487363 486358 485773 486307 488235 491650 496511 502546 509489 517481 527089 538941 553358
62520E53358J6771J8458J9660K1355K4312K8115L1768L5096L8732M2721M6221
62509H76567M8758N0728N2236N2412N0558M7051M2488L6660K9219K0713J2056
62498A319446L399n496j4017k0688k4414k5198k3737k0904j7439j3626r231m109
62486A143986J363O764J2175J7766K3235K8218L2838L6975L9181L7308L0612K0772
62474A431193J0654K355l786r044j5428k4302l5158m5749n3636n7810n9033n8939
62462A081317n8699n8290n6849n3770m9316m4186l8772l3184k7736k2948j9076
62451F18491j5968j3383j1161r083o964m956l454k565j798n19J468L777N802P179
62437E66866P880Q026P667O855N721M352K586K15k576n227p326q868r981j0646
$$ plain form
62520 553358 570129 588587 608247 629602 653914 682029 713797 748893 787625 830346 876567
62509 876567 925325 976053 1028289 1080701 1131259 1178310 1220798 1257458 1286677 1307390 1319446
62498 1319446 1322845 1317349 1303332 1282644 1258230 1233032 1209295 1188391 1170952 1157326 1148095 1143986
62486 1143986 1145349 1152113 1164288 1182054 1205289 1233507 1266345 1303320 1342501 1379809 1410421 1431193
62474 1431193 1441847 1444202 1440416 1431372 1415944 1391642 1356484 1310735 1257099 1199289 1140256 1081317
62462 1081317 1022618 964328 907479 853709 804393 760207 721435 688251 660515 637567 618491
62451 618491 602523 589140 577979 568896 561932 556976 553522 550957 549159 548640 550108 553885 559687 566866
62437 566866 574746 582772 590439 597294 603015 607367 609953 610168 607592 602365 595039 586171 576190 565544
62423E65544j0812j0559j0048r454q981q605p839o253m353l366l858m938n228
62410D71250m272k686j341q34j382k552l308k881j637o19l05k26J96R36J613K037
62394D53989K309K528K626K452K021J659J763K371L135L785M411N158N934O614
62380E00755P231P728P824P513P412Q128R419J0403J0574J0274J0105J0292J0694
62367F18352J1208J1969J3265J5295J8035K1367K5244K9629L4262L8847M3469
62356H80942M8448N3649N8297O1729O3801O4245O2085N6348M7283L6372K5231
62345A458430J4875N842j679p996j3782j9510k5172l0512l5316l9420m2594m4507
62333A218659m4820m3437m0729l7338l3659k9719k5720k2338k0193j9233j8907
$$ plain form
62423 565544 554732 544173 534125 524671 515690 507085 499246 492993 488640 485274 481416 476478 471250
62410 471250 466978 464292 462951 462117 460735 458183 454875 451994 450357 449738 449433 449207 449403 450339 451952 453989
62394 453989 456298 458826 461452 463904 465925 467584 469347 471718 474853 478638 483049 488207 494141 500755
62380 500755 507986 515714 523538 531051 538463 546591 556010 566413 576987 587261 597366 607658 618352
62367 618352 629560 641529 654794 670089 688124 709491 734735 764364 798626 837473 880942
62356 880942 929390 983039 1041336 1103065 1166866 1231111 1293196 1349544 1396827 1433199 1458430
62345 1458430 1473305 1479147 1477468 1469472 1455690 1436180 1411008 1380496 1345180 1305760 1263166 1218659
62333 1218659 1173839 1130402 1089673 1052335 1018676 988957 963237 940899 920706 901473 882566
62322H82566j8782j8775j9028j9790k1120k2472k2947k2282k1210k0422j9620
62311F56118j8195j6378j4947j3940j2575j0505q424p114o496n915m929l575k194
62298E30931j191p27m45K81J594K881L407L112K700L001M222N772O813P123P219
62283E76693P608Q209Q724R219R897J0571J0889J0940J1118J1437J1575J1522
62271F98402J1631J1924J2025J1942J2336J3683J5525J7016J7950J8962K0804
62260H62200K3658K7161L0935L5048L9861M5425N1148N6248O0217O2531O2253
62249A356685N8468N1263M1724L0970J9672Q573j209q937j5084k0947k7486l4702
62237A458990m2022m8836n4655n9024o1547o2071o0715n7696n3273m7963m2647
$$ plain form
62322 882566 863784 845009 825981 806191 785071 762599 739652 717370 696160 675738 656118
62311 656118 637923 621545 606598 592658 580083 569578 561154 554040 547544 541629 536700 533125 530931
62298 530931 529740 529013 528568 528849 530443 533324 536731 539843 542543 545544 549766 555538 562351 569474 576693
62283 576693 584301 592510 601234 610453 620350 630921 641810 652750 663868 675305 686880 698402
62271 698402 710033 721957 733982 745924 758260 771943 787468 804484 822434 841396 862200
62260 862200 885858 913019 943954 979002 1018863 1064288 1115436 1171684 1231901 1294432 1356685
62249 1356685 1415153 1466416 1508140 1539110 1558782 1567355 1566146 1557209 1542125 1521178 1493692 1458990
62237 1458990 1416968 1368132 1313477 1254453 1192906 1130835 1070120 1012424 959151 911188 868541
62226H68541l8042l4084l0174k6126k2393j9255j6372j3507j1072r491q478p597
62214F31950p052p128p213o387m903l989m035l959k765r48K62M16J21J10O45J600
62198E86725K684L626M343M894N316N672O218P155Q154Q625Q511Q438Q919R836
62184F79116J0834J1725J2280J2121J1157R793Q382O872N229L867L260L438M234
62171G82308N739Q204J1684J6085K1321K7127L2851L7822M1805M4907M7121M8099
62159A125073M7276M4103L8392L0644K1916J3237N285j524o986j1367j5322j9383
62147A271344k3700k8252l2784l6465l8226l7828l6104l3841l0983k7334k3430
62136I22397j9988j6935j3761j0568p962o088m625l684l851n023n997n693m282
$$ plain form
62226 868541 830499 796415 766241 740115 717722 698467 682095 668588 657516 648025 639547 631950
62214 631950 624898 617770 610557 604170 599267 595278 591243 587284 584519 583571 583833 584249 584370 584480 585125 586725
62198 586725 589409 593035 597378 602272 607588 613260 619478 626633 634787 643412 651923 660361 669280 679116
62184 679116 689950 701675 713955 726076 737233 747026 755408 762280 767509 771376 774636 778074 782308
62171 782308 788047 796251 807935 824020 845341 872468 905319 943141 984946 1029853 1076974 1125073
62159 1125073 1172349 1216452 1254844 1285488 1307404 1320641 1325926 1324402 1317416 1306049 1290727 1271344
62147 1271344 1247644 1219392 1186608 1150143 1111917 1074089 1037985 1004144 973161 945827 922397
62136 922397 902409 885474 871713 861145 853183 847095 842470 838786 834935 829912 823915 818222 813940
62123H13940k679j289L19K645N615Q634J0958J2014J1533R522O199K101j856m716
62109H72940o086o326o056n654n299n316o236q373j1374j4167j5468j4634j2073
62096G55878q838n776l098o28J783M142O287P839Q366P877P025O610O833P251
62082H01551P478P678Q279R371J0692J2138J3988J6456J9145K1257K2377K2882
62070I73292K3390K3955K4121K3805K3768K4903K7150K9563L1402L2685L3511
62059A271545L3247L0911K6119J9327J1326L087m052q834j1188j2473j4300j7237
62047A327478k0891k4852k9149l3929l8920m3286m5936m6295m4940m3184m1820
62036I14276m0526l8620l5956l2814k9374k5853k2776k0498j8685j6774j4784
$$ plain form
62123 813940 811261 809972 810291 812936 818551 827185 838143 850157 861690 871212 877411 879512 877656 872940
62109 872940 866854 860528 854472 848818 843519 838203 831967 823594 812220 798053 782585 767951 755878
62096 755878 747040 741264 738166 737538 739321 743463 749750 757589 765955 773832 780857 787467 794300 801551
62082 801551 809029 816707 824986 834357 845049 857187 871175 887631 906776 928033 950410 973292
62070 973292 996682 1020637 1044758 1068563 1092331 1117234 1144384 1173947 1205349 1238034 1271545
62059 1271545 1304792 1335703 1361822 1381149 1392475 1395562 1391510 1382676 1371488 1359015 1344715 1327478
62047 1327478 1306587 1281735 1252586 1218657 1179737 1136451 1090515 1044220 999280 956096 914276
62036 914276 873750 835130 799174 766360 736986 711133 688357 667859 649174 632400 617616
62025F17616j3094j1676j0261r146q948r476r653q851p673p001o878o693o077
62012E02189n113l988k877j971j274m91O82K217L840N290O375P034P397P620P555
61997E34485O912N764M554L480K335J066rq33j944l633n258n952n863o006o906
61982E22192q002q526q410q042p516o566n146l714k835k702l112l732m203m167
61968D45519l467k443j730j621j796j770j456j018n05J04N88O42L23M3R3M34R07
61951D32847J385J818K321L199M524N935P121Q408J0253J2366J3943J4797J5576
61938E34493J6700J7780J8406J8849J9451J9898J9638J8724J7673J6668J5477
61927G33757J4045J2608J1143R163O295K836m29k893m521n686o699p490p677o892
$$ plain form
62025 617616 604522 592846 582585 573439 564491 555015 545362 536511 528838 521837 514959 508266 502189
62012 502189 497076 493088 490211 488240 486966 486475 487157 489374 493214 498504 504879 511913 519310 526930 534485
61997 534485 541397 547161 551715 555195 557530 558596 558587 557754 555810 552177 546919 540967 535104 529098 522192
61982 522192 514190 505664 497254 489212 481696 475130 469984 466270 463435 460733 457621 453889 449686 445519
61968 445519 442052 439609 437879 436258 434462 432692 431236 430218 429713 429817 430405 431047 431370 431413 431506 431940 432847
61951 432847 434232 436050 438371 441570 446094 452029 459150 467558 477811 490177 504120 518917 534493
61938 534493 551193 568973 587379 606228 625679 645577 665215 683939 701612 718280 733757
61927 733757 747802 760410 771553 780716 787011 789847 789418 786525 782004 776318 769619 762129 754452 747560
61913G47560n050k451L70L047N709Q743J2111J5118J7013J7592J7008J5361J2731
61900H64862R342N275L89m956r511j2205j3423j4441j5743j6709j6923j6825j6825
61887G42307j6624j5834j4573j3177j1861j0950j0784j1119j1241j0931j0628
61876F04585j0435r776q424p060o232n578m627l631k896j978m25J289K399L073
61862E50284M138N830P589Q911R828J0708J2157J4711J8076K1048K2913K4477
61850G10670K6882K9797L1821L2473L2658L3059L3134L1993K9458K5795K1060
61839A038800J5302R027K939k611p640j1998j5111j6371j5767j3967j1534q235
61827I62834l611J838O731J0283J2975J5338J6792J6431J4239J0724N865n19p735
$$ plain form
61913 747560 742510 740059 740429 743476 749185 757928 770039 785157 802170 819762 836770 852131 864862
61900 864862 874204 879479 879868 874912 865401 853196 839773 825332 809589 792880 775957 759132 742307
61887 742307 725683 709849 695276 682099 670238 659288 648504 637385 626144 615213 604585
61876 604585 594150 584374 575950 568890 562658 557080 552453 548822 545926 543948 543523 544812 547211 550284
61862 550284 554422 560252 567841 576752 586580 597288 609445 624156 642232 663280 686193 710670
61850 710670 737552 767349 799170 831643 864301 897360 930494 962487 991945 1017740 1038800
61839 1038800 1054102 1063129 1066068 1063457 1055817 1043819 1028708 1012337 996570 982603 971069 962834
61827 962834 959223 961061 967792 978075 991050 1006388 1023180 1039611 1053850 1064574 1070439 1069920 1062185
61814A062185j4597k0650k5944k9869l1474l1130l0588l0803l0769k9084k5939
61803G61338k2835k0855j9828j8926j7449j5226j2664j0403q794p797p316p237
61791E92008p117o396n150m160l967m208m177l719l185k798k428j931j441j270
61777E40061j592k163k429k127j653j596j930k065j707j208j024j122j155q77
61763E17413k85M55J062J376J671K378L391L917L314J891O07L2j04l49q00j176
61747E34793j547k451l930m881m167k364j450k350l630l385j735m03l18p45p70
61732E00667m34j01K91Q83J505K045K671L254L187K268J285J176J886K536K528
61717E25647K050J642J577J675J523Q79p4r56j650k341l106l793m331m813n181
$$ plain form
61814 1062185 1047588 1026938 1000994 971125 939651 908521 877933 847130 816361 787277 761338
61803 761338 738503 717648 697820 678894 661445 646219 633555 623152 614358 606561 599245 592008
61791 592008 584891 578495 573345 569185 565218 561010 556833 553114 549929 547131 544703 542772 541331 540061
61777 540061 538469 536306 533877 531750 530097 528501 526571 524506 522799 521591 520567 519445 518290 517413
61763 517413 517128 517583 518645 520021 521692 524070 527461 531378 534692 536583 537190 537222 537118 536769 535969 534793
61747 534793 533246 530795 526865 521984 517817 515453 514003 511653 508023 504638 502903 502500 502182 501437 500667
61732 500667 500233 500132 500423 501306 502811 504856 507527 510781 513968 516236 517521 518697 520583 523119 525647
61717 525647 527697 529339 530916 532591 534114 534993 534919 533963 532313 529972 526866 523073 518742 513929 508748
61702E08748n209m957m908n400o102o354n859m903l996l419l118k888k673k583
61688D46379k644k720k825l205l879m335m035l079k012j189o96o64j119j641j708
61673D10628j317q21k99K87O03L18r3J61Q98J013J12q91j163j051j174j244o25
61656D05342M34J045R45P55R73J380J540J419J286J325J526J846K302K890L391
61641D28399L434K898K199J888K014K082J606M83j054k526l356l342k999l029
61627D28697l514m005m305m550m561l855k452j049j31N06J065J253Q66L74L40
61612D04679O07M56n55k250m012n159n373m986m619m449m197l804l573l527l308
61597C55930k926k936l475l808l337k506k049j843j165J05J234J505Q95l8o75
$$ plain form
61702 508748 503539 498582 493674 488274 482172 475818 469959 465056 461060 457641 454523 451635 448962 446379
61688 446379 443735 441015 438190 434985 431106 426771 422736 419657 417645 416456 415760 415096 413977 412336 410628
61673 410628 409311 408490 408191 408478 409081 409399 409306 409467 410365 411378 411490 410599 409436 408385 407211 405967 405342
61656 405342 405776 406821 407766 408521 409494 410874 412414 413833 415119 416444 417970 419816 422118 425008 428399
61641 428399 431833 434731 436930 438818 440832 442914 444520 445003 443949 441423 438067 434725 431726 428697
61627 428697 425183 421178 416873 412323 407762 403907 401455 400406 400275 400781 401846 403099 403965 404339 404679
61612 404679 405286 405742 405187 402937 398925 393766 388393 383407 378788 374339 370142 366338 362765 359238 355930
61597 355930 353004 350068 346593 342785 339448 336942 334893 333050 331885 331990 333224 334729 335624 335586 334911
61582C34911q46r83j564k310k372j532n46o7J84N86O78j49j432k004j451m32L40
61565C21011P77J054J153J004O74L22K17O53J556K257K160J510J092J195J354
61550C37989J136P24N51O29N89J82m20q72j068j117r32j01J469L022L595L196
61534C48572K809L086L617L678L118K169R48l65j347j777j980k324k742k990l007
61519C51465k667j753o03j38o69j230p94L50J152J279J186J068P43K99J4l07j008
61502C48387j679j463l69O32Q71N85J30n12j181j292o18K47O29M83J56j23k24
61485C44659pL73N36M86P26J482K228K369K019J688J466J037L26l09n18l05J10
61468C58366N56R66J288J415J161M38n51j328j476j022m08p6j3J95Q06J498J735
$$ plain form
61582 334911 334065 333082 331518 329208 326836 325304 324758 324691 324875 325461 326139 325990 324558 322554 321103 320671 321011
61565 321011 321788 322842 323995 324999 325673 325995 326212 326865 328421 330678 332838 334348 335440 336635 337989
61550 337989 339125 339849 340400 341029 341618 341800 341380 340508 339440 338323 337391 337290 338759 341781 345376 348572
61534 348572 351381 354467 358084 361762 364880 367049 367997 367632 366285 364508 362528 360204 357462 354472 351465
61519 351465 348798 347045 346442 346304 345635 344405 343611 343961 345113 346392 347578 348646 349389 349688 349702 349395 348387
61502 348387 346708 345245 344876 345508 346379 346964 347094 346582 345401 344109 343491 343738 344367 344850 345006 344883 344659
61485 344659 344652 345025 345561 346047 346773 348255 350483 352852 354871 356559 358025 359062 359388 359079 358561 358256 358366
61468 358366 358922 359888 361176 362591 363752 364190 363639 362311 360835 359813 359405 359329 359316 359511 360317 361815 363550
61451C63550J437J032Q51Q64J009J301J497J200N87M18R33J318Q74J75K57J089
61435C78392J774K053K522L338L746L240K365J846J610J221P81P02R04Q77M77
61420D05848J56L09P35R44Q03P01J035J688K120J914J101l8j186j947k005j566
61404D10612j373j936k912l572l602l158k390j373l56L91Q56J066Q56K62j35J61
61388C93397P58R03O47O79J067R96M1j068j364p65J67J104K062L003L728M075
61372D09430L947L256K122J017M68O53J269J743J645J108P90J169J999K757L420
61357D36793M295N207N540N263N224O120P631Q984R993J0988J1912J2051J0782
61344E40783Q381N847L960K682J609P64N76R79J207Q31M39O60J026N70p20k004
$$ plain form
61451 363550 364987 366019 366870 367734 368743 370044 371541 372741 373328 373746 374679 375997 376871 377046 377303 378392
61435 378392 380166 382219 384741 388079 391825 395065 397430 399276 400886 402107 402888 403590 404494 405371 405848
61420 405848 406004 406313 407048 407992 408795 409496 410531 412219 414339 416253 417354 417316 416130 414183 412178 410612
61404 410612 409239 407303 404391 400819 397217 394059 391669 390296 389940 390331 391187 392253 393109 393371 393236 393397
61388 393397 394155 395058 395705 396384 397451 398447 398488 397420 396056 395291 395458 396562 398624 401627 405355 409430
61372 409430 413377 416633 418755 419772 420240 420893 422162 423905 425550 426658 427448 428617 430616 433373 436793
61357 436793 441088 446295 451835 457098 462322 468442 476073 485057 495050 506038 517950 530001 540783
61344 540783 549164 555011 558971 561653 563262 564026 564602 565581 566788 567619 568058 568718 569744 570314 569594 567590
61328E67590k980m109n349n821n125m052l396k904k077j264j125j424j248k32
61314E26484J136K300L152L836M572N673P309R267J1236J3202J5267J7125J8111
61301F38670J7726J5896J2832Q968M926J245j928m637o731p900q084p694p366
61288F55923p583q339r055r014q074o826n916n339m609l485k216j204n75p1P36
61273E84353K039L508M543M875M771M567M216L543K714K189K258K873L892N317
61259F35658P209R391J1330J2362J2188J1059R443P596N576L453J263j064l358
61246G22106n090n987o626p739r013r325q275o741n628m868m077l455l323l350
61232F38609k964k249j680j245m82P19K019L298M724O125O877O587N583M567M136
$$ plain form
61328 567590 564610 560501 555152 549331 544206 540154 536758 533854 531777 530513 529388 527964 526716 526484
61314 526484 527620 529920 533072 536908 541480 547153 554462 563729 574965 588167 603434 620559 638670
61301 638670 656396 672292 685124 694092 699018 700263 698335 693698 686967 679067 670983 663289 655923
61288 655923 648340 640001 630946 621932 613858 607032 601116 595777 591168 587683 585467 584263 583688 583617 584353
61273 584353 586392 589900 594443 599318 604089 608656 612872 616415 619129 621318 623576 626449 630341 635658
61259 635658 642867 652258 663588 675950 688138 699197 708640 716236 721812 725265 726528 725464 722106
61246 722106 717016 711029 704403 696664 687651 678326 670051 663310 657682 652814 648737 645282 641959 638609
61232 638609 635645 633396 631716 630471 629989 630708 632727 636025 640749 646874 653751 660338 665921 670488 674624
61217F74624M528N492O386O798P034P593Q230Q112O914N242L763K518J440R59
61203G49633J520K830M176N369O897R032J1334J3183J4562J6048J8155K0702K2745
61190H96186K3079K1134J7528J3561J0044O836L711J190%j53m70j671l305m765
61176I82905o212p975r658j0617j1119j2062j3571j4680j4660j3957j3521j3771
61164H41102j4570j5628j6439j6334j5190j3878j3380j3592j3469j2323j0451
61153F85848q452o457m302k074j42J294K304K863K581J048j563m478o945q746
61139F52779r921j0234r302p206m646k298l26J348K640L480M155N167O707Q502
61125F40845J0271J2069J4159J6580J8963K0875K2270K3460K4618K5482K5764
$$ plain form
61217 674624 679152 684644 691030 697828 704862 712455 720685 728797 735711 740953 744716 747234 748674 749633
61203 749633 751153 753983 758159 763528 770425 779457 790791 803974 818536 834584 852739 873441 896186
61190 896186 919265 940399 957927 971488 981532 988368 992079 993269 993269 993116 992646 990975 987670 982905
61176 982905 976693 968718 959060 948443 937324 925262 911691 897011 882351 868394 854873 841102
61164 841102 826532 810904 794465 778131 762941 749063 735683 722091 708622 696299 685848
61153 685848 677396 670939 666637 664563 664421 665715 668019 670882 673463 674511 672948 668470 661525 652779
61139 652779 642858 632624 623322 616116 611470 609172 608846 610194 612834 616314 620469 625636 632343 640845
61125 640845 651116 663185 677344 693924 712887 733762 756032 779492 804110 829592 855356
61114H55356K5696K5924K6866K8359K9790L0421K9715K7706K5064K2511K0127
61103A147535J7554J4730J1919Q975N149K7n720j0908j4987j8248k0982k2968
61091A112076k3956k4344k4966k6109k6997k6569k4715k2464k0807j9724j8507
61080H52918j6748j4641j2557j0747r303q051o581m736k938j652p01M46J886L265
61066G69860M467N737P113Q291R112R747J0398J1180J2256J3629J4917J5801J6593
61053I09101J7793J9266K0597K2092K4492K7611L0210L1508L2059L2809L4004
61042A201542L5419L6991L8729M0477M2044M3297M4034M4276M4638M5700M7130
61031A664277M8230M9234N0996N3324N4846N4779N3609N1818M9381M7038M6508
$$ plain form
61114 855356 881052 906976 933842 962201 991991 1022412 1052127 1079833 1104897 1127408 1147535
61103 1147535 1165089 1179819 1191738 1200713 1205862 1205889 1200169 1189261 1174274 1156026 1135044 1112076
61091 1112076 1088120 1063776 1038810 1012701 985704 959135 934420 911956 891149 871425 852918
61080 852918 836170 821529 808972 798225 788922 780871 774290 769554 766616 764964 764263 764709 766595 769860
61066 769860 774327 780064 787177 795468 804580 814327 824725 835905 848161 861790 876707 892508 909101
61053 909101 926894 946160 966757 988849 1013341 1040952 1071162 1102670 1134729 1167538 1201542
61042 1201542 1236961 1273952 1312681 1353158 1395202 1438499 1482533 1526809 1571447 1617147 1664277
61031 1664277 1712507 1761741 1812737 1866061 1920907 1975686 2029295 2081113 2130494 2177532 2224040
61020B224040M8570N2334N7199O3926P2728Q1881Q9776R7047J05343J15704J29949
61009C138497J52045J85639K31315K88547L58976M45256N48528O70913Q19067
61000F838783J001185J222725J490146J809459K154875K423577K444701K082897
60992B1468348J367487N16435j88648n66994n97960l59435M1249M63143P10182
60983B2853807N92638N7472p43430j535373k087353k319373k285545k090121j823419
60974A0619303j544806j287879j066256q79986p24480n96010m91081m05068l33919
60965C289818k75935k30651j96724j71594j52444j36906j23431j11450j00918
60956A789765r1409q1985p2006o1756n2158m4122l8189l4497l2872l2919l3925
$$ plain form
61020 2224040 2272610 2324944 2382143 2446069 2518797 2600678 2690454 2787501 2892844 3008548 3138497
61009 3138497 3290542 3476181 3707496 3996043 4355019 4800275 5348803 6019716 6838783
61000 6838783 7839968 9062693 10552839 12362298 14517173 16940750 19385451 21468348
60992 21468348 22835835 23352270 23163622 22596628 21998668 21639233 21680482 22143625 22853807
60983 22853807 23446445 23503917 22760487 21225114 19137761 16818388 14532843 12442722 10619303
60974 10619303 9074497 7786618 6720362 5840376 5115896 4519886 4028805 3623737 3289818
60965 3289818 3013883 2783232 2586508 2414914 2262470 2125564 2002133 1890683 1789765
60956 1789765 1698356 1616371 1544365 1482609 1430451 1386329 1348140 1313643 1280771 1247852 1213927
60945A213927l4784l4444l2727l0462k8632k7596k7197k7157k7029k6236k4720
60934H92943k3211k2407k2028k1247j9813j8234j6887j5575j4055j2506j1212
60923F95768j0135r082q046p134o253n159l871k827k447k538k370j441r9Q47J054
60908F36267R33J029J349J528J422J307J461J767J858J642J434J436J189r4k524
60893F52004n226p187q173q512q357p658o619n752n389n533o079o861p545p844
60879E55269p836p725p485p055o705o668o617o041n010l994l100k169j432j249
60865D82183j204m90P22J344J149J338K710M242M354K993J492R24J347K327L319
60850E08750L766L605L562M160M714M104K455J130R50J268J041J65p74j544k560
$$ plain form
60945 1213927 1179143 1144699 1111972 1081510 1052878 1025282 998085 970928 943899 917663 892943
60934 892943 869732 847325 825297 804050 784237 766003 749116 733541 719486 706980 695768
60923 695768 685633 676551 668505 661371 655118 649959 646088 643261 640814 638276 635906 634465 634366 635213 636267
60908 636267 637200 638229 639578 641106 642528 643835 645296 647063 648921 650563 651997 653433 654622 654528 652004
60893 652004 646778 639591 631418 622906 614549 606891 600272 594520 589131 583598 577519 570658 563113 555269
60879 555269 547433 539708 532223 525168 518463 511795 505178 499137 494127 490133 487033 484864 483432 482183
60865 482183 480979 480489 481211 482555 483704 485042 487752 491994 496348 499341 500833 501757 503104 505431 508750
60850 508750 512516 516121 519683 523843 528557 532661 535116 536246 537196 538464 539505 539670 538896 537352 534792
60835E34792m276o485q203q260o360l616j730j442j982k168j708j254j424k123
60821D83761k708k642j958j256j183j838k732l372l792m343n040n401n042m310
60807D38144m003m443n058n049m286l337k679k271j868j479j270j284j458j752
60793C97907k071k181j890j251m30M97J448K101K056J315M00j36j85oK27N42R28
60776C99271J213J332J514J964K484K679K527K432K706L227L693L881L547K511
60762D34981J083N1j53rk42q19j175j187j360j980k663k915k714k331j911j435
60746D15221q37m7R53J940K485K211J007r29l072m760n681o038o035n546m631
60731C86241l997m199m651m194k728j431j172j486j450q81j95K89M74L51K01N03
$$ plain form
60835 534792 530516 524031 515828 507568 501208 497592 495862 494420 492438 490270 488562 487308 485884 483761
60821 483761 481053 478411 476453 475197 474014 472176 469444 466072 462280 457937 452897 447496 442454 438144
60807 438144 434141 429698 424640 419591 415305 411968 409289 407018 405150 403671 402401 401117 399659 397907
60793 397907 395836 393655 391765 390514 390084 390581 392029 394130 396186 397501 397901 397765 397580 397574 397801 398343 399271
60776 399271 400484 401816 403330 405294 407778 410457 412984 415416 418122 421349 425042 428923 432470 434981
60762 434981 436064 436115 435962 435953 435711 434892 433717 432530 431170 429190 426527 423612 420898 418567 416656 415221
60746 415221 414384 414337 415290 417230 419715 421926 422933 422004 418932 414172 408491 402453 396418 390872 386241
60731 386241 382244 378045 373394 369200 366472 365041 363869 362383 360933 360052 359857 360146 360620 360971 361172 361675
60715C61675J225J711J627J494J734J804J032p8k82P72K160K990L290L424L320
60700C87898K733J912J529J960K850L370K952J893J107J140J516J358N30k41m04
60685D12103k00n2K04R67K006K568K368J989J982K084J764J248J318K098K681
60670D35128K260J041l28j732l334m800n466n264m762m296l647k729j977j729
60656C98365j696j331m25Q35K059K769K690K186K071K699L473L467K329M69j386
60641D18574k636l109l126l102l072k821k475k484k839k829j906m24P73J242J125
60626C90891P59M07K46L09N01P79J154J456J423J134R99J133J070M36m02o80j20
60609D01495P90J322J208Q03N69L83l48j591k237j390J70Q34L49N1P38J537J532
$$ plain form
60715 361675 362900 364611 366238 367732 369466 371270 372302 372224 371942 372714 374874 377864 381154 384578 387898
60700 387898 390631 392543 394072 396032 398882 402252 405204 407097 408204 409344 410860 412218 412748 412507 412103
60685 412103 411903 411851 412055 413022 415028 417596 419964 421953 423935 426019 427783 429031 430349 432447 435128
60670 435128 437388 438429 438101 436369 433035 428235 422769 417505 412743 408447 404800 402071 400094 398365
60656 398365 396669 395338 394913 395748 397807 400576 403266 405452 407523 410222 413695 417162 419491 419960 418574
60641 418574 415938 412829 409703 406601 403529 400708 398233 395749 392910 390081 388175 387751 388524 389766 390891
60626 390891 391650 392057 392303 392612 393113 393892 395046 396502 397925 399059 400058 401191 402261 402697 402295 401615 401495
60609 401495 402285 403607 404815 405618 406187 406570 406222 404631 402394 401004 401174 402008 402357 402408 403146 404683 406215
60592D06215J307J842K754K885K175J670J812J862J200K08l86l68M8N91R54Q78
60576D25647M88L52R71K333L972N295O021O511P499R207J0970J2109J2903J4103
60562E18381J5568J6049J4493J1108O950K936n52l447n800p629q710q652p365
60549E43330n426l664k412j339j18J008J701K368L911O467R037J0878J2648J5386
60535E93775J8784K1496K3079K4298K5311K4775K1541J6213J0221M148k011p498
60523G74132j0985j2042j1576j0754j0171r954r950r712q829p400n866m449l127
60510F59317j969j107m40K59J106K259M094O798J0085J3633J7576K2075K6893
60497G60579L1834L7256M3379M9407N4052N6803N7989N7710N5479N0950M4366
$$ plain form
60592 406215 407522 409364 412118 415003 417178 418848 420660 422522 423722 423930 423544 423176 423224 423815 424769 425647
60576 425647 426135 426487 427458 429791 433763 439058 445079 451590 459089 468296 479266 491375 504278 518381
60562 518381 533949 549998 564491 575599 582549 585485 584933 581486 575686 568057 559347 550695 543330
60549 543330 537904 534240 531828 530489 530371 531379 533080 535448 539359 545826 554863 565741 578389 593775
60535 593775 612559 634055 657134 681432 706743 731518 753059 769272 779493 783641 781630 774132
60523 774132 763147 751105 739529 728775 718604 708650 698700 688988 680159 672759 666893 662444 659317
60510 659317 657348 656241 655801 656060 657166 659425 663519 670317 680402 694035 711611 733686 760579
60497 760579 792413 829669 873048 922455 976507 1033310 1091299 1149009 1204488 1255438 1299804
60486A299804L6210K6965J7197P375k471j2555k2887l3299m3533n2774n9513o2691
60474A097828o2792o1086n8066n3582m8277m3523l9779l6070l1613k6913k2777
60463F13350j9151j5728j2981j1606j1281j0812r490p729o357n742n675n756n730
60450D85312n560n298m948m491l978l513l161k928k710k214j188R2Q46O31j01
60435D46791o04p47q56r77q58n56m73p79j292j814k142j870q11M14R35Q08R60
60418D36129J827K716K840K350J912J722J445Q82K48j27r2L12R09J423J614J454
60402D57564J248J373J738J650P02l34j69J272K622K893K695K992L536L518L115
60387D86415L163L668L843L529L371L578L592L105K464J947J571J567K184L025
$$ plain form
60486 1299804 1336014 1362979 1380176 1387551 1385080 1372525 1349638 1316339 1272806 1220032 1160519 1097828
60474 1097828 1035036 973950 915884 862302 814025 770502 730723 694653 663040 636127 613350
60463 613350 594199 578471 565490 553884 542603 531791 522301 514572 508215 502473 496798 491042 485312
60450 485312 479752 474454 469506 465015 461037 457524 454363 451435 448725 446511 445323 445415 446261 446892 446791
60435 446791 446187 445440 444584 443607 442749 442193 441720 440941 439649 437835 435693 433823 433012 433426 434361 435169 436129
60418 436129 437956 440672 443512 445862 447774 449496 450941 451823 452071 451944 451852 452164 453073 454496 456110 457564
60402 457564 458812 460185 461923 463573 464275 463941 463772 465044 467666 470559 473254 476246 479782 483300 486415
60387 486415 489578 493246 497089 500618 503989 507567 511159 514264 516728 518675 520246 521813 523997 527022
60373E27022L530L981M884N515M580K454J094J274J551P98R5R15K680L638L288
60358E67299K542K063J849K118L298N182P016Q451R676J0755J1517J1869J1549
60345F55184R866O490K295j354l990o045p667q439q249p666p263p064o794o228
60331F03076n330m383l920m113m448m445m416m929n689n787m974l983l406k952
60317E40301k118r69J73J431L261N732Q307J0384J1903J3321J4975J6610J7649
60304F40960J7929J7878J7906J7866J7194J5373J2136P585K286l035q135j3277
60292G42666j8301k2118k3571k2618k0201j7194j3903j0507p434n199m132m187
60280E73301m811n176m897m444m466m843m922m563m375m709m985m458l283k333
$$ plain form
60373 527022 530552 534533 539417 544932 549512 551966 553060 554334 555885 556683 556778 557693 560373 564011 567299
60358 567299 569841 571904 573753 575871 579169 584351 591367 599818 609494 620249 631766 643635 655184
60345 655184 665050 671540 673835 672481 668491 662446 654779 646340 638091 630425 623162 616098 609304 603076
60331 603076 597746 593363 589443 585330 580882 576437 572021 567092 561403 555616 550642 546659 543253 540301
60317 540301 538183 537214 537387 538818 542079 547811 556118 566502 578405 591726 606701 623311 640960
60304 640960 658889 676767 694673 712539 729733 745106 757242 764827 767113 764078 755943 742666
60292 742666 724365 702247 678676 656058 635857 618663 604760 594253 586819 581620 577488 573301
60280 573301 568490 563314 558417 553973 549507 544664 539742 535179 530804 526095 521110 516652 513369 511036
60266E11036j998j763j115m13m07j049j423r68k05P4j40l42m13n57n02L37J770
60249E01922K689K363J364Q08J081J689J987J704R63J31m79q68j155j222r34o51
60233E11392q61j255r13L53J571J958J948K311K918L160L068L222L702M021L943
60218E40538L777L779L907M110M495N082N794O659P699Q645R088Q912Q407P999
60204F28891P954Q175Q130P288N775M363L569L160K772K488K389K014R08n70j608
60189F85698j971k153k605l341m175m912n350n459n486n559n410m898m486m681
60175F25212n169n112m233l070k181j649j331j086p05j17K62j17j100j780j519
60160E96305o37M3J27p9j3N97J500K131K127J648J147Q96Q37Q12P50P68J062J623
$$ plain form
60266 511036 509038 507275 506160 505747 505340 504291 502868 501900 501695 501769 501629 501287 500874 500317 499815 500152 501922
60249 501922 504611 506974 508338 509146 510227 511916 513903 515607 516570 516701 516222 515354 514199 512977 512043 511392
60233 511392 510531 509276 508363 508716 510287 512245 514193 516504 519422 522582 525650 528872 532574 536595 540538
60218 540538 544315 548094 552001 556111 560606 565688 571482 578141 585840 594485 603573 612485 620892 628891
60204 628891 636845 645020 653150 660438 666213 670576 674145 677305 680077 682565 684954 686968 687876 687306 685698
60189 685698 683727 681574 678969 675628 671453 666541 661191 655732 650246 644687 639277 634379 629893 625212
60175 625212 620043 614931 610698 607628 605447 603798 602467 601381 600676 600559 600821 600704 599604 597824 596305
60160 596305 595668 595711 595838 595759 595746 596343 597843 599974 602101 603749 604896 605792 606629 607441 608191 608959 610021 611644
60142F11644K035J904J492J589K534L801M793N570O430P228P639P697P530O860
60128F78746N422L671K435J939J727J500J415J603J920K231K455K344J786J263
60114G10457J420K039K101J103k35r40r64j025j589k491l357l980m255m151l894
60099F90239l968m651n589n955n224l686k091q69J43J246K420L359L728L328K288
60084F74718J110L02j11m27o89o69m83o72j488k566l538m471n429o124o371o490
60068F36602o837p305p660p878p811p068n815n058n445o221o149n165m250l894
60054E50046l575k765j662o68J99J161K286L364M043M148M048M452N479O346O385
60039E83287N963N796N752N143L921K701J672M25j064k181k655l010l723m590
$$ plain form
60142 611644 613679 615583 617075 618664 621198 624999 629792 635362 641792 649020 656659 664356 671886 678746
60128 678746 684168 687839 690274 692213 693940 695440 696855 698458 700378 702609 705064 707408 709194 710457
60114 710457 711877 713916 716017 717120 716885 715945 714981 713956 712367 709876 706519 702539 698284 694133 690239
60099 690239 686271 681620 676031 670076 664852 661166 659075 658206 658349 659595 662015 665374 669102 672430 674718
60084 674718 675828 676130 676019 675592 674903 674234 673751 673079 671591 669025 665487 661016 655587 649463 643092 636602
60068 636602 629765 622460 614800 606922 599111 592043 586228 581170 575725 569504 563355 558190 553940 550046
60054 550046 546471 543706 542044 541376 541575 542736 545022 548386 552429 556577 560625 565077 570556 576902 583287
60039 583287 589250 595046 600798 605941 609862 612563 614235 614660 613596 611415 608760 605750 602027 597437
60025E97437n249n746o207o458o444o541p070p752q127q235q488q894q903q096
60011D95227o761n577m821m113l078k030j610j868k046j521n36K16M79N66Q45
59996D63372J370J918K227K251K251K392K372J924J560K151L576M613M485L733
59982E00195L127K527J472J40j076k294l599m318l831k688k021k092k277k122
59968D81143j638q80m5L53K01K60J102K070K305K231K797L689L716K729J712J035
59952E02780J62q34j014k18M47L32J93P44J375J073j98j715k884l434l343l017
59936D90449k988l207l146k734k343j824n63J312K787L423L893M704N470N938
59922E01171O575P486P742O632M684K699O54j536k998k755j145O01J821K672L290
$$ plain form
60025 597437 592188 586442 580235 573777 567333 560792 553722 545970 537843 529608 521120 512226 503323 495227
60011 495227 488466 482889 478068 473955 470877 468847 467237 465369 463323 461802 461266 461482 461961 462527 463372
59996 463372 464742 466660 468887 471138 473389 475781 478153 480077 481637 483788 487364 491977 496462 500195
59982 500195 503322 505849 507321 507461 506385 504091 500492 496174 492343 489655 487634 485542 483265 481143
59968 481143 479505 478625 478580 478933 479134 479394 480496 482566 484871 487102 489899 493588 497304 500033 501745 502780
59952 502780 502942 502108 501094 500876 501323 501655 501848 502592 503967 505040 504842 503127 500243 496809 493466 490449
59936 490449 487461 484254 481108 478374 476031 474207 473644 474956 477743 481166 485059 489763 495233 501171
59922 501171 507746 515232 522974 529606 534290 536989 537643 536107 533109 530354 529209 529810 531631 534303 537593
59907E37593L564L622L806M122M266M065L554K807K003J385R85O13L16L55O95
59892E73751J047J586K810M534N813O285O648P346P694P087O155N849O047O049
59878F48701N881O016O272N990N135M190L155J544o08k628m136n362o400o840
59864F60910o357n213l996l160k826k751k473j816j148q75q05l78O38J973L313
59849F35036M575N842P253Q890J0443J1025R685O276J841j916l738l640k617j383
59835F87572K62K455M082L522O13k965n489o578o694o168n304m589m192l833l556
59820F49138l999n262o298o198n497n399o064o524o065m990m113m024m679n289
59806E74737m882l429k013j491j456j083n15n07j111j542j363r64q21q58p39m01
$$ plain form
59907 537593 541157 544779 548585 552707 556973 561038 564592 567399 569402 570787 571772 572385 572701 573056 573751
59892 573751 574798 576384 579194 583728 589541 595826 602474 609820 617514 624601 630756 636605 642652 648701
59878 648701 654582 660598 666870 672860 677995 682185 685340 686884 686276 683648 679512 674150 667750 660910
59864 660910 654553 649340 645344 642184 639358 636607 634134 632318 631170 630295 629490 629112 629750 631723 635036
59849 635036 639611 645453 652706 661596 672039 683064 692749 699025 700866 698950 695212 691572 688955 687572
59835 687572 687834 690289 694371 697893 698506 695541 690052 683474 676780 670612 665308 660719 656527 652694 649138
59820 649138 645139 639877 633579 627381 621884 616485 610421 603897 597832 592842 588729 584705 580026 574737
59806 574737 569855 566426 564413 562922 561466 560383 559868 559361 558250 556708 555345 554381 553560 552702 551963 551562
59790E51562j05k03p53j361j488j092o54m42j72L81R55J220J260J204R22M16N4
59773E51704L7P8M3K95R67J481J403J180J464K137K715L163L608L819L609L404
59757E81107L622L954M003M177N028O151O692O656O762P177P444P541P989Q814
59743F67117R324R056Q189O994N556M163L212K622J920J069N29M16K29l70j064
59728G18962j391j279r59o79o81j026j433j590j641j971k575k983k881k438k003
59713F93432j813j964k395k811k907k593k004j377j031j053r52q4J314K129J757
59698F77648Q79M38M78N99Q92J522J972J608O83j41r25k106l325l658l044k417
59682F71103k347k458k415k523l044l687m160m706n617o641p151o800n828m851
$$ plain form
59790 551562 551457 551254 550501 549140 547652 546560 545906 545464 545292 545673 546628 547848 549108 550312 551234 551650 551704
59773 551704 551741 551819 551862 552157 553124 554605 556008 557188 558652 560789 563504 566667 570275 574094 577703 581107
59757 581107 584729 588683 592686 596863 601891 608042 614734 621390 628152 635329 642773 650314 658303 667117
59743 667117 676441 685497 693686 700680 706236 710399 713611 716233 718153 719222 719751 720167 720396 720026 718962
59728 718962 717571 716292 715333 714654 713973 712947 711514 709924 708283 706312 703737 700754 697873 695435 693432
59713 693432 691619 689655 687260 684449 681542 678949 676945 675568 674537 673484 672532 672448 673762 675891 677648
59698 677648 678527 678965 679443 680042 680934 682456 684428 686036 686719 686578 685653 683547 680222 676564 673520 671103
59682 671103 668756 666298 663883 661360 658316 654629 650469 645763 640146 633505 626354 619554 613726 608875
59668F08875m289l947l348k564k266k707l195k977k130j094M7J207J865J786J638
59653E86901K057K662K877L093L896M632M040K090m6j637k777l404l387l448m472
59638E93077n802n716l927k127j585j710j536j249j346j452j061n73o89j400k317
59623E60587l345m297m503l577k187j420j686k722m054n029m962l842k471j463
59609E15029o02M52J495K305L145M086M431L681K565K287K959L581L376K518J626
59594E52934J147J218J640J989K095K288K789L033K111n5k384l628l497k773k389
59579E56518k504k574k231j876k077k688l003k667j938j076j40N83O05l7o59p91
59563E33445o58n91n41m55n26o77m06L94R82P31P2j37J83M50M91P44J450K281
$$ plain form
59668 608875 604586 600639 597291 594727 592461 589754 586559 583582 581452 580358 580405 581612 583477 585263 586901
59653 586901 588958 591620 594497 597590 601486 606118 610158 612248 612202 610565 607788 604384 600997 597549 593077
59638 593077 587275 581559 577632 575505 573920 572210 570674 569425 568079 566627 565566 564993 564304 562904 560587
59623 560587 557242 552945 548442 544865 542678 541258 539572 536850 532796 527767 522805 518963 516492 515029
59609 515029 514427 514879 516374 518679 521824 525910 530341 534022 536587 538874 541833 545414 548790 551308 552934
59594 552934 554081 555299 556939 558928 561023 563311 566100 569133 571244 571189 568805 565177 561680 558907 556518
59579 556518 554014 551440 549209 547333 545256 542568 539565 536898 534960 533884 533744 534327 534932 534895 534236 533445
59563 533445 532787 532196 531655 531200 530674 529997 529591 529985 530967 531698 531770 531633 531816 532266 532757 533501 534951 537232
59545E37232K868L237L621M308N667P922J0839J4080J7916K2760K7433K8617K3256
59532G09756J1902r25j0164j3778j3049j0261o970l914j394O73K425L547L665
59519F71513L138K722K307R60j459l807n289o530q167r508r698r369r657j0161
59505F06995r408p199n002l951l744l716l814m107m326m270l963l239j997q99
59491E47360q96j824k410j901q63p4M24Q87J278J578J945K293K410K657L731N480
59475E62075O770O962O631O469O268N537M378L202K137J211O52O07R57J640K613
59460F18109L474L746L646L826M368M899N720P534R829J0854R905Q343P537P009
59446G08799N647L692K163R99q69l820p054r585j0884j0760r449p732o235m804
$$ plain form
59545 537232 540100 543337 546958 551266 556933 564855 575694 589774 607690 630450 657883 686500 709756
59532 709756 721658 720733 710569 696791 683742 673481 666511 662597 661203 661876 664301 667848 671513
59519 671513 674651 677373 679680 680640 679181 675374 670085 663555 655388 645880 636182 626813 617156 606995
59505 606995 597587 590388 585386 581435 577691 573975 570161 566054 561728 557458 553495 550256 548259 547360
59491 547360 546464 544640 542230 540329 539466 539392 539816 540703 541981 543559 545504 547797 550207 552864 556595 562075
59475 562075 568845 575807 582438 588907 595175 600712 605090 608292 610429 611640 612292 612899 613856 615496 618109
59460 618109 621583 625329 628975 632801 637169 642068 647788 655322 665151 676005 685910 694253 701790 708799
59446 708799 714446 718138 720301 721300 720431 716611 709557 699972 689088 678328 668879 661147 654912 650108
59432F50108l150j768j327j477j131N8J481K773M347O489Q680J0394J1986J4225
59418G01688J7207K0249K2714K4547K6017K7550K9901L3519L6820L5600K5970
59407A001782Q710j0056k3383k8407k6729k1442j4916q255j120P405J6062K0029
59395I19680J4612Q25j4583k5208k9621k9766k7248k2820j7780j3683j0950r014
59383G34444p506o401n530m776m340m154l629k521j470j056j096j307j737j903
59369F87018p16J779L700L583K449K305L353M199M262M369N093O049O973Q214
59355G42630R825J1201J2010J2750J3975J5509J6764J7453J7824J8276J8875J9214
59343I26306J8923J8164J7212J5670J2851Q972N089J607k095o220r891j2601j5159
$$ plain form
59432 650108 646958 645190 643863 642386 641255 641313 642794 645567 649914 656403 665083 675477 687463 701688
59418 701688 718895 739144 761858 786405 812422 839972 869873 903392 940212 975812 1001782
59407 1001782 1010492 1000436 977053 948646 921917 900475 885559 877304 876184 883589 899651 919680
59395 919680 934292 935117 920534 895326 865705 835939 808691 785871 768091 754408 743458 734444
59383 734444 726938 720537 715007 710231 705891 701737 698108 695587 694117 693061 691965 690658 688921 687018
59369 687018 686302 688081 691781 695364 697813 700118 703471 707670 711932 716301 721394 727443 734416 742630
59355 742630 752455 763656 775666 788416 802391 817900 834664 852117 869941 888217 907092 926306
59343 926306 945229 963393 980605 996275 1009126 1018098 1023187 1024794 1022699 1016479 1006588 993987 978828
59330I78828j8229k0947k2111k1973k1609k1244k0372j9017j7704j6529j5337
59319G63756j4391j3865j3100j1521r807q996q779p991o538n453n150m810l704
59306F49651j985m7J978L918N665P654J0508J4036J7098J8328J6508J0818J869
59293G55999p668j4667j7934j8388j7158j4647j1382q422o413m990l499j762P4
59280F29143J819L265M468N908P832R589J0445J0922J2336J4910J7234J8017J7559
59267G63447J7107J7184J7095J5840J3259J0225P598N132J858k323o156q570r904
59254H41792j0924j1417j0803r523q557p876o662m903l535k884k229j083J91J371
59240G62958K917M996O817P524P217O600O066N517M764L724K367O38j609m438
$$ plain form
59330 978828 960599 939652 917541 895568 873959 852715 832343 813326 795622 779093 763756
59319 763756 749365 735500 722400 710879 701072 692076 683297 675306 668768 663315 658165 653355 649651
59306 649651 647666 647619 649597 653515 659180 666834 677342 691378 708476 726804 743312 754130 755999
59293 755999 748331 733664 715730 697342 680184 665537 654155 645733 639320 634330 630831 629069 629143
59280 629143 630962 634227 638695 644603 652435 662024 672469 683391 695727 710637 727871 745888 763447
59267 763447 780554 797738 814833 830673 843932 854157 861755 866887 868745 866422 860266 851696 841792
59254 841792 830868 819451 808648 799125 790568 782692 776030 771127 767592 764708 762479 761396 761587 762958
59240 762958 765875 770871 777688 785212 792429 799029 805095 810612 815376 819100 821467 822105 820496 816058
59226H16058p491j0064j1815j3036j3919j4100j3416j2573j2278j2132j1211r494
59214F74529p906p120o961o859o265m875l099j935j746j668r04j0J31r9K72J013
59198F26498J059M67M29J302K119K297K492L239L978M018L502K865K192J570J337
59183F59364J520J657J536J482J625J559J108P93J145J990K742K983K655K092
59169F84251J997K840M229N290N688N801N900N780N163L945K049m16k866m651
59155G25000n765o706p722q714r617j0324j0468r892r111q704q513q118p647p358
59141F06341o855n671m315l759m085m537m687m586m096l065j925j182n68L31J090
59126E58431J211J340K382L813M450M565N554P579R349J0319J1330J2742J3723
$$ plain form
59226 816058 808567 798503 786688 773652 759733 745633 732217 719644 707366 695234 684023 674529
59214 674529 666623 659503 652542 645683 639418 634543 631444 629509 627763 626095 625191 625181 625312 625213 625485 626498
59198 626498 627557 628024 628453 629755 631874 634171 636663 639902 643880 647898 651400 654265 656457 658027 659364
59183 659364 660884 662541 664077 665559 667184 668743 669851 670644 671789 673779 676521 679504 682159 684251
59169 684251 686248 689088 693317 698607 704295 710096 715996 721776 726939 730884 732933 732517 729651 725000
59155 725000 719235 712529 704807 696093 686476 676152 665684 655792 646681 637977 629464 621346 613699 606341
59141 606341 599486 593815 589500 585741 581656 577119 572432 567846 563750 560685 558760 557578 557010 557341 558431
59126 558431 559642 560982 563364 567177 571627 576192 581746 589325 598674 608993 620323 633065 646788
59113F46788J3901J4056J4533J4512J3581J2570J1996J1040Q985O548M812L786
59101G77108K890J988J129m1j811l876n688o834o865n603l912l152l454l491k343
59086G36045o33N22O98j17j850l847n066n359n735o799p831p990p423o642n727
59071F72246m781m345m646n154n377n459n546n404m963m501l921k853j684j403
59057F12209k055k506k197j886k063k012j221n09o67j107r16l42j79m19n99q09
59041E92722j308j659j275n23k84o96j055q72m10k09l55k27J047L518O019P385
59025F01818P891Q698J0178J1804J3473J5478J7208J7347J5730J3518J1189P912
59013G52244L513o22l380n243o820p559o968n853n107m287k570j75K200M467O598
$$ plain form
59113 646788 660689 674745 689278 703790 717371 729941 741937 752977 761962 768510 773322 777108
59101 777108 779998 781986 783115 783074 781263 777387 771699 764865 758000 752397 748485 745333 741879 738388 736045
59086 736045 735412 735934 736632 736515 734665 730818 725752 720393 714658 707859 700028 692038 684615 677973 672246
59071 672246 667465 663120 658474 653320 647943 642484 636938 631534 626571 622070 618149 615296 613612 612209
59057 612209 610154 607648 605451 603565 601502 599490 598269 597760 597093 595986 595070 594728 594549 594130 593531 592722
59041 592722 591414 589755 588480 587957 587673 586977 585922 585050 584640 584431 584076 583849 584896 588414 594433 601818
59025 601818 609709 618407 628585 640389 653862 669340 686548 703895 719625 733143 744332 752244
59013 752244 755757 755135 751755 746512 739692 732133 725165 719312 714205 709918 707348 707173 709373 713840 720438
58998G20438P930Q003P405O840O133M968L773L028K534K120K108K270J479o41
58984G78388k766l583l480l439l370k664j475j99J429L597N624P044Q562J0775
58970G94443J2896J3928J4194J4367J4036J2689J1277J1134J1982J2496J2294
58959I35736J1808J0785Q575N543K622k69l933q246j2223j5536j8533k0873k1635
58946H73821k0897j9864j9188j8254j6344j3559j0503p813o084n456n189m327
58934G26343k799j375p50j060j962k623k097m45R32P79n80j875k460k601k703
58919G04724k990l502l825l310k109j310j497j909j716j117m70P42K933N328O951
58904F96923Q000R236J0709J2101J3540J4975J5641J5309J5117J5848J6356J5296
$$ plain form
58998 720438 728368 736371 743776 750616 756749 761717 765490 768518 771052 773172 775280 777550 779029 778388
58984 778388 775622 772039 768559 765120 761750 759086 757611 757412 758841 762438 768062 775106 783668 794443
58970 794443 807339 821267 835461 849828 863864 876553 887830 898964 910946 923442 935736
58959 935736 947544 958329 966904 972447 975069 974800 970867 962621 950398 934862 916329 895456 873821
58946 873821 852924 833060 813872 795618 779274 765715 755212 747399 741315 735859 730670 726343
58934 726343 723544 722169 721419 720359 718397 715774 713677 713232 714164 714943 714363 712488 710028 707427 704724
58919 704724 701734 698232 694407 691097 688988 687678 686181 684272 682556 681439 680969 681711 684644 689972 696923
58904 696923 704923 714159 724868 736969 750509 765484 781125 796434 811551 827399 843755 859051
58892H59051J3651J3706J5972J8808K0913K2535K4182K5664K6542K6364K4482
58881A091870K0599J5576J0707O425K416j397n001q954j3646j8159k1000k1849
58869A057587k1625k1034j9954j8043j5176j1591q253o480o485p005p086p354
58857I07501q554r936j0397j0296j0682j1520j2035j2133j2011j1176r350p602
58845G81809p042p127o884o990q626j1004j2135j1713j1108j0766r719p665n575
58832F65455m027k782k050k435l396l521k539j502q61k2J064J619J648K193L540
58817F52384M692N034N120N341N190M400L550L092K676J875P16o09j801k320k095
58802F87245k066k999m189m479m079l968m100l884l924n287p232p733o389m783
$$ plain form
58892 859051 872702 886408 902380 921188 942101 964636 988818 1014482 1041024 1067388 1091870
58881 1091870 1112469 1128045 1138752 1145177 1147593 1146196 1141195 1132241 1118595 1100436 1079436 1057587
58869 1057587 1035962 1014928 994974 976931 961755 950164 941911 935431 928946 921941 914855 907501
58857 907501 898947 889011 878614 868318 857636 846116 834081 821948 809937 798761 789411 781809
58845 781809 774767 767640 760756 753766 745140 734136 722001 710288 699180 688414 678695 671030 665455
58832 665455 661428 658646 656596 654161 650765 647244 644705 643203 642342 642320 643384 645003 646651 648844 652384
58817 652384 657076 662110 667230 672571 677761 682161 685711 688803 691479 693354 694070 693461 691660 689340 687245
58802 687245 685179 682180 677991 673512 669433 665465 661365 657481 653557 648270 641038 633305 626916 622133
58788F22133l815k734j208j91N9P97K673M406M643L823L192L119L301L693M271
58773F48162M511L843K127m77l482n890o911o963p081p427p350o775o260n733
58759E94294m542k913j920j700j065O80K738M027M362M066L392K747K575K714
58745F09455K591K247K358L248M622O169P617Q456Q447Q165Q194Q219P858P749
58731F95395Q590R728J0068R789R667R344P965N955M436L372K097J252K001L715
58717G83374M658M834N885Q109R800R881R132Q339P162N252K805k76m160p894
58703H46901j0206j1515j3386j5992j8111j9490k1006k2430k2371k0724j8910
58692F52760j7420j5406j2995j1506j0890r497p079n542n802o306n737m919m815
$$ plain form
58788 622133 618318 615584 614376 614185 614244 615041 617714 622120 626763 630586 633778 636897 640198 643891 648162
58773 648162 652673 656516 658643 658166 654684 648794 641883 634920 627839 620412 613062 606287 600027 594294
58759 594294 589752 586839 584919 583219 582154 582834 585572 589599 593961 598027 601419 604166 606741 609455
58745 609455 612046 614293 616651 619899 624521 630690 638307 646763 655210 663375 671569 679788 687646 695395
58731 695395 703985 713713 723781 733570 743237 752581 760546 766501 770937 774309 776406 777658 779659 783374
58717 783374 788032 792866 798751 806860 816660 826541 835673 844012 851174 856426 859231 858955 854795 846901
58703 846901 836695 825180 811794 795802 777691 758201 737195 714765 692394 671670 652760
58692 652760 635340 619934 606939 595433 584543 575046 567967 562425 556623 550317 544580 539661 534846
58679E34846m733l824k621j929j610j396j315p79J083L610M981N017N611P828
58665E44769J0656J3183J5813J8447J9681J8702J6078J1987N921j090o375q854
58653F58918j0102j1278j1437j0058q671q446q341p216n718m609l297j573p62
58640E67410j546k482k137r41L03J784L256L362J857M38r8j320m178o823p349
58625E51536o663o619p104p030o548o155n068k358J411N245Q924J1961J3106J2404
58611E57042J1850J2342J1984R252N759L743K729J080p97j385r44r91j763k351
58597F07550k587k916l117k784k337k119j491m1J433K396L671N858Q126R843J1744
58582F33229J4097J5549J5301J4606J4437J3597J1011P992O145M824K887J397
$$ plain form
58679 534846 530113 526289 523668 521739 520129 518733 517418 516639 517722 521332 526313 531330 536941 544769
58665 544769 555425 568608 584421 602868 622549 641251 657329 669316 675237 674147 667772 658918
58653 658918 648816 637538 626101 616043 607372 598926 590585 583369 577651 573042 569745 568172 567410
58640 567410 565864 563382 561245 560304 560607 562391 565647 569009 570866 571304 571206 569886 565708 558885 551536
58625 551536 544873 538254 531150 524120 517572 511417 506349 503991 505402 510647 519571 531532 544638 557042
58611 557042 568892 581234 593218 602470 608229 611972 614701 615781 614984 613599 612655 611664 609901 607550
58597 607550 604963 602047 598930 596146 593809 591690 590199 590158 591591 593987 597658 603516 611642 621485 633229
58582 633229 647326 662875 678176 692782 707219 720816 731827 739819 745964 750788 753675 755072
58570G55072K162M880P852J0529J3404J6555K0048K4499K9536L3122L4115L3961
58558I85735L4064L3240K9744K4075J7665J0520K540m380q201r505j0243j0789
58546A094465j0420r427q617p824o947p298r939j3828j7415k0691k3905k5918
58534I32236k5870k4879k3993k2173j8420j4172j1251r119o586m421l770l649
58522G63933k666j660j982k724k376j724k272l268l189k756l497m607m269l013
58508G23930k763l495l662l028k381j485Q4J052J52j411j737j325j728k519k302
58493F97382j489j214q05Q03K490K751K668M042N973O514O399P711J0089J1758
58479G55072J3145J5855J8995K0136J9239J8124J6769J3593Q772L902r91o724
$$ plain form
58570 755072 757234 762114 769966 780495 793899 810454 830502 855001 884537 917659 951774 985735
58558 985735 1019799 1053039 1082783 1106858 1124523 1135043 1137583 1133203 1125002 1115497 1105254 1094465
58546 1094465 1084045 1074618 1066001 1058177 1051230 1043932 1033993 1020165 1002750 982059 958154 932236
58534 932236 906366 881487 857494 835321 816901 802729 791478 782359 775773 771352 767582 763933
58522 763933 761267 759607 757625 754901 752525 750801 748529 745261 742072 739316 735819 731212 726943 723930
58508 723930 721167 717672 714010 710982 708601 707116 707200 708252 708404 706993 705256 703931 702203 699684 697382
58493 697382 695893 694679 693874 694677 697167 699918 702586 706628 712601 719115 725514 733225 743314 755072
58479 755072 768217 784072 803067 823203 842442 860566 877335 890928 899700 903602 902611 895887
58467H95887j1948j4373j4445j4418j4371j2523q966n595k803M77L894O181P937
58454H14934J0668J3649J5014J5173J5705J5609J2457O685J122l291p608j1320
58442H98797j2615j1933j1534j1641j0645q707p472o528l967l13J893K295K771
58429H20401L577L292K563L844P174R943J1033J1605J1700R850O371L463J584
58416I06400r33m403p109q292q829q999q487q221r233j0299r785q762r034r392
58402G94622p585m691l340k896r28J758K400J642K551M887N539M250L700M189
58388H06098L466J784J783L329L667K886L903O805Q536Q488R107J0532J0178Q083
58374H88645P201P767O886M379L461M763N336M523N194P926R661R499J0305J3067
$$ plain form
58467 895887 883939 869566 855121 840703 826332 813809 804843 799248 796445 796922 800816 806997 814934
58454 814934 825602 839251 854265 869438 885143 900752 913209 919894 921016 917725 910117 898797
58442 898797 886182 874249 862715 851074 840429 831722 824250 817722 813755 813442 815335 817630 820401
58429 820401 823978 827270 829833 833677 840851 850794 861827 873432 885132 894982 901353 904816 906400
58416 906400 905467 901064 893955 885663 876834 867835 859348 851127 841894 831595 821810 813048 804014 794622
58402 794622 787037 782346 779006 776110 775182 776940 779340 780982 783533 788420 793959 798209 801909 806098
58388 806098 809564 811348 813131 816460 820127 823013 826916 833721 842257 850745 859852 870384 880562 888645
58374 888645 895846 903613 910499 914878 918339 923102 928438 932961 938155 946081 955742 965241 975546 988613
58360I88613J5044J4931J4734J5051J3800J0924R085Q449O105J968k84M55R77
58347A099852j65m23J358K824L010M065O489P979Q329J0128J3346J4888J4667
58334A186347J6222J9966K1971K0888J9912K0324J9358J6209J3789J2736J0049
58323A377771N409K453K058R55j302j014K201L850K647K890O371R253R528J0324
58309A433394J2978J4249J3258J3859J7150J9012J7949J7891K0243K0941J8561
58298A619485J7448J9370K0130J7968J7228J9867K1522K0036J9643K2603K4827
58287A840127K4083K4334K7554K9487K8036K7534L0245L2002L0749L0775L3967
58276B158893L5742L4301L4787L9472M3104M2959M3903M8425N1597N1276N3015
$$ plain form
58360 988613 1003657 1018588 1033322 1048373 1062173 1073097 1082182 1090631 1096736 1098704 1098420 1098875 1099852
58347 1099852 1099687 1099264 1100622 1103446 1106456 1110521 1117010 1124989 1133318 1143446 1156792 1171680 1186347
58334 1186347 1202569 1222535 1244506 1265394 1285306 1305630 1324988 1341197 1354986 1367722 1377771
58323 1377771 1383180 1385633 1387691 1388646 1387344 1386330 1388531 1392381 1395028 1397918 1404289 1413542 1423070 1433394
58309 1433394 1446372 1460621 1473879 1487738 1504888 1523900 1541849 1559740 1579983 1600924 1619485
58298 1619485 1636933 1656303 1676433 1694401 1711629 1731496 1753018 1773054 1792697 1815300 1840127
58287 1840127 1864210 1888544 1916098 1945585 1973621 2001155 2031400 2063402 2094151 2124926 2158893
58276 2158893 2194635 2228936 2263723 2303195 2346299 2389258 2433161 2481586 2533183 2584459 2637474
58265B637474N9212O3831O3804O4990P0546P4496P3443P3373P7705Q0110P6677
58254C415661P3710P5623P6793P3557P2307P7176Q1743Q1777Q3924R2695J01424
58243D306390J05444J11271J23009J33102J36837J42211J54704J66443J71699
58234E551110J78508J93018K07365K15509K25735K44369K62933K75054K89818
58225G643419L14171L39002L57663L80535M15552M52600M83814N20071N70010
58216A1476837O22942O70966P26745P99956Q78893R56249J048838J169590J306054
58207A9657070J450697J624399J843849K096119K374742K709276L129711L639452
58199C8525315M259062N057087O098768P407206R015490J1007013J3461889J6426429
$$ plain form
58265 2637474 2696686 2760517 2824321 2889311 2959857 3034353 3107796 3181169 3258874 3338984 3415661
58254 3415661 3489371 3564994 3641787 3715344 3787651 3864827 3946570 4028347 4112271 4204966 4306390
58243 4306390 4411834 4523105 4646114 4779216 4916053 5058264 5212968 5379411 5551110
58234 5551110 5729618 5922636 6130001 6345510 6571245 6815614 7078547 7353601 7643419
58225 7643419 7957590 8296592 8654255 9034790 9450342 9902942 10386756 10906827 11476837
58216 11476837 12099779 12770745 13497490 14297446 15176339 16132588 17181426 18351016 19657070
58207 19657070 21107767 22732166 24576015 26672134 29046876 31756152 34885863 38525315
58199 38525315 42784377 47841464 53940232 61347438 70362928 81369941 94831830 111258259
58191A11258259J9981806K4262461K9360405L5311471M2116343M9276982N4820277
58184C66388004N5076349M6487487K8536213M990455j8072511l5735898m6184811
58177D01485288n0141806m9306667m5405712l9952985l4119586k8597093k3677928
58170A30283511j9470955j5995709j3171216j0869092r001596p514002o326743
58163D7934198n351284m543525l888702l352634k893798k503654k190274j936894
58155B1273433j714279j518434j360086j230451j110201r99561r09036q31793
58147A1599592p53235o77001o15312n63911n10782m59411m20195l88711l54686
58138F856348l23153l05183k96154k83384k67100k54786k43139k24557k04038
$$ plain form
58191 111258259 131240065 155502526 184862931 220174402 262290745 311567727 366388004
58184 366388004 421464353 467951840 496488053 501478508 483405997 447670099 401485288
58177 401485288 351343482 302036815 256631103 216678118 182558532 153961439 130283511
58170 130283511 110812556 94816847 81645631 70776539 61774943 54260941 47934198
58163 47934198 42582914 38039389 34150687 30798053 27904255 25400601 23210327 21273433
58155 21273433 19559154 18040720 16680634 15450183 14339982 13340421 12431385 11599592
58147 11599592 10846357 10169356 9554044 8990133 8479351 8019940 7599745 7211034 6856348
58138 6856348 6533195 6228012 5931858 5648474 5381374 5126588 4883449 4658892 4454854
58129D454854j91331j83206j70454j55486j46427j40682j30715j19632j15061
58120C101860j13673j07190r7966r3706r2245q6228p7611p3264p1245o5210n7661
58109B165861n5374n6253n3826n0103n1023n3665n0946m4952m2907m3820m1567
58098A621425l7531l7587l9894l7967l3072l1666l3028l1060k6076k3604k3484
58087A266456k0979j6756j5378j5809j3548j0268j1275j5315j6732j5936j7857
58076A096603k1711k2199j9639j9263k1498k1995k0358j9963k0065j6942j1934
58065H81036r948j0754j0011p889q286j0411r660o378n516p878r470r363j0550
58052G64922j3049j3475j1590j0547j0722r711p863p581p952o347m215m809o567
$$ plain form
58129 4454854 4263523 4080317 3909863 3754377 3607950 3467268 3336553 3216921 3101860
58120 3101860 2988187 2880997 2783031 2689325 2597080 2510852 2433241 2359977 2288732 2223522 2165861
58109 2165861 2110487 2054234 2000408 1950305 1899282 1845617 1794671 1749719 1706812 1662992 1621425
58098 1621425 1583894 1546307 1506413 1468446 1435374 1403708 1370680 1339620 1313544 1289940 1266456
58087 1266456 1245477 1228721 1213343 1197534 1183986 1173718 1162443 1147128 1130396 1114460 1096603
58076 1096603 1074892 1052693 1033054 1013791 992293 970298 949940 929977 909912 892970 881036
58065 881036 871088 860334 850323 842434 834148 823737 814077 807699 802183 794305 784835 775472 764922
58052 764922 751873 738398 726808 716261 705539 695828 687965 680384 672432 666085 661870 657061 650494
58039F50494n563l143l909p186p959n610m336n256n351m250m947p525q807q495
58025E68157r344j1148j0906q938q533r495q325m960l109l636l714k714k905m103
58011D76327l547j446q12j652j056Q64J049m53m43J180J151q88j724o25j76p12
57995D67037K09K247K186M1n84R75J395l16j251l98k87j664k106j169j537l757
57979D61021n101m827n321o802o328l527j905k834l404j939o58r92j199m55o43
57964D15086k203k745j540r67j762j380J146L165L033K442K365J074j833l764
57950D12117l550l444m658m965k886m56M20P56J615J948J357J623L572N555O702
57935D15706Q403J1059J2799J2906J3051J3556J2168Q218M316K021m87m508q153
$$ plain form
58039 650494 644931 641788 637879 630693 622734 617124 612788 607532 602181 597931 592984 585459 576652 568157
58025 568157 558813 547665 536759 527821 519288 509793 501468 496508 493399 489763 486049 483335 480430 476327
58011 476327 472780 471334 470522 468870 467814 468678 469727 469274 468831 470011 471162 470274 468550 467925 467749 467037
57995 467037 467246 469493 471679 471720 471136 472111 473506 473190 471939 471541 471254 469590 467484 466315 464778 461021
57979 461021 455920 451093 445772 438970 432642 429115 427210 424376 420972 419033 418375 417383 416184 415729 415086
57964 415086 412883 410138 408598 407631 405869 404489 405635 408800 411833 414275 416640 417714 415881 412117
57950 412117 408567 405123 400465 395500 392614 392158 392578 393334 394949 396897 398254 399877 403449 409004 415706
57935 415706 424109 435168 447967 460873 473924 487480 499648 507866 512182 514203 513716 509208 501055
57922E01055r792j0803j2575j3844j3245j1770j0710r680q386p661p308n642k667
57909C76972p14n66j8K167M078M112L417L178K501Q88j72J64O28N59J219K855
57893D01268L592K835K683M184N328M628L501L211K639J176N87J791K706J694
57879D41823K25k03q46k986n169n779n829o652p165o107m735m714n276m850l691
57864C78046k638j251P40K017J819J627K701L936M130M307N668P259P717P551
57850D23629P587P107N548M186M040L968K775J388Q94L64j215k679k621j948k323
57835D50700l436l962l870l895l918l645l635m065l932k841k044k308k471j644
57821D05034q90j161j443p42l5m41j173j182j166k213l979n817q026j0421j1473
$$ plain form
57922 501055 491263 480460 467885 454041 440796 429026 418316 408636 400250 392589 385281 379639 376972
57909 376972 376258 375692 375674 377841 381919 386031 389448 392626 395127 396015 395843 396007 396635 397194 398413 401268
57893 401268 404860 407695 410378 414562 419890 424518 428019 431230 433869 435045 435632 437423 440129 441823
57879 441823 442048 441845 440999 438013 432844 427065 421236 414584 407419 401312 396577 391863 386587 381737 378046
57864 378046 375408 374157 374897 376914 378733 380360 383061 386997 391127 395434 401102 408361 416078 423629
57850 423629 431216 438323 443871 448057 452097 456065 458840 460228 461122 461486 460271 457592 454971 453023 450700
57835 450700 447264 443302 439432 435537 431619 427974 424339 420274 416342 413501 411457 409149 406678 405034
57821 405034 404144 402983 401540 400798 400763 400322 399149 397967 396801 394588 390609 384792 376766 366345 354872
57806C54872j0506q987q149p242n681m596m504l725j319O50J45j491j689m21O14
57791B97971J025J494J875J778J882K675L155K627K357L550N249O123O763Q142
57777C46666R414R396Q696Q347P803O414N295N538N995N023L046J315l83k635
57763D19930m476m802m331m139l729k570j865k540l162k264j058j386k559k837
57749C78212k480k651k839k145j638k523l375k261l23Qp99l73J282J999J436J331
57733C62861J998J855O25q1K90M68o7k11O11J630K317K823K794J770P10J121K619
57716C84133L384K937K528K835L225L291L231K709J097j141k912m066m983n125
57702C91143l829k008j109q35J44J682K432K237K027J661L0k710n093o506p515
$$ plain form
57806 354872 344366 335379 327230 319988 314307 309711 305207 301482 300163 300813 300958 299467 297778 297357 297971
57791 297971 298996 300490 302365 304143 306025 308700 311855 314482 316839 320389 325638 331761 338524 346666
57777 346666 356080 365476 374172 382519 390322 396736 402031 407569 413564 418587 421633 422948 422565 419930
57763 419930 415454 410652 406321 402182 398453 395883 394018 391478 388316 386052 384994 383608 381049 378212
57749 378212 375732 373081 370242 368097 366459 363936 360561 358300 357977 357985 357186 356813 358095 360094 361530 362861
57733 362861 364859 366714 367339 367258 367548 368016 367949 367738 368349 369979 372296 375119 377913 379683 380393 381514 384133
57716 384133 387517 390454 392982 395817 399042 402333 405564 408273 409370 408229 405317 401251 396268 391143
57702 391143 387314 385306 384197 383362 383506 385188 387620 389857 391884 393545 393575 390865 385772 379266 371751
57687C71751q178p940p103o526n982m629k764j357j03K045M822P153R421J3027
57673C63637J7961K3074K8698L6509M6668N7523O8478Q0548R2739R9468R3075
57662A008378O9031K9557j6165n5942q1180r1056r0210q3367p3247o2038n1680
57651E02081m2512l3782k5813j9913j6154j3224j0531q627p454o102m547l757
57639C09665l763l333j897k94O46Q97N66k03o95l37K62K75J79P72J285L76j506
57622C02895k696k932l248l642l023j497m46k75j05K41L7n87o81l93q59k144l212
57605B77433l807m329m133k264J76R28q0p54l31k02r89j501j225j236j828j739
57589B54119o71j82j075k062k028j547j261p80j57m11j576k192j654j198j646
$$ plain form
57687 371751 363573 355633 348530 342004 336022 331393 328629 327272 327169 329214 334036 341189 350610 363637
57673 363637 381598 404672 433370 469879 516547 574070 642548 723096 815835 915303 1008378
57662 1008378 1077409 1106966 1090801 1034859 953679 862623 772413 689046 615799 553761 502081
57651 502081 459569 425787 399974 380061 363907 350683 340152 331525 324071 317969 313422 309665
57639 309665 305902 302569 300672 300378 301024 301921 302487 302284 301589 301252 301514 301789 301968 302740 304025 304401 302895
57622 302895 300199 297267 294019 290377 287354 285857 285411 285136 285031 285272 285309 284722 284041 283648 282789 280645 277433
57605 277433 273626 269297 265164 262900 263076 264004 263924 263170 262839 262637 261648 260147 258922 257686 255858 254119
57589 254119 253448 253266 252191 250129 248101 246554 245293 244513 244356 243945 242369 240177 238523 237325 235679
57574B35679k096j789j358j247p98R3L31l90p86j55M83M07L82Q42Q95K88L13J510
57556B32604K413J946J238J544K162K030J694K057K618K541K161K046J812J268
57542B60134J283K248L030K843K651L311L794K927J437N54j58j627l116l233k351
57527B73727k115k957l799l868l377k685k011j649j524r59L19J533K061K431L183
57512B58310L705L268K432K164K327K174J762J666J834J774J479J250J052P92
57498B85989P26Q67O54j03p24p31o30q77r79m11M03Q54J068J261J066L48j90n3
57480B88538K96M65R24J855K306J587N40K89N93O38N82J020J586J429P32N11J184
57463C05075K228L033L319L046K495K165K147K131K251L073M306M670L642K311
$$ plain form
57574 235679 233583 231794 230436 229189 228391 228484 228815 228425 227639 227484 227967 228374 228756 229598 230493 230781 231094 232604
57556 232604 235017 236963 238201 239745 241907 243937 245631 247688 250306 252847 255008 257054 258866 260134
57542 260134 261417 263665 266695 269538 272189 275500 279294 282221 283658 284212 284054 282427 279311 276078 273727
57527 273727 271612 268655 264856 260988 257611 254926 252915 251266 249742 248783 249102 250635 252696 255127 258310
57512 258310 262015 265283 267715 269879 272206 274380 276142 277808 279642 281416 282895 284145 285197 285989
57498 285989 286715 287582 288236 288133 287409 286678 286048 285171 284192 283781 284184 285038 286106 287367 288433 288781 288591 288538
57480 288538 288834 289299 290223 292078 294384 295971 296511 296800 297393 298031 298613 299633 301219 302648 303380 303891 305075
57463 305075 307303 310336 313655 316701 319196 321361 323508 325639 327890 330963 335269 339939 343581 345892
57449C45892J802J843J680J334J146J098J338K363L794M213L189K246K738L928
57435C78604M397M139L904L561K720K079K533L536L872L529L384L532L341K836
57421D25967K623K728K673K513K727L332L975M589N107N021M125L195L101L725
57407D75401M544N558O685P050N996M226K927K333K139K593L923N280N525M717
57393E38897L839L489L707M506N561N989N456M835M935N322N441N793O774P385
57379F11929O677N612N732O674O855O151N915O523O834O215N387M950M631M368
57365F94453M759N873O759O640N823N063M712M739N016N448O172P388Q643Q890
57351G80378P962P275Q062R495R801Q816Q030Q308Q988R276R296R448R738J0002
$$ plain form
57449 345892 347694 349537 351217 352551 353697 354795 356133 358496 362290 366503 369692 371938 374676 378604
57435 378604 383001 387140 391044 394605 397325 399404 401937 405473 409345 412874 416258 419790 423131 425967
57421 425967 428590 431318 433991 436504 439231 442563 446538 451127 456234 461255 465380 468575 471676 475401
57407 475401 479945 485503 492188 499238 505234 509460 512387 514720 516859 519452 523375 528655 534180 538897
57393 538897 542736 546225 549932 554438 559999 565988 571444 576279 581214 586536 591977 597770 604544 611929
57379 611929 618606 624218 629950 636624 643479 649630 655545 662068 668902 675117 680504 685454 690085 694453
57365 694453 699212 705085 711844 718484 724307 729370 734082 738821 743837 749285 755457 762845 771488 780378
57351 780378 788340 795615 803677 813172 822973 831789 839819 848127 857115 866391 875687 885135 894873 904875
57337I04875J0135R951R475R211R512R903R826R694J0298J1400J1894J1364J0508
57324A038046J0104J0301J0901J1576J1861J1662J1625J2330J3352J3804J3624
57313A169186J3532J3939J4596J5142J5301J4845J3987J3526J3940J4670J4933
57302A327597J4829J4933J5314J5660J5928J6096J5843J5271J5339J6565J7960
57291A501335J8224J7500J6891J6741J6571J6283J6254J6468J6657J7008J7811
57280A687743J8678J9122J9454K0197K1024K1387K1685K2651K3974K4665K4534
57269A925114K4124K3578K2698K1867K1712K2063K2314K2475K2854K3108K2826
57258B174733K2583K3249K4459K5089K4906K4608K4515K4437K4549K5097K5572
$$ plain form
57337 904875 915010 924961 934436 943647 953159 963062 972888 982582 992880 1004280 1016174 1027538 1038046
57324 1038046 1048150 1058451 1069352 1080928 1092789 1104451 1116076 1128406 1141758 1155562 1169186
57313 1169186 1182718 1196657 1211253 1226395 1241696 1256541 1270528 1284054 1297994 1312664 1327597
57302 1327597 1342426 1357359 1372673 1388333 1404261 1420357 1436200 1451471 1466810 1483375 1501335
57291 1501335 1519559 1537059 1553950 1570691 1587262 1603545 1619799 1636267 1652924 1669932 1687743
57280 1687743 1706421 1725543 1744997 1765194 1786218 1807605 1829290 1851941 1875915 1900580 1925114
57269 1925114 1949238 1972816 1995514 2017381 2039093 2061156 2083470 2105945 2128799 2151907 2174733
57258 2174733 2197316 2220565 2245024 2270113 2295019 2319627 2344142 2368579 2393128 2418225 2443797
57247B443797K5411K5179K5717K6542K6528K5873K5795K6500K6993K6901K6896
57236B732132K7260K7535K7723K8445K9623L0351L0311L0221L0672L1530L2547
57225C058350L3542L4092L3954L3685L3920L4328L4332L4302L4785L5141L4445
57214C434876L3310L3152L3988L4587L4513L4269L3725L2306L0572K9703K9415
57203C794416K8433K7053K7007K8550K9914L0224L0729L2305L3805L4018L3554
57192D130008L3640L4385L5320L6332L7097L6734L4943L2627L0677K9075K7671
57181D498509K6663K5808K4340K2305K0851K0581K0717K0422J9807J9102J8044
57170D737149J6700J5739J5315J4628J3294J2067J1653J1739J1716J1327J0209
$$ plain form
57247 2443797 2469208 2494387 2520104 2546646 2573174 2599047 2624842 2651342 2678335 2705236 2732132
57236 2732132 2759392 2786927 2814650 2843095 2872718 2903069 2933380 2963601 2994273 3025803 3058350
57225 3058350 3091892 3125984 3159938 3193623 3227543 3261871 3296203 3330505 3365290 3400431 3434876
57214 3434876 3468186 3501338 3535326 3569913 3604426 3638695 3672420 3704726 3735298 3765001 3794416
57203 3794416 3822849 3849902 3876909 3905459 3935373 3965597 3996326 4028631 4062436 4096454 4130008
57192 4130008 4163648 4198033 4233353 4269685 4306782 4343516 4378459 4411086 4441763 4470838 4498509
57181 4498509 4525172 4550980 4575320 4597625 4618476 4639057 4659774 4680196 4700003 4719105 4737149
57170 4737149 4753849 4769588 4784903 4799531 4812825 4824892 4836545 4848284 4860000 4871327 4881536
57159D881536P907M882K452J192K94j077k768m369n852p146q117r226j1088j3100
57145D835520j3786j2861j1580j0651r208o454k990K31L110N890Q443J0649J2476
57132D808789J3324J2343R751O695L464q17o384j2081j6788k0227k1931k0981
57120D755157j7456j2776p975k938K147O104Q317R663J1161J3030J5800K1024
57108D801258K9976M2621N8440P7273R9025J23844J53128J89179K33727K88212
57098F096683L55699M40744N46931O75939Q28773J005253J201175J407486J612635
57089A4171318J804168J968630K093041K167332K183252K131961K007927J816896
57081C0344525J575028J296552R85279O41083K70902j11107m91305q58956j201966
$$ plain form
57159 4881536 4889443 4894325 4896777 4897969 4898263 4897186 4894418 4890049 4884197 4877051 4868934 4859708 4848620 4835520
57145 4835520 4821734 4808873 4797293 4786642 4777434 4770980 4767990 4768221 4771331 4777221 4785664 4796313 4808789
57132 4808789 4822113 4834456 4844207 4850902 4854366 4853549 4847165 4835084 4818296 4798069 4776138 4755157
57120 4755157 4737701 4724925 4716950 4714012 4716159 4722263 4730580 4740243 4751404 4764434 4780234 4801258
57108 4801258 4831234 4873855 4932295 5009568 5108593 5232437 5385565 5574744 5808471 6096683
57098 6096683 6452382 6893126 7440057 8115996 8944769 9950022 11151197 12558683 14171318
57089 14171318 15975486 17944116 20037157 22204489 24387741 26519702 28527629 30344525
57081 30344525 31919553 33216105 34201384 34842467 35113369 35002262 34510957 33652001 32450035
57072C2450035j505657j756819j946142k067136k117017k100247k028777j917388
57064A7010852j779619j627226j470211j315774j168366j031113r06158p93935
57056F918450o93864o05927n30263m65552m09518l60927l19561k84387k53439
57047B995012k25544k00665j78623j58952j41904j28049j16809j06788r7490q9384
57037A550804q2367p5572o8618o1715n4548m6386l7207k7416j6587l787J0721
57026A087322K4965L5849L9217L0581Q556k1914n1416p2147q1765q2208p6722
57015H40318o8388n9578n1495m4340l8060l2476k7187k2251j8560j6598j5347
57004D46038j3570j1626j0708j0875j1213j1567j2498j3804j4666j5047j5379
$$ plain form
57072 32450035 30944378 29187559 27241417 25174281 23057264 20957017 18928240 17010852
57064 17010852 15231233 13604007 12133796 10818022 9649656 8618543 7712385 6918450
57056 6918450 6224586 5618659 5088396 4622844 4213326 3852399 3532838 3248451 2995012
57047 2995012 2769468 2568803 2390180 2231228 2089324 1961275 1844466 1737678 1640188 1550804
57037 1550804 1468437 1392865 1324247 1262532 1207984 1161598 1124391 1096975 1080388 1076601 1087322
57026 1087322 1112287 1148136 1187353 1217934 1226490 1204576 1153160 1081013 999248 917040 840318
57015 840318 771930 712352 660857 616517 578457 545981 518794 496543 477983 461385 446038
57004 446038 432468 420842 410134 399259 388046 376479 363981 350177 335511 320464 305085
56993C05085j5090j3231j0448q470p470n710k127K369O702J1079J5880K0247K2519
56980C21335K1343J6172P725j733r467j4108j5881j5391j3219j0483q353o806
56968B71134m885k312J75K114L788N467P237R584J2934J6705K0000K3067K6532
56955C91540K9153K7951K1134R784l409j5700k4570k8373k7662k4834k1786j8622
56943C14606j4899j0868o961l142N07L466N615P745J0768J4922J9992K5761L1933
56930C99445L7914M2289M2186L4178J7536l490k2118l4092l9467m0086l7306l2491
56918C64498k7566k3706k0419j6798j2990r862p911p025o665o001m524k768j730
56905B16533j465j026Q0J389K488L564M746N816O817Q164R894J1632J3354J5422
$$ plain form
56993 305085 289995 276764 266316 257846 250376 244666 242539 244908 251610 262689 278569 298816 321335
56980 321335 342678 358850 366575 364842 355375 341267 325386 309995 296776 286293 277940 271134
56968 271134 266249 263937 264112 266226 270014 275481 282718 292302 305236 321941 341941 365008 391540
56955 391540 420693 448644 469778 479562 476153 460453 435883 407510 379848 355014 333228 314606
56943 314606 299707 288839 281878 278736 279243 282709 288324 296069 306837 321759 341751 367512 399445
56930 399445 437359 479648 521834 556012 573548 570058 547940 513848 474381 434295 396989 364498
56918 364498 336932 313226 292807 276009 263019 253157 245246 238221 231556 225555 221031 218263 216533
56905 216533 215068 214042 214122 215511 217999 221563 226309 232125 238942 247106 257000 268632 281986 297408
56891B97408J7825K0159K2399K4906K7738L0727L3759L5912L4654K7554J5032
56880E88073L75j2983k3155k9315l1333l0189k7371k3474j8411j2910q208m234
56868C66865L51N970J1568J6582K1944K8603L6539M5711N6483O8108P7617Q0629
56856H16970P2874N1979K0166j4487m1992n7261o2236o1270n6515m8519l8708
56845E81001k8955j9726j0398q79Q353J7269K6338L6005M6794N9399P4057R0404
56833H79662J07761J23849J32378J24092R2968M2240j6044o7501j02257j17995
56823A199153j18575j10011r6814q1407o5767n1856m0203k9584j8968q673R60
56812E78255J0819K1907L3929M6085N8602P2189Q5774R4972R2978P4069L8293
$$ plain form
56891 297408 315233 335392 357791 382697 410435 441162 474921 510833 545487 573041 588073
56880 588073 588448 575465 552310 522995 491662 461473 434102 410628 392217 379307 371099 366865
56868 366865 367216 373186 384754 401336 423280 451883 488422 534133 590616 658724 736341 816970
56856 816970 889844 941823 961989 947502 905510 848249 786013 724743 668228 619709 581001
56845 581001 552046 532320 521922 521043 529396 546665 573003 609008 655802 715201 789258 879662
56833 879662 987423 1111272 1243650 1367742 1460710 1502950 1486906 1419405 1317148 1199153
56823 1199153 1080578 970567 873753 792346 726579 674723 634520 604936 585968 577295 578255
56812 578255 589074 610981 644910 690995 749597 821786 907560 1002532 1095510 1169579 1207872
56801A207872o458m8193p7852r3098r6426r1576q2032p0701n9254m8128l7680
56790D96474k8612k0971j3885o798R1O865J4144K1944K9642L7285M5141N1226
56778F32546N1123M1613K3583Q92k2106m1262n3216n7222n5617n1287m5583l9252
56766C84212l3565k9096k4793j9855j5451j3029j2059j0906r135p464o231n321
56754A97307m938n108n065m281l412l151l015k368j714j699j780j212m90m20o06
56739A58048l25r4q10j974k363j969j780j927j554l39J055J931J957R93n68j682
56723A48599j773j439j225n71R82K460K648J903J388J174N63k47l90J28N43P41
56707A55484J187J707J643J054N16l2j058k218k649k279j772j309n38L71P76N98
$$ plain form
56801 1207872 1201414 1153221 1075369 982271 885845 794269 712237 641536 582282 534154 496474
56790 496474 467862 446891 433006 426208 426299 433164 447308 469252 498894 536179 581320 632546
56778 632546 683669 725282 748865 749757 727651 686389 633173 575951 520334 469047 423464 384212
56766 384212 350647 321551 296758 276903 261452 248423 236364 225458 216323 208859 202628 197307
56754 197307 192369 187261 182196 177915 174503 171352 168337 165969 164255 162556 160776 159564 159074 158654 158048
56739 158048 157723 157629 156819 154845 152482 150513 148733 146806 145252 144913 145968 147899 149856 150849 150281 148599
56723 148599 146826 145387 144162 143591 144573 147033 149681 151584 152972 154146 154709 154462 154072 154200 154743 155484
56707 155484 156671 158378 160021 161075 161591 161559 160501 158283 155634 153355 151583 150274 149736 150107 150883 151481
56691A51481L69K69J25J25O26J325J594J498J607J890J688Q03j03k70M37J496
56675A64960K054J616O76K24L51J21q71j739j708j258j137j153q35m17k65j57
56659A60462R2J46J3L83J252J445M58n25o18q37k224l702l599k292j545j902k478
56642A44529k688k475j534J03J285J207R99K193M242N327N022M358L710K656J529
56627A70463J199J392J003j6p61j122j734k319j963r27m71p54o84N8N08J91j44
56610A63919M3K82P7l82p53q55m32N02J233J185Q06P31O14l8n69j54N92M80k43
56591A67038m26j8J30Q6O44J587J893J520J252J049K54p41q24o2M69N59Q85J337
56573A76632J179P36J012J737J705R56P35J290J737K065L207M972O075O467P548
$$ plain form
56691 151481 151850 152119 152244 152369 152995 154320 155914 157412 159019 160909 162597 163400 163297 163027 163464 164960
56675 164960 167014 168630 169306 169530 169881 170002 169131 167392 165684 164426 163289 162136 161301 160884 160619 160462
56659 160462 160554 160700 160713 161096 162348 163793 164251 163726 163108 162271 160047 156345 152746 150454 148909 147007 144529
56642 144529 141841 139366 137832 137935 139220 140427 141426 143619 147861 153188 158210 162568 166278 168934 170463
56627 170463 171662 173054 174057 174041 173280 172158 170424 168105 166142 165215 164744 163990 163306 163364 163872 164063 163919
56610 163919 163962 164244 164321 163939 163186 162331 161899 162401 163634 164819 165625 166356 166970 166932 166363 166209 166801 167281 167038
56591 167038 166612 166594 166724 166810 167454 169041 170934 172454 173706 174755 175009 174268 173444 173382 173851 174410 175295 176632
56573 176632 177811 178547 179559 181296 183001 183957 184692 185982 187719 189784 192991 197963 204038 210505 218053
56558B18053R603J1044J0658Q892O474L620R99l56n81q02j190q81J8K84k80n87
56542B64968m67j049k441l196k752k306k578k635j839j086j181j617j820j953
56528B38048j866r38L60N09p01j662j550j529k460l310k967j977j342j067r23
56513B16625j197j750j697r38n79j070j456j180j021j340j183j32N94J21o37n97
56497B02563k36m30r36j166j215j146m99M92N90n75j622j460p92o09n81j37K54
56480A92495J09MM46P78L64j67J3O81J256J740K042J563L73k93K54J030Q99J83
56462B03770j56J04O68J316J622J107K85L47J338J947J579J077Q55J34j172j683
56446B13138p29M20O50O43J195J538P35o12j395j487j095l7J283J621P41N5L37
$$ plain form
56558 218053 227656 238700 249358 258250 264724 268344 269343 268987 268406 267604 266414 265533 265551 265835 265555 264968
56542 264968 264501 263452 261011 257815 255063 252757 250179 247544 245705 244619 243438 241821 240001 238048
56528 238048 236182 235244 235604 236113 235412 233750 232200 230671 228211 224901 221934 219957 218615 217548 216625
56513 216625 215428 213678 211981 211043 210464 209394 207938 206758 205737 204397 203214 203082 203676 203797 203160 202563
56497 202563 202327 201897 200961 199795 198580 197434 196935 197427 198017 197442 195820 194360 193568 192959 192378 192241 192495
56480 192495 192604 192608 193054 193832 194196 194029 194042 194723 195979 197719 199761 201324 201697 201404 201658 202688 203587 203770
56462 203770 203614 203718 204386 205702 207324 208431 208716 209063 210401 212348 213927 215004 215859 215993 214821 213138
56446 213138 212409 212829 213479 214122 215317 216855 217590 216978 215583 214096 213001 212964 214247 215868 216609 216664 217001
56429B17001M60m16j183p75o8k14n95k14L59J95p9N98J760K247K045J753J258
56412B24132M01o9L02N82l3o98l67L31K32l86m83l9K93N10Q66J031P56N50N94
56393B28505J70q45j289p23n66j849l329l382k362j430m99Q33J679J170K95M48
56377B16826J237J518J639K678M274N121M961M394L447J957O24J75K06J63N92
56362B49812J920L066K844J828J269J168Q87O65R19J050N57K55Q57J423Q67j31
56346B69256l60p6j3L08J468K519K350J614J456J501R61N48J204K091J940J358
56330B88125J710K627K794K288K075K128J986K261L510M637M426L643L506L328
56316C29044J948L62L26J311J400N32K25P55J115J257J962K898L161L220M143
$$ plain form
56429 217001 217461 217045 215862 215087 215019 214805 214210 213996 214355 214550 214471 215069 216829 219076 221121 222874 224132
56412 224132 224533 224464 224766 225348 225315 224617 224250 224581 224813 224427 223944 223905 224198 224708 225574 226605 227361 227911 228505
56393 228505 228675 227830 226541 225818 225252 223403 220074 216692 214330 212900 212401 213234 214913 216083 216378 216826
56377 216826 218063 219581 221220 223898 228172 233293 238254 242648 246095 248052 248676 248851 249057 249220 249812
56362 249812 251732 254798 257642 259470 260739 261907 262794 263459 264378 265428 265985 266240 267097 268520 269387 269256
56346 269256 268896 268820 268807 269115 270583 273102 275452 277066 278522 280023 280984 281532 282736 284827 286767 288125
56330 288125 289835 292462 295256 297544 299619 301747 303733 305994 309504 314141 318567 322210 325716 329044
56316 329044 330992 331354 331680 332991 334391 334923 335148 335903 337018 338275 340237 343135 346296 349516 353659
56301C53659N405N711N337N406N535M592L160K832L520L830L594L727M109L961
56287D14378L795M624N827O119N980O755P989Q316Q206R197J0909J1611J1322
56274E15028J1536J2296J2351J1984J2747J4557J5784J6199J7102J8611J9607
56263F77802K0384K2582K6199K9392L1603L4426L8985M4632N0604N6983O3871
56252A097463P1379Q0312R1011J02030J11849J21194J31460J41711J49782J55400
56242B253591J59453J61027J58247J51465J42359J30313J13002R0396O4954L8007
56232C462814R324j9741m6194o8854q8827j06207j19402j28115j33916j37485
56222B623397j38118j36248j33445j29633j23358j15182j07749j01969r6030q8737
$$ plain form
56301 353659 359064 364775 370112 375518 381053 385645 388805 391637 395157 398987 402581 406308 410417 414378
56287 414378 418173 422797 428624 434743 440723 447478 455467 463783 471989 481186 492095 503706 515028
56274 515028 526564 538860 551211 563195 575942 590499 606283 622482 639584 658195 677802
56263 677802 698186 720768 746967 776359 807962 842388 881373 926005 976609 1033592 1097463
56252 1097463 1168842 1249154 1340165 1442195 1554044 1675238 1806698 1948409 2098191 2253591
56242 2253591 2413044 2574071 2732318 2883783 3026142 3156455 3269457 3359853 3424807 3462814
56232 3462814 3472138 3452397 3406203 3337349 3248522 3142315 3022913 2894798 2760882 2623397
56222 2623397 2485279 2349031 2215586 2085953 1962595 1847413 1739664 1637695 1541665 1452928
56212A452928q1086p4112o7875o2710n8794n4498m8187m1541l7756l6485l4149
56201H55735k9589k5562k3947k3088k1056j8180j5251j2122r240p767p416o706
56189F55811n781o108p238p054n548m940n642n602m176l072k784j738J39P88j28
56174E96927l15J101K197K030K188L315L701K718K271L336M292M154M285N590
56160F37790P014Q052R631J1480J1846J0925J1195J3310J5026J5344J6197J8784
56148G86594K1708K4100K7275L1988L7418M3876N3114O4881P6815Q8630J02425
56137A358824J17623J29604J34792J33275J25417J10479R0593P1799N8804N1867
56127B383077M9908N2279N5728N4294M5014L0485J4236k443j7633k7795l2539
$$ plain form
56212 1452928 1371842 1297730 1229855 1167145 1108351 1053853 1005666 964125 926369 889884 855735
56201 855735 826146 800584 776637 753549 732493 714313 699062 686940 677700 669933 662517 655811
56189 655811 650030 643922 636684 629630 624082 619142 613500 607898 603722 600650 597866 596128 596267 597055 596927
56174 596927 596612 597713 599910 601940 604128 607443 611144 613862 616133 619469 623761 627915 632200 637790
56160 637790 644804 652856 662487 673967 685813 696738 707933 721243 736269 751613 767810 786594
56148 786594 808302 832402 859677 891665 929083 972959 1026073 1090954 1167769 1256399 1358824
56137 1358824 1476447 1606051 1740843 1874118 1999535 2110014 2200607 2272406 2331210 2383077
56127 2383077 2432985 2485264 2540992 2595286 2640300 2670785 2685021 2682578 2664945 2637150 2604611
56116B604611l6643m4727n7169p2827r1370j10500j24998j31424j30762j24838
56106A679353j13903r9441q5052p2433o0273m8614l9907l4146k7936k0343j4705
56095A062600j2494j0608p145m475l876k598O81K852K166J771L952N974N396M501
56081A048697N621O843O376O449Q904J1350J1535J1260J2300J2945J2115J2332
56069A166727J5005J7395J7653J8124K0250K1326J9867J8869K0157K0812J8999
56058A375184J7640J8465J8302J5377J3241J4154J4750J2840J2141J5312J8611
56047A546017J8750J8754K1550K4149K3783K3588K6342K8829K8318K8299L1674
56036A820053L4697L3929L2769L4711L6674L5614L5080L8402M2062M2687M3699
$$ plain form
56116 2604611 2567968 2523241 2466072 2393245 2301875 2191375 2066377 1934953 1804191 1679353
56106 1679353 1565450 1466009 1380957 1308524 1248251 1199637 1159730 1125584 1097648 1077305 1062600
56095 1062600 1050106 1039498 1032353 1027878 1024002 1021404 1022085 1024937 1027103 1028874 1032826 1038800 1044196 1048697
56081 1048697 1054318 1061161 1067537 1073986 1082890 1094240 1105775 1117035 1129335 1142280 1154395 1166727
56069 1166727 1181732 1199127 1216780 1234904 1255154 1276480 1296347 1315216 1335373 1356185 1375184
56058 1375184 1392824 1411289 1429591 1444968 1458209 1472363 1487113 1499953 1512094 1527406 1546017
56047 1546017 1564767 1583521 1605071 1629220 1653003 1676591 1702933 1731762 1760080 1788379 1820053
56036 1820053 1854750 1888679 1921448 1956159 1992833 2028447 2063527 2101929 2143991 2186678 2230377
56025B230377M7991N1226M9845M8477N1604N5312N5371N5789O0805O6061O6685
56014B839543O6618P0660P4943P4876P4808P9808Q5554Q6665Q7381R3495J01376
56003C735727J05642J09844J18670J27711J32136J37087J47969J59194J64429
55994D938409J68818J78765J89358J94949K01900K16978K33699K44767K57042
55985F824685K78705L03138L21970L42198L72879M07022M35362M65517N07762
55976A0259238N54929N97174O43172P04666P74402Q42773R20979J022704J139493
55967A7459530J261559J405167J590077J809381K054517K349738K726906L190173
55959C3847048L746461M446842N353983O496024P899978R637782J1787292J4391063
$$ plain form
56025 2230377 2278368 2329594 2379439 2427916 2479520 2534832 2590203 2645992 2706797 2772858 2839543
56014 2839543 2906161 2976821 3051764 3126640 3201448 3281256 3366810 3453475 3540856 3634351 3735727
56003 3735727 3841369 3951213 4069883 4197594 4329730 4466817 4614786 4773980 4938409
55994 4938409 5107227 5285992 5475350 5670299 5872199 6089177 6322876 6567643 6824685
55985 6824685 7103390 7406528 7728498 8070696 8443575 8850597 9285959 9751476 10259238
55976 10259238 10814167 11411341 12054513 12759179 13533581 14376354 15297333 16320037 17459530
55967 17459530 18721089 20126256 21716333 23525714 25580231 27929969 30656875 33847048
55959 33847048 37593509 42040351 47394334 53890358 61790336 71428118 83215410 97606473
55951I7606473J7513368K1278678K5786560L1077743L7210058M3968588M9920428
55944C24361896N1788873M5684633L0017735P553751j5683032l3905905m4403691
55937C65414260m7737087m6084335m1673279l6162260l0599446k5513440k1079926
55930A16564487j7328517j4241542j1742328r713813q065624o744643n688655
55923D3039365m823154m103646l516512l038569k633809k286478k000191j765379
55915A8871627j559396j375806j223165j097200r81986q75821p89417p20717o56097
55906I592022n94051n44218n05190m65429m24269l91046l65349l37964l09309
55897E655197k87759k71627k51460k28414k12186k02232j88625j70630j57153
$$ plain form
55951 97606473 115119841 136398519 162185079 193262822 230472880 274441468 324361896
55944 324361896 376150769 421835402 451853137 459406888 443723856 409817951 365414260
55937 365414260 317677173 271592838 229919559 193757299 163157853 137644413 116564487
55930 116564487 99235970 84994428 73252100 63538287 55472663 48728020 43039365
55923 43039365 38216211 34112565 30596053 27557484 24923675 22637197 20637006 18871627
55915 18871627 17312231 15936425 14713260 13616060 12634074 11758253 10968836 10248119 9592022
55906 9592022 8997971 8453753 7948563 7483134 7058865 6667819 6302470 5964506 5655197
55897 5655197 5367438 5095811 4844351 4615937 4403751 4201519 4012894 3842264 3685111
55888C685111j49369j39312j25688j15435j09236j00423q8977q2645q3335q5198
55878B605493q6421r0288r4471r1891q3000p5589p2005o7646o2052o0006o1212
55867A760912n9811n4904n1374m9910m6156m0079l6327l5080l2127k8095k7987
55856A299062l1271l1994k9108k7479k8161k6919k3052k0820k1266k1086k0226
55845A017680k2145k5933k6472k3345k1476k2185k1527j8415j6465j6697j5993
55834G87027j3881j3547j5070j4780j2278j1165j1890j0906p753o054o566o136
55822F57001m477n075q256j0117r541r675j1229j0943q118o284o759o714n030
55809E54783m097m391l185j65J544J336K416N718Q171Q530R303J1354J2030J0289
$$ plain form
55888 3685111 3535742 3396430 3270742 3155307 3046071 2945648 2856671 2774026 2690691 2605493
55878 2605493 2519072 2428784 2334313 2242422 2159422 2083833 2011828 1944182 1882130 1822124 1760912
55867 1760912 1701101 1646197 1594823 1544913 1498757 1458678 1422351 1387271 1355144 1327049 1299062
55856 1299062 1267791 1235797 1206689 1179210 1151049 1124130 1101078 1080258 1058992 1037906 1017680
55845 1017680 995535 969602 943130 919785 898309 876124 854597 836182 819717 803020 787027
55834 787027 773146 759599 744529 729749 717471 706306 694416 683510 675757 669703 663137 657001
55822 657001 652524 647449 639193 629076 619535 609860 598631 587688 579570 573286 566527 559813 554783
55809 554783 550686 546295 543110 542945 544489 545825 548241 553959 562130 570660 579963 591317 603347 613636
55795F13636Q337O620K574l987r331j1451j2400j3501j3209j1161r510q730o930
55782E30957m699n557r937j3654j4029j2839j1601q932m545r65J045M328J0274
55769D59846J5788J7382J4766Q860K02q939j4808j6394j6255j6075j5003j3242
55757D16128j2864j3882j3684j1761j0822j1830j2206j0531q668p637n662k292
55745B94289j65o56j567j168p04r91m56J398K258Q25j086k070l213m841m987l068
55729B73798j547j823k065j141j034l102n376n912n655n800n479m160l177k829
55715B24698j200K112M483M564M663O491Q030P192N289M109K661j63k570k667
55701B67692j809k262l607m284m656n846p305p905p848p480o017l319j026j42
$$ plain form
55795 613636 621973 628593 631167 627180 617849 606398 593998 580497 567288 556127 546617 537887 530957
55782 530957 526258 520701 510764 497110 483081 470242 458641 449709 445164 444199 445244 449572 459846
55769 459846 475634 493016 507782 516642 516844 507905 493097 476703 460448 444373 429370 416128
55757 416128 403264 389382 375698 363937 353115 341285 329079 318548 309880 302243 296581 294289
55745 294289 294124 293468 291901 290733 290029 289038 288582 289980 292238 293063 291977 289907 286694 281853 276866 273798
55729 273798 272251 270428 268363 267222 266188 263086 257710 251798 246143 240343 234864 230704 227527 224698
55715 224698 223498 225610 230093 234657 239320 245811 253841 261033 266322 270431 273092 272929 270359 267692
55701 267692 265883 263621 260014 255730 251074 245228 237923 230018 222170 214690 208673 205354 204328 204186
55687B04186N13J765K360J521Q74J743K877K972L145M687O440O749O087N548M553
55672B56020K279k93j857k795l885m539m046l068k366j620p20m29o31K0J562K165
55656B35797J348J114K430L403K782K397L814N291M518K147R8j555l505n059n495
55641B49525n814o884p596p046o620p639q777q196o478n156m064k545j517j922
55627A69271k610k102r93m67NJ209K111J564N73N11O26l48j591j696j316j844
55611A62903k755k732k192k298k565j937j108j379k202k192j599j520j600q51
55597A35973J36R4o12p12l29m26p51l60M68P79O99Q70J020P59Q34J881K934K929
55579A46186K540K792L174K977L128M611O453P425Q383J0584J2990J3705J2937
$$ plain form
55687 204186 204699 206464 208824 210345 211219 212962 215839 218811 221956 226643 233083 239832 245919 251467 256020
55672 256020 258299 258006 256149 253354 249469 244930 240884 237816 235450 233830 233110 232681 232050 232070 233632 235797
55656 235797 237145 238259 240689 244092 246874 249271 253085 258376 262894 265041 265139 263584 260079 255020 249525
55641 249525 243711 236827 229231 222185 215565 207926 199149 190953 184475 179319 175255 172710 171193 169271
55627 169271 166661 164559 163566 163099 163104 164313 166424 167988 168561 169072 169698 169350 167759 166063 164747 162903
55611 162903 160148 157416 155224 152926 150361 148424 147316 145937 143735 141543 139944 138424 136824 135973
55597 135973 136109 136203 135591 134879 134550 134124 133373 133013 133481 134260 134959 135829 136849 137608 138442 140323 143257 146186
55579 146186 148726 151518 154692 157669 160797 165408 171861 179286 187669 198253 211243 224948 237885
55566B37885J1975J0380O950K596n29k205l870n750o870p475q743j0347j0742
55553B13255r767q689p836o456m725l740l477k826j632p96m81m1M35L63J57O98
55537A64442J573J619R43O06O85L82k55n45o91j323j932j627j070j671l184l976
55521A53976l492k648k028j428r72r18p35P4O80J80n56k11M90k97k606m825o333
55504A28351p608q166o794l969j798j295j653k118k624k646j502J00P41N38Q08
55489I0365J602J693R46N30O46K91n14m54O35J216N31k64j13N15P73N58o6j093
55471I7797j872j585o18j28j85J00O75M91n17j137p86o2O84J645K371K066J209
55454A00148J014J266O31p58j234m09J53k93n04L21J046O53n4k9K60q7q05j121
$$ plain form
55566 237885 249860 260240 267190 269786 269257 267052 263182 257432 250562 243087 234344 223997 213255
55553 213255 203488 194799 186963 180507 175782 172042 168565 165739 164107 163311 162830 162789 163224 163587 163744 164442
55537 164442 166015 167634 168577 169183 169868 170250 169995 169450 168759 167436 165504 163877 162807 161136 157952 153976
55521 153976 150484 147836 145808 144380 143408 142490 141755 141829 142509 142689 142133 141922 142412 142115 139509 134684 128351
55504 128351 120743 112577 105783 101814 100016 98721 97068 94950 92326 89680 88178 88278 89019 89557 90365
55489 90365 91967 93660 94606 95136 95782 96073 95559 95105 95740 96956 97487 97223 97110 97625 98398 98956 98890 97797
55471 97797 95925 94340 93722 93594 93409 93509 94184 94675 94158 93021 92235 92173 92857 94502 96873 98939 100148
55454 100148 101162 102428 103059 102301 101067 100658 100811 100518 100014 100335 101381 102034 101980 101951 102211 102124 101319 100198
55436A00198r37n31P6O89P84L24j63n84j248j715j042M45J165N63j8N94J833K581
55418A03014K673K523K335K370K966L725L619K392R56N3m68p91p63o23r55j600
55402A21426j786j539j700k313k451j926j670j931j694n25M80L79k55m09N2P76
55386A04914J495J719R64j86m98O9K55l71o85p2M23j16r85j148p76m86k59o1m18
55367A03778j332j713r58j34n14j766k549k296j459o71l84p27j048l67J159K040
55351I1059J367L6o07m40j21J48N17Q02P60N76M98L86J29r4k55n20o33m6R60J322
55331I5844O89k2lN34J122J617J557K90j616k361j190N16J254J308J570J708R22
55314A03739k85o52k8N45M72J54M2%k15n12n94k77K18L08l25j127j266q22o59
$$ plain form
55436 100198 99261 98730 98806 99495 100279 100603 100440 99856 98608 96893 95851 96296 97461 98024 98006 98600 100433 103014
55418 103014 105687 108210 110545 112915 115881 119606 123225 125617 126573 126626 126158 125367 124604 123981 123026 121426
55402 121426 119640 118101 116401 114088 111637 109711 108041 106110 104416 103891 104371 104750 104495 104086 104138 104914
55386 104914 106409 108128 109092 108906 108408 108477 108732 108361 107676 107604 108027 107911 106926 105778 105002 104516 104257 104196 103778
55367 103778 102446 100733 99775 99641 99127 97361 94812 92516 91057 90386 90002 89275 88227 87860 89019 91059
55351 91059 92426 92462 91855 91415 91294 91442 91959 92761 93521 94097 94595 94981 95110 95016 94761 94241 93608 93562 94522 95844
55331 95844 96533 96511 96508 97042 98164 99781 101338 101628 100012 97651 96461 96977 98231 99539 101109 102817 103739
55314 103739 103454 102802 102774 103319 103791 103945 103987 103987 103772 103260 102666 102389 102607 102915 102590 101463 100197 99375 98716
55295I8716j072j392j136o04j04M50R11Q58M46K84K41m11j338j056Q09K539K502
55278A00643J138j21p56r99p87j41K22k49j013j210q07j89N78J301J319M80k93
55261I9116k69L8k7n7N07J066P78K6k11J5p3m94o07l80l17l61K1O27O03j88q46
55240I8967p31k54j38m64p79p51m65k35j53P8O52J094P31j86n20K76J400J808
55222A00330J446Q75L17k89p71q93p18l56K06P04N70k48q97o49J97Q03P80K45
55204A01652n43j140r99q7Q80J218R22L82j13l58k96k69o42j072r45m78m81q87
55186I6744p20J86P16K71k31R4P50R49R45J254J494J085L16k63p81j410j539o73
55168I9187M91R35P35O17O10K59k89m43k16j65m63p63p56l37M77J322J548J040
$$ plain form
55295 98716 97644 96252 95116 94512 94408 94858 95769 96627 97073 97357 97598 97187 95849 94793 95602 98141 100643
55278 100643 101781 101660 100904 99905 99118 98977 99199 98950 97937 96727 95920 95731 96309 97610 98929 99409 99116
55261 99116 98847 98885 98858 98801 99308 100374 101152 101178 100967 100982 100909 100415 99808 99428 99111 98750 98771 99398 100001 99813 98967
55240 98967 98236 97982 97844 97380 96601 95850 95385 95150 94997 95075 95727 96821 97552 97366 96846 97122 98522 100330
55222 100330 101776 102651 102968 102679 101908 101015 100297 99941 100147 100851 101421 101173 100276 99627 99824 100627 101407 101652
55204 101652 101109 99969 98970 98883 99763 100981 101903 102285 102172 101814 101518 101249 100607 99535 98590 98112 97631 96744
55186 96744 96024 96210 96926 97197 96966 97060 97810 98759 99704 100958 102452 103537 103853 103590 102809 101399 99860 99187
55168 99187 99678 100613 101348 101965 102575 102834 102545 102102 101886 101721 101258 100495 99739 99402 99879 101201 102749 103789
55150A03789M70L41L79K61J83J65k12q29p28L50J129M86q72j496j150n37J32J059
55132A02920J862J910J329O76lq85j623j821j780j857j634o75M72J075J367J835
55116A03168J993J142j10m84J15O21M67O6j95k80J3Q43J645J643R47L36J64K95
55098A12389P41J444J793J294M51N7j1l28p48p66o09p46p50O3J120J132N4p59
55080A15821m72L66R06Q84L26n73j167q99j36L04L23L87M64K19l2K79P19L03q15
55061A17207j372q57q9K57M62P46O40j24r43j175r09n58l09k47m07m81m9P37J247
55042A13776J199Q21L11k62n86m11j09k19n15l43K28N02K99J02L6l14q85r09n8
55023A12663R75J352R99L86r0l01l88n80p70n18K14O90M24mJ38N16L66j33k16
$$ plain form
55150 103789 104259 104600 104979 105240 105423 105588 105376 104547 103819 104169 105298 105784 104912 103416 102266 101729 101861 102920
55132 102920 104782 106692 108021 108697 108694 107809 106186 104365 102585 100728 99094 98419 98891 99966 101333 103168
55116 103168 105161 106303 106193 105709 105824 106445 106912 106978 106783 106503 106516 107359 109004 110647 111594 111930 112094 112389
55098 112389 113130 114574 116367 117661 118112 118169 118158 117830 117082 116316 115707 114961 114211 114274 115394 116526 116580 115821
55080 115821 115349 115715 116621 117505 117831 117258 116091 115192 115056 115360 115683 116070 116534 116753 116721 117000 117719 118022 117207
55061 117207 115835 114978 114889 115146 115608 116354 116994 116870 115927 114752 113843 113285 112976 112729 112322 111841 111792 112529 113776
55042 113776 114975 115796 116107 115845 115259 114848 114739 114520 114005 113662 113890 114392 114691 114793 114829 114515 113630 112721 112663
55023 112663 113638 114990 115989 116375 116285 115984 115596 115016 114246 113728 113942 114632 115056 115052 115190 115706 116072 115939 115723
55004A15723P0P3j49K6M49L94rJ45Q59J007J73n83k79O81J308J218O05j42m10
54985A21159K51J342J735J109L58L07P18Q88N73j3n21o03k07J40o3m32j60P40
54967A27321J448J602J633J696J300K85o33p46k04L01K44m01j128j190m40L14
54951A31402L54N1J34L87R7n52p42m97n65r25p34J35Q32R99J233J755J981J694
54933A37039J481J525J225M64O0M49J080J639K669M335N741O337O867Q027R131
54918A88069R094Q019O812N711M159J827j032l950o388p793q029p635p278p125
54904A74461o879o206n063l861l222l137k709j336J56M82k75q56o87l88l31l7
54888A40112P54J497J758J737J605J365J496K670M516N861O450P164Q260Q780
$$ plain form
55004 115723 115793 115866 115717 115743 116192 116586 116577 116722 117581 118588 118761 118178 117899 118580 119888 121106 121711 121569 121159
54985 121159 121410 122752 124487 125596 125954 126261 126979 127867 128440 128427 127906 127303 127096 127236 127173 126741 126581 127321
54967 127321 128769 130371 132004 133700 135000 135285 134652 133906 133702 134003 134247 133846 132718 131528 131088 131402
54951 131402 131756 131807 131941 132328 132425 131873 131131 130634 130069 129144 128410 128545 129377 130376 131609 133364 135345 137039
54933 137039 138520 140045 141270 141734 141794 142243 143323 144962 147631 151966 157707 164044 170911 178938 188069
54918 188069 197163 205182 211994 217705 221864 223691 222659 218709 212321 204528 196499 188864 181586 174461
54904 174461 167582 161376 156313 152452 149230 146093 143384 142048 142204 142686 142411 141555 140868 140480 140149 140112
54888 140112 140866 142363 144121 145858 147463 148828 150324 152994 157510 163371 169821 176985 185245 194025
54874A94025Q235P424O860N744L410N50j930m134o270p582p393o444o052o390
54860A80053o508n623l790j759o60j107k288k710k151j808k198k341j718j486
54846A43906k546l801l694k495j563j223q80n82q49j324j063q1O78P86O85O67
54830A26621N09J15l39q05j234j246o32M5R2l09m75k23J28M97R66J256J056O60
54812A26682O05Q79J104J254J469J455Q12j67p11n29m7K58K55O9m1J24M13N29
54794A34413O30J174J897J763M01j088j444p41K6K69N7l65o11j78Q84J792K069
54777A40948K144K334K060R99K72J264L656N742O562O665O893P358P812Q208Q623
54762B11540Q898Q583P116M356R83j984m192n996p423p972p650p246p157o844
$$ plain form
54874 194025 202260 209684 216544 222288 225698 226248 224318 220184 213914 206332 198939 192495 186443 180053
54860 180053 173545 167922 164132 162373 161713 160606 158318 155608 153457 151649 149451 147110 145392 143906
54846 143906 141360 137559 133865 131370 129807 128584 127704 127122 126273 124949 123886 123805 124483 125269 125954 126621
54830 126621 127130 127245 126906 126101 124867 123621 122989 123034 123126 122817 122342 122119 122247 122744 123710 124966 126022 126682
54812 126682 127287 128166 129270 130524 131993 133448 134260 134093 133382 132853 132806 133064 133319 133388 133347 133471 133884 134413
54794 134413 135043 136217 138114 139877 140278 139190 137746 137005 137031 137300 137357 136992 136381 136203 137087 138879 140948
54777 140948 143092 145426 147486 148485 148757 150021 153677 159419 165981 172646 179539 186897 194709 202917 211540
54762 211540 220438 229021 236137 240493 241476 239492 235300 229304 221881 213909 206259 199013 191856 185012
54748A85012o044n447n441n255m233k999k312j758p67jl66j243j212j07R36J198
54732A49961R65O36M31P99K043L640M803N499O095O528O740P324Q583R449Q593
54717B22089O249L668J184j753m913p188q176q513q617q294p635p040o297m867
54703A59897l137k153j999j684q71m28r38j806k251k145j600p15n0k70r86r35
54687A37929K02J128O29q93k164k539k210j532p31K1P10J355J684J328M65k32
54671A35150m20m27o81j212j771j995j544n21L48M33rk91k84k69j37M29J118J242
54653A29159Q28N68O58N94K36J21N12R06Q46N67M91N75N13K23k5J58Q29J336Q00
54634A39895p24k008k085j332n83Q9Q09R47m5j327j519o15K09M08M02L04j98q28
$$ plain form
54748 185012 178968 173521 168080 162825 158592 155593 153281 151523 150756 150755 150389 149146 147934 147827 148763 149961
54732 149961 150926 151562 151993 152792 154835 158475 163278 168777 174872 181400 188140 195464 204047 213496 222089
54717 222089 228338 232006 233190 231437 226524 219336 211160 202647 194030 185736 178101 171061 164764 159897
54703 159897 156760 154607 152608 150924 150053 149625 148687 146881 144630 142485 140885 140170 140120 139850 138864 137929
54687 137929 138131 139259 139888 138995 136831 134292 132082 130550 129819 129840 130550 131905 133589 134917 135382 135150
54671 135150 134730 134303 133622 132410 130639 128644 127100 126579 126927 127360 127351 127060 126776 126507 126370 126799 127917 129159
54653 129159 129987 130555 131213 131807 132043 132164 132676 133582 134428 134995 135486 136061 136574 136797 136772 136930 137759 139095 139895
54634 139895 139171 137163 135078 133746 133163 133252 134061 135008 134963 133636 132117 131502 131711 132119 132521 132825 132627 131799
54616A31799r10o29o78p68MJ300J685R01L11O38R26M36q8J05M40J97j54J18P25
54597A36358R27O34J04o77j498j580o19N24R11O52L71K06J8q0j13m37r80r96k43
54578A33482L63L2o89q14l66j6J26M20P43O08P2k52l3M97J048J485J648J334N26
54559A40214m69j088q22J91J025R56M75O48J479J833J027l32j332j592r61N58
54543A41810K170K637J826R51Q24Q78M68k5j11j82n88p53j86M28K28m87r77j377
54525A47534k128k688k142p48K90M35J63j02l49m01QO33R66J052J258J408R57
54508A46146M6n32m24p9N8K4l7j16j08Q7K49R9j85j92J0l7m45q31r67r51q01l17
54486A40697M50J058J139P28J07l56k93M20J392J972J813J130M39K60P79J585
$$ plain form
54616 131799 130889 130260 129582 128814 128818 130118 131803 132704 133015 133653 134579 135015 134927 135032 135472 135669 135515 135633 136358
54597 136358 137285 137919 138023 137346 135848 134268 133649 134173 135084 135736 136107 136313 136331 136251 136138 135701 134721 133725 133482
54578 133482 133845 133877 133188 132374 132008 131992 132118 132538 133281 133889 133961 133709 133676 134173 135221 136706 138354 139688 140214
54559 140214 139745 138657 137835 138026 139051 140007 140482 141130 142609 144442 145469 145137 143805 142213 141252 141810
54543 141810 143980 146617 148443 149394 150218 151096 151564 151539 151428 151246 150658 149905 149719 150147 150375 149888 148911 147534
54525 147534 145406 142718 140576 139828 140118 140553 140716 140614 140265 139864 139872 140505 141471 142523 143781 145189 146146
54508 146146 146192 145660 145236 145157 145215 145239 145202 145086 144978 145065 145314 145413 145228 145036 145046 145009 144564 143733 142766 141815 141014 140697
54486 140697 141147 142205 143344 144072 144179 143823 143530 143950 145342 147314 149127 150257 150696 150956 151735 153320
54470A53320J859J165l4q42q41l38J41L59M40N87P61O44P4o14j004j204j613k116
54452A50744k103j295r8J009J788J894J007m27j300j078m10j12k20m30p12j001
54436A47256r09m04j09l38m50J77J115J532J386J147Q01P8o59o75M0P60J045J097
54418A52890J138J016N52j44p77j010o67l4L20K05J6j3j30l61j02Q99J789J614
54400A57201O80N9R8K98M08O90J091J124P13L89M21M24R6j92M5O31Q68L92l46
54381A65090n18J66J103J494J316J210J468J641J307O73J54j21j46J45O16R66
54365A76564J327K179L425M225M143L722L459L070K353J870J921J673L24j545
54351B08710k808l430m104m773m792m262l919l766l047j638l86J02M5k93r72j765
$$ plain form
54470 153320 155179 156344 156310 155468 154627 154289 154430 154789 155229 155816 156577 157221 157295 156681 155677 154473 152860 150744
54452 150744 148641 147346 147248 148257 150045 151939 152946 152519 151219 150141 149731 149619 149399 148969 148257 147256
54436 147256 146347 145943 145834 145496 145046 145223 146338 147870 149256 150403 151204 151282 150623 149948 149988 150748 151793 152890
54418 152890 154028 155044 155596 155452 154675 153665 152998 152964 153284 153489 153505 153492 153362 153001 152899 153798 155587 157201
54400 157201 157881 157940 158038 158336 158744 159434 160525 161649 162362 162751 163172 163596 163692 163500 163545 164176 165044 165436 165090
54381 165090 164572 164738 165841 167335 168651 169861 171329 172970 174277 174950 175104 174983 174837 174982 175598 176564
54365 176564 177891 180070 183495 187720 191863 195585 199044 202114 204467 206337 208258 209931 210255 208710
54351 208710 205902 202472 198368 193595 188803 184541 180622 176856 173809 172171 171785 171887 171932 171639 170667 168902
54335A68902k000j452p10l99n21p36p77m42L14J111J402J065M35j84o58q26o14
54318A63910k43P4M43Q57Q62J64p10j037q69p28p19o13n60q75j395j747j925j913
54300A52976j165M96J929J830O68J71R64J899J908J217N04j8k00K55J147J659
54284A66240J372O89J07k59k77J60N41J39p16q23J16R35P27Q7L1N19Q17O34K00
54265A71239j97k11M89J619K302K151J757J599J296M72k96k85K14L83J24k4M2
54248A82674j23o37j006q19k76R8o6p65j615k167k328k393k475k262j491l71O96
54231A64674J482J829J609J090R75J568K226K104J283O32O59R22P20k5p40r28
54215A80080p37p52j272j978k314k055j332l76M51P11L20k19m87p61j457k148
$$ plain form
54335 168902 166902 165450 164740 164341 163820 163084 162307 161865 162179 163290 164692 165757 166192 166008 165350 164524 163910
54318 163910 163667 163741 164184 165041 165903 166067 165357 164320 163451 162723 162004 161391 160831 159956 158561 156814 154889 152976
54300 152976 151811 152307 154236 156066 156734 156905 157869 159768 161676 162893 163397 163379 163179 163434 164581 166240
54284 166240 167612 168301 168408 168149 167872 168032 168573 168712 167996 167173 167289 168224 168951 169038 169069 169588 170405 171039 171239
54265 171239 171042 170831 171320 172939 175241 177392 179149 180748 182044 182516 182220 181935 182149 182532 182656 182632 182674
54248 182674 182551 181914 180908 180089 179813 179911 179845 179080 177465 175298 172970 170577 168102 165840 164349 163978 164674
54231 164674 166156 167985 169594 170684 171659 173227 175453 177557 178840 179472 180131 181053 181773 181748 181008 180080
54215 180080 179343 178591 177319 175341 173027 170972 169640 169264 169715 170426 170746 170527 170040 169279 167822 165674
54199A65674j963q49L35J093J776K524K697J880Q09N03Q95J002L31n41p72k00
54183A75194O34J212J521J794J925J539O99R7J09J22n96j663k057j602j118j117
54167A76693j267j246j176r78k89O20Q05J03l32L41J293J199J21p31q41q33j207
54150A72275j530j193l43K93K65j66l88r8M39Q05R26R30P63L52K5K21P72J074
54132A75422R89R59J062P84j9o56o44m56o59q47k49R92J906J905J291O41K30P0
54114A82721J60N14J102J695J830J157K5o61l97M04J058J428J859K559L426M262
54098B03142M907N358N893O817P925Q476P829N890K948n31l843o294p702q332
54084B32483q258p260n478l586k145j250q84j009j102l60J282K895L681L777L663
$$ plain form
54199 165674 163711 162862 163197 164290 166066 168590 171287 173167 173976 174479 175374 176376 176707 176166 175394 175194
54183 175194 175828 177040 178561 180355 182280 183819 184518 184615 184724 184846 184250 182587 180530 178928 177810 176693
54167 176693 175426 174180 173004 172026 171737 172357 173162 173265 172933 173274 174567 175766 175887 175156 174315 173482 172275
54150 172275 170745 169552 169209 169502 169767 169601 169213 169115 169554 170359 171285 172215 172978 173330 173355 173576 174348 175422
54132 175422 176411 177370 178432 179216 179197 178541 177897 177441 176782 175935 175686 176678 178584 180489 181780 182421 182651 182721
54114 182721 182881 183395 184497 186192 188022 189179 189204 188543 188146 188550 189608 191036 192895 195454 198880 203142
54098 203142 208049 213407 219300 226117 234042 242518 250347 256237 259185 258654 254811 248517 240815 232483
54084 232483 224225 216965 211487 207901 205756 204506 203622 202613 201511 201151 202433 205328 209009 212786 216449
54069B16449L505L422L676M089L886K669J032k69j154j829k271k589l152l788
54055B23676l626k408j153p98q92n69j0J52K35J027K236K729K224J726K111L183
54039B29843M196M659M595M611N452O995Q053P859P122O856O652N398L292J724
54025C07307J340J511J761K279K816K436R76m73j079j302j822k456k816l164l869
54010C03445m637n025n159n324n327m887m245l819l642l649l965m415m257l084
53996B42010j592p87p77j040j453k194k816k454j123k0j39j129j893j865j292
53981B21436n72J08N48M19l25j127j233n77K8j76r07j029J21J959L254L293K300
53964B27520J035L02O50K102M095N900P258Q450R840J1526J3445J5426J6891J6704
$$ plain form
54069 216449 219954 223376 227052 231141 235027 237696 238728 238459 237305 235476 233205 230616 227464 223676
54055 223676 220050 217642 216489 215691 214799 214230 214220 214372 214607 215634 217870 220599 222823 224549 226660 229843
54039 229843 234039 238698 243293 247904 253356 260351 268404 276263 283385 290241 296893 302291 305583 307307
54025 307307 308647 310158 311919 314198 317014 319450 320426 319953 318874 317572 315750 313294 310478 307314 303445
54010 303445 298808 293783 288624 283300 277973 273086 268841 265022 261380 257731 253766 249351 245094 242010
53996 242010 240418 239631 238854 237814 236361 234167 231351 228897 227774 227754 227615 226486 224593 222728 221436
53981 221436 220864 220972 221520 221939 221614 220487 219254 218677 218705 218529 217622 216593 216714 218673 221927 225220 227520
53964 227520 228555 228857 229507 231609 235704 241604 248862 257312 267152 278678 292123 307549 324440 341144
53950C41144J3793Q156J164n213r519j1336j1113r718q019o502n141l631j805
53937B92260K20K123L500M029L690K848J954J272R63J202J898K549K733K699L010
53922C26950L707M270M427M439M476M365M163M422N428O690P567Q034Q354Q350
53908D05642P608O169M467K686P14j263k673l189l040k670k307k077k136k543
53894D05388l104l625m247n341o937q407r010q784q463q381p942o679n314m936
53880C14218n351n374m710m411m986n341m400k860k227k671l063k821k598k996
53866B60409l608l636k866j778j060j120j726k149j963j657k008k960l557l022
53852B27299j565p7O35M07k09m92l11k34o75j319j698j836j911j724j116n42m56
$$ plain form
53950 341144 354937 363093 364257 359044 349525 338189 327076 317358 309339 302837 297696 294065 292260
53937 292260 292480 294603 298103 302132 305822 308670 310624 311896 312859 314061 315959 318508 321241 323940 326950
53922 326950 330657 334927 339354 343793 348269 352634 356797 361219 366647 373337 380904 388938 397292 405642
53908 405642 413250 419419 423886 426572 427286 426023 423350 420161 417121 414451 412144 410067 407931 405388
53894 405388 402284 398659 394412 389071 382134 373727 364717 355933 347470 339089 331147 324468 319154 314218
53880 314218 308867 303493 298783 294372 289386 284045 279645 276785 274558 271887 268824 266003 263405 260409
53866 260409 256801 253165 250299 248521 247461 246341 244615 242466 240503 238846 236838 233878 230321 227299
53852 227299 225734 225657 226292 226699 226490 225998 225687 225453 224778 223459 221761 219925 218014 216290 215174 214632 214176
53835B14176m55J69J174J571J099O18Q55J492J758J300K70r05j555j081L39J786
53819B22611K531K675K683K662K371J729J018O65Q73J386J719J772K055L001M242
53804B53993M949M818M312M023M204M832N683O267O143N442M740M418M333M123
53790C22280L580K775K042J726J749J603R95J70o33j667l127m545n292n354n121
53775C11181m770m449m606n351n836n134l621k566k543l049l554l942l964l299
53761B54497k301j768j830j906j848k083k512k331j325l28kl0Pr7m84o64l08J41
53743B34828K21J34Q1l04j144j572p25Q95J869J498L42o69j091j010p26m23P9
53726B32283J012K071K543K223J725J581J569J362J208J496K014K263K249K323
$$ plain form
53835 214176 213721 213890 215064 216635 217734 218352 219207 220699 222457 223757 224027 223122 221567 220486 220825 222611
53819 222611 225142 227817 230500 233162 235533 237262 238280 238945 239818 241204 242923 244695 246750 249751 253993
53804 253993 258942 263760 268072 272095 276299 281131 286814 293081 299224 304666 309406 313824 318157 322280
53790 322280 325860 328635 330677 332403 334152 335755 336750 336920 336287 334620 331493 326948 321656 316302 311181
53775 311181 306411 301962 297356 292005 286169 281035 277414 274848 272305 269256 265702 261760 257796 254497
53761 254497 252196 250428 248598 246692 244844 242761 240249 237918 236593 236265 236263 236233 236240 236143 235659 234995 234687 234828
53743 234828 235049 235183 235264 234960 233816 232244 231519 232414 234283 235781 236123 235454 234363 233353 232627 232204 232283
53726 232283 233295 235366 237909 240132 241857 243438 245007 246369 247577 249073 251087 253350 255599 257922
53712B57922K506K427J920J233P02N11O83J073J517K028K732L518M098M422M698
53697B91990M893M734M232L738L321K693J896J364J162Q56L73K24M90M59k17q77
53681C21331r62r59j434j885j542o89j63L6M69R19N00q45j998k008j030J77R46
53664C10863Q00l46j822k572k254j493r54o26k42J22J87k5j65N7O01J165J474
53647C04770J534J537J484J160N93K69N62J211J691J854J891J844J584J169Q93
53632C24046R86J521K426L358L787L561L218L355L814L936L506L045L172M008
53618C67739N188O187O579O222N275M055K948K381K570L202L637L560L188K818
53604D25549K601K672K973K948K109J099J209K500L359K575R35r0l78p26j155
$$ plain form
53712 257922 260428 262855 264775 266008 266710 267221 267904 268977 270494 272522 275254 278772 282870 287292 291990
53697 291990 296883 301617 305849 309587 312908 315601 317497 318861 320023 320879 321252 321476 321966 322425 322208 321331
53681 321331 320369 319410 317976 316091 314549 313860 313697 313733 314202 315121 315621 314776 312778 310770 309740 309917 310863
53664 310863 311663 311317 309495 306923 304669 303176 302222 301596 301354 301476 301663 301638 301473 301530 302131 303296 304770
53647 304770 306304 307841 309325 310485 311078 311347 311909 313120 314811 316665 318556 320400 321984 323153 324046
53632 324046 325032 326553 328979 332337 336124 339685 342903 346258 350072 354008 357514 360559 363731 367739
53618 367739 372927 379114 385693 391915 397190 401245 404193 406574 409144 412346 415983 419543 422731 425549
53604 425549 428150 430822 433795 436743 438852 439951 441160 443660 447019 449594 450529 450439 450061 449335 448180
53589D48180r78l24j85r40j904k438k488k088j298p76j278k417k888k259j515
53574D24404j521j869j861j593j446j212n65R0N3o19j176j145p39l92k66k24l7
53557D09882L02M39O3n31o24O7J113K042K719K964K425J259L71M31J004J250J092
53540D26268J071J352J614J888K716M287N934O799O693O102N666N823O703Q087
53526D91003R546J0790J1827J2678J3174J3194J2961J2870J3090J3570J4305J5277
53514F44285J6120J6396J6430J7332J9707K2597K4363K4530K4157K4376K5227
53503H75520K6109K6646K6624K5699K3886K2044K1196K1393K1700K1302K0249
53492A132368J9185J8724J8992J9505J9590J9177J8954J9395J9956J9758J8846
$$ plain form
53589 448180 447202 446878 446693 445753 443849 441411 438923 436835 435537 434761 433483 431066 428178 425919 424404
53574 424404 422883 421014 419153 417560 416114 414902 414337 414427 414480 413861 412685 411540 410801 410409 410143 409919 409882
53557 409882 410184 410623 410686 410155 409531 409598 410711 412753 415472 418436 420861 422120 422491 422922 423926 425176 426268
53540 426268 427339 428691 430305 432193 434909 439196 445130 451929 458622 464724 470390 476213 482916 491003
53526 491003 500549 511339 523166 535844 549018 562212 575173 588043 601133 614703 629008 644285
53514 644285 660405 676801 693231 710563 730270 752867 777230 801760 825917 850293 875520
53503 875520 901629 928275 954899 980598 1004484 1026528 1047724 1069117 1090817 1112119 1132368
53492 1132368 1151553 1170277 1189269 1208774 1228364 1247541 1266495 1285890 1305846 1325604 1344450
53481A344450J8107J7995J8103J8007J7882J7948J7851J6997J5124J2300Q768
53470A523532N113K206M52p90k636n448q465j0732j2111j3184j4218j4724j4265
53457A434730j3459j3556j4965j6753j7967j8829k0083k1572k2332k1948k1054
53446A232212k0397k0135k0219k0716k1246k0767j8535j5083j1700q991o559m053
53434A043811j983j105j295j546j156m51o0K36J298L338N504O916P644Q277R114
53419A078542J0277J2078J4593J7157J9026K0362K1847K3478K4610K5143K5818
53408A292931K7113K8639K9947L1215L2692L4174L5500L7054L9202M1674M4026
53397A674167M6355M8951N1512N3371N4392N5051N5648N6044N6263N6695N7458
$$ plain form
53481 1344450 1362557 1380552 1398655 1416662 1434544 1452492 1470343 1487340 1502464 1514764 1523532
53470 1523532 1528645 1530851 1531303 1530513 1527877 1522429 1513964 1503232 1491121 1477937 1463719 1448995 1434730
53457 1434730 1421271 1407715 1392750 1375997 1358030 1339201 1319118 1297546 1275214 1253266 1232212
53446 1232212 1211815 1191680 1171461 1150745 1129499 1108732 1090197 1075114 1063414 1054423 1047864 1043811
53434 1043811 1041828 1040723 1039428 1037882 1036726 1036275 1036215 1036451 1037749 1041087 1046591 1053507 1061151 1069428 1078542
53419 1078542 1088819 1100897 1115490 1132647 1151673 1172035 1193882 1217360 1241970 1267113 1292931
53408 1292931 1320044 1348683 1378630 1409845 1442537 1476711 1512211 1549265 1588467 1630141 1674167
53397 1674167 1720522 1769473 1820985 1874356 1928748 1983799 2039447 2095491 2151754 2208449 2265907
53386B265907N7959N7556N6380N5000N3432N1053M7672M4149M1442L9282L6419
53375B806251L2180K7261K2709J8665J4426R483M053j261o145j1038j7010k4732
53363B874842l3345m0834m5952m9320n2156n4526n5633n5384n4628n3937n3114
53352B326013n1979n0715m9207m6984m4089m1362l9491l8464l8263l9238m1238
53341A844983m3022m3229m1628l8893l5661l2347k9470k7403k5881k4240k2095
53330A481114j9446j6411j3335j0976j0029j0453j1630j3144j4985j6960j8335
53319A325410j8288j6721j4520j2943j2508j2457j1557r531p325n766m484k598
53307A196712j97J620K066J599J358K124L928O274Q508J0226J1647J3424J5935
$$ plain form
53386 2265907 2323866 2381422 2437802 2492802 2546234 2597287 2644959 2689108 2730550 2769832 2806251
53375 2806251 2838431 2865692 2888401 2907066 2921492 2930975 2935028 2933767 2927622 2916584 2899574 2874842
53363 2874842 2841497 2800663 2754711 2705391 2653235 2598709 2543076 2487692 2433064 2379127 2326013
53352 2326013 2274034 2223319 2174112 2127128 2083039 2041677 2002186 1963722 1925459 1886221 1844983
53341 1844983 1801961 1758732 1717104 1678211 1642550 1610203 1580733 1553330 1527449 1503209 1481114
53330 1481114 1461668 1445257 1431922 1420946 1410917 1400464 1388834 1375690 1360705 1343745 1325410
53319 1325410 1307122 1290401 1275881 1262938 1250430 1237973 1226416 1216885 1209560 1203794 1199310 1196712
53307 1196712 1196515 1198135 1200201 1201800 1203158 1205282 1209210 1215484 1223992 1234218 1245865 1259289 1275224
53294A275224J8826K1424K3450K5097K6477K7371K7632K7477K7164K6557K5375
53283A552074K3741K2099K0671J9239J7507J5290J2420Q953N491K678K41k760
53271A697644o491r897j2151j3791j5763j8048k0139k2199k4630k6920k8125k8324
53259A471166k8452k8782k8801k8580k8893k9715k9965k9186k8214k7579k6536
53248A156463k4575k2717k2208k2724k3076k3078k3495k4471k5198k5057k4154
53237H95710k2734k0911j9037j7632j6805j6164j5330j4194j2782j1252r941r003
53225G09925q226p467p023p222p974r107j0705j2629j4201j5012j5537j6207j6361
53212E62254j5138j3052j1576j1128j0668r475q229p854q161q292p869p128o343
$$ plain form
53294 1275224 1294050 1315474 1338924 1364021 1390498 1417869 1445501 1472978 1500142 1526699 1552074
53283 1552074 1575815 1597914 1618585 1637824 1655331 1670621 1683041 1691994 1697485 1700163 1700404 1697644
53271 1697644 1691153 1681256 1669105 1655314 1639551 1621503 1601364 1579165 1554535 1527615 1499490 1471166
53259 1471166 1442714 1413932 1385131 1356551 1327658 1297943 1267978 1238792 1210578 1182999 1156463
53248 1156463 1131888 1109171 1086963 1064239 1041163 1018085 994590 970119 944921 919864 895710
53237 895710 872976 852065 833028 815396 798591 782427 767097 752903 740121 728869 718928 709925
53225 709925 701699 694232 687209 679987 672013 662906 652201 639572 625371 610359 594822 578615 562254
53212 562254 547116 534064 522488 511360 500692 491217 482988 475134 466973 458681 450812 443684 437341
53199D37341n722n646o414p769q972r327q654p451o626o706p220p130o064m738
53185C38902l992l803l603l250l173l644m321m645m416l763k782j477j88K87n96
53170B95536k304l494l331k202j000j27M20M68j67j064j519j478j475j574j161
53155B75528r1P03L16q85j791j983j904j828j418n01M20P79O47M59L76K86J96
53138B69309J75R6j49k08M30J586K324J979J004L91N64J084J374J326J203J153
53122B83641R59L01o59j138m93Q59J785J815J643J893K093J460K03q21j293j461
53106B90787j305p34m09j148k483k972k250j530j651j829j117q5Or82k021k270
53090B68007j662n97K56K74l73o72m7Q10R84N82J96k04q50j227o86L07P04L97
$$ plain form
53199 437341 431619 425973 419559 411790 402818 393491 384837 377386 370760 364054 356834 349704 343640 338902
53185 338902 334910 331107 327504 324254 321081 317437 313116 308471 304055 300292 297510 296033 295845 296132 295536
53170 295536 293232 289738 286407 284205 283205 283078 283498 283966 283799 282735 281216 279738 278263 276689 275528
53155 275528 275437 276140 276456 275571 273780 271797 269893 268065 266647 266146 266566 267345 267992 268451 268827 269113 269309
53138 269309 269484 269580 269431 269223 269653 271239 273563 275542 276546 276937 277501 278585 279959 281285 282488 283641
53122 283641 284600 284901 284242 283104 282611 283470 285255 287070 288713 290606 292699 294159 294362 293541 292248 290787
53106 290787 289482 288748 288339 287191 284708 281736 279486 277956 276305 274476 273359 273274 273280 272298 270277 268007
53090 268007 266345 265748 266004 266278 265905 265233 265186 265996 266980 267562 267758 267554 266704 265477 264791 265098 265802 266199
53072B66199J61K19N0m57p98r47j452k242k429j748j126j343j895j805q73L18
53056B49832J164J426J300J351J857K179J421j17r71l60Q40J405J212Q48N10R4
53040B63991k17k14j24j56j0N22R04N93M0Q6N89N60k60r29o86K7L39J39l1R0K74
53019B65527L88O53J218J810K020J709J042K77l17m97l05j73m45q25p56k94j13
53002B70919m15n24K9N91L37m10o87m56n22r65q48J89J186J380J457K328L393
52985B76982L193J545q8m09L80J259J647J613J361J001O22L25J51J54M16R40J526
52968B92618J871J730J149N61N21J120J812K026J801J582J417Q48l32j581k133
52953C05010j870j392j298j696k314k823k899k308j221l20k89j064j847j903j238
$$ plain form
53072 266199 266360 266579 266629 266172 265374 264427 262975 260733 258304 256556 255430 254087 252192 250387 249514 249832
53056 249832 250996 252422 253722 255073 256930 259109 260530 260413 259442 259082 259922 261327 262539 263387 263897 263991
53040 263991 263774 263560 263436 263280 263270 263792 264696 265289 265329 265415 266004 266564 266304 265375 264689 264716 265055 265194 265163 265253 265527
53019 265527 265915 266568 267786 269596 271616 273325 274367 274644 274327 273830 273525 273352 272907 272082 271326 271032 270919
53002 270919 270504 269980 270009 270600 270937 270527 269840 269384 268862 267897 267049 267238 268424 269804 271261 273589 276982
52985 276982 280175 281720 281632 281223 281603 282862 284509 286122 287483 288484 289106 289431 289582 289736 290152 291092 292618
52968 292618 294489 296219 297368 297929 298450 299570 301382 303408 305209 306791 308208 309056 308724 307143 305010
52953 305010 303140 301748 300450 298754 296440 293617 290718 288410 287189 286869 286580 285516 283669 281766 280528
52938B80528m28J1n8m83r81j275j236j001q26q37r02o55K03J461K272J871M89
52921B78153p46j007m93J23M78N05J20m93p11j42O93R25M34j71m88o22o93o06
52903B75259l85j56J70O79R84N94j89m49J17P96Q65M07p3k48J16J149K374K724
52885B84734J647j11j297j478j255j338j743j893j282j51N80L18l25j67R97K128
52869B79364K362K043K042K601L311L695L302J751o11k464k642j409j17K80j05
52854B93403q08j647k577l389l868m061m164m246m115l525k495j386n91j98j46
52839B56187n20j290j957j895j155l70J38O27J181J460J416J556K074K392K017
52824B61861J257N20l55j476k228k038j323q57o28k04K44K92L71J353L025M114
$$ plain form
52938 280528 280100 280111 280053 279570 278589 277314 276078 275077 274251 273414 272512 271857 272060 273521 275793 277664 278153
52921 278153 277407 276400 275907 276030 276508 277013 277133 276640 275929 275787 276480 277405 277839 277668 277180 276558 275865 275259
52903 275259 274874 274718 274888 275567 276551 277145 276956 276507 276624 277420 278285 278692 278619 278371 278487 279636 282010 284734
52885 284734 286381 286270 284973 283495 282240 280902 279159 277266 275984 275833 276413 276731 276406 276239 277236 279364
52869 279364 281726 283769 285811 288412 291723 295418 298720 300471 299860 297396 294754 293345 293228 293508 293403
52854 293403 292595 290948 288371 284982 281114 277053 272889 268643 264528 261003 258508 257122 256531 256333 256187
52839 256187 255667 254377 252420 250525 249370 249000 249138 249765 250946 252406 253822 255378 257452 259844 261861
52824 261861 263118 263638 263283 261807 259579 257541 256218 255361 254733 254529 254773 255065 255436 256789 259814 263928
52808B63928L902K890J678K53j312k433k831k967l171l049k347j702j815k343
52794B48681k361j623p08l9N78J433K393K983K725J530j2q81n07O28J546J746
52778B58112J386O75l27j341j779j327l70M02O07K87l21r44j302j280j007o53
52762B50818j91L76P30M55l07p89m16M51R64Q14N54Q04J519K163K338K119J862
52745B64264J894K228K516K364J835J455J643K196K473K041J029Rm04K0R46J722
52729B88231J926J593R46J26p69j573k146k446k381j883j192q29r98j242r27m0
52713B76396P69R26M56j49m45l79k16j57q1J87M41K26m93j095r40q1Q34J180Q00
52694B78179O5l32M8Q49J191O19l89j058j116q17m86l47m89o98o15k61j04l28
$$ plain form
52808 263928 267830 270720 272398 272651 271339 268906 266075 263108 259937 256888 254541 252839 251024 248681
52794 248681 246320 244697 243989 243950 244528 245961 248354 251337 254062 255592 255580 254699 254192 254820 256366 258112
52778 258112 259498 260173 259846 258505 256726 255399 255029 255431 256038 256325 256004 255060 253758 252478 251471 250818
52762 250818 250627 251003 251733 252188 251881 251092 250676 251127 252091 252905 253459 254263 255782 257945 260283 262402 264264
52745 264264 266158 268386 270902 273266 275101 276556 278199 280395 282868 284909 285938 285947 285543 285563 286509 288231
52729 288231 290157 291750 292696 292822 292053 290480 288334 285888 283507 281624 280432 279603 278605 277363 276436 276396
52713 276396 277165 278091 278547 278398 277953 277574 277358 277201 277120 277307 277748 277974 277481 276386 275446 275365 276199 277379 278179
52694 278179 278244 277912 277960 278809 280000 280619 280230 279172 278056 277239 276753 276406 275917 275219 274604 274343 274239 273911
52676B73911m84k13J63K62L74Q62J287Q93j49q22n67K04Q99J357J549J396J054
52659B81976Q73Q53O60L18L80J175K324L231L558L160K023N08p58j510j958k191
52643B94622j971j369r98j233j613j442o50K68Q70J023Q55P98J321K286L016L340
52627B99123M011N455O495N345J859k011m222m491l918l442l175k893k489j988
52613B93659j464j063q82p89n56k30j40m66q95r02l38L86P19N13J35J19O57J363
52595B89826J559R37j4m20Q3R57J358R79K20l11l50j37o8j35J85J229K299K135
52577C00332N23j120j335m61j20r87j957j762o45J12j09o93p99l84l1j40n53q94
52559B88977j004q68l38O77J703J850P86p69j867k302k329j761k39J685K591J761
$$ plain form
52676 273911 273427 273214 273377 273639 274013 274875 276162 277055 276906 276084 275517 275721 276620 277977 279526 280922 281976
52659 281976 282849 283702 284362 284680 285060 286235 288559 291790 295348 298508 300531 301039 300281 298771 296813 294622
52643 294622 292651 291282 290284 289051 287438 285996 285346 285614 286484 287507 288362 289160 290481 292767 295783 299123
52627 299123 303134 308589 315084 320429 322288 320277 316055 311564 307646 304204 301029 298136 295647 293659
52613 293659 292195 291132 290250 289461 288905 288675 288535 288069 287174 286272 285934 286320 287039 287552 287687 287806 288463 289826
52595 289826 291385 292322 292308 291888 291971 292928 294286 295265 295485 295174 294824 294687 294619 294484 294669 295898 298197 300332
52577 300332 300855 299735 298400 297939 297819 296832 294875 293113 292468 292580 292471 291778 290979 290595 290564 290424 289871 288977
52559 288977 287973 287105 286767 287444 289147 290997 291783 291014 289147 286845 284516 282755 282516 284201 286792 288553
52543B88553L9j203j465j113m85L18J070J447J420J239J030P41M03J89J65K34
52527B92582L05L44L34L07L11K73L7k92l56jM81Q57J272J802K039J727J483K086
52509C05591L166L469K630J720J587J506L27j625k913l073l125l760m179l405
52495B97916j992j313j618j810j160k42J80K71O20J203J476J203O43J00k27j55
52479B95095K90O83O47L63K32K30N4k08k08J7J31K68R44K014K489J915J257J738
52461C07951L127L958L323J819N56k17j137k613m043m383l419k242k189l272m082
52446B93137l409j576J32R85J256J321J067M20j80l16k88p24j570k023j556n57
52430B86119K93Q05J112J059M22l98n70J37J007J309J135J047J274J667K098K474
$$ plain form
52543 288553 288592 287389 285924 284811 284326 284644 285714 287161 288581 289820 290850 291591 291994 292183 292348 292582
52527 292582 292887 293231 293565 293872 294183 294456 294493 294201 293845 293844 294325 295182 296454 298256 300295 302022 303505 305591
52509 305591 308757 312226 314856 316576 318163 319669 319996 318371 315458 312385 309260 305500 301321 297916
52495 297916 295924 294611 292993 291183 290023 289781 289961 290232 290852 292055 293531 294734 295377 295477 295250 295095
52479 295095 295385 296068 296715 297078 297310 297540 297594 297386 297178 297195 297326 297594 298538 300552 303041 304956 306213 307951
52461 307951 311078 315036 318359 320178 320734 320517 319380 316767 312724 308341 304922 302680 300491 297219 293137
52446 293137 289728 288152 288284 289269 290525 291846 292913 293333 293153 292837 292549 291825 290255 288232 286676 286119
52430 286119 286412 287217 288329 289388 289810 289412 288842 288979 289986 291295 292430 293477 294751 296418 298516 300990
52414C00990K580K368K210K540L356M458N966Q057J0413J2423J3834J4610J4182
52401C97987J1631O789P42n037r564j2333j3061j1928r819p800o433n614m920
52388C30640l953k632j312m86k99m18l94O1R52J911K323K013J668K074K984L434
52372C38566L152K980L613M678N318N150M299L067J988J603J743J512M57p87j422
52357C75917j471j315q78j6P68R09P53J058J745K049J793J646J985K432K648K862
52341C92885L264L605L725L940M508N219N820O392P005P483P889Q803J0531J2390
52327D83459J3420J3640J4061J5348J7038J8227J8714J9056J9647K0075J9564
52316F72249J7979J6226J5535J6368J8054J9490K0041J9861J9541J9603K0138
$$ plain form
52414 300990 303570 305938 308148 310688 314044 318502 324468 332525 342938 355361 369195 383805 397987
52401 397987 409618 416407 417149 412112 402548 390215 377154 365226 355407 347607 341174 335560 330640
52388 330640 326687 324055 322743 322257 321958 321540 321146 321207 322159 324070 326393 328406 330074 332148 335132 338566
52372 338566 341718 344698 348311 352989 358307 363457 367756 370823 372811 374414 376157 377669 378126 377339 375917
52357 375917 374446 373131 372253 372237 373005 373914 374667 375725 377470 379519 381312 382958 384943 387375 390023 392885
52341 392885 396149 399754 403479 407419 411927 417146 422966 429358 436363 443846 451735 460538 471069 483459
52327 483459 496879 510519 524580 539928 556966 575193 593907 612963 632610 652685 672249
52316 672249 690228 706454 721989 738357 756411 775901 795942 815803 835344 854947 875085
52305H75085K0712K0679J9750J8319J7088J6371J5827J4979J3785J2496J1089
52294A056180R125O314K983j91k821m973o815q304r243r511r231q787q518q274
52280I97934p453n798l926k668j987j096L45J835L038M515O896R677J1517J1647
52266A024476J0604R573R401J0199J1515J2746J3604J4246J4898J5381J5303J4667
52254A176613J4116J4376J5459J6487J6310J4357J0995P110L430K52k383m529
52242A282593o333p960r394j0504j1274j1778j2017j2008j2042j2395j2800j2565
52230A151523j1449j0065r189q972q996q817q238p272o163n224m553l966l307
52217A055312k530j538l13P95J451J997L192N029O514O869O356N512M348K912
$$ plain form
52305 875085 895797 916476 936226 954545 971633 988004 1003831 1018810 1032595 1045091 1056180
52294 1056180 1065305 1071619 1074602 1074411 1071590 1066617 1059802 1051498 1042255 1032744 1023513 1014726 1006208 997934
52280 997934 990481 984683 980757 978089 976102 975006 975351 977186 980224 984739 991635 1001312 1012829 1024476
52266 1024476 1035080 1044653 1054054 1064253 1075768 1088514 1102118 1116364 1131262 1146643 1161946 1176613
52254 1176613 1190729 1205105 1220564 1237051 1253361 1267718 1278713 1285823 1289253 1289505 1287122 1282593
52242 1282593 1276260 1268300 1258906 1248402 1237128 1225350 1213333 1201325 1189283 1176888 1164088 1151523
52230 1151523 1140074 1130009 1120820 1111848 1102852 1094035 1085797 1078525 1072362 1067138 1062585 1058619 1055312
52217 1055312 1052782 1051244 1050931 1051726 1053177 1055174 1058366 1063395 1069909 1076778 1083134 1088646 1092994 1095906
52203A095906J921K025K865L634M207M962N829O343O443O420O290N976N826O109
52189A164756O152N031L063J573R98K83j512l998o283q131r678j0689j0820j0247
52175A120498r435q580p646o656n595m368l132k329k042j738r86k4P95J598K533
52160A072893L192L163K873L094L687L670K698J656J422J631J297K83n89p46m62
52145A099762k1R06K469L755L529J859J05p98j245j821k096j302M34K316M020
52130A111872N734P436Q951J0640J3087J6149J9046K1476K3774K6013K7792K9067
$$ plain form
52203 1095906 1097827 1099852 1102717 1106351 1110558 1115520 1121349 1127692 1134135 1140555 1146845 1152821 1158647 1164756
52189 1164756 1170908 1175939 1179002 1180575 1181573 1181856 1180344 1176346 1170063 1161932 1152254 1141565 1130745 1120498
52175 1120498 1111063 1102483 1094837 1088181 1082586 1078218 1075086 1072757 1070715 1068977 1067991 1067967 1068762 1070360 1072893
52160 1072893 1076085 1079248 1082121 1085215 1088902 1092572 1095270 1096926 1098348 1099979 1101276 1101559 1100970 1100224 1099762
52145 1099762 1099741 1100647 1103116 1106871 1110400 1112259 1112364 1111566 1110321 1108500 1106404 1105102 1105536 1107852 1111872
52130 1111872 1117606 1125042 1133993 1144633 1157720 1173869 1192915 1214391 1238165 1264178 1291970 1321037
$$ [...]
##END NTUPLES=NMR SPECTRUM
##END=
