
##TITLE=AC1243_NTAAH12033_6610012_zTQ3Pv6xJF
##JCAMPDX= 6.0         $$ Bruker NMR JCAMP-DX V2.0
##DATA TYPE= NMR SPECTRUM
##DATA CLASS= NTUPLES
##ORIGIN= BRUKER
##OWNER= Administrator
$$ 1.72 TOPSPIN		Version 2.1
$$ 2012-08-01 23:59:15.921 -0500  Administrator@TOPSPIN
$$ Compression mode = diff/dup
##.OBSERVE FREQUENCY= 400.02188249412
##.OBSERVE NUCLEUS= ^1H
##.ACQUISITION MODE= SIMULTANEOUS (DQD)
##.ACQUISITION SCHEME= undefined
##.AVERAGES= 8
##.DIGITISER RES= 22
##SPECTROMETER/DATA SYSTEM= spect
##.PULSE SEQUENCE= zg30
##.SOLVENT NAME= COFFEE_meoh
##.SHIFT REFERENCE= INTERNAL, COFFEE_meoh, 1, 14.98509
##AUDIT TRAIL= $$ (NUMBER, WHEN, WHO, WHERE, PROCESS, VERSION, WHAT)
$$ ##TITLE= Audit trail, TOPSPIN		Version 2.1
$$ ##JCAMPDX= 5.01
$$ ##ORIGIN= Bruker BioSpin GmbH
$$ ##OWNER= Administrator
$$ $$ C:\Bruker\TOPSPIN/data/COFFEE/nmr/AC1243_NTAAH12033_6610012_zTQ3Pv6xJF/10/pdata/1/auditp.txt
$$ ##AUDIT TRAIL=  $$ (NUMBER, WHEN, WHO, WHERE, PROCESS, VERSION, WHAT)
(   1,<2012-08-01 23:58:54.484 -0500>,<Administrator>,<TOPSPIN>,<go>,<TOPSPIN 2.1>,
      <created by zg
	started at 2012-08-01 23:57:46.359 -0500,
	POWCHK enabled, PULCHK disabled,
       configuration hash MD5:
       6B 1B 68 BB D9 2E 58 E2 7F 35 AD 54 07 DF 0E 41
       data hash MD5: 64K
       DD 24 A1 E9 0B 55 0A 05 79 02 2F E5 47 5F 67 3A>)
(   2,<2012-08-01 23:59:04.140 -0500>,<Administrator>,<TOPSPIN>,<proc1d>,<TOPSPIN 2.1>,
      <Start of raw data processing
       efp LB = 0 FT_mod = 6 PKNL = 1 PHC0 = 0 PHC1 = 0 SI = 32K 
       data hash MD5: 32K
       A8 DC 73 BB 3A 03 21 2A 58 37 08 99 6A 57 BC 2B>)
(   3,<2012-08-01 23:59:05.031 -0500>,<Administrator>,<TOPSPIN>,<proc1d>,<TOPSPIN 2.1>,
      <pk PHC0 = 179.4232 PHC1 = 0 
       data hash MD5: 32K
       E4 47 9A 13 36 C8 15 F6 DD 05 19 A3 3A B5 91 10>)
(   4,<2012-08-01 23:59:05.468 -0500>,<Administrator>,<TOPSPIN>,<proc1d>,<TOPSPIN 2.1>,
      <abs ABSG = 1 
       data hash MD5: 32K
       41 B2 14 7D EA 81 52 58 D6 31 98 09 CB B9 1E 2B>)
(   5,<2012-08-01 23:59:05.750 -0500>,<Administrator>,<TOPSPIN>,<proc1d>,<TOPSPIN 2.1>,
      <abs ABSG = 2 
       data hash MD5: 32K
       B1 FA 18 F2 86 AB 68 3B 4B 63 F7 46 55 36 F9 01>)
(   6,<2012-08-01 23:59:06.000 -0500>,<Administrator>,<TOPSPIN>,<proc1d>,<TOPSPIN 2.1>,
      <abs ABSG = 3 
       data hash MD5: 32K
       F0 CA 12 0E 9C 3E D5 1C B4 CC 90 3C 76 AB 08 F9>)
(   7,<2012-08-01 23:59:06.250 -0500>,<Administrator>,<TOPSPIN>,<proc1d>,<TOPSPIN 2.1>,
      <abs ABSG = 4 
       data hash MD5: 32K
       6B 2A D6 60 70 37 CC 1A E9 3B E1 8A 9D 6B D1 13>)
(   8,<2012-08-01 23:59:06.531 -0500>,<Administrator>,<TOPSPIN>,<proc1d>,<TOPSPIN 2.1>,
      <abs ABSG = 5 
       data hash MD5: 32K
       FD A8 79 3B D2 3E 41 4F 46 B0 41 6E A9 5B 16 84>)
$$ ##END=
$$ 
$$ $$ hash MD5
$$ $$ 1E E9 CF 7D 9B 96 C6 14 2C F3 0D 9F 0B B2 A6 6F
##$RELAX= 
##$RELAX= 
##$RELAX= 
##$RELAX= 
##$RELAX= 
##$RELAX= 
##$RELAX= 
$$ Bruker specific parameters
$$ --------------------------
$$ [...]
##$TP= (0..7)
150 150 150 150 150 150 150 150
##$TP07= 0
##$TPNAME0= <>
##$TPNAME1= <>
##$TPNAME2= <>
##$TPNAME3= <>
##$TPNAME4= <>
##$TPNAME5= <>
##$TPNAME6= <>
##$TPNAME7= <>
##$TPOAL= (0..7)
0.5 0.5 0.5 0.5 0.5 0.5 0.5 0.5
##$TPOFFS= (0..7)
0 0 0 0 0 0 0 0
##$TUNHIN= 0
##$TUNHOUT= 0
##$TUNXOUT= 0
##$USERA1= <user>
##$USERA2= <user>
##$USERA3= <user>
##$USERA4= <user>
##$USERA5= <user>
##$V9= 5
##$VALIST= <valist>
##$VCLIST= <CCCCCCCCCCCCCCC>
##$VD= 0
##$VDLIST= <DDDDDDDDDDDDDDD>
##$VPLIST= <PPPPPPPPPPPPPPP>
##$VTLIST= <TTTTTTTTTTTTTTT>
##$WBST= 1024
##$WBSW= 4
##$XGAIN= (0..3)
0 0 0 0
##$XL= 0
##$YL= 0
##$YMAX_a= 482225
##$YMIN_a= -632798
##$ZGOPTNS= <>
##$ZL1= 120
##$ZL2= 120
##$ZL3= 120
##$ZL4= 120
##$ABSF1= 14.98509
##$ABSF2= -5.573092
##$ABSG= 5
##$ABSL= 3
##$ALPHA= 0
##$AQORDER= 0
##$ASSFAC= 0
##$ASSFACI= 0
##$ASSFACX= 0
##$ASSWID= 0
##$AUNMP= <proc_prof1d_extract_pilot.lims>
##$AXLEFT= 0
##$AXNAME= <>
##$AXNUC= <1H>
##$AXRIGHT= 0
##$AXTYPE= 0
##$AXUNIT= <>
##$AZFE= 0.1
##$AZFW= 0.1
##$BCFW= 0
##$BC_mod= 0
##$BYTORDP= 0
##$COROFFS= 0
##$CY= 15
##$DATMOD= 1
##$DC= 0
##$DFILT= <>
##$DTYPP= 0
##$F1P= 0
##$F2P= 0
##$FCOR= 0.5
##$FTSIZE= 32768
##$FT_mod= 6
##$GAMMA= 0
##$GB= 0
##$INTBC= 1
##$INTSCL= 1
##$ISEN= 128
##$LB= 0
##$LEV0= 0
##$LPBIN= 0
##$MAXI= 10000
##$MC2= 0
##$MEAN= 0
##$ME_mod= 0
##$MI= 0
##$NCOEF= 0
##$NC_proc= -8
##$NLEV= 6
##$NOISF1= 0
##$NOISF2= 0
##$NSP= 0
##$NTH_PI= 0
##$NZP= 0
##$OFFSET= 14.98509
##$PC= 1
##$PHC0= 179.4232
##$PHC1= 0
##$PH_mod= 1
##$PKNL= yes
##$PPARMOD= 0
##$PPDIAG= 0
##$PPIPTYP= 0
##$PPMPNUM= 2147483647
##$PPRESOL= 1
##$PSCAL= 4
##$PSIGN= 0
##$PYNMP= <proc.py>
##$REVERSE= no
##$SF= 400.02
##$SI= 32768
##$SIGF1= 0
##$SIGF2= 0
##$SINO= 400
##$SIOLD= 32768
##$SPECTYP= <>
##$SREGLST= <1H.CDCl3>
##$SSB= 0
##$STSI= 32768
##$STSR= 0
##$SW_p= 8223.68421052631
##$SYMM= 0
##$S_DEV= 0
##$TDeff= 65536
##$TDoff= 0
##$TI= <>
##$TILT= no
##$TM1= 0
##$TM2= 0
##$TOPLEV= 0
##$USERP1= <user>
##$USERP2= <user>
##$USERP3= <user>
##$USERP4= <user>
##$USERP5= <user>
##$WDW= 1
##$XDIM= 32768
##$YMAX_p= 459798213
##$YMIN_p= -739443
##$CURPLOT= <Network HP LaserJet P1505>
##$CURPRIN= <$Network HP LaserJet P1505>
##$DFORMAT= <normdp>
##$LAYOUT= <+/1D_H.xwp>
##$LFORMAT= <normlp>
##$PFORMAT= <normpl>
##$SURQMSG= 1
$$ End of Bruker specific parameters
$$ ---------------------------------
##NTUPLES= NMR SPECTRUM
##VAR_NAME=  FREQUENCY,     SPECTRUM/REAL,   SPECTRUM/IMAG
##SYMBOL=    X,             R,               I
##VAR_TYPE=  INDEPENDENT,   DEPENDENT,       DEPENDENT
##VAR_FORM=  AFFN,          ASDF,            ASDF
##VAR_DIM=   32768,         32768,           32768
##UNITS=     HZ,            ARBITRARY UNITS, ARBITRARY UNITS
##FACTOR=    0.250966925370066, 1,           1
##FIRST=     8223.43324360094, -45269,       67388
##LAST=      0,             32929,           79430
##MIN=       0,             -739443,         0
##MAX=       8223.43324360094, 459798213,    0
$$ Real data points
##PAGE= N=1
##DATA TABLE= (X++(R..R)), XYDATA
$$ [...]
$$ plain form
19462 -280386 -93227 -144512 316439 -209530 60473 -172225 -217030 -58063 -82927 -15226 89476
19450 24679 -199786 -123017 -369392 -323000 -42357 37418 -379344 -139445 32127 31768 -133430
19438 78997 -739443 31256 -187459 -132659 -190823 275659 424497 -21354 -288099 79060 -129552
19426 -65150 15641 -27555 -34282 -160379 -268681 -6817 -258425 -62517 283545 82328 -192808
19414 234444 161957 -319967 -229863 -8379 210284 -271569 83846 -142763 -7226 -566035 -144588
19402 -207068 -411331 -108251 -100670 369569 -276777 245574 -40487 -130874 117929 61684
19392 61684 -31100 -184798 -155884 -75176 236387 -34853 130991 -66012 -125248 530 138006
19381 138006 184392 -263563 -168968 180270 221528 223632 -176790 -38918 -89210 -7026 -171860
$$ packed form
19462b80386i3227n1285C16439b09530F0473a72225m4805e8063k4864a5226H9476
19450B4679a99786P6769k46375M6392d2357C7418c79344a39445C2127l59a33430
19438G8997g39443C1256a87459N4800n8164B75659J48838b1354k66745G9060a29552
19426f5150A5641b7555o727j26097j08302f817k51608f2517B83545H2328a92808
19414B34444p2487c19967R0104h379B10284b71569H3846a42763g226n58809a44588
19402b07068k04263a08251P581C69569b76777B45574d0487r0387A17929n6245
19392F1684c1100j53698K8914g5176B36387c4853A30991f6012n9236E30J37476
19381A38006M6386b63563R4595A80270M1258K104a76790c8918n0292g026j64834
$$ plain form
19370 -171860 -138502 -48243 158955 -27155 -217171 -15398 -159837 -106782 362034 -29245 240452
19358 -294905 -35298 -408300 -380753 -188157 -74531 -341178 278425 44072 -94958 -195285
19348 -195285 -354042 -350735 -194573 -229519 -136589 -59095 -265007 133686 -242244 -240950 -208100
19337 -208100 -84038 -157748 6202 315220 34553 104314 -335007 23758 -98988 16536 152379
19326 152379 -159458 -190192 82289 13020 156562 213748 -163573 -62262 -164519 -147297 -95897
19315 -95897 100552 -19723 -386518 136718 -130296 74299 293061 75174 -181280 -411858
19305 -411858 -145683 -75698 396689 -159335 135003 -40587 -53259 -237676 167982 -6265
19294 -44202 -168611 230453 91878 -81820 240182 198921 102194 -37326 82915 -64969 -254701
$$ packed form
19370a71860L3358d8243A58955b7155j90016a5398j44439N3055C62034b9245B40452
19358b94905c5298l73002K7547a88157g4531k66647B78425D4072i4958j00327
19348a95285j58757L307J56162l4946R2930e9095k05912A33686b42244J294L2850
19337b08100h4038p3710F202L09018C4553O9761c35007B3758i8988A6536J35843
19326A52379a59458l0734H2289A3020J43542N7186a63573f2262j02257J7222N1400
19315i5897A00552a9723l66795A36718a30296G4299K18762G5174a81280k30578
19305d11858a45683O9985C96689a59335A35003d0587j2672j84417A67982f265
19294d4202j24409B30453I1878h1820B40182m1261r6727c7326H2915f4969j89732
$$ plain form
19283 -254701 -225419 -46562 49699 -121304 -101283 -177585 -217696 -92362 -216110 -30449 -231507
19272 -231507 -35714 66314 5640 53597 30514 159514 -303215 -35299 -216874 154896 -217857
19260 -238010 -555296 55901 -98534 -43113 -146439 -190075 -268957 -180870 -60366 12389 -44607
19248 47179 -23428 -97203 65081 7806 150303 -133111 104206 244165 -282423 -111580 248009
19236 -174879 -96541 -308 310685 -158867 -279386 -186540 -81332 -240177 -252890 -143823 6382
19224 -166894 -124300 -256590 -91294 -37995 -235704 199600 -91296 -184670 -193622 -104690 -28220
19212 149180 -357310 124760 -84778 -159784 190940 -266912 -31280 -380810 -41493 -95265
19202 -95265 129491 -76638 99335 427852 -164820 -173047 82379 -85190 -163717 -265333 61596
$$ packed form
19283b54701K9282d6562D9699a21304K0021p6302m0111i2362j23748c0449k01058
19272b31507c5714F6314E640M7957k3083J29000c03215c5299j81575A54896b17857
19260b38010l17286E5901i8534d3113j03326m3636p8882Q8087f0366A2389d4607
19248D7179b3428p3775F5081G806J42497a33111A04206J39959b82423a11580B48009
19236a74879P8338c08C10685a58867j20519R2846h1332j58845j2713J09067F382
19224a66894M2594j32290i1294c7995j97709A99600i1296r3374q952Q8932b8220
19212A49180c57310A24760h4778p5006A90940b66912c1280l49530d1493n3772
19202i5265A29491g6638I9335L28517a64820q227H2379h5190p8527j01616F1596
$$ plain form
19190 91793 -336733 -3970 -304630 114269 70925 -60512 41059 92956 -43100 110320 13930
19178 -170773 110403 267137 -2586 -342046 142431 -129944 -192777 -215998 -141168 -148708 71764
19166 -15935 -21634 -321847 -65373 -138204 -210968 -91551 98078 -82540 -161331 86354 106720 -42608
19153 -132659 -108631 66021 -131273 -224110 -157006 83298 -341528 -2617 68796 -14607 9552
19141 -130878 -203175 -30011 -176966 -94885 210443 -58876 -353343 -212353 -25157 145844
19130 25130 53083 -128830 129259 -75614 -293050 11346 33359 -131172 -265644 24578 221516
19119 221516 93062 -50398 -407577 -284254 29094 -60815 -69803 140472 216338 130193 235709
19108 235709 12459 -171198 -97649 -224062 -80678 -218595 -525018 -62380 -259788 -28175
$$ packed form
19190I1793c36733c970l00660A14269m3344f0512D1059N1897d3100A10320A3930
19178a70773A10403J56734b586l39460A42431a29944o2833k3221P4830p540G1764
19166a5935n699l00213f5373p2831p2764i1551I8078h2540p8791H6354K0366d2608
19153a32659K4028F6021a31273r2837O7104H3298c41528b617F8796a4607I552
19141a30878p2297c0011j46955Q2081B10443e8876k94467J40990b5157A45844
19130B5130K7953a28830A29259g5614k17436A1346K2013a31172j34472B4578J96938
19119B21516I3062e0398l57179J23323B9094f0815q988A40472P5866q6145J05516
19108B35709A2459a71198P3549j26413h0678j37917l06423f2380j97408b8175
$$ plain form
19097 -253900 -134500 -145635 91556 -119233 -50373 34876 -26328 -172971 -303013 -162159
19087 -162159 -87126 -94317 107342 -81110 -146974 -49111 220829 170239 -337394 -24934 -9083
19075 251838 -124088 -53555 -402347 -156119 11992 180487 -162377 -50957 14725 221180
19065 221180 -93020 83014 -48958 -237514 -387498 -205158 -112140 62895 -73205 -44850 -142118
19054 -142118 48804 -17359 -224852 -114824 16882 7059 -13008 2438 149331 -186908 -146690
19043 -146690 25491 -322881 126060 -155532 -147685 97334 54133 340770 262936 -4988 -270269
19032 -270269 126856 243917 292164 -151246 -38251 -41872 108439 273437 304667 66069 -5119
19020 262015 263571 204460 -277121 298037 -139481 -181716 -239198 185155 -90269 -329018 63467
$$ packed form
19097b53900J19400j1135I1556a19233e0373C4876b6328j46643j30042J40854
19087a62159P5033p191A07342h1110o5864d9111B20829n0590c37394b4934i083
19075B51838a24088e3555l48792a56119A1992J68495a62377e0957A4725K06455
19065B21180i3020H3014d8958j88556j49984J82340R3018F2895g3205K8355r7268
19054a42118D8804a7359k07493J10028A6882G059a3008B438J46893a86908M0218
19043a46690B5491c22881A26060a55532P847I7334m3201K86637p7834d988k65281
19032b70269A26856J17061M8247a51246c8251l621A08439J64998L1230F6069e119
19020B62015J556n9111b77121B98037a39481m2235n7482A85155i0269k38749F3467
$$ plain form
19008 133163 200826 -30584 68211 -40807 -134768 -150220 32706 -104912 -69469 115848 201660
18997 201660 -171826 253077 63552 59722 -144407 -57464 -249954 -1006 -286762 93541 -147419
18985 -108707 329945 -209843 52140 46989 159284 -154136 -66239 32223 9794 -379857 -40150
18973 9618 63263 184421 467797 179088 330839 22647 143919 139050 69587 31021 -94633
18961 93513 -11806 89300 68702 -251735 112754 39179 133040 6616 129159 -363370 -18754
18949 -232526 -14293 -112431 124360 71658 -326189 -60288 138985 107437 796 -129054 -159323
18938 -159323 170728 -130422 133020 187106 -25326 28235 -301581 -66785 200433 77097
18927 65878 -51540 20926 28807 -24703 -387583 -89450 227090 -202338 -435472 130624 140384
$$ packed form
19008A33163O7663c0584F8211d0807r3961j5452C2706a04912L5443A15848Q5812
18997B01660a71826B53077F3552l830a44407e7464j92490a006k85756I3541a47419
18985a08707C29945b09843E2140n151J12295a54136f6239C2223I794c79857d0150
18973I618N3645J21158K83376A79088J51751B2647J21272m869o9463C1021i4633
18961I3513a1806H9300k0598b51735A12754C9179R3861F616J22543c63370a8754
18949b32526a4293r8138A24360n2702c26189f0288A38985l1548G96a29054l0269
18938a59323A70728a30422A33020N4086b5326B8235c01581f6785B00433G7097
18927F5878e1540B0926P881b4703l62880h9450B27090b02338k33134A30624R760
$$ plain form
18916 140384 -183667 179310 -192492 133569 -53427 -53556 -118939 43749 528261 814512 333815
18904 165468 37642 236389 -110478 20932 -379871 314641 -182814 -99173 -246790 -20832
18893 -27805 -245589 -69120 -292455 41925 35952 87142 -290225 55014 131753 -31841 -36683
18882 -36683 -97014 -134258 23522 204143 250431 -6888 -129784 -60832 -153330 -8112 124221
18870 -67053 -302351 -240538 -89719 -24427 22654 -179349 -96455 133667 293854 -131048 -70192
18859 -70192 -42279 -273896 -361435 2549 -83015 218658 -292625 261132 -166422 110773 46757
18847 148671 120766 -161020 11186 -188078 -8379 -121438 -144724 -141668 -156133 34323 76927
18836 76927 252119 135884 324372 -292092 97215 116393 137364 -253684 -58547 -13989 87093
$$ packed form
18916A40384a83667A79310a92492A33569e3427j29o5383D3749M84512K86251C33815
18904A65468C7642J98747a10478B0932c79871C14641a82814Q3641j47617b0832
18893b7805k17784f9120k23335D1925n973N1190b90225E5014P6739c1841m842
18882c6683o0331l7244B3522J80621M6288f888j22896f0832r2498h112A24221
18870f7053k35298O1813h9719b4427B2654a79349Q2894A33667J60187a31048O0856
18859g0192K7913k31617q7539B549h3015B18658b92625B61132a66422A10773D6757
18847A48671k7905a61020A1186a88078h379j13059k3286L056j4465C4323M2604
18836G6927J75192j16235J88488b92092I7215J9178K0971b53684e8547a3989H7093
$$ plain form
18824 -182990 -255676 127216 -451393 -21736 -45797 82701 -54468 -55240 -5222 159492 153372 244598
18812 244598 240456 -38522 242269 591434 163683 177396 341761 -1103 -2928 -81847 -64068
18801 -64068 184090 -60904 202121 -171838 -42453 -191151 -137867 -112443 -531814 -95217 199362
18789 -206627 -328478 -209959 6804 13899 97618 -139818 -263604 23330 54084 60830 -7048
18777 -36673 -51847 -56049 -130537 254900 21627 6311 -236169 73174 -54630 -89259 -182405 28954
18764 23068 -37906 -45686 -190696 -197020 -121633 -291925 33256 188563 -127362 120195 -228439
18752 -19473 -122917 -139469 -282166 -407241 -304670 -147724 -238126 429416 -227940 139422
18741 -281836 216860 -65923 221740 247398 30764 -56409 -206938 -187906 -154698 107299 50938
$$ packed form
18824a82990p2686A27216d51393b1736k4061H2701e4468p72e222A59492o120R1226
18812B44598m142c8522B42269L49165A63683J3713J64365a103j825p8919J7779
18801f4068A84090f0904B02121a71838d2453j48698N3284K5424m19371i5217A99362
18789b06627j21851J18519F804P095Q3719a39818j23786B3330L0754O746g048
18777c6673j5174m202p4488B54900B1627F311b36169G3174e4630l4629r3146B8954
18764B3068c7906p780j45010o324P5387j70292C3256J55307a27362A20195b28439
18752a9473j03444j6552j42697j25075J02571a47724r0402D29416b27940A39422
18741b81836B16860f5923B21740K5658C0764e6409j50529J9032L3208A07299E0938
$$ plain form
18729 75643 -205030 43844 105152 28861 255864 -124060 31133 -13309 -27342 -121718 34791
18717 -95122 -237097 -96504 -287372 -111707 -298530 -365602 318395 -190433 -243019 -88790
18706 -327979 -26109 -104328 -45041 70186 338995 -268231 -161954 243104 -309719 -386999
18696 -386999 161625 -77308 81348 40247 -148032 75747 159442 62907 -57265 -67366 -280945
18685 -280945 289009 -72721 -162899 -164689 -248994 -81685 -52224 69836 268277 242803 -29627
18673 -136530 -8740 -50693 -138996 56772 -64377 -205273 -70767 139521 -148174 -52109 -425748
18662 -425748 19418 210627 -15060 -147141 310228 67099 102742 -74199 -463519 -171487
18651 73089 -190593 125387 -77235 -106106 -40690 -75683 -51011 173578 210853 44190 -125246
$$ packed form
18729G5643b05030D3844O1308B8861K27003a24060C1133a3309j4033r4376C4791
18717i5122j41975i6504j90868a11707j86823o7072C18395a90433n2586h8790
18706c27979b6109p8219d5041G0186K68809b68231J06277B43104c09719p7280
18696c86999A61625g7308H1348D0247a48032G5747Q3695F2907e7265j0101k13579
18685b80945B89009g2721r0178j790q4305h1685K9461F9836J98441k5474b9627
18673a36530h740m1953q8303E6772f4377j40896g0767A39521a48174e2109l73639
18662d25748A9418J91209a5060j32081C10228F7099L5643g4199l89320a71487
18651G3089a90593A25387g7235k8871d0690l4993K4672A73578L7275D4190a25246
$$ plain form
18639 -246954 -125131 89280 -203143 -323916 86679 -154005 -196259 103025 -288105 125235
18628 172766 -43446 -54356 -19867 141552 213731 -47918 116813 -226034 166732 139 181254
18617 181254 -40779 116758 -333280 141997 -77294 -40751 24429 50066 -67904 41769 -150715
18605 -33424 -103956 167990 -189177 -400584 89964 -233105 -8895 -254272 -258582 -75938 181391
18593 -59896 -97066 72618 265803 26312 81053 -169849 -380978 341425 -308448 -32632 -217434
18582 -217434 -336586 -21502 -234748 -136083 -59904 110910 -288643 84378 -256948 7203 -49340
18570 -376755 164658 124193 -174676 30318 -18379 85806 -460603 -212781 70279 -218253
18559 -209312 -106817 71166 -406357 43435 162258 -143158 107562 -84474 -84820 9255 132381
$$ packed form
18639b46954J21823H9280b03143j20773H6679a54005m2254A03025b88105A25235
18628A72766d3446j0910a9867A41552P2179d7918A16813b26034A66732A39J81115
18617A81254d0779A16758c33280A41997g7294L6543B4429K5637f7904D1769a50715
18605c3424p0532A67990a89177k11407H9964b33105h895k45377m310g5938A81391
18593e9896l7170G2618J93185B6312N4741a69849k11129C41425c08448c2632j84802
18582b17434j19152b1502k13246R8665e9904A10910b88643H4378b56948G203d9340
18570c76755A64658m0465a74676C0318a8379H5806d60603b12781G0279b18253
18559b09312J02495G1166d06357D3435J18823a43158A07562h4474l46I255J23126
$$ plain form
18548 132381 -106746 -192577 57684 75940 -41560 -221502 231783 247585 39084 233198 -3705
18536 -147691 -398634 236190 -355924 -3551 94375 -116764 -163569 -295094 -3929 90413 -69816
18524 11044 -121554 124488 168830 17445 -16444 152170 -144599 -56296 -70549 -253195 -135686
18513 -135686 -41252 83016 -99577 8946 -39614 146967 279487 -364105 -448042 167482 -37816
18501 -74784 104688 -35825 11408 25528 21385 67562 -115652 -9873 106156 41243 86429
18490 86429 -51226 -297150 -60129 -103619 -92538 -234993 -49892 -375078 277682 201320 -203166
18478 -171869 392 -42716 -143205 -61530 -269094 149158 318828 -126891 -182931 -93634 -198119
18467 -198119 290322 -365839 138402 -183273 33128 132866 -247739 -232346 -49437 86998
$$ packed form
18548A32381a06746q5831E7684J8256d1560j79942B31783J5802C9084J94114c705
18536a47691k50943B36190c55924c551I4375a16764m6805j31525c929I0413f9816
18524A1044a21554A24488M4342A7445a6444A52170a44599e6296j4253j82646J17509
18513a35686d1252H3016i9577H946c9614A46967J32520c64105q3937A67482c7816
18501g4784A04688c5825A1408J4120m143M6177a15652i873A06156D1243M5186
18490H6429e1226k45924f0129m3490J1081j42455d9892l25186B77682p6362b03166
18478a71869C92d2716j00489f1530k07564A49158J69670a26891n6040Q9297j04485
18467a98119B90322c65839A38402a83273C3128R9738b47739J5393d9437H6998
$$ plain form
18456 86713 78101 146241 -64846 -157746 -397150 -274904 -1655 90447 -14934 -306230 81795
18444 -363738 -270703 185850 49193 205694 353713 -312140 -84508 80049 -56488 -233765
18434 -233765 -175365 -105067 -83815 32122 335135 -168093 -57038 -200849 -221068 -287185 -212736
18423 -212736 -135359 30970 -102841 105310 93817 175092 -242259 219329 58107 -177339
18412 274698 -120946 -96430 -150673 -304377 -236763 -57460 138535 -36735 -240296 6921 451452
18401 451452 -69102 17288 100636 -282050 150182 -30148 59397 -55470 -138402 136941 -159353
18389 215590 -320502 -90717 -144989 -108008 -188890 45681 -130040 20392 -18993 62104 -194394
18377 287465 -111417 -47180 139342 92295 -272666 -164545 -201193 196404 33456 -62484
$$ packed form
18456H6713q612O8140f4846r2900k39404J22246a655I0447a4934k91296H1795
18444c63738R3035A85850D9193J56501J48019c12140h4508H0049e6488j77277
18434b33765N8400P0298K1252C2122L03013a68093e7038j43811k0219o6117P4449
18423b12736P7377C0970a02841A05310j1493Q1275b42259B19329E8107a77339
18412B74698a20946K4516n4243j53704O7614e7460A38535c6735k03561F921M44531
18401D51452f9102A7288Q3348b82050A50182c0148E9397e5470q2932A36941a59353
18389B15590c20502i0717n4272L6981q0882D5681a30040B0392a8993F2104a94394
18377B87465a11417d7180A39342m7047b72666J08121l6648A96404C3456f2484
$$ plain form
18366 -151115 -233801 -629137 -50154 -53935 -51077 186252 205438 1864 374614 229076 253714
18355 253714 85264 103479 -138117 112133 -56503 -121989 -364926 201084 -73476 101764
18344 -248431 -19205 -72648 234818 388859 -145506 424491 143640 95385 39810 -116224
18333 71180 -251592 -11258 -361494 -195099 54081 39415 -169097 -90348 -471002 88151 -231999
18321 -217069 -230749 49108 3090 -192635 -274510 -131864 211197 -92439 -152635 222386 -83819
18309 -259685 -22508 279097 -4685 29445 270369 -305105 -40610 -33521 -6006 -148459 -224710
18298 -224710 16993 -208175 81518 15044 61291 -216521 105653 323876 141006 185581
18288 185581 261440 49775 51689 234433 -244730 35082 -254963 89502 -190481 86945 32181
$$ packed form
18366a51115q2686l95336e0154l781K858A86252J9186A864L72750j45538K4638
18355B53714H5264J8215a38117A12133e6503o5486k42937B01084g3476A01764
18344b48431a9205n3443B34818J54041a45506D24491A43640m8255C9810a16224
18333G1180b51592a1258l50236J66395E4081j4666a69097P8749l80654H8151b31999
18321b17069j3680D9108C090a92635q1875a31864B11197i2439o0196B22386h3819
18309b59685b2508B79097d685B9445K40924c05105d0610P089f006j42453p6251
18298b24710A6993b08175H1518A5044M6247b16521A05653K18223A41006M4575
18288A85581P5859D9775J914J82744b44730C5082b54963H9502a90481H6945C2181
$$ plain form
18276 165662 -115631 32886 75279 -298596 -58287 -220995 20985 -115567 -97654 -35535 167464
18264 -28967 -64073 -142192 73050 -256545 107113 -53032 -273030 -73834 -163027 -190613 -114776
18253 -114776 -161570 -312817 180850 -135150 8073 82469 211412 375771 79988 172170 327160
18242 327160 -34238 -59628 -238708 -202468 285246 244952 -256078 -234034 -185617 -132240 -84718
18231 -84718 -176468 -84822 183097 118764 36395 54013 43107 -55916 -282530 -97931 261162
18219 -124130 -18110 -202919 96715 2524 25463 198211 -80964 498757 -208840 231197 -228531
18207 532685 -72188 5431 -157133 210412 5623 -372315 197522 -46681 -5331 -287141 -309846
18196 -309846 -193674 51079 -55159 -299331 36909 74663 -14290 167149 -24074 20252 -192121
$$ packed form
18276A65662a15631C2886M2393b98596e8287j62708B0985a15567J7913c5535A67464
18264b8967l5106p8119G3050b56545A07113e3032k19998g3834q9193k7586P5837
18253a14776m6794j51247A80850a35150H073P4396J28943J64359G9988R2182J54990
18242C27160c4238k5390j79080L6240B85246m0294b56078K2044M8417N3377M7522
18231h4718r1750h4822A83097o4333C6395J7618j0906e5916k26614i7931B61162
18219a24130a8110j84809I6715B524K2939J72748h0964D98757b08840B31197b28531
18207E32685g2188E431a57133B10412E623c72315A97522d6681e331k81810k2705
18196c09846J16172E1079e5159k44172C6909L7754a4290A67149b4074B0252a92121
$$ plain form
18184 -105307 289216 -16884 -25839 252626 -112130 154448 63347 61831 66009 172499 69998
18172 -246793 -56671 -121296 195780 -25572 -21579 -31999 98346 31372 285414 98194 153076
18161 153076 177650 -40717 177230 -145974 100426 57048 -182466 -231060 96629 -110139
18150 -62153 -199691 -56790 -269652 -27360 37040 -351153 128569 167061 -284897 -182614
18140 -182614 243919 -278430 -138381 -113668 -142154 177730 117296 -181484 -43576 95221
18129 76023 -207813 -173568 -71161 41889 -47022 -177882 -77940 21534 44937 -76491 194079
18117 7309 -54539 -58533 159956 -208465 -153830 143129 -208354 250824 154374 -27557 26353
18105 -195313 -14025 -214414 -192283 87279 -163265 154894 -32728 -62899 -295703 183005
$$ packed form
18184a05307B89216a6884q955B52626a12130A54448F3347j516M178J06490F9998
18172b46793e6671o4625A95780b5572L993j0420I8346C1372K54042I8194N4882
18161A53076K4574d0717A77230a45974A00426m3378a82466m8594I6629a10139
18150f2153j37538e6790k12862b7360C7040c51153A28569L8492b84897J02283
18140a82614B43919b78430a38381K4713k8486A77730o0434a81484d3576I5221
18129G6023b07813L4245g1161D1889d7022j30860g7940B1534K3403g6491A94079
18117G309e4539l994A59956b08465N4635A43129b08354B50824r6450b7557B6353
18105a95313a4025k00389K2131H7279a63265A54894c2728l0171k32804A83005
$$ plain form
18094 -26164 -148948 106897 -341275 19353 -87597 -304688 169123 -140162 119405 -147143
18083 206640 -20656 256953 -171365 -98119 -45422 -92858 -142104 -62803 262020 252314 6272
18071 -193594 200397 -136275 73677 -5909 -204891 15745 141726 127241 181587 119586 -192062
18059 -20281 12949 229883 -19797 198432 61673 267553 -293715 -130129 88464 -17193 88474
18047 131254 -149954 141059 -39928 -172371 -284629 -138788 129780 172975 361658 -36435
18036 -36523 -370772 -224360 -97818 172264 -227735 215366 -190049 166802 -104103 -282046
18026 -282046 337817 49497 235972 64405 283000 -59985 287412 75750 -45619 71579 -123515
18014 -25226 -131825 -137024 229826 -12803 148595 19023 -198952 306323 391239 -205001 -237041
$$ packed form
18094b6164j22784A06897c41275A9353h7597k17091A69123a40162A19405a47143
18083B06640b0656B56953a71365P3246d5422m7436m9246f2803B62020r706F272
18071a93594B00397a36275G3677e909j98982A5745J25981j4485N4346o2001a92062
18059b0281A2949K16934a9797A98432F1673K05880b93715a30129H8464a7193H8474
18047A31254a49954A41059c9928j32443j12258a38788A29780M3195J88683c6435
18036c6523l34249J46412i7818A72264b27735B15366a90049A66802a04103j77943
18026b82046C37817D9497J86475F4405K18595e9985B87412G5750d5619G1579a23515
18014b5226j06599n199B29826a2803A48595A9023a98952C06323Q4916b05001l2040
$$ plain form
18003 -237041 -278191 -43823 -243571 -74080 -164963 -231229 -43510 -151951 -189083 -153168 57557
17991 -467703 79085 -261314 97738 76015 5770 -129811 90973 381440 134365 -180499 -82560
17979 18933 -139917 17223 298855 -214958 -224211 51954 -104415 223207 -116283 141007
17968 292780 100375 -31752 -138893 267316 272891 72943 -505228 -12650 -11006 163538 6224
17956 407715 -267777 182000 -252481 99969 204583 36725 -99398 -117826 167710 170188 -147955
17944 73716 309506 -16147 340706 64606 88249 4169 -94447 -297941 73888 -133813 175900
17932 -117383 94122 43950 27625 13260 -159166 -2418 -119755 123148 -267816 115852 91016
17921 91016 109208 -312071 -204698 14824 321156 2132 164829 -47005 -271431 40537 262745
$$ packed form
18003b37041m1150d3823j99748g4080r0883o6266d3510j08441l7132L5915E7557
17991d67703G9085b61314I7738k1723E770a29811I0973K90467A34365a80499h2560
17979A8933a39917A7223K81632b14958r253E1954a04415B23207a16283A41007
17968B92780A00375c1752j07141B67316N575G2943e05228a2650J644A63538F224
17956D07715b67777A82000b52481I9969J04614C6725i9398j8428A67710K478a47955
17944G3716K35790a6147C40706F4606K3643D169i4447k03494G3888a33813A75900
17932a17383I4122D3950j6325A3260a59166b418j17337A23148b67816A15852k4836
17921I1016J8192c12071J07373A4824L06332B132J62697d7005k24426D0537K22208
$$ plain form
17910 262745 52769 -133311 195635 -164167 19568 -101189 -113353 358094 185959 295615
17900 295615 96268 100583 78116 241182 -159645 -258560 186710 48287 41481 -91066 15865
17888 111610 27677 127370 -161842 106851 157020 183290 -22063 -184362 358440 -105953
17877 -280797 244360 74128 -138462 -104804 -47857 -41415 64592 -81025 212664 111789 112630
17866 112630 -66777 -196698 -205574 272374 14691 -104536 -119065 98637 -161298 122665 5216
17854 -185266 124870 186693 -126360 74680 -214793 134243 61787 -91358 27600 290619
17844 290619 -23783 38140 -92358 184721 61830 -69055 106886 120542 49408 174685 108253
17833 108253 189160 -63792 -42239 206565 225108 298580 -85148 103073 3813 294580 -90470
$$ packed form
17910B62745E2769a33311A95635a64167A9568a01189j2164C58094j72135J09656
17900B95615I6268M315k2467J63066a59645r8915A86710D8287o806i1066A5865
17888A11610B7677R9693a61842A06851N0169K6270b2063j62299C58440a05953
17877b80797B44360G4128a38462L3658d7857O442F4592h1025B12664j00875Q41
17866A12630f6777j29921q876B72374A4691a04536j4529I8637a61298A22665E216
17854a85266A24870O1823a26360G4680b14793A34243F1787i1358B7600K63019
17844B90619b3783C8140i2358A84721F1830f9055A06886J3656D9408J25277o6432
17833A08253Q0907f3792K1553B06565J8543P3472h5148A03073C813K90767i0470
$$ plain form
17821 198159 -216468 670 84791 -226774 -374433 -228041 110315 -258468 172289 205915
17811 205915 109847 82558 76162 -63640 -267703 115068 92178 217982 101187 -140473 174377
17799 -131595 168438 11798 -22200 -123151 -225652 -154516 -133475 -101390 -99308 279924 -202148
17787 1253 -81156 -52295 69062 -144145 83040 38807 -139795 256701 339627 -126790 -26870
17775 -72435 -147035 175665 84597 119396 272892 -53075 -198503 235607 63408 177284 89807
17764 89807 -18259 -417 155386 115048 123582 -237548 -10134 -68797 56112 441162 217252
17752 84991 260051 457684 89479 -132816 -531 -7652 -40719 -14528 -76891 118467 269216
17741 269216 -208946 282661 -124723 -44579 145319 182073 250120 89504 -137174 -44617
$$ packed form
17821A98159b16468F70Q4121b26774j47659J46392A10315b58468A72289L3626
17811B05915r6068k7289o396f3640k04063A15068k2890J25804A01187a40473A74377
17799a31595A68438A1798b2200j00951j02501P1136K1041L2085K082B79924b02148
17787A253h1156K8861F9062a44145H3040C8807a39795B56701Q2926a26790b6870
17775g2435p4600A75665H4597L4799J53496e3075j45428B35607F3408J13876q7477
17764H9807a8259d17A55386m0338Q534b37548a0134n8663E6112L85050B17252
17752H4991J75060J97633H9479a32816e31p121l3067a4528o2363A18467J50749
17741B69216b08946B82661a24723d4579A45319L6754O8047H9504a37174d4617
$$ plain form
17730 -261690 -78720 156792 -9541 75431 262027 234010 275690 -38259 109721 137252 241744
17719 241744 -333195 -371533 -149011 15963 36187 76739 62008 4014 301983 149800 -205178
17707 403628 161101 109878 -46930 -61564 143090 278939 -15326 303088 -182294 303644
17696 56486 237943 50673 -67323 128118 252264 -88847 214559 164729 74720 -508382 366286
17684 -74713 7847 9242 -33656 -53020 -12402 -23227 26625 400985 199414 -185357 -24041
17672 128462 19211 230754 -51692 32686 -145429 96924 210603 57231 302586 18703 -122632
17660 314439 178644 265803 -56889 218089 -91107 77926 192551 213032 121979 178188 -296549
17648 21176 94968 434933 155585 86447 -75854 -60460 430044 -74279 231200 107058 -13453
$$ packed form
17730b61690g8720A56792i541G5431J86596k8017M1680c8259A09721K7531J04492
17719B41744c33195l8338a49011A5963K0224M0552j4731D014K97969A49800b05178
17707D03628A61101n1223d6930j4634A43090J35849a5326C03088a82294C03644
17696E6486J81457E0673f7323A28118J24146h8847B14559m9830G4720e08382C66286
17684g4713G847J395c3656j9364a2402j0825B6625L74360A99414a85357b4041
17672A28462A9211K11543e1692C2686a45429I6924J13679E7231K45355A8703a22632
17660C14439j35795Q7159e6889B18089i1107G7926J14625K0481r1053N6209b96549
17648B1176P3792L39965A55585o9138g5854J5394D30044g4279B31200A07058a3453
$$ plain form
17636 103689 383667 164798 61475 163058 -129942 364746 -98826 358626 83644 240301
17626 240301 2734 475444 245516 75265 125619 142948 374168 22637 206937 190386 -52505
17614 213993 250691 -22711 48144 -7296 447013 533641 70244 -44742 -32529 94110 -144930
17602 45632 81492 119898 -187546 65274 253144 -8882 270469 299607 94269 57097 317180
17591 317180 182690 -165692 332350 172856 463804 323043 479286 107275 185450 126947
17581 126947 -139547 221921 253747 108557 -33836 482062 178697 109812 106514 -41431 292727
17569 27939 215939 97500 99456 444226 117102 132804 135725 -50672 30098 334785 322520
17558 322520 330973 243124 345006 205431 90497 19062 301562 209705 85573 61938 122639
$$ packed form
17636A03689K79978A64798F1475J01583a29942C64746i8826C58626H3644J56657
17626B40301B734M72710k29928G5265N0354J7329K31220B2637J84300j6551e2505
17614B13993L6698b2711D8144g296D47013Q6628G0244d4742J2213I4110a44930
17602D5632L5860L8406a87546F5274J87870h882B70469K9138I4269l7172K60083
17591C17180j34490a65692C32350j59494K90948j40761J56243A07275P8175n8503
17581A26947a39547B21921L1826A08557c3836D82062A78697o8885l298d1431B92727
17569B7939J88000I7500J956L44770A17102J5702K921e0672C0098L04687j2265
17558C22520Q453q7849J01882j39575I0497A9062K82500r1857H5573k3635O0701
$$ plain form
17547 122639 165467 280930 -51282 178009 206230 65916 31543 14791 244571 150604 156522
17536 156522 -125399 465103 148509 154063 -139380 412618 153767 330850 228903 210364
17526 210364 638726 1085740 1328724 1001077 1034440 539082 624081 408102 153700 593916
17516 593916 364180 452606 614839 403359 509515 566328 756558 930217 918317 1045134
17506 1045134 627692 512969 452344 475178 329120 295603 73923 302307 332055 -16062
17495 459773 429423 418769 495981 253715 198492 106481 358893 173386 481249 207342
17484 349610 622109 257569 308848 409866 118935 70579 438079 491771 466526 122929
17473 337141 672415 277591 130072 437633 213551 594367 183663 308824 372753 452248
$$ packed form
17547A22639M2828J15463e1282A78009K8221F5916C1543A4791K29780r3967N918
17536A56522a25399D65103A48509N554a39380D12618A53767J77083j01947j8539
17526B10364M28362M47014K42984l27647L3363m95358Q4999k15979A53700M40216
17516E93916k29736Q8426J62233k11480J06156N6813J90230J73659j1900J26817
17506A045134m17442j14723o0625K2834j46058l3517G3923K28384K9748a6062
17495D59773l0350j0654P7212k42266n5223r2011K52412A73386L07863B07342
17484C49610K72499B57569N1279J01018A18935m8356L67500N3692k5245A22929
17473C37141L35274B77591A30072L07561B13551L80816A83663J25161O3929P9495
$$ plain form
17463 452248 57048 431428 414785 197097 336764 199686 284927 66394 -45606 87289 363020
17452 363020 407747 268457 416750 244838 404760 657937 566610 451139 241393 367816
17442 367816 531457 445091 477162 411198 608783 335408 386227 524108 315102 486572
17432 486572 518997 280247 313301 166130 270470 563303 276900 328867 392569 498187
17422 498187 227302 429840 188289 101067 193210 -92375 446037 551368 492312 379200
17412 379200 303203 272441 238540 145748 359747 132952 315400 255958 332018 228253 92442
17400 192028 26253 266442 81679 422883 -3677 159187 -12221 259200 250734 282099 498104
17389 498104 371431 397571 184243 251445 306457 45379 249220 118977 240709 378423
$$ packed form
17463D52248E7048L74380j6643A97097J39667j37078Q5241F6394d5606H7289K75731
17452C63020M4727j39290J48293j71912J59922K53177r1327j15471k09746J26423
17442C67816J63641q6366L2071o5964J97585k73375N0819J37881k09006J71470
17432D86572L2425k38750L3054j47171J04340K92833B76900N1967O3702J05618
17422D98187B27302K02538A88289q7222R2143i2375D46037J05331n9056j13112
17412C79200p5997l0762l3901r2792K13999A32952J82448n9442P6060j03765I2442
17400A92028B6253K40189H1679L41204c677A59187a2221B59200q466L1365K16005
17389D98104j26673K6140A84243O7202N5012D5379K03841A18977J21732J37714
$$ plain form
17379 378423 -91683 256864 367705 30003 14273 55325 264629 116415 608281 244338
17368 335119 339018 400909 297240 6428 447886 364807 322659 735334 174229 -69751 266331
17356 264466 616937 200640 375301 443479 237959 358516 483432 45160 199618 260675
17346 260675 422950 -72298 236184 339959 317919 215801 279468 218060 180000 198795 423437
17335 423437 313606 72937 117719 540874 368150 133273 457734 100989 292351 244038
17325 244038 371125 367914 39325 156180 508313 286933 324516 33247 415286 333982 292348
17314 292348 443346 198424 502267 -73840 179122 75137 5926 475788 240050 548002
17304 548002 152824 347292 412021 488962 30013 298744 108170 137925 362051 -21948
$$ packed form
17379C78423i1683B56864J10841C0003A4273M1052K09304A16415M91866B44338
17368C35119L899O1891j03669F428M41458q3079m2148M12675A74229f9751B66331
17356B64466L52471B00640J74661O8178k05520J20557J24916D5160J54458O1057
17346B60675J62275g2298B36184J03775k2040j02118O3667o1408l8060J8795K24642
17335D23437j09831G2937M4782M23155j72724A33273L24461A00989J91362m8313
17325B44038J27087l211C9325J16855L52133k21380L7583C3247L82039q1304m1634
17314B92348J50998A98424L03843g3840A79122G5137E926M69862k35738L07952
17304E48002A52824J94468O4729P6941C0013K68731A08170K9755K24126b1948
$$ plain form
17293 244093 385753 325508 498565 617807 271222 258587 507909 59289 240597 284505
17283 284505 72607 370795 159304 414813 522662 413393 628049 476572 551013 216570
17272 165441 191148 602877 353364 209711 422271 464276 313785 271350 555842 312051
17262 312051 214480 342380 467407 579377 448909 422463 398129 196339 549128 401976
17252 401976 340660 398619 503252 305891 384943 505639 122908 303803 476526 242460
17242 242460 322883 68464 397615 544630 164346 215718 697570 520652 263814 229924
17232 229924 214329 743689 413237 141930 183532 566971 477904 549244 526092 403646
17222 403646 400909 276337 68013 229038 481674 474445 452632 149825 573755 530181 374525
$$ packed form
17293B44093J41660o0245J73057J19242B71222j2635K49322E9289J81308M3908
17283B84505G2607K98188A59304K55509J07849j09269K14656j51477P4441B16570
17272A65441K5707M11729k49513j43653K12560M2005j50491m2435K84492k43791
17262C12051r7571J27900J25027J11970j30468k6446k4334A96339L52789j47152
17252D01976o1316N7959J04633j97361P9052J20696A22908J80895J72723k34066
17242B42460Q0423F8464L29151J47015A64346N1372M81852j76918k56838l3890
17232B29924j5595N29360l30452A41930M1602L83439q9067P1340k3152j22446
17222D03646k737j24572F8013J61025K52636p229k1813A49825M23930m3574j55656
$$ plain form
17211 374525 299208 468124 331508 631899 210272 159317 431043 183697 249066 612212
17201 612212 357826 746895 124703 266232 439443 230396 356517 403652 356705 402532
17191 402532 421177 289038 595142 873988 612410 286731 430283 457001 418654 491855
17181 491855 509045 435627 310874 205835 598572 193011 652537 616919 635584 368145
17171 368145 411694 600792 324699 588800 494941 774651 420831 250344 604132 251444
17160 584923 502737 400158 279903 461336 580184 643040 358897 713600 462761 501372
17150 501372 266540 532914 251868 561973 794696 634357 517614 573339 598344 613709
17140 613709 683874 357055 570457 316434 466074 649436 433112 553859 848942 464113
$$ packed form
17211C74525p5317J68916j36616L00391B10272n0955K71726A83697O5369L63146
17201F12212k54386L89069A24703J41529J73211k09047J26121M7135m6947M5827
17191D02532J8645j32139L06104K78846k61578B86731J43552K6718l8347P3201
17181D91855J7190p3418j24753j05039L92737A93011M59526l5618J8665k67439
17171C68145M3549J89098k76093K64101r3859K79710l53820j70487L53788B51444
17160E84923q2186j02579j20255J81433J18848O2856k84143L54703k50839L8611
17150E01372k34832K66374B51868L10105K32723j60339j16743N5725K5005J5365
17140F13709P0165l26819K13402k54023J49640J83362k16324J20747K95083l84829
$$ plain form
17130 464113 611544 508259 580494 659793 502891 701344 620112 516089 561985 488171
17120 488171 581255 439811 842153 366493 885267 552275 221288 739617 669861 639297
17110 639297 601656 662186 468150 737408 1016645 739312 566806 693881 679825 374281
17100 374281 556591 596364 726608 791784 827908 1040235 748331 540027 601171 826770
17090 826770 690091 695806 885853 766839 648737 750658 524028 414833 784117 648386
17080 648386 660316 902403 586577 755184 466104 906460 959474 1057848 979574 888672
17070 888672 714661 725535 669660 1091544 978644 926204 884241 1091302 983667 843558
17060 843558 870636 1009692 853034 947313 1078919 1188893 665406 832219 794120 1213001
$$ packed form
17130D64113J47431j03285P2235P9299j56902J98453q1232j04023M5896p3814
17120D88171R3084j41444M02342C66493N18774l32992B21288N18329o9756l0564
17110F39297l7641O0530j94036K69258K79237k77333j72506J27075j4056l05544
17100C74281J82310L9773J30244O5176L6124K12327k91904k08304O1144K25599
17090H26770j36679N715J90047j19014j18102J01921k26630j09195L69284j35731
17080F48386J1930K42087l15826J68607k89080M40356N3014R8374p8274r0902
17070H88672j74011J0874n5875M21884j12900n2440m1963K07061j07635j40109
17060H43558K7078J39056j56658R4279J31606J09974n23487J66813l8099M18881
$$ plain form
17050 1213001 1025475 837510 1141242 903109 1092481 750513 928733 1050388 817953
17041 817953 807498 1130970 861300 1203904 1061665 1153369 988230 912539 942981 836796
17031 836796 1115144 1339092 933561 984632 891609 1258715 1126877 975056 1052506 978399
17021 978399 1118233 1040787 1256388 1019447 1522808 1163322 1162417 1051501 1080845 968423
17011 968423 1154890 1042865 993726 1270842 1484218 971014 1153235 1137039 1170723 1299773
17001 1299773 1122035 1394751 1156686 1341105 1415863 1470495 1398112 1534535 1110105 1013791
16991 1013791 1679706 1645544 1249844 1393780 1263243 1370412 1508068 1733583 1588220 1238786
16981 1238786 1270583 1379560 1215158 1662248 1494698 1513675 1520844 1445979 1616937 1772769
$$ packed form
17050A213001j87526j87965L03732k38133J89372l41968J78220J21655k32435
17041H17953j0455L23472k69670L42604j42239R1704j65139p5691L0442j06185
17031H36796K78348K23948m05531N1071r3023L67106j31838j51821P7450p4107
17021I78399J39834p7446K15601k36941N03361l59486r05j10916K9344j12422
17011I68423J86467j12025m9139K77116K13376n13204J82221j6196L3684J29050
17001A299773j77738K72716k38065J84419P4758N4632p2383J36423m24430r6314
16991A013791O65915l4162l95700J43936j30537J07169J37656K25515j45363l49434
16981A238786L1797J08977j64402M47090j67550J8977P169p4865J70958J55832
$$ plain form
16971 1772769 1356189 1550140 1536499 1712010 1828241 1511475 1723712 1841954 1651212 1638117
16961 1638117 1602164 1743613 1848455 1892940 1484579 1553015 1611412 1947495 1477476 1878911
16951 1878911 2124820 1928326 1790130 2186423 1688067 2003194 2091923 1931900 1840043 2101896
16941 2101896 1934560 2066941 2005031 2290692 2102542 2283645 2098072 1883754 2031902 2408575
16931 2408575 2030983 1965465 2199448 2248945 2430028 2313806 2190989 2270920 2625594 2302862
16921 2302862 2630840 2465549 2377601 2405649 2788036 2590300 2768431 2511033 2529973 2727697
16911 2727697 2758018 2527220 2608898 2799858 2928622 3138575 2737166 2803962 2552421 2921630
16901 2921630 3049264 3108336 2858243 2841086 2761027 3044211 3207496 2998034 3256460 3610568
$$ packed form
16971A772769m16580J93951j3641J75511J16231l16766K12237J18242j90742j3095
16961A638117l5953J41449J04842M4485m08361O8436N8397L36083m70019M01435
16951A878911K45909j96494j38196L96293m98356L15127Q8729j60023r1857K61853
16941B101896j67336J32381o1910K85661j88150J81103j85573k14318J48148L76673
16931B408575l77592o5518K33983M9497J81083j16222j22817P9931L54674l22732
16921B302862L27978j65291q7948K8048L82387j97736J78131k57398J8940J97724
16911B727697L0321k30798Q1678J90960J28764K09953m01409O6796k51541L69209
16901B921630J27634N9072k50093j7157q0059K83184J63285k09462K58426L54108
$$ plain form
16891 3610568 3668674 3509419 3528362 3503945 3426210 3522605 3685932 3494041 3726473 3487265
16881 3487265 3869620 3842575 3690300 3527911 3739775 3828700 4067833 3991057 4115371 4328145
16871 4328145 4151526 4407828 4395001 4323779 4459870 4469520 4476290 4459120 4724594 4826549 4791737
16860 4791737 4963679 4675016 4957767 5196142 4924492 5160834 5594747 5476179 5479547 5554363
16850 5554363 5771615 5685162 5892224 5963160 5853037 5891047 6291077 5823585 6326120 6632038
16840 6632038 6442835 6637838 6609502 6736354 6806890 7282707 7396678 7557168 7325508 7423736
16830 7423736 7427525 7801204 8087201 7902355 8424760 8528739 8454210 8485470 9075990 8973565
16820 8973565 9221120 9185160 9471039 9252111 9926072 10227394 10264182 10554058 10691103 10793457
$$ packed form
16891C610568N8106j59255J8943k4417p7735R6395J63327j91891K32432k39208
16881C487265L82355k7045j52275j62389K11864Q8925K39133p6776J24314K12774
16871D328145j76619K56302j2827p1222J36091R650O770j7170K65474J01955l4812
16860D791737J71942k88663K82751K38375k71650K36342M33913j18568L368P4816
16850E554363K17252q6453K07062P0936j10123L8010M00030m67492N02535L05918
16840F632038j89203J95003k8336J26852P0536M75817J13971J60490k31660R8228
16830G423736L789L73679K85997j84846N22405J03979p4529L1260N90520j02425
16820H973565K47555l5960K85879k18928O73961L01322L6788K89876J37045J02354
$$ plain form
16810 10793457 10987785 11429803 11659238 11965438 11859842 12491410 12624976 13099590 13251108
16801 13251108 13572581 13653941 14196070 14215951 14655776 14828303 15796482 15893796 16116173 16404000
16791 16404000 16820518 17450501 17670231 18120494 18763315 19401583 19531270 20073685 20798547
16782 20798547 21464423 22126811 22425157 23148092 23859364 24508304 25133538 25475930 26633981
16773 26633981 27396073 27868301 29324523 29618883 30837339 32027428 32935646 34025005 34821872
16764 34821872 35779879 36836782 38174475 39639750 40975514 42442338 43707621 45239919
16756 45239919 46592064 48127872 49976551 51762336 53643666 55205619 57070351 59368376
16748 59368376 61320924 63354576 65732206 67898478 70682459 72576550 75189408 77465694
$$ packed form
16810A0793457J94328M42018K29435L06200j05596O31568J33566M74614J51518
16801A3251108L21473Q1360N42129J9881M39825J72527R68179R7314K22377K87827
16791A6404000M16518O29983K19730M50263O42821O38268J29687N42415P24862
16782B0798547O65876O62388K98346P22935P11272O48940O25234L42392J158051
16773B6633981P62092M72228J456222K94360J218456J190089R08218J089359P96867
16764C4821872R58007J056903J337693J465275J335764J466824J265283J532298
16756D5239919J352145J535808J848679J785785J881330J561953J864732K298025
16748E9368376J952548K033652K377630K166272K783981J894091K612858K276286
$$ plain form
16740 77465694 80208729 82829031 85285732 87893703 90364148 92680029 95818541 97909952
16732 97909952 100502993 102885757 104718638 106871885 108863338 110616616 112064596 113328294
16724 113328294 114135887 115246132 115679405 115983491 115555670 115751572 114711768 113943114 112872887
16715 112872887 111455046 109898421 108006511 106371566 104181379 101706871 99169590 96823309
16707 96823309 94414832 92054976 89030157 86644984 83499114 81293923 78560433 76276121
16699 76276121 73665044 71356594 68514060 66535437 63678501 61890091 59648030 57494627
16691 57494627 55562711 53369616 51662304 49835389 48242402 46536110 45135376 43236191
16683 43236191 41967690 40779402 39245496 38382326 36405638 35592323 34396619 33342278
$$ packed form
16740G7465694K743035K620302K456701K607971K470445K315881L138512K091411
16732I7909952K593041K382764J832881K153247J991453J753278J447980J263698
16724A13328294Q07593J110245M33273L04086m27821J95902j039804p68654j070227
16715A12872887j417841j556625j891910j634945k190187k474508k537281k346281
16707I6823309k408477k359856l024819k385173l145870k205191k733490k284312
16699G6276121k611077k308450k842534j978623k856936j788410k242061k153403
16691E7494627j931916k193095j707312j826915j592987j706292j400734j899185
16683D3236191j268501j188288j533906q63170j976688q13315j195704j054341
$$ plain form
16675 33342278 32200841 31245336 30269117 29082114 28400665 27637288 26930330 26005252 25204749
16666 25204749 24563071 23702232 23260734 22689320 21742540 21333067 20483895 19994984 19575463
16657 19575463 18997289 18580424 18088535 17934993 17103847 16953465 16546207 15973196 15630022
16648 15630022 15089831 14567745 14415322 14331333 13603930 13360101 13249647 12862365 12725223
16639 12725223 12177450 12241305 11831398 11645381 10951864 10967256 10544470 10606252 10486495 10182679
16629 10182679 9967898 9895444 9358190 9794800 9132282 9248536 8696361 8629651 8430979 7871639
16619 7871639 8049006 8067074 7924812 7697095 7614264 7564706 7581991 7235999 7310065 7058753
16609 7058753 6734619 6927729 6887873 6597206 6576572 6547797 6190276 6189888 5997239 6004781 5679470
$$ packed form
16675C3342278j141437r55505r76219j187003o81449p63377p06958r25078q00503
16666B5204749o41678q60839m41498n71414r46780m09473q49172m88911m19521
16657A9575463n78174m16865m91889j53542q31146j50382m07258n73011l43174
16648A5630022n40191n22086j52423q3989p27403k43829j10454l87282j37142
16639A2725223n47773O3855m09907j86017o93517J5392m22786O1782j19757l03816
16629A0182679k14781p2454n37254M36610o62518J16254n52175o6710j98672n59340
16619G871639J77367J8068j42262k27717q2831m9558J7285l45992P4066k51312
16609G058753l24134J93110l9856k90667k0634k8775l57521l88j92649P542l25311
$$ plain form
16598 5679470 6095473 5552325 5593346 5641881 5643437 5230086 5198840 5091924 5194364 4876085
16588 4876085 5277495 4937910 4548873 4872434 4631554 4502206 4678550 4563739 4230145
16579 4230145 4533947 4822191 4184136 4500692 4481110 4204608 4149896 4000676 3872897 3689445
16569 3689445 3559819 4052483 3874205 3464647 3513014 3370876 3659416 3761056 3478713 3157833
16559 3157833 3461033 3541747 3567811 3116114 3040618 3140505 3045190 2980816 2834213 2984164
16549 2984164 3076925 2879346 3004651 3062140 2955012 2793390 2678431 2864366 2605222 2612199
16539 2612199 2433651 2562002 2692315 2426534 2276893 2209903 2361646 2337620 2636897 2751137
16529 2751137 2209790 2231155 2257835 2193769 2359079 2490265 2119096 1892609 2246527 2415745
$$ packed form
16598E679470M16003n43148M1021M8535J556m13351l1246j06916J02440l18279
16588D876085M01410l39585l89037L23561k40880j29348J76344j14811l33594
16579D230145L03802K88244o38055L16556j9582k76502n4712j49220j27779j83452
16569C689445j29626M92664j78278m09558M8367j42138K88540J01640k82343l20880
16559C157833L03200Q0714K6064m51697p5496R9887r5315o4374j46603J49951
16549B984164R2761j97579J25305N7489j07128j61622j14959J85935k59144O977
16539B612199j78548J28351J30313k65781j49641o6990J51743k4026K99277J14240
16529B751137n41347K1365K6680o4066J65310J31186l71169k26487L53918J69218
$$ plain form
16519 2415745 2063740 2210648 1923241 2028843 1911728 2281617 2126299 1995719 1845239
16510 1845239 2187090 1982353 2096862 1932899 2208815 2006230 1881887 1888021 1906548 1572265
16500 1572265 1731698 1845485 1868781 1812096 1719480 1500502 1523569 1789372 1742934 1874655
16490 1874655 1768584 1805344 1870687 2113540 1444787 1418919 1473460 1746354 1740547 1483000
16480 1483000 1460620 1529144 1452753 1352113 1505231 1530462 1573268 1351171 1523701 1655536
16470 1655536 1696117 1717001 1215430 1063896 1179662 1125445 1319680 1195498 1048309 1358385
16460 1358385 1364198 1396494 1384940 1281414 1342847 1072580 972476 1067600 1012991 1099715 1369292
16449 1369292 974684 1184127 1270587 1475296 922776 977425 1105783 834810 1244704 1214687
$$ packed form
16519B415745l52005J46908k87407J05602j17115L69889j55318j30580j50480
16510A845239L41851k04737J14509j63963K75916k02585j24343O134J8527l34283
16500A572265J59433J13787K3296n6685r2616k18978K3067K65803m6438J31721
16490A874655j06071L6760O5343K42853o68753k5868N4541K72894n807k57547
16480A483000k2380O8524p6391j00640J53118K5231M2806k22097J72530J31835
16470A655536M0581K0884n01571j51534J15766n4217J94235j24182j47189L10076
16460A358385N813L2296j1554j03526O1433k70267j00104R5124n4609Q6724K69577
16449A369292l94608K09443Q6460K04709n52520N4649J28358k70973M09894l0017
$$ plain form
16439 1214687 1029399 1052580 1038686 1088723 1100487 1226927 1088965 1072408 1073671 1511062 788603
16428 788603 947397 1150217 1140523 1231830 1008253 1359337 1096467 1141952 876524 1261987
16418 1261987 844992 323432 920256 1158878 931109 1283161 964352 914706 717467 894698
16408 894698 879377 834858 982015 564181 795451 847209 604684 930765 773925 946269
16398 946269 803720 911090 1260668 1090997 858587 1152529 542031 626506 917355 991882
16388 991882 784022 872017 762341 527681 922827 885775 773517 721118 648079 850011
16378 850011 232288 749465 840905 872406 511500 702226 579340 785482 527334 617771
16368 617771 671722 639392 567223 352528 603696 554707 905756 689485 487222 537666
$$ packed form
16439A214687j85288K3181j3894N0037J1764J26440j37962j6557J263M37391p22459
16428G88603J58794K02820r694R1307k23577L51084k62870M5485k65428L85463
16418A261987m16995C23432N96824K38622k27769L52052l18809m9646j97239J77231
16408H94698j5321m4519J47157m17834K31270N1758k42525L26081j56840J72344
16398I46269j42549J07370L49578j69671k32410K93942E42031Q4475K90849P4527
16388I91882k07860Q7995j09676k34660L95146l7052j12258n2399p3039K01932
16378H50011B32288N17177R1440L1501l60906J90726j22886K06142k58148R0437
16368F17771N3951l2330p2169k14695K51168m8989L51049k16271k02263N0444
$$ plain form
16358 537666 503589 818163 233341 427446 543200 689044 511684 329029 847886 520539
16348 520539 455262 571681 769648 427989 671235 536573 561855 597874 598812 666796 217176
16336 408874 453903 717528 711075 626416 288684 1035136 423433 690436 436406 584452
16326 584452 922733 110643 549464 548978 308249 584769 486877 529414 746265 536243
16316 536243 396149 523740 389530 340831 314982 572440 515033 569454 476507 308835
16306 308835 334193 584410 280924 532948 575280 395473 242063 522452 473286 323366
16296 323366 205546 270941 512048 534759 386267 627215 49829 345262 731558 515101
16286 515101 610118 205946 634965 274264 123665 364517 546049 159847 486469 301620
$$ packed form
16358E37666l4077L14574B33341J94105J15754J45844j77360j82655N18857l27347
16348E20539o5277J16419J97967l41659K43246j34662K5282L6019R38O7984B17176
16336D08874M5029K63625o453q4659B88684P46452D23433K67003k54030J48046
16326E84452L38281A10643M38821m86k40729K76520r7892M2537K16851k10022
16316E36243j40094J27591j34210m8699k5849K57458n7407N4421r2947j67672
16306C08835K5358K50217B80924K52024M2332j79807j53410K80389m9166j49920
16296C23366j17820O5395K41107K2711j48492K40948D9829K95433L86296k16457
16286E15101R5017B05946M29019B74264A23665K40852J81532A59847L26622j84849
$$ plain form
16276 301620 420875 373825 436588 296190 529316 331754 127846 271229 226515 435580
16266 435580 332589 367491 334880 239806 359027 361161 105092 314897 287722 388112 115778
16254 366023 237206 675699 141789 510936 383831 399627 66370 542123 69366 86225
16244 86225 273903 237655 325275 405342 235127 190418 496059 483154 388500 -42502 219830
16232 310930 262333 376962 303522 -24616 372090 874045 178017 442736 107353 600425
16222 600425 175187 -118142 209452 369187 472299 125935 274004 -27834 340597 270842
16212 270842 119097 403853 242892 268896 284021 581501 421943 345592 243340 312991
16202 312991 193258 164829 210373 642101 -33779 161175 -124870 65618 581840 222494
$$ packed form
16276C01620J19255m7050O2763j40398K33126j97562A27846J43383m4714K09065
16266D35580j02991L4902l2611r5074J19221K134A05092K09805k7175J00390A15778
16254C66023j28817M38493A41789L69147j27105J5796F6370M75753F9366J6859
16244H6225J87678l6248Q7620Q0067j70215m4709L05641j2905r4654d2502B19830
16232C10930m8597J14629p3440b4616C72090N01955A78017K64719A07353M93072
16222F00425A75187a18142B09452J59735J03112A25935J48069b7834C40597o9755
16212B70842A19097K84756j60961K6004J5125K97480j59558p6351j02252O9651
16202C12991j19733k8429M5544M31728c3779A61175a24870F5618N16222B22494
$$ plain form
16191 197002 398679 259007 304291 157 338128 264234 96950 601934 369882 297950 299500
16180 299500 37899 148842 363865 223372 147917 305833 -63710 377654 252193 -7329
16169 124189 206362 276455 133134 131028 144586 152233 380632 -97761 473364 114839 247359
16158 247359 37279 198692 -166018 220072 58527 339993 204322 345172 192619 260996
16148 260996 -310797 277093 84064 -42561 -112602 120839 167189 149326 52230 68243 289570
16137 289570 169250 178556 169463 100508 422133 -168435 412072 -167284 -57669 217706 131953
16126 131953 146438 49971 162612 157770 41800 95722 41207 45939 -108982 -4398 292281
16114 57036 -286892 396149 470048 558288 291415 -20158 241828 319650 -34710 239170 18021
$$ packed form
16191A97002K01677j39672M5284A57L37971p3894I6950N04984k32052p1932J550
16180B99500C7899J10943K15023j40493p5455J57916f3710C77654j25461g329
16169A24189Q2173P0093A33134k106J3558P647K28399i7761D73364A14839J32520
16158B47359C7279J61413a66018B20072E8527K81466j35671J40850j52553O8377
16148B60996c10797B77093H4064d2561p0041A20839M6350j7863E2230J6013K21327
16137B89570j20320R306r093o8955L21625a68435D12072a67284e7669B17706q5753
16126A31953J4485D9971J12641m842D1800N3922D1207M732a08982d398B92281
16114E7036b86892C96149P3899Q8240k66873b0158B41828P7822c4710B39170A8021
$$ plain form
16102 -174705 -42019 -176860 48302 -53531 -129784 74290 127744 219844 135059 -41784 45936
16090 -179073 80135 187899 136028 -68541 313852 -148015 -303219 378407 211835 -101116
16079 122784 283545 264145 269521 338800 -140026 -7257 9810 294662 -192922 159098 -78542
16067 43195 102950 -34739 252238 -337781 294847 -445547 175482 184998 46053 178959 345593
16056 345593 -55850 128345 259947 -16103 228699 64653 -267441 131856 323025 88494
16045 -127291 189053 191313 -63801 78979 -27567 102125 122427 282216 9125 128117 69065
16034 69065 350786 332127 -79685 -35175 -144825 -92982 -184661 -153263 129317 131139 -42119
16022 132903 283182 60926 62970 245856 -164252 41056 89356 -206042 -19231 -83886 392945
$$ packed form
16102a74705d2019j34841D8302e3531p6253G4290N3454R2100q4785d1784D5936
16090a79073H0135J07764n1871f8541C13852a48015j55204C78407j66572a01116
16079A22784J60761j9400N376O9279a40026g257I810K84852a92922A59098g8542
16067D3195N9755c4739B52238c37781B94847d45547A75482R516D6053J32906J66634
16056C45593e5850A28345J31602a6103B28699F4653b67441A31856J91169H8494
16045a27291A89053K260f3801G8979b7567A02125K0302J59789I125J18992n9052
16034F9065K81721j8659g9685c5175j09650N1843r1679L1398A29317J822d2119
16022A32903J50279F0926K044J82886a64252D1056M8300b06042a9231o4655C92945
$$ plain form
16010 177139 288102 -244580 26146 248141 199047 -88035 267943 258915 -158704 60432 249340
15999 249340 -30558 32424 -177570 176909 -90626 28893 -182476 124932 -163798 61242
15988 351440 426899 447742 945267 1006541 940255 982652 852687 650312 293032 33008 92717
15977 92717 47421 -106411 -262376 4710 254620 302782 304353 -46431 -251786 18221 -15586
15965 -16142 -141066 5510 -1343 19666 -347312 151780 103985 -95590 93604 -297665 -41501
15953 -128095 -132089 123999 -348689 -324340 46668 15843 -67787 -154578 74473 177517 -228491
15941 199336 244601 -59323 205817 -121746 -229532 -334272 259703 223088 228985 312855 9452
15929 -69055 -51814 -54575 248104 188786 -120717 88539 -110125 -90056 -211897 87264 -57815
$$ packed form
16010A77139J10963b44580B6146K21995m9094h8035B67943r028a58704F0432J88908
15999B49340c0558C2424a77570A76909i0626B8893a82476A24932a63798F1242
15988C51440P5459K0843M97525O1274o6286M2397j29965k02375B93032C3008N9709
15977I2717m5296a06411j55965D710K49910M8162J571d6431k05355A8221a5586
15965a6142j24924E510a343A9666c47312A51780m7795i5590I3604b97665d1501
15953a28095l994A23999c48689K4349D6668A5843f7787q6791G4473J03044b28491
15941A99336M5265e9323B05817a21746j07786j04740B59703l6615N897Q3870I452
15929f9055J7241k761B48104n9318a20717H8539a10125K0069j21841H7264e7815
$$ plain form
15917 35204 -125598 -43626 67270 67752 141062 346575 -167135 97010 -93459 -20429 184935
15905 -79509 172370 321010 -223633 199665 197390 124823 -33239 155625 -340447 -239479
15895 -239479 132711 -123147 44238 49934 259914 289224 204762 -220217 465362 103682
15884 46560 -48370 -229727 -225690 214375 72891 35737 28376 -41288 -85229 71530 -77227 -181218
15872 -181218 23414 353225 -363058 138720 -101026 133527 -133821 -250435 -177974 -216776
15862 -216776 -124743 197385 -185628 -66795 26283 60206 4249 -164232 136085 -179717 -24459
15850 272467 -118180 -158418 -281043 -220409 -66557 -87636 30406 -199877 227102 -45885 -23718
15839 -23718 -212893 -60265 -213188 428023 -495 -164629 91000 179772 142049 -66708 -272164
$$ packed form
15917C5204a25598d3626F7270M82P3310K05513a67135I7010i3459b0429A84935
15905g9509A72370J48640b23633A99665k275p2567c3239A55625c40447J00968
15895b39479A32711a23147D4238N696K09980K9310q4462b20217D65362A03682
15884D6560d8370j81357M037B14375G2891C5737p361d1288m3941G1530g7227j03991
15872a81218B3414L29811c63058A38720a01026A33527a33821j16614P2461l8802
15862b16776R2033A97385a85628f6795B6283L3923D249a64232A36085a79717b4459
15850B72467a18180m0238j22625O0634f6557k1079C0406a99877B27102d5885K2167
15839b3718j89175f0265j52923D28023d95j64134I1000Q8772l7723f6708k05456
$$ plain form
15828 -272164 266683 21056 45012 196672 200973 -373765 214825 95792 244994 59665 -262808
15816 -303518 207583 -88474 -18503 222044 -127825 158214 386621 225640 28225 -224602
15805 -134255 398497 106860 -145126 245403 -316691 34521 152824 333133 51107 121387
15795 121387 59706 -273655 48490 -100102 111300 49548 -80405 -159004 153718 171926 -179404
15783 425281 161384 -292270 78711 13677 49356 37512 -70461 -491167 230378 374341
15773 374341 91475 -100834 -35894 -4026 -333467 174410 -196438 112087 -288357 11905
15762 256777 -66584 -238696 -127414 -27535 248876 219926 173818 128814 150109 73830 1039
15750 125039 260772 -97488 181955 -101491 74111 -139778 98708 140999 -189524 6700 59986
$$ packed form
15828b72164B66683B1056K3956J51660M301c73765B14825I5792J49202E9665b62808
15816c03518B07583h8474a8503B22044a27825A58214K28407j60981B8225b24602
15805a34255C98497A06860a45126B45403c16691C4521J18303J80309E1107P0280
15795A21387E9706b73655D8490a00102A11300D9548h0405p8599A53718J8208a79404
15783D25281A61384b92270G8711A3677L5679j1844g0461m20706B30378J43963
15773C74341I1475a00834c5894d026l29441A74410a96438A12087b88357A1905
15762B56777f6584j72112J11282b7535B48876k8950m6108m5004K1295G3830A039
15750A25039J35733i7488A81955a01491G4111a39778I8708M2291a89524F700N3286
$$ plain form
15739 59986 -46613 182064 -165498 -65816 234392 78772 -197762 -138204 29471 231929 -151862
15727 -125286 -119351 26143 -78295 297711 198170 -93026 1120 -98923 -16059 -120780 -47535
15715 -252311 -118473 -210701 -141139 117173 -44333 -332774 -21295 6691 -74348 -23638 143209
15703 201087 -347318 -66146 -52856 43702 -211493 55227 67281 145250 88468 -104537 356257
15691 -29480 -127664 -19343 58653 -33574 93372 -211843 212530 -67201 -1385 2327 734986
15680 734986 -192477 16913 253205 -115488 -249191 114896 357221 125148 286216 120794
15669 242207 175048 -33417 23688 91378 -130830 -188758 53695 113873 83348 26617 -101275
15657 103096 49607 70152 -84818 -380751 47748 123866 53515 -162196 217470 -90633 15696
$$ packed form
15739E9986d6613A82064a65498f5816B34392G8772a97762N9558B9471K02458a51862
15727a25286N935B6143g8295B97711r9541i3026A120i8923a6059j04721d7535
15715b52311a18473r2228O9562A17173d4333k88441b1295F691g4348b3638A43209
15703B01087c47318f6146J3290D3702b11493E5227J2054P7969n6782a04537C56257
15691b9480r8184a9343E8653c3574I3372b11843B12530f7201a385B327P32659
15680G34986a92477A6913K36292a15488j33703A14896K42325A25148J61068A20794
15669B42207o7159c3417B3688O7690a30830n7928E3695O0178l0525B6617a01275
15657A03096D9607K0545h4818k95933D7748P6118E3515a62196B17470i0633A5696
$$ plain form
15645 -39959 72476 70610 -11518 52910 625728 -244688 -136419 -69123 92144 -90287 72261
15633 -74342 -282312 -87121 24957 -287628 -11544 125514 128151 -24098 -35706 74389 -28990
15621 129539 -42845 97051 -25711 176530 -260597 -344009 118886 129186 -381013 -135452
15610 -183767 -301596 39209 -119000 56180 -229993 111598 -209273 -273228 172975 945 35375
15599 35375 40612 103347 53822 22422 -50101 155816 114823 -124834 -24611 -178690 -376218
15588 -376218 96647 -372342 -160073 148487 -47333 -43421 162040 3429 174106 81891 -349898
15576 -226115 10088 147786 -25953 -90471 32035 -230906 204863 97996 198324 -121876
15565 141662 -58703 44496 69152 30985 -246995 -33960 133010 -13819 -206418 226116 -108495
$$ packed form
15645c9959G2476j866a1518E2910N72818b44688J08269O7296I2144i0287G2261
15633g4342k07970h7121B4957b87628a1544A25514K637b4098j1608G4389b8990
15621A29539d2845I7051b5711A76530b60597q3412A18886J0300c81013a35452
15610a83767j17829C9209a19000E6180b29993A11598b09273o3955A72975I45L4430
15599C5375N237O2735m9525B2422e0101A55816m0993a24834b4611j54079j97528
15588c76218I6647c72342a60073A48487d7333L912A62040C429J70677H1891c49898
15576b26115A0088J37698b5953o4518C2035b30906B04863I7996J00328a21876
15565A41662e8703D4496K4656C0985b46995c3960A33010a3819j92599B26116a08495
$$ plain form
15553 247866 -127459 112515 309707 30137 64610 -370708 -40397 52626 379168 21858
15542 380170 100339 101800 -17814 394116 38415 -267955 -12532 132671 -275271 370353
15531 -67508 -140083 -52852 243293 235969 37240 359309 4930 74170 31907 -3487 -100394 144621
15518 -203619 16791 198703 338510 294880 82458 421587 -22294 217683 -14133 44262 285940
15507 285940 305015 314033 234257 429188 171765 195969 129395 295403 249307 205105 -107360
15495 179349 -228902 23422 173894 296 67218 149735 30617 225320 82362 -92701 137390
15483 -266785 21868 34534 286112 -10740 258304 -84273 299567 -80573 373315 331118 618562
15472 618562 496988 415833 193544 73316 140502 -4416 134215 -185178 88039 285515 252684
$$ packed form
15553B47866a27459A12515J97192C0137L4473c70708d0397E2626L26542B1858
15542C80170A00339J461a7814C94116C8415b67955a2532A32671b75271C70353
15531f7508p2575e2852B43293p324C7240L22069D930O9240C1907c487r6907A44621
15518b03619A6791J81912J39807m3630H2458L39129b2294B17683a4133D4262K41678
15507B85940J9075R018p9776J94931A71765K4204o6574J66008m6096m4202a07360
15495A79349b28902B3422J50472B96O6922Q2517C0617J94703H2362i2701A37390
15483b66785B1868J2666K51578a0740B58304h4273B99567h0573C73315m2197K87444
15472F18562j21574q1155A93544G3316O7186d416A34215a85178H8039J97476l2831
$$ plain form
15461 252684 -53835 263906 -30388 107248 156170 151841 -415909 -10397 -16901 -164637 -56225
15449 201643 -96848 110006 -119106 252581 273545 372117 455091 692976 547841 1525645
15439 1525645 978688 575027 456003 -187292 182708 98357 64606 -97548 4206 -139926
15428 145577 194328 -39637 184618 104215 103136 -201297 -9606 187083 201605 -120416 -49548
15416 1734 -164586 -129447 166432 241089 238715 181021 27405 -131864 -80833 -23143 -119602
15405 -119602 -73416 -183002 -65211 -43695 369789 106141 -82175 71992 6858 78135 224135
15394 224135 36247 -234141 134580 -115486 84860 98809 56841 -350157 150913 303754
15384 303754 102771 -78708 194478 -135785 375387 -179654 38031 305710 293682 133018
$$ packed form
15461B52684e3835B63906c0388A07248M8922m329d15909a0397o504j47736e6225
15449B01643i6848A10006a19106B52581K0964R8572Q2974K37885j45135R77804
15439A525645n46957m03661j19024a87292A82708q4351l3751i7548D206a39926
15428A45577M8751c9637A84618q0403j079b01297i606A87083J4522a20416d9548
15416A734a64586L5139A66432P4657k374n7694B7405a31864N1031b3143r6459
15405a19602M6186j09586f5211K1516C69789A06141h2175G1992F858P1277J46000
15394B24135C6247b34141A34580a15486H4860J3949m1968c50157A50913J52841
15384C03754A02771g8708A94478a35785C75387a79654C8031K67679j2028A33018
$$ plain form
15373 20082 316460 482499 195019 -46963 171216 229781 350758 116367 -449807 -229597
15363 -229597 104184 242646 69244 132796 379281 -27963 388814 193202 319915 128730
15352 221145 -43276 365599 -75200 153225 -185282 2744 302644 67326 405542 710889
15342 710889 495264 182152 318173 -100476 222486 -39939 356477 266685 321318 367915
15332 367915 377679 123321 107844 52696 217839 56127 225013 80440 80286 191067 104520
15321 104520 155429 352063 245704 261988 -26195 262726 218696 228537 445765 -121435 170291
15309 147626 -170743 144216 414191 103384 -2472 -58096 234362 183138 -10750 -156912
15299 -156912 -248725 311248 -136408 58720 53419 -105789 114413 -91941 79545 -177633 -150665
$$ packed form
15373B0082K96378J66039A95019d6963A71216N8565J20977A16367d49807K20210
15363b29597A04184J38462F9244O3552K46485b7963C88814A93202J26713A28730
15352B21145d3276C65599g5200A53225a85282B744K99900F7326L38216L05347
15342G10889k15625A82152J36021a00476B22486c9939C56477q9792N4633M6597
15332C67915R764A23321j5477E2696J65143E6127J68886H0440j54J10781q6547
15321A04520N0909J96634j06359J6284b6195B62726m4030R841K17228a21435A70291
15309A47626a70743A44216K69975A03384b472n5624B34362n1224a0750j46162
15299a56912r1813C11248a36408E8720n301a05789A14413i1941G9545a77633K6968
$$ plain form
15288 -150665 -26300 -98562 101950 80009 72396 -3187 86228 -111878 317710 -39675 -90242
15277 -90242 79172 181352 16314 567 -30563 225217 -15889 4342 -2936 155111 -64620 296750
15264 61888 167217 21294 112039 -52987 285684 86593 265075 -55237 -132468 -157170 -179061
15253 -179061 75683 288820 194261 -107279 106630 360887 93802 -60788 354477 306970
15243 306970 823787 1442756 2034493 1575903 1817254 1460111 537781 65586 -202759 -69026
15232 -149063 -666 -3324 74751 98110 188841 91639 2970 -7324 170238 53054 -101605 188757
15219 108603 384246 478852 292844 298649 91196 252003 -101639 130490 -14984 86706 -84194
15207 173852 211036 -2664 -358265 -220156 -132892 344622 74345 275673 213791 -186532 336866
$$ packed form
15288a50665b6300p2262A01950k1941p613c187H6228a11878C17710c9675n0567
15277i0242G9172J02180A6314E67c0563B25217a5889D342b936A55111f4620B96750
15264F1888J05329B1294R0745e2987B85684H6593J78482e5237p7231k4702k1891
15253a79061G5683K13137r4559a07279A06630K54257I3802f0788C54477m7507
15243C06970N16817O18969N91737m58590K41351l57143E37781F5586b02759f9026
15232a49063f66k658G4751K3359R0731I1639B970g324A70238E3054a01605A88757
15219A08603K75643R4606j86008N805I1196J60807a01639A30490a4984H6706h4194
15207A73852L7184b664l55601J38109Q7264C44622G4345K01328o1882a86532C36866
$$ plain form
15195 79809 89990 -165856 -103487 153814 -127896 307879 196799 72545 186010 166198
15185 166198 -8212 35191 53235 66493 -63178 103674 200534 -120500 -125081 112217 314174
15174 314174 133307 217575 93227 14926 76761 -111576 -252438 458130 -35148 164360
15163 200122 -94977 208334 -118179 -29982 116035 -164370 93664 -71486 76373 -82082 122024
15151 160911 14698 103531 -84442 499031 -41443 36132 186587 140656 358287 187844 130263
15140 130263 26240 51042 210913 32681 44254 84067 58398 111087 194467 149164 182645
15129 182645 176071 122757 134117 237207 151623 309283 465934 170327 108054 424483 380210
15118 380210 417989 535588 336429 309414 86996 457445 -69908 312314 73508 -17728 224357
$$ packed form
15195G9809J0181a65856O2369A53814a27896C07879j11080G2545J13465j9812
15185A66198h212C5191J8044J3258f3178A03674R6860a20500m581A12217K01957
15174C14174A33307Q4268I3227A4926O1835a11576j40862D58130c5148A64360
15163B00122i4977B08334a18179b9982A16035a64370I3664g1486G6373h2082A22024
15151A60911A4698Q8833h4442D99031d1443C6132J50455m5931K17631j70443n7581
15140A30263B6240K4802J59871C2681J1573L9813k5669N2689Q3380m5303L3481
15129A82645o574n3314J1360J03090q5584J57660J56651A70327o2273L16429m4273
15118C80210L7779J17599j99159k7015H6996L70449f9908C12314G3508a7728B24357
$$ plain form
15106 292563 408327 118846 28523 241967 18811 -152952 30381 260231 316745 28590
15095 128917 115072 3190 -243184 255581 464531 -30177 -127552 -39694 -26728 235783 221466
15084 221466 -67089 -40544 236010 134394 23662 131433 308688 275933 22924 427877
15074 427877 104808 -11587 2326 -306014 212722 54055 -31263 33941 242659 166918 197298
15063 197298 -51844 -109628 201030 71930 223058 304860 15934 406505 304850 142333
15052 107335 65498 288051 177107 514611 233726 351008 486255 509500 325173 619509
15042 619509 87722 496212 249555 467298 455323 241014 627296 131837 107255 349552
15032 349552 895468 521686 503696 860202 718558 549823 422796 78083 627271 463839
$$ packed form
15106B92563J15764A18846B8523K13444A8811a52952C0381K29850N6514B8590
15095A28917j3845C190b43184B55581K08950c0177r7375c9694J2966B35783j4317
15084B21466f7089K6545B36010j01616B3662J07771J77255l2755B2924M04953
15074D27877A04808a1587B326c06014B12722E4055c1263C3941K08718p5741L0380
15063A97298e1844n7784B01030G1930J51128Q1802A5934L90571j01655A42333
15052A07335m1837K22553j10944L37504B33726J17282J35247K3245j84327K94336
15042F19509H7722M08490k46657K17743j1975k14309L86282A31837k4582K42297
15032C49552N45916l73782j7990L56506j41644j68735j27027G8083N49188j63432
$$ plain form
15022 463839 357035 784123 503479 478016 622985 521991 416823 330663 445564 306211
15012 306211 491693 155520 532375 632650 687312 530388 580026 121633 240391 672200
15002 672200 377496 268176 608273 661759 777163 483261 817939 554448 692242 307354
14991 467209 197873 324291 436350 475367 375282 704123 467842 608983 687892 765480
14981 765480 837498 949463 889121 684466 437072 617444 550231 468780 693766 661299
14971 661299 705564 773157 680038 416391 204854 231506 -92018 158463 181755 73705 362651
14960 362651 290087 417786 296398 221613 197400 75009 318503 473140 233236 519190
14950 519190 302922 469422 348606 433394 754252 358862 712943 659281 490777 294632
$$ packed form
15022D63839j06804M27088k80644k5463J44969j00994j05168q6160J14901j39353
15012C06211J85482A55520L76855J00275N4662j56924M9638A21633J18758M31809
15002F72200k94704j09320L40097N3486J15404k93902L34678k63491J37794C07354
14991D67209A97873J26418J12059L9017j00085L28841k36281J41141P8909P7588
14981G65480P2018J11965o0342k04655k47394J80372o7213q1451K24986l2467
14971F61299M4265O7593r3119k63647B04854K6652i2018A58463K3292G3705K88946
14960C62651p2564J27699j21388p4785k4213G5009K43494J54637B33236K85954
14950E19190k16268J66500j20816Q4788L20858C58862L54081n3662j68504j96145
$$ plain form
14940 294632 326338 575362 302928 187529 434310 465973 280188 767557 897674 646443
14930 646443 1250150 1131160 1183042 1109933 1615679 1869130 1562277 1484737 1387975 1762189
14920 1762189 1390813 1496551 1948721 2091022 2343454 2377206 1700867 1123241 1407325 1298246
14910 1298246 916377 631367 625497 487779 570277 460918 396561 360373 409398 392570 63171
14898 408208 648381 443247 580138 586154 483358 534883 429780 472861 569485 522036 367069
14887 367069 398152 846225 815898 767434 1108570 678416 608307 575991 527229 1141988 644779
14876 644779 777063 608151 758877 688507 605656 751217 766557 308697 553115 669709
14866 669709 587684 803467 1182657 710474 800027 343728 778599 354180 645072 323038
$$ packed form
14940B94632L1706K49024k72434j15399K46781L1663j85785M87369J30117k51231
14930F46443O03707j18990N1882p3109N05746K53451l06853p7540r6762L74214
14920A762189l71376J05738M52170J42301K52432L3752o76339n77626K84084j09079
14910A298246l81869k85010n870j37718Q2498j09359o4357l6188M9025j6828F3171
14898D08208K40173k05134J36891O016j02796N1525j05103M3081R6624m7449j54967
14887C67069L1083M48073l0327m8464L41136m30154p0109l2316m8762O14759m97209
14876F44779J32284j68912J50726p0370q2851J45561J5340C08697K44418J16594
14866F69709q2025K15783L79190m72183Q9553C43728M34871C54180K90892l22034
$$ plain form
14856 323038 559693 236978 499249 111248 848918 631818 391795 446412 379603 690824
14846 690824 666452 816051 865994 903557 1393871 1076165 1331300 1159755 1187063 830796
14836 830796 786465 710207 564307 732937 232672 310331 612301 744474 711157 476672
14826 476672 419887 709687 576160 651756 609715 673996 707851 652215 597437 806344 828152
14815 828152 654265 1009954 494380 644401 470439 479797 732606 676852 653577 653248 969918
14804 969918 733657 1204154 1012971 715831 552228 827114 783934 654159 740511 311640
14793 384915 440812 509155 653041 672811 606599 485200 620326 705083 834836 719595
14783 719595 663642 637124 757748 728161 421908 826968 723294 1133022 952239 1077417
$$ packed form
14856C23038K36655B36978K62271A11248P37670k17100k40023N4617o6809L11221
14846F90824k4372J49599M9943L7563M90314l17706K55135j71545K7308l56267
14836H30796m4331p6258j45900J68630B32672P7659L01970J32173l3317k34485
14826D76672n6785K89800j33527P5596m2041O4281L3855n5636n4778K08907K1808
14815H28152j73887L55689D94380J50021j73962R358K52809n5754k3275l29L16670
14804I69918k36261M70497j91183k97140j63603K74886m3180j29775Q6352C11640
14793C84915N5897O8343J43886J9770o6212j21399J35126Q4757J29753j15241
14783G19595n5953k6518J20624k9587l06253M05060j03674M09728j80783J25178
$$ plain form
14773 1077417 976867 809626 1178032 849740 446337 567379 549358 612757 537776 571073
14763 571073 438261 507758 838890 594445 985460 369117 937843 571119 728934 746937
14753 746937 866396 625442 721099 642857 895063 946992 835988 643706 627025 811651
14743 811651 640849 795094 786878 577378 648875 544092 964282 915234 583542 844815
14733 844815 1082914 524543 883125 1474809 1378944 1462357 1786773 2097733 1990832 1253868
14723 1253868 1554941 918186 845932 1058472 1266490 903832 1037357 915179 990573 969464
14713 969464 1200369 1064926 749614 953079 508954 1030344 572258 1160982 1589108 1384442
14703 1384442 1111307 1546253 2011170 1629703 1768399 1421239 1395811 1063024 987882 849419
$$ packed form
14773A077417j00550j67241L68406l28292m03403J21042j8021O3399p4981L3297
14763E71073j32812O9497L31132k44445L91015C69117N68726l66724J57815J8003
14753G46937J19459k40954R5657p8242K52206N1929j11004j92282j6681J84626
14743H11651j70802J54245q216k09500P1497j04783M20190m9048l31692K61273
14733H44815K38099E24543L58582N91684r5865Q3413L24416L10960j06901p36964
14723A253868L01073o36755p2254K12540K08018l62658J33525j22178P5394k1109
14713I69464K30905j35443l15312K03465m44125N21390m58086N88724M28126k04666
14703A384442k73135M34946M64917l81467J38696l47160k5428l32787p5142j38463
$$ plain form
14693 849419 974998 1117740 935254 715977 718777 952335 1024970 886680 667922 1157038
14683 1157038 1291624 1103556 1050229 1097947 991542 1184551 676004 1016059 792949 1002454
14673 1002454 990657 989967 950728 991895 1335957 1133254 1159779 1118491 772527 1338035 1265383
14662 1265383 976010 1100062 1077448 903258 1319768 908880 1011281 1180869 1297990 1471130
14652 1471130 1034932 1497782 1281073 1406284 1202447 1141373 1469508 1255724 1065129 1283852
14642 1283852 1362138 1478017 1265712 1617056 1300775 1228442 1463688 1205817 1477983 1251596
14632 1251596 1476376 1477691 1336247 1251066 1380736 1232549 1573376 1434841 1424810 1559420
14622 1559420 1762456 1523574 1410800 1493939 1644064 1478665 1604002 1806487 1619764 1415905
$$ packed form
14693H49419J25579J42742j82486k19277K800K33558P2635j38290k18758M89116
14683A157038J34586j88068n3327M7718j06405J93009n08547L40055k23110K09505
14673A002454j1797o90l9239M1167L44062k02703K6525m1288l45964N65508p2652
14662A265383k89373J24052k2614j74190M16510m10888J02401J69588J17121J73140
14652A471130m36198M62850k16709J25211k03837o1074L28135k13784j90595K18723
14642A283852P8286J15879k12305L51344l16281p2333K35246k57871K72166k26387
14632A251596K24780J315j41444q5181J29670j48187L40827j38535j0031J34610
14622A559420K03036k38882j12774Q3139J50125j65399J25337K02485j86723k03859
$$ plain form
14612 1415905 1219891 1471052 1664519 1367351 1379571 1601526 1524116 1615881 1316821 1576744
14602 1576744 1732255 1690359 1205428 1849901 1326050 1882623 1761664 1736659 1575662 1549676
14592 1549676 1708684 1724350 1725877 1741210 1719529 1819037 1717827 1847082 1948490 2093061
14582 2093061 2174398 1932596 2009518 1990267 2117192 2093596 1660675 1890779 2012412 2291026
14572 2291026 2061162 2034245 2068466 2138847 2172604 2151185 2059393 2735333 2644788 2659373 2528682
14561 2528682 2862120 2742372 2753676 2597555 3001608 3049340 3044638 3163284 3696597 3930353
14551 3930353 4864563 5492484 7937850 11721128 20007134 40510174 42483085 19042712
14542 7603086 4261016 3090281 2906728 2674072 3527472 5662236 4159871 2771575 2219075
$$ packed form
14612A415905j96014K51161J93467k97168J2220K21955p7410R1765k99060K59923
14602A576744J55511m1896m84931O44473n23851N56573j20959k5005j60997k5986
14592A549676J59008J5666J527J5333k1681R9508j01210J29255J01408J44571
14582B093061Q1337k41802P6922j9251J26925k3596m32921K30104J21633K78614
14572B291026k29864k6917L4221P0381L3757k1419r1792O75940r0545J4585j30691
14561B528682L33438j19748J1304j56121M04053M7732m702J18646N33313K33756
14551C930353R34210O27921K445366L783278Q286006K0503040J972911A9042712
14542G603086l342070j170735j83553k32656Q53400K134764j502365j388296n52500
$$ plain form
14533 2219075 1878484 2194258 2260718 2048815 1936846 2295806 2363337 2222209 2347680 2277819
14523 2277819 2124405 2562898 2394774 2649261 2773835 2362401 2316698 2406116 2445354 2751751
14513 2751751 2565821 2878061 2713751 3010725 2690498 2825830 2938778 2891789 3122389 3098941
14503 3098941 2976568 2889971 3270506 3101634 2909425 3274041 3346164 3270245 3309516 3445758
14493 3445758 3704997 3761997 3537157 3709230 3503121 3746925 3583971 3559311 3963208 3507322
14483 3507322 3664417 3622118 4041106 3977855 4121215 4179356 4109540 3827918 3904294 3988054
14473 3988054 4254606 4105244 4237362 4328647 4405051 4341652 4469825 4456138 4526218 4567578
14463 4567578 4791169 4450842 4815332 4855023 4918846 4903522 4682705 4956119 5059177 4972910
$$ packed form
14533B219075l40591L15774O6460k11903j11969L58960O7531j41128J25471o9861
14523B277819j53414M38493j68124K54487J24574m11434m5703Q9418L9238L06397
14513B751751j85930L12240j64310K96974l20227J35332J12948m6989K30600k3448
14503C098941j22373q6597L80535j68872j92209L64616P2123p5919L9271J36242
14493C445758K59239N7000k24840J72073k06109K43804j62954k4660M03897m55886
14483C507322J57095m2299M18988o3251J43360N8141o9816k81622P6376Q3760
14473C988054K66552j49362J32118R1285P6404o3399J28173j3687P0080M1360
14463D567578K23591l40327L64490L9691O3823j5324k20817K73414J03058q6267
$$ plain form
14453 4972910 5034110 5169631 5101000 5427692 5610349 5706398 5872379 5609243 5564287 5795923
14443 5795923 6067250 5993881 6131730 6214763 6123647 6276860 6271810 6670677 6188699 6555458
14433 6555458 6725430 6533501 7113265 6744926 7056076 7245502 7379615 7482555 7613148
14424 7613148 7603858 7542339 8218620 8176122 8373027 8511505 8615650 8612973 8631890 8678439 8962801
14413 8962801 8718568 8614814 9050174 9108259 9491186 9431454 9628195 10106699 10416557 10604725
14403 10604725 10803545 10323376 10539684 10613224 10855499 10844058 11170427 11306118 11391199 11858344
14393 11858344 12000569 12164635 12629204 12025031 12768864 13004943 13358032 13423362 13649122
14384 13649122 13840072 14287857 15105543 14985987 15158321 15132440 15732297 15905666 16023392
$$ packed form
14453D972910O1200J35521o8631L26692J82657R6049J65981k63136m4956K31636
14443E795923K71327p3369J37849Q3033r1116J53213n050L98867m81978L66759
14433F555458J69972j91929N79764l68339L11150J89426J34113J02940J30593
14424G613148r290o1519O76281m2498J96905J38478J04145k677J8917M6549K84362
14413H962801k44233j03754M35360N8085L82927n9732J96741M78504L09858J88168
14403A0604725J98820m80169K16308P3540K42275j1441L26369J35691Q5081M67145
14393A1858344J42225J64066M64569o04173P43833K36079L53089O5330K25760
14384A3649122J90950M47785Q17686j19556J72334k5881N99857J73369J17726
$$ plain form
14375 16023392 16491274 16954241 17058204 17194213 17786024 18119861 18334395 18984605 19465825
14366 19465825 19852409 20177006 20559895 20709022 21331130 21827359 22181302 22625476 23413545
14357 23413545 23493286 24103983 24555036 25227251 26151252 26401214 26981471 27952894 28465216
14348 28465216 29342547 30253328 30451182 31722204 32159585 32977970 33756665 35107622 35755988
14339 35755988 36840905 37841482 38870959 40216337 41117791 42368036 43552673 45101238
14331 45101238 46268502 47441518 49043165 50480582 51954098 54012510 56029254 57895289
14323 57895289 59702406 61717812 63791134 66259662 68648019 71186506 73491896 76135342
14315 76135342 78455788 81799311 84667812 88687238 92056673 95935168 99522007 104154730
$$ packed form
14375A6023392M67882M62967J03963J36009N91811L33837K14534O50210M81220
14366A9465825L86584L24597L82889J49127O22108M96229L53943M44174P88069
14357B3413545P9741O10697M51053O72215R24001K49962N80257R71423N12322
14348B8465216Q77331R10781J97854J271022M37381Q18385P78695J350957O48366
14339C5755988J084917J000577J029477J345378R01454J250245J184637J548565
14331D5101238J167264J173016J601647J437417J473516K058412K016744J866035
14323E7895289J807117K015406K073322K468528K388357K538487K305390K643446
14315G6135342K320446L343523K868501M019426L369435L878495L586839M632723
$$ plain form
14307 104154730 108448788 113091578 117861654 123181355 129199536 134898151 141013404 147643473
14299 147643473 154792750 161928145 169805727 178046176 186733632 195877679 205578146 216137373
14291 216137373 227514219 238615804 250529776 263203703 276555013 290177620 304089833
14284 304089833 318601874 333460548 348659171 363625955 378267973 393296260 407193049
14277 407193049 420653813 432777942 443391953 451383428 455566241 458376814 459655573
14270 459655573 459798213 458394984 454868898 450424482 442724397 433534429 422957436 411013964
14262 411013964 397530660 383499243 368341472 352846237 336963543 321347748 305500809
14255 305500809 290686343 276499324 262252462 248949700 236321685 224436228 212653509
$$ packed form
14307A04154730M294058M642790M770076N319701O018181N698615O115253O630069
14299A47643473P149277P135395P877582Q240449Q687456R144047R700467J0559227
14291B16137373J1376846J1101585J1913972J2673927J3351310J3622607J3912213
14284C04089833J4512041J4858674J5198623J4966784J4642018J5028287J3896789
14277D07193049J3460764J2124129J0614011P991475M182813K810573J278759
14270D59655573J42640j403229l526086m444416p700085r189968j0576993j1943472
14262D11013964j3483304j4031417j5157771j5495235j5882694j5615795j5846939
14255C05500809j4814466j4187019j4246862j3302762j2628015j1885457j1782719
$$ plain form
14248 212653509 202807472 193753808 183643089 174493962 166664428 158632727 151111820 143968251
14240 143968251 137242261 131040070 125178517 119896079 114724577 109491136 104550494 100313880
14232 100313880 96431389 93122185 89329122 85665347 82485553 78884579 75660985 72952461
14224 72952461 70502811 67720151 65502309 63584290 61217801 58999155 56891212 55184475
14216 55184475 53294973 51461505 50363735 48967009 47488023 45997316 44534908 43170957
14208 43170957 41684238 41132041 40193350 38920917 37617451 36321575 35889860 34742959
14200 34742959 33761170 32727966 31948205 30997076 30358059 29576123 28959101 28367591 27576966
14191 27576966 26735284 25845102 25609930 25033675 24338902 23511365 23082649 22464896 22354667
$$ packed form
14248B12653509r846037r053664j0110719r149127p829534q031701p520907p143569
14240A43968251o725990o202191n861553n282438n171502n233441m940642m236614
14232A00313880l882491l309204l793063l663775l179794l600974l223594k708524
14224G2952461k449650k782660k217842j918019k366489k218646k107943j706737
14216E5184475j889502j833468j097770j396726j478986j490707j462408j363951
14208D3170957j486719n52197r38691j272433j303466j295876m31715j146901
14200C4742959r81789j033204p79761r51129o39017p81936o17022n91510p90625
14191B7576966q41682q90182k35172n76255o94773q27537m28716o17753j10229
$$ plain form
14182 22354667 21879543 21113272 20742863 20381843 19678101 19437416 19041080 18719061 18155733
14173 18155733 17940428 17609044 17237562 16914872 16678662 16236689 15953407 16057459 15324765
14164 15324765 15007728 14750914 14604017 14190563 14149768 13910275 13669797 13649481 12749307 13085701
14154 13085701 12718982 12502469 12315977 11885288 11972693 11736847 11289793 11360573 11405685 10835887
14144 10835887 10496355 10485366 10444130 10285040 10344211 9941981 9773451 9675311 9693451 9421571
14134 9421571 9677420 9210940 8692678 8860395 8730297 8780062 8413098 8735496 8242240 7949794
14124 7949794 8113908 7925548 7850368 7819613 7816847 7540139 7309556 7426250 7318132 7520297
14114 7520297 6949900 7276576 6974358 6963435 6681687 6372496 6620523 6494393 6474149 6063726
$$ packed form
14182B2354667m75124p66271l70409l61020p03742k40685l96336l22019n63328
14173A8155733k15305l31384l71482l22690k36210m41973k83282J04052p32694
14164A5324765l17037k56814j46897m13454m0795k39493k40478k0316r00174L36394
14154A3085701l66719k16513j86492m30689Q7405k35846m47054P0780M5112n69798
14144A0835887l39532j0989m1236j59090N9171m02230j68530r8140J8140k71880
14134I421571K55849m66480n18262J67717j30098M9765l66964L22398m93256k92446
14124G949794J64114j88360p5180l0755k766k76708k30583J16694j08118K02165
14114G520297n70397L26676l02218j0923k81748l09191K48027j26130k0244m10423
$$ plain form
14104 6063726 6322054 6210570 6013372 6216158 6176185 5850136 5809426 5904795 5905073 5807328 5669451
14093 5669451 5484188 5411903 5461634 5249048 5279432 5228562 4899157 4959693 4968390 5224174 4845900
14082 4845900 5075468 4930466 4888011 4542971 4779247 4745892 4417250 4545522 4622892 4351055
14072 4351055 4367363 4209617 4343157 4454242 3923180 4082135 4354432 4245145 4210398 4453493
14062 4453493 4042127 4124504 4029312 4092936 4112160 3692216 4033487 4149054 3684760 4006683
14052 4006683 3631258 3415158 3447517 3200114 3269525 3561493 3190025 3671588 2900327 3020288
14042 3020288 3077744 3329007 3024105 3081381 3191398 3145919 2667891 3013355 2927821 3061347
14032 3061347 3090627 3079733 3074860 3166832 3437504 2807485 2918037 2880752 3071709 2936299
$$ packed form
14104F063726K58328j11484j97198K02786l9973l26049m0710R5369K78r7745j37877
14093E669451j85263p2285M9731k12586L0384n0870l29405O0536Q697K55784l78274
14082D845900K29568j45002m2455l45040K36276l3355l28642J28272P7370k71837
14072D351055J6308j57746J33540J11085n31062J58955K72297j09287l4747K43095
14062D453493m11366Q2377r5192O3624J9224m19944L41271J15567m64294L21923
14052D006683l75425k16100L2359k47403O9411K91968l71468M81563p71261J19961
14042C020288N7456K51263l04902N7276J10017m5479m78028L45464q5534J33526
14032C061347K9280j0894m873R1972K70672o30019J10552l7285J90957j35410
$$ plain form
14022 2936299 2630874 2515519 2648025 2663578 2608567 2704697 2466290 2142743 2399034 2355213
14012 2355213 2530377 2292546 2415968 2473283 2077163 2372316 2191835 1999727 2135488 2312991
14002 2312991 2198626 2624622 2386537 2400963 2547924 2394752 1904639 2065477 2233252 2166586
13992 2166586 2276262 2419442 2496458 3774525 6107473 12299635 31143224 46567447
13984 46567447 26415865 13238906 8021016 5843252 4837103 4139984 3745617 3536817
13976 3536817 2867247 3124552 2807233 2530733 2524631 2460965 2230289 2439668 2172448 1907301
13966 1907301 2387804 2199925 2259486 2194630 2004841 2192447 2052458 2059219 2470798 2085827
13956 2085827 2158937 1480147 1863914 2326100 1750672 1833297 1864811 2001458 1824385 1678128
$$ packed form
14022B936299l05425j15355J32506J5553n5011R6130k38407l23547K56291m3821
14012B355213J75164k37831J23422N7315l96120K95153j80481j92108J35761J77503
14002B312991j14365M25996k38085J4426J46961j53172m90113J60838J67775o6666
13992B166586J09676J43180P7016J278067K332948O192162J8843589J5424223
13984D6567447k0151582j3176959n217890k177764j006149o97119l94367k08800
13976C536817o69570K57305l17319k76500o102o3666k30676K09379k67220k65147
13966A907301M80503j87879N9561o4856j89789J87606j39989O761M11579l84971
13956B085827P3110o78790L83767M62186n75428Q2625L1514J36647j77073j46257
$$ plain form
13946 1678128 1907003 1659694 1736060 1602851 1618481 1689827 1681106 1866321 1440964 1676752
13936 1676752 1557393 1795182 1670912 1630930 1740172 1789427 1733568 1425233 1612947 1634556
13926 1634556 1437687 1726099 1598521 1542724 1544633 1411310 1556878 1711886 1808558 1696484
13916 1696484 1332217 1565752 1345962 1897312 1349219 1435335 1534747 1479733 1300537 1211692
13906 1211692 1422146 1358163 1370266 1353888 1259547 1409548 1186118 1319873 925753 1219791
13896 1219791 1346498 1233018 793911 973453 1386356 1066544 1395455 1159939 761326
13887 761326 1580701 1102033 1348505 1073819 1193451 1186557 1279230 1139867 1258067 1450112
13877 1450112 1269696 1268643 1181856 981068 1197128 1135169 1099873 1049147 1013901 1320262 985239
$$ packed form
13946A678128K28875k47309P6366j33209J5630P1346q721J85215m25357K35788
13936A676752j19359K37789j24270l9982J09242M9255n5859l08335J87714K1609
13926A634556j96869K88412j27578n5797J909j33323J45568J55008R6672j12074
13916A696484l64267K33535k19790N51350n48093Q6116R9412n5014j79196q8845
13906A211692K10454o3983J2103j6378r4341J50001k23430J33755l94120K94038
13896A219791J26707j13480m39107J79542M12903l19812L28911k35516l98613
13887G61326Q19375m78668K46472k74686J19632o894R2673j39363J18200J92045
13877A450112j80416j053q6787k00788K16060o1959l5296n0726l5246L06361l35023
$$ plain form
13866 985239 1256201 1121164 1098662 1225185 1115946 1306953 969073 855385 942458 1142820
13856 1142820 746926 1029669 633692 1129780 1303148 1118958 885227 796304 893849 1039712
13846 1039712 921107 1157703 749543 593103 812407 818008 803919 1029936 740357 1077424
13836 1077424 873701 945509 669172 930547 860819 675181 841981 1186962 1131853 953891
13826 953891 861564 983250 880601 654512 1203957 744226 919545 936416 701433 593830
13816 593830 807188 868939 1143797 644976 664617 817214 937879 984383 553092 771385
13806 771385 631250 773939 989997 651497 638087 806092 627315 529459 896416 592173
13796 592173 616666 874850 721977 1096206 768386 448937 829721 470943 553845 726589
$$ packed form
13866I85239K70962j35037k2502J26523j09239J91007l37880j13688Q7073K00362
13856A142820l95894K82743l95977M96088J73368j84190k33731q8923R7545J45863
13846A039712j18605K36596m08160j56440K19304N601j4089K26017k89579L37067
13836A077424k03723P1808k76337K61375o9728j85638J66800L44981n5109j77962
13826I53891r2327J21686j02649k26089N49445m59731J75319J6871k34983j07603
13816E93830K13358O1751K74858m98821J9641J52597J20665M6504m31291K18293
13806G71385j40135J42689K16058l38500j3410J68005j78777r7856L66957l04243
13796E92173K4493K58184j52873L74229l27820l19449L80784l58778Q2902J72744
$$ plain form
13786 726589 551046 463901 622582 691900 827643 712352 709247 498901 621966 816446
13776 816446 495915 985617 856237 554336 741841 338765 661231 763241 637230 618919
13766 618919 657200 625118 767132 713442 380726 601005 751864 395040 635133 563747
13756 563747 593744 981639 249704 791583 765805 660087 751341 1095575 428643 442634
13746 442634 984059 659756 576175 797070 662990 365306 954034 472318 502586 398022
13736 398022 430413 954750 432010 442783 336414 417942 770058 689915 447862 426285
13726 426285 676437 667587 314088 433066 382236 574104 667390 329810 619612 339677
13716 339677 798703 600557 449944 520235 468101 533739 664628 501655 489128 334512
$$ packed form
13786G26589j75543q7145J58681O9318J35743j15291l105k10346J23065J94480
13776H16446l20531M89702j29380l01901J87505C38765L22466J02010j26011j8311
13766F18919L8281l2082J42014n3690l32716K20279J50859l56824K40093p1386
13756E63747K9997L87895B49704N41879k5778j05718R1254L44234D28643J3991
13746D42634N41425l24303q3581K20895j34080k97684N88728D72318L0268j04564
13736C98022L2391N24337D32010J0773j06369Q1528L52116q0143k42053k1577
13726D26285K50152q850C14088J18978n0830J91868R3286C29810K89802k79935
13716C39677M59026j98146j50613P0291n2134O5638J30889j62973j2527j54616
$$ plain form
13706 334512 594422 189743 552491 759298 649240 853053 708918 72297 401156 666880
13696 666880 421495 100292 225231 280663 393348 703039 514473 579672 600761 602224
13686 602224 352592 557744 449272 554312 407811 867486 365622 260718 637163 333071
13676 333071 393291 428077 659551 494639 253060 523698 613197 502132 520935 744631
13666 744631 662986 210099 308602 279616 452702 323484 498966 583486 206925 216540 614463
13655 614463 365509 472920 576816 352421 595899 239593 542491 531205 344170 435112
13645 435112 278501 438017 105535 235549 291630 399888 105359 619033 336295 199993
13635 199993 67483 783554 598024 363078 261043 228545 4405 518595 680671 612881
$$ packed form
13706C34512K59910A89743L62748K06807j10058K03813j44135G2297L28859K65724
13696F66880k45385A00292J24939N5432J12685L09691j88566O5199K1089J463
13686F02224k49632K05152j08472J05040j46501M59675C65622j04904L76445l04092
13676C33071O0220L4786K31474j64912k41579K70638Q9499j11065J8803K23696
13666G44631q1645B10099R8503k8986J73086j29218J75482Q4520B06925R615L97923
13655F14463k48954J07411J03896k24395K43478B39593L02898j1286j87035R0942
13645D35112j56611J59516A05535J30014N6081J08258A05359N13674k82738j36302
13635A99993F7483P16071j85530k34946j02035l2498D405N14190J62076o7790
$$ plain form
13625 612881 11780 39546 497096 178582 85354 639273 251587 213039 684556 -76313
13614 301312 348501 578805 -117739 178718 207524 466672 269946 600719 260461 387392
13604 387392 356656 346245 311275 219704 420130 335253 389748 291293 198500 242543 439653
13593 439653 663117 270941 43594 429226 226240 325871 304551 259402 612327 138069
13582 74436 385255 409228 221129 448257 334949 304814 120845 533271 412155 138867
13571 550390 400846 312874 150046 337354 592843 594276 134593 545022 92391 246233
13561 246233 131695 456097 153455 342017 253687 47534 300677 417556 274118 287275
13551 287275 381546 497814 280925 389481 26291 113179 109929 280255 138498 321718
$$ packed form
13625F12881A1780K7766M57550A78582H5354N53919B51587l8548M71517g6313
13614C01312M7189K30304a17739A78718K8806K59148j96726L30773B60461J26931
13604C87392l0736j0411l4970r1571K00426q4877N4495r8455r2793M4043J97110
13593D39653K23464B70941D3594L85632k02986R9631k1320m5149L52925A38069
13582G4436L10819K3973j88099K27128j13308l0135A20845M12426j21116A38867
13571E50390j49544q7972A50046J87308K55489J433A34593M10429I2391J53842
13561B46233j14538L24402A53455J88562q8330D7534K53143J16879j43438J3157
13551B87275R4271J16268k16889J08556B6291Q6888l250J70326A38498J83220
$$ plain form
13541 321718 466322 543332 62623 -171827 37026 443055 296503 141964 449938 391620
13531 391620 504040 65401 -143953 449665 563732 360961 118452 405610 776403 134793
13520 37810 369902 412600 278536 61379 -39243 53617 -43267 315345 143716 143747 436151
13509 436151 250796 198728 532282 121951 283845 371481 275010 121802 239904 -71117
13498 546676 -7524 641294 146259 -216785 188764 15706 134086 299871 175526 488626
13488 488626 175512 73748 19213 242354 361144 72132 310460 460696 317851 262435
13478 262435 347407 314772 36283 128071 307496 -59774 -34320 413291 -113079 231325 617038
13467 617038 264669 393943 300795 44012 267447 275494 156401 397969 174580 478066
$$ packed form
13541C21718J44604P7010F2623a71827C7026M06029j46552A41964L07974n8318
13531C91620J12420F5401a43953D49665J14067k02771A18452K87158L70793A34793
13520C7810L32092M2698j34064F1379c9243E3617d3267C15345A43716L1K92404
13509D36151j85355n2068L33554A21951J61894Q7636r6471A21802J18102g1117
13498E46676g524F41294A46259b16785A88764A5706J18380J65785j24345L13100
13488D88626A75512G3748A9213K23141J18790G2132K38328J50236j42845n5416
13478B62435Q4972l2635C6283R1788J79425e9774K5454D13291a13079B31325L85713
13467F17038B64669J29274r3148D4012K23435Q047j19093K41568A74580L03486
$$ plain form
13457 478066 474157 442193 535755 120594 12467 84287 218288 303267 154375 365250 252483
13446 252483 93379 184623 -24828 435750 32197 151467 84812 192968 228965 264297 195245
13435 195245 6806 20088 145389 398357 371048 -382373 292166 223702 80804 -153477 178418
13423 559517 174240 201936 282765 -82223 36573 469477 277194 318278 233099 218540 70441
13411 82419 353896 191486 426308 136866 384360 295856 156031 -2861 186098 340272
13401 340272 91745 185561 335232 164362 354289 188588 125851 355925 223316 -69049
13390 191170 164543 359678 120279 -8244 28679 -231085 -198512 606250 -40660 248279 277485
13379 277485 -155538 -240440 190811 249788 240077 222965 387271 200044 179008 99810 389473
$$ packed form
13457D78066l909l1964R3562A20594A2467P1820J34001Q4979j48892K10875j12767
13446B52483I3379R1244b4828D35750C2197J19270o6655J08156L5997L5332o9052
13435A95245F806J3282J25301K52968k7309c82373B92166o8464H0804a53477A78418
13423E59517A74240K7696Q0829h2223C6573M32904j92283M1084q5179j4559G0441
13411H2419K71477j62410K34822A36866K47494q8504j39825b861A86098J54174
13401C40272I1745R3816J49671A64362J89927j65701o2737K30074j32609f9049
13390A91170k6627J95135A20279h244B8679b31085L2573F06250d0660B48279K9206
13379B77485a55538q4902A90811N8977r711j7112J64306j87227k1036p9198K89663
$$ plain form
13368 389473 326582 -78960 370312 61425 226457 364757 -78567 68065 160220 206080 239286
13357 239286 100594 32906 219223 188448 90384 57867 329795 16319 172327 365396
13347 365396 272071 250380 53802 396801 22633 51344 261222 148499 95206 211916 484213
13336 484213 -132370 468304 163210 395218 122801 277185 68030 89799 -46944 191014
13325 389630 186247 147512 272849 332878 385440 266176 167157 94906 446749 366434 54226
13313 257165 178384 176573 239640 373000 371553 87462 130640 -42628 189692 -158265 -39562
13301 110320 585488 397999 483404 -27 164248 148386 282429 304041 205175 210354 -117809
13289 -96682 233981 152829 35349 -92933 176993 597759 152807 190240 115810 86705 150154
$$ packed form
13368C89473o2891g8960C70312F1425J65032J38300g8567F8065R2155M5860L3206
13357B39286A00594C2906J86317l0775I0384l2517K71928A6319J56008J93069
13347C65396r3325k1691E3802L42999B2633K8711K09878j12723n3293J16710K72297
13336D84213a32370D68304A63210K32008A22801J54384F8030K1769d6944A91014
13325C89630A86247l8735J25337O0029N2562j19264r9019p2251L51843q0315E4226
13313B57165p8781j811O3067J33360j447H7462M3178d2628A89692a58265c9562
13301A10320M75168j87489Q5405b7A64248j5862J34043K1612r8866N179a17809
13289i6682B33981q1152C5349i2933A76993M20766A52807L7433p4430k9105O3449
$$ plain form
13278 150154 111972 230652 15341 -124687 201440 81380 30766 80875 337011 125684
13267 145589 -131587 -163779 152073 190732 -134101 -100499 26617 266698 220496 138050 34101
13255 15914 188436 86359 48874 81906 -65697 -63079 295418 -75660 81873 169831 -29752
13243 229 -61301 368998 120189 131653 197856 -69081 195595 536327 12896 -105175 244869
13231 22310 443615 64045 -133437 -76534 -46418 139522 260375 129838 3865 188914 102546
13220 102546 99986 125088 -42457 157986 -289906 252052 -108579 40818 187540 59310 -80508
13208 -158782 290100 -241799 265598 163150 -118332 192445 -146812 -41964 -77171 324508
13197 -32954 -191812 -134393 271292 -228262 5870 99837 118285 -55412 -178229 279370 -408639
$$ packed form
13278A50154l8182J18680A5341a24687B01440H1380C0766N0109K56136A25684
13267A45589a31587l2192A52073L8659a34101L3602B6617K40081m6202q2446C4101
13255A5914J72522H6359l7485L3032f5697K618B95418g5660H1873Q7958b9752
13243B29f1301C68998A20189J1464O6203f9081A95595L40732A2896a05175B44869
13231B2310M21305F4045a33437N6903L0116A39522J20853A29838C865J85049q6368
13220A02546k560K5102d2457A57986b89906B52052a08579D0818J46722E9310h0508
13208a58782B90100b41799B65598j02448a18332A92445a46812d1964l5207C24508
13197c2954j58858N7419B71292b28262E870R3967J8448e5412j22817B79370d08639
$$ plain form
13185 -177456 -78559 368771 367448 142765 380718 259429 374963 147174 105512 249291
13175 249291 278705 99066 -131441 -203542 -79681 143798 -13496 -124762 445687 57941 406082
13164 406082 -199303 -66004 84768 -64870 21490 -171273 316035 -97953 107634 65615 -108709
13152 118355 268421 197497 -51089 41102 245968 133584 295512 171815 10306 -30308
13141 -205893 -101492 -29934 163662 114989 21513 94399 94539 40639 69830 75538 273547
13130 273547 35552 300346 103344 89388 -179941 -20561 -276044 137079 -306797 -67289
13119 19845 -15061 -126181 -56826 -6492 90880 -22385 -151221 -199137 472529 51183 127416
13108 127416 91723 -113115 120497 423028 -131510 35091 -127571 106237 57266 -162571
$$ packed form
13185a77456g8559C68771j323A42765K37953j21289J15534A47174m1662J43779
13175B49291K9414I9066a31441p2101g9681A43798a3496j11266D45687E7941L48141
13164D06082a99303f6004H4768f4870B1490a71273C16035i7953A07634m2019a08709
13152A18355J50066p0924e1089D1102K04866j12384J61928j23697A0306c0308
13141b05893a01492b9934A63662m8673B1513P2886J40D0639K9191N708J98009
13130B73547C5552K64794A03344j3956a79941b0561k55483A37079c06797f7289
13119A9845a5061j11120e6826f492I0880b2385j28836m7916D72529E1183P6233
13108A27416l5693a13115A20497L02531a31510C5091a27571A06237m8971a62571
$$ plain form
13097 244956 142361 230545 294990 -94419 206359 -115988 288412 -164922 30565 -33372
13086 128071 167975 239667 49938 10130 51471 70909 -189690 24942 106061 -33575 -223216
13075 -223216 -111644 -34086 263236 377644 297612 -189115 310676 -170522 -37093 75139
13064 32107 72593 -30305 135366 10163 21181 -189676 202900 167786 132357 186025 -124216
13052 -29690 139981 25247 30926 80283 223279 108228 71727 263118 35537 204945 -174224
13040 76548 111917 -113509 -286258 139418 164562 148052 -193218 302023 -199267 -92873
13029 -57576 -184377 51345 -98075 -21587 356047 349566 52104 66251 66209 107210 -31704 236053
13016 -89023 288062 342564 88968 163080 -145391 337868 215252 194972 13215 -169847 -42838
$$ packed form
13097B44956j02595Q8184O4445i4419B06359a15988B88412a64922C0565c3372
13086A28071L9904P1692D9938A0130M1341J9438a89690B4942Q1119c3575j89641
13075b23216J11572c4086B63236J14408q0032a89115C10676a70522c7093G5139
13064C2107M0486c0305A35366A0163J1018a89676B02900l5114l5429N3668a24216
13052b9690A39981B5247N679M9357J42996A08228l6501J91391C5537J69408a74224
13040G6548L5369a13509j72749A39418K5144j6510a93218C02023a99267i2873
13029e7576j26801E1345i8075b1587C56047o481E2104J4147m2M1001c1704B36053
13016h9023B88062N4502H8968P4112a45391C37868j22616k0280A3215a69847d2838
$$ plain form
13004 44168 149772 -34268 206557 167301 -98446 36316 94402 -165155 -83890 90292 -123969
12992 176907 -432274 -154074 21367 10203 103955 87881 239942 -44185 117137 -215777
12981 -492183 -16252 -151035 -238059 221257 105202 -79416 155613 -87818 245221 -21055
12970 -198702 -244399 -231934 -254514 -84543 -306648 76903 -244672 29454 19000 271315 126290
12958 -133208 34334 201089 -104926 83159 39804 58591 90236 36472 -243909 146555 -91917
12946 -337107 51349 196807 171052 520156 -106390 -74389 -149844 65678 -327320 42932 -32100
12934 -35960 -32860 318944 -101478 -12752 -57020 69442 16926 -183322 161908 -150677 -8079
12922 -30902 -129148 11862 60763 373412 573058 93144 -9170 -123044 228751 148769 115286
$$ packed form
13004D4168J05604c4268B06557l9256i8446C6316N8086a65155Q1265I0292a23969
12992A76907d32274a54074B1367A0203R3752j6074J52061d4185A17137b15777
12981d92183a6252j34783q7024B21257A05202g9416A55613h7818B45221b1055
12970a98702m5697J2465k2580h4543k22105G6903b44672B9454j0454K52315A26290
12958a33208C4334J66755a04926H3159C9804J8787L1645C6472b43909A46555i1917
12946c37107E1349J45458k5755L49104a06390L2001p5455F5678c27320D2932c2100
12934c5960L100C18944a01478a2752m4268F9442A6926a83322A61908a50677h079
12922c0902r8246A1862M8901L12649J99646I3144i170j13874B28751p9982l3483
$$ plain form
12911 115286 -86619 -45645 -361452 84456 102273 266963 341949 -153275 70467 -183583 35480
12899 91549 -38135 -52799 -141483 -100016 -45043 -6987 -64019 11792 -244491 107245 -35958
12887 35514 -252087 -105708 255971 -164227 233112 -56715 27641 -48171 -139695 -124817 238975
12875 -178215 127083 -21907 -283107 123805 65385 -89915 -275088 58560 67263 -294499 -24810
12863 94959 -44811 138522 29810 91025 10143 213983 -71789 -156418 95835 -324736 165027
12851 -43861 -18007 -1782 101148 -223236 40432 127640 -107898 158671 -99482 37140 77406
12840 77406 105407 -29561 -215765 -61160 -141019 205986 322826 236923 243359 116264 226729
12829 226729 105976 117708 5704 -49822 397185 -226591 -59146 -219869 97641 148425 168116
$$ packed form
12911A15286h6619M0974l15807H4456J7817J64690P4986a53275G0467a83583C5480
12899I1549c8135j4664q8684M1467d5043f987n7032A1792b44491A07245c5958
12887C5514b52087a05708B55971a64227B33112e6715B7641d8171r1524J4878B38975
12875a78215A27083b1907k61200A23805n8420h9915j85173E8560Q703b94499b4810
12863I4959d4811A38522B9810O1215A0143K03840g1789q4629I5835c24736A65027
12851d3861a8007a782A01148b23236D0432Q7208a07898A58671i9482C7140M0266
12840G7406K8001b9561j86204f1160p9859B05986J16840q5903O436A16264J10465
12829B26729A05976J1732E704d9822C97185b26591e9146j60723I7641N0784J9691
$$ plain form
12818 168116 -57998 38678 38852 -88356 -4032 -328447 54230 111400 207241 -236797 31088 -197374
12805 -27407 104324 89002 -58233 345606 50975 339368 84089 -35582 -37131 -227174 75163
12793 152735 343760 358581 -16724 178587 -2145 -297815 -163820 -318610 -81573 126833
12782 -11200 -171921 15023 -272395 362720 133730 -107692 -2476 -271856 -134928 -128017 211037
12770 -246474 -100321 -164737 134501 -397294 144850 -154109 -183428 -103720 -220964 -109041
12759 2027 125868 -11527 32517 296538 164937 511525 -51789 -115559 -226029 244720 180739
12748 180739 -428944 174754 88179 92789 179836 161287 98050 185716 -70902 167037 253154
12737 253154 35310 -97585 -31980 -15973 69314 -122958 -160342 129801 21921 -11541 13945
$$ packed form
12818A68116e7998C8678J74h8356d032l24415E4230N7170R5841b36797C1088a97374
12805b7407A04324j5322e8233C45606E0975K88393H4089c5582j549j90043G5163
12793A52735J91025J4821a6724A78587b145k95670J33995j54790h1573A26833
12782a1200j60721A5023b72395C62720A33730a07692b476k69380a34928O911B11037
12770b46474a00321o4416A34501c97294A44850a54109k9319P9708j17244a09041
12759B027J23841a1527C2517K64021j31601L46588e1789o3770j10470B44720o3981
12748A80739d28944A74754q6575M610Q7047j8549o3237Q7666g0902A67037Q6117
12737B53154C5310i7585c1980a5973F9314a22958l7384A29801B1921a1541A3945
$$ plain form
12725 79535 39061 105669 137257 78914 237086 153200 -303837 10187 -104628 -219199 -58172
12713 -55405 10611 -69114 83462 161708 280981 214290 -264854 25073 -243270 155899 220379
12702 220379 429640 -246703 -24921 251945 -44111 -74589 81584 203211 -7713 -311158 28903
12690 188401 102594 -58140 -39112 -104529 242688 -83434 191159 448780 611042 185950
12679 15387 269512 125698 -77045 52308 -28932 -44222 76486 -49407 -41116 114483 32348
12667 -113171 -166202 -211727 -375084 87794 219407 165423 -99779 -127074 197949 237636 69413
12655 198395 82128 10709 -41798 417525 197963 -1948 -211915 -217870 -83884 -274895 -68815
12643 -129675 50317 -280916 -121444 145382 -154875 -16227 -14852 102596 27228 367984
$$ packed form
12725G9535C9061O6608L1588n8343J58172q3886c03837A0187a04628j14571e8172
12713e5405A0611f9114H3462P8246J19273o6691b64854B5073b43270A55899O4480
12702B20379K09261b46703b4921B51945d4111l0478H1584J21627g713l03445B8903
12690A88401q5807e8140J9028o5417B42688h3434A91159K57621J62262A85950
12679A5387K54125A25698g7045E2308b8932j5290G6486d9407Q291A14483C2348
12667a13171n3031m5525j63357H7794J31613n3984i9779k7295A97949L9687F9413
12655A98395H2128A0709d1798D17525A97963a948k09967n955h3884j91011f8815
12643a29675E0317b80916a21444A45382a54875a6227J375A02596B7228L40756
$$ plain form
12633 367984 20369 112751 118540 245393 178955 -34759 108259 63076 40917 -32791 300012
12621 -259944 473595 -131715 257770 254201 18657 -2915 -170463 -18070 -127746 -154162 -13631
12609 -122783 -203623 -112493 333918 272088 -141393 -266847 50432 -47929 -64420 -49653 -21874
12597 168529 42618 164122 125360 -151590 -159118 -548652 -5913 -166707 52685 59294 -227979
12585 -158766 122171 -40960 -110458 -378734 197949 -79190 261317 54380 74894 160162 -63789
12573 64268 248986 148684 -5765 72694 -75879 51305 189139 207303 -31135 -50461 -220965
12562 -220965 -9745 122840 340782 78678 97320 148707 -2677 424839 -407399 -39680 209111
12550 -78504 -117981 322864 -60808 7705 -276218 -94873 -167297 -207262 49283 87982 299349
$$ packed form
12633C67984B0369R2382N789J26853o6438c4759A08259m5183k2159c2791C00012
12621b59944D73595a31715B57770l569A8657b915j67548a8070j09676k6416a3631
12609a22783q0840R1130C33918o1830a41393j25454E0432d7929j6491J4767b1874
12597A68529D2618J21504l8762a51590p528l89534e913j60794E2685O609b27979
12585a58766A22171d0960o9498k68276A97949g9190B61317E4380K0514Q5268f3789
12573F4268J84718j00302e765G2694g5879E1305J37834J8164c1135j9326j70504
12562b20965i745A22840K17942G8678J8642N1387b677D24839d07399c9680B09111
12550g8504l9477C22864f0808G705b76218i4873p2424l9965D9283L8699K11367
$$ plain form
12539 299349 47115 -6817 90642 -374923 -46009 147524 127388 -146484 -79000 79433 -490797
12527 -128919 -217623 -137322 -376294 57359 -23949 -80555 -368077 -61117 12653 -270340 117711
12515 134777 -225874 -39802 -364132 -27362 -42844 294135 -258542 -30625 89756 34649 282503
12504 282503 -179267 -128724 -107907 -36698 -61442 -5750 -104250 189541 51441 -306343 -236826
12493 -236826 39306 348284 -266663 58097 -126505 -45 406 -8508 35797 194336 -124506 -53150
12480 184265 -14123 253332 -8794 -169565 1353 476551 98712 207243 95828 -75872 219154
12468 60988 230417 14244 -135347 34698 -12893 -197602 94923 287411 204530 99200 -448789
12456 30173 -103094 -299539 -27737 -154484 287937 45250 -15986 -210477 92136 -220412
$$ packed form
12539B99349D7115f817I0642c74923d6009A47524k0136a46484O7484G9433d90797
12527a28919q8704Q0301k38972E7359b3949n6606k87522f1117A2653b70340A17711
12515A34777b25874c9802l24330b7362j5482B94135b58542c0625H9756C4649K47854
12504B82503a79267N0543K0817c6698k4744e750r8500A89541E1441c06343O9517
12493b36826C9306L08978b66663E8097a26505d5D06h508C5797J58539a24506e3150
12480A84265a4123B53332h794j60771A353M75198I8712J08531I5828g5872B19154
12468F0988J69429A4244a35347C4698a2893j84709I4923J92488q2881I9200d48789
12456C0173a03094j96445b7737j26747B87937D5250a5986j94491I2136b20412
$$ plain form
12445 -265657 -79865 159724 180286 -38643 -322725 -109835 -278549 59184 55224 84452 -41963
12433 -205572 -45969 28909 -223119 70414 -343658 171575 -121201 30920 -88844 -21905 -126705
12422 -126705 361585 34235 -163101 -93939 -235589 -14035 69507 62950 3935 -21767 121696
12410 -170241 -132163 184101 85687 91388 -79322 99596 391604 -34307 210343 372383 -62715
12398 51444 -341806 -38328 -186582 -157416 369067 -215651 23107 -97654 49259 149485 -76179
12386 -201766 173504 -385044 146599 126607 156004 -235981 -85472 -9415 -166658 381536
12375 -82584 -176431 292383 -211008 -113469 -14248 274170 199157 81355 244410 -29077 115933
12363 91958 -245749 442841 112908 140125 -16871 110246 -124416 354407 94967 257410
$$ packed form
12445b65657g9865A59724K0562c8643k84082a09835j68714E9184l960K9228d1963
12433b05572d5969B8909b23119G0414c43658A71575a21201C0920h8844b1905j04800
12422a26705C61585C4235a63101O9162j41650a4035F9507o557C935b1767A21696
12410a70241L8078A84101H5687N701g9322I9596K92008c4307B10343J62040f2715
12398E1444c41806c8328j48254K9166C69067b15651B3107i7654D9259J00226g6179
12386b01766A73504c85044A46599j9992K9397b35981h5472i415j57243C81536
12375h2584r3847B92383b11008R7539a4248B74170p5013H1355J63055b9077A15933
12363I1958b45749D42841A12908K7217a6871A10246a24416C54407I4967J62443
$$ plain form
12353 257410 -110037 -51004 304831 -147652 133564 157040 -78391 503422 37954 -129846
12342 11661 14577 -250706 -48953 -118255 158056 263975 44003 86636 242032 98250 236771
12331 236771 1544 346916 276228 106466 59254 13085 413792 29855 44400 175957 144041
12320 144041 370291 23635 329684 359582 139639 90306 45358 75526 -76440 -27558 4821
12308 312182 353373 160590 -330694 285106 386299 59725 7743 104069 24786 -222424 7372
12296 241013 205981 42097 357194 65429 418360 256005 233853 444160 266020 -27620
12285 9243 164646 -71214 113281 217348 -31345 227799 418027 60169 288257 195084 340030
12274 340030 319139 283843 314634 45963 125429 57365 244612 164408 -52945 269794 154862
$$ packed form
12353B57410a10037e1004C04831a47652A33564K3476g8391E03422C7954a29846
12342A1661K916b50706d8953o9302A58056J05919D4003M2633J55396I8250J38521
12331B36771A544L45372p0688A06466m7212A3085M00707B9855J4545J31557l1916
12320A44041K26250B3635L06049K9898A39639m9333m4948L0168g6440b7558D821
12308C12182M1191A60590c30694B85106J01193E9725G743R6326B4786b22424G372
12296B41013l5032D2097L15097F5429L52931j62355k2152K10307j78140b7620
12285I243J55403g1214A13281J04067c1345B27799J90228F0169K28088r3173J44946
12274C40030k0891l5296L0791D5963P9466E7365J87247q0204e2945B69794j14932
$$ plain form
12263 154862 281553 -153983 436096 451952 3147 135312 -87775 -36436 -20203 66873 283639
12252 283639 25297 396529 581497 -48919 4379 123583 48765 -275946 186911 -34354 -148522
12241 -148522 241462 172270 70678 140940 -234127 -24132 -340258 367365 100991 93704 -48162
12229 329515 282765 144195 87727 32020 -130457 -86741 -70225 539860 430764 391349 -22605
12217 99796 162243 254516 9117 24427 352786 58896 47947 91448 128604 91140 105425 394335
12205 394335 15362 193567 74224 167088 36430 120820 204533 130352 -225022 180261 363332
12194 363332 -38836 169644 32771 205417 9262 188974 769392 -4764 122666 222144 171264
12183 171264 294538 186180 -24974 393174 148143 149993 74877 59299 38046 209291 215054
$$ packed form
12263A54862J26691a53983D36096J5856C147J32165h7775c6436J6233F6873K16766
12252B83639B5297L71232J84968d8919D379J19204D8765b75946A86911c4354j14168
12241a48522B41462o9192G0678P0262b34127b4132l16126C67365A00991p287d8162
12229C29515m6750j38570n6468C2020a30457M3716J6516E39860j09096l9415b2605
12217I9796O2447R2273I117J5310L28359E8896j0949M3501L7156l7464J4285K88910
12205C94335A5362J78205G4224R2864C6430Q4390Q3713p4181b25022A80261J83071
12194C63332c8836A69644C2771J72646I262J79712N80418d764A22666R9478n0880
12183A71264J23274j08358b4974C93174A48143J850G4877j5578k1253J71245N763
$$ plain form
12172 215054 43654 215161 12982 210979 379792 64643 455778 118449 655504 196559
12161 267286 333098 317495 139142 -10412 -108613 292268 -63178 -175164 127443 102155 206534
12150 206534 -167740 325595 287196 258108 372766 -109439 72018 -376773 129358 226410
12140 226410 279298 -188770 157276 222201 331328 176822 199086 -56392 68192 94281 92969
12129 92969 58637 -161321 87103 584485 -71382 305379 -13175 425601 119210 230264
12119 230264 214469 379256 167054 185339 115772 141743 670196 -198557 146702 171076
12109 171076 205732 248430 10070 141956 93611 -26828 2729 -34664 157876 141105 -155093
12097 312789 46170 174327 149603 88657 64903 260355 138216 117542 292956 93668 365418
$$ packed form
12172B15054D3654J71507A2982J97997J68813F4643L91135A18449N37055A96559
12161B67286O5812j5603A39142a0412r8201B92268f3178j11986A27443k5288J04379
12150B06534a67740C25595l8399k9088J14658a09439G2018c76773A29358R7052
12140B26410N2888a88770A57276O4925J09127j54506K2264e6392F8192K6089j312
12129I2969l4332a61321H7103M97382g1382C05379a3175D25601A19210J11054
12119B30264j5795J64787A67054J8285o9567K5971N28453a98557A46702K4374
12109A71076L4656M2698A0070J31886m8345b6828B729c4664A57876j6771a55093
12097C12789D6170J28157k4724o0946k3754J95452j22139k0674J75414I3668K71750
$$ plain form
12086 365418 9813 190786 325510 -4647 -44822 82114 -48331 210723 62123 162321 101343
12075 101343 -49281 468723 -143649 64260 37254 -217711 152674 247875 -9219 -144005 234161
12063 -28804 -78724 -271439 -76608 133272 246764 -47318 -28257 -46399 6197 -64174 200281
12051 -307164 -266430 -81368 -267128 101840 -230483 -32443 12994 -124064 396758 202908
12041 202908 -23835 -173474 223415 208294 -114524 353199 -137525 109890 -123452 165738
12030 471138 73235 -242282 -89041 247604 -38156 145334 -70878 308154 422252 256341
12020 256341 251043 -189017 -36292 -64625 -144746 486944 -15239 -34736 277786 -275260 292485
12008 81669 223681 113488 -113206 -10662 123148 185641 90651 -186988 -187142 11771 -102703
$$ packed form
12086C65418I813J80973J34724d647m0175H2114d8331B10723F2123J00198o0978
12075A01343d9281D68723a43649F4260k7006b17711A52674R5201i219j34786B34161
12063b8804m9920j92715g6608A33272J13492d7318J9061j8142F197f4174B00281
12051c07164M0734h1368j85760A01840b30483c2443A2994a24064C96758j93850
12041B02908b3835j49639B23415j5121a14524C53199a37525A09890a23452A65738
12030D71138G3235b42282h9041B47604c8156A45334g0878C08154J14098j65911
12020B56341n298a89017c6292k8333q0121D86944a5239j9497B77786b75260B92485
12008H1669J42012j10193a13206a0662A23148O2493I0651a86988j54A1771a02703
$$ plain form
11996 -19247 -415287 -14083 -32718 -223621 24324 -50818 -68996 -173521 -65773 172982 -127702
11984 -163533 146203 242024 -198370 109319 -239860 -110481 60951 179257 -171795 254711
11973 -20611 35617 12282 -115174 207893 -67133 -369409 -124518 31549 -91895 244663 -181426
11961 68662 -294187 73436 -33669 150182 129744 25839 -49639 -100565 -220156 107091 -182859
11949 -2908 -28836 -70230 -263501 -240311 -192016 23839 81682 -133003 55028 -68203 -308013
11938 -308013 8088 168992 -135355 -169506 14157 657757 421461 -119662 151488 -307156
11927 -174838 -184286 58594 249864 386014 139872 34469 -281906 -23854 155982 -130420
11916 247985 -160353 244334 -50156 73222 -314362 -372449 -134991 -70793 48861 -55379 -156505
$$ packed form
11996a9247l96040a4083j8635j90903B4324e0818j8178j04525f5773A72982a27702
11984a63533A46203R5821a98370A09319b39860a10481F0951J18306a71795B54711
11973b0611C5617A2282a15174B07893f7133l02276a24518C1549i1895B44663a81426
11961F8662b94187G3436c3669A50182k0438B5839d9639n0926j19591A07091a82859
11949b908k5928m1394j93271K3190M8295B3839N7843a33003E5028f8203k39810
11938c08013H088J60904a35355l4151A4157O43600k36296a19662A51488c07156
11927a74838r448E8594J91270J36150A39872C4469b81906b3854A55982a30420
11916B47985a60353B44334e0156G3222c14362n8087a34991O4198D8861e5379j01126
$$ plain form
11905 -156505 -69926 49369 189988 -67571 183060 200267 73203 17038 15179 -115916 -94391
11894 -94391 -30613 59255 -28740 -662718 -180220 32158 101996 65009 161124 -27768 99666
11882 -148868 -134623 -2694 -244392 -59754 -374140 -1149 -163602 -42812 -255749 -64385 139971
11870 -69773 226314 -128198 -236526 -165451 62641 -228394 -25652 -244284 -136468 258704
11859 156320 -135588 -169868 -8832 -54726 308116 115783 -107336 13270 -19675 -162699 -15267
11847 -154232 82859 -182971 -241118 -90209 261077 -430 -553676 -450114 148038 287445 92920
11835 23394 -136497 -64100 -19029 -292874 -57430 -177713 3033 -7996 34464 -87750 -312027
11824 -312027 137027 5640 -284697 -257612 -281148 -194197 -35046 -33938 -154546 -268918 -103483
$$ packed form
11905a56505f9926D9369J40619f7571A83060J7207G3203A7038j859a15916K1525
11894i4391c0613E9255b8740o33978a80220C2158O9838l6987R6115b7768I9666
11882a48868J4245b694k41698e9754l14386a149j62453d2812k12937f4385A39971
11870f9773B26314a28198j08328P1075F2641b28394b5652k18632J07816B58704
11859A56320a35588l4280h832m5894C08116A15783a07336A3270a9675j43024a5267
11847a54232H2859a82971n8147i0209B61077d30n53246J03562A48038J39407I2920
11835B3394a36497f4100a9029k73845e7430j20283C033g996C4464h7750k24277
11824c12027A37027E640b84697K7085k3536Q6951c5046J108j20608j14372a03483
$$ plain form
11812 138658 273149 -390213 65749 10182 -240893 46885 76868 -63308 -8862 215066 104102
11800 -125741 -235570 -172841 -2947 -229276 246016 -149326 -409347 -192811 -215890 -66609
11789 35174 -380025 328045 91788 -325659 -416764 74359 16065 57125 154619 -211670 -155745
11778 -155745 153608 -8393 -76672 -234699 51791 220179 -56493 -160504 -34930 -278091 -387285
11767 -387285 -6709 -404765 9054 3589 -207467 -282458 313687 309797 -253222 -117305 -238703
11756 -238703 -380599 -101181 -121180 47172 -84320 35531 -172912 -109840 78611 346391 -502084
11744 205786 -215452 -904 22885 57564 -149805 227064 44512 97564 59261 -152194 -184295
11733 -184295 -150845 316057 103223 -10582 54634 39532 286057 62561 230574 68531 -423797
$$ packed form
11812A38658J34491c90213F5749A0182b40893D6885K9983f3308h862B15066A04102
11800a25741j09829O2729b947k26329B46016a49326k60021a92811k3079f6609
11789C5174c80025C28045I1788c25659r1105G4359A6065M1060R7494b11670N5925
11778a55745A53608h393o8279j58027E1791J68388e6493j04011c4930k43161j09194
11767c87285f709l98056I054C589b07467p4991C13687l890b53222a17305j21398
11756b38703j41896a01181j9999D7172h4320C5531a72912O3072G8611K67780e02084
11744B05786b15452i04B2885L4679a49805B27064D4512N3052l8303a52194l2101
11733a84295L3450C16057A03223a0582E4634j5102K46525F2561J68013F8531d23797
$$ plain form
11721 121573 -189047 -4080 120359 -85707 -156359 126145 221135 300257 38027 -175010 -318293
11710 -318293 95607 234729 -212993 167737 -62069 97549 -419562 71896 -172187 120632
11699 93327 -249111 -3464 -171607 140938 57067 136903 -241386 -200222 -190253 -859 33087 -51456
11686 53244 188513 243472 -157492 -150271 211161 210002 -142332 121387 -49793 274383 199205
11675 199205 -65975 -83835 224048 103399 92374 -41638 342053 -44835 -182886 153561
11664 26071 -188948 100756 156808 -37633 61538 -79823 -9146 -145197 -72979 363596 71073
11652 -186490 35869 289383 191635 -162167 -30930 -267788 -31388 -145985 -285510 268585
11641 3056 -142900 57258 -52025 46789 214826 -22559 119331 -179449 31371 283299 117570
$$ packed form
11721A21573a89047d080A20359h5707p0652A26145R4990P9122C8027a75010j43283
11710c18293I5607J39122b12993A67737f2069I7549d19562G1896a72187A20632
11699I3327b49111c464j68143A40938E7067P9836b41386M1164R969h59C3087e1456
11686E3244J35269N4959a57492P221B11161j159a42332A21387d9793B74383p5178
11675A99205f5975j7860B24048A03399j1025d1638C42053d4835j38051A53561
11664B6071a88948A00756N6052c7633F1538g9823i146j36051P2218C63596G1073
11652a86490C5869K53514r7748a62167c0930k36858c1388j14597j39525B68585
11641C056a42900E7258e2025D6789J68037b2559A19331a79449C1371K51928A17570
$$ plain form
11629 46484 -225504 -33305 131375 -26299 -337710 136658 -17137 -49289 -138004 -319748 328085
11617 214842 80789 -379944 -413229 -5950 46629 19909 177008 -55284 -125920 -105852 63547
11605 175357 60884 -28394 -120345 118645 -315604 137030 -107595 -50904 16711 -2365 174295
11593 -37792 -46445 -110560 173461 160629 147734 507755 -22080 107850 54546 -112032 59519
11581 230391 181373 271299 97956 73194 -18683 -65228 -20007 224732 -178010 -42012 204391
11569 143013 -36822 -30989 52389 41152 141997 60896 -179587 -128320 -28775 -122171 -130913
11558 -130913 364829 107898 166558 103980 -114792 1061 -53586 142101 -44467 147228 -214861
11546 156374 -34526 -13030 -4012 268386 33269 198055 -66551 170450 159248 160563 454471
$$ packed form
11629D6484b25504c3305A31375b6299l11411A36658a7137l2152q8715j81744C28085
11617B14842H0789c79944l3285e950D6629A9909J57099e5284p0636K0068F3547
11605A75357F0884b8394r1951A18645c15604A37030a07595e0904A6711b365A74295
11593c7792q653o4115A73461j2832j2895L60021b2080A07850n3304a12032E9519
11581B30391m9018Q9926I7956k4762a8683m6545b0007B24732a78010d2012B04391
11569A43013c6822N833E2389j1237J00845F0896a79587N1267b8775r3396q742
11558a30913C64829A07898N8660o2578a14792A061e3586A42101d4467A47228b14861
11546A56374c4526a3030d012B68386C3269J64786f6551A70450j1202J315K93908
$$ plain form
11535 454471 442868 25448 210680 428456 239433 504665 -56283 -77946 -28159 18437 -30215
11523 -335813 120445 -5766 -130306 204011 265510 -93044 52067 194777 256241 -195173 69145
11511 -516768 -47259 229341 -157129 28585 34075 203945 367359 -121994 304145 77148
11500 382964 39079 280222 677 -260094 355078 139483 -88888 64569 140169 141846 387872
11489 387872 178720 96734 198346 374631 281043 -135380 303639 78974 -231414 225919
11478 43048 -105805 240029 173060 272904 43547 103346 153849 -44468 152308 -14690 138369
11466 104116 394107 108085 245283 -4009 249900 -146146 51993 -61982 22391 -28033 544341
11454 -94974 70449 284088 81134 231470 157345 393306 196933 130470 221535 33816 244390
$$ packed form
11535D54471j1603B5448J85232K17776j89023K65232e6283k1663b8159A8437c0215
11523c35813A20445e766j24540B04011O1499i3044E2067J42710O1464a95173F9145
11511e16768d7259B29341a57129B8585N490J69870J63414a21994C04145G7148
11500C82964C9079K41143F77b60094C55078A39483h8888F4569P5600J677K46026
11489C87872A78720q1986J01612J76285r3588a35380C03639G8974b31414B25919
11478D3048a05805B40029o6969R9844D3547N9799N0503d4468A52308a4690A38369
11466A04116K89991A08085J37198d009B49900a46146E1993f1982B2391b8033E44341
11454i4974G0449K13639H1134J50336p4125K35961j96373o6463R1065C3816K10574
$$ plain form
11443 244390 63170 166148 38589 -68400 104930 -144955 -87512 107308 29565 -179657
11432 -126438 48887 274232 380866 -17499 -113208 -16377 219206 66308 -25318 -222520 -198765
11421 -198765 -28325 71831 -75851 -91536 20205 67238 169282 216927 -109334 -270532 23499
11409 54095 -369444 337029 229827 446321 -61266 -42615 -116981 136637 -161147 219594
11398 -210952 179100 124799 173293 185125 67258 -201528 -166989 41088 -147927 -179953 -125694
11387 -125694 -63180 52449 33416 -39198 18343 -164034 -82799 95209 -372118 226925 -183403
11375 200882 -67394 17032 301381 -367742 -423142 314834 264803 179765 -270653 -149406
11365 -149406 -79722 117225 -19655 -27027 162679 97861 220325 -81104 -175590 -19482 333292
$$ packed form
11443B44390F3170J02978C8589f8400A04930a44955N7443A07308B9565a79657
11432a26438D8887K25345J06634a7499r5709a6377B19206F6308b5318j97202K3755
11421a98765b8325G1831g5851j5685B0205M7033J02044M7645a09334j61198B3499
11409E4095c69444C37029j07202K16494f1266J8651p4366A36637a61147B19594
11398b10952A79100n4301M8494J1832F7258b01528L4539D1088a47927l2026N4259
11387a25694O2514E2449j9033c9198A8343a64034Q1235I5209c72118B26925a83403
11375B00882f7394A7032K84349c67742n5400C14834n0031q5038b70653J21247
11365a49406O9684A17225a9655p372A62679o4818J22464h1104r4486a9482C33292
$$ plain form
11353 150972 -162603 -201875 170103 125617 136479 263392 -42491 -153642 300349 76222
11342 -143795 261164 -201240 6244 137333 439411 -315700 -90162 -292081 -15399 4840 85960
11331 85960 -330034 -29626 204033 63756 -137241 -69673 120181 411921 -15150 121332
11320 -168862 -88892 278479 64981 194085 -26595 -18646 84959 -231044 -227988 186311 19770
11308 80162 -44201 -398670 74835 -167682 -104681 -112070 162668 243353 240492 -1491 -139624
11297 -139624 -208814 185948 -23155 23191 -150908 -223296 70747 140571 248460 6291 -169934
11285 -211354 77453 31758 -16901 -538158 -57709 -77408 197508 -44162 -74743 -231525 141923
11273 9368 45227 -5335 -60436 -325930 -57873 -107023 -103143 -152619 -37540 -238617 -129030 -220096
$$ packed form
11353A50972a62603l9272A70103m4486J0862J26913d2491j11151C00349G6222
11342a43795B61164b01240F244J31089L02078c15700i0162k01919a5399D840Q1120
11331H5960c30034b9626B04033F3756a37241O7568A20181K91740a5150A21332
11320a68862P9970B78479F4981J29104b6595P949H4959b31044L056A86311A9770
11308H0162d4201l54469G4835a67682O3001p389A62668Q0685k861a491j38133
11297a39624o9190A85948b3155B3191a50908p2388G0747O9824J07889F291a69934
11285b11354G7453C1758a6901n21257e7709j9699A97508d4162l0581j56782A41923
11273I368L5859e335n5101k65494e7873m9150L880m9476c7540k01077J09587r1066
$$ plain form
11261 -220096 46438 -58335 -50525 -175469 -69280 -390914 174516 63809 -189374 -95728 -37704
11249 -18789 -64098 256729 -80254 -237344 -393301 -148038 -132390 101496 2676 -240502 -55136
11237 -63264 -256523 -200997 87353 194502 -74338 -185755 -43256 7335 -239576 -123225 -20306
11225 -94184 -202421 77380 -144556 -379205 130422 358898 -120258 -206082 241437 -67810
11214 -83031 -155479 21292 308387 -165679 -266883 370380 115289 -159054 -60488 -160179
11204 -160179 87314 127368 -201904 -173131 111657 9369 -142729 -90418 -246415 77996 -118462
11192 -87118 -297210 66882 -211106 -124665 -129675 -492190 -137124 -114558 232 -7518 -120069
11181 -120069 -221138 26569 -166709 234740 48721 24426 -105292 42433 174720 -55217
$$ packed form
11261b20096D6438e8335P810j24944f9280l21634A74516F3809a89374R3646c7704
11249a8789m5309B56729h0254j57090j55957a48038J5648A01496B676b40502e5136
11237f3264j93259N5526H7353J07149g4338j11417d3256G335b39576J16351b0306
11225i4184j08237G7380a44556k34649A30422K28476a20258q5824B41437f7810
11214h3031p2448B1292K87095a65679j01204C70380A15289a59054f0488r9691
11204a60179H7314M0054b01904K8773A11657I369a42729N2311j55997G7996a18462
11192h7118k10092F6882b11106Q6441n010l62515a37124K2566B32g518j12551
11181a20069j01069B6569a66709B34740D8721k4295a05292D2433J32287e5217
$$ plain form
11170 -113110 -318681 -78501 -12104 13403 -19580 243957 54402 -32829 34717 -209301 52692
11158 127485 210259 -343332 25844 -190900 -125284 73935 -337370 -43649 135168 -92551 -29742
11146 160791 90230 314962 -27045 -38389 -103296 30830 -105943 32219 -146845 125614 126328
11135 126328 266815 337126 390675 198429 -284588 -146815 308708 120703 -161913 -314647
11125 -314647 180358 51438 7989 275833 136286 48040 48018 175833 -59458 209125 375739
11114 375739 -109929 -16480 219929 36462 248351 123906 41309 130395 259841 -157032
11103 138706 47714 181802 -22884 248341 238322 161242 71208 138242 29398 231996 280629
11092 280629 292698 296801 414228 -150349 540608 83833 183912 270276 172931 278910 -188538
$$ packed form
11170a13110k05571g8501a2104A3403a9580B43957E4402c2829C4717b09301E2692
11158A27485Q2774c43332B5844a90900O5616G3935c37370d3649A35168i2551b9742
11146A60791p0561K24732b7045j1344o4907C0830a05943C2219a46845A25614P14
11135A26328J40487P0311N3549j92246b84588J37773C08708A20703a61913j52734
11125c14647A80358E1438G989K67844A36286D8040k2J27815e9458B09125J66614
11114C75739a09929a6480B19929C6462K11889A23906D1309Q9086J29446a57032
11103A38706D7714J34088b2884B48341j0019p7080G1208O7034B9398K02598M8633
11092B80629J2069M103J17427a50349E40608H3833J00079Q6364r7345J05979a88538
$$ plain form
11080 53252 210808 241851 211316 341725 231520 399370 416916 158209 231517 364534
11070 364534 191796 340212 228579 153242 607359 229988 306726 520733 287829 435617
11060 435617 595069 530275 143554 524631 391900 653476 517022 653133 753971 569047
11050 569047 488860 913185 923658 678024 790366 864695 955607 526676 1128969 963160
11040 963160 759739 754478 665427 1027679 917539 822034 321307 939784 763884 419432
11030 419432 711070 1151111 1037930 915794 913456 667464 841174 602969 845209 833683
11020 833683 480992 767834 799213 436329 737545 755152 504405 509518 841001 455622
11010 455622 483903 450198 557255 718342 750722 366489 787555 803257 488461 974129
$$ packed form
11080E3252J57556L1043l0535J30409j10205J67850J7546A58209P3308J33017
11070C64534j72738J48416j11633p5337M54117B29988P6738K14007k32904J47788
11060D35617J59452o4794A43554L81077j32731K61576j36454J36111J00838j84924
11050E69047q0187M24325J0473k45634J12342P4329R0912m28931O02293j65809
11040I63160k03421n261q9051L62252j10140r5505C21307O18477j75900l44452
11030D19432K91638M40041j13181j22136k338k45992J73710k38205K42240j1526
11020H33683l52691K86842L1379l62884L01216J7607k50747N113L31483l85379
11010D55622K8281l3705J07057J61087L2380C66489M21066J5702l14796M85668
$$ plain form
11000 974129 544326 803279 612703 832071 1037405 995090 641895 655885 822982 927560
10990 927560 537885 896864 651544 916051 985225 959804 749114 1190869 990397 791300
10980 791300 976822 1278774 1039645 1304114 1391235 1295472 1597213 1954857 1788263 2196619
10970 2196619 2136092 2562813 2745237 2940968 2799158 2592371 2765621 2530949 2345974 1865564
10960 1865564 1780207 1755686 1808869 1492940 1563672 1519478 1485781 1654890 1576605 1343797 1364991
10949 1364991 1581052 1184366 1139102 1079584 675271 436103 599606 674188 323768 252364
10939 252364 -176116 108519 327324 27653 32823 158854 70942 167469 -55475 123575 395023
10928 395023 124763 304545 -205486 -30218 -154950 298877 231271 247415 -43082 258497
$$ packed form
11000I74129m29803K58953j90576K19368K05334m2315l53195J3990J67097J04578
10990I27560l89675L58979k45320K64507O9174k5421k10690M41755k00472j99097
10980G91300J85522L01952k39129K64469Q7121r5763L01741L57644j66594M08356
10970B196619o0527M26721J82424J95731j41810k06787J73250k34672j84975m80410
10960A865564q5357k4521N3183l15929P0732m4194l3697J69109p8285k32808K1194
10949A364991K16061l96686m5264n9518m04313k39168J63503P4582C23768p1404
10939B52364a76116A08519K18805B7653N170J26031G0942R6527e5475A23575K71448
10928C95023A24763J79782b05486c0218j24732B98877o7606J6144d3082B58497
$$ plain form
10917 147991 -9241 -146873 48098 76567 -49749 118552 -223666 135842 105226 84370 -311984
10905 82991 16939 -16871 36563 75806 -258310 -50044 187133 39456 -68359 -155557 61561
10893 -217634 -105023 -284969 -20471 62286 -147524 215040 59250 -8627 -77384 93930 54663
10882 54663 271073 -169662 246455 -51359 -226968 122629 -125242 -1548 98645 -35626 -47249
10871 -47249 -240690 102398 352738 1277 -56323 -52324 -235338 -214517 112292 151271 73854
10859 145120 36751 -11000 20146 140791 26498 14511 -64515 -133962 -112390 26138 -11011
10847 430032 -194764 -179601 256545 154857 -24010 34372 -32281 -281876 -215723 -51325 -259517
10836 -259517 -147899 -23056 131607 64502 -122979 -385796 -207658 156690 -348230 227439
$$ packed form
10917A47991i241j37632D8098K8469d9749A18552b23666A35842l0616k0856c11984
10905H2991A6939a6871C6563L9243b58310e0044A87133C9456f8359q7198F1561
10893b17634a05023j79946b0471F2286a47524B15040E9250h627o8757I3930l9267
10882E4663K16410a69662B46455e1359j75609A22629a25242a548I8645c5626j1623
10871d7249j93441A02398K50340A277e6323L999j83014K0821A12292L8979G3854
10859A45120C6751a1000B0146J20645B6498j1987f4515o9447K1572B6138a1011
10847D30032a94764J5163B56545j01688b4010C4372c2281k49595O6153e1325k08192
10836b59517J11618b3056A31607F4502a22979k62817J78138A56690c48230B27439
$$ plain form
10825 111745 -298288 97079 -131457 43756 396 -221233 14647 108025 -178945 -368800 -111233
10813 -427395 -49069 -72703 -120160 -245051 34571 -264716 351709 -107015 -268612 -66300
10802 -75624 173262 162803 10558 82756 41649 -35718 192982 -32789 -20636 -139451 -323061
10791 -323061 -192709 148879 3357 -53429 65251 36348 -207096 35428 20257 -31775 -25857
10780 -25857 -141799 -272167 255781 -192533 -217135 193881 -170317 -74944 -121274 -125670 319997
10768 -79064 156091 -293574 147354 47416 95151 124653 -128720 129166 -81632 -39641 142025
10756 195267 120100 -195612 -234342 364988 -219195 63191 -265326 -197745 -118842 17531 -38891
10744 83030 -118365 109312 251091 141635 -184702 158279 -39224 -352820 -90660 73280
$$ packed form
10825A11745b98288I7079a31457D3756C96b21233A4647R3378a78945j89855a11233
10813d27395d9069k3634m7457j24891C4571b64716C51709a07015j61597f6300
10802g5624A73262j0459A0558P2198m1107c5718A92982c2789J2153j18815j83610
10791c23061J30352A48879C357e3429F5251k8903b07096C5428j5171c1775N918
10780b5857j15942j30368B55781a92533k4602A93881a70317g4944m6330m396C19997
10768g9064A56091b93574A47354D7416M7735K9502a28720A29166h1632c9641A42025
10756A95267p5167a95612l8730C64988b19195F3191b65326O7581P8903A7531c8891
10744H3030a18365A09312J41779j09456a84702A58279c9224l13596i0660G3280
$$ plain form
10733 -92560 -182715 -11187 347470 -319440 150542 -290082 -222432 -237304 -479850 -219332
10722 12098 -128960 -63273 -346583 -16836 -152830 -198179 208034 -221416 -98683 -302461
10712 -302461 -165483 -218188 -164767 -196222 -99551 -103800 -58370 -32018 96683 137656 -84731
10700 -124046 -26131 -277004 129976 -65020 -355010 -82122 -50240 150183 142006 17994 -330543
10688 41496 -171899 -8641 23441 -117755 -119562 231744 -3101 -223162 168232 138489 -196300
10676 -135356 -187642 -134290 31024 -47203 184824 -157374 150294 57164 -418618 46642 20758
10664 -51189 71548 -167374 35354 -398403 -295485 -209200 122801 -241039 -296958 -13065 53919
10652 -102434 317991 -129043 -37024 -31954 309599 -183742 -11548 341880 -57927 -18587 -41274
$$ packed form
10733i2560r0155a1187C47470c19440A50542b90082O7650j4872k42546b19332
10722A2098a28960f3273k83310a6836j35994m5349B08034b21416i8683k03778
10712c02461J36978n2705N3421l1455R6671m249M5430K6352I6683M0973h4731
10700a24046b6131k50873A29976f5020k89990h2122L1882A50183q177A7994c30543
10688D1496a71899h641B3441a17755j807B31744c101k20061A68232k9743a96300
10676a35356n2286N3352C1024d7203A84824a57374A50294E7164d18618D6642B0758
10664e1189G1548a67374C5354c98403J02918Q6285A22801b41039n5919a3065E3919
10652a02434C17991a29043c7024N070C09599a83742a1548C41880e7927a8587k2687
$$ plain form
10641 -41274 -137255 182093 -285053 -325591 287 18948 -314207 1560 -97315 -15414 -278623
10630 -278623 79710 -261701 34081 56093 -48795 -115533 -491657 50854 2798 -173658 15912
10618 158499 23895 -106802 -112337 -256274 -139215 104950 -104556 -91640 -43296 -209760
10608 -209760 -6921 205880 -72800 -100224 -190629 -121043 -86005 -10465 -154858 -165382 34869
10596 245930 -140093 -221324 -446287 -24491 -246494 -250565 170737 91605 -102406 47805 -269153
10584 -242470 77979 -285548 -77212 -237112 10063 -16404 -320969 96047 -275094 -207566 98070
10572 68188 93658 -139623 19184 346028 -31897 -27106 106105 146891 204261 -34626 71454
10560 181247 110042 -344151 -69591 -42988 -75841 285954 105123 -348732 -114292 -61496
$$ packed form
10641d1274r5981A82093b85053m0538B87J8661c14207A560i7315a5414k63209
10630b78623G9710b61701C4081K2012d8795o6738l76124E0854B798a73658A5912
10618A58499B3895a06802n535j43937J17059A04950a04556J2916d3296j66464
10608b09760f921B05880g2800k7424r0405O9586L5038a0465j44393j0524C4869
10596B45930a40093q1231k24963b4491k22003m071A70737p9132a02406D7805b69153
10584b42470G7979b85548g7212j59900A0063a6404l04565I6047b75094O7528I8070
10572F8188K5470a39623A9184L26844c1897M791A06105M0786N7370c4626G1454
10560A81247p1205c44151f9591K6603l2853B85954A05123c48732a14292N2796
$$ plain form
10550 -61496 -72763 64418 -122833 -268738 16913 74516 8251 -112928 -224487 49466 -324526
10538 -386516 -200106 173773 -169621 303430 -78891 74661 -5608 -107110 -250978 70426
10527 -88449 -63362 -160756 73431 -50115 -237334 36912 -498040 1657 -8864 -386003 -170333
10515 234053 87491 -41407 -274789 -295972 -30488 131168 -15484 135300 -9166 54581 -426847
10503 -56388 81047 67916 22065 277844 16013 -76264 -5427 -131121 -9456 202972 163643
10492 163643 -86456 37098 -15887 64564 -27894 304532 -165686 -43798 48868 -52813 -218774
10481 -218774 23525 224014 39284 -91309 91767 490805 601420 911311 287615 445001
10471 445001 386219 -42118 118896 -15255 -72499 32684 -76102 62370 -343249 19055 -86213
$$ packed form
10550f1496j1267F4418a22833j45905A6913N7603H251a12928j11559D9466c24526
10538c86516J86410A73773a69621C03430g8891G4661e608j01502j43868G0426
10527h8449K5087r7394G3431e0115j87219C6912d98040A657h864l77139a70333
10515B34053H7491d1407k33382k1183c0488A31168a5484A35300i166E4581d26847
10503e6388H1047j3131B2065K55779A6013g6264e427j25694i456B02972l9329
10492A63643h6456C7098a5887F4564b7894C04532a65686d3798D8868e2813j65961
10481b18774B3525K00489C9284i1309I1767L99038J10615L09891B87615J57386
10471D45001n8782d2118A18896a5255n7244C2684g6102F2370c43249A9055h6213
$$ plain form
10459 18649 -33656 -182364 -128330 -191166 212546 -238322 -250855 -206044 -269049 -14360 -160662
10448 -160662 29975 37583 -245857 -66407 30567 -486844 135781 208775 92430 41576 195717
10437 195717 -194789 -46491 203112 -128278 -212075 -67213 -152943 -14906 64410 69054 -115815
10425 47244 158305 -255357 -112243 -187677 -228095 -113673 99526 420190 -78630 -127808 186526
10413 47356 15243 -275019 -78832 -201139 104440 -297215 -147423 -210615 108916 31949
10402 8810 -284802 20241 -69168 -26892 4316 -144915 -80230 359038 105193 -179570 -86145
10390 16793 -155291 299487 -64525 128636 -304349 -155297 67563 217111 16668 92179
10380 92179 90618 -95188 -108620 334534 174409 179297 204164 -104677 280324 312092 478765
$$ packed form
10459A8649c3656j48708N4034o2836B12546b38322j2533M4811o3005a4360j46302
10448a60662B9975P608b45857f6407C0567d86844A35781P2994I2430D1576J54141
10437A95717a94789d6491B03112a28278q3797f7213q5730a4906F4410M644a15815
10425D7244J11061b55357a12243p5434m0418a13673I9526L20664g8630m9178A86526
10413D7356A5243b75019g8832j22307A04440b97215a47423o3192A08916C1949
10402H810b84802B0241f9168b6892D316a44915O4685C59038A05193a79570h6145
10390A6793a55291B99487f4525A28636c04349J49052F7563J49548A6668P5511
10380I2179j561i5188j3432C34534j60125M888K4867a04677B80324L1768J66673
$$ plain form
10369 478765 290887 546655 470340 296717 114273 275684 459890 430261 464283 384003
10359 384003 99891 352282 164733 -104224 238865 437881 126748 550939 474587 456522
10349 456522 -38424 450651 800760 184324 518602 -241375 204768 495733 133721 225371
10339 225371 -303 302524 88470 287503 78383 31665 475543 271805 21876 315064 128002
10327 -188329 -139705 67648 255181 80659 181167 316773 43193 246523 208374 138511 -51537
10315 292240 -14561 -95383 342357 176175 -44215 -114718 -52327 280489 -94621 72840 252372
10304 252372 -349399 -365295 -86070 104983 346126 235852 -219845 14329 56904 -170272
10293 -172553 -131429 -368810 -310502 -193991 -184815 -64474 123834 -51747 66826 -141323 -97193
$$ packed form
10369D78765j87878K55768p6315j73623A14273J61411J84206k9629L4022q0280
10359C84003I9891K52391A64733a04224B38865J99016A26748M24191p6352j8065
10349D56522c8424D50651L50109A84324L34278b41375B04768K90965A33721R1650
10339B25371c03C02524H8470J99033G8383C1665M43878k03738B1876K93188A28002
10327a88329M8624F7648J87533H0659J00508J35606D3193K03330l8149o9863e1537
10315B92240a4561q0822C42357j66182d4215p0503e2327B80489i4621G2840J79532
10304B52372c49399j5896h6070A04983K41143j10274b19845A4329M2575a70272
10293a72553M1124k37381N8308J16511R176f4474A23834e1747F6826a41323M4130
$$ plain form
10282 -97193 -409660 -43832 21147 135201 -53494 -114828 143221 182237 -25706 -323015 26098
10270 106354 -185546 -39895 -135929 -7750 -67782 281614 -212016 -306486 14516 76165 167927
10259 167927 41078 -117104 303972 285356 45354 220590 272997 366773 409807 377935 183174
10247 187995 504953 40035 -317068 -408496 44389 -54205 -165834 183240 -84921 25865 -111746
10235 81806 -116208 194556 -434645 -270969 -319185 172713 -80378 44982 -57433 -65639 -165925
10224 -165925 -101145 -220071 -20429 -201316 -86201 116291 79905 15951 -331891 -208961
10214 -208961 77146 -115822 -324916 -27074 -17536 161337 184259 -287357 -209436 13726 19078
10203 19078 -132996 -36771 -318343 -244221 -169578 -234162 -41244 18773 248893 146071 -308742
$$ packed form
10282i7193l12467d3832B1147J14054e3494o1334A43221L9016b5706k97309B6098
10270A06354a85546c9895r6034g750o0032B81614b12016r4470A4516O1649R1762
10259A67927D1078a17104C03972j8616D5354J75236N2407R3776M3034l1872A83174
10247A87995L16958D0035c17068r1428D4389e4205j11629A83240h4921B5865a11746
10235H1806a16208A94556d34645J63676m8216A72713h0378D4982e7433q206j00286
10224a65925O4780j18926b0429j80887h6201A16291l6386A5951c31891J22930
10214b08961G7146a15822k09094b7074R538A61337K2922b87357P7921A3726N352
10203A9078a32996c6771k81572P4122P4643o4584d1244A8773K30120j02822c08742
$$ plain form
10191 -188019 86910 18396 128802 -309126 -66601 -125228 -35336 -103882 104968 163758 -85077
10179 -127055 -88080 -15261 -63093 -11739 -119815 -161909 -69665 75601 -83893 -40833 -89067
10168 -89067 92468 -361820 -118176 -365035 -46614 -185410 -140336 -291302 100756 -244873
10157 -154421 59986 -173431 -218962 -168608 40013 -19281 424990 198349 -104962 -373538
10147 -373538 -262463 -166895 -225903 -246140 264016 -149024 -16559 314525 22032 -114107
10136 -203309 -88406 160905 -313980 -265277 -102484 91139 -272745 -336095 42676 -163167
10125 -134847 210447 81792 -241750 -67771 -95190 -58038 26188 -20172 -42578 -449967 301893
10113 -251819 -93157 84058 -216535 -130369 366891 30753 -29735 -81354 -158213 -544056 -120485
$$ packed form
10191a88019H6910A8396J10406c09126f6601n8627c5336o8546A04968N8790h5077
10179a27055L8975a5261m7832a1739j08076m2094f9665G5601h3893d0833m8234
10168h9067I2468c61820a18176k46859d6614j38796M5074j50966A00756b44873
10157a54421E9986a73431m5531N0354D0013a9281D24990A98349a04962k68576
10147c73538J11075R5568n9008k0237B64016a49024a6559C14525B2032a14107
10136b03309h8406A60905c13980M8703a02484I1139b72745o3350D2676a63167
10125a34847B10447H1792b41750f7771k7419L7152B6188b0172k2406m07389C01893
10113b51819i3157H4058b16535Q6166C66891C0753b9735n1619p6859l85843a20485
$$ plain form
10101 307225 86843 -311143 22934 43169 119187 -177333 -374921 -123715 207194 78088
10090 258697 180113 -30959 -223007 -48684 -33579 -280773 -252909 -148283 117546 -296363
10079 -507499 -604463 -44414 123073 140549 -123773 -45022 -429140 -119832 -368298 233914
10068 150152 9425 -96240 -86872 192351 -159673 -266181 -31184 84655 15164 -29907 -85625
10057 -85625 -167228 344113 176855 247722 48569 -29063 -16772 -93330 -62390 -99653 -41446
10045 -45645 312251 -71142 -210848 -139669 97157 -240669 44884 -257998 -120183 -282990
10035 -282990 20549 -256019 -230297 -215880 3938 -236148 -25222 -333740 -106242 -150071 -32937
10023 226871 153761 65352 44730 118154 89364 174854 -18676 -64856 145409 -156971 90945
$$ packed form
10101C07225H6843c11143B2934K0235P6018a77333j97588a23715B07194G8088
10090B58697p8584c0959j92048d8684J5105k47194K7864J04626A17546b96363
10079e07499r6964d4414A23073J7476a23773d5022l84118a19832k48466B33914
10068A50152I425i6240R368A92351a59673j06508c1184H4655A5164b9907n5718
10057h5625q1603C44113j67258P0867D8569b9063J2291p6558L0940l7263d1446
10045d5645C12251g1142j39706P1179I7157b40669D4884b57998a20183j62807
10035b82990B0549b56019K5722J4417C938b36148b5222l08518a06242m3829c2937
10023B26871p3110F5352k0622P3424k8790Q5490a8676m6180A45409a56971I0945
$$ plain form
10011 -63270 -5883 -182584 117084 -103204 191867 -95775 -307956 -258369 -292598 326905 -94839
9999 -22653 -116818 -197039 47177 -205783 -94610 276417 -454784 86178 -242068 -162881 -253523
9988 -253523 15617 -332564 -197553 -126294 -285537 -205504 -210936 -219777 112059 -107331 -64574
9977 -64574 433690 -222619 -315018 34635 215059 130443 -454455 -283781 21248 5936 -90088
9965 209693 216722 -405295 -15953 -290860 -137076 221160 -10523 24109 125833 -165621 -270803
9954 -270803 81516 -73 206145 115164 -302401 126555 68650 -103222 -275391 87871 -307999
9942 -93169 -288039 -66053 197206 403999 -109360 -97098 -225355 72714 213991 -182298
9931 -35014 48765 -42665 -176613 -16136 -256968 67992 37361 297767 -21114 -440088 -172255
$$ packed form
10011f3270e883j76701A17084a03204A91867i5775k12181M9587l4229C26905i4839
9999b2653r4165q0221D7177b05783i4610B76417d54784H6178b42068P9187r0642
9988b53523A5617c32564J35011P1259j59243Q0033n432q841A12059a07331M2757
9977f4574D33690b22619r2399C4635J80424q4616d54455J70674B1248E936i0088
9965B09693P029d05295a5953k74907a37076B21160a0523B4109J01724a65621j05182
9954b70803H1516g3B06145r0981c02401A26555n7905a03222j72169H7871c07999
9942i3169j94870f6053A97206K06793a09360J2262j28257G2714J41277a82298
9931c5014D8765d2665j33948a6136k40832F7992l0631K60406b1114m18974a72255
$$ plain form
9919 -246631 -53588 213370 103127 -133078 -175669 21688 132538 42147 -299233 -96983 -143382
9908 -143382 -288584 -84625 -179874 -87761 -107634 -155280 304625 216027 -11011 -253047 -5386
9896 -555919 -160512 369681 -158997 117516 30438 -200491 -112364 -160645 67040 130561 128060
9885 128060 -444096 284627 -196335 -141222 -178022 -445068 171742 157593 216786 -138758
9874 70115 -90325 135962 -52086 -490231 60400 -299372 -60621 -169858 -183855 -268347 246982
9862 -67313 49666 -41324 -83907 -202608 -131200 186617 -212535 -153577 -5701 -88364 -52746
9851 -52746 -221065 -120084 -134593 40616 254822 -43671 -119361 -118893 -200969 -50195 -225156
9840 -225156 100533 245145 146701 -31505 -129052 -152113 -300298 -185386 -381096 -57512 -307302
$$ packed form
9919b46631e3588B13370A03127a33078m2591B1688J10850D2147b99233i6983m6399
9908a43382j45202h4625r5249h7761j9873m7646C04625q8598a1011k42036e386
9896e55919a60512C69681a58997A17516C0438b00491Q8127m8281F7040O3521k501
9885A28060d44096B84627a96335N5113l6800k67046A71742j4149N9193a38758
9874G0115i0325A35962e2086m38145F0400b99372f0621j09237j3997q4492B46982
9862f7313D9666d1324m2583j18701P1408A86617b12535N8958e701q2663L5618
9851e2746j68319J00981j4509D0616K14206d3671p5690M68q2076e0195j74961
9840b25156A00533J44612r8444c1505r7547k3061j48185J14912j95710e7512k49790
$$ plain form
9829 -307302 -90180 -151620 160320 107868 284162 63392 -184656 -172358 -153165 -238657 -185908
9818 -185908 291145 -218564 -282350 -32981 -32907 18049 124748 82562 -249288 90484 150203
9807 150203 -86945 -44586 -116101 -163328 -160063 -283804 -43111 -72264 74493 58375 -286225
9795 91835 -193729 239710 228803 187992 -29404 60166 14329 128825 71864 -106433 -260268
9784 -260268 -113153 -134797 193751 95520 -129452 -62970 29437 -181197 -270778 -61648 -201059
9773 -201059 79290 -134735 129272 -98668 -261892 -231682 54307 -222354 -136008 13037 -121921
9761 -156435 -27566 56500 106842 -234749 -146625 -289293 750 -291701 130697 95751 -58871
9749 -203025 -289132 77561 41101 -191383 45184 -296062 -107337 -161814 -123334 139332 -179745
$$ packed form
9829c07302i0180o1440A60320n2452J76294F3392a84656J2298J9193q5492N2749
9818a85908B91145b18564o3786c2981P4A8049J06699m2186b49288I0484N9719
9807A50203h6945M2359p1515m7227L265j23741d3111k9153G4493j6118b86225
9795I1835a93729B39710j0907m0811b9404F0166A4329J14496n6961a06433j53835
9784b60268a13153k1644A93751I5520a29452f2970B9437a81197q9581f1648j39411
9773b01059G9290a34735A29272i8668j63224L0210E4307b22354Q6346A3037a21921
9761a56435b7566E6500N0342b34749Q8124j42668G50b91701A30697l4946e8871
9749b03025q6107G7561l6460a91383D5184b96062a07337n4477L8480A39332a79745
$$ plain form
9737 395183 5834 -50725 -262421 -372881 129483 64811 -87002 -113154 -18646 213843 -447012
9725 -152708 -335157 -93811 60312 -291045 239375 -205490 25772 3971 -77038 -44852 -69424
9714 -69424 185633 244330 -304671 142395 -410210 -10491 101025 -290484 66128 -71230 -108190
9703 -108190 22658 -106868 -266728 -263130 -383827 -53349 -9512 15933 -106724 78513 -334470
9691 -225212 -242998 127985 -302746 -73303 45986 -40335 -65126 -89242 -115104 -244969 -348277
9680 -348277 -140195 -113843 53506 -44055 314060 192761 319555 -20794 -3867 -259193 -187365
9669 -187365 -224054 -108520 -88309 -17617 -228141 263126 35949 -75010 126661 -6654 -37425
9658 -37425 -41946 -407521 -131757 8078 -70154 30789 211206 88815 -112680 25588 -216806
$$ packed form
9737C95183E834e0725k11696j10460A29483o4672h7002k6152a8646B13843d47012
9725a52708j82449i3811F0312b91045B39375b05490B5772C971g7038L2186k4572
9714f9424A85633N8697c04671A42395d10210a0491A01025b90484F6128g1230l6960
9703a08190B2658a06868j59860L598j20697e3349i512A5933a06724G8513c34470
9691b25212j7786A27985c02746g3303D5986d0335k4791k4116k5862j29865j03308
9680c48277a40195K6352E3506d4055C14060j21299J26794b0794c867k55326P1828
9669a87365l6689a08520K0211a7617k10524B63126C5949g5010A26661f654l0771
9658c7425m521l65575a31757H078g0154C0789J80417H8815a12680B5588b16806
$$ plain form
9646 -323610 32329 -149703 -117729 590 131346 138088 41449 -20139 348302 -124064 -184978
9635 -184978 -129365 -178444 5212 -158095 -178068 84242 -92639 -196791 13086 141228 -56128
9623 -48816 286417 78501 -202198 -172216 -27949 -5385 -195849 -75289 -392573 203712 -418879
9611 -198287 -54123 63540 -353127 217530 160274 -205023 24038 -15442 26727 29849 -212299
9599 -55126 92780 -169091 -176190 327684 -54057 -219576 -206762 -98689 -150082 -312351 146838
9587 -19427 -245121 -133540 7684 -50538 -235322 -159677 -179130 57935 -117058 -347228 -12517
9575 -121036 -138657 146866 -202938 -13397 14952 -128828 -296365 -144570 5368 -57961 -98966
9564 -98966 -147569 251802 -157096 187115 102375 156896 46812 -234556 -12369 -136375 104148
$$ packed form
9646c23610C2329a49703L1974E90J30756O742D1449b0139C48302a24064o0914
9635a84978N5613m9079E212a58095j9973H4242i2639j04152A3086J28142e6128
9623d8816B86417G8501b02198K9982b7949e385j90464g5289l17284B03712d18879
9611a98287e4123F3540c53127B17530n7256b05023B4038a5442B6727L122b12299
9599e5126I2780a69091p099C27684e4057j65519J2814i8689n1393j62269A46838
9587a9427k25694J11581G684e0538j84784P5645j9453E7935a17058k30170a2517
9575a21036j7621A46866b02938a3397A4952a28828j67537a44570E368e7961m1005
9564i8966m8603B51802a57096A87115q4740N4521D6812b34556a2369j24006A04148
$$ plain form
9552 -174984 191495 -108964 -181218 27283 -124333 -86746 -268940 -90085 -85424 -68103 26117
9540 -183190 -262391 -13510 139989 -40110 -312319 46972 -322625 -33263 -329823 -320577 -23037
9528 81771 -285325 1193 39789 202710 -98027 52734 231548 -255352 11822 66525 -7050
9516 -242708 191368 -58210 18080 -54188 -213716 -97818 -203369 -92695 200500 -218893 94434
9504 -59934 -112008 -144234 26722 17391 -148323 -95333 -131827 -128954 -255428 -60995 109795 -195827
9491 -189032 250624 -109723 41059 -303964 -50271 215339 -14571 -89568 -523029 -55023 75187
9479 -209234 237296 -281326 -160102 65317 117020 -70582 -89539 137750 30829 117444 -206956
9467 46387 -42730 -337054 -158059 123620 -358103 -7141 -295267 88071 -170202 191813 -95834
$$ packed form
9552a74984A91495a08964p2254B7283a24333L7587j82194i0085M661J7321B6117
9540a83190p9201a3510A39989d0110k72209D6972c22625c3263k96560R246b3037
9528H1771b85325A193L8596J62921i8027E2734J78814b55352A1822N4703g050
9516b42708A91368e8210A8080e4188j59528i7818j05551i2695B00500b18893I4434
9504e9934n2074l2226B6722r331a48323N2990l6494K873j26474f0995A09795a95827
9491a89032B50624a09723D1059c03964e0271B15339a4571p4997m33461e5023G5187
9479b09234B37296b81326J21224F5317N1703g0582j8957A37750C0829Q6615b06956
9467D6387d2730k94324a58059A23620c58103g141k88126H8071a70202A91813i5834
$$ plain form
9455 -327284 -48060 -25700 -163435 339417 473 -131835 -275269 -178082 -4776 -229818 45210
9443 -158103 36271 -151312 156351 104044 -104531 -150913 -304507 -49011 254439 63470 181235
9432 181235 155631 -105681 -95298 -223988 211077 91780 -155708 -279624 -55906 8119 -18872
9420 -52314 27441 -156232 -142855 -157871 11625 -159317 160249 73043 -43198 -205338 191866
9408 73066 -294055 -163475 -149358 -278016 136684 146391 -229119 -163527 -7623 131204 11158
9396 -238289 109855 -96804 -281949 -109568 -140969 6605 -257708 168881 -55808 -70569 92907
9384 146315 97166 -134091 29006 -94965 197885 315912 94070 -57226 320045 48695 -106914
9372 -114916 188335 -212587 279909 -134147 93121 -209453 -102774 -325570 -99680 -50178
$$ packed form
9455c27284d8060K2360j37735C39417D73a31835j43434R7187d776k25042D5210
9443a58103C6271a51312A56351n2307a04531m6382j53594d9011B54439F3470J17765
9432A81235k5604a05681J0383j28690B11077I1780a55708j23916e5906H119a8872
9420e2314B7441a56232J3377j5016A1625a59317A60249G3043d3198j62140A91866
9408G3066b94055J30580J4117j28658A36684R707b29119O5592g623A31204A1158
9396b38289A09855i6804j85145a09568l1401F605b57708A68881e5808j4761I2907
9384A46315m9149a34091B9006i4965A97885J18027I4070e7226C20045D8695a06914
9372a14916A88335b12587B79909a34147I3121b09453a02774k22796i9680M9502
$$ plain form
9362 -50178 -301073 106870 -153518 191491 -190818 -5942 48103 -44111 -21612 112897 -15130
9350 -13211 -61120 -124338 -207321 54504 247355 -137538 -123995 -69043 -83332 -160915 -163573 -283683
9338 -283683 -46377 -214615 -50455 68133 -128148 -113116 -255499 -336721 52196 -202183 -152868
9327 -152868 -29508 47810 -217062 -44329 152040 -63865 -48437 -334032 -192915 -119877 -178781
9316 -178781 -262178 32036 -257258 -197211 -395603 -19656 -271193 -199629 54087 -81821 -277725
9305 -277725 -226697 -187822 -50407 -217048 324523 -344576 -390258 40918 -294770 342 -270834
9293 -50879 -59522 130651 -299266 29870 -335547 277410 -141539 -26474 -101814 -354669 158600
9281 45809 -157037 271570 64685 169392 -53921 29236 -201270 -151505 -80451 -431652 -231519
$$ packed form
9362e0178k50895A06870a53518A91491a90818e942D8103d4111b1612A12897a5130
9350a3211m7909o3218q2983E4504J92851a37538J3543N4952j4289p7583k658j20110
9338b83683d6377j68238e0455F8133a28148J5032j42383q1222E2196b02183M9315
9327a52868b9508D7810b17062d4329A52040f3865J5428k85595J41117P3038n8904
9316a78781q3397C2036b57258O0047j98392a9656k51537P1564E4087h1821j95904
9305b77725N1028L8875e0407j66641C24523c44576m5682D0918b94770C42b70834
9293e0879q643A30651b99266B9870c35547B77410a41539b6474p5340k52855A58600
9281D5809a57037B71570F4685J04707e3921B9236b01270M9765P1054l51201K00133
$$ plain form
9270 -231519 114169 51652 298693 -159601 -121861 177145 91640 -173684 47968 233369
9260 233369 -115951 -176384 -34234 -196486 58213 -259157 204270 -251397 -368849 174700
9249 166098 -257140 52247 -311061 -53142 -250772 -207872 157914 7753 -88242 -21847 -41353
9238 -41353 83102 -186627 137734 3451 39836 -261537 -299183 105422 -65622 129006 144101
9227 144101 198024 -235389 24332 -180161 -14977 -37555 132633 313672 -39433 101401 -200636
9215 143801 216752 -177503 139006 -172344 77369 -47769 163559 5403 199908 -109960 -65372
9204 -65372 26041 -148026 43662 -161496 -60433 -60910 254184 -314315 182112 -15138 156375
9192 -242014 -61827 210505 -306606 -123273 -70443 58894 -40604 -10650 172718 -240374 199963
$$ packed form
9270b31519A14169E1652K47041a59601L7740A77145q5505a73684D7968J85401
9260B33369a15951o0433c4234j62252E8213b59157B04270b51397j17452A74700
9249A66098b57140E2247c11061e3142j97630M2900A57914G753h8242b1847j9506
9238d1353H3102a86627A37734C451L6385b61537l7646A05422f5622A29006J5095
9227A44101N3923b35389B4332a80161a4977k2578A32633J81039c9433A01401b00636
9215A43801P2951a77503A39006a72344G7369d7769A63559E403J94505a09960M4588
9204f5372B6041a48026D3662a61496f0433m77B54184c14315A82112a5138A56375
9192b42014f1827B10505c06606a23273N2830E8894d0604a0650A72718b40374A99963
$$ plain form
9180 -1587 6061 166957 -217107 -270528 -300783 -124327 -154234 -251049 -188678 81906 -122158
9168 -403252 -22147 -352671 -189762 215439 -310157 -139838 -24741 149304 -18582 20011
9157 -354593 -226152 35508 -34387 -234877 -160457 284949 99028 211852 100125 -262496
9146 -336654 114730 216463 -80529 103626 386633 -408907 -154965 -194652 -38424 -150583
9136 -150583 -31792 -83658 18647 -118570 -319917 -178402 144729 276524 237101 -44294 -412743
9125 -412743 -338978 -9932 5891 -148991 -124277 -141503 10156 -260557 28409 -30267 28315 -230836
9112 -36862 -72131 84586 83687 -23028 31632 -28283 -237919 -15943 87502 126928 -314714 -145866
9099 -371334 -102763 -339673 -88753 83676 -56413 -124398 163193 -81128 -89286 -188711 55047
$$ packed form
9180a587F061J60896b17107n3421l0255a24327k9907r6815O2371H1906a22158
9168d03252b2147l30524J62909B15439c10157a39838b4741A49304a8582B0011
9157c54593J28441C5508c4387k00490P4420B84949I9028J12824A00125b62496
9146c36654A14730J01733h0529A03626K83007d08907a54965l9687c8424j12159
9136a50583c1792n1866A8647a18570k01347J41515A44729J31795l9423d4294l68449
9125d12743P3765i932E891a48991K4714j7226A0156b60557B8409c0267B8315b30836
9112c6862l5269H4586q99b3028C1632b8283k09636a5943H7502L9426c14714a45866
9099c71334a02763k36910h8753H3676e6413o7985A63193h1128q158r9425E5047
$$ plain form
9087 -72847 -188022 -83972 -258494 -99346 -108457 36614 77523 5615 -89246 -252988 -144087
9076 -144087 67134 149859 -177079 -331656 -295119 -193443 -111415 -245490 62859 -12395 -27894
9065 -27894 107319 -421634 -100066 88050 256210 84484 18575 -262443 -189347 5480 -255590
9053 -133083 -31584 212302 392890 -289064 -312717 96821 271905 -195086 -52419 256684
9042 3789 333269 128377 -46443 -208678 -40406 83760 215514 86946 6382 94893 36049
9030 290627 137243 -34734 -362778 -375406 -12319 -37317 -3819 110284 -126629 -161963 189357
9018 146038 -231877 -140193 111192 -87942 210882 35307 -201514 176817 -42003 177853
9007 143713 46509 343308 -157438 94368 262804 578089 -21659 -46896 85625 -148056 169549
$$ packed form
9087g2847j15175h3972j74522i9346r111C6614M0909E615h9246j63742J08901
9076a44087F7134Q2725a77079j54577L6537J01676Q2028j34075F2859a2395j5499
9065b7894A07319d21634a00066H8050J68160H4484A8575b62443P3096E480b55590
9053a33083c1584B12302J80588b89064k3653I6821J75084a95086e2419B56684
9042C789L29480A28377d6443j62235d0406H3760J31754H6946F382Q8511C6049
9030B90627A37243c4734l28044j2628a2319k4998c819A10284a26629l5334A89357
9018A46038b31877R1684A11192h7942B10882C5307b01514A76817d2003A77853
9007A43713D6509K96799a57438I4368J68436L15285b1659k5237H5625a48056A69549
$$ plain form
8995 297690 79882 -260344 -89390 -45144 219238 -193761 -43493 32288 -115066 -149830 -203101
8984 -203101 178433 119809 -202831 -184812 -231769 133569 -134739 86901 188611 -53985 107502
8972 -23744 33724 473238 -74281 364989 -57304 52042 133804 -152537 14799 -201640 -242711
8961 -242711 -314268 99964 254685 -29059 -29750 -286503 13876 391854 32508 200206 -161952
8949 -201882 -219151 -288895 -97677 115570 -124864 -235639 113847 -72656 329957 198170
8939 198170 -60685 -109330 90488 -237954 -128889 56856 166238 273470 242200 -24578 125935
8927 119591 -50116 211326 28561 371264 199920 710089 1060829 4489813 12746937 4966425
8916 1126597 659048 486535 115877 213423 -3922 160130 -49382 185742 85183 261359
$$ packed form
8995B97690G9882b60344h9390M4246B19238a93761d3493C2288a15066l4764n3271
8984b03101A78433n8624b02831J8019m6957A33569a34739H6901J01710e3985A07502
8972b3744C3724M39514g4281C64989e7304E2042Q1762a52537A4799b01640m1071
8961b42711p1557I9964J54721b9059o91k56753A3876L77978C2508J67698a61952
8949b01882j7269o9744i7677A15570a24864j10775A13847g2656C29957j31787
8939A98170f0685m8645I0488b37954J09065E6856J09382J07232l1270b4578A25935
8927A19591e0116B11326B8561L42703j71344N10169L50740L428984Q257124D966425
8916A126597m67549j72513A15877R7546c922A60130d9382A85742H5183J76176
$$ plain form
8906 261359 198154 -179837 115395 -257162 -68230 -61169 -91299 -188990 108446 -51791 -15690
8894 104643 18993 71628 -77552 -239869 11860 266440 -67567 396468 -134016 -220733 77756
8882 25873 70361 -62228 51007 -116661 205544 -42292 46712 -76678 -214520 -24499 80877
8870 167412 -343061 72513 -62254 -227752 -144579 52643 -442520 -128720 -228610 -107850 -174414
$$ packed form
8906B61359o3205a79837A15395b57162f8230P061l0130r7691A08446e1791a5690
8894A04643A8993N2635g7552j62317A1860K54580f7567C96468a34016q6717G7756
8882B5873M4488f2228E1007a16661B05544d2292D6712g6678j37842b4499H0877
8870A67412c43061G2513f2254j65498Q3173E2643d42520a28720r9890a07850o6564
$$ [...]
##END NTUPLES=NMR SPECTRUM
##END=
