
##TITLE=AC1244__6673806_yxZqgxz7Om
##JCAMPDX= 6.0         $$ Bruker NMR JCAMP-DX V2.0
##DATA TYPE= NMR SPECTRUM
##DATA CLASS= NTUPLES
##ORIGIN= BRUKER
##OWNER= Administrator
$$ 1.72 TOPSPIN		Version 2.1
$$ 2012-12-12 01:48:42.163 -0500  Administrator@X
$$ Compression mode = diff/dup
##.OBSERVE FREQUENCY= 400.02188249412
##.OBSERVE NUCLEUS= ^1H
##.ACQUISITION MODE= SIMULTANEOUS (DQD)
##.ACQUISITION SCHEME= undefined
##.AVERAGES= 8
##.DIGITISER RES= 22
##SPECTROMETER/DATA SYSTEM= spect
##.PULSE SEQUENCE= zg30
##.SOLVENT NAME= COFFEE_meoh
##.SHIFT REFERENCE= INTERNAL, COFFEE_meoh, 1, 14.98509
##AUDIT TRAIL= $$ (NUMBER, WHEN, WHO, WHERE, PROCESS, VERSION, WHAT)
$$ ##TITLE= Audit trail, TOPSPIN		Version 2.1
$$ ##JCAMPDX= 5.01
$$ ##ORIGIN= Bruker BioSpin GmbH
$$ ##OWNER= Administrator
$$ $$ E:\/data/COFFEE/nmr/AC1244__6673806_yxZqgxz7Om/20/pdata/1/auditp.txt
$$ ##AUDIT TRAIL=  $$ (NUMBER, WHEN, WHO, WHERE, PROCESS, VERSION, WHAT)
(   1,<2012-12-12 01:48:33.460 -0500>,<Administrator>,<X>,<go>,<TOPSPIN 2.1>,
      <created by zg
	started at 2012-12-12 01:47:27.288 -0500,
	POWCHK enabled, PULCHK disabled,
       configuration hash MD5:
       86 BA 57 50 F2 9D 5C 9B 26 00 A9 28 5F 66 2E 89
       data hash MD5: 64K
       42 AD 82 48 B4 AC AE E9 D5 6D A0 BF B2 4A F7 34>)
(   2,<2012-12-12 01:48:36.726 -0500>,<Administrator>,<X>,<proc1d>,<TOPSPIN 2.1>,
      <Start of raw data processing
       efp LB = 0 FT_mod = 6 PKNL = 1 PHC0 = 0 PHC1 = 0 SI = 32K 
       data hash MD5: 32K
       50 92 75 C5 7B 9B F7 EB 7C 73 D4 6B 9C E3 99 40>)
(   3,<2012-12-12 01:48:37.241 -0500>,<Administrator>,<X>,<proc1d>,<TOPSPIN 2.1>,
      <pk PHC0 = 96.93787 PHC1 = 0 
       data hash MD5: 32K
       EE 36 14 01 F2 03 FC EB 12 1B 9D D5 A3 C5 BB C1>)
(   4,<2012-12-12 01:48:37.491 -0500>,<Administrator>,<X>,<proc1d>,<TOPSPIN 2.1>,
      <abs ABSG = 1 
       data hash MD5: 32K
       4F F5 07 37 4B F0 49 2D 5E A5 BF F7 E4 6D 16 97>)
(   5,<2012-12-12 01:48:37.663 -0500>,<Administrator>,<X>,<proc1d>,<TOPSPIN 2.1>,
      <abs ABSG = 2 
       data hash MD5: 32K
       D8 D4 AC CB 5D B1 1F 2D 66 FE 17 13 D6 87 A8 4F>)
(   6,<2012-12-12 01:48:37.819 -0500>,<Administrator>,<X>,<proc1d>,<TOPSPIN 2.1>,
      <abs ABSG = 3 
       data hash MD5: 32K
       C2 04 E2 8D D4 19 A9 46 2A D6 E9 4D 90 D6 AB 28>)
(   7,<2012-12-12 01:48:37.976 -0500>,<Administrator>,<X>,<proc1d>,<TOPSPIN 2.1>,
      <abs ABSG = 4 
       data hash MD5: 32K
       4F 74 A3 19 E4 4A B0 26 B8 08 0C 67 41 72 7D C5>)
(   8,<2012-12-12 01:48:38.163 -0500>,<Administrator>,<X>,<proc1d>,<TOPSPIN 2.1>,
      <abs ABSG = 5 
       data hash MD5: 32K
       44 18 B5 05 55 B2 3C E7 AC 72 BA A4 69 7D FA 14>)
$$ ##END=
$$ 
$$ $$ hash MD5
$$ $$ A2 D4 D6 3B AA 34 A8 9B 7B 9D C6 74 6E 29 2A 6A
##$RELAX= 
##$RELAX= 
##$RELAX= 
##$RELAX= 
##$RELAX= 
##$RELAX= 
##$RELAX= 
##$RELAX= 
$$ Bruker specific parameters
$$ --------------------------
##$DU= <E:\>
##$EXPNO= 20
##$NAME= <AC1244__6673806_yxZqgxz7Om>
##$PROCNO= 1
$$ [...]
150 150 150 150 150 150 150 150
##$TP07= 0
##$TPNAME0= <>
##$TPNAME1= <>
##$TPNAME2= <>
##$TPNAME3= <>
##$TPNAME4= <>
##$TPNAME5= <>
##$TPNAME6= <>
##$TPNAME7= <>
##$TPOAL= (0..7)
0.5 0.5 0.5 0.5 0.5 0.5 0.5 0.5
##$TPOFFS= (0..7)
0 0 0 0 0 0 0 0
##$TUNHIN= 0
##$TUNHOUT= 0
##$TUNXOUT= 0
##$USERA1= <user>
##$USERA2= <user>
##$USERA3= <user>
##$USERA4= <user>
##$USERA5= <user>
##$V9= 5
##$VALIST= <valist>
##$VCLIST= <CCCCCCCCCCCCCCC>
##$VD= 0
##$VDLIST= <DDDDDDDDDDDDDDD>
##$VPLIST= <PPPPPPPPPPPPPPP>
##$VTLIST= <TTTTTTTTTTTTTTT>
##$WBST= 2048
##$WBSW= 25
##$XGAIN= (0..3)
0 0 0 0
##$XL= 0
##$YL= 0
##$YMAX_a= 683361
##$YMIN_a= -580126
##$ZGOPTNS= <>
##$ZL1= 120
##$ZL2= 120
##$ZL3= 120
##$ZL4= 120
##$ABSF1= 14.98509
##$ABSF2= -5.573092
##$ABSG= 5
##$ABSL= 3
##$ALPHA= 0
##$AQORDER= 0
##$ASSFAC= 0
##$ASSFACI= 0
##$ASSFACX= 0
##$ASSWID= 0
##$AUNMP= <proc_prof1d_extract_pilot.lims>
##$AXLEFT= 0
##$AXNAME= <>
##$AXNUC= <1H>
##$AXRIGHT= 0
##$AXTYPE= 0
##$AXUNIT= <>
##$AZFE= 0.1
##$AZFW= 0.1
##$BCFW= 0
##$BC_mod= 0
##$BYTORDP= 0
##$COROFFS= 0
##$CY= 15
##$DATMOD= 1
##$DC= 0
##$DFILT= <>
##$DTYPP= 0
##$F1P= 0
##$F2P= 0
##$FCOR= 0.5
##$FTSIZE= 32768
##$FT_mod= 6
##$GAMMA= 0
##$GB= 0
##$INTBC= 1
##$INTSCL= 1
##$ISEN= 128
##$LB= 0
##$LEV0= 0
##$LPBIN= 0
##$MAXI= 10000
##$MC2= 0
##$MEAN= 0
##$ME_mod= 0
##$MI= 0
##$NCOEF= 0
##$NC_proc= -8
##$NLEV= 6
##$NOISF1= 0
##$NOISF2= 0
##$NSP= 0
##$NTH_PI= 0
##$NZP= 0
##$OFFSET= 14.98509
##$PC= 1
##$PHC0= 96.93787
##$PHC1= 0
##$PH_mod= 1
##$PKNL= yes
##$PPARMOD= 0
##$PPDIAG= 0
##$PPIPTYP= 0
##$PPMPNUM= 2147483647
##$PPRESOL= 1
##$PSCAL= 4
##$PSIGN= 0
##$PYNMP= <proc.py>
##$REVERSE= no
##$SF= 400.02
##$SI= 32768
##$SIGF1= 0
##$SIGF2= 0
##$SINO= 400
##$SIOLD= 32768
##$SPECTYP= <>
##$SREGLST= <1H.CDCl3>
##$SSB= 0
##$STSI= 32768
##$STSR= 0
##$SW_p= 8223.68421052631
##$SYMM= 0
##$S_DEV= 0
##$TDeff= 65536
##$TDoff= 0
##$TI= <>
##$TILT= no
##$TM1= 0
##$TM2= 0
##$TOPLEV= 0
##$USERP1= <user>
##$USERP2= <user>
##$USERP3= <user>
##$USERP4= <user>
##$USERP5= <user>
##$WDW= 1
##$XDIM= 32768
##$YMAX_p= 485889729
##$YMIN_p= -1131641
##$CURPLOT= <Network HP LaserJet P1505>
##$CURPRIN= <$Network HP LaserJet P1505>
##$DFORMAT= <normdp>
##$LAYOUT= <+/1D_H.xwp>
##$LFORMAT= <normlp>
##$PFORMAT= <normpl>
##$SURQMSG= 1
$$ End of Bruker specific parameters
$$ ---------------------------------
##NTUPLES= NMR SPECTRUM
##VAR_NAME=  FREQUENCY,     SPECTRUM/REAL,   SPECTRUM/IMAG
##SYMBOL=    X,             R,               I
##VAR_TYPE=  INDEPENDENT,   DEPENDENT,       DEPENDENT
##VAR_FORM=  AFFN,          ASDF,            ASDF
##VAR_DIM=   32768,         32768,           32768
##UNITS=     HZ,            ARBITRARY UNITS, ARBITRARY UNITS
##FACTOR=    0.250966925370066, 1,           1
##FIRST=     8223.43324360094, -40286,       -124335
##LAST=      0,             158115,          57635
##MIN=       0,             -1131641,        0
##MAX=       8223.43324360094, 485889729,    0
$$ Real data points
##PAGE= N=1
##DATA TABLE= (X++(R..R)), XYDATA
$$ [...]
19547c38020l5117d6091j90030A79451n5362l486N6014j4548a10393G5024a42207
$$ -338020 -373137 -46091 -236121 179451 124089 120603 176617 162069 -110393 75024 -142207
19535G97b25161C14726k3370I9100f6296B04492a52753g735A16949l0474f5557
$$ 797 -225161 314726 291356 99100 -66296 204492 -152753 -7735 116949 86475 -65557
19523a13476Q497A7710a23900q5570k0719B35997c2390A6977L05290I3497i8813
$$ -113476 -104979 17710 -123900 -209470 -230189 235997 -32390 16977 322267 93497 -98813
19511g0062k28827A88413c20877d1194A78870H3006g9665k8939K5501r0807q9700
$$ -70062 -298889 188413 -320877 -41194 178870 83006 -79665 -108604 -83103 -173910 -263610
19500b63610j07008a69077A68930k8723a46745n30681b12602A33394b27892a03033
$$ -263610 -370618 -169077 168930 140207 -146745 -677426 -212602 133394 -227892 -103033
19489B666J03618h4235H5020K97508c32906J29489o1238A26258L92755A33379
$$ 2666 106284 -84235 85020 382528 -332906 -203417 -264655 126258 519013 133379
19478f33j48148O5332b0273D41307b60262A67639J36664b84260f2A8382a93153
$$ -633 -148781 -83449 -20273 441307 -260262 167639 304303 -284260 -62 18382 -193153
19466F1653d12150a45933N0868B03132b34924K0268f0195j31893f755G6112b04250
$$ 61653 -412150 -145933 -95065 203132 -234924 -214656 -60195 -192088 -6755 76112 -204250
19454F006M27181a66932h457C568K56030o9521a57293A95925o2372a35943A60810
$$ 6006 433187 -166932 -8457 3568 259598 190077 -157293 195925 133553 -135943 160810
19442i6695k23471B96062b35837j7020M4813H2083L1887b2191q8544l07470B01799
$$ -96695 -320166 296062 -235837 -252857 -208044 82083 113970 -22191 -110735 -418205 201799
19430B727f1083f415l8508i474A20261b61234l22792a88246R0741B9522a27868
$$ 2727 -61083 -6415 -44923 -9474 120261 -261234 -584026 -188246 -97505 29522 -127868
19418f5582A60119j6523a48887q3839A69698a46125A63119e6075A58460j8981
$$ -65582 160119 143596 -148887 -232726 169698 -146125 163119 -56075 158460 139479
19408A39479a19136A48117h7084J378k88521a54809H5658b18607J06021r8251
$$ 139479 -119136 148117 -87084 -85706 -374227 -154809 85658 -218607 -112586 -210837
19398b10837L2797O5494H665L34670A7012Q4581b24159K502M1038b7960p18l10430
$$ -210837 -178040 -112546 8665 343335 17012 101593 -224159 -221657 -180619 -27960 -28678 -339108
19386c39108a24268F8264b40297B83458H3355M8976c41283h277B92901g694q6949
$$ -339108 -124268 68264 -240297 283458 83355 132331 -341283 -8277 292901 -7694 -94643
19375i4643k52783A14287a38639j1696D9714L73768A41165b99390A70697b47420
$$ -94643 -347426 114287 -138639 -150335 49714 423482 141165 -299390 170697 -247420
19364g2451j03259j58691k43955E9487h5220C0803a46962b8699N853a716j795
$$ -72451 -175710 -334401 -578356 59487 -85220 30803 -146962 -28699 -22846 -1716 -3511
19353c511A2794b16464A7535b32592O3290I8618l4156b47417o2691a6716j27930
$$ -3511 12794 -216464 17535 -232592 -169302 98618 64462 -247417 -310108 -16716 -144646
19342a44646A2624K35997c44147J16018R0312K0263k6372F971K36092b45578c3677
$$ -144646 12624 248621 -344147 -228129 -137817 -117554 -143926 6971 243063 -245578 -33677
19330G400a44544B62419b05203k6328A1541Q0289m4184K59209H0820a12875j47056
$$ 7400 -144544 262419 -205203 -231531 11541 91830 47646 306855 80820 -112875 -259931
19319b59931B43930b55773B0792a82027j28531N6478q5993a57162K1683j90904
$$ -259931 243930 -255773 20792 -182027 -310558 -254080 -340073 -157162 -135479 -326383
19309c26383H7506A274f2047q6812j46245E0619J1726d7001A42746c6600j7740
$$ -326383 87506 1274 -62047 -148859 -295104 50619 62345 -47001 142746 -36600 -54340
19298e4340q6861m12072b31038a02682p9388j34876B49458J12201b09381Q5802
$$ -54340 -141201 -553273 -231038 -102682 -182070 -316946 249458 361659 -209381 -123579
19288a23579M5766j5137r5838j01533N1539k0329N3644P7066A94334o0612c81409
$$ -123579 -77813 -92950 -188788 -290321 -238782 -259111 -205467 -128401 194334 133722 -381409
19276A34427R1596a08010D5602K45816c50342J58114J9218A02669a29148p4629
$$ 134427 226023 -108010 45602 291418 -350342 -192228 -173010 102669 -129148 -203777
19266b03777j42820A7568b13065L6638o6750g3377r8322A1432b54027a25500M6890
$$ -203777 -346597 17568 -213065 -176427 -243177 -73377 -171699 11432 -254027 -125500 -78610
19255g8610k19239b6145j75745a3980A57029F2133J28384F9678c20575a04709
$$ -78610 -297849 -26145 -201890 -13980 157029 62133 190517 69678 -320575 -104709
19244A4314c05809a28859g649l68027E1024c0486A09097b72341A22958a801l0776
$$ 14314 -305809 -128859 -7649 -375676 51024 -30486 109097 -272341 122958 -1801 -32577
19233c2577k48181A52882b98873g9568G7250g8729l41334a88962j2284R0277A45940
$$ -32577 -280758 152882 -298873 -79568 77250 -78729 -420063 -188962 -201246 -110969 145940
19221A71090E7765a01676E1244f8631B4828O9522b75950A53102P9608E6551a0537
$$ 171090 57765 -101676 51244 -68631 24828 94350 -275950 153102 232710 56551 -10537
19209b35083g9126B19552I9085a89642R576B4729b12620b1866k06087m1296f2104
$$ -235083 -79126 219552 99085 -189642 -180066 24729 -212620 -21866 -227953 -269249 -62104
19197f623H8740L45233b45133c5580l38820b5652k09563g6806c0567j47458j94070
$$ -6623 88740 433973 -245133 -35580 -374400 -25652 -235215 -76806 -30567 -178025 -372095
19186c72095L7002J18248b2189A63448c4434B11221H5011J45302e8292B8528b03101
$$ -372095 -335093 -216845 -22189 163448 -34434 211221 85011 230313 -58292 28528 -203101
19174h6597B09400n5044C3849a4986l76043J92019D4977K51283b24039B8108K77177
$$ -86597 209400 154356 33849 -14986 -391029 -199010 44977 296260 -224039 28108 305285
19163C05285c87265c5599G4539g2174i908A83519H828K02611c70316a30489N7899
$$ 305285 -387265 -35599 74539 -72174 -9908 183519 8828 211439 -370316 -130489 -72590
19152g2590A53210e3386B63510d3778o7048H783f2310l0348C35388i2089n1981
$$ -72590 153210 -53386 263510 -43778 -110826 8783 -62310 -92658 335388 -92089 -144070
19141a44070D3135a6577j48871A58536b47847e2045A62356F9936a94836D2600
$$ -144070 43135 -16577 -165448 158536 -247847 -52045 162356 69936 -194836 42600
19130B17469b48166f8915A59272F9360K1828K3544b10765j8351e1316n8413k36123
$$ 217469 -248166 -68915 159272 69360 91188 114732 -210765 -229116 -51316 -109729 -345852
19119c45852h653o0537I4206b02233H9171K1262b4339H5847J2671a39225H7520
$$ -345852 -8653 -69190 94206 -202233 89171 110433 -24339 85847 98518 -139225 87520
19107f1340C04262I5410b63073a09752A21601J5825f1713b9062j7279C87874c4960
$$ -61340 304262 95410 -263073 -109752 121601 137426 -61713 -29062 -46341 387874 -34960
19095C9096a92431O7899j27593A77856d2800k6333k21299A36088n9822D264c22150
$$ 39096 -192431 -124532 -252125 177856 -42800 -69133 -290432 136088 76266 4264 -322150
19083a0220j94445M3302A71756e3014A3128a93983j05297B5011b25631j17224
$$ -10220 -204665 -161363 171756 -53014 13128 -193983 -299280 25011 -225631 -342855
19073c42855J07189P4746C72261A66128b56073f4012B53354b59745m8534A04901
$$ -342855 -235666 -160920 372261 166128 -256073 -64012 253354 -259745 -308279 104901
19062A346J15527C2069a40771B58185J8119B4206b15273A08468D3804a48013L0941
$$ 1346 116873 32069 -140771 258185 276304 24206 -215273 108468 43804 -148013 -117072
19051a17072k36027J34955g8479j93477A29786f5796r3199E8816a30804L5349
$$ -117072 -353099 -218144 -78479 -271956 129786 -65796 -158995 58816 -130804 -95455
19041i5455H6324J50892j03917m2914j6010k3024K10911a7214A19392E8734j715
$$ -95455 86324 237216 133299 90385 74375 51351 262262 -17214 119392 58734 57019
19030E7019J63410D609J8242a49G5843G566K30644A07386N4890B8957J84228q4882
$$ 57019 220429 4609 22851 -149 75843 7566 238210 107386 162276 28957 213185 128303
19018A28303a67383J0974e1349k12233G858L2304i058j08262M4918j05594a6246
$$ 128303 -167383 -156409 -51349 -263582 7858 40162 -9058 -117320 -72402 -177996 -16246
19006f1648C5804a07012n2592b6034A0014a7680l76287g6077I5716b26976R6658
$$ -61648 35804 -107012 -159604 -26034 10014 -17680 -393967 -76077 95716 -226976 -130318
18995a30318N3574B0194a42034l8136b5508M464j6981j21752d0788r4105k72784
$$ -130318 -76744 20194 -142034 -180170 -25508 -21044 -38025 -159777 -40788 -134893 -407677
18984d07677J79597c1606A30038b80346C7262L1477b131m5087k60605p5542e9138
$$ -407677 -228080 -31606 130038 -280346 37262 68739 -2131 -47218 -307823 -383365 -59138
18972A32094N3342i3120C51908i0647d95q2345D6917c2273L511D8028a76532e5665
$$ 132094 185436 -93120 351908 -90647 -495 -82840 46917 -32273 -28762 48028 -176532 -55665
18959i7507A30260c22620H9620b5371p8716A99929a10245k2520l30783A3024c04607
$$ -97507 130260 -322620 89620 -25371 -104087 199929 -110245 -132765 -463548 13024 -304607
18947g0014A2281a30855E9246a49631l50182a24345c4374q281B9832a39652A36983
$$ -70014 12281 -130855 59246 -149631 -499813 -124345 -34374 -42655 29832 -139652 136983
18935D21933h5303m6853J0150j17290i0042m0639J3900d5517j7881j74060R4452
$$ 421933 -85303 -132156 -122006 -239296 -90042 -130681 -116781 -45517 -63398 -237458 -143006
18924a43006A64983N2201f2505m63483C990a9774A27855l475a57654P5650A95515
$$ -143006 164983 217184 -62505 -525988 3990 -19774 127855 124380 -157654 -82004 195515
18912A80271b33208c0320C3990K16855b73760h0175k3735C1192d79402A34921
$$ 180271 -233208 -30320 33990 250845 -273760 -80175 -103910 31192 -479402 134921
18901b46248b3946k5040j23324F9774b61128Q4489A62282c6893k22840D8913b38254
$$ -246248 -23946 -48986 -172310 69774 -261128 -176639 162282 -36893 -259733 48913 -238254
18889a03971j92826d323k63761h5673j34058d6151E7510A8899c89703G424a81299
$$ -103971 -296797 -4323 -268084 -85673 -219731 -46151 57510 18899 -389703 7424 -181299
18877d4008m7825B01594g6007m8301C3910d22886R2617J55288b4018B5195o88
$$ -44008 -91833 201594 -76007 -124308 33910 -422886 -330269 -174981 -24018 25195 24507
18866B4507b00640j7573e6446n5286p991a3916l26559d1150A97467H6007a73240
$$ 24507 -200640 -218213 -56446 -111732 -119723 -13916 -340475 -41150 197467 86007 -173240
18854E1890a36574B27127d40670h1129C4216c7079A40911a67895o8780A33962
$$ 51890 -136574 227127 -440670 -81129 34216 -37079 140911 -167895 -236675 133962
18843b07564j92156M3019a17487r0407j32493a41609j43723e4090k39649J03317
$$ -207564 -399720 -356701 -117487 -207894 -340387 -141609 -285332 -54090 -293739 -190422
18833a90422q1962A40858a05238A02592L2401d7233B03231b84255g1679B99746
$$ -190422 -272384 140858 -105238 102592 134993 -47233 203231 -284255 -71679 299746
18822C9467h8502B44552k3043c3785G8848J18812O76k7189J45882e9041A07652
$$ 39467 -88502 244552 221509 -33785 78848 197660 198336 171147 317029 -59041 107652
18810B50666K04010b00937A20073P9137a28306N8043C5238m19a34732m063N380
$$ 250666 454676 -200937 120073 199210 -128306 -70263 35238 34819 -134732 -138795 -133415
18799a33415A85099c06913C9240e414m4215O591a5893l6959R013j07422A19496
$$ -133415 185099 -306913 39240 -5414 -49629 -43038 -15893 -52852 -43839 -151261 119496
18787a61396B21515e1467k72149B22746p2228J33872b09409G6561a01182b3755
$$ -161396 221515 -51467 -323616 222746 150518 284390 -209409 76561 -101182 -23755
18776e2460j85018B9742a12485k04055g1536r5112f5844j79518C044O698c08745
$$ -52460 -237478 29742 -112485 -316540 -71536 -166648 -65844 -245362 3044 9742 -308745
18764e2162B79188f3680h315j5827q4937A18706c9598m18670b08082D20738b31142
$$ -52162 279188 -63680 -8315 -24142 -109079 118706 -39598 -458268 -208082 420738 -231142
18752a71230m2224g210C40322a5168k42853A11567A7911b82941H0619a90508I9535
$$ -171230 -213454 -7210 340322 -15168 -258021 111567 17911 -282941 80619 -190508 99535
18740b92465A25992b37281J06469C45757b19845D3304a8375D4556a56896j94700
$$ -292465 125992 -237281 -130812 345757 -219845 43304 -18375 44556 -156896 -351596
18730c51596a44622d9261A25902n2177e9797n30629a04023j91190F5999a78756
$$ -351596 -144622 -49261 125902 73725 -59797 -590426 -104023 -295213 65999 -178756
18719A72999R8165I0013k4465i3859B6942a35230C4301e9374A57726b42348B86930
$$ 172999 271164 90013 65548 -93859 26942 -135230 34301 -59374 157726 -242348 286930
18707B2004h9877I0263b11367K9638C40328p9486a1156B05931a74252D3572a7830
$$ 22004 -89877 90263 -211367 -181729 340328 260842 -11156 205931 -174252 43572 -17830
18695f1744K3342j55885B6726i420l7148A37385o2001g2288j81686I0819C1320
$$ -61744 -38402 -194287 26726 -9420 -46568 137385 75384 -72288 -253974 90819 31320
18683c35599D667a58477M7772F1131g3268m3917r2591B97229A20534i7132D0806
$$ -335599 4667 -158477 -110705 61131 -73268 -117185 -209776 297229 120534 -97132 40806
18671b2117l5293k38063B00365A169c2362l3377l58384B2147d75613a14338C7971
$$ -22117 -57410 -295473 200365 1169 -32362 -65739 -424123 22147 -475613 -114338 37971
18659c08376c5225B10027b82584D44999c31145A31121f5051r0081H5453c05201
$$ -308376 -35225 210027 -282584 444999 -331145 131121 -65051 -155132 85453 -305201
18648d3268B82859b39617B9804c1017j74486c4752B07321b72451A80151h0679
$$ -43268 282859 -239617 29804 -31017 -205503 -34752 207321 -272451 180151 -80679
18637H8052J57938A8589i0381j70451d633k35983G6645c54433L9396G5901a34440
$$ 88052 245990 18589 -90381 -260832 -4633 -240616 76645 -354433 -315037 75901 -134440
18625b7709l0239k75130a54579q8132J19558p6098Q1036B65496E7092j4807c3370
$$ -27709 -57948 -333078 -154579 -242711 -123153 -199251 -118215 265496 57092 42285 -33370
18613A39155c94069J58052A32455a36549L1742A91104a03928F272a18798d8723
$$ 139155 -394069 -236017 132455 -136549 -104807 191104 -103928 6272 -118798 -48723
18602A31964d55844g8888B10984c09490c0474A8884a65494q465L3171M7135o9062
$$ 131964 -455844 -78888 210984 -309490 -30474 18884 -165494 -173959 -140788 -93653 -162715
18591a62715k7444j34618A70293b01834i5122L5433F8521a81244A63768A0390
$$ -162715 -190159 -324777 170293 -201834 -95122 -59689 68521 -181244 163768 10390
18580a39290A0835J25630d3041B34279b82271J32306j93441h7248j04352b0299
$$ -139290 10835 136465 -43041 234279 -282271 -149965 -343406 -87248 -191600 -20299
18569A18476b25798A17890b7173q5041A24359e7842A22455b19217C72414a19830
$$ 118476 -225798 117890 -27173 -112214 124359 -57842 122455 -219217 372414 -119830
18558g6300j86280D8532a92154C942J20794e5275C1657g8120G9930b1365E7005
$$ -76300 -262580 48532 -192154 3942 124736 -55275 31657 -78120 79930 -21365 57005
18546I9361b08030c4944q123k0749j00846A37831b71368B9745b98922a31691J682
$$ 99361 -208030 -34944 -43067 -63816 -164662 137831 -271368 29745 -298922 -131691 -130009
18535a30009C67096b25112B29462n4083b82670M5530D34760c57449a69109a9955
$$ -130009 367096 -225112 229462 175379 -282670 -237140 434760 -357449 -169109 -19955
18524g2514A33052b89267K6758G6344J57909f8811b7935m09299b17780c6550i553
$$ -72514 133052 -289267 -262509 76344 234253 -68811 -27935 -437234 -217780 -36550 -9553
18512b24670C3089g5534j65199I1493L558a73434N4799j3719m2028j0100A16941
$$ -224670 33089 -75534 -240733 91493 95051 -173434 -118635 -132354 -174382 -184482 116941
18500A33152J38506c03020o8163p3625A51941m9079e710m99375n6468A71369m9314
$$ 133152 271658 -303020 -371183 -444808 151941 102862 -5710 -505085 -561553 171369 122055
18489A22055M8599h7678B21746C3042a23117L3326a0619r7004F7730c2540k56915
$$ 122055 170654 -87678 221746 33042 -123117 -89791 -10619 -107623 67730 -32540 -289455
18478b89455H9315a23605B00960a3536p0348j00268B20082a38728J8952K3029
$$ -289455 89315 -123605 200960 -13536 -83884 -184152 220082 -138728 -119776 -96747
18468i6747C9509R9085b39512j2521Q7649K4541l4665G625i3143l78777J61187
$$ -96747 39509 138594 -239512 -252033 -164384 -139843 -174508 7625 -93143 -471920 -310733
18457c10733C3266j2568b3595B36488A08600M8728c8071B0869b46583g3873D1734
$$ -310733 33266 20698 -23595 236488 108600 157328 -38071 20869 -246583 -73873 41734
18445b36866c6086B25428a28161m1123g0897I52Q7039a52697C54909a85223B30359
$$ -236866 -36086 225428 -128161 -169284 -70897 952 87991 -152697 354909 -185223 230359
18433a26850A23778j0721a96658e6131b7274I264b931k25448F7517M2063a11650
$$ -126850 123778 113057 -196658 -56131 -27274 9264 -2931 -228379 67517 109580 -111650
18421a44123A43280D1758K06540q6378o9849m4108b43328g3190r7061q9181q0595
$$ -144123 143280 41758 248298 161920 92071 47963 -243328 -73190 -170251 -259432 -340027
18410c40027E1329P940J76566B2526d9051C22245H2205j6449M6483D8056K00860
$$ -340027 51329 59269 235835 22526 -49051 322245 82205 65756 112239 48056 248916
18399B48916a84640M3370c7548A4971M4289b58238R6315j75041J06218B47758
$$ 248916 -184640 -141270 -37548 14971 59260 -258238 -161923 -336964 -230746 247758
18388a93908m5929J66D2724K72246c86321A39204M1733h7098A0746g6807k03836
$$ -193908 -239837 -239671 42724 314970 -386321 139204 180937 -87098 10746 -76807 -280643
18377b80643J28643f3099F2443c75032C71040A76512b4248p8919k25831J29132
$$ -280643 -152000 -63099 62443 -375032 371040 176512 -24248 -103167 -328998 -199866
18367a99866q8888d7048B38562H4315J95299B8087J62852b05112A36419A3973
$$ -199866 -288754 -47048 238562 84315 279614 28087 190939 -205112 136419 13973
18356d15637A43849J01198e0809A08657A3326a84733E8449F280M53830b19700
$$ -415637 143849 245047 -50809 108657 13326 -184733 58449 6280 460110 -219700
18345a75860j25944j80901b1393I6093e4464H3177i4070j46216H8731C703c31261
$$ -175860 -301804 -482705 -21393 96093 -54464 83177 -94070 -240286 88731 3703 -331261
18333F5104J43863F8374B2747b73252p2449J2927N8675J7479a26771B9373P8251
$$ 65104 208967 68374 22747 -273252 -345701 -332774 -274099 -256620 -126771 29373 107624
18322A07624d14612f5057M450J1771k5208b7834l25030g933A90243C915b83330
$$ 107624 -414612 -65057 -60607 -48836 -74044 -27834 -352864 -7933 190243 3915 -283330
18310b85910E1650L06a86243c813A70869d10496J97943f3917m15323A10364E0723
$$ -285910 51650 51956 -186243 -3813 170869 -410496 -212553 -63917 -479240 110364 50723
18298A31535L5793C7393f0356B63751c7269j70689B2588O1885R4688i7892A321
$$ 131535 167328 37393 -60356 263751 -37269 -207958 22588 84473 179161 -97892 1321
18286d52330d1413D9993a95866f7564a4169j3369j93290A70694K60915A08908
$$ -452330 -41413 49993 -195866 -67564 -14169 -27538 -220828 170694 431609 108908
18275c0473q6275a4237m3382k51744B46245M9394A42927c43139J22853A21547
$$ -30473 -116748 -14237 -57619 -309363 246245 295639 142927 -343139 -220286 121547
18264A38909b22054A79736a05960a0998m78270K38135j33720B83656a30954j7767
$$ 138909 -222054 179736 -105960 -10998 -489268 -251133 -384853 283656 -130954 -148721
18254a48721N4738N415A42659L3052J51601f323B1577c15094B779K39076a91047
$$ -148721 -93983 -88568 142659 175711 327312 -6323 21577 -315094 2779 241855 -191047
18242A38005F574M0770L8509K70142G2701b02155L8659D840K28185b77499L9154
$$ 138005 6574 47344 85853 355995 72701 -202155 -163496 4840 233025 -277499 -238345
18231b38345f6351k11824N7572g3306A19558h322F5009A8903b96471A24537i7949
$$ -238345 -66351 -278175 -220603 -73306 119558 -8322 65009 18903 -296471 124537 -97949
18219b28707D01630A48595b84769b2178B16022a28400A1241f4695J25j46047g3418
$$ -228707 401630 148595 -284769 -22178 216022 -128400 11241 -64695 -64570 -210617 -73418
18207B05296b26275A9452b60042A5155b54452a01045D9241a56699B03077d12635
$$ 205296 -226275 19452 -260042 15155 -254452 -101045 49241 -156699 203077 -412635
18196C2272b24012b6837C03459a81048O3997q1258Q6217j73618C1804J53689a44642
$$ 32272 -224012 -26837 303459 -181048 -117051 -198309 -112092 -285710 31804 185493 -144642
18184G216M0347M5491Q3267a16470j88974h0275j15893O885m7182A02682i5711
$$ 7216 47563 93054 176321 -116470 -305444 -80275 -196168 -189283 -236465 102682 -95711
18172h4490A45811b5751k16745a0375m8699l83968a32401G6624M7006c8390F5565
$$ -84490 145811 -25751 -242496 -10375 -59074 -443042 -132401 76624 123630 -38390 65565
18160I4598a56602r7180E8226d18k51237K3641i3263L3149J0736A84889E2050
$$ 94598 -156602 -253782 58226 -418 -251655 -228014 -93263 -60114 -49378 184889 52050
18148D7265I140K44011a4848G4887a18645d7953G7545R4494N7036H6604b40836
$$ 47265 9140 253151 -14848 74887 -118645 -47953 77545 172039 229075 86604 -240836
18136d09797I3993j565f9862k6310A40287d3053H6085r916h1072Q900Q144l7352
$$ -409797 93993 92428 -69862 -96172 140287 -43053 86085 76169 -81072 -72172 -64028 -101380
18124a01380A3710N9816J31605b6481H162h646A63653E5263J82293m1586I0558
$$ -101380 13710 73526 205131 -26481 8162 -8646 163653 55263 237556 195970 90558
18112i9245j08891C50027H9161J47126a91956o8313J26935B31516c12586E5030
$$ -99245 -208136 350027 89161 236287 -191956 -260269 -133334 231516 -312586 55030
18101A38630b0748j4118A16930d2784g630p4294L8454B42303c28844A3718c8065
$$ 138630 -20748 -34866 116930 -42784 -7630 -81924 -43470 242303 -328844 13718 -38065
18089F8764a5193G7633O5352a53598d4744n3233b2896r0871K2428J9613j6708
$$ 68764 -15193 77633 142985 -153598 -44744 -97977 -22896 -113767 -91339 -71726 -88434
18078h8434G3801c217j30183D7699b9280A76297i984k12489L4161c7600j06127
$$ -88434 73801 -3217 -133400 47699 -29280 176297 -9984 -222473 -188312 -37600 -143727
18067a43727k9218j81197g8379P147j31325k1888A00777b75054A80633b03969
$$ -143727 -172945 -354142 -78379 -71232 -202557 -224445 100777 -275054 180633 -203969
18056b89701A20314n5943a76064A26977a50169j03676B1699d62258J78745I3897
$$ -289701 120314 64371 -176064 126977 -150169 -253845 21699 -462258 -283513 93897
18045c52590a9805a53A1450P3289J51992J15340G2962d5977k72643A23700D6845
$$ -352590 -19805 -153 11450 84739 236731 352071 72962 -45977 -318620 123700 46845
18033A99380q4268b48819i4302B40832a21361j9825p9299A81945O077J06323j39502
$$ 199380 115112 -248819 -94302 240832 -121361 -141186 -220485 181945 188022 294345 154843
18022A54843c4519j9069I1626O8227B3495b67026a01131k68377A6613a72734A07810
$$ 154843 -34519 -53588 91626 159853 23495 -267026 -101131 -369508 16613 -172734 107810
18010A68574a20834e9219r3215O6514H7747P6209m7128J3629E1432b1566H7751
$$ 168574 -120834 -59219 -152434 -85920 87747 163956 116828 130457 51432 -21566 87751
17998A51884C9344J46301b47741A96793d09751a47247N006B72260E0366d0344
$$ 151884 39344 185645 -247741 196793 -409751 -147247 -142241 272260 50366 -40344
17987B76862a43737C18666j1595a37984B78896B4512b15663A18400A158P0215
$$ 276862 -143737 318666 307071 -137984 278896 24512 -215663 118400 1158 71373
17977G1373g2858l10924d3646k23967B07204c10473e5922l57454a36297A18559
$$ 71373 -72858 -383782 -43646 -267613 207204 -310473 -55922 -413376 -136297 118559
17966G0182M7399a64686A69037a66940B04234e2878k97974a09324j75064r9329
$$ 70182 117581 -164686 169037 -166940 204234 -52878 -350852 -109324 -284388 -383717
17956c83717r5390i8438D2269e7335r9125A84696b96545F3223b47580N8261A15643
$$ -383717 -479107 -98438 42269 -57335 -156460 184696 -296545 63223 -247580 -189319 115643
17944a1225o2569b5275A23798b28144D29635a26708l130B08906b48673A39017
$$ -11225 -73794 -25275 123798 -228144 429635 -126708 -129838 208906 -248673 139017
17933B97915A25375b63781A1781c73281C42562g166C8151a23113j16133j8774
$$ 297915 125375 -263781 11781 -373281 342562 -7166 38151 -123113 -239246 -258020
17923b58020I9597k7835b08734e256k07677b843k71481l3735A72316D2131g5349
$$ -258020 99597 71762 -208734 -5256 -212933 -2843 -274324 -308059 172316 42131 -75349
17911A62004L5830J33875a59670A98924k7554b92905N6928H7696a07269k26861
$$ 162004 197834 331709 -159670 198924 171370 -292905 -235977 87696 -107269 -334130
17901c34130a47390E3582P6988A5055f308C3492J93705l0403c3322A51680b3659
$$ -334130 -147390 53582 130570 15055 -6308 33492 227197 196794 -33322 151680 -23659
17889A84151c72888a20210A5267M6773g7309j08703A5337a27923j88783k3328
$$ 184151 -372888 -120210 15267 62040 -77309 -186012 15337 -127923 -316706 -340034
17879c40034h4796G5743a15096e6888a2517l4956j21386g2152m1764A85408i8711
$$ -340034 -84796 75743 -115096 -56888 -12517 -47473 -168859 -72152 -113916 185408 -98711
17867b15828j03749O8012a7351k40659k0390a18595D80688B20715a9960G6516
$$ -215828 -319577 -251565 -17351 -258010 -278400 -118595 480688 220715 -19960 76516
17856G2371a50743j2995O5343M8602A56924e9932A39435k442g3763A74922a13410
$$ 72371 -150743 -163738 -98395 -49793 156924 -59932 139435 136993 -73763 174922 -113410
17844A49634n1499B5235c12456C2310M1453h0432J4622j63812e4694H3470A3959
$$ 149634 98135 25235 -312456 32310 73763 -80432 -65810 -229622 -54694 83470 13959
17832C12969G8672i1059F5250O7973f5446H5728g2280j562p5111k76833H4330
$$ 312969 78672 -91059 65250 133223 -65446 85728 -72280 -73842 -148953 -425786 84330
17820d1656k3032j55693O3499B19357a1921A03600e87526f4078k50234a0675C79218
$$ -41656 -64688 -220381 -156882 219357 -11921 103600 -587526 -64078 -314312 -10675 379218
17808A49377a51093B1131b36383C98476a49877q9976a03588A59312N9004d01598
$$ 149377 -151093 21131 -236383 398476 -149877 -239853 -103588 159312 218316 -401598
17797c98969a43589A44087h0446A35595K88368b08875R1811d0667C2287M3404
$$ -398969 -143589 144087 -80446 135595 423963 -208875 -117064 -40667 32287 75691
17787G5691d5553B81540B9362b60801p454J01199j94512D0948A6030D129a44068
$$ 75691 -45553 281540 29362 -260801 -268255 -167056 -361568 40948 16030 4129 -144068
17775H6762a67171B24133j00022J2432a14675k40092A03308a20379p6240F7988
$$ 86762 -167171 224133 124111 136543 -114675 -354767 103308 -120379 -196619 67988
17764g1804A26184F1090k0989L1493L3706c4899B15476a85036B95859a57453j42093
$$ -71804 126184 61090 40101 71594 105300 -34899 215476 -185036 295859 -157453 -299546
17753b99546A14113P2740A9960L31500p8697r7436b5105q0057k77421a89450m1420
$$ -299546 114113 186853 19960 351460 272763 175327 -25105 -105162 -382583 -189450 -230870
17742b30870A62164c00351A25568c4003A81628h1510A78078a17646k37029F3948
$$ -230870 162164 -300351 125568 -34003 181628 -81510 178078 -117646 -354675 63948
17731c2449l26711a09466M3387O945C66598b0389k24339N1471F5576o878J12868
$$ -32449 -359160 -109466 -66079 -59134 366598 -20389 -244728 -193257 65576 58698 171566
17720A71566B462g2434B19069a02228p4958G5507K09903e378B04570q7629f2063
$$ 171566 2462 -72434 219069 -102228 -177186 75507 285410 -5378 204570 116941 -62063
17708D10567A11474h3239A73099n8566D6790a45818l961p2930A78466b0853C99621
$$ 410567 111474 -83239 173099 114533 46790 -145818 -149779 -222709 178466 -20853 399621
17696H8196c3397m6140B4075J18864K76951i6680R30G5169J13538a9421H5543
$$ 88196 -33397 -79537 24075 142939 419890 -96680 -95750 75169 188707 -19421 85543
17684A61128J6640m4594h0945E508a42873e1850p0743F1157J49938O089a59334
$$ 161128 177768 133174 -80945 5508 -142873 -51850 -122593 61157 211095 217184 -159334
17672A22138j0669e459B40049J50743I3506l8423d5185G1282c02444A00646l4840
$$ 122138 111469 -5459 240049 390792 93506 55083 -45185 71282 -302444 100646 65806
17661F5806P788j9640J24790p2952K0708B5131Q902J06047a12198D8534i1767
$$ 65806 73594 53954 178744 105792 126500 25131 34033 140080 -112198 48534 -91767
17649C75210k6919A32621a22029a7456B16098a26686B13087J324b49213A09441
$$ 375210 348291 132621 -122029 -17456 216098 -126686 213087 214411 -249213 109441
17638b42400e9922D37959G7597a75090c2398A77490d8056k66358e8546j09993
$$ -242400 -59922 437959 77597 -175090 -32398 177490 -48056 -314414 -58546 -168539
17628a68539K5009A7664L1107d4647j25226f9428B23879E4465L7827o845k50b90633
$$ -168539 -143530 17664 48771 -44647 -169873 -69428 223879 54465 92292 85447 85197 -290633
17615A23545a06270K5302A93859b14950h7312l23078B1005a51021A51028B107
$$ 123545 -106270 -80968 193859 -214950 -87312 -410390 21005 -151021 151028 2107
17604b10120k763G8946a46903B17869a75429A2084L2812A8423J16352i0288A27222
$$ -210120 -212883 78946 -146903 217869 -175429 12084 44896 18423 134775 -90288 127222
17592d5724J3289B21195k3808h7669j61772n8907g8966B27445b41355c2544A50274
$$ -45724 -32435 221195 197387 -87669 -249441 -308348 -78966 227445 -241355 -32544 150274
17580G6271J59696a22451B26286e3842E9233I283b3890k64482B5754N3106K43846
$$ 76271 235967 -122451 226286 -53842 59233 9283 -23890 -288372 25754 78860 322706
17569C22706g8582j29534a8753d342A292a06763D11K39445g8888E02140A50480
$$ 322706 -78582 -208116 -18753 -4342 1292 -106763 411 239856 -78888 502140 150480
17557a25836C86161c2755A00982a28823m1819E4799J44575b58078A20226D9886
$$ -125836 386161 -32755 100982 -128823 -170642 54799 199374 -258078 120226 49886
17546h02B03843J6582a36808M8174j25419K8287J9098F3229K11574I2942b79731
$$ -802 203843 220425 -136808 -88634 -214053 -185766 -166668 63229 274803 92942 -279731
17534A28904m3163C1407L88958a29964B10966K1657I6476L58093H5460C6320K7021
$$ 128904 85741 31407 420365 -129964 210966 232623 96476 454569 85460 36320 63341
17523F3341a85839c5445A77008m398a28329j1302B25966N6115R3267j67222a73764
$$ 63341 -185839 -35445 177008 172610 -128329 -139631 225966 282081 375348 208126 -173764
17511A30713K90830f9460j53724D8571d9574M100k2671J3527C86060A47407a08393
$$ 130713 421543 -69460 -223184 48571 -49574 -45474 -68145 -54618 386060 147407 -108393
17499D2469J44145E0840A5739K63993n9881a75741A3065K68340D4666L14652D3848
$$ 42469 186614 50840 15739 279732 219851 -175741 13065 281405 44666 359318 43848
17487H9182M9100N0788a70819d0450C78574F7593a0501n2916A83348O0421I3106
$$ 89182 138282 189070 -170819 -40450 378574 67593 -10501 -63417 183348 243769 93106
17475F3056J39623P6301q8586a98677A76846f1691C097d179A91093H7453K03508
$$ 63056 202679 278980 190394 -198677 176846 -61691 3097 -4179 191093 87453 290961
17464B90961g7387E7825K64658E4157L47043I8231J20245H8290K34035j59662
$$ 290961 -77387 57825 322483 54157 401200 98231 218476 88290 322325 162663
17454A62663E3734J11396L82398a53775A04202J44809J65499j57691C0076M02443
$$ 162663 53734 165130 547528 -153775 104202 249011 414510 256819 30076 432519
17444D32519b26770G2481J27738a12364C55681J82765k03736A24046M58645k26991
$$ 432519 -226770 72481 200219 -112364 355681 538446 334710 124046 582691 355700
17434C55700p1005K38907j68392a26287E92933a59091A97300b52997C81188j70427
$$ 355700 284695 523602 355210 -126287 592933 -159091 197300 -252997 381188 210761
17424B10761k5892K77118b2427r9369A69316b79034A69405F4414L12157A68458
$$ 210761 184869 461987 -22427 -121796 169316 -279034 169405 64414 376571 168458
17413D00252r8827J18055F53O6662A9998O4019L56424A50352E9497a269C787J42934
$$ 400252 301425 419480 653 67315 19998 84017 440441 150352 59497 -1269 3787 146721
17401A46721a13283D06705b4399A00545J65458G8685l3472j2704J78929h5472
$$ 146721 -113283 406705 -24399 100545 266003 78685 45213 32509 211438 -85472
17390B08041n2326J72405h0683B48078D8177K30067q2138L1848G9725M8087i8360
$$ 208041 155715 328120 -80683 248078 48177 278244 196106 227954 79725 127812 -98360
17378A34784K24370q9138J68821f0348E58652B58251K2590i1865q6911H4660J11141
$$ 134784 359154 270016 438837 -60348 558652 258251 280841 -91865 -178776 84660 195801
17367A95801L11709E9785B4084R8965b21640B86079a17709E4036O7699n0787L14817
$$ 195801 507510 59785 24084 123049 -221640 286079 -117709 54036 121735 70948 385765
17356C85765j28243n8924B9495d9012A18203J41501B1453a0757C16864A35079
$$ 385765 257522 198598 29495 -49012 118203 259704 21453 -10757 316864 135079
17345A29571a44373K4369F50689A65865J9692k4940m6911l2287L3397p315J83447
$$ 129571 -144373 -120004 650689 165865 185557 160617 113706 81419 114816 107501 290948
17334B90948L1631l2698b91032A98978b419B22767E5398J5620J54497I0618L7217
$$ 290948 322579 289881 -291032 198978 -2419 222767 55398 71018 225515 90618 127835
17323A27835Q6298K34835B4590P4414Q5331Q2671a63962B69250h2421A42965C3610
$$ 127835 214133 448968 24590 99004 184335 267006 -163962 269250 -82421 142965 33610
17311A25427n0400L20436g5126B12737K21836A20305N9030K00119m3897B8879
$$ 125427 75027 395463 -75126 212737 434573 120305 179335 379454 335557 28879
17300A12002K49026o3297a49801A05008a2896A95499p3400M6174K97776B09107
$$ 112002 361028 297731 -149801 105008 -12896 195499 122099 168273 466049 209107
17289a6770C10222B7593K01778G7951K07028A10814Q1139b10963A74572G4101
$$ -16770 310222 27593 229371 77951 284979 110814 191953 -210963 174572 74101
17278e1437A31626o4465J02538d2160r004A51864J95260j55672J258C1251a22595
$$ -51437 131626 67161 169699 -42160 -51164 151864 347124 191452 192710 31251 -122595
17266C04260j44396L0911N774A8905J07196A0424K43129J78486Q7773G2013J20614
$$ 304260 159864 190775 196549 18905 126101 10424 253553 432039 519812 72013 192627
17255A92627M84812A30046C8105J95345E6213K8791J7402m2056L5351g0401E7801
$$ 192627 677439 130046 38105 233450 56213 85004 102406 60350 95701 -70401 57801
17243A43095L84682j76353A25659D0555M8767K76896p4473H1366a54017B46040
$$ 143095 527777 351424 125659 40555 89322 366218 291745 81366 -154017 246040
17232B33578N6927j9591J41671C5761J91897J44020r2464j10544a54212C43602
$$ 233578 290505 270914 412585 35761 227658 371678 279214 168670 -154212 343602
17221a38997A84188Q6144j6727O9280k4220I9405M4539K1905m5818N6000R2160
$$ -138997 184188 270332 253605 322885 298665 99405 143944 165849 120031 176031 268191
17210B68191f8445B72642K21393A19400L63728E8443J84909K4760G8851K43268
$$ 268191 -68445 272642 494035 119400 483128 58443 243352 268112 78851 322119
17200C22119I1311i268B39848E1083K51418e073j8559B81527J11901j34478j19606
$$ 322119 91311 -9268 239848 51083 302501 -5073 -23632 281527 393428 258950 139344
17189A39344K97917A15205c3771A0203L56485E0991J94804L37868A61644K23708
$$ 139344 437261 115205 -33771 10203 366688 50991 245795 583663 161644 385352
17179C85352A80980M01294B09599J82855L9107j6448K1068j85614P9210J2947
$$ 385352 180980 582274 209599 392454 431561 415113 436181 250567 329777 342724
17169C42724j00884k8971J67608j63191L15786C4687L98850I6969N0597J15420
$$ 342724 241840 212869 380477 217286 533072 34687 433537 96969 147566 262986
17159B62986m3379J96780k2040l7812j73447D0489L32602j06062R4089j9098K9739
$$ 262986 219607 416387 394347 356535 183088 40489 373091 267029 361118 342020 371759
17148C71759k2705K06508j38740J27044m5893j46952Q3411R7328j36615A05256
$$ 371759 349054 555562 416822 543866 497973 351021 434432 531760 395145 105256
17137D71970o8180L5351L1496B09960a60877E50791B04874K59197A06390L28890
$$ 471970 403790 439141 470637 209960 -160877 550791 204874 464071 106390 435280
17127D35280K72512B02695J01805E8856J00643o5724M07800l9083M1617P065J44867
$$ 435280 707792 202695 304500 58856 159499 93775 501575 462492 504109 511174 656041
17116F56041B69146J33162A39539J41166J4827M7072o0685N57559j15086B89871
$$ 656041 269146 402308 139539 280705 295532 342604 281919 839478 724392 289871
17105E20564j98705J10003k6467J56328j34454K51635k67373A94288J6206M86613
$$ 520564 321859 431862 405395 561723 427269 678904 411531 194288 210494 697107
17095F97107k79180A29233J63646Q6986K25662j67419K3160j91885L50390n7593
$$ 697107 417927 129233 292879 379865 605527 438108 461268 269383 619773 562180
17085E62180k6081k27879r1305L12429k20212J56042L49779l25634k38315L36237
$$ 562180 536099 308220 216915 529344 309132 465174 814953 489319 251004 587241
17075E87241k08052j39314K64398k36364L64823j81909o4345Q2488J06915q2069
$$ 587241 379189 239875 504273 267909 632732 450823 386478 468966 575881 493812
17065D93812m5934m7870K02665o2941K79499P9659D16590J70384q2222m7151J9911
$$ 493812 447878 400008 602673 539732 819231 898890 416590 586974 504752 457601 477512
17054D77512K18337j07397j00087o9948P2599N83680l96105p7408n3242N0830
$$ 477512 695849 588452 488365 418417 491016 1074696 678591 601183 547941 598771
17044E98771j23831o3297n2736O4551J26517K986K78912j77788j51149O1397M69274
$$ 598771 474940 411643 358907 423458 549975 552961 831873 654085 502936 564333 1033607
17033A033607D32624m2768K17593K03540C81178M19712m615k98246j42962M25092
$$ 1033607 432624 389856 607449 810989 381178 800890 796275 498029 355067 780159
17023G80159j5417n3702k121j89317Q8547J83422J19179k92419j25390K27105
$$ 780159 764742 711040 708919 519602 608149 791571 910750 618331 492941 720046
17013G20046k36193m490J05528K46501l8032o513l5087K425o5816K03804o2867
$$ 720046 483853 479363 584891 831392 793360 786847 751760 754185 688369 892173 829306
17002H29306o2249P704L31668J381k29870m8115L87148l57988J04065l94641K77570
$$ 829306 767057 774761 1106429 1107810 877940 829825 1216973 858985 963050 568409 845979
16991H45979Q9727k22954J27295n2754k78230L62383L09357E70443J10870J43962
$$ 845979 935706 712752 840047 787293 509063 871446 1180803 570443 681313 825275
16981H25275K49944k55896K92315j98210j54872M52514k0097k47819Q608j36163
$$ 825275 1075219 819323 1111638 913428 758556 1211070 1190973 943154 951762 815599
16971H15599L90297j71132M8796N8705j53606P3120K48203j80958j54237J28705
$$ 815599 1205896 1034764 1083560 1142265 988659 1061779 1309982 1129024 974787 1103492
16961A103492q5883J02984J68154k57625L12708k15491j57798L22543k93960N77339
$$ 1103492 1017609 1120593 1288747 1031122 1343830 1128339 970541 1293084 999124 1576463
16951A576463k17641j60200j29365P6235L91427j69065j03078J06671K03284l32666
$$ 1576463 1358822 1198622 1069257 1145492 1536919 1367854 1264776 1371447 1574731 1242065
16941A242065n7335L0922L88795m86793J03373K59292k41253L63188k87783k96913
$$ 1242065 1184730 1215652 1604447 1117654 1221027 1480319 1239066 1602254 1314471 1017558
16931A017558N95942l30648N07307m44749K13467N1542L8713K1840J00279k42881
$$ 1017558 1613500 1282852 1790159 1345410 1558877 1610419 1649132 1670972 1771251 1528370
16921A528370K91578l71020p1471j36007L79087L42233k41368L03178l12601q141
$$ 1528370 1819948 1448928 1377457 1241450 1620537 1962770 1721402 2024580 1711979 1703838
16911A703838p6008K44413n6625j29613K09861j34314J30984j47003K06708J06607
$$ 1703838 1627830 1872243 1815618 1686005 1895866 1761552 1892536 1745533 1952241 2058848
16901B058848P1065k89637J52504L18124q4871K16794p40765K69271L35195j12987
$$ 2058848 2129913 1840276 1992780 2310904 2226033 2442827 1702062 1971333 2306528 2193541
16891B193541K78691j91648m4066K9776q8367j02315K47682M7445l6161n9254
$$ 2193541 2472232 2280584 2236518 2266294 2177927 2075612 2323294 2370739 2334578 2275324
16881B275324K81574J08097j25146j73296J63641Q4586j88399L70221j5279j96913
$$ 2275324 2556898 2664995 2539849 2366553 2530194 2614780 2426381 2796602 2781323 2584410
16871B584410L2070L25199j26145k54686O23509o2534M9140j07437j8710K90110
$$ 2584410 2616480 2941679 2815534 2560848 3184357 3121823 3170963 3063526 3044816 3334926
16861C334926l82720K40532j34296R584K68949l5272q5058Q8929K26605j62778
$$ 3334926 2952206 3192738 3058442 3068026 3336975 3301703 3216645 3305574 3532179 3369401
16851C369401q321n5895J8819J40436J43482K22270K49290l39635L82164j26709
$$ 3369401 3361080 3305185 3324004 3464440 3607922 3830192 4079482 3739847 4122011 3995302
16841C995302K34248l52250O16352J25317j05424n70554M55955J86720J26088
$$ 3995302 4229550 3877300 4493652 4618969 4513545 3942991 4398946 4585666 4711754
16832D711754J31206K1984j42199L86072j10460k16406N30072N6436O7360j8755
$$ 4711754 4842960 4864944 4722745 5108817 4998357 4781951 5312023 5368459 5435819 5417064
16822E417064K63473j29037K24090K96478J9965K66717J34519j55657K59230j8464
$$ 5417064 5680537 5551500 5775590 6072068 6092033 6358750 6493269 6337612 6596842 6578378
16812F578378j10595N37046o5475L99625j34408M67029j26134J97319K45025J03610
$$ 6578378 6467783 7004829 6939354 7338979 7204571 7671600 7545466 7742785 7987810 8091420
16802H091420J78933J86096K60033M28914m0695j59069K84620M88245L55530L70011
$$ 8091420 8270353 8456449 8716482 9145396 9104701 8945632 9230252 9718497 10074027 10444038
16792A0444038k87861M87454O50199M15764N6712L77184L99332L32557K71368
$$ 10444038 10156177 10643631 11293830 11709594 11766306 12143490 12542822 12875379 13146747
16783A3146747K78172M01241P01964J65732L87470L93796N36997N50259M44995
$$ 13146747 13424919 13826160 14528124 14693856 15081326 15475122 16012119 16562378 17007373
16774A7007373L93990R82066J98271N19511O16364J173522J11517Q65557M84306
$$ 17007373 17401363 18383429 18581700 19101211 19717575 20891097 21002614 21868171 22352477
16765B2352477J227682Q08506J010623Q13553Q98386J210652R25885J308633J359830
$$ 22352477 23580159 24388665 25399288 26212841 27111227 28321879 29247764 30556397 31916227
16756C1916227J160027J343549J492187J756698J578112J534303J884792K052808
$$ 31916227 33076254 34419803 35911990 37668688 39246800 40781103 42665895 44718703
16748D4718703K231432K254247K216115K606816K666050K852846L096225L580465
$$ 44718703 46950135 49204382 51420497 54027313 56693363 59546209 62642434 66222899
16740F6222899L098574L725564M214923M081567M011246N031648M582409N713669
$$ 66222899 69321473 73047037 77261960 81343527 85354773 90386421 94968830 100682499
16732A00682499N285375N964119O043054O297845O843780O075033O599318O922045
$$ 100682499 105967874 111931993 117975047 124272892 131116672 137191705 143791023 150713068
16724A50713068O317681O670826N622559N387354M655723M068374L396718K013220
$$ 150713068 157030749 163701575 169324134 174711488 179367211 183435585 186832303 188845523
16716A88845523P83455L86422j031498k193499l310056l781356n152097n190906
$$ 188845523 189628978 190015400 188983902 186790403 183480347 179698991 174546894 169355988
16708A69355988n520725o582555o339437p193271o480291o622287o818472o140340
$$ 169355988 163835263 157252708 150913271 143720000 137239709 130617422 123798950 117658610
16700A17658610o115846o080557o044820m963557n175120m828658m685280m139213
$$ 117658610 111542764 105462207 99417387 94453830 89278710 84450052 79764772 75625559
16692G5625559m060795l534042l598730l678420k531975l169115k666323k581433
$$ 75625559 71564764 68030722 64431992 60753572 58221597 55052482 52386159 49804726
16684D9804726k074590k648376k145908j790500j542400k290529j495426j866941
$$ 49804726 47730136 45081760 42935852 41145352 39602952 37312423 35816997 33950056
16676C3950056j188757j268656j462268j432272q95011q14969j253347q89412
$$ 33950056 32761299 31492643 30030375 28598103 27703092 26888123 25634776 24745364
16668B4745364j048685r23102q15390o38493p92418o42012n28024q24413n95425
$$ 24745364 23696679 22773577 21958187 21319694 20527276 19885264 19357240 18532827 17937402
16659A7937402p47167n82109l91594j16863p17051p69666n10510k09826r39511
$$ 17937402 17190235 16608126 16216532 16099669 15382618 14612952 14102442 13892616 12953105
16650A2953105K86715o13419k04500o51690m65722J67719j27944p28929q1480
$$ 12953105 13239820 12626401 12421901 11770211 11304489 11472208 11344264 10615335 10533855
16641A0533855o47730O3683k82808m5974m33947O3044m51686q3161p8966n68781
$$ 10533855 9886125 9949808 9667000 9621026 9187079 9250123 8798437 8715276 8636310 8067529
16631H067529j66563j98431l68478J87168K53533o60022l49050l4868O2866k74303
$$ 8067529 7900966 7702535 7334057 7521225 7774758 7114736 6765686 6730818 6793684 6519381
16621F519381J62237q8724k34388m49070J30246p7204j85029J34659j85589m44429
$$ 6519381 6681618 6592894 6358506 5909436 6039682 5962478 5777449 5912108 5726519 5282090
16611E282090O9032P2815j61536l98729N649J40660l7641n71543O8512o5123O1342
$$ 5282090 5351122 5423937 5262401 4863672 4869321 5009981 4972340 4400797 4469309 4404186 4465528
16600D465528J12856k96927j37502J09039o98j10415k3460m93575j31151J77872
$$ 4465528 4578384 4281457 4143955 4252994 4252296 4141881 4118421 3624846 3493695 3671567
16590C671567l97161M00605l17165L37547l30723L30179q64430N23757l82102
$$ 3671567 3274406 3675011 3357846 3695393 3364670 3694849 2830419 3354176 2972074
16581B972074P7157j9861j38552O3644o5452J72791m86629K67119k65684j24871
$$ 2972074 3049231 3029370 2890818 2954462 2889010 3061801 2575172 2842291 2576607 2451736
16571B451736L33451k09129l82352M76550k79274K08528J28956m72673j60145
$$ 2451736 2785187 2576058 2193706 2670256 2390982 2599510 2728466 2255793 2095648
16562B095648J14170L7000k11565J94119J52187m31503L47639Q619l53524o2497
$$ 2095648 2209818 2246818 2035253 2229372 2381559 1950056 2297695 2306314 1952790 1890293
16552A890293M56559m04116K27745k42963N9738n91946O09249m04446k8874Q1990
$$ 1890293 2346852 1942736 2170481 1927518 1987256 1395310 2004559 1600113 1571239 1653229
16542A653229K06401P9163p48035O50540L43324o04485L05941n99480N61940j61222
$$ 1653229 1859630 1938793 1190758 1841298 2184622 1580137 1886078 1286598 1848538 1687316
16532A687316k20067r620J71917q6312k8172J57880k29781J58034l40192L41979
$$ 1687316 1467249 1457629 1629546 1543234 1515062 1672942 1443161 1601195 1261003 1602982
16522A602982j5888q6217K7046m80865M34386j79527j86691K3806J40461M1333
$$ 1602982 1587094 1500877 1527923 1047058 1481444 1301917 1115226 1139032 1279493 1320826
16512A320826k99146K24353j9926l3104l7318K50277j35971R5480l32896k46190
$$ 1320826 1021680 1246033 1226107 1193003 1155685 1405962 1269991 1365471 1032575 786385
16502G86385M04705K1970j94554J68150j1923R4102l93085L71793m6681J13690
$$ 786385 1191090 1213060 1018506 1186656 1174733 1268835 875750 1247543 1200862 1314552
16492A314552k98727j05498P0765K80229n32362J59430L09296m58310K73309k76596
$$ 1314552 1015825 910327 981092 1261321 728959 888389 1197685 739375 1012684 736088
16482G36088L47512l77987J72745l2378l94629K43204J62560j30525L25463k90611
$$ 736088 1083600 705613 878358 845980 451351 694555 857115 726590 1052053 761442
16472G61442j51476o5858L23373P8517k16005j28052N1021N49276l38457J59634
$$ 761442 609966 544108 867481 945998 729993 601941 652962 1202238 863781 1023415
16462A023415l45112B39532M43073K6840r7268J94637J61672k54888L82636l43436
$$ 1023415 678303 239532 682605 709445 612177 806814 968486 713598 1096234 752798
16452G52798n0417q0511J84277j56887Q1303o816A96355R1079L84047k38359J13219
$$ 752798 702381 621870 806147 649260 730563 723747 196355 287434 671481 433122 546341
16441E46341J68483k23323K81421M5330C96615J80416J25180r6j84346L73733
$$ 546341 714824 491501 772922 818252 396615 577031 702211 702115 517769 891502
16431H91502m06675K25966j74311J11960Q4819n0272r8393j97827J29174J8598
$$ 891502 484827 710793 536482 648442 733261 682989 584596 386769 515943 534541
16421E34541J46968l00831A17322K79982K74996K5817k16701j71586J07387K6404
$$ 534541 681509 380678 117322 397304 672300 698117 481416 309830 417217 443621
16411D43621q7546J74774B61387K15827m4027j38518K12766j69858M3833r8919
$$ 443621 356075 530849 261387 477214 433187 294669 507435 337577 381410 282491
16401B82491r5976L06260k21233J0391p7458L53620B01418J06789K53946k561
$$ 282491 186515 492775 271542 281933 204475 558095 201418 308207 562153 559592
16391E59592B69563K81607A57812L59968B27190m2228J80554l972J87919k28272
$$ 559592 269563 551170 157812 517780 227190 184962 365516 361544 549463 321191
16381C21191A41400J13802J39597L29067C15421K64736B13861M8509o4922R6717
$$ 321191 141400 255202 394799 723866 315421 580157 213861 262370 197448 294165
16371B94165L6303R2547n4128q0997K81268j476j56541i3182A95314J39565N7552
$$ 294165 330468 423015 368887 287890 569158 567682 411141 -93182 195314 334879 392431
16360C92431M1140l6173C6989K90028k3418A39611M63783a06600A13366L20414
$$ 392431 433571 397398 36989 327017 303599 139611 603394 -106600 113366 433780
16350D33780N5617F6403K13993M07873B21742r9541Q5517a5800A96569m7670m4263
$$ 433780 489397 66403 280396 688269 221742 122201 207718 -15800 196569 148899 104636
16339A04636L24388j97487G8000Q4131P4691J73990j06282A7294O1325L6470K50341
$$ 104636 429024 231537 78000 162131 236822 410812 304530 17294 78619 115089 365430
16328C65430A57683E0407J27730A8826J00306K75446A29483J45620j23731G1120
$$ 365430 157683 50407 178137 18826 119132 394578 129483 275103 151372 71120
16317C63012K6058j17463N1786j13682r6445g5918A51127J64115Q0908r6703E5727
$$ 363012 389070 271607 323393 209711 113266 -75918 151127 315242 396150 299447 55727
16305B84115C1230M2000J74747J25578j35432B0781B827O7211A6518K22413H7950
$$ 284115 31230 73230 247977 373555 238123 20781 2827 70038 16518 238931 87950
16293G5556d0534B77521a23376A29991P1228d2497k7435G0934a8731G6695K189
$$ 75556 -40534 277521 -123376 129991 201219 -42497 -69932 70934 -18731 76695 78884
16282G8884J96331j06518J37035J24060A63417o0772J14631G0830N53947H4168
$$ 78884 275215 168697 305732 429792 163417 102645 217276 70830 624777 84168
16271C24426A43293P5059A5181O8993A2260M4041L69313A38847A8644a7373A35752
$$ 324426 143293 218352 15181 84174 12260 56301 425614 138847 18644 -17373 135752
16259B40667g5525B20169N7243m0410M6714J29306A12199J03193a87783F8604
$$ 240667 -75525 220169 277412 237002 283716 413022 112199 215392 -187783 68604
16248a3647Q59C3917f2029D22650c7878A08635K71241A59611a42848A79146i5186
$$ -13647 -12788 33917 -62029 422650 -37878 108635 379876 159611 -142848 179146 -95186
16236B10276e9082F7606J53927m3721h5450a6953A25225J45402b04543e3997A66061
$$ 210276 -59082 67606 221533 177812 -85450 -16953 125225 270627 -204543 -53997 166061
16224B40817d3809A14073l6021K61929A69214a03605l9494F7711a17065B19114
$$ 240817 -43809 114073 78052 339981 169214 -103605 -143099 67711 -117065 219114
16213A18317L38758A22373J43036h3042E9882k601J60305C0210J67170l0786m6807
$$ 118317 457075 122373 265409 -83042 59882 57281 217586 30210 197380 166594 119787
16202A19787p625J21578d001l4432G8851J98260b13034j91682D3755a07620B46217
$$ 119787 112162 233740 -4001 -38433 78851 277111 -213034 -404716 43755 -107620 246217
16190c8774m9612b8941J2057B34850I5446h8544A82766h7382C8093b71864C6830
$$ -38774 -88386 -28941 -16884 234850 95446 -88544 182766 -87382 38093 -271864 36830
16178H5139L1686A3622K86766H688L56096B99P6690i6549B9953b34806B48479
$$ 85139 116825 13622 300388 8688 364784 299 76989 -96549 29953 -234806 248479
16166B59796k3499J9580D8565J7919n84K9470J35840o5127m8050a07356C9181
$$ 259796 236297 255877 48565 66484 65900 95370 231210 166083 118033 -107356 39181
16154A4373a44576A25681e9954j50492C6666a80803f9344D6924K92199a62302
$$ 14373 -144576 125681 -59954 -210446 36666 -180803 -69344 46924 339123 -162302
16143d4354B20113I0002l2914K2642A7888J48068K05874a66631N5727B34167c53432
$$ -44354 220113 90002 57088 79730 17888 165956 371830 -166631 -110904 234167 -353432
16131I5317a0760k0253i693B9258j006J48138F0441L2742O5718a61599D71641
$$ 95317 -10760 -31013 -9693 29258 28252 176390 60441 93183 158901 -161599 471641
16119g8864k59538h1453Q129B2069g9366D21269j45210m3497a8795B78171k4768
$$ -78864 -338402 -81453 -73324 22069 -79366 421269 276059 232562 -18795 278171 253403
16108B53403a8097k4615B4008R3440g8613j77127J19072c8728a1307C22135F5956
$$ 253403 -18097 -42712 24008 117448 -78613 -255740 -136668 -38728 -11307 322135 65956
16096B75051j18525b16615Q2165j67243e9970B4741a2243l66613A58835K80149
$$ 275051 156526 -216615 -134450 -301693 -59970 24741 -12243 -378856 158835 438984
16086D38984A63212a32864B5738b45818e0913D5397b13653j47867A45741d0287
$$ 438984 163212 -132864 25738 -245818 -50913 45397 -213653 -361520 145741 -40287
16075a3819k83775a02889L5617E9389K18297p156g7494j03668j88929l0907J78593
$$ -13819 -297594 -102889 -67272 59389 277686 270530 -77494 -181162 -370091 -400998 -222405
16064b22405D0265c36953Q5073a17195j53976C05592a94824O9221k09399A79402
$$ -222405 40265 -336953 -251880 -117195 -271171 305592 -194824 -125603 -335002 179402
16053a84888A3064N5739a7849j52953m0953d3125C4948A138a36533B50522l9020
$$ -184888 13064 68803 -17849 -170802 -211755 -43125 34948 1138 -136533 250522 211502
16042B11502g702o1759A41161e5171A47653g4070j68213f5438A78309d73478G0152
$$ 211502 -7702 -69461 141161 -55171 147653 -74070 -242283 -65438 178309 -473478 70152
16030i7813A70140a23195B29b92994B8780J35727a01472B0175a22507e7866D094
$$ -97813 170140 -123195 229 -292994 28780 164507 -101472 20175 -122507 -57866 4094
16018f1506j3398C37483D4490L5361a80217N4468c3820j07286C27613b09271J02787
$$ -61506 -74904 337483 44490 79851 -180217 -125749 -33820 -141106 327613 -209271 -106484
16007a06484B16683G9770J64370g8651B16683A00117d21995a54136J8538K181
$$ -106484 216683 79770 244140 -78651 216683 100117 -421995 -154136 -135598 -133417
15997a33417c5694C9558R102a74008H5566A7158J0225J08833O1917O6938F7663
$$ -133417 -35694 39558 48660 -174008 85566 17158 27383 136216 198133 265071 67663
15985D881h3499k4164C1477J97952K98702B61049b5383j43161H7081b17908A16237
$$ 4881 -83499 -107663 31477 229429 528131 261049 -25383 -168544 87081 -217908 116237
15973a33019q3284l9436H9451H854i0571q7696g6321l6801e245j19985j56762
$$ -133019 -216303 -255739 89451 8854 -90571 -178267 -76321 -113122 -5245 -125230 -281992
15962b81992Q2434C42613a16940C2221a20464c0230j54670i1105E9925a10932
$$ -281992 -199558 342613 -116940 32221 -120464 -30230 -184900 -91105 59925 -110932
15951A3533N5533h284B28029h5351D13472F0454b06232F9684P4047a83651h5237
$$ 13533 69066 -8284 228029 -85351 413472 60454 -206232 69684 143731 -183651 -85237
15939I7681i5146q5078A53312J3823b70007E7831J38100a39488j09322C65495
$$ 97681 -95146 -180224 153312 167135 -270007 57831 195931 -139488 -248810 365495
15928a9688A65193a44978H856J05097c07141N9425c1102p8322A47015e4658I300
$$ -19688 165193 -144978 8856 113953 -307141 -247716 -31102 -109424 147015 -54658 9300
15916C6442a23446P009J7940r0472d7809l176B8611c71966B9491d65813D1143
$$ 36442 -123446 -116437 -98497 -188969 -47809 -50985 28611 -371966 29491 -465813 41143
15904d2125k61949d5544B68835M6806H8976a88439l7001d5558A143c7517F0383
$$ -42125 -304074 -45544 268835 315641 88976 -188439 -225440 -45558 1143 -37517 60383
15892g7821k66238a28101B22192J2080b34900A16133E2943L759c6064l5629A16863
$$ -77821 -344059 -128101 222192 234272 -234900 116133 52943 56702 -36064 -71693 116863
15880b36775F5532C859b90904A2527a49388r2323h3763j5898A51390f4927K8029
$$ -236775 65532 3859 -290904 12527 -149388 -241711 -83763 -99661 151390 -64927 -36898
15869c6898q3186C66919a8181C30589a06271m2971L0139G4240b80374b278j27042
$$ -36898 -120084 366919 -18181 330589 -106271 -149242 -119103 74240 -280374 -2278 -129320
15858a29320A04210b73997c2165C9456J45634D5828N2758a65888e2937I0953k4828
$$ -129320 104210 -273997 -32165 39456 185090 45828 98586 -165888 -52937 90953 66125
15847F6125N0281h895j37486e4277l62652i9875j8630r7284G5005a35136C28231
$$ 66125 116406 -8895 -146381 -54277 -416929 -99875 -118505 -215789 75005 -135136 328231
15835B14561I1199i4626c6671n1777j27361C6615a54200B7469L20963b95521R0054
$$ 214561 91199 -94626 -36671 -88448 -215809 36615 -154200 27469 348432 -295521 -205467
15824b05467k04805J39299c3450j19423M498k1517b1650j996l80575a70753k1071
$$ -205467 -410272 -270973 -33450 -152873 -148375 -169892 -21650 -23646 -404221 -170753 -191824
15813a91824P4888J1668F7988e0501A03482B610d03482a64199b2694C4481a50230
$$ -191824 -116936 -105268 67988 -50501 103482 2610 -403482 -164199 -22694 34481 -150230
15801A57873c06516i0726C53521a15138r6489A06883P9627c7328j4698A06524
$$ 157873 -306516 -90726 353521 -115138 -211627 106883 186510 -37328 -52026 106524
15790b68375j5652e3882l7849I4577c11927A77551C0977J98740c19193f2271k183
$$ -268375 -284027 -53882 -91731 94577 -311927 177551 30977 229717 -319193 -62271 -64454
15779f4454j02026q0275d7404B30985c1750k52002C755a24839B06676a92716A30697
$$ -64454 -166480 -246755 -47404 230985 -31750 -283752 3755 -124839 206676 -192716 130697
15767B1769e3115a6909k46530A87181n6508d45224A80441a21475H2277K66145
$$ 21769 -53115 -16909 -263439 187181 130673 -445224 180441 -121475 82277 348422
15757C48422a20355B71O40948A90497q9136c74066M8280J51968B82119D6514L2177
$$ 348422 -120355 271 641219 190497 101361 -374066 -325786 -173818 282119 46514 78691
15746G8691K7350c3527E9853K6736L5477c7865m1108a9839o9485C14261E3048
$$ 78691 106041 -33527 59853 86589 122066 -37865 -78973 -19839 -89324 314261 53048
15734E7897b36823D1470K74813c8846k8203K6930j88963q43E4525d6813C20058
$$ 57897 -236823 41470 316283 -38846 -67049 -40119 -229082 -229925 54525 -46813 320058
15722f2175k16150h3288j97855A98091b16342J01968l2473c1203j1014J7691B22177
$$ -62175 -278325 -83288 -281143 198091 -216342 -114374 -146847 -31203 -42217 -24526 222177
15710C13441a28048j5586P0763n8096d7356C8829b58032P2787F8562K33228j31306
$$ 313441 -128048 -143634 -72871 -130967 -47356 38829 -258032 -185245 68562 301790 170484
15699A70484A5431f1654j93814D6699d51811C78776a14898I9887L0943K91696
$$ 170484 15431 -61654 -255468 46699 -451811 378776 -114898 99887 130830 422526
15689D22526C0484d14393a72702k3118d9357J3218j07898a341o5035B52233a26161
$$ 422526 30484 -414393 -172702 -195820 -49357 -36139 -144037 -1341 -66376 252233 -126161
15677B14533F0551R7412j8307i2476b5087k3667o5054A75128g4340H986a37378
$$ 214533 60551 157963 139656 -92476 -25087 -48754 -113808 175128 -74340 8986 -137378
15665A07181C2732a73054D387K9827c30766c5739k0819B87595a46n7410k72792
$$ 107181 32732 -173054 4387 34214 -330766 -35739 -56558 287595 -146 -57556 -330348
15654c30348a24684j17242m4908B1325a30936e5568C34829d5657A20726O1196
$$ -330348 -124684 -241926 -286834 21325 -130936 -55568 334829 -45657 120726 181922
15644A81922r174a45567D45385F5107K59370b53171J00533A63746g9637p8391
$$ 181922 172748 -145567 445385 65107 324477 -253171 -152638 163746 -79637 -158028
15634a58028A05680d8142B40357A3534L79217b302n2607j41152B53982c1855A781
$$ -158028 105680 -48142 240357 13534 392751 -2302 -54909 -196061 253982 -31855 1781
15622B11039f0586l10511c8263A48689d4611B1083J31070b5064Q984k279n2907
$$ 211039 -60586 -371097 -38263 148689 -44611 21083 152153 -25064 -16080 -18359 -71266
15611g1266A29075a08899A53938b3886A29133B1608d73880K12989j01453h3748
$$ -71266 129075 -108899 153938 -23886 129133 21608 -473880 -260891 -362344 -83748
15600b74566C9912f2137G6963K21707a68743q8658i1042j12095A57516a73074
$$ -274566 39912 -62137 76963 298670 -168743 -257401 -91042 -203137 157516 -173074
15589B9019O1808e5405D5003N469a24702A47746d23694a31626p1746b5640k05843
$$ 29019 90827 -55405 45003 50472 -124702 147746 -423694 -131626 -203372 -25640 -231483
15578b31483K4215I9255a7419q6818L2208D1886N2713c3449l7824j47346r5888
$$ -231483 -207268 99255 -17419 -104237 -72029 41886 94599 -33449 -71273 -218619 -314507
15567c14507A15437L4690b60934a28179e2535P602p9815B5636c79614a31559F6115
$$ -314507 115437 150127 -260934 -128179 -52535 -44933 -124748 25636 -379614 -131559 66115
15555a05120A54449e0438j78447A15761B8116J73038a32072R216e6435B75889
$$ -105120 154449 -50438 -228885 115761 28116 201154 -132072 -122856 -56435 275889
15544a79249J0261A67281b62990A90173a34514N6625j16594A11444b41423I406
$$ -179249 -168988 167281 -262990 190173 -134514 -77889 -194483 111444 -241423 9406
15533A91730b45901M3039c9829j17181j2838E1316O6979c53878J61877q5321A5834
$$ 191730 -245901 -202862 -39829 -157010 -169848 51316 118295 -353878 -192001 -277322 15834
15521A72684A7828e1784A31841L3274c3449k26880B39920j6108A05696D6299N9676
$$ 172684 17828 -51784 131841 165115 -33449 -260329 239920 223812 105696 46299 105975
15510A05975a2165C2097e3224B69525c16053a15771E5513a33140D0881d1259E431
$$ 105975 -12165 32097 -53224 269525 -316053 -115771 55513 -133140 40881 -41259 5431
15498B4320L7963b91521i2866j0338j30524k21711B17604h4292B03970R7810a96000
$$ 24320 62283 -291521 -92866 -103204 -233728 -455439 217604 -84292 203970 301780 -196000
15486A95656b1907k44873I3341K5605a63636A63286B5271E54M6621K42687d1120
$$ 195656 -21907 -266780 93341 118946 -163636 163286 25271 554 47175 289862 -41120
15474i4356j11710L0352p160C6249M4930M6870P9992I1023K31746B2182a40455
$$ -94356 -206066 -175714 -182874 36249 81179 128049 208041 91023 322769 22182 -140455
15462h8671M0897C08793C0075J15308b20970D24221D5641N2173f156A3216J40090
$$ -88671 -47774 308793 30075 145383 -220970 424221 45641 97814 -6156 13216 153306
15451A53306a45046M221I3723K08647a3530M931B57488d93350A0538b4367j6437
$$ 153306 -145046 -140825 93723 302370 -13530 -8599 257488 -493350 10538 -24367 -40804
15440d0804B79323m7903a07574c7654K741A37779a94347A28059e0437C7878R8204
$$ -40804 279323 231420 -107574 -37654 -34913 137779 -194347 128059 -50437 37878 136082
15429A36082a9522n5920o7049A8544a02970c4241l0343q4637F237a96403Q1563
$$ 136082 -19522 -75442 -142491 18544 -102970 -34241 -64584 -149221 6237 -196403 -114840
15418a14840A37449E8552A4746J7196f5819E5501a90069P5584a9644A72763H4876
$$ -114840 137449 58552 14746 31942 -65819 55501 -190069 -114485 -19644 172763 84876
15406B04716r6635d1106j18942C08522d7631b1688l30426B45691b11899C43688
$$ 204716 108081 -41106 -160048 308522 -47631 -21688 -352114 245691 -211899 343688
15395B54308K6092a59731a7335k62394I5102R3590b12477R8969l1002A02142c781
$$ 254308 280400 -159731 -17335 -279729 95102 188692 -212477 -113508 -144510 102142 -3781
15383a6641I6657e6320A07910D7162b66617a23503B79279o0555e7993B29992a06268
$$ -16641 96657 -56320 107910 47162 -266617 -123503 279279 218724 -57993 229992 -106268
15371d33000b8290k6600k9710A26117b25673a10949E6182J09835M4871C9004d0036
$$ -433000 -28290 -54890 -84600 126117 -225673 -110949 56182 166017 210888 39004 -40036
15359A44565E4715N488g3912A8978J71866b8795C4655a15678p9750L4988I6691
$$ 144565 54715 60203 -73912 18978 190844 -28795 34655 -115678 -195428 -160440 96691
15347B9496K27214j21968m7163a14085C38809C0921M19910A80005b10162D8245
$$ 29496 256710 134742 87579 -114085 338809 30921 450831 180005 -210162 48245
15336A9512Q8710E4098K28598a2628k66833A06705k3621k7405a07836N579A82151
$$ 19512 108222 54098 282696 -12628 -279461 106705 83084 55679 -107836 -102257 182151
15324C30448A04477m6932J37856b74102A94742a43690c9155k90173A38967F2015
$$ 330448 104477 57545 195401 -274102 194742 -143690 -39155 -329328 138967 62015
15313b02791I3420b88969J32374A12162j3330d29173a48507A26008J8068h3362
$$ -202791 93420 -288969 -156595 112162 98832 -429173 -148507 126008 144076 -83362
15302c29930B52746a40304J9398F4081O8802k9583a98427H5702B3837L03808j04474
$$ -329930 252746 -140304 -120906 64081 132883 103300 -198427 85702 23837 327645 223171
15291B23171j08023e0677j24624Q2725B19822C1372K51462C5100K6659a57780
$$ 223171 115148 -50677 -175301 -92576 219822 31372 282834 35100 61759 -157780
15280I0366a92505A44232o6556a24185J6490a8725A05149J51481K2412C3744A0633
$$ 90366 -192505 144232 77676 -124185 -107695 -18725 105149 256630 279042 33744 10633
15268A04121J35512c922n591F1147k0364K98149A37640L3009L5421j8043b1298
$$ 104121 239633 -3922 -9513 61147 40783 338932 137640 170649 206070 188027 -21298
15256B4219l37J267J50863i4570A1881M40739n6042K22329R00253n36959K51127
$$ 24219 23882 25149 176012 -94570 11881 452620 396578 618907 1519160 982201 1233328
15245A233328J82228p00140l48440H9223C3884K3900d3931C50313H2565a44052
$$ 1233328 1415556 715416 366976 89223 33884 57784 -43931 350313 82565 -144052
15234b5806j8825j00382C6941a19699q9446j81464a7800f421A99585q4880b6356
$$ -25806 -44631 -145013 36941 -119699 -209145 -390609 -17800 -6421 199585 114705 -26356
15222A42736m062b4829B82385A03621J92402j11802k914n7043E5133a95961A83859
$$ 142736 138674 -24829 282385 103621 296023 184221 181307 124264 55133 -195961 183859
15210D8829O1386K1460e4305l8487l33896A99425n6571E2172b7096C12165n3038
$$ 48829 110215 131675 -54305 -92792 -426688 199425 142854 52172 -27096 312165 259127
15199B59127F8367b7351F8981A4994J26306e4944k67408A35932k1698G559b48908
$$ 259127 68367 -27351 68981 14994 141300 -54944 -322352 135932 114234 7559 -248908
15187b1537j77670A60661E0285j7667a56442A32440C0722J61828Q9865a73102
$$ -21537 -199207 160661 50285 32618 -156442 132440 30722 192550 282415 -173102
15176C8492e284H9655j031l0535g6613A33715e42A81953J42069c91520C0882a789
$$ 38492 -5284 89655 88624 58089 -76613 133715 -542 181953 324022 -391520 30882 -1789
15163a0824j56219B86801B4750J45250a40204O6346j65656I2532a5187A16306
$$ -10824 -167043 286801 24750 170000 -140204 -73858 -239514 92532 -15187 116306
15152E04595H0572K33363G9326P2840j6654b7010E0649A8411a0689j20019j1654
$$ 504595 80572 313935 79326 152166 135512 -27010 50649 18411 -10689 -130708 -142362
15141a42362D26491a10031B26021b80872A33301f4184A46979d1673a5861H0372
$$ -142362 426491 -110031 226021 -280872 133301 -64184 146979 -41673 -15861 80372
15130a48908O7811D9072M90592A88060a18394C3721J74390j03218K98597e6278
$$ -148908 -81097 49072 539664 188060 -118394 33721 208111 104893 403490 -56278
15119D4548J65462P3639k5086j12027K91113h8151A113K60345d083A79720c4041
$$ 44548 210010 283649 258563 146536 437649 -88151 1113 261458 -4083 179720 -34041
15107a78474B98923A23654b44690I1755f7951B30613A978J0150K16804o2201K9596
$$ -178474 298923 123654 -244690 91755 -67951 230613 1978 12128 228932 166731 196327
15096A96327J59679A47980N278k1745b27295C29298a98965D79723j22872K4689
$$ 196327 356006 147980 153258 131513 -227295 329298 -198965 479723 356851 381540
15086C81540c5472B04730a60621D553J16308J24374c2320l9057D6808N2480e200
$$ 381540 -35472 204730 -160621 4553 120861 245235 -32320 -71377 46808 99288 -5200
15074A49854a74733E5201P3384B0510L58449H9732a42085J4170a2478a809A38769
$$ 149854 -174733 55201 128585 20510 378959 89732 -142085 -127915 -12478 -1809 138769
15062A16277N8909h3122A7788Q377K25490q2513a06905A0122L94889f6795A31790
$$ 116277 175186 -83122 17788 26165 251655 169142 -106905 10122 405011 -66795 131790
15050A67713K8188K9419P5796C746K69807C8743f5014B51149j00535A5821K93056
$$ 167713 195901 225320 301116 3746 273553 38743 -65014 251149 150614 15821 308877
15039C08877j37245K4466K75288a9925p202C18484a25100C15523j15242j0356
$$ 308877 171632 196098 471386 -19925 -27127 318484 -125100 315523 200281 189925
15029A89925o6049P52153B11065o9726L43716j76158h6362B69094j24737Q0833
$$ 189925 123876 876029 211065 141339 485055 308897 -86362 269094 144357 225190
15019B25190j3727C726K11638m5098J07944H9848J74653j4507c8376A77609H1101
$$ 225190 211463 3726 215364 170266 278210 89848 264501 249994 -38376 177609 81101
15007C59120G8630L3614R2217m0147b89266B24513e4895B04403J00516j48332
$$ 359120 78630 112244 204461 164314 -289266 224513 -54895 204403 304919 156587
14997A56587K22014B7173J64341J01261a81284A16324J7030J55302q7378a60319
$$ 156587 378601 27173 191514 292775 -181284 116324 133354 288656 201278 -160319
14986B47211J3195A0566b68718A80582e8476G29606B72074N3031A08096R115N4458
$$ 247211 260406 10566 -268718 180582 -58476 729606 272074 325105 108096 117211 171669
14975A71669r241M0292O5741p7069C4248M03081j66947q5675J91444l5531b4106
$$ 171669 162428 202720 268461 191392 34248 437329 270382 184707 376151 340620 -24106
14963i8189E0239e1584B48653m0486f746D11924j00325l8291A02086Q5389p9186
$$ -98189 50239 -51584 248653 208167 -6746 411924 311599 273308 102086 187475 108289
14952A08289J6878J32239L15326A22530l0925K50204K98776j83941a57962D99185
$$ 108289 125167 257406 572732 122530 91605 341809 640585 456644 -157962 499185
14941C61577J2029j49423J30629l9096r9129j8138K01636j21974c1530D41331
$$ 361577 373606 224183 354812 315716 216587 198449 400085 278111 -31530 441331
14930d7186E64210A86861K05510a08347C84241j89173l9774J74387K19767k61519
$$ -47186 564210 186861 392371 -108347 384241 195068 155294 329681 549448 287929
14920B87929J74682j27375O9815j73072B7995L48552P5169L387B26199n9368K81671
$$ 287929 462611 335236 405051 231979 27995 376547 451716 455103 226199 166831 448502
14909D48502J140K46395A85008K68090k13673M06421k57871j41964L07852n9644
$$ 448502 449642 696037 185008 453098 239425 645846 387975 246011 553863 494219
14899D94219B10366O2896m0458D6995K76183P9551D7284L71028j9594j72228M87748
$$ 494219 210366 273262 232804 46995 323178 402729 47284 418312 398718 226490 714238
14888G14238l22395k1035j12727K14546A72318L74285N4293k27753A65999K30540
$$ 714238 391843 370808 258081 472627 172318 546603 600896 373143 165999 396539
14878C96539j73200K35887E4297J14574J22171K47562J18825k73039l0799A05620
$$ 396539 223339 459226 54297 168871 291042 538604 657429 384390 353591 105620
14867E53627k49500N4716k9119p0454j6231K10106A02229J15176l6503L09745
$$ 553627 304127 358843 329724 259270 243039 453145 102229 217405 180902 490647
14857D90647Q2792B20640n6163J66338M70777A78794N3051K74501A90509L6181
$$ 490647 573439 220640 164477 330815 801592 178794 231845 506346 190509 226690
14847B26690l7239K46170O6681k43495K73120k29156K04199k50853j00255L98056
$$ 226690 189451 435621 502302 258807 531927 302771 506970 256117 155862 553918
14837E53918k65661K39675O6452B90857O5285P4707J8420H3325K71595J90111
$$ 553918 288257 527932 594384 290857 356142 430849 449269 83325 354920 545031
14827E45031j48288G0536K60341L2433K01733j66344p8707J67756j47126J46184
$$ 545031 396743 70536 330877 363310 565043 398699 319992 487748 340622 486806
14817D86806b9053B07936K55020K24941k91317j80870K28043l0056J90997K36876
$$ 486806 -29053 207936 462956 687897 396580 215710 443753 413697 604694 841570
14807H41570C55877J18714B5584N82244j56190m9633K53094k2695j98201Q255
$$ 841570 355877 474591 25584 607828 451638 402005 655099 632404 434203 442458
14797D42458A61092N93105B82393K87100k9937q296M3132M6485J31499C55167
$$ 442458 161092 754197 282393 569493 539556 531260 574392 620877 752376 355167
14786E68505n4001j09035M29869l86061j73080L64504n5958M0358o6782M83358
$$ 568505 514504 405469 835338 449277 276197 640701 584743 625101 558319 1041677
14776A041677C94774Q4305J1250Q0736J15789j21267K8960J19051j43290J23579
$$ 1041677 394774 479079 490329 571065 686854 565587 594547 713598 570308 693887
14766F93887j70219K27173j13062n8301j98340j9909L69700j41496j6233L5077
$$ 693887 523668 750841 637779 579478 381138 361229 730929 589433 573200 608277
14756F08277J74246q2799j66615J20095m9465J09397K76443k44307J05249j24793
$$ 608277 782523 699724 533109 653204 603739 713136 989579 745272 850521 725728
14746G25728B50975M88759n1703j64844N72046l15934L6040j45248J15014j27913
$$ 725728 250975 739734 688031 523187 1095233 779299 815339 670091 785105 657192
14736F57192O1776j71303L34150Q6927k50092K14871k32634L95638n03174N03584
$$ 657192 718968 547665 881815 968742 718650 933521 700887 1096525 593351 1096935
14726A096935n01227K9557J44364J46186o6948j91403N9555m7706K32154J96277
$$ 1096935 595708 625265 769629 915815 848867 657464 717019 669313 901467 1097744
14716A097744j20116r2853J35076r0349k08751K56165k36730J97009K81682m08335
$$ 1097744 977628 884775 1019851 929502 720751 976916 740186 937195 1218877 810542
14706H10542L8457o7597J4279K06039j8976l58378N91886E74099L72852M55169
$$ 810542 848999 781402 795681 1001720 982744 624366 1216252 574099 946951 1402120
14696A402120n52026o9307K37861l5387j12008k40224J68527J19972j03476M64660
$$ 1402120 850094 780787 1018648 983261 871253 631029 799556 919528 816052 1280712
14686A280712J14154l59269J64404l48038j52912N83533l95261J6456k14653M38308
$$ 1280712 1394866 1035597 1200001 851963 699051 1282584 887323 903779 689126 1127434
14676A127434j17509j937k2409M2908q1572J69889l1600k73065J81135J26451
$$ 1127434 1009925 1007988 985579 1028487 946915 1116804 1085204 812139 993274 1119725
14666A119725k0092J17363k23069J23644j45794M2733j64370M82150j10762k7204
$$ 1119725 1099633 1216996 993927 1117571 971777 1014510 850140 1332290 1221528 1194324
14656A194324J25179k02301j74029J53550Q9940q0501J95874l70631L89194m82352
$$ 1194324 1319503 1117202 943173 1096723 1186663 1106162 1302036 931405 1320599 838247
14646H38247N34074j36118L777M4611J24424j52981L48642l21450J48362j93029
$$ 838247 1372321 1236203 1239980 1284591 1409015 1256034 1604676 1283226 1431588 1238559
14636A238559J21917K3003M1577K82l16513M34482k37986n6045m6343R7195M0116
$$ 1238559 1360476 1383479 1425056 1425338 1108825 1543307 1305321 1249276 1202933 1300128 1340244
14625A340244k8707K60940j13406n3546J11007l6430L02779j34161k09029r6110
$$ 1340244 1311537 1572477 1459071 1405525 1516532 1480102 1782881 1648720 1439691 1343581
14615A343581J8038j03048O1042L30756j1379k36672K01508l5024N5792J09976
$$ 1343581 1361619 1258571 1319613 1650369 1638990 1402318 1603826 1568802 1624594 1734570
14605A734570Q6759k56857l11502L56560K72630j38741j09417L72104m96504P76020
$$ 1734570 1821329 1564472 1252970 1609530 1882160 1743419 1634002 2006106 1509602 2285622
14595B285622p10330M22322J05881k91046J09547o5684R0340l11470K35987N973
$$ 2285622 1575292 1997614 2103495 1812449 1921996 1856312 1946652 1635182 1871169 1877142
14585A877142J73111L6063j53180J5610o5404J76284R2186K07752m59515K76105
$$ 1877142 2050253 2086316 1933136 1948746 1883342 2059626 2151812 2359564 1900049 2176154
14575B176154J87638P3353O2713l35404k06830K14577L8231K17186m6252M07352
$$ 2176154 2363792 2437145 2499858 2164454 1957624 2172201 2210432 2427618 2381366 2788718
14565B788718m13692J5197J00896L7705J89900k48850J56938M44761O0430k37072
$$ 2788718 2375026 2390223 2491119 2528824 2718724 2469874 2626812 3071573 3132003 2894931
14555B894931M61265L00795M89363n4885P44003O66303J594114M247772J0277324
$$ 2894931 3356196 3656991 4146354 4091469 4835472 5501775 7095889 11343661 21620985
14546B1620985K0874144O568005k3714502I942755D687258j293129r68057l72495
$$ 21620985 42495129 49063134 25348632 9942755 4687258 3394129 2426072 2053577
14538B053577L9071l62142L66875l11280M90129r5903l23170K36097J33440l7526
$$ 2053577 2092648 1730506 2097381 1786101 2276230 2180327 1857157 2093254 2226694 2189168
14528B189168J46741K23587k81741N0965M80276k74046o8792o8953L90333o000
$$ 2189168 2335909 2559496 2277755 2328720 2808996 2534950 2466158 2397205 2787538 2781538
14518B781538l4543l06054L08098J70546n72232N25306j2235k09151L05489J08934
$$ 2781538 2746995 2440941 2749039 2919585 2347353 2872659 2860424 2651273 2956762 3065696
14508C065696K37651j78540j42530K43229j05211K4630J73605k02222J88955K8362
$$ 3065696 3303347 3124807 2982277 3225506 3120295 3144925 3318530 3116308 3305263 3333625
14498C333625j10646J91688j56203J05865K52855j45156N0645J02684l35935O60951
$$ 3333625 3222979 3414667 3258464 3364329 3617184 3472028 3522673 3625357 3289422 3950373
14488C950373k29502j90368l7968N06280J05456l20040M6601K14474J75685l24510
$$ 3950373 3720871 3530503 3492535 3998815 4104271 3784231 3830832 4045306 4220991 3896481
14478C896481K75293M8047J10893j71004j48966N28122J29063j35081L700J58660
$$ 3896481 4171774 4219821 4330714 4159710 4010744 4538866 4667929 4532848 4536548 4695208
14468D695208p3416L0800M9367j7952J46147K4514J17458J32495J10490m52107
$$ 4695208 4621792 4652592 4701959 4684007 4830154 4854668 4972126 5104621 5215111 4763004
14458D763004J55288L75629n476L3902o5961M48994k7379j584J84369Q329M286
$$ 4763004 4918292 5293921 5288445 5322347 5256386 5705380 5678001 5676417 5860786 5869115 5873401
14447E873401K4781r7930R8304K47370J68316r5232Q3136M48207n13299L86435
$$ 5873401 5898182 5800252 5898556 6145926 6314242 6219010 6302146 6750353 6237054 6623489
14437F623489J89395m26901J24705R4223M46522J35214J602k38992L80303N1034
$$ 6623489 6812884 6385983 6510688 6604911 7051433 7186647 7188249 6949257 7329560 7380594
14427G380594P5068j25938O92315k95034K89592m3749K06581J5994l5100O60752
$$ 7380594 7455662 7329724 8022039 7727005 8016597 7972848 8179429 8195423 8160323 8821075
14417H821075k71005L15685J79551r7233J45929K63317Q5088j50270O4202J19549
$$ 8821075 8550070 8865755 9045306 8948073 9094002 9357319 9442407 9292137 9356339 9475888
14407I475888P2474M67409O7266R9966K55003K71016J12381L7883K99268k5880
$$ 9475888 9548362 10015771 10083037 10183003 10438006 10709022 10821403 10859286 11158554 11132674
14397A1132674L62790n444N66636l30005N36462J94471j15678M54097K74976L05373
$$ 11132674 11495464 11490020 12056656 11726651 12263113 12457584 12341906 12796003 13070979 13376352
14387A3376352j53535M00175J76121N92395p8357O00540K8704L39149K975L36343
$$ 13376352 13222817 13622992 13799113 14391508 14313151 14913691 14942395 15281544 15284519 15620862
14377A5620862M53791K3840O73496N01567O8756M15913N66359L42061j04850O07757
$$ 15620862 16074653 16098493 16771989 17273556 17342312 17758225 18324584 18666645 18561795 19169552
14367A9169552L25128M97599L99298N13652L48743N75735K99410N09983R74165
$$ 19169552 19494680 19992279 20391577 20905229 21253972 21829707 22129117 22639100 23613265
14358B3613265J87662P58875N25369P36408L36811O79552P17288O13841O93198
$$ 23613265 23800927 24559802 25085171 25821579 26158390 26837942 27555230 28169071 28862269
14349B8862269J165051O04102P54976Q00317P77281R53297O59146R28431R33637
$$ 28862269 30027320 30631422 31386398 32186715 32963996 33917293 34576439 35504870 36438507
14340C6438507J248486Q83913J365493R64293J420401J066440J106878J448510
$$ 36438507 37686993 38570906 39936399 40900692 42321093 43387533 44494411 45942921
14332D5942921J659256R39723J694234J665813J750210J206098K418994J348714
$$ 45942921 47602177 48541900 50236134 51901947 53652157 54858255 57277249 58625963
14324E8625963K208892J919885K059976K576406K503030K558297K379552K747893
$$ 58625963 60834855 62754740 64814716 67391122 69894152 72452449 74832001 77579894
14316G7579894L453648L124189K875713L330734L565874M177814L656154M309736
$$ 77579894 81033542 84157731 87033444 90364178 93930052 98107866 101764020 106073756
14308A06073756M602269M374309N431100N290518N771139N703810O485209O684531
$$ 106073756 110676025 115050334 120481434 125771952 131543091 137246901 143732110 150416641
14300A50416641P108376P585949P828254Q729970Q873552R674304J0189371J0440645
$$ 150416641 157525017 165110966 172939220 181669190 190542742 200217046 210406417 220847062
14292B20847062J1188331J1794827J2400215J2747106J3595023J3913083J5106082
$$ 220847062 232035393 243830220 256230435 268977541 282572564 296485647 311591729
14285C11591729J4664071J5526044J5474026J5773594J5927215J5607538J5251215
$$ 311591729 326255800 341781844 357255870 373029464 388956679 404564217 419815432
14278D19815432J4243497J3800290J2008000J0718829Q705465N899013O99203
$$ 419815432 434058929 447859219 459867219 470586048 479291513 485190526 485889729
14271D85889729k338095l735626l07852l496670n475083p850888r098669j0983583
$$ 485889729 483551634 479816008 479508156 476011486 470536403 462685515 453586846 442603263
14263D42603263j2568144j3547286j4733002j5476330j5809355j6426145j6278306
$$ 442603263 430035119 416487833 401754831 386278501 370469146 354043001 337764695
14256C37764695j5789500j4895478j4805741j4188975j3911114j3034955j2650562
$$ 337764695 321975195 307079717 292273976 278085001 264173887 251138932 238488370
14249B38488370j1647630j0667859j0647257j0479792r274819q304690q169045
$$ 238488370 226840740 216172881 205525624 195045832 185771013 177466323 169297278
14242A69297278p892944p940119o733407o526458n550486o021699n406802n358874
$$ 169297278 161404334 153464215 146730808 140204350 134653864 128632165 123225363 117866489
14234A17866489n293335m571139m117003l951116m105861l713507l265250l585042
$$ 117866489 112573154 108002015 103885012 99933896 95828035 92114528 88849278 85264236
14226H5264236l181765l312115k559438k948747k664249k213345j990359k658413
$$ 85264236 82082471 78770356 76210918 73262171 70597922 68384577 66394218 63735805
14218F3735805j765379k631740j501559k005028j397890j384834k024673j455536
$$ 63735805 61970426 59338686 57837127 55832099 54434209 53049375 51024702 49569166
14210D9569166j388392j337584r80877r46707j177676j694445j231832j444654
$$ 49569166 48180774 46843190 45862313 44915606 43737930 42043485 40811653 39366999
14202C9366999q33433l46269r30068p21127j494616j276691n38180p44739n61968
$$ 39366999 38533566 38187297 37257229 36536102 35041486 33764795 33226615 32481876 31919908
14193C1919908o46558p75097j329519m39788p95551p56136j69150o30103n67920
$$ 31919908 31273350 30498253 29168734 28728946 27933395 27177259 27008109 26378006 25810086
14184B5810086o61275m80907l33658p72888m30869n76687K9481q47265m00813
$$ 25810086 25148811 24667904 24334246 23561358 23130489 22553802 22583283 21736018 21335205
14175B1335205l76086l84631n46765p5871o64940l04726l69845k43145l06038
$$ 21335205 20959119 20574488 20027723 19951852 19286912 18982186 18612341 18369196 18063158
14166A8063158n37125j92149J13210m65393l64855J5369q07651k8152j96698l70217
$$ 18063158 17526033 17333884 17447094 16981701 16616846 16632215 15824564 15796412 15599714 15229497
14156A5229497q09517K72082m29666m24855K3512m27751j21645l69308K82890
$$ 15229497 14419980 14692062 14262396 13837541 13861053 13433302 13311657 12942349 13225239
14147A3225239o13728N7702o36967M26993m47537j75750m47328j28833K15156
$$ 13225239 12611511 12669213 12032246 12459239 12011702 11835952 11388624 11259791 11474947
14138A1474947m80677m8319l12787m40319M03928n44824J08979j40003j46643
$$ 11474947 10994270 10945951 10633164 10192845 10596773 10051949 10160928 10020925 9874282
14129I874282m51479k47154J48818R2264k61536k37548k76556L12138k43546j33067
$$ 9874282 9422803 9175649 9324467 9416731 9155195 8917647 8641091 8953229 8709683 8576616
14119H576616p584m56256J16034j2002o02855j78769O21642n0181k91473l20555
$$ 8576616 8569032 8112776 8228810 8216808 7613953 7435184 8056826 8006645 7715172 7394617
14109G394617P4083m2358k37637l10682N12466n32507R801J23795n87484M47488
$$ 7394617 7468700 7426342 7188705 6878023 7390489 6857982 6867783 6991578 6404094 6851582
14099F851582m19006l12480M79207j12781k15332m48673J21379J79571J28595
$$ 6851582 6432576 6120096 6599303 6486522 6271190 5822517 5943896 6123467 6252062
14090F252062m73811k13741p697K62560j93747k77930L30196l70595M5344j52911
$$ 6252062 5778251 5564510 5556813 5819373 5625626 5347696 5677892 5307297 5352641 5199730
14080E199730M62911n36584q227j19306q9383k38447N57539l95060K33498k31862
$$ 5199730 5662641 5126057 5117830 4998524 4909141 4670694 5228233 4833173 5066671 4834809
14070D834809j90693j73606L75773k93990J36326j50166M8606l3700q0740J03994
$$ 4834809 4644116 4470510 4846283 4552293 4688619 4538453 4587059 4553359 4472619 4576613
14060D576613j08540K06969j81628J27937N5400m01059L14752m96509j04462J83976
$$ 4576613 4468073 4675042 4493414 4621351 4676751 4275692 4590444 4093935 3989473 4173449
14050D173449l28104R3772l55033J55273L13875o96890L63811r0456k7760O0905
$$ 4173449 3845345 3939117 3584084 3739357 4053232 3356342 3720153 3629697 3601937 3662842
14040C662842j20182l8574K53Q250p0235J07886j59646K18258l29962j65072K61844
$$ 3662842 3542660 3504086 3504339 3512589 3442354 3550240 3390594 3608852 3278890 3113818 3375662
14029C375662N6379j7436m2352l66727j61207M75569l16848j6392J1984J30564
$$ 3375662 3432041 3414605 3372253 3005526 2844319 3319888 3003040 2986648 2998632 3129196
14019C129196k55785J80626k96208k25099L31982m01378L71893J61491m88373
$$ 3129196 2873411 3054037 2757829 2532730 2864712 2463334 2835227 2996718 2508345
14010B508345K32864j78493j71998L62484k61105M07592n89192l3443K8482J71240
$$ 2508345 2741209 2562716 2390718 2753202 2492097 2899689 2310497 2277054 2305536 2476776
14000B476776j83043K08663l96095M9122J59888k75770L4111j13561K40229p3620
$$ 2476776 2293733 2502396 2106301 2155423 2315311 2039541 2073652 1960091 2200320 2126700
13990B126700O91946M73248K423628P697079K0021440J5698710j8443632j5182054
$$ 2126700 2818646 3291894 5715522 13412601 33434041 49132751 30689119 15507065
13982A5507065o330418k598761j160588j086540m17052m53092k17343k68223K53652
$$ 15507065 9176647 6577886 5417298 4330758 3913706 3460614 3243271 2975048 3228700
13973C228700k13147l29854K61664o18891N76464m9154l53054R0491L33918l04442
$$ 3228700 3015553 2685699 2947363 2328472 2904936 2855782 2502728 2593219 2927137 2622695
13963B622695l99991L19108m19867L16420q7296l27775N06283j66568r0162n62342
$$ 2622695 2222704 2541812 2121945 2438365 2351069 2023294 2529577 2363009 2272847 1710505
13953A710505K93118R2728p3633K13859j13182M02439m62586k33724J54666Q9227
$$ 1710505 2003623 2096351 2022718 2236577 2123395 2525834 2063248 1829524 1984190 2073417
13943B073417j79468J23735n81755M77385M00019l04674N7808R572k16037J17793
$$ 2073417 1893949 2017684 1435929 1913314 2313333 2008659 2066467 2076039 1860002 1977795
13933A977795l36552Q1945M707L26665r3859k44065L209K10537l42140J63659
$$ 1977795 1641243 1723188 1727895 2054560 1960701 1716636 1719845 1930382 1588242 1751901
13923A751901J20115j90938J31527J65510j23987o13477N81968K03735n06438
$$ 1751901 1872016 1681078 1812605 1978115 1854128 1240651 1822619 2026354 1519916
13914A519916j78518M90271k52506K38291k83666L84254j89554k64086J28701
$$ 1519916 1341398 1831669 1579163 1817454 1533788 1918042 1728488 1464402 1593103
13905A593103l9595L17204o29405j7097Q4618J21844n1090J26838j92783L79446
$$ 1593103 1553508 1870712 1241307 1224210 1308828 1430672 1379582 1506420 1313637 1693083
13895A693083n97913L00600k8602j18766M40859q5696k19629j86665m669m7158
$$ 1693083 1095170 1395770 1367168 1248402 1689261 1603565 1383936 1197271 1192602 1145444
13885A145444K34847k10637K76961M5509l28183K01255M570m74106L784L18780
$$ 1145444 1380291 1169654 1446615 1492124 1163941 1365196 1369766 895660 899444 1218224
13875A218224M8975J28550K17563l31610M1636j30335J55247J3228j86770j836
$$ 1218224 1267199 1395749 1613312 1281702 1323338 1193003 1348250 1361478 1174708 1172872
13865A172872J41436m0640l00722K02845l16625J83786K25025j00290K38658m20370
$$ 1172872 1314308 1273668 972946 1175791 859166 1042952 1267977 1167687 1406345 985975
13855I85975O29475l67961j2008J13456j94787j05013K55800j8293l36783J97941
$$ 985975 1615450 1247489 1235481 1348937 1154150 1049137 1304937 1286644 949861 1147802
13845A147802K1691L36461m51251P1992R7605k26690L12231k51869L58496m53336
$$ 1147802 1169493 1505954 1054703 1126695 1224300 997610 1309841 1057972 1416468 963132
13835I63132j32110J58143L91481j72589l89321J2678o7372K89201j01648M3123
$$ 963132 831022 989165 1380646 1208057 818736 831414 764042 1053243 951595 994718
13825I94718o9615J5837n0606J48053J00593l70950J7071J17137K00190l11816
$$ 994718 925103 940940 890334 1038387 1138980 768030 785101 902238 1102428 790612
13815G90612J53501k55395M83055m63882L33101K8389k40144J90103j38983j52557
$$ 790612 944113 688718 1171773 707891 1040992 1069381 829237 1019340 880357 727800
13805G27800O87327l86423l39913J21196K39452J47318k18736r5561m7133m5370
$$ 727800 1415127 1028704 688791 809987 1049439 1196757 978021 882460 835327 789957
13795G89957Q1746L79999D79572K43658Q3147Q9234k39071L74407l23092Q5388
$$ 789957 871703 1251702 479572 723230 806377 895611 656540 1030947 707855 793243
13785G93243N0147D02280P19228k00665k90959L67671M5245m95221K79237q7337
$$ 793243 843390 402280 1121508 920843 629884 997555 1042800 547579 826816 739479
13775G39479q8387j11246N48927m39897J52252n390p72M4569J4127j45127L0203
$$ 739479 651092 539846 1088773 648876 801128 795738 794966 839535 853662 708535 738738
13764G38738N55j15519r2825J47402K98363J32773m34783k9848J8888L26407C47017
$$ 738738 739293 623774 530949 678351 976714 1109487 674704 644856 663744 990151 347017
13752F89344m9220J96828k77479K42290L0859l3992J19350A61984N76500j94785
$$ 689344 640124 836952 559473 801763 832622 798630 917980 161984 738484 543699
13742E43699K10178R2311j47085j45971j25215K63067Q7327j4216J28794k97710
$$ 543699 753877 846188 699103 553132 427917 690984 778311 764095 892889 595179
13732E95179p6836L99580l65632J69717j17257K26410k99415J59833j83486P7280
$$ 595179 518343 917923 552291 722008 604751 831161 531746 691579 508093 585373
13722E85373L9331j30590K80573k23858Q3567j7738j30567N3894j17027K00250
$$ 585373 624704 494114 774687 550829 634396 616658 486091 539985 422958 623208
13712F23208J35527k40127M00943C67569J14485K37308l9924J05147j73039J34127
$$ 623208 758735 518608 919551 367569 482054 719362 679438 784585 611546 745673
13702G45673k07371P8415J15835N4943k13849J94750B68837K93134k3771K04460
$$ 745673 538302 616717 732552 787495 573646 768396 268837 561971 538200 742660
13692G42660j21516j20733q6374K81665l528k03650K06712k89765L35511j91714
$$ 742660 621144 500411 414037 695702 692174 488524 695236 405471 740982 549268
13682E49268K48617l69739K53662l12781J52539K4846k52073L33285j72366J954
$$ 549268 797885 428146 681808 369027 521566 546412 294339 627624 455258 457212
13672D57212q6387J20465l8087p3463J88466A34443K0422N05386l9985n6310N0739
$$ 457212 370825 491290 453203 379740 568206 134443 154865 660251 620266 563956 614695
13661F14695M5420j53113J14204K28282j04444k98253j31434P7604J56893k02160
$$ 614695 660115 507002 621206 849488 745044 446791 315357 392961 549854 347694
13651C47694J1023r8303L8486M27774k74400l9511j34397K26059K30779j64859
$$ 347694 358717 260414 298900 726674 452274 412763 278366 504425 735204 570345
13641E70345q5195j76285j7132J37592k230o2855D0074K28175n5879O34648k23968
$$ 570345 485150 308865 291733 429325 427095 364240 40074 268249 212370 847018 623050
13630F23050j48401P5793j90257J3901K0290j58981O8712M09168q3739B35236
$$ 623050 474649 550442 360185 374086 394376 235395 304107 713275 629536 235236
13619G61389k50013J07926K5964j58094j01210L5463A99632K33532j99243M06579
$$ 761389 511376 619302 645266 487172 385962 421425 199632 433164 233921 640500
13609F40500Q4465L2780C70278A66529K55715M9336L26798I2480K58394Q0402
$$ 640500 724965 757745 370278 166529 422244 471580 798378 92480 350874 431276
13599D31276L95140l90744o78J65028k79840j29922q5312P42179B26471K59297
$$ 431276 826416 435672 434994 600022 320182 190260 104948 847127 226471 485768
13589D85768j19928L4815o7517M3899J13003A07933M22309B60141K82619n5897
$$ 485768 365840 400655 333138 377037 490040 107933 530242 260141 542760 486863
13579D86863B13481L00098D4726N18677j81474k7807Q6575m2954J3184p3418M4168
$$ 486863 213481 513579 44726 563403 381929 354122 440697 397743 410927 337509 381677
13568C81677j582O7302j04765K30720k78358h1812C27634N85144k79557k89025
$$ 381677 380095 447397 342632 573352 294994 -81812 327634 912778 633221 344196
13558C44196J20389k16169J78354J3796j54324N8318J60058F9988N79549B27213
$$ 344196 464585 248416 426770 440566 286242 344560 504618 69988 649537 227213
13547C86152j37283J33378L47491k39381A92682N0942J6173b246H17888k53426
$$ 386152 248869 382247 729738 490357 192682 243624 259797 -2246 817888 564462
13537E64462I3422L74105r8139K69433k02428A50538N3812J33918K55330k53032
$$ 564462 93422 467527 369388 638821 436393 150538 204350 338268 593598 340566
13527C40566g1560E63065B65046i8963C59899J62045k09283O362N6926F7508L38048
$$ 340566 -71560 563065 265046 -98963 359899 521944 312661 319023 375949 67508 405556
13516D05556J0068l443d2594D62778q6806j27051N0448j29558Q2288k298K03423
$$ 405556 415624 412181 -42594 462778 375972 248921 299369 169811 252099 249801 453224
13505D53224a362E10015r1776K8541K9652A92487I0482K01381l1191J24559K81035
$$ 453224 -1362 510015 418239 446780 476432 192487 90482 291863 260672 385231 666266
13494F66266b65854E05902j7264J05493k88488L63614B80486K5756K8181k6368
$$ 666266 -265854 505902 488638 594131 305643 669257 280486 306242 334423 308055
13484C08055j03509K15300F9160L89240B08957R3120C7605J99846j00539K28255
$$ 308055 204546 419846 69160 458400 208957 302077 37605 237451 136912 365167
13474C65167o2020L7603A23069R9307a67172E19377k48384n4686F0881K34791
$$ 365167 303147 340750 123069 222376 -167172 519377 270993 216307 60881 295672
13464B95672J04465b3974B52325I1817L91634j62258d548E07072A68630P1079
$$ 295672 400137 -23974 252325 91817 483451 321193 -4548 507072 168630 239709
13454B39709a00253D86451j90552J64613K11959B49907J97142j83815K02372j99719
$$ 239709 -100253 486451 295899 460512 672471 249907 447049 263234 465606 265887
13444B65887K3508I5707c29530A13859K29356j70332N55554A63481M469h721m5107
$$ 265887 289395 95707 -329530 113859 343215 172883 728437 163481 167950 -8721 -53828
13433e3828B61569N9560A35976K05242A04414K47652g2909C3262L55506A54054
$$ -53828 261569 321129 135976 341218 104414 352066 -72909 33262 388768 154054
13422B91794Q573I7019K14494K7395j18601K0810m5189M0000G8779g7834A94965
$$ 291794 300367 97019 311513 338908 220307 241117 195928 235928 78779 -77834 194965
13410C10843K07146B03102K8725a27715A60953O0247f9478A83288J30849n6754
$$ 310843 517989 203102 231827 -127715 160953 221200 -69478 183288 314137 257383
13400B57383M1529h514A66750d3554E0208J50258J0210q831L01860J15470A36428
$$ 257383 298912 -8514 166750 -43554 50208 200466 210676 201845 503705 619175 136428
13388B48050N7324N6568j69846K45423B0667K62990g23F3623K14425P9519a7845
$$ 248050 305374 361942 192096 437519 20667 283657 -723 63623 278048 357567 -17845
13376B47465K8202j27635R6073L40930k7192e373B17324J8019M24595C1125K413
$$ 247465 275667 148032 244105 585035 557843 -5373 217324 235343 659938 31125 33538
13365C3538L05203k3512O5965A71217c3590B75526J69097k13865j12964g6216
$$ 33538 338741 315229 381194 171217 -33590 275526 444623 230758 117794 -76216
13354A34395k4070k8090a22951A39936L1078o8594A9466N15564A73352J43086
$$ 134395 110325 82235 -122951 139936 171014 102420 19466 535030 173352 316438
13344C16438K21256A44882L7536J72189l9047J46299B2642M14824j77334N3994
$$ 316438 537694 144882 182418 354607 315560 461859 22642 437466 260132 314126
13334C14126M7318J94650A13356P4152K08599k2157j358O3015I434K04238P9111
$$ 314126 361444 556094 113356 187508 396107 373950 372592 435607 9434 213672 292783
13323B92783A25853L326K45846j62084M0149J563q8402k4274P8072O9326J12364
$$ 292783 125853 129179 375025 212941 253090 254653 166251 141977 220049 289375 401739
13312D01739j83956L0646F3182K40270q7551K1454K24734B22565P3574i0851A07357
$$ 401739 217783 248429 63182 303452 215901 237355 462089 222565 296139 -90851 107357
13300b4268C21858j49421l0433L79535A36159L32064A17673K69618A53476J1355
$$ -24268 321858 172437 142004 521539 136159 468223 117673 387291 153476 164831
13290A64831g8793A82697b9467A30905j2344L315L12291k12777l5073k1828P335
$$ 164831 -78793 182697 -29467 130905 118561 121876 434167 221390 186317 164489 171824
13279A71824J20725q1677n5515K78329D3612j7028L31981q8588A16005k6010L1336
$$ 171824 292549 210872 155357 433686 43612 26584 358565 269977 116005 89995 121331
13268A21331h5052B99655b59571A90620c27449B97262d6095B58136b1195E6104
$$ 121331 -85052 299655 -259571 190620 -327449 297262 -46095 258136 -21195 56104
13257a3229C01977j01157j4062i8884A78993J82190B2498J96864k0100l4076n2606
$$ -13229 301977 200820 186758 -98884 178993 361183 22498 219362 199262 165186 112580
13246A12580n912b82037a33111O2510B03604q2035J3498L22205j33451D2991K72060
$$ 112580 106668 -282037 -133111 -70601 203604 121569 135067 457272 323821 42991 315051
13235C15051J81013A68075a22762D669M13375f9229a8895A3072J48453c5332H0033
$$ 315051 496064 168075 -122762 4669 418044 -69229 -18895 13072 161525 -35332 80033
13223B52067B5958g2729q4773B88732k1813r5477a00480I0542j1964N4061J37960
$$ 252067 25958 -72729 -157502 288732 266919 171442 -100480 90542 78578 132639 270599
13212B70599J20549f6313K9588a965q4507B78123j10379N456K13244j60660A7088
$$ 270599 391148 -66313 -36725 -1965 -86472 278123 167744 173200 386444 225784 17088
13200a508I6647j2433J18784a8001F6186g1388A52168K51331A1605K33387K22896
$$ -1508 96647 84214 202998 -18001 66186 -71388 152168 403499 11605 244992 467888
13189D67888e3127a9286j29118A495K29959a55468B04490a19332A73216b7751
$$ 467888 -53127 -19286 -148404 1495 231454 -155468 204490 -119332 173216 -27751
13178A2367a96055B76467a5754A91514a66379C33900j30946a21550C44320A8459
$$ 12367 -196055 276467 -15754 191514 -166379 333900 202954 -121550 344320 18459
13167B36964I8035J39829O1634k1787d1932p6509n279B3394a44024g0907B26383
$$ 236964 98035 237864 299498 277711 -41932 -118441 -123720 23394 -144024 -70907 226383
13155a1824A13174M14783B6983J46793O0875m6469n5032a257B05275e0827A76259
$$ -11824 113174 527957 26983 173776 234651 188182 133150 -1257 205275 -50827 176259
13143a7360A39516J25179b9092A53001c4189j33055d4538B39259j2976a82757
$$ -17360 139516 264695 -29092 153001 -34189 -167244 -44538 239259 226283 -182757
13132B87262c9858A09770K11566d027B00830c813k4702A00568O6018h2073B25977
$$ 287262 -39858 109770 321336 -4027 200830 -3813 -28515 100568 166586 -82073 225977
13120B07641K47195d1322A49436l3187A2680K89993r8300F8421a8378A48731O0910
$$ 207641 454836 -41322 149436 116249 12680 302673 204373 68421 -18378 148731 209641
13109B09641i0224n5208j50968A46984d1028o9509I1986M4189C9101J09481A1017
$$ 209641 -90224 -145432 -296400 146984 -41028 -110537 91986 136175 39101 148582 11017
13097a37401F5580i4435r3171A82467q9766K58191D897K37415a63958h937B84626
$$ -137401 65580 -94435 -187606 182467 92701 350892 4897 242312 -163958 -8937 284626
13085A03173B7632K62420f6243D53462j96024j442F5478L94399A23522J36406
$$ 103173 27632 290052 -66243 453462 257438 255996 65478 459877 123522 259928
13075B59928f3746C20676A1432L05480i2183B30818K05044k00293L44503B35159
$$ 259928 -63746 320676 11432 316912 -92183 230818 435862 235569 580072 235159
13064A64862F4699J31855n2605M0837K50414b58009E37164F9706M4655O1843H6478
$$ 164862 64699 196554 143949 184786 435200 -258009 537164 69706 114361 176204 86478
13052a37783B49240D4336a93782d6426A42228M2068n9873e6701K0082G9879M4961
$$ -137783 249240 44336 -193782 -46426 142228 184296 124423 -56701 -36619 79879 124840
13041A24840j2204e5319F7288K47573D9900N1952B8009K38074O0920c3744C14459
$$ 124840 112636 -55319 67288 314861 49900 101852 28009 266083 327003 -33744 314459
13029H0140k6365J04675J82097j44312b26923B52903K9379A13123g9245A32765
$$ 80140 53775 158450 340547 196235 -226923 252903 282282 113123 -79245 132765
13018c1687D09330e1687r6063N3164B96446r8053d2138k52607G4847M289J9503
$$ -31687 409330 -51687 -147750 -94586 296446 198393 -42138 -294745 74847 79136 98639
13007I8639C5604h6244B16836j1114r8523K71962j47196D5064O3444N0560F9297
$$ 98639 35604 -86244 216836 205722 107199 379161 231965 45064 108508 159068 69297
12995b810A23143c5187H5858J91011j18210J8469G7712R945J11744J24651a71477
$$ -2810 123143 -35187 85858 276869 158659 177128 77712 87657 199401 324052 -171477
12983a87612B68546G8652Q8615a09799D20952e4385R979C26962j4577r2838N733
$$ -187612 268546 78652 167267 -109799 420952 -54385 -44406 326962 312385 219547 225280
12972B25280F6113b6655A38765D6337J06836a06765C04278F4247Q9318Q8622J98011
$$ 225280 66113 -26655 138765 46337 153173 -106765 304278 64247 153565 242187 440198
12961D40198k09945A539K1012K53055a89494G225J02785a94696A2825e11289F6673
$$ 440198 230253 1539 22551 275606 -189494 7225 110010 -194696 12825 -511289 66673
12949B27763H5749d9072a6818o8856A48606D1604j8720b78327B55143J62213A70488
$$ 227763 85749 -49072 -16818 -85674 148606 41604 22884 -278327 255143 417356 170488
12937A47427j7818F0723f5879q6B58816A06691L9145a10185C8657L2332k8100
$$ 147427 129609 60723 -65879 -65965 258816 106691 145836 -110185 38657 70989 42889
12926D2889R5262a42959F016M78303k25109m7387a18717A10663e6940A37471n9487
$$ 42889 138151 -142959 6016 484319 259210 211823 -118717 110663 -56940 137471 77984
12915G7984a12673A98885I1060M0450b6676C19898D5500a6121E2506a80337P807
$$ 77984 -112673 198885 91060 131510 -26676 319898 45500 -16121 52506 -180337 -172530
12904a72530A91546a62257g2280p230A4563b7251G6389b0480B00293a84720A46700
$$ -172530 191546 -162257 -72280 -79510 14563 -27251 76389 -20480 200293 -184720 146700
12892g5358c147G5745O5458d224m4574A62621a42063b1659n7644C08590a5271
$$ -75358 -3147 75745 141203 -4224 -48798 162621 -142063 -21659 -79303 308590 -15271
12880b5405k2308a1774A2154K05683n3924N8186A0604J92162g2293j08757g3448
$$ -25405 -47713 -11774 12154 217837 163913 222099 10604 202766 -72293 -181050 -73448
12868E6704O2160L5212J8609J80576A53237E7404K23342I2357K40742F7585b42313
$$ 56704 118864 154076 172685 353261 153237 57404 280746 92357 333099 67585 -242313
12856A46472b08194J1145E1502a44387c8377E7717L06735C5164a82155m1233a08795
$$ 146472 -208194 -197049 51502 -144387 -38377 57717 364452 35164 -182155 -223388 -108795
12844e8517E9530J52349B5836a49505a7037m3294A30793K24053A63112b02542
$$ -58517 59530 211879 25836 -149505 -17037 -60331 130793 354846 163112 -202542
12833A84035k8693p3675J82640d0178j34607B84475e096r989B14579I4560a64449
$$ 184035 155342 81667 264307 -40178 -174785 284475 -5096 -15085 214579 94560 -164449
12821B66969a22426F6080P2734L30712j62918I1862L1613l5581N6522L5847D6794
$$ 266969 -122426 66080 138814 469526 306608 91862 123475 87894 144416 180263 46794
12809B54990f7232I5704G597P4023L8862m0094J7411g9075I4072L2735M4711F447
$$ 254990 -67232 95704 7597 81620 120482 80388 97799 -79075 94072 126807 171518 6447
12796d4639j38469h9594F53c3982m1040l3958H1645N0183a06897L8607E3961j5657
$$ -44639 -183108 -89594 653 -33982 -75022 -108980 81645 131828 -106897 -68290 53961 38304
12784C8304d2478C50403f8205H9767k7191J8549b51363K7595e7200A37878a85363
$$ 38304 -42478 350403 -68205 89767 62576 81125 -251363 -223768 -57200 137878 -185363
12772I0261K93001j28379B6541a39105k71513A17995i8482m7864F6868a08225
$$ 90261 383262 254883 26541 -139105 -410618 117995 -98482 -146346 66868 -108225
12761C32285C802J31066a77363C2773i4850G1829a67327g030E2045J77902Q4764
$$ 332285 3802 134868 -177363 32773 -94850 71829 -167327 -7030 52045 229947 314711
12750C14711j45913j8722C0247b57588A25611K1959a83554B58379D961N6850K4288
$$ 314711 168798 150076 30247 -257588 125611 147570 -183554 258379 4961 61811 86099
12739H6099O6455K63962b45580c8950F9053j0311M5167c8095a8504o9755A58085
$$ 86099 152554 416516 -245580 -38950 69053 58742 103909 -38095 -18504 -88259 158085
12727a75847L7548K4464A5173K96111a45988C11597b90561B24124h0790H5264
$$ -175847 -138299 -113835 15173 311284 -145988 311597 -290561 224124 -80790 85264
12716c07794a15836D47494D4417J47295L20064k05031m2253K63984B01262J80163
$$ -307794 -115836 447494 44417 191712 511776 306745 264492 528476 201262 381425
12706C81425j41942C7843M77842r4897A77290i2310I7072m7304K16589b57669
$$ 381425 239483 37843 515685 420788 177290 -92310 97072 49768 266357 -257669
12695H2705e9395G728O3405b21118M1376e5065B53803h9079A2602K05933m1141
$$ 82705 -59395 7728 71133 -221118 -179742 -55065 253803 -89079 12602 218535 177394
12684A77394F9190g492j77746d9093B31748J4426J3192D0907L90552j89829j13298
$$ 177394 69190 -7492 -185238 -49093 231748 246174 259366 40907 431459 241630 128332
12673A28332L37461a43496C317c4162B8075K34617a24410A7294e8650q0286C05400
$$ 128332 465793 -143496 3317 -34162 28075 262692 -124410 17294 -58650 -138936 305400
12661C44716F742J10094N7398H5664L19785I7646m0473J01196a96656P053A0808
$$ 344716 6742 116836 174234 85664 405449 97646 57173 158369 -196656 -189603 10808
12649B21828j01091K7751A7325c49312i9053K7758d489k0504F563a0138B99139
$$ 221828 120737 148488 17325 -349312 -99053 -71295 -4489 -24993 6563 -10138 299139
12637F8698L4805B9186b07599B14973N4315D6770K98518A72334R095J73793C2344
$$ 68698 103503 29186 -207599 214973 269288 46770 345288 172334 181429 355222 32344
12625g2601B52192F6785A6627L85178f1735b9473A41755N2203a23806F4716c7393
$$ -72601 252192 66785 16627 401805 -61735 -29473 141755 193958 -123806 64716 -37393
12613b0346A72789C5472J5797J68182e2260h440A31880r451J4577a45254B11572
$$ -20346 172789 35472 51269 219451 -52260 -8440 131880 122429 137006 -145254 211572
12601A70765N0548K4465q0945C7195Q9390b38825A26961a2816E3924K95932A04464
$$ 170765 221313 245778 164833 37195 126585 -238825 126961 -12816 53924 349856 104464
12589C9247O1103L33110f0662I8485h0481j1104A38622R0217A14208O2656c7033
$$ 39247 100350 433460 -60662 98485 -80481 -91585 138622 228839 114208 176864 -37033
12577E5447B2502J64381B5127c2251A76218G2857a04003r8118F0360K17109b50114
$$ 55447 22502 186883 25127 -32251 176218 72857 -104003 -202121 60360 277469 -250114
12565a5745C3257M548a80304A43509a76504N2276n817l9355m7635E5399f0115
$$ -15745 33257 37805 -180304 143509 -176504 -124228 -130045 -169400 -217035 55399 -60115
12553A17612h9142p9989G6630i920A50956F0090e3480D08582h5639A08022e6025
$$ 117612 -89142 -169131 76630 -9920 150956 60090 -53480 408582 -85639 108022 -56025
12541a50522A3927b83213A17366L4895f9980D15986A37884L41823c8050a605F507
$$ -150522 13927 -283213 117366 152261 -69980 415986 137884 479707 -38050 -1605 6507
12529C575f6449B14558C3778J44502a63518c1071C32356C5417e9993l92F7761
$$ 3575 -66449 214558 33778 178280 -163518 -31071 332356 35417 -59993 -60385 67761
12517B21382a08455e0239B6920L50229A56481P2070A0149J29906d31530R5454
$$ 221382 -108455 -50239 26920 377149 156481 228551 10149 140055 -431530 -336076
12507c36076J46660g0588G9652M8332J06721k3403j05097m7313b9132m9334B7070
$$ -336076 -189416 -70588 79652 127984 234705 211302 106205 58892 -29132 -78466 27070
12495B6691L61268B8992e9462a3985I3660J38560b34198A79092b67394d6018A4351
$$ 26691 387959 28992 -59462 -13985 93660 232220 -234198 179092 -267394 -46018 14351
12483D8979d7435J1418C20613o7145G4899a67098j30302A73275B2464J7989b9212
$$ 48979 -47435 -36017 320613 253468 74899 -167098 -297400 173275 22464 40453 -29212
12471i2966G8108i0318j52317Q9826O7026h697F6069p983J19501b17241d5278
$$ -92966 78108 -90318 -242635 -152809 -85783 -8697 66069 58086 177587 -217241 -45278
12459b27677C21107m2630A16790b1127m6429B47759H7589d53675C09197b14641
$$ -227677 321107 278477 116790 -21127 -67556 247759 87589 -453675 309197 -214641
12448d3135C21443A2747J01325b6330p5207m2908c352k72612d4349E2867J42913
$$ -43135 321443 12747 114072 -26330 -101537 -144445 -3352 -275964 -44349 52867 195780
12437A95780g4828F1149j8355a90390q1297J0919J00555A86215f257A13969d12292
$$ 195780 -74828 61149 42794 -190390 -271687 -260768 -160213 186215 -6257 113969 -412292
12425H9556A8695o641b41193A43147m7911a44986j57903A83089a80213a7260k21769
$$ 89556 18695 12054 -241193 143147 95236 -144986 -302889 183089 -180213 -17260 -239029
12414b39029c579m0766k92755B07426j1068c8599J1300A33188D1491h8663j70061
$$ -239029 -3579 -44345 -337100 207426 196358 -38599 -27299 133188 41491 -88663 -258724
12403b58724A12120a84619f9251D62198p1875A5511P7794o156P5688L1320r0762
$$ -258724 112120 -184619 -69251 462198 390323 15511 93305 87149 162837 194157 103395
12392A03395a73323C84426d2021j35799A71591A1432c43746i646j26439k726D94765
$$ 103395 -173323 384426 -42021 -177820 171591 11432 -343746 -9646 -136085 -138811 494765
12380I1324a78644B6615d9872j80426b7201j05971N6662B9477P6965b70907B12562
$$ 91324 -178644 26615 -49872 -230298 -27201 -133172 -76510 29477 106442 -270907 212562
12368e3264Q23A90066l1909c1262B56306c03458m3652B12890a56646G2937l0874
$$ -53264 -52441 190066 158157 -31262 256306 -303458 -347110 212890 -156646 72937 42063
12357D2063d3978D50767d14774A24621h281n4044B35549h329A91190a5059A20192
$$ 42063 -43978 450767 -414774 124621 -8281 -62325 235549 -8329 191190 -15059 120192
12345a23389B8944A615k34b29114B7504d32860D80476A05643B4594L7435k3550
$$ -123389 28944 1615 1381 -229114 27504 -432860 480476 105643 24594 62029 38479
12334C8479G806O2213G695J38434K6208a07252D1865a12402o1236C04627E1286
$$ 38479 7806 70019 7695 146129 172337 -107252 41865 -112402 -173638 304627 51286
12322D8361K26206p7630n0560a62918p650A74343b42079F9396M5437Q7139q6603
$$ 48361 274567 196937 146377 -162918 -170568 174343 -242079 69396 114833 201972 115369
12311A15369b19514A2562J1449a65222I6326h8543k36049B24896F0376d1772A23569
$$ 115369 -219514 12562 24011 -165222 96326 -88543 -324592 224896 60376 -41772 123569
12299b67068B11774a08371j70452a31978I9170r921a5992B56478a43849m7663
$$ -267068 211774 -108371 -278823 -131978 99170 89249 -15992 256478 -143849 -191512
12289a91512B55419f3400B75361A18031c20980B45012O0289b19165D12757E5324
$$ -191512 255419 -63400 275361 118031 -320980 245012 305301 -219165 412757 55324
12278A02089Q6674J68709A75347m187C5557J5809n534M5328J02048D4911K6702
$$ 102089 188763 357472 175347 171160 35557 51366 45832 91160 193208 44911 71613
12267G1613J56768F4583K23637h9107A87321a33170c2055B75843A18295D9069
$$ 71613 228381 64583 288220 -89107 187321 -133170 -32055 275843 118295 49069
12256H1839a05120A05983R062M3215J61648F815J7717h9054D1835L90c6246C08136
$$ 81839 -105120 105983 115045 158260 319908 6815 24532 -89054 41835 42225 -36246 308136
12243i3878A57881b29676B16257a2042E50027G4678O8158J6627m0541m0205Q1834
$$ -93878 157881 -229676 216257 -12042 550027 74678 142836 159463 118922 78717 160551
12232A60551p1614J94708a22467G3155J3804K38211A58234K69283p4517j23867
$$ 160551 88937 283645 -122467 73155 86959 325170 158234 427517 353000 229133
12222B29133F7971Q8140n4799J63675K0054j05783K49849o9462p3017b41165B63471
$$ 229133 67971 156111 101312 264987 285041 179258 429107 359645 286628 -241165 263471
12210B73935j26774F5598M14729A64704e6297B41169j08297J30749K30224C92
$$ 273935 147161 65598 480327 164704 -56297 241169 132872 263621 493845 392
12199B27171L4426A26031J80251L8935G9629M76464B74870A00649a89551a7689
$$ 227171 261597 126031 306282 345217 79629 556093 274870 100649 -189551 -17689
12188h84A38391O4264J19836n7338b84035d354A64346i1427A65705A8220a98294
$$ -884 138391 202655 322491 265153 -284035 -4354 164346 -91427 165705 18220 -198294
12176A77315J70538j8052j35586a65370B51496A11970R6393k8126K36958B03682
$$ 177315 347853 329801 194215 -165370 251496 111970 208363 180237 417195 203682
12165c42304g8865A45752j5218J30810A09647D6981M4780K89210e1610A76940
$$ -342304 -78865 145752 130534 261344 109647 46981 91761 380971 -51610 176940
12154C0812K42642D9122h1701A26953J61730A25633k2689m1347O7658L24593d871
$$ 30812 273454 49122 -81701 126953 288683 125633 102944 61597 129255 453848 -4871
12142A17475R0742e8532l8622b1116A88831g5024q3598J0753h840H2413K75933
$$ 117475 208217 -58532 -97154 -21116 188831 -75024 -158622 -147869 -8840 82413 358346
12131C58346f9097k35273B99129a07808d5217A33901f8641k7355A59153P1236
$$ 358346 -69097 -304370 299129 -107808 -45217 133901 -68641 -95996 159153 230389
12121B30389e6999k14917A80741J35583d3817A15101C8904i0515H537P9520b09819
$$ 230389 -56999 -271916 180741 316324 -43817 115101 38904 -90515 8537 88057 -209819
12109a33495b0123e363A3411a33906G5106n170K8835K0304K8571A3917R27i8829
$$ -133495 -20123 -5363 13411 -133906 75106 69936 98771 119075 147646 13917 14844 -98829
12096A46604m6240c4706A36412a70948A85196i2933j84806a15324L4987A17293
$$ 146604 100364 -34706 136412 -170948 185196 -92933 -277739 -115324 -80337 117293
12085B91194g9080A11143i3946B9831b74826B36067A17235K84144N02657J132675
$$ 291194 -79080 111143 -93946 29831 -274826 236067 117235 401379 904036 2036711
12075B036711m40680F36788B6375L30281a20354A37191j0981O9540a11984G1375
$$ 2036711 1596031 636788 26375 356656 -120354 137191 126210 195750 -111984 71375
12064F4321f8406A36284a78495H5413A0742L27720D5996M82228a99687j0953l9250
$$ 64321 -68406 136284 -178495 85413 10742 338462 45996 528224 -199687 -210640 -249890
12053b49890D56516E5602K8206B2896J74357d8965K3327F7263a46786M0857K280
$$ -249890 456516 55602 83808 22896 197253 -48965 -25638 67263 -146786 -105929 -103649
12042a03649p8672g1099C49684g4513l94895a26256A25482b10161H9541a12518
$$ -103649 -182321 -71099 349684 -74513 -469408 -126256 125482 -210161 89541 -112518
12031a35256D76570a88299Q008c8331C40755f5349l46197A86550a6653o4154o6198
$$ -135256 476570 -188299 -180291 -38331 340755 -65349 -411546 186550 -16653 -80807 -147005
12020a47005j7432b9645A46166J64787b8035B68730a46253E3094Q4586K00358
$$ -147005 -164437 -29645 146166 310953 -28035 268730 -146253 53094 137680 338038
12010C38038G1970J29672p1567i9504A38025C6856C616b77141C29451B519J70015
$$ 338038 71970 201642 130075 -99504 138025 36856 3616 -277141 329451 2519 172534
11999A72534A3633J1935R9790a58978N9564j86603J37183b6876D0835P0063h4790
$$ 172534 13633 25568 125358 -158978 -99414 -286017 -148834 -26876 40835 110898 -84790
11987b83832e7796C00937f7392A67104a93816C4847h7393j38005A18102N1772
$$ -283832 -57796 300937 -67392 167104 -193816 34847 -87393 -225398 118102 169874
11977A69874m3157N8688F0592J19917R5667b5396O540B88326d29873h4583E2918
$$ 169874 126717 185405 60592 180509 276176 -25396 -18856 288326 -429873 -84583 52918
11965A25408l0047Q6870E921f6408l3551r6791m63c0514A97326q4649a42833F1246
$$ 125408 95361 182231 5921 -66408 -99959 -196750 -197213 -30514 197326 112677 -142833 61246
11952a52915A10392R38m5717a12589A85863c26860G3363a47300l11870d6944I4653
$$ -152915 110392 111330 65613 -112589 185863 -326860 73363 -147300 -459170 -46944 94653
11940a0592A52264a22871j6113b4657A88891a10728B38243c38861C14953q8605
$$ -10592 152264 -122871 -138984 -24657 188891 -110728 238243 -338861 314953 226348
11930B26348a33659C06815c32462e0042A09303J97092a37793F3045B4007R1490
$$ 226348 -133659 306815 -332462 -50042 109303 306395 -137793 63045 24007 115497
11920A15497h2547A6694d11828D7116d51491C52942g8051C30289b22013B2452
$$ 115497 -82547 16694 -411828 47116 -451491 352942 -78051 330289 -222013 22452
11909g0812B10455o8907d5729j9134C07725c15765J00020C9319R3366d74991A51837
$$ -70812 210455 141548 -45729 -64863 307725 -315765 -215745 39319 132685 -474991 151837
11897C3156a34391G7279B0318a83280A5541d1058j12499A30885b53452A45317
$$ 33156 -134391 77279 20318 -183280 15541 -41058 -153557 130885 -253452 145317
11886A18442k8862c7411n3287H9128K43323G7200j3592J62177a51199A47894n1657
$$ 118442 89580 -37411 -90698 89128 332451 77200 63608 225785 -151199 147894 96237
11875I6237b79129d7711E2252b45059B8961Q657b77000C2196h4757A6278J05920
$$ 96237 -279129 -47711 52252 -245059 28961 37618 -277000 32196 -84757 16278 122198
11864A22198a21971A28133J42700O6963A63805h5003B74851B2733d24390A51373
$$ 122198 -121971 128133 270833 337796 163805 -85003 274851 22733 -424390 151373
11853A32522o1411d4200j34769h1545A69054b85292F9392P5901F083A539L8769
$$ 132522 71111 -44200 -178969 -81545 169054 -285292 69392 145293 6083 1539 40308
11842D0308g1998l42628a0278m14157F4409K46168b10730I2152a42764E0383g7793
$$ 40308 -71998 -414626 -10278 -424435 64409 310577 -210730 92152 -142764 50383 -77793
11830C57612A63141O0763R5217c16871g7815K6179j72335i1502j63723G5255B0873
$$ 357612 163141 223904 319121 -316871 -77815 -51636 -223971 -91502 -255225 75255 20873
11818a64293C12962D8635K41710j35436J25493A23646b01433b902F9871R2361
$$ -164293 312962 48635 290345 154909 280402 123646 -201433 -2902 69871 162232
11808A62232c3248C20928f9601q842A66486a96336g7914j7428D9479b04684f5961
$$ 162232 -33248 320928 -69601 -78443 166486 -196336 -77914 -95342 49479 -204684 -65961
11796B14616a71373O8142B70757A22533J6622b59885B2608J94193A1640K78653
$$ 214616 -171373 -103231 270757 122533 139155 -259885 22608 216801 11640 290293
11786B90293i7929B91443A05517c9197B13031b6513q0078A00669k217e1271j35733
$$ 290293 -97929 291443 105517 -39197 213031 -26513 -106591 100669 98452 -51271 -187004
11775a87004P5767r0625k46773J16547a03132C0327P976a48976j47595L1242A73782
$$ -187004 -111237 -201862 -448635 -332088 -103132 30327 38303 -148976 -296571 -265329 173782
11763A24393b12174N9278N9210A06338B4868N9612c83405a00188c3658B1433L1344
$$ 124393 -212174 -152896 -93686 106338 24868 84480 -383405 -100188 -33658 21433 52777
11752E2777b69279E8733b13143A59491b24704A38834a53664A54401a60319n4302
$$ 52777 -269279 58733 -213143 159491 -224704 138834 -153664 154401 -160319 -214621
11742b14621A66821D8747c56161A62328c18946C07025a52600a9384E3100K09795
$$ -214621 166821 48747 -356161 162328 -318946 307025 -152600 -19384 53100 262895
11732B62895b92761A68666n5674b46108c9034B32788D6188d2451D00029a96237
$$ 262895 -292761 168666 112992 -246108 -39034 232788 46188 -42451 400029 -196237
11721b7577C9098b8415F1360K31411k2515A2728d8082a624A48051L45839e9085
$$ -27577 39098 -28415 61360 292771 270256 12728 -48082 -1624 148051 493890 -59085
11709C62288F8759d36169i159A71319K60415g8014B44987b53272A02726a45353
$$ 362288 68759 -436169 -9159 171319 431734 -78014 244987 -253272 102726 -145353
11698d1275A87815G0636e08p0089C20380f8057A06858Q3923C3694a90441f8685
$$ -41275 187815 70636 -508 -70597 320380 -68057 106858 190781 33694 -190441 -68685
11686A95625J3851a5988B75319j33542K37870b8920k88774C755a8111p5573B96663
$$ 195625 209476 -15988 275319 141777 379647 -28920 -317694 3755 -18111 -93684 296663
11674a64012B21033H8087m805J5999h4426c5311G3393A81J32179M9617P6021p6968
$$ -164012 221033 88087 83282 99281 -84426 -35311 73393 181 132360 181977 257998 181030
11662A81030b12752e6401A86890a99969B1119a16000B7819Q9580j1278a9507m09938
$$ 181030 -212752 -56401 186890 -199969 21119 -116000 27819 117399 106121 -19507 -429445
11651d29445g6111C51677q4762e3759O583B59755N3552m3847A30855G521g5668
$$ -429445 -76111 351677 266915 -53759 -47176 259755 313307 269460 130855 7521 -75668
11639B57145a80013c4527k52903l0931a21062F723Q7033a06098D019e5107A09151
$$ 257145 -180013 -34527 -287430 -318361 -121062 6723 93756 -106098 4019 -55107 109151
11627A9606K36321J35417b10744A95480E5127K1938a43870J6466C50502d9090
$$ 19606 255927 391344 -210744 195480 55127 77065 -143870 -127404 350502 -49090
11616A50885a20330N1988o7476A19101b79903f873k49553b1898A53910a4231l024
$$ 150885 -120330 -68342 -135818 119101 -279903 -6873 -256426 -21898 153910 -14231 -17255
11605a7255j38563I787M8434h3988k63393B12007e3633B09338C8718g0432A95739
$$ -17255 -155818 9787 58221 -83988 -347381 212007 -53633 209338 38718 -70432 195739
11593a2412L91B02537A077K88791a19933k4504B18499j7557F371J01045a90625
$$ -12412 -12021 202537 1077 289868 -119933 -144437 218499 200942 6371 107416 -190625
11581B14477D7002K80755j21426q0154a9823A56160g0289B27219P8002a27490
$$ 214477 47002 327757 206331 126177 -19823 156160 -70289 227219 305221 -127490
11570A02698K33475b43774C99210I0632Q914J79932Q3091H7682l8786L62656r3904
$$ 102698 336173 -243774 399210 90632 99546 279478 362569 87682 48896 411552 317648
11559C17648o1545J65J15420A00838j8443b82028B26934C0841K62541g3642A25756
$$ 317648 256103 256268 371688 100838 82395 -282028 226934 30841 293382 -73642 125756
11547d146G5151i5170k8111C27196a33289H7671a8025j84954A77349K08189I3025
$$ -4146 75151 -95170 -123281 327196 -133289 87671 -18025 -202979 177349 385538 93025
11535B42451i6933b7676h47B60113c37038A51903O2807J90118A1795L0801J27986
$$ 242451 -96933 -27676 -847 260113 -337038 151903 214710 404828 11795 42596 170582
11524A70582M9458b46871B82058q7436m9744f2993C62857d3472B07961I5050Q2350
$$ 170582 220040 -246871 282058 194622 144878 -62993 362857 -43472 207961 95050 177400
11513A77400C7748L79496r4848j09982k1851n59B4985a61443K5764F9361J45096
$$ 177400 37748 417244 322396 212414 190563 190004 24985 -161443 -135679 69361 214457
11502B14457L66837A70600J07508K344B9369K23824O3492g0857m4535C84706d7577
$$ 214457 581294 170600 278108 280452 29369 253193 316685 -70857 -115392 384706 -47577
11490D80120a28964A626i4224A59033J1133c1374O196D86398k05788Q5481e1998
$$ 480120 -128964 1626 -94224 159033 170166 -31374 -25178 486398 280610 366091 -51998
11478a0014E893K49228b07282N9845A04295a90563G7551L03206A85161b65519
$$ -10014 5893 255121 -207282 -147437 104295 -190563 77551 380757 185161 -265519
11467A9138K47866A22201n9442K03099A14317f1615e673E8652R5275P9544c5668
$$ 19138 267004 122201 62759 265858 114317 -61615 -5673 58652 153927 233471 -35668
11455i61D41556B0063J20566Q7816r2402a4392o1707A58920J80463I8787b6054
$$ -961 441556 20063 140629 228445 136043 -14392 -76099 158920 339383 98787 -26054
11443C27230A37674L48505a13422D01554A06471D3444f1382q9127k2954C5892
$$ 327230 137674 486179 -113422 401554 106471 43444 -61382 -150509 -173463 35892
11432i3721C25749D0715J20528c12037B34277J02611h5662E7408O6338a16296
$$ -93721 325749 40715 161243 -312037 234277 336888 -85662 57408 123746 -116296
11421d8013F7144K2851c44495j3027A52448E753K83569c15634A29664l6985J90383
$$ -48013 67144 89995 -344495 -357522 152448 5753 289322 -315634 129664 92679 283062
11410B83062d1232j54636e9283r1258E2761J98673a50166I800a36315D41201I6237
$$ 283062 -41232 -195868 -59283 -150541 52761 251434 -150166 9800 -136315 441201 96237
11398f1193n8369e3970k23065e8068B33157h6720A84683r327a91193Q4978F266
$$ -61193 -119562 -53970 -277035 -58068 233157 -86720 184683 175356 -191193 -106215 6266
11386d2387B11375c19244a6937A46239C8362K5470b66091A21810D1129O7931p322
$$ -42387 211375 -319244 -16937 146239 38362 63832 -266091 121810 41129 109060 101738
11375A01738J1588H895a28007i82p3709D953M19157a35327d7489a3276k49329
$$ 101738 113326 8895 -128007 -982 -74691 4953 424110 -135327 -47489 -13276 -262605
11364b62605I5841a07323j09813d2353C499J45860a58957A60174D1791J02068
$$ -262605 95841 -107323 -217136 -42353 3499 149359 -158957 160174 41791 143859
11354A43859e8749k95802F7163e5174B06819D485i8772b484F440b58935B0549
$$ 143859 -58749 -354551 67163 -55174 206819 4485 -98772 -2484 6440 -258935 20549
11342H8435a10285O071D10369a8873M171I6130L99233G917J41369E5396a90429
$$ 88435 -110285 -104214 410369 -18873 -14702 96130 495363 7917 149286 55396 -190429
11330a77119H1592B9312f6443K721I7704D6440K61606A5177i2367l0532A20775
$$ -177119 81592 29312 -66443 -63722 97704 46440 308046 15177 -92367 -122899 120775
11318A13904f8586B21494I6553H598i3132j14789E7658e7958j05744k6032M7636
$$ 113904 -68586 221494 96553 8598 -93132 -207921 57658 -57958 -163702 -189734 -142098
11307a42098A28152b78311J09940A04483d7506l7469k5863b1047I3875a61794
$$ -142098 128152 -278311 -168371 104483 -47506 -84975 -110838 -21047 93875 -161794
11296i4916A13696E0314K959Q8435e8882b0670k29585F0542b60454a14242A25800
$$ -94916 113696 50314 53273 141708 -58882 -20670 -250255 60542 -260454 -114242 125800
11284a39841A75022a8461k56354a4646k56490J24762r0833C48431i8287A880e41650
$$ -139841 175022 -18461 -274815 -14646 -271136 -146374 -237207 348431 -98287 1880 -541650
11272b23203c0162I0514a26180e9125j29579j40620h2288A29161i8229b0094j3445
$$ -223203 -30162 90514 -126180 -59125 -188704 -329324 -82288 129161 -98229 -20094 -33539
11261c3539C2047a53298G9931a41036j03269k8845C4334g7692K7372j52631A37538
$$ -33539 32047 -153298 79931 -141036 -244305 -273150 34334 -77692 -50320 -202951 137538
11249a40388c6222F8583b55013C2006K76507g0762r500P683J2434k88276J68695
$$ -140388 -36222 68583 -255013 32006 308513 -70762 -80262 -72579 -60145 -348421 -179726
11238a79726B9257n735c53483a03606A0895b75409c8072k5149C8965J31590d33098
$$ -179726 29257 23522 -353483 -103606 10895 -275409 -38072 -63221 38965 170555 -433098
11226A58726r14a68539C1488b46043i9669j38037H1096e7994C7389b02435j44888
$$ 158726 157812 -168539 31488 -246043 -99669 -237706 81096 -57994 37389 -202435 -347323
11215c47323E6052O1103a114A98101m8096Q8705B6557a71961B36804a51362e9199
$$ -347323 56052 117155 -1114 198101 150005 238710 26557 -171961 236804 -151362 -59199
11203h7902j99323c5609F0105a00646A30025e8955B68343d169D3839a83165B8872
$$ -87902 -287225 -35609 60105 -100646 130025 -58955 268343 -4169 43839 -183165 28872
11191A24625a72558b3789k3938r1153j1928G5862l1781b18483e7296j25102G0891
$$ 124625 -172558 -23789 -47727 -138880 -150808 75862 44081 -218483 -57296 -182398 70891
11179A25003c7969H3919L31667E7808c60459J01414C46470b11248B25906b32943
$$ 125003 -37969 83919 415586 57808 -360459 -259045 346470 -211248 225906 -232943
11168E7922B2762J16902a16182B44239j13334c66780a04921H9519j4424d17134
$$ 57922 22762 139664 -116182 244239 130905 -366780 -104921 89519 75095 -417134
11157C5110M663K2185A2445a80189A28230b9004A40258b56579G5215A3159L6884
$$ 35110 39773 61958 12445 -180189 128230 -29004 140258 -256579 75215 13159 50043
11146E0043J88105m1011B0899d1806G7091a49595D299b27594A24997F2274M9161
$$ 50043 238148 197137 20899 -41806 77091 -149595 4299 -227594 124997 62274 111435
11135A11435g1056d605C79864A47805E9432K91675A33931a16192A04733g2429
$$ 111435 -71056 -4605 379864 147805 59432 351107 133931 -116192 104733 -72429
11124A43732f089l229G4833J81804c11900I3751b9999B12693b8724p6160q4308
$$ 143732 -6089 -9318 74833 256637 -311900 93751 -29999 212693 -28724 -104884 -189192
11113a89192e501B92694d6436E95564A19340b43059B0101i5066B49423o8960K07211
$$ -189192 -5501 292694 -46436 595564 119340 -243059 20101 -95066 249423 180463 387674
11102C87674H0463J01374G8134K12004F6422l370i042B22935j4031N8599H4611
$$ 387674 80463 181837 78134 290138 66422 63052 -9042 222935 208904 267503 84611
11090B23775J81530A44464L13L7735c3046B22171K43438R90B08404J58804o8982
$$ 223775 405305 144464 144777 182512 -33046 222171 465609 466599 208404 367208 298226
11079B98226D1577M39856j31979L3245J82817B26016N4939P4704Q700j15376K48620
$$ 298226 41577 481433 349454 382699 565516 226016 280955 355659 364359 248983 497603
11068D97603M9969r0573j65807L76077I6833N26092j18956O1021j31890B04757
$$ 497603 547572 456999 291192 667269 96833 622925 503969 564990 433100 204757
11057B47520O93073l82157J63288j27684k34774M81235l68952J31973N4880J51510
$$ 247520 940593 558436 721724 594040 359266 840501 471549 603522 658402 809912
11047H09912J91195m33475J78385J05114J02704B75981L65161L20029k44304m5137
$$ 809912 1001107 567632 746017 851131 953835 275981 641142 961171 716867 671730
11037F71730J67119j21372l08197M15375C51840M65379l16828j01558K13924k92183
$$ 671730 838849 717477 409280 824655 351840 817219 500391 398833 612757 320574
11027C20574O30002l27041j9855Q1938j74575O7367k4001L34834o961l11903R5746
$$ 320574 950576 623535 603680 685618 511043 578410 554409 889243 882282 570379 666125
11016F66125j77493L88803j8044M551C14039M51982l61725L85334l50215L63926
$$ 666125 488632 877435 859391 863942 314039 766021 404296 789630 439415 803341
11006H03341j50289k34305L49558l03183N2008j09640M37237j76300N1981J22030
$$ 803341 653052 418747 768305 465122 517130 407490 844727 668427 720408 842438
10996H42438P525j11245Q8852j79156J61027J13669L8657K21970j03653l36608
$$ 842438 849963 738718 827570 648414 809441 923110 961767 1183737 1080084 743476
10986G43476N21812k60918j96889M44728J23353P7098K06216m72329j5440L13539
$$ 743476 1265288 1004370 807481 1252209 1375562 1452660 1658876 1186547 1171107 1484646
10976A484646K37895L45482l4095N96794j76940O03578j8583k95224j08379j24798
$$ 1484646 1722541 2068023 2033928 2630722 2453782 3057360 3038777 2743553 2635174 2510376
10966B510376N9538n86584P2434l80353p2393J7815K32036p6505n3083j05679
$$ 2510376 2569914 1983330 2055764 1675411 1603018 1620833 1852869 1776364 1723281 1617602
10956A617602L27641K300m08132M7538l49396k96785K15834m72317j43741L6889
$$ 1617602 1945243 1947543 1539411 1586949 1237553 940768 1156602 684285 540544 577433
10946E77433k30375L11738B31605J29197j53443m5253L34905A82500J37085m7470
$$ 577433 347058 658796 231605 360802 207359 162106 497011 182500 319585 272115
10936B72115j18500a2907k31841F4420k4682N6107a08048k57592d4370A36641
$$ 272115 153615 -12907 -244748 64420 39738 95845 -108048 -365640 -44370 136641
10925a4221A48527e0969I1425a44419B19622J66737F5464J18220C9458b13692
$$ -14221 148527 -50969 91425 -144419 219622 386359 65464 183684 39458 -213692
10914a46891E9241c86018B45186b09501A66276a47460d6540A04593A1525e8471
$$ -146891 59241 -386018 245186 -209501 166276 -147460 -46540 104593 11525 -58471
10903e9487j9418m33612F0773h7688q4512D8435a35289M9246B4113r737a60444
$$ -59487 -78905 -512517 60773 -87688 -172200 48435 -135289 -86043 24113 14376 -160444
10891a13968j11169A48006a85079B32539a53567K5883A02675a79282h7167B67272
$$ -113968 -225137 148006 -185079 232539 -153567 -127684 102675 -179282 -87167 267272
10880A10109m1347g1703j7103G3192J13632d68468A420d08460J02553A59425a20138
$$ 110109 68762 -71703 -88806 73192 186824 -468468 1420 -408460 -305907 159425 -120138
10868a413k9737l83982A06205N1616J59497H1037L6847i0992l54461B71473a2551
$$ -1413 -31150 -415132 106205 157821 317318 81037 117884 -90992 -445453 271473 -12551
10856b32872O4138A48087b31248E2307c04985J20538i205A27401h7305H9866a99546
$$ -232872 -168734 148087 -231248 52307 -304985 -184447 -9205 127401 -87305 89866 -199546
10844c10280A70284g9472L1575A08109B2047f9338A28272C3411J68910k8578J2997
$$ -310280 170284 -79472 -47897 108109 22047 -69338 128272 33411 202321 173743 186740
10833A86740Q8355A03396b34321A09875b7642k94326A34707i6784a4322C8265
$$ 186740 275095 103396 -234321 109875 -27642 -321968 134707 -96784 -14322 38265
10822A40349e3671F5712i129l4797k52828J17449B03026J50988b80296R7281o576
$$ 140349 -53671 65712 -9129 -43926 -296754 -179305 203026 354014 -280296 -183015 -189591
10811a89591A94R2878D1366a52762K2747F8145b53766o0566o2897D6379j8677
$$ -189591 194 93072 41366 -152762 -130015 68145 -253766 -314332 -377229 46379 27702
10800B7702b26718D8101N3370j4101O8474K1205k3789a78762A51659A8178O2929
$$ 27702 -226718 48101 101471 87370 155844 177049 153260 -178762 151659 18178 81107
10789H1107a93909D55083a86616g7473a3453C3769P8336d20209a27864A76073
$$ 81107 -193909 455083 -186616 -77473 -13453 33769 112105 -420209 -127864 176073
10778H395J69425f6565r9688m9440A50807c14436D19953A8274J39826d4453I8822
$$ 8395 177820 -66565 -166253 -215693 150807 -314436 419953 18274 158100 -44453 98822
10766b56813G2766J16308a4630q6267j12600B3432K50359D8354d3913j4347F4079
$$ -256813 72766 189074 -14630 -100897 -213497 23432 273791 48354 -43913 -58260 64079
10754e3639j89096j05943C9328a97963e2000B27409a61320L3858H4424K79172
$$ -53639 -242735 -348678 39328 -197963 -52000 227409 -161320 -127462 84424 363596
10744C63596a28325C9767Q0849a81591r7505c3325H4061b61135H5241d7539B8837
$$ 363596 -128325 39767 120616 -181591 -279096 -33325 84061 -261135 85241 -47539 28837
10732a09157c9542m1012B46216j19447J95124i9992p0029C1369J1845c2500C24982
$$ -109157 -39542 -80554 246216 126769 321893 -99992 -170021 31369 43214 -32500 324982
10720a23395J1567I0379H444P9185J68846g7252B72430b4950k63891P0665m117
$$ -123395 -111828 90379 8444 87629 256475 -77252 272430 -24950 -288841 -218176 -222293
10709b22293h8026r2010E6463b74928A18614J22529b31726a08884j03227K6131
$$ -222293 -88026 -180036 56463 -274928 118614 241143 -231726 -108884 -212111 -185980
10699a85980j99010J30289A87003c13633A59075e39165h1905I1278F990m68i5498
$$ -185980 -384990 -254701 187003 -313633 159075 -539165 -81905 91278 6990 6522 -95498
10687F4987j7193a69792g6570q6496b2601k98082A02134J40593G892J28201a44278
$$ 64987 47794 -169792 -76570 -163066 -22601 -320683 102134 242727 7892 136093 -144278
10675b10498J4365j34403J47968j32142F6729J19669c31286O1482m6704K2330
$$ -210498 -196133 -330536 -182568 -314710 66729 186398 -331286 -269804 -316508 -294178
10665b94178a39602O9657j93254O7241d1003k61301j5802O0979F6378K29976A21447
$$ -294178 -139602 -69945 -263199 -195958 -41003 -302304 -318106 -257127 66378 296354 121447
10653a16044N8014K1611A11335a74486D599d97913B2521a55575c3498D2859N7322
$$ -116044 -58030 -36419 111335 -174486 4599 -497913 22521 -155575 -33498 42859 100181
10642A00181a99808r5178D0673e038j43325C5090a04953B9204g271A80762I107
$$ 100181 -199808 -294986 40673 -5038 -148363 35090 -104953 29204 -7271 180762 9107
10630B49224a02417k02278F5061J28467b61920i3149A6772a32202M5801J6140
$$ 249224 -102417 -304695 65061 193528 -261920 -93149 16772 -132202 -86401 -70261
10620g0261O727A99977a76046M3230B03710G3877a450j84631j17723C80781c57130
$$ -70261 -63534 199977 -176046 -132816 203710 73877 -1450 -186081 -303804 380781 -357130
10608d0976l5290m16818A48656c3701l04278A20428f5614j6586A4712g7757A17343
$$ -40976 -76266 -493084 148656 -33701 -337979 120428 -65614 -82200 14712 -77757 117343
10596h9922A94522d25803a87025D8748A1207c50947E5843b23377j15583c4876
$$ -89922 194522 -425803 -187025 48748 11207 -350947 55843 -223377 -338960 -34876
10585A14739a27188A86217a25261o9336g4540c4931H7449J0840a54680m4353D587
$$ 114739 -127188 186217 -125261 -194597 -74540 -34931 87449 98289 -154680 -199033 4587
10573a034j35549F7410R036b10802B68208E5765O6336O6016B3623A806L78584
$$ -1034 -136583 67410 76446 -210802 268208 55765 122101 188117 23623 1806 380390
10562C80390A4622c07367J29674B13515a19534A86343b78073E3241A8104a65694
$$ 380390 14622 -307367 -177693 213515 -119534 186343 -278073 53241 18104 -165694
10551A18280g7351j11182A83301c4789k75052a3785m5022A80670b93553Q6494
$$ 118280 -77351 -188533 183301 -34789 -309841 -13785 -58807 180670 -293553 -207059
10541b07059b5931C01425K95317a83720J8977I5933b02946n1022b3878l00820
$$ -207059 -25931 301425 596742 -183720 -164743 95933 -202946 -253968 -23878 -324698
10531c24698H5984Q4399c26428a04199E6354K4640j3820a94844G461J04066c97057
$$ -324698 85984 170383 -326428 -104199 56354 80994 67174 -194844 7461 111527 -397057
10519G6140a25821A61061g5569A20230b7845N047C7219J60985c54296A38048a35508
$$ 76140 -125821 161061 -75569 120230 -27845 -22798 37219 198204 -354296 138048 -135508
10507d3668l18897F2850a774n1833k1010B63602d00467A58072K00886a0227B301
$$ -43668 -362565 62850 -1774 -53607 -74617 263602 -400467 158072 358958 -10227 2301
10495B63878a95221P1292K7594c1440D9852b96082E4906R1105b0558j25056C18541
$$ 263878 -195221 -123929 -96335 -31440 49852 -296082 54906 146011 -20558 -145614 318541
10483B22965k7550n4980O05063B12248M70732B27490M67146A66731K0969a71454
$$ 222965 195415 140435 745498 212248 682980 227490 694636 166731 187700 -171454
10472g2160L3172k93910J36309P9949c2527B04744B2577M2184a66826P086b9522
$$ -72160 -38988 -332898 -196589 -116640 -32527 204744 22577 64761 -166826 -159740 -29522
10460b5771A9784J3522h8246p840B60905G4280c01286N9974B10351o719G6693
$$ -25771 19784 33306 -88246 -96086 260905 74280 -301286 -241312 210351 203632 76693
10448h1918q2424C6024b0418j54433C36031a15235A21596c21720K0137B7025b36791
$$ -81918 -164342 36024 -20418 -174851 336031 -115235 121596 -321720 -301583 27025 -236791
10436G1310L8798a61540C54915D5722a5504j10369A59849i0697F3547a6963l76278
$$ 71310 110108 -161540 354915 45722 -15504 -125873 159849 -90697 63547 -16963 -393241
10425c93241a46209B93660d8312l43723A04613n765a95480F8564c4036B92766
$$ -393241 -146209 293660 -48312 -392035 104613 98848 -195480 68564 -34036 292766
10414b29483f1149A85319c1216I1666c1435k70086B58984B0687i8738j32415b9626
$$ -229483 -61149 185319 -31216 91666 -31435 -301521 258984 20687 -98738 -231153 -29626
10402C1930b00319h450m39062J57356J8098d3600B26471b60774A69499J64464
$$ 31930 -200319 -8450 -447512 -290156 -272058 -43600 226471 -260774 169499 333963
10392C33963H7816L73417B11462b25475I6467J6412a20155A02770a37035L2762
$$ 333963 87816 461233 211462 -225475 96467 112879 -120155 102770 -137035 -104273
10382a04273J5383E4692Q0374K06070j2757J57806j96363E5486d4023A21008J15771
$$ -104273 -88890 54692 135066 341136 328379 486185 289822 55486 -44023 121008 236779
10371B36779j5219J4698f481B75777A32524O69649j74561k55732G2392K02578
$$ 236779 221560 236258 -6481 275777 132524 802173 627612 371880 72392 274970
10361B74970r5538M23126l8887k53200j1221A07333R8300N5628K18549A77515
$$ 274970 179432 602558 563671 310471 299250 107333 205633 261261 479810 177515
10350E03097j11174J20382B7038J82982J15453J34968j40674K66142A48318G3084
$$ 503097 391923 512305 27038 210020 325473 460441 319767 585909 148318 73084
10339a37753B38914j2975f5935A27795J67913G9695i805B78229o9531I3318h9247
$$ -137753 238914 225939 -65935 127795 295708 79695 -9805 278229 208698 93318 -89247
10327A53320c7574E4124J88265N50989G3174J2836J201B7665l414i55C25730h239
$$ 153320 -37574 54124 242389 793378 73174 86010 87211 27665 24251 -955 325730 -8239
10314a56058e0810B79613M2045n0266h9086m3730A7986c86714B23226b90054C2614
$$ -156058 -50810 279613 321658 271392 -89086 -132816 17986 -386714 223226 -290054 32614
10302H6822K81583A38145J19132p3589J5204o1845A2489J30081a02571B08459
$$ 86822 368405 138145 257277 183688 198892 137047 12489 142570 -102571 208459
10291B117b14796A74969l3353j0983J34043b70994A54182a63971m9442P0504A37025
$$ 2117 -214796 174969 141616 130633 264676 -270994 154182 -163971 -213413 -142909 137025
10279C9281c9471E657b58839d5072o7104B40436a0050A25186j7057b7316k37905
$$ 39281 -39471 5657 -258839 -45072 -112176 240436 -10050 125186 108129 -27316 -265221
10268b65221F3034L867J95335n4692A00377a51086C20535C407J8389a74537C08973
$$ -265221 63034 66901 262236 207544 100377 -151086 320535 3407 21796 -174537 308973
10256B84644D6614J45794n1128k6184c292m375j16955B26924r6148k8959g7936
$$ 284644 46614 192408 141280 115096 -3292 -7667 -124622 226924 130776 101817 -77936
10244c15146H7066a25577N9509p7987B31541A06668c6248m02274g9548R599C57641
$$ -315146 87066 -125577 -66068 -144055 231541 106668 -36248 -438522 -79548 -69949 357641
10232A54499m7161b00369A26232a54922A20494b81440O8996H8637i871C8691a00998
$$ 154499 107338 -200369 126232 -154922 120494 -281440 -212444 88637 -9871 38691 -100998
10220b35877J08244H8417h9071E3470a20969o4359A2492Q9894M5589c3702A3483
$$ -235877 -127633 88417 -89071 53470 -120969 -185328 12492 102386 147975 -33702 13483
10208c5754J5610k9076k70372A15416J09621H0506h1054k471l05468a55536c6392
$$ -35754 -20144 -49220 -319592 115416 225037 80506 -81054 -83525 -388993 -155536 -36392
10196A48166A8284N22J6967J32296i38A38475E8898c57981g9324A05346N036M3327
$$ 148166 18284 18806 35773 168069 -938 138475 58898 -357981 -79324 105346 110382 153709
10184A53709a79755h2468A3499g706B10060e57k79202a5964C06190A15388N2557
$$ 153709 -179755 -82468 13499 -7706 210060 -557 -279759 -15964 306190 115388 167945
10173A67945d3954B32083C604N9169A7461b79811i3810A5016a07170n1099j07599
$$ 167945 -43954 232083 3604 62773 17461 -279811 -93810 15016 -107170 -158269 -265868
10162b65868Q1263C8894b13735e0794J6072j54991j32379a56239A83081E8915
$$ -265868 -184605 38894 -213735 -50794 -34722 -189713 -322092 -156239 183081 58915
10151b43440a19820A11397a72194B4435b65399A02985J83721E8956f1312k38427
$$ -243440 -119820 111397 -172194 24435 -265399 102985 286706 58956 -61312 -299739
10141b99739A3983Q1192d2997j3688m9140q1982D4591J04465R4124a35946A38076
$$ -299739 13983 95175 -42997 -56685 -105825 -187807 44591 149056 243180 -135946 138076
10129F9223c34415B0899c86011C20936C7276c9149D2904A1684d9739k6649j32149
$$ 69223 -334415 20899 -386011 320936 37276 -39149 42904 11684 -49739 -76388 -208537
10118b08537M3588a9857l27560a01386A08108a5738j20759A12477P2896a5479
$$ -208537 -164949 -19857 -347417 -101386 108108 -15738 -136497 112477 185373 -15479
10107a50588C9201b92735j5219O9195J17623K0127d4774k30976E9093c02334f7554
$$ -150588 39201 -292735 -307954 -238759 -121136 -101009 -44774 -275750 59093 -302334 -67554
10095G5555J11623a33665H1632b7421q6971A09275l509a12791r5164C2429g9287
$$ 75555 187178 -133665 81632 -27421 -114392 109275 105766 -112791 -207955 32429 -79287
10083a94709G4663J50659A6705b14176h6682K2673B2960N5336m876L11731j77421
$$ -194709 74663 225322 16705 -214176 -86682 -64009 22960 78296 73420 385151 207730
10072B07730a69592m968Q4191o2181B47837a93792b5405A57300d24449a33905
$$ 207730 -169592 -174560 -90369 -152550 247837 -193792 -25405 157300 -424449 -133905
10061i5971B53048A02856J07210B4857i9102m0940c5307D01442d46633a59919
$$ -95971 253048 102856 210066 24857 -99102 -140042 -35307 401442 -446633 -159919
10050A99281b5123j19304M1016d554k19845b1966A82335d91328I8382D2487d77376
$$ 199281 -25123 -144427 -103411 -4554 -224399 -21966 182335 -491328 98382 42487 -477376
10038E1778m124H136a25189f1044j41700B67260c09521G1013a81570J1221A09368
$$ 51778 47654 8136 -125189 -61044 -202744 267260 -309521 71013 -181570 -170349 109368
10026f8590b1046C6695a54761p5382p1478F4722d0349k04988M7986j15102c2386
$$ -68590 -21046 36695 -154761 -230143 -301621 64722 -40349 -245337 -197351 -312453 -32386
10014a05951A74532b75732C82019a11066j23470E0868i2124b2350n81762A0607
$$ -105951 174532 -275732 382019 -111066 -234536 50868 -92124 -22350 -604112 10607
10003H7973K9020A0729J35104k1330c7659a3944G9850k625a66105R406j35385
$$ 87973 116993 10729 145833 124503 -37659 -13944 79850 77225 -166105 -156699 -292084
9992b92084E8424J4c70519h9962j76893A28975a49195k49335A70987q1953B5313
$$ -292084 58424 58438 -370519 -89962 -266855 128975 -149195 -398530 170987 89034 25313
9980d17344H6235b81115A42106A5588a71951r1840a22506D2812a40846O6624j51530
$$ -417344 86235 -281115 142106 15588 -171951 -263791 -122506 42812 -140846 -74222 -225752
9969b25752J04580E1703c8822j43311B14205b0775o1418l34482f0426C23166F9258
$$ -225752 -121172 51703 -38822 -182133 214205 -20775 -82193 -416675 -60426 323166 69258
9957A30267b17811R8689B32452k7453b35834C17916h0037B6121L66151b85567
$$ 130267 -217811 -119122 232452 204999 -235834 317916 -80037 26121 392272 -285567
9946b4832E0968d24540f4720j79473M7582Q3246B13707B1082J43498e4410A10759
$$ -24832 50968 -424540 -64720 -244193 -196611 -113365 213707 21082 164580 -54410 110759
9934a17138j2785j89082c8091j10754M993B2697i1187n115E8224d0919j50223
$$ -117138 -129923 -319005 -38091 -148845 -143852 22697 -91187 -96302 58224 -40919 -191142
9923a91142r073c5984p9439c7399B14731b09899A42082O4004A2435g3504l13163
$$ -191142 -200215 -35984 -115423 -37399 214731 -209899 142082 206086 12435 -73504 -386667
9912c86667E38313b11068d0767A73847K98528b38559A85547Q1552b8588k99404
$$ -386667 538313 -211068 -40767 173847 472375 -238559 185547 267099 -28588 -327992
9902c27992a18757l8766F5342e12156a00969B13093a06733A44069E1217J9096
$$ -327992 -118757 -157523 65342 -512156 -100969 213093 -106733 144069 51217 70313
9892G0313b40466c076A68651p1085A342a59701f3543E1628b39750A00029a18869
$$ 70313 -240466 -3076 168651 97566 1342 -159701 -63543 51628 -239750 100029 -118869
9880A80417a37841c071l7678B77763e04796e7458j76689B30169b65323O1023h2144
$$ 180417 -137841 -3071 -40749 277763 -504796 -57458 -234147 230169 -265323 -204300 -82144
9868a05891k06915E7587A3373R329c24868a6329j35933F0926b01577c3892k90581
$$ -105891 -312806 57587 13373 22702 -324868 -16329 -152262 60926 -201577 -33892 -324473
9857c24473R3180G5112J88580m9497q6405n7497N8952n8412L1050a59924f0862
$$ -324473 -231293 75112 263692 214195 127790 70293 129245 70833 101883 -159924 -60862
9845a85578A28383b43139I4956C1320d2446j51541b2855A71333N9064a75826f5177
$$ -185578 128383 -243139 94956 31320 -42446 -193987 -22855 171333 230397 -175826 -65177
9833b37657J03417N1066j59255H0064c2415j50083l2315A27335a67517B21746
$$ -237657 -134240 -83174 -242429 80064 -32415 -182498 -214813 127335 -167517 221746
9822a05806D08815b0998c453l64924J62390c376o8719A06322b24838a3713j7737
$$ -105806 408815 -20998 -3453 -368377 -205987 -3376 -72095 106322 -224838 -13713 -31450
9811c1450n4664A58727J44630A41069a09442a1162A71353R3570i9403j72017J5967
$$ -31450 -86114 158727 303357 141069 -109442 -11162 171353 264923 -99403 -271420 -255453
9800b55453A12187A7285e8239I9692b76822D5523i4256j07255e7879b775l8917
$$ -255453 112187 17285 -58239 99692 -276822 45523 -94256 -201511 -57879 -2775 -41692
9789d1692A38095h8808q323n1412B5823J86324l275a73105B2524q251e5544j19323
$$ -41692 138095 -88808 -97131 -148543 25823 212147 208872 -173105 22524 14273 -55544 -174867
9777a74867J0799N8345p9102O5543j8461e4549r0085J9976a5012j41237f48j00170
$$ -174867 -164068 -105723 -184825 -119282 -137743 -54549 -144634 -124658 -15012 -156249 -648 -100818
9765a00818b4830l01034R3922j57064h4648j69058a04911H1717d34900G3321a36880
$$ -100818 -24830 -325864 -231942 -389006 -84648 -253706 -104911 81717 -434900 73321 -136880
9753b62336B6746d9411D435K23228j8866G52c57501C9233a1367H6663M9426e8846
$$ -262336 26746 -49411 4435 227663 208797 752 -357501 39233 -11367 86663 136089 -58846
9740b31214G0421J80333I3962a86270b7734k4658n0854H9154a04293b585A15873
$$ -231214 70421 250754 93962 -186270 -27734 -52392 -103246 89154 -104293 -2585 115873
9728a1103j18739l2843b2707j81138A11732a73700o4544J06777l63270I9491a01814
$$ -11103 -129842 -162685 -22707 -203845 111732 -173700 -238244 -131467 -494737 99491 -101814
9716a35136N094d5738q792A29376F671c2133A70276l9343b43613d0463G7227b84463
$$ -135136 -130042 -45738 -54530 129376 6671 -32133 170276 130933 -243613 -40463 77227 -284463
9703a89151P6029D18060g4780o7070j18521K6736M6671A50435N1037a10579K8558
$$ -189151 -113122 418060 -74780 -141850 -260371 -233635 -186964 150435 201472 -110579 -82021
9692h2021c0904a2690I2427O0322b72978q4211e8793k74374G2157J01440Q1955
$$ -82021 -30904 -12690 92427 152749 -272978 -357189 -58793 -333167 72157 173597 255552
9681B55552A9767J69927a7427k35763q0880Q7098L8060A65336A7392J52730a10493
$$ 255552 19767 189694 -17427 -253190 -334070 -246972 -208912 165336 17392 170122 -110493
9669h2035j12785A52494n2274b77023a06645D1525a62409j48668A15554A7898
$$ -82035 -194820 152494 100220 -277023 -106645 41525 -162409 -311077 115554 17898
9658C1789a1790k7958j64857a7815A0109c14704G0696a62292A27760c60534I4640
$$ 31789 -11790 -39748 -204605 -17815 10109 -314704 70696 -162292 127760 -360534 94640
9646B72397b95644d1168E8232b13684A05296i7662j14791A2237b14903j56389
$$ 272397 -295644 -41168 58232 -213684 105296 -97662 -212453 12237 -214903 -371292
9636c71292O4465J39071N4763E9238a15830B4747M492a80475I8449M3236R1600
$$ -371292 -306827 -167756 -112993 59238 -115830 24747 29239 -180475 98449 141685 233285
9625B33285l4737a45320A07088i5797C4675i8312m2586k92449a45052o3803a200
$$ 233285 198548 -145320 107088 -95797 34675 -98312 -140898 -433347 -145052 -208855 -1200
9613a37154c862k42520P7292L4131j62211J16021A37742b95063F7160f6759l28684
$$ -137154 -3862 -246382 -169090 -134959 -297170 -181149 137742 -295063 67160 -66759 -395443
9602c95443a05897j34918B7261a43741E8335B362h3820B12880p4784b8433j8353
$$ -395443 -105897 -240815 27261 -143741 58335 2362 -83820 212880 138096 -28433 -46786
9591d6786j76801C65234e299k75702B30593b0665j15880C9036c42r0189j11014
$$ -46786 -223587 365234 -5299 -281001 230593 -20665 -136545 39036 -342 -90531 -201545
9580b01545h6030o9056D4710d52083d2654E0577K28665c1443j16564f0605B1645
$$ -201545 -86030 -155086 44710 -452083 -42654 50577 279242 -31443 -148007 -60605 21645
9568E5957k6442p409J2956b8483k74212B5466A684e84998b51863B14315b20098
$$ 55957 29515 22106 35062 -28483 -302695 25466 1684 -584998 -251863 214315 -220098
9556b91703D0018A4822g2482j10092O0143j02320f5643n06961e5841A9988J8167
$$ -291703 40018 14822 -72482 -182574 -122431 -224751 -65643 -572604 -55841 19988 38155
9545C8155e0959D82771a46009O3424H3338J48305K68313i5454e589j93381A01844
$$ 38155 -50959 482771 -146009 -82585 83338 231643 499956 -95454 -5589 -198970 101844
9533b9602j77556J2535B12b34780C1308a36029M554M4050j47361e3794b3492C8754
$$ -29602 -207158 -194623 212 -234780 31308 -136029 -131475 -87425 -234786 -53794 -23492 38754
9520a71740j77756h3914m2982b4397A95321m4643b07881g9901B59241d4717k75379
$$ -171740 -349496 -83914 -126896 -24397 195321 150678 -207881 -79901 259241 -44717 -320096
9509c20096a07544A04744c00162B05594j02476C868a89322P2538n3395g7866j00533
$$ -320096 -107544 104744 -300162 205594 103118 3868 -189322 -116784 -170179 -77866 -178399
9498a78399l1022m4035q0160D7707i0259o0451C6886a97416C30953D6123A0985
$$ -178399 -209421 -253456 -333616 47707 -90259 -150710 36886 -197416 330953 46123 10985
9486A49967a91171F6929a80977c3926m4705A41079c21089D8298b82533J22405
$$ 149967 -191171 66929 -180977 -33926 -78631 141079 -321089 48298 -282533 -160128
9476a60128L5581e9743B59930H5105b28754p1531l3523h5849j10588G3984a95667
$$ -160128 -124547 -59743 259930 85105 -228754 -300285 -333808 -85849 -196437 73984 -195667
9464A41091C729c80352J12380J7263b3292A1757b13912A9806K56635c5808l92673
$$ 141091 3729 -380352 -267972 -250709 -23292 11757 -213912 19806 276441 -35808 -428481
9453d28481J55902G0055a70358b5453k54287A023h7303M349A73398a14973k9735
$$ -428481 -272579 70055 -170358 -25453 -279740 1023 -87303 -82954 173398 -114973 -144708
9442a44708o2504j39844J65702h8480m85555b24915J02498p2737M6189j766j8029
$$ -144708 -207212 -347056 -181354 -88480 -574035 -224915 -122417 -195154 -148965 -150731 -168760
9431a68760A94811a44326I0950i7162l34223J46593j64539K21607p5863a44040
$$ -168760 194811 -144326 90950 -97162 -431385 -284792 -449331 -227724 -303587 -144040
9420b07378C22876j47405j6294c7636q0568a7944B32936a09639a4223A84426b4630
$$ -207378 322876 175471 159177 -37636 -118204 -17944 232936 -109639 -14223 184426 -24630
9408B59317a1599l11668J54886g4269j37109A08013A6944b28897A44111D0682
$$ 259317 -11599 -323267 -168381 -74269 -211378 108013 16944 -228897 144111 40682
9397E23835a15344j12465B76682a91324g40l1765q1665j33977I5450c25977d7814
$$ 523835 -115344 -227809 276682 -191324 -740 -32505 -114170 -248147 95450 -325977 -47814
9385b99613b8865D4628f9769C39223g6315m6513A08448b14222j13643a3364n0696
$$ -299613 -28865 44628 -69769 339223 -76315 -122828 108448 -214222 -327865 -13364 -64060
9374f4060D5356c99175a81706d0944j49683H314f4072B23201D43g6179A88527
$$ -64060 45356 -399175 -181706 -40944 -190627 8314 -64072 223201 443 -76179 188527
9362H0118a44648l1682a4301A34873a06243m1335k5428O5372N0826j02807p4169
$$ 80118 -144648 -176330 -14301 134873 -106243 -147578 -173006 -107634 -56808 -159615 -233784
9351b33784B3508h1281j65646j8847o0734a58420P8641J3569p6685f6130j93620
$$ -233784 23508 -81281 -246927 -265774 -326508 -158420 -79779 -66210 -142895 -66130 -259750
9340b59750b0100A58280O9516d0893q1684p8019B04695J70215j37349a38863k5936
$$ -259750 -20100 158280 227796 -40893 -122577 -200596 204695 374910 237561 -138863 -164799
9329a64799G6988M930K40878a20862b8375A37079B4706c70126J49476J5905g8753
$$ -164799 76988 81918 322796 -120862 -28375 137079 24706 -370126 -220650 -204745 -78753
9317i7164k8778j71441Q4208h26l89555J74204r6059a32187l21900J92877J2107
$$ -97164 -125942 -297383 -213175 -826 -390381 -216177 -312236 -132187 -454087 -261210 -249103
9306b49103C4241c28494G1471M8811a55823B11751c01354k8817a29893A1676K84623
$$ -249103 34241 -328494 71471 120282 -155823 211751 -301354 -330171 -129893 11676 296299
9295B96299i7806B99421a89424c4873l8018a33D1753j8200h966j57786A66453
$$ 296299 -97806 299421 -189424 -34873 -72891 -133 41753 23553 -8966 -166752 166453
9283c67743A98058a23854k25564J06692m1050B25696G4832a55360M3603G9922
$$ -367743 198058 -123854 -349418 -242726 -283776 225696 74832 -155360 -111757 79922
9272b45564k4035I4954a4415n6149j81706B31981a86473k17559A54629B9369c8392
$$ -245564 -269599 94954 -14415 -70564 -252270 231981 -186473 -404032 154629 29369 -38392
9260A34426Q2272i8589j07463I1313L3607E2243a7440a491l10681B4954c0986
$$ 134426 216698 -98589 -206052 91313 124920 52243 -17440 -1491 -312172 24954 -30986
9248c59740J51953k0729F7819a33359r1977m8581q2892B493h8613B76343a90791
$$ -359740 -207787 -228516 67819 -133359 -225336 -273917 -356809 2493 -88613 276343 -190791
9236A70461a62475g3536L2470p2937j82594A80282J8629b05153D0634a30558H743
$$ 170461 -162475 -73536 -41066 -114003 -296597 180282 198911 -205153 40634 -130558 8743
9224C27060d9151B4937d507r9783A58454J9683q2700b77149B997b29087A82686
$$ 327060 -49151 24937 -4507 -104290 158454 178137 95437 -277149 2997 -229087 182686
9212d7239B0004a13548B8533a5906A07134D059J00792E146K46641b77210a21639
$$ -47239 20004 -113548 28533 -15906 107134 4059 104851 5146 251787 -277210 -121639
9200A50175c03698a10081j54517B88997a7348k37452b7726k14482R8004K83A52919
$$ 150175 -303698 -110081 -264598 288997 -17348 -254800 -27726 -242208 -144204 -143921 152919
9188a1584j92075A14906b37165B4587h7024L8219m1112j90780i1737j81914i2953
$$ -11584 -203659 114906 -237165 24587 -87024 -48805 -89917 -280697 -91737 -273651 -92953
9176E8532R5786d7707D7289a67598j95250b9924k00477k57787F2989a89571D4455
$$ 58532 154318 -47707 47289 -167598 -362848 -29924 -230401 -488188 62989 -189571 44455
9164A5933h6157K9770H9121e4024o4594B41458G1544h5561G7535A6168b06404
$$ 15933 -86157 -56387 89121 -54024 -118618 241458 71544 -85561 77535 16168 -206404
9152A50583c18615I8060J19675a14923b7317o9414A04271b31853d2055j43373
$$ 150583 -318615 98060 217735 -114923 -27317 -96731 104271 -231853 -42055 -185428
9142a85428R0929g890A64421E8507R0747B5641b85262n348b0711k88563n5467
$$ -185428 -94499 -7890 164421 58507 149254 25641 -285262 -290610 -20711 -309274 -364741
9131c64741A63281a56989G077b28581A68213e019j74420j009B03035f4114b8036
$$ -364741 163281 -156989 7077 -228581 168213 -5019 -179439 -180448 203035 -64114 -28036
9119A48216a29902j59500A5096M2744k7031a8095C5234b14725I8277a4699I2672
$$ 148216 -129902 -289402 15096 57840 30809 -18095 35234 -214725 98277 -14699 92672
9107C4374a43066F2807b78849B63092d87319b31063i6010j04267M251F3750d8518
$$ 34374 -143066 62807 -278849 263092 -487319 -231063 -96010 -200277 -196026 63750 -48518
9095b96033f6000j3758A0310b42277n7766C28217a0399l38332e0610B173i1832
$$ -296033 -66000 -79758 10310 -242277 -300043 328217 -10399 -348731 -50610 2173 -91832
9083C594d8290j8726K0762j63414G5079g2504k53863E0931P1229a71302C07499
$$ 3594 -48290 -67016 -46254 -209668 75079 -72504 -326367 50931 122160 -171302 307499
9071C1823J39462b39705e6392A41945a26413c2916j40400h5163j07095B63301
$$ 31823 171285 -239705 -56392 141945 -126413 -32916 -173316 -85163 -192258 263301
9060f9458A06525a17128K253j73593E24689D8552d69076F2659h3504L588A60070
$$ -69458 106525 -117128 -114875 -288468 524689 48552 -469076 62659 -83504 -79916 160070
9048a87540E2472a15192A32802b2782r6404J9527l4519k0403N0090j4682j42090
$$ -187540 52472 -115192 132802 -22782 -119186 -99659 -134178 -154581 -104491 -119173 -261263
9037b61263P9418M3427d5266C0239E015c4662k76133d857A24603L9638d52548
$$ -261263 -181845 -138418 -45266 30239 5015 -34662 -310795 -4857 124603 164241 -452548
9025h7661j21013G549f683j00397R200j10580B990M7384d65630B3343a90834G5897
$$ -87661 -208674 7549 -6683 -107080 -97880 -208460 2990 50374 -465630 23343 -190834 75897
9012E860J67185d5105g846j51310j91543a66978j0873A88474r2722m4820J05471
$$ 5860 173045 -45105 -7846 -159156 -350699 -166978 -177851 188474 95752 50932 156403
9001A56403E6799L622d09919c0100E702h8044A81321F982i7546j03943E551L40838
$$ 156403 56799 60421 -409919 -30100 5702 -88044 181321 6982 -97546 -201489 5551 346389
8989C46389m9505E9532a01495c3830C11262A00724b98258g7284K2827b1693l48445
$$ 346389 296884 59532 -101495 -33830 311262 100724 -298258 -77284 -54457 -21693 -370138
8978c70138A33279a92039j56479b7540A14033j5367a5164k31478A96156C9841
$$ -370138 133279 -192039 -348518 -27540 114033 98666 -15164 -246642 196156 39841
8967a21778m8351M8189O76j52118g9887H4315b83253a10910C9518j7082b788k00194
$$ -121778 -170129 -121940 -121264 -273382 -79887 84315 -283253 -110910 39518 22436 -2788 -202982
8955b02982B39230F2379a47790r6179B21376D0785b43462H1273a26051I7485K70460
$$ -202982 239230 62379 -147790 -243969 221376 40785 -243462 81273 -126051 97485 367945
8944C67945G306K3738K6652b05478j74159e9904D3658i4271q2482g2113D56927
$$ 367945 7306 31044 57696 -205478 -379637 -59904 43658 -94271 -176753 -72113 456927
8932e3707F6822b86651a22577A33969a49239B18638A01266K18253R0565J231829
$$ -53707 66822 -286651 -122577 133969 -149239 218638 101266 319519 410084 1641913
8922A641913L030775M028145C069813F65958k64040j59666E502a2789j80948A87458
$$ 1641913 4672688 8700833 3069813 665958 401918 242252 5502 -12789 -193737 187458
8911a54977P0962L4308A42411J4903J74562d3565r8070B3358a55130A9591c35066
$$ -154977 -84015 -49707 142411 157314 331876 -43565 -141635 23358 -155130 19591 -335066
8899b36647J09876l0574m6028j39474C48085D6514K28293a71462M4179A64252
$$ -236647 -126771 -157345 -203373 -342847 348085 46514 274807 -171462 -127283 164252
8888a95211G3734P5355b40946B65062B3658O5405m365e15504G2109a49349D9123
$$ -195211 73734 149089 -240946 265062 23658 89063 84698 -515504 72109 -149349 49123
8876d5264j76392a02812l2426a076G1455K47981G8887d5063A6068f0346A27677
$$ -45264 -221656 -102812 -135238 -1076 71455 319436 78887 -45063 16068 -60346 127677
$$ [...]
##END NTUPLES=NMR SPECTRUM
##END=
