
##TITLE=AC1244__6673806_yxZqgxz7Om
##JCAMPDX= 6.0         $$ Bruker NMR JCAMP-DX V2.0
##DATA TYPE= NMR SPECTRUM
##DATA CLASS= NTUPLES
##ORIGIN= BRUKER
##OWNER= Administrator
$$ 1.72 TOPSPIN		Version 2.1
$$ 2012-12-12 02:01:45.432 -0500  Administrator@X
$$ Compression mode = diff/dup
##.OBSERVE FREQUENCY= 400.02188249412
##.OBSERVE NUCLEUS= ^1H
##.ACQUISITION MODE= SIMULTANEOUS (DQD)
##.ACQUISITION SCHEME= undefined
##.AVERAGES= 64
##.DIGITISER RES= 22
##SPECTROMETER/DATA SYSTEM= spect
##.PULSE SEQUENCE= noesygpps1d.comp
##.SOLVENT NAME= COFFEE_meoh
##.SHIFT REFERENCE= INTERNAL, COFFEE_meoh, 1, 14.96108
##AUDIT TRAIL= $$ (NUMBER, WHEN, WHO, WHERE, PROCESS, VERSION, WHAT)
$$ ##TITLE= Audit trail, TOPSPIN		Version 2.1
$$ ##JCAMPDX= 5.01
$$ ##ORIGIN= Bruker BioSpin GmbH
$$ ##OWNER= Administrator
$$ $$ E:\/data/COFFEE/nmr/AC1244__6673806_yxZqgxz7Om/22/pdata/1/auditp.txt
$$ ##AUDIT TRAIL=  $$ (NUMBER, WHEN, WHO, WHERE, PROCESS, VERSION, WHAT)
(   1,<2012-12-12 02:01:39.370 -0500>,<Administrator>,<X>,<go>,<TOPSPIN 2.1>,
      <created by zg
	started at 2012-12-12 01:50:09.429 -0500,
	POWCHK enabled, PULCHK disabled,
       configuration hash MD5:
       86 BA 57 50 F2 9D 5C 9B 26 00 A9 28 5F 66 2E 89
       data hash MD5: 64K
       DE D4 91 1D 52 36 A8 DC 7A 45 26 F1 8F AC 35 F9>)
(   2,<2012-12-12 02:01:42.510 -0500>,<Administrator>,<X>,<proc1d>,<TOPSPIN 2.1>,
      <Start of raw data processing
       efp LB = 0.3 FT_mod = 6 PKNL = 1 PHC0 = 0 PHC1 = 0 SI = 128K 
       data hash MD5: 128K
       A5 59 0E 2D D2 A6 79 CD 67 50 F1 0D 9E FC B6 8A>)
(   3,<2012-12-12 02:01:43.651 -0500>,<Administrator>,<X>,<proc1d>,<TOPSPIN 2.1>,
      <pk PHC0 = -80.98022 PHC1 = 0 
       data hash MD5: 128K
       5F 22 A8 29 94 64 61 BD 97 0D F2 42 B5 D8 82 D9>)
(   4,<2012-12-12 02:01:44.401 -0500>,<Administrator>,<X>,<proc1d>,<TOPSPIN 2.1>,
      <abs ABSG = 1 
       data hash MD5: 128K
       28 3D 91 E3 08 C3 4F 5B BA 86 8F 2A C3 F2 86 BE>)
(   5,<2012-12-12 02:01:44.573 -0500>,<Administrator>,<X>,<proc1d>,<TOPSPIN 2.1>,
      <abs ABSG = 2 
       data hash MD5: 128K
       50 9B DF F1 ED 13 3E 06 B0 88 B7 FC AB 46 FE 24>)
(   6,<2012-12-12 02:01:44.745 -0500>,<Administrator>,<X>,<proc1d>,<TOPSPIN 2.1>,
      <abs ABSG = 3 
       data hash MD5: 128K
       00 A0 CF 46 C2 4A 72 5C 77 D7 49 B6 1E 04 51 AF>)
(   7,<2012-12-12 02:01:44.932 -0500>,<Administrator>,<X>,<proc1d>,<TOPSPIN 2.1>,
      <abs ABSG = 4 
       data hash MD5: 128K
       7C A9 C5 7A 75 F9 80 92 D9 1B 46 3F 96 3D 72 99>)
(   8,<2012-12-12 02:01:45.104 -0500>,<Administrator>,<X>,<proc1d>,<TOPSPIN 2.1>,
      <abs ABSG = 5 
       data hash MD5: 128K
       E0 FC 5E C7 B2 55 4C A1 77 5A 73 0F A1 5D 7E 75>)
$$ ##END=
$$ 
$$ $$ hash MD5
$$ $$ E6 1D C7 EA C1 9C A8 85 AF FB 13 A1 81 15 72 AD
##$RELAX= 
##$RELAX= 
##$RELAX= 
##$RELAX= 
##$RELAX= 
##$RELAX= 
##$RELAX= 
##$RELAX= 
##$RELAX= 
$$ Bruker specific parameters
$$ --------------------------
##$DU= <E:\>
##$EXPNO= 22
$$ [...]
##$TP07= 0
##$TPNAME0= <>
##$TPNAME1= <>
##$TPNAME2= <>
##$TPNAME3= <>
##$TPNAME4= <>
##$TPNAME5= <>
##$TPNAME6= <>
##$TPNAME7= <>
##$TPOAL= (0..7)
0.5 0.5 0.5 0.5 0.5 0.5 0.5 0.5
##$TPOFFS= (0..7)
0 0 0 0 0 0 0 0
##$TUNHIN= 0
##$TUNHOUT= 0
##$TUNXOUT= 0
##$USERA1= <user>
##$USERA2= <user>
##$USERA3= <user>
##$USERA4= <user>
##$USERA5= <user>
##$V9= 5
##$VALIST= <valist>
##$VCLIST= <CCCCCCCCCCCCCCC>
##$VD= 0
##$VDLIST= <DDDDDDDDDDDDDDD>
##$VPLIST= <PPPPPPPPPPPPPPP>
##$VTLIST= <TTTTTTTTTTTTTTT>
##$WBST= 2048
##$WBSW= 25
##$XGAIN= (0..3)
0 0 0 0
##$XL= 0
##$YL= 0
##$YMAX_a= 6170295
##$YMIN_a= -13222855
##$ZGOPTNS= <>
##$ZL1= 120
##$ZL2= 120
##$ZL3= 120
##$ZL4= 120
##$ABSF1= 14.96108
##$ABSF2= -5.597102
##$ABSG= 5
##$ABSL= 3
##$ALPHA= 0
##$AQORDER= 0
##$ASSFAC= 0
##$ASSFACI= 0
##$ASSFACX= 0
##$ASSWID= 0
##$AUNMP= <proc_prof1d_extract.lims>
##$AXLEFT= 0
##$AXNAME= <>
##$AXNUC= <1H>
##$AXRIGHT= 0
##$AXTYPE= 0
##$AXUNIT= <>
##$AZFE= 0.1
##$AZFW= 0.1
##$BCFW= 0
##$BC_mod= 0
##$BYTORDP= 0
##$COROFFS= 0
##$CY= 15
##$DATMOD= 1
##$DC= 0
##$DFILT= <>
##$DTYPP= 0
##$F1P= 0
##$F2P= 0
##$FCOR= 0.5
##$FTSIZE= 131072
##$FT_mod= 6
##$GAMMA= 0
##$GB= 0
##$INTBC= 1
##$INTSCL= 1
##$ISEN= 128
##$LB= 0.3
##$LEV0= 0
##$LPBIN= 0
##$MAXI= 10000
##$MC2= 0
##$MEAN= 0
##$ME_mod= 0
##$MI= 0
##$NCOEF= 0
##$NC_proc= -2
##$NLEV= 6
##$NOISF1= 0
##$NOISF2= 0
##$NSP= 0
##$NTH_PI= 0
##$NZP= 0
##$OFFSET= 14.96108
##$PC= 1
##$PHC0= -80.98022
##$PHC1= 0
##$PH_mod= 1
##$PKNL= yes
##$PPARMOD= 0
##$PPDIAG= 0
##$PPIPTYP= 0
##$PPMPNUM= 2147483647
##$PPRESOL= 1
##$PSCAL= 4
##$PSIGN= 0
##$PYNMP= <proc.py>
##$REVERSE= no
##$SF= 400.020009604383
##$SI= 131072
##$SIGF1= 0
##$SIGF2= 0
##$SINO= 400
##$SIOLD= 131072
##$SPECTYP= <>
##$SREGLST= <1H.CDCl3>
##$SSB= 0
##$STSI= 131072
##$STSR= 0
##$SW_p= 8223.68421052631
##$SYMM= 0
##$S_DEV= 0
##$TDeff= 65536
##$TDoff= 0
##$TI= <>
##$TILT= no
##$TM1= 0
##$TM2= 0
##$TOPLEV= 0
##$USERP1= <user>
##$USERP2= <user>
##$USERP3= <user>
##$USERP4= <user>
##$USERP5= <user>
##$WDW= 1
##$XDIM= 131072
##$YMAX_p= 482337132
##$YMIN_p= -12046
##$CURPLOT= <Network HP LaserJet P1505>
##$CURPRIN= <$Network HP LaserJet P1505>
##$DFORMAT= <normdp>
##$LAYOUT= <+/1D_H.xwp>
##$LFORMAT= <normlp>
##$PFORMAT= <normpl>
##$SURQMSG= 1
$$ End of Bruker specific parameters
$$ ---------------------------------
##NTUPLES= NMR SPECTRUM
##VAR_NAME=  FREQUENCY,     SPECTRUM/REAL,   SPECTRUM/IMAG
##SYMBOL=    X,             R,               I
##VAR_TYPE=  INDEPENDENT,   DEPENDENT,       DEPENDENT
##VAR_FORM=  AFFN,          ASDF,            ASDF
##VAR_DIM=   131072,        131072,          131072
##UNITS=     HZ,            ARBITRARY UNITS, ARBITRARY UNITS
##FACTOR=    0.0627417313425164, 1,          1
##FIRST=     8223.62146879497, 2241,         -62663
##LAST=      0,             3479,            -62494
##MIN=       0,             -12046,          0
##MAX=       8223.62146879497, 482337132,    0
$$ Real data points
##PAGE= N=1
##DATA TABLE= (X++(R..R)), XYDATA
$$ [...]
67827 87784 89950 92165 94340 96945 99867 102247 103684 104814 106382 108407 110588 112769 114531 115019 113901
67812 113901 111988 110180 108138 104763 99870 94705 90829 88963 88829 89487 89767 88961 87340 85774 84818
67797 84818 84385 84176 84043 83927 83841 83898 84043 83823 82838 81365 80079 79106 77848 75893 73708 72176 71735 72105
67779 72105 72602 72627 72120 71641 71722 72136 72143 71559 71128 71621 72983 74652 76331 78056 79786 81381 82898 84506
67761 84506 86157 87608 88764 89739 90593 91204 91388 91061 90321 89507 89038 88991 88914 88291 87130 85923 85086 84681
67743 84681 84653 85034 85824 86773 87432 87378 86428 84757 82807 80963 79266 77486 75512 73583 72146 71482 71446
67726 71446 71543 71394 71134 71190 71591 71767 71277 70518 70322 70832 71240 70735 69421 68103 67445 67534 68027 68454 68518 68380
67706 68380 68575 69380 70323 70545 69663 68108 66691 66037 66385 67573 69119 70470 71278 71336 70402 68497 66383
67689 66383 65263 65697 67077 68376 69139 69469 69405 68801 67753 66744 66303 66758 68153 70142 72072 73507
67673 73507 74660 75988 77514 78914 80150 81526 83096 84522 85563 86296 86806 87158 87678 88678 89747
67658 89747 89959 89053 87776 86810 86040 85339 85282 86291 87570 87829 86818 85379 84135 82935 81544 80108
67642 80108 78816 77721 77010 76900 77178 77367 77423 77746 78460 79237 79906 80625 81338 81659 81565 81644 82421 83851 85670
67623 85670 87650 89300 89942 89510 88816 88601 88747 88788 88736 88945 89555 90514 91791 93130 93940 94002 93968 94610 95786
67604 95786 96691 96854 96313 95040 92966 90557 88662 87578 86811 85896 84974 84352 83920 83328 82466 81547 80883
67587 80883 80704 80997 81421 81563 81334 80939 80400 79372 77534 75005 72357 70329 69440 69554 69800 69300 68064
67570 68064 66956 66695 67177 67834 68321 68620 68852 69257 70127 71431 72646 73280 73482 73777 74246 74312 73446 71842
67552 71842 70271 69419 69475 70159 70983 71573 71945 72390 72995 73392 73273 72976 73108 73505 73122 71311 68846 67099
67534 67099 66516 66515 66724 67456 68795 70054 70643 70845 71199 71633 71910 72451 73825 75561 76355 75619 74116 72875
67516 72875 72111 71488 70889 70446 70159 69894 69654 69552 69571 69521 69220 68692 68323 68680 69913 71396 72310 72540 72600
67497 72600 72754 72746 72498 72398 72638 72848 72749 72663 72943 73404 73831 74565 75913 77312 77754 76922 75318 73502 71844
67478 71844 70767 70420 70105 68883 66902 65400 65155 65643 65951 65800 65314 64575 63999 64497 66454 68941 70685
67461 70685 71487 71965 72211 71709 70603 70028 70717 71970 72497 71927 71069 70924 71738 72794 72919 71436 68948
67444 68948 66990 66722 68107 70472 73404 76707 79823 81915 82598 82248 81555 81006 80761 80667 80312 79383 78069
67427 78069 76958 76435 76307 76072 75401 74383 73478 73222 73763 74633 75098 74761 73752 72458 71311 70691 70689 70964
67409 70964 71147 71344 71867 72543 72813 72629 72683 73431 74416 74975 75229 75806 76863 77914 78550 78816 78893 78790 78436
67390 78436 77820 77090 76654 76917 77597 77638 76354 74472 73376 73400 73611 73338 73012 73120 73205 72626 71743 71559 72388
67371 72388 73596 74495 74805 74342 73047 71540 70923 71649 73020 74162 75071 76269 77791 79129 80052 80771
67355 80771 81220 80839 79476 78032 77644 78402 79407 80047 80625 81584 82770 83886 85218 87181 89289 90302
67339 90302 89661 88268 87511 87859 88762 89620 90341 91026 91667 92328 93265 94566 95827 96454 96244 95511 94722 94242
67321 94242 94322 95022 95974 96446 95896 94405 92481 90582 89044 88247 88427 89271 90090 90576 91067 91906 92964 94088
67303 94088 95607 97830 100188 101529 101341 100266 99288 98849 98850 99081 99336 99383 99107 98558 97721 96522 95191 94316
67285 94316 94248 94684 95115 95468 95995 96712 97338 97757 98184 98856 99767 100755 101600 102064 102115 102190 102991 104847 107329
67266 107329 109567 110852 110944 110026 108579 107269 106658 106727 106739 105898 104320 103132 103281 104467 105604 106223 106758
67249 106758 107398 107412 106122 104024 102363 101841 102250 103094 103925 104284 104056 103914 104710 106286 107529 107822 107786 108222
67231 108222 108956 109317 109333 109693 110655 111597 111822 111375 110903 110945 111558 112474 113440 114398 115373 116278 116947 117363 117700
67212 117700 118057 118337 118472 118598 118831 119049 119075 118978 118944 119003 119123 119471 120245 121217 121816 121812 121665 121973 122686 123111 122676
67191 122676 121525 120334 119703 119765 120267 120781 120854 120241 119245 118716 119355 120958 122574 123529 124051 124744 125765 126786
67173 126786 127557 128084 128326 128109 127455 126738 126424 126789 127871 129409 130857 131792 132383 133119 133944 134072 133009
67156 133009 131431 130616 131128 132445 133779 134805 135588 136285 137108 138183 139155 139272 138217 136661 135612 135383
67140 135383 135536 135725 136082 136694 137278 137688 138401 139991 142261 144298 145453 145928 146359 147116 148181 149433 150776
67123 150776 152062 153122 153908 154473 154811 154844 154631 154545 155156 156821 159343 162026 164139 165359 165854 166052 166375
67106 166375 166980 167603 167804 167568 167546 168371 169805 171018 171771 172786 174657 176892 178515 179277 179681 180010 180045
67089 180045 179829 180048 181333 183515 185849 187681 188745 189140 189329 189934 191227 192896 194506 196014 197646
67074 197646 199426 201052 202154 202536 202333 202101 202535 203830 205490 206968 208325 209995 212140 214565 217082
67059 217082 219514 221444 222496 222949 223673 225243 227411 229526 231204 232498 233738 235319 237433 239900 242444
67044 242444 245091 247975 250744 252705 253714 254476 255643 257065 258318 259559 261327 263689 266114 268190
67030 268190 270071 272184 274773 277697 280453 282503 283895 285386 287600 290206 292437 294306 296654 299853
67016 299853 303145 305685 307791 310546 314381 318573 322240 325394 328793 332897 337245 340909 343497 345602
67002 345602 348258 352044 356771 361869 366883 371603 375993 380088 383936 387602 391326 395546 400534 405981
66988 405981 411072 415035 417597 419197 420986 424393 430101 437370 444736 451432 457746 464061 470194 475936
66974 475936 481601 487564 493716 499904 506518 513987 521894 529281 535853 542270 549192 556598 564227 572189
66960 572189 580752 589825 599007 608044 617001 626051 635295 644835 654905 665804 677548 689613 701241
66947 701241 712171 722915 734162 746155 758896 772608 787415 802706 817445 831311 845051
66936 845051 859515 874758 890327 905975 921728 937580 953549 969904 986944 1004661 1022886
66925 1022886 1041669 1061234 1081630 1102710 1124423 1146789 1169540 1192047 1213829 1235073 1256591
66914 1256591 1279207 1303174 1328132 1353702 1380066 1407775 1436971 1466982 1496827 1526004 1554707
66903 1554707 1583497 1612924 1643210 1674037 1704784 1735236 1765923 1797515 1830033 1862916 1895704
66892 1895704 1928269 1960506 1992271 2023666 2054997 2086326 2117418 2148145 2178503 2208124 2236293
66881 2236293 2262850 2288660 2314735 2341060 2366662 2390581 2412302 2431495 2448034 2462392 2475454
66870 2475454 2487573 2498139 2506357 2512185 2516260 2519162 2521028 2521622 2520344 2516286 2508892 2498729 2487252
66857 2487252 2475457 2462938 2448521 2431674 2412982 2393305 2372783 2350758 2326440 2299519 2270397
66846 2270397 2240123 2209987 2180796 2152321 2123564 2093660 2062527 2030640 1998436 1966099 1933727
66835 1933727 1901356 1868790 1835800 1802638 1770080 1738639 1707885 1676932 1645528 1614271 1583672
66824 1583672 1553459 1523096 1492629 1462563 1433028 1403565 1373899 1344551 1316423 1289878 1264436
66813 1264436 1239350 1214339 1189815 1166440 1144414 1123150 1101681 1079458 1056777 1034470 1013263
66802 1013263 993427 974829 957131 939955 923036 906304 889779 873408 857033 840560 824117
66791 824117 808002 792492 777754 763858 750697 737783 724343 709981 695293 681457 668989
66780 668989 657203 645223 633249 622296 612737 603766 594491 585027 576063 567715 559367 550517 541278
66767 541278 531935 522421 512479 502218 492343 483788 477027 471659 466715 461474 455899 450225 444382 438096
66753 438096 431416 424760 418444 412448 406678 401106 395550 389634 383226 376744 370823 365721 361164 356647
66739 356647 351811 346667 341600 337075 333240 329880 326795 324035 321668 319497 317190 314609 311809 308808
66725 308808 305565 302144 298707 295294 291743 287872 283678 279315 274952 270685 266572 262757 259499 256953
66711 256953 254893 252830 250495 248085 245886 243821 241581 239126 236796 234926 233541 232415 231196 229475
66697 229475 226969 223760 220217 216705 213524 211089 209729 209135 208351 206673 204395 202349 200877 199560 197870
66682 197870 195724 193400 191299 189849 189255 189167 188823 187672 185675 183024 179964 176991 174729 173243 171852
66667 171852 170058 168337 167490 167408 167159 166222 164943 163692 162304 160669 159236 158394 157856 157220 156731 156840 157200
66650 157200 156876 155531 153767 152226 150957 149864 149096 148609 147803 146104 143687 141258 139366 138267 138145
66635 138145 138841 139488 139068 137554 136028 135441 135587 135605 135166 134668 134390 133946 132785 130933 128985 127494 126605
66618 126605 126201 126145 126282 126397 126284 125829 124985 123777 122422 121309 120705 120498 120339 119994 119429 118633 117552 116285
66600 116285 115221 114827 115268 116181 116852 116708 115754 114476 113256 112067 110884 110112 110144 110581 110458 109442 108322
66583 108322 107945 108065 107794 107010 106650 107467 109006 110096 110066 109168 108050 107144 106510 105942 105140 104039 103020
66566 103020 102613 102842 103035 102490 101279 100196 99904 100307 100772 100765 100128 98934 97359 95720 94426 93764 93770 94277
66548 94277 95038 95815 96482 97066 97619 98081 98358 98457 98414 98134 97502 96627 95771 95033 94313 93566 92836 91998 90836
66529 90836 89500 88580 88478 88975 89656 90431 91265 91635 90835 88898 86740 85233 84487 84215 84475 85580 87327
66512 87327 88780 89118 88512 87861 87652 87455 86755 85895 85677 86141 86362 85600 84197 83051 82646 82865 83363 83680
66494 83680 83297 82093 80622 79563 79078 79014 79400 80214 80913 80845 80076 79210 78504 77800 77260 77391 78171 78879 79079
66475 79079 79135 79411 79597 79271 78642 78226 78136 78135 78067 77815 77183 76248 75547 75482 75792 75954 75801 75367 74596 73754 73722
66454 73722 75100 77166 78462 78416 77776 77448 77582 77933 78443 79130 79799 80173 80095 79520 78593 77780 77567 77901 78280
66435 78280 78454 78645 78994 79221 79060 78667 78358 78211 78144 78118 78059 77827 77450 77090 76624 75604 73896 72107 71039
66416 71039 70950 71562 72550 73650 74511 74882 74926 74982 75051 74819 74202 73568 73342 73611 74214 74938 75543 75778 75535 74922
66396 74922 74089 73063 71888 70861 70377 70477 70681 70475 69950 69745 70274 71233 72064 72712 73611 74939 76287
66379 76287 77147 77484 77630 77785 77763 77187 75856 74012 72246 71014 70265 69744 69597 70392 72400 75091 77475
66362 77475 78764 78677 77446 75758 74412 73733 73391 72943 72410 72156 72381 72939 73530 73894 73963 74009 74495 75587
66344 75587 76910 77897 78255 77982 77228 76364 75935 76164 76654 76873 76842 77025 77614 78265 78485 78042 77000 75635
66326 75635 74346 73437 73040 73275 74246 75623 76547 76329 75121 73553 71980 70628 70148 71217 73475 75602
66310 75602 76726 77138 77368 77294 76662 75908 75736 76192 76787 77328 78001 78712 79075 79133 79467 80257 80767 80191 78765
66291 78765 77553 77244 77539 77808 77965 78451 79514 80812 81734 81920 81382 80307 78928 77500 76227 75140
66275 75140 74199 73510 73299 73614 74181 74628 74811 74939 75372 76277 77325 77827 77383 76408 75778 75856 76077 75675 74622
66256 74622 73666 73493 74119 75078 75967 76687 77274 77694 77865 77816 77672 77490 77243 77003 76980 77158 77095 76405 75418 75029
66236 75029 75727 77047 78113 78518 78486 78412 78535 78931 79566 80328 81164 82112 83039 83500 83130 82193 81464 81470 82035 82625
66216 82625 82957 83096 83139 83018 82660 82195 81910 81989 82293 82442 82215 81938 82314 83695 85566 86972 87466 87407 87247
66197 87247 86907 86169 85357 85044 85101 84678 83369 81875 81087 80937 80678 80046 79510 79450 79734 80201 81002 82209 83417
66178 83417 84076 84035 83616 83276 83266 83496 83749 84145 85168 86838 88069 87528 85257 82865 81879 82393 83498 84378
66160 84378 84621 84091 83113 82388 82134 81660 80343 78721 77929 78243 78912 79346 79775 80592 81682 82676 83469 84232
66142 84232 85108 86024 86624 86493 85695 84893 84585 84420 83834 83142 83293 84517 85987 86971 87528 87759 87246 85877
66124 85877 84625 84703 86207 88185 89866 91186 92317 93354 94444 95592 96268 95762 94081 92055 90416
66109 90416 89240 88473 88443 89397 90881 92082 92706 93113 93703 94585 95830 97550 99514 101066 101737 101728 101545 101347
66091 101347 101064 100968 101624 103079 104524 105045 104513 103522 102677 102252 102335 102916 103770 104533 105011 105323 105764 106607 107889
66072 107889 109206 109872 109568 108733 108003 107416 106580 105544 104947 105145 105727 106160 106457 106840 107129 106956 106391 105877
66054 105877 105580 105213 104509 103507 102424 101519 101114 101370 101966 102382 102615 103252 104601 106063 106704 106308 105509
66037 105509 105002 104997 105444 106358 107710 109218 110524 111482 112162 112671 113155 113846 114904 116241 117633 118888 119757
66020 119757 119951 119592 119548 120757 123089 125260 126127 125742 124979 124550 124698 125507 126975 128894 131022 133375 136088
66003 136088 139154 142536 146366 150689 155194 159524 163685 167751 171378 174142 176221 178177 180057 181285
65989 181285 181482 180852 179625 177720 175135 172155 168944 165408 161685 158242 155172 151939 148200 144426 141249
65974 141249 138650 136331 134510 133674 133732 133972 133913 133697 133649 133815 134023 134132 134176 134380 134946 135720 136293 136579 136973
65955 136973 137629 137950 137319 136137 135600 136445 138354 140583 142766 145002 147515 150430 153676 156989 160109
65940 160109 162983 165732 168523 171514 174674 177537 179501 180642 181872 183857 186081 187499 187908 188115 188866
65925 188866 190256 192204 194891 198466 202708 207171 211473 215443 219276 223435 228020 232398 235947 239039
65911 239039 242544 246352 249220 250320 250275 250171 250198 249799 248672 246972 244828 242328 239887 238027 236685 235157
65895 235157 232787 229471 225440 220864 215808 210421 205004 199880 195204 190888 186757 182742 178898 175339
65881 175339 172237 169735 167608 165188 161986 158385 155315 153217 151795 150841 150683 151495 152586 152973 152488
65866 152488 151901 151941 152505 152823 152268 150990 149804 149401 149710 150167 150531 151073 151980 153075 154251 155671 157281
65849 157281 158597 159281 159518 159462 158838 157586 156462 156350 157200 158275 159206 160146 161051 161637 162110 163178 165152
65832 165152 167605 170219 173400 177691 182954 188534 193956 199170 204363 209799 215642 221557 226633 230037
65818 230037 231745 232406 232532 232007 230419 227672 224148 220347 216492 212516 208328 203943 199421 194903 190796
65803 190796 187687 185843 184925 184353 183813 183196 182334 181173 180142 179905 180685 182102 183729 185504 187608 190239
65787 190239 193599 197816 202808 208515 215281 223646 233663 244721 256097 267247 277440 285681 291458
65774 291458 295205 297566 298417 297102 293408 287745 280440 271490 261231 250726 241110 232824 225806 220254
65760 220254 216705 215394 215925 217852 221317 226814 234405 243530 253758 265358 278853 294124 310262
65747 310262 326252 341488 355640 368451 379815 389715 397730 402815 403895 400677 393694 383683 371238
65734 371238 356998 341752 326146 310454 294791 279430 264747 250938 238029 226144 215592
65723 215592 206568 198870 192045 185795 180089 174939 170277 166144 162747 160081 157675 155017 152213 149945
65709 149945 148705 148380 148605 149171 149897 150449 150611 150519 150331 149889 149096 148483 148860 150330 152066 153241 153801 154132
65691 154132 154325 154210 153972 154285 155726 158274 161518 165173 169252 173874 179101 184983 191598 198941 206913
65676 206913 215642 225837 238501 254019 271661 290280 309468 329637 350824 371863 391146 407994
65664 407994 422800 435864 446653 454439 459255 461835 462855 462701 461842 460872 460043 459215 458557 458955 461280
65649 461280 465318 469785 473397 475581 476081 474319 469527 461381 450143 436220 419846 401318 381263
65636 381263 360434 339311 318096 297046 276634 257357 239639 223957 210831 200400 192090 184993
65624 184993 178591 172908 167938 163274 158554 154032 150380 147961 146593 145958 145828 145751 144979 143166 140962
65609 140962 139476 139123 139371 139734 140508 142162 144292 145768 145973 145484 145326 145855 146600 146941 146605 145704 144753
65592 144753 144663 146282 149638 153763 157460 160276 162718 165727 170053 175959 183331 191970 201849 213085
65578 213085 225809 240150 256242 273930 292395 310441 327407 343599 359526 374801 388121
65567 388121 398328 405175 408933 409463 405998 397910 385587 370407 353776 336318 318120 299530 281341
65554 281341 264154 248061 233139 219829 208424 198519 189510 181438 174778 169423 164543 159737 155809
65541 155809 153953 154338 155836 157078 157595 157960 159001 160910 163068 164711 165664 166303 166951 167559 167961 168082
65525 168082 167773 166750 164900 162489 159899 157281 154605 151903 149360 147273 145987 145706 146213 146905 147232
65510 147232 147012 146378 145644 145291 145691 146626 147266 146899 145624 144216 143523 144098 146055 148868 151513 153216 154112
65493 154112 154922 156053 157342 158656 160333 162830 166100 169519 172402 174568 176434 178459 180475 181723
65479 181723 181729 180967 180343 180131 179748 178600 176683 174190 170958 166765 162065 157939 155198 153695 152640 151363
65463 151363 149641 147521 145183 142980 141301 140226 139501 138976 138821 139133 139571 139715 139573 139317 138715 137436
65447 137436 136002 135784 137659 141049 144573 147302 149119 150285 151181 152235 153641 155229 156936 159129 162038
65432 162038 165102 167417 168714 169335 169400 168704 167481 166490 166019 165402 163983 162142 160858 160479 160433 160069 159376
65415 159376 158775 158487 158274 157725 156693 155436 154334 153573 153155 153107 153514 154370 155578 157068 158806 160784 163166
65398 163166 166284 170189 174323 177945 180808 183002 184297 184240 182991 181446 180216 178967 177108 174709 172348
65383 172348 170374 168797 167621 166832 166206 165573 165175 165374 166078 166873 167729 169154 171490 174303 176600 177631
65367 177631 177544 177341 178133 180323 183607 187726 192839 198944 205448 211876 218784 227368 238159 250570 263665
65352 263665 276743 289018 299404 307106 312151 314965 315671 314175 310737 305994 300402 293949 286507 278237
65338 278237 269595 261070 252960 245211 237471 229461 221428 214083 207983 203016 198647 194582 190983 188042
65324 188042 185600 183308 180986 178639 176285 174024 172164 170931 170035 168833 167002 164771 162456 160120
65310 160120 157836 155907 154527 153553 152906 152865 153536 154337 154600 154577 155212 156872 158929 160821 162942 165999 169820
65293 169820 173320 175621 176777 177378 177733 177700 177157 176342 175610 174950 174008 172663 171399 170939 171619 173219 175189
65276 175189 176804 177310 176386 174481 172410 170580 168873 167168 165568 164036 162321 160433 158826 157825 157219
65261 157219 156754 156726 157696 159727 162228 164456 165942 166557 166492 166180 166010 166064 166216 166334 166233 165605 164284 162533
65243 162533 160840 159482 158442 157596 156708 155410 153627 152014 151547 152475 153908 154604 154002 152474 150842 149765
65227 149765 149346 149105 148485 147480 146644 146373 146461 146550 146758 147457 148550 149423 149714 149771 150122 150755 151200 151216 151066
65208 151066 151065 151125 150911 150337 149677 149197 148852 148469 148132 148173 148747 149590 150359 151103 152187 153721 155303 156455 157097
65189 157097 157408 157393 156960 156450 156662 158086 160270 162191 163262 163811 164536 165585 166262 165764 164228 162885 162852
65172 162852 163901 164817 164976 164986 165591 166614 167623 169077 171919 176088 180298 183434 185504 186992 187984 188340
65156 188340 188241 188109 188340 189432 191975 196050 200924 205812 210780 216541 223597 231949 241465 252028 263435
65141 263435 275549 288484 302273 316381 329908 342309 353730 364712 375719 386707 396803
65130 396803 404667 409575 412108 413390 413795 412839 410172 406122 401245 395823 389885 383277 375631 366637 356434
65115 356434 345461 334027 322430 311208 300546 289519 276848 262745 249266 238352 230084 223259
65103 223259 216972 211012 205225 199429 193870 189150 185693 183579 182682 182504 182133 180971 179444 178470 178269
65088 178269 178266 178146 178347 179231 180308 180710 180255 179636 179560 179922 179984 179302 178319 177826 177941 177975 177451 176821 176858 177680
65068 177680 178841 180126 181599 182922 183334 182618 181663 181676 183024 185058 186930 188316 189405 190363 190961 190763
65052 190763 189702 188274 187074 186282 185743 185339 185032 184712 184317 183943 183544 182701 181115 179148 177361 175665
65036 175665 173570 171279 169699 169077 168337 166319 163203 160172 158034 156718 155828 155052 154064 152626 150930
65021 150930 149549 148922 149033 149568 150197 150802 151591 152910 154753 156631 158132 159351 160556 161764 163159 165571
65005 165571 169765 175145 179903 182788 184281 185705 187631 189549 190756 190982 190299 188981 187646 187144 188041
64990 188041 190203 192962 195652 198029 200256 202580 205024 207455 209876 212432 215038 217184 218351 218523
64976 218523 218060 217134 215546 213094 209800 205722 200869 195560 190657 187111 185231 184540 184247 183727 182704
64961 182704 181299 179901 178773 177698 176267 174539 173094 172287 171707 170639 168900 167019 165670 165179 165391
64946 165391 165770 165723 165114 164451 164319 164710 165178 165539 166003 166622 167115 167384 167742 168352 168831 168748 168257 167814 167499
64927 167499 167042 166410 165934 165819 165897 165948 165962 166027 166258 166900 168198 169939 171371 171834 171466 171133 171680 173286 175444
64908 175444 177461 179008 180321 181929 184262 187519 191780 197065 203239 210018 217148 224508 232028 239621
64894 239621 247217 254726 261915 268491 274363 279741 284850 289640 293840 297121 299081 299207 297126 292938
64880 292938 287182 280424 273018 265243 257441 249914 242847 236562 231723 228936 228067 228162 228238 228029 227786 227587
64864 227587 227155 226308 225181 223858 222081 219493 215966 211534 206330 200849 195972 192264 189304 186144 182450
64849 182450 178778 175709 173232 171159 169661 168987 168948 169165 169653 170639 171827 172393 171902 170897 170275 170353 170806
64832 170806 171365 172202 173604 175595 177986 180582 183167 185496 187527 189617 192197 195205 198084 200498 202928
64817 202928 206352 211382 217867 225276 233199 241475 250109 259218 268827 278439 286899 292971 296157 296752
64803 296752 295106 291146 284854 277002 268938 261521 254594 247730 241207 235851 231978 228966 226048 223152
64789 223152 220705 218875 217438 216257 215381 214608 213420 211650 209924 209118 209502 210705 212316 214227 216433
64774 216433 218978 222206 226698 232640 239480 246529 253754 261656 270345 279107 287046 293950 300325 306700
64760 306700 313111 319207 324707 329733 334815 340500 346766 352798 357481 360220 361227 360994 359620 356646
64746 356646 351466 343841 334126 323078 311415 299633 288294 278316 270551 264957 260530 256328 252414
64733 252414 249527 248010 247427 247191 247206 247739 248895 250402 251879 253235 254773 256874 259570 262546 265592
64718 265592 268828 272345 275865 279110 282371 286224 290687 294988 298265 300105 300271 298385 294237 288194
64704 288194 281009 273324 265596 258231 251469 245222 239372 234113 229682 225788 221771 217459 213560 210971
64690 210971 209870 209670 209698 209705 209850 210496 212117 215153 219709 225363 231452 237651 244217 251601 259905 268822
64674 268822 277967 287031 295593 303070 309009 313241 315579 315626 313164 308610 302757 296085 288656 280771 273337
64659 273337 267310 262857 259331 256065 253021 250625 249137 248299 247646 247092 247146 248525 251555 255921 260924
64644 260924 265967 270957 276409 283097 291464 301380 312487 324598 337502 350486 362430 372516 380588
64631 380588 386690 390546 391793 390556 387495 383270 378139 372008 364670 356066 346542 336869 327830 319809
64617 319809 312918 307347 303235 300218 297563 294948 292801 291655 291474 291789 292172 292273 291719 290480 289243
64602 289243 288914 289610 290439 290364 289062 286958 284682 282573 280523 278190 275511 272958 271128 270173 269873 270133
64586 270133 271045 272579 274733 277977 282946 289460 296383 302751 308579 314180 319180 322740 324509 324840 324199
64571 324199 322745 320421 317098 312712 307453 301650 295281 288005 279955 272078 265210 259265 253865 249306
64557 249306 246046 243561 240704 237165 233630 230474 227347 224297 222262 221863 222495 223288 224337 226221 228726
64542 228726 230853 232022 232743 234045 236462 239443 241618 241911 240552 238683 236922 234829 231978 228860 226301
64527 226301 224566 223581 223451 224072 224666 224508 223940 224073 225589 228299 231553 234481 236233 236752 237115 238400
64511 238400 240400 242249 244051 246910 251338 256690 262359 268608 275842 283898 292526 301852 311742 321167
64497 321167 328723 333492 335194 333991 330536 325713 319939 313104 305525 298433 293018 289428 287194 286166
64483 286166 286337 287128 287657 287652 287432 286996 285803 283546 280535 277100 273137 268598 264076 260463 258118 256646
64467 256646 255509 254695 254752 256186 258909 262330 265935 269534 272834 275099 275684 274867 273730 273094 272779 272063
64451 272063 270589 268640 266775 265477 265077 265672 267035 268855 271136 274163 277980 282185 286519 291440 297714
64436 297714 305420 313713 321725 329477 337894 348199 361381 377776 396861 417744 440313 465788
64424 465788 495886 531697 573777 623125 681517 750835 832402 926767 1033326 1149654 1271379
64413 1271379 1393079 1509669 1617630 1715708 1804445 1884418 1954449 2011547 2052384 2074535 2076741
64402 2076741 2059096 2023442 1972872 1909994 1835559 1748884 1649497 1538535 1419250 1296538 1175626
64391 1175626 1060712 954667 859569 776653 705573 644582 592112 547735 511166 480935 454844
64380 454844 431500 410788 393029 378250 366159 356256 347923 340694 334362 328573 322616 316003 309019
64367 309019 302263 295894 289754 283936 278681 273910 269413 265302 261744 258462 255142 252204 250473 250179
64353 250179 250987 252965 256715 262365 269097 275860 281962 286891 290248 292127 292934 292537 290247 285971 280720
64338 280720 275549 270572 265548 260871 257233 254636 252469 250535 249378 249535 250918 253086 255811 259201
64324 259201 263363 268010 272392 275724 277711 278554 278461 277481 275903 274440 273688 273576 273560 273176 272191 270439 267822
64307 267822 264357 260047 254879 249181 243708 239021 234918 230811 226562 222556 219071 216052 213630 212392
64293 212392 212797 214484 216466 218024 219232 220577 222241 223966 225621 227632 230656 234974 240467 247042
64279 247042 254665 262951 271197 279081 286912 294873 302371 308603 313506 317596 320949 322969 323288 322401 321107
64264 321107 319727 318226 316892 316404 317231 319157 321394 322909 322718 320267 315786 310087 303791 296855 289057
64249 289057 280715 272567 264991 257796 250915 244844 240081 236475 233542 231176 229610 228826 228488 228425 228770
64234 228770 229607 230947 233001 235923 239186 241707 242887 243056 242696 241767 240186 238508 237525 237373 237454 237088
64218 237088 235837 233470 230134 226564 223691 221927 221024 220449 219708 218491 216985 215909 215816 216394 216848 216876
64202 216876 216848 217077 217550 218411 220142 222980 226691 231210 237050 244609 253471 262876 272711 283541 295747
64187 295747 309079 323018 337047 350379 361772 369943 374084 373928 369573 361500 350713 338601 326465
64174 326465 315083 304601 294806 285562 277027 269389 262482 255884 249482 243705 238995 235223 231908 228881
64160 228881 226413 224717 223766 223676 224751 226875 229251 231219 233081 235662 239181 243085 246973 251065 255514
64145 255514 259708 262676 264132 264821 265800 267396 268874 269189 268113 266427 264876 263323 261324 259203 257833
64130 257833 257462 257551 257857 258805 260442 261881 262457 262821 264218 267111 271215 276416 282758 289728 296560 303328
64114 303328 310946 319890 329536 338926 347554 355164 361373 365882 368721 370045 370099 369660 370116 372729 377878
64099 377878 385130 393716 402695 410979 417667 422405 425308 426578 426288 424409 421014 416508 411593 406788
64085 406788 401997 396777 390949 384689 378152 371444 364951 359129 353872 348591 343093 337946 333749 330506
64071 330506 327971 326052 324437 322336 319211 315563 312454 310387 309057 308043 307249 306736 306613 307132 308505
64056 308505 310553 312798 314955 317180 319911 323647 328670 334647 340685 346247 351993 359296 368879 380275
64042 380275 392575 405333 418670 432902 448177 464091 479510 493084 504117 512682 518776 521759
64030 521759 520926 516477 509666 502130 495146 489225 484116 479296 474631 470503 467154 464124 460518 455707
64016 455707 449569 442245 434023 425455 417258 409839 402996 396162 389013 381805 375176 369624 365171 361551
64002 361551 358621 356486 355246 354792 354871 355269 355930 357046 358984 361864 365221 368404 371373 374792 379127
63987 379127 384047 389002 394021 399493 405433 411530 417817 424718 432329 440200 448017 456054 464748 474257
63973 474257 484710 496431 509450 523076 536540 550010 564559 581083 599661 620029 642324
63962 642324 667092 694752 725248 758319 794085 833456 877886 928678 986631 1052435 1127157
63951 1127157 1211983 1307644 1414568 1533783 1667362 1817774 1986858 2175307 2382682 2607618
63941 2607618 2848237 3102629 3368827 3644063 3924098 4203375 4475716 4734774 4974140
63932 4974140 5187582 5369533 5515501 5622161 5687194 5709080 5687118 5621724 5514723 5369163
63922 5369163 5188851 4978326 4743254 4490298 4226127 3956535 3686532 3420758 3163254
63913 3163254 2916993 2684153 2466753 2266587 2084487 1920164 1772873 1641885 1526271
63904 1526271 1424728 1335911 1258639 1191641 1133399 1082506 1037979 999043 964853 934579 907510
63893 907510 882848 859679 837423 816142 796082 777061 758554 740361 722935 707113 693664
63882 693664 682985 675012 669447 666207 665616 668079 673708 682363 693840 707885 724308 743286 765327
63869 765327 790588 818427 847937 878743 910878 944056 977582 1010968 1044107 1076716 1108041
63858 1108041 1137342 1164279 1188618 1209839 1227344 1240827 1250167 1255070 1255074 1249888 1239608 1224612 1205258
63845 1205258 1181613 1153580 1121509 1086632 1050498 1013853 976387 937728 898309 858997 820278
63834 820278 782185 744776 708309 673157 639954 609589 582496 558067 535275 513866 494362
63823 494362 476902 460732 445152 430423 417323 406167 396578 387922 379635 371439 363640 356964 351685
63810 351685 347173 342702 338384 334727 331566 328223 324680 321682 319400 316841 313194 309126 305975 303920
63796 303920 301751 298392 294037 289605 285649 282091 278692 275404 272343 269665 267510 266015 265331 265515 266286
63781 266286 266942 266756 265524 263640 261646 259811 258118 256444 254720 253067 251761 250915 250241 249382 248455 247936
63765 247936 247894 247703 246817 245595 244948 245191 245610 245226 243821 242052 240764 240345 240671 241451 242524 243871 245478
63748 245478 247248 249003 250563 251851 252977 254212 255860 258132 261090 264560 268051 270947 272972 274411
63734 274411 275719 276982 277992 278816 279967 281896 284536 287563 290916 294809 299242 303763 307866 311529
63720 311529 315201 319259 323572 327701 331386 334574 337023 338248 338051 336765 334668 331533 327285 322869
63706 322869 319690 318133 317307 316478 316047 316650 317988 319268 320433 322152 324672 327456 330001 332375 334748
63691 334748 336987 339025 341194 343796 346558 348873 350422 351359 352011 352578 352940 352595 351017 348434 346120
63676 346120 345544 347074 349667 351825 352764 352694 352317 352236 352735 353835 355421 357291 359130 360489 360959 360444 359209
63659 359209 357541 355335 352133 347612 341995 335920 330009 324646 320080 316500 313955 312323 311368 310741 309946
63644 309946 308584 306822 305482 305445 306940 309504 312526 315706 319056 322677 326632 330925 335542 340461 345657
63629 345657 351143 357118 363997 372024 380749 389226 397094 405333 415631 428927 444788 462112 480130
63616 480130 498718 518197 539185 562413 588279 616539 646613 678191 711259 745419 779334
63605 779334 811012 838574 860673 876391 885167 887146 883477 875987 866369 855623 844137 832124
63593 832124 819932 808027 796639 785309 772866 758009 740017 718947 695442 670599 645798
63582 645798 622179 600181 579849 561494 545556 531848 519657 508876 500414 494994 492051 490405
63570 490405 489687 490444 493060 497250 502531 508574 515112 522038 529601 538067 547237 556830 567264 579393
63556 579393 593446 608971 626047 645812 669379 696792 727551 761812 800515 844315 892333
63545 892333 941429 986455 1021905 1044206 1052787 1049200 1035846 1015755 992693 970346 951061 935543
63533 935543 923497 914133 906226 898257 888697 876202 859893 839783 816664 791149 763076 732307
63521 732307 699812 667339 636121 606497 578715 553298 530413 509529 490126 472310 456420
63510 456420 442375 429773 418399 408273 399348 391469 384538 378499 373212 368505 364256 360330 356647
63497 356647 353471 351411 350760 350966 351033 350457 349504 348645 348096 348017 348751 350518 353009 355667 358346 361429 365211
63480 365211 369437 373604 377512 381322 385210 389178 393112 396773 399756 401684 402493 402317 401164 398935 395781
63465 395781 392047 387853 383118 378211 374100 371407 369563 367444 364824 362821 362752 364829 368095 371446 374585
63450 374585 378102 382779 388851 395954 403678 411989 421111 431322 443065 456987 473560 492816 514845
63437 514845 540452 570823 606273 645333 684982 721582 751859 773722 786780 792294 792582 790303
63425 790303 787889 787223 789695 796607 809313 828681 854424 885256 919675 956309 993557 1029313
63413 1029313 1061307 1087597 1106765 1117926 1120844 1116058 1104952 1089837 1073609 1058656 1045694 1033784
63401 1033784 1021548 1008096 992792 974645 952471 925677 894719 860924 825944 791148 757239
63390 757239 724442 693078 663775 637089 613142 591848 573280 557578 544590 533846 524929 517832
63378 517832 512997 510924 511559 514016 517173 520636 524980 531074 539478 550452 563998 579646 596688
63365 596688 614977 635166 657882 683117 710780 741245 774639 810039 846216 882954 920606
63354 920606 958323 993678 1024275 1048883 1066751 1076954 1079280 1075128 1066614 1055133 1041498 1027013
63342 1027013 1013302 1000971 989177 976606 962191 944832 923372 897477 868114 836780 804577
63331 804577 772313 741028 711840 685472 662332 642848 627368 615962 608780 606314 608514 613539
63319 613539 617906 618164 612310 599851 581359 558425 533533 509243 487268 468252 452083 438164
63307 438164 425761 414578 404961 397290 391265 386111 381387 377266 374095 371972 370752 370131 369668 368902
63293 368902 367463 364934 360881 355467 349967 346083 344485 344290 344096 343218 341834 340377 339175 338362 337774
63278 337774 337043 336079 335298 335056 335008 334465 333432 332924 334068 336978 340581 343496 345039 345558 345929 346836 348500
63261 348500 350892 353882 357175 360451 363730 367351 371425 375570 379453 383277 387354 391429 394972 398092
63247 398092 401638 406324 412178 418973 426677 435240 444437 454347 465693 479187 494668 511349 528905
63234 528905 547850 568726 591299 614834 638899 663639 689270 715585 741997 767932 793088
63223 793088 817423 841036 864098 886783 909184 931356 953528 976218 999839 1024093 1047859
63212 1047859 1069875 1089455 1106361 1120021 1129131 1132138 1128067 1116927 1099558 1077152 1050725 1020869
63200 1020869 988094 953517 919007 886385 856519 829389 804925 783359 764747 748624 734604
63189 734604 723161 715412 712058 712746 716545 722798 731392 742340 755363 769958 785789 802889 821399
63176 821399 841126 861391 881340 900370 918403 935871 953418 971316 989041 1005529 1019943
63165 1019943 1031955 1041263 1047200 1049126 1046909 1040587 1029828 1014283 994376 971090 944897 915593
63153 915593 883527 850347 818016 787451 758676 731933 707847 686455 666810 647948 629954
63142 629954 613742 599944 588231 577680 567623 558128 549756 542988 537880 534144 531358 529111 527189
63129 527189 525775 525253 525674 526633 527862 529721 532780 537068 542095 547514 553304 559258 564738 569216 572882
63114 572882 576475 580583 585195 589869 594230 598246 602006 605242 607308 607881 607543 607398 608046 609164 610045
63099 610045 610332 610157 609818 609382 608537 606847 604347 601734 599688 598123 596561 595220 595143 596975 600060 603078
63083 603078 605297 606973 608894 611897 616451 622220 628203 633719 639087 644960 651284 657570 664042 671716
63069 671716 681092 691408 701546 711304 721461 733004 746648 762706 780941 800709 821765 844791
63057 844791 870773 899991 932132 967258 1006012 1048786 1095318 1145302 1198691 1255002 1312976
63046 1312976 1371606 1431092 1491963 1553538 1614157 1672983 1730596 1787557 1843349 1897374 1950296
63035 1950296 2003518 2057621 2112037 2165998 2218921 2269794 2316874 2358222 2392038 2416390 2429189
63024 2429189 2428884 2415005 2387912 2348323 2297217 2235913 2166139 2090176 2010865 1930925 1852141 1775644
63012 1775644 1703017 1636481 1577630 1526523 1482499 1445499 1416049 1394257 1379519 1371162 1368885 1372510
63000 1372510 1381647 1395711 1414065 1436164 1461631 1490016 1520371 1551424 1582441 1613595 1645156
62989 1645156 1676721 1707725 1738341 1769082 1799607 1828554 1854515 1876506 1893450 1903944 1906860
62978 1906860 1901704 1888194 1866015 1835261 1796698 1751351 1700192 1644398 1585473 1524846 1463692
62967 1463692 1403315 1345221 1290456 1239271 1191619 1147514 1106604 1068024 1031302 996997 965874
62956 965874 937718 911568 886828 863499 841445 820159 799333 779184 760120 742488 726536
62945 726536 712079 698197 683913 669401 655988 644676 635086 626165 617541 609685 602967 597064 591412
62932 591412 585918 581035 577173 574177 571451 568583 565715 563310 561717 561055 561246 561888 562255 561742 560360
62917 560360 558572 556723 554814 552704 550238 547323 544245 541778 540505 540040 539357 537937 536132 534414 532828
62902 532828 531376 530322 529805 529551 529383 529631 530640 532109 533274 533620 533183 532375 531700 531404 531183 530552 529660
62885 529660 529262 529614 529929 529446 528606 528512 529484 530826 531841 532387 532511 532266 531966 531986 532178 531954 531102 530013
62867 530013 528979 527812 526353 524927 524036 523922 524567 525752 527005 527907 528576 529436 530458 531169 531562 532317
62851 532317 533799 535474 536764 537904 539369 540970 542159 542864 543327 543413 542823 541855 541175 540893 540493 539739 538992
62834 538992 538588 538490 538608 538864 538878 538285 537525 537616 538844 540312 541166 541643 542512 544116 546510 549888 554070 558012
62816 558012 560745 562637 564889 567909 571107 574318 578315 583481 588826 593087 596288 599566 603786 608993
62802 608993 615004 621854 629578 638060 647178 656758 666402 675819 685430 696337 709595 725747 744961
62789 744961 767196 792157 819656 850254 885170 925294 970683 1021330 1077899 1141073 1210500
62778 1210500 1285103 1364381 1448744 1538395 1632484 1729522 1827982 1926006 2020911 2109603 2189429
62767 2189429 2258308 2314233 2355210 2379844 2387663 2378719 2353172 2311576 2255501 2187587 2110778 2027364
62755 2027364 1938777 1846293 1751863 1658079 1567236 1480517 1398125 1320036 1246431 1177547 1113509
62744 1113509 1054456 1000659 952332 909299 870967 836609 805665 777850 753105 731435 712661
62733 712661 696239 681415 667718 655323 644788 636366 629691 624219 619810 616634 614601 613247 612261
62720 612261 611880 612607 614641 617804 621927 627166 633866 642169 651787 662326 673955 687628 704324 724061
62706 724061 746041 769898 796423 826783 861364 899702 941363 986446 1035376 1088620 1146602
62695 1146602 1209397 1276391 1346494 1418731 1492259 1565720 1636844 1702947 1761686 1811327 1850596
62684 1850596 1878436 1893761 1895376 1882415 1855105 1814987 1764301 1705287 1640067 1570750 1499289
62673 1499289 1427283 1356063 1286760 1220113 1156504 1096496 1041063 990818 945202 903034 863933
62662 863933 828646 797740 770524 745714 722789 702113 683871 667482 652184 637681 623996
62651 623996 611068 598842 587516 577297 568033 559412 551454 544472 538565 533518 529275 526115 524137
62638 524137 522851 521613 520313 519346 518910 518571 517601 515616 512885 510106 507885 506404 505508 504984 504594 504004
62622 504004 503024 502025 501786 502759 504748 507486 511117 515716 520674 525109 528838 532439 536420 540789 545499
62607 545499 550783 556851 563668 571308 580304 591375 604948 621068 639607 660458 683713 709776
62595 709776 739143 771960 807968 846923 888801 933499 980484 1028801 1077123 1123700 1166616
62584 1166616 1204353 1235983 1260730 1277640 1285873 1285050 1275103 1256152 1228884 1194923 1156353 1114868
62572 1114868 1071532 1027230 982973 939684 897942 858075 820451 785527 753555 724271 697097
62561 697097 671837 649000 629070 611550 595255 579650 565440 553572 544124 536440 529865 523893
62549 523893 518039 512257 507319 504125 502610 501772 500735 499372 497972 496784 496021 495814 495985 496107 495857 495126
62533 495126 493906 492464 491596 492191 494459 497957 502428 508108 515073 522882 531268 540786 552302 566058
62519 566058 581732 599317 619478 642896 669533 698786 730230 764008 800415 839262 879849
62508 879849 921579 964339 1008050 1051977 1094634 1134216 1168894 1197023 1217605 1230593 1236421 1235342
62496 1235342 1227763 1215317 1200874 1187068 1175001 1164712 1156549 1151592 1150848 1154484 1162081 1173513 1189490
62483 1189490 1211136 1238816 1271251 1305826 1339655 1370231 1395326 1413030 1422390 1423728 1417859 1404930
62471 1404930 1384134 1354499 1315882 1269450 1217386 1162002 1104911 1047056 989450 933478 880400
62460 880400 830987 785944 746205 712275 683472 658435 636409 617589 602162 589539 578781
62449 578781 569509 562097 556980 553959 552233 551110 550621 551308 553423 556607 560514 565362 571446 578246 584486
62434 584486 589172 592265 594238 595299 595159 593355 589542 583604 575692 566276 556173 546402 537704 530001
62420 530001 522514 514665 506798 499734 493769 488430 483177 477923 472810 467931 463478 459838 457208 455296
62406 455296 453681 452323 451518 451349 451500 451583 451515 451479 451662 452159 453114 454842 457706 461819 466836 472023 476492
62389 476492 479556 481161 482089 483564 486430 490771 496340 503011 510541 518216 525288 531754 538286 545356
62375 545356 552908 560918 569692 579268 588987 598230 607427 617923 630851 646379 664041 683521 705113
62362 705113 729586 757626 789360 824538 863345 906839 956194 1011403 1070822 1131966 1192518
62351 1192518 1250551 1304074 1350774 1388472 1416002 1433699 1442963 1445257 1441439 1431855 1416687 1396075
62339 1396075 1370129 1339144 1303755 1264815 1223331 1180729 1138921 1099620 1063498 1030286 999687
62328 999687 971879 947076 924934 904611 885250 866289 847451 828542 809201 788882 767331
62317 767331 745079 723176 702277 682323 663206 645344 629179 614491 600810 588424 578331
62306 578331 571032 565891 561973 559074 557493 557095 557239 557589 558485 560379 563353 567496 573355 581544 592030
62291 592030 604187 617492 631730 646482 660890 674270 686609 698188 708952 718593 727045 734429
62279 734429 740597 745198 748249 750129 750916 750243 748133 745481 743231 741371 739372 737527 737255 739911 745710
62264 745710 754121 765008 779121 797654 821627 851628 887871 930236 978192 1030783 1086936 1145939
62252 1145939 1207310 1269771 1330385 1385258 1431438 1467932 1494855 1512163 1519749 1518376 1509592 1494409
62240 1494409 1472499 1442970 1405624 1361216 1310903 1256021 1198412 1140413 1084116 1030655 980312
62229 980312 933195 889707 850441 815821 785880 760253 738303 719359 702919 688610 676009
62218 676009 664630 654196 644812 636658 629536 622916 616485 610509 605461 601372 597755 594259 591260 589593
62204 589593 589628 590818 592287 593743 595534 597937 600855 604316 608775 614504 621007 627567 634215 641639 650168
62189 650168 659387 668802 678328 687961 697522 706980 716546 726180 735430 744068 752392 760497 767759 773602
62175 773602 778499 783595 789593 796644 805202 816335 831156 850388 874448 903398 936856 974401
62163 974401 1016020 1061545 1109563 1157415 1202367 1242345 1275616 1300651 1316843 1324979 1326612 1323050
62151 1323050 1315005 1302677 1285918 1264574 1238870 1209340 1176497 1140998 1104050 1067085 1031074
62140 1031074 996754 965426 938502 916033 896664 879491 865009 853626 844308 835727 827969 821925
62128 821925 817496 813588 809626 805853 802327 798897 796386 796553 800388 807227 815917 826037 837499 849581
62114 849581 860911 870075 875926 877853 876161 871932 866202 859557 852530 845760 839330 832391 823888 813515
62100 813515 801876 790137 779787 772188 767808 766039 766000 767292 769860 773650 778732 785324 793164 801207
62086 801207 808468 815042 821820 829399 837693 846514 855998 866436 878007 890846 905166 921292 939611
62073 939611 960403 983558 1008549 1034710 1061350 1087669 1113101 1138003 1163536 1190400 1218012
62062 1218012 1245350 1272194 1298808 1324493 1347190 1364661 1375679 1380078 1378259 1370991 1359323 1344258
62050 1344258 1326463 1306252 1283588 1258037 1229004 1196206 1159951 1121053 1080652 1040042 1000308
62039 1000308 961973 925085 889591 855487 822713 791264 761528 734260 710053 688936 670468
62028 670468 654098 639467 626593 615782 607164 600316 594552 589532 585277 581529 577447 572186 565668
62015 565668 558620 551960 546227 541456 537471 534256 532094 531287 531795 533236 535250 537730 540743 544346 548447
62000 548447 552738 556824 560544 564120 567743 571079 573431 574422 574344 573766 572936 571568 569023 564730 558657
61985 558657 551410 543700 535732 527285 518306 509186 500483 492657 485997 480460 475555 470778 466242 462535
61971 462535 459866 457771 455774 453886 452156 450169 447442 444164 441129 439019 437948 437616 437695 438159 439333
61956 439333 441433 443986 446090 447484 448972 451454 454860 458574 462602 467724 474559 483056 492951 504214
61942 504214 516976 531486 548196 567365 588323 609607 630187 650302 670847 692235 714139
61931 714139 735963 757041 776504 793491 807636 819116 828155 834706 838631 839913 838539 834375 827484
61918 827484 818534 808703 799025 790002 781949 775599 772080 772190 775890 782639 792001 803702 817235 831827
61904 831827 846832 861778 875839 887521 895180 897901 895828 889777 880663 869129 855457 839760
61892 839760 822359 804011 785658 767924 750865 734261 718198 703303 690287 679151 668984
61881 668984 658697 647823 636438 624579 612322 600437 590282 582636 576935 572044 567487 563527
61869 563527 560396 558081 556815 557150 559374 563261 568519 575122 583078 592246 602612 614448 628037 643489
61855 643489 660946 680657 702722 727061 753771 783017 814259 846101 877473 908745 941018
61844 941018 974286 1006680 1035573 1059101 1076733 1088863 1095979 1097976 1094313 1085123 1071984 1057126
61832 1057126 1041994 1027240 1014131 1004951 1001424 1003318 1009265 1018473 1030902 1046058 1062493 1078543
61820 1078543 1092786 1103646 1109326 1108641 1101545 1088493 1069735 1045680 1017636 987522 956806 926019
61808 926019 895250 864702 834737 805797 778593 754103 733036 715225 699660 685218 671384
61797 671384 658365 646605 636201 626815 618086 610013 602818 596512 590808 585427 580313 575513 571103
61784 571103 567371 564787 563465 562729 561535 559358 556411 553030 549231 545068 541085 538041 536189 535122
61770 535122 534323 533655 533245 533068 532856 532418 531949 531871 532322 532908 533217 533536 534670 536878 539322 540926 541609 542150
61752 542150 542939 543392 542811 541325 539626 538047 536272 533869 530855 527754 525236 523593 522474 521247 519751
61737 519751 518505 518019 518144 518373 518548 518950 519814 521191 523178 525744 528227 529563 529428 528856 529308 531249
61721 531249 534031 536976 540061 543364 546356 548217 548757 548552 548099 547199 545425 542952 540549 538757 537352
61706 537352 535673 533205 529795 525588 520973 516355 511752 506703 500852 494589 488868 484338 480755 477304
61692 477304 473395 469183 465347 462358 459936 457312 454037 450349 446710 443228 439789 436506 433710 431540
61678 431540 429837 428408 427119 425767 424157 422393 420817 419634 418779 418184 417834 417485 416787 415891 415643 416737
61662 416737 418799 420657 421534 421716 421989 422687 423473 423874 423801 423531 423393 423591 424200 425179 426431 427995 430135
61645 430135 433015 436307 439428 442271 445376 449087 452845 455669 457197 457890 458269 458290 457393 454880 450376
61630 450376 444382 438365 433786 430856 428562 425997 423283 421112 419850 419334 419161 418925 418482 418248 418895 420475
61614 420475 422110 422760 422018 419983 416843 413018 409295 406201 403350 399938 395771 391399 387284 383380 379499
61599 379499 375659 371945 368444 365381 362935 360784 358163 354631 350613 347039 344594 343333 342812 342437 341825
61584 341825 340973 340076 339237 338422 337592 336682 335561 334205 332911 332058 331693 331585 331683 332171 333003 333676 333696 333143
61566 333143 332651 332830 333742 334862 335641 336175 337176 339065 341256 342673 342873 342342 341832 341865 342827 344860 347332
61549 347332 348964 348994 347997 347208 347272 348022 349159 350597 352133 353357 354173 355151 357109 360394 364568 368793
61533 368793 372473 375607 378530 381336 383639 384941 385052 384044 382033 379266 376315 373813 371896 370091
61519 370091 367899 365359 363012 361390 360616 360391 360287 360080 359834 359718 359803 360080 360578 361302 362071 362575 362632 362284
61501 362284 361605 360544 359031 357173 355307 353923 353477 354105 355417 356713 357580 358208 358998 359995 360912 361614
61485 361614 362253 362883 363326 363604 364151 365215 366312 366741 366589 366745 367824 369543 371288 372817 374081 374850
61469 374850 375031 375114 375761 376969 378099 378677 378766 378535 377975 377120 376229 375550 375222 375465 376521 378250 380100 381582
61451 381582 382508 382725 382069 380811 379701 379220 379082 378821 378558 378777 379573 380592 381617 382823 384500 386820
61435 386820 389792 393175 396497 399484 402340 405317 408198 410557 412393 414035 415537 416707 417653 418721
61421 418721 419820 420486 420834 421805 424049 427062 429834 431961 433609 434754 435067 434427 433042 431108 428757
61406 428757 426236 423743 421159 418326 415524 413212 411404 409768 408313 407385 406910 406259 405137 404045 403519
61391 403519 403379 403162 402876 402869 403295 404191 405781 408051 410201 411185 410824 409889 409120 408709 408736 409375 410454 411491
61373 411491 412489 414124 416729 419619 421973 423938 426222 428889 431296 433171 435067 437659 441072 445008
61359 445008 449107 453083 456943 461219 466642 473420 481118 489322 498064 507483 517466 527828 538418 548797
61345 548797 558106 565660 571579 576631 581548 586513 591021 594121 595141 594493 593495 593117 593015 591944 588847
61330 588847 583422 576161 568297 561278 555651 550613 545143 539399 534445 530855 528336 526670 526097 526540 527307
61315 527307 528097 529708 533119 538300 544498 551368 559193 568225 578514 590389 604413 620638 638272
61302 638272 656205 673436 688815 700948 708874 712755 713584 712330 709609 705948 701781 696964 690702
61289 690702 682369 672321 661637 651066 640691 630751 622303 616474 613055 610439 607235 603609 600711
61276 600711 599179 598738 599136 600717 603773 607829 612056 616153 620364 624719 628782 632324 635882 640407 646583
61261 646583 654665 664711 676519 689362 702124 713887 724212 732845 739436 743739 745900 746291 745130
61248 745130 742393 737996 731898 724200 715425 706593 698664 691879 685915 680645 676292 672798 669556 666105
61234 666105 662637 659404 656096 652466 649306 647979 648895 651204 654155 658020 663208 669191 675068 680755
61220 680755 686845 693471 700119 706620 713535 721290 729523 737615 745407 752928 759784 765292 769156 771686
61206 771686 773463 775071 777115 780239 785012 791776 800483 810722 822223 835476 851527 870934 893092
61193 893092 916793 941078 965222 988205 1008716 1025652 1038384 1046802 1051552 1054012 1055423 1055943 1054954
61180 1054954 1052196 1048141 1043268 1037474 1030261 1020987 1009010 994258 977898 961734 946550 931532
61168 931532 915606 898793 881808 864932 847860 830362 812434 794105 775683 758017 741907
61157 741907 727401 714251 702959 694678 689938 687960 687424 687585 688601 691151 695759 701965 707925 711187
61143 711187 710238 705306 697746 688991 680091 671832 664877 659737 656633 655341 655332 656342 658706 662868 668629
61128 668629 675388 683157 692927 705768 721823 740393 760767 782766 806605 832430 860013 888933
61116 888933 919033 950423 982774 1014964 1045988 1076039 1105961 1135587 1163389 1188083 1209865
61105 1209865 1229594 1247409 1262796 1275447 1285170 1291116 1291971 1287146 1277191 1262955 1244836 1223176
61093 1223176 1198913 1173309 1147101 1120250 1092636 1064836 1037964 1012738 988947 966111 944498
61082 944498 925084 908487 894422 882353 872215 864113 857770 852796 849295 847695 848091 850241 854080
61069 854080 859790 867336 876391 886725 898252 910645 923432 936618 950853 966800 984635 1004268
61057 1004268 1025668 1048790 1073573 1100247 1129316 1160953 1194689 1230035 1267139 1306499 1348224
61046 1348224 1392001 1437623 1485072 1534031 1583777 1633762 1684024 1734806 1785921 1836639 1886087
61035 1886087 1933616 1978975 2022395 2064472 2105750 2146272 2185618 2223388 2259433 2293506 2324872
61024 2324872 2352655 2376734 2398199 2418866 2440560 2464994 2494148 2530279 2575323 2630334 2695676
61013 2695676 2771757 2859707 2961760 3081718 3225666 3402474 3623504 3901625 4250357 4683844
61003 4683844 5217639 5869906 6662872 7624585 8790226 10199859 11886478 13848992 16015206
60994 16015206 18217633 20212753 21754294 22690193 23026944 22923088 22621662 22363782 22317946
60985 22317946 22533810 22921432 23268557 23308540 22822634 21727223 20097583 18120384 16012208
60976 16012208 13953009 12058819 10386274 8949241 7735060 6717855 5868709 5161298
60968 5161298 4573024 4084213 3677652 3338408 3053390 2811117 2602207 2419855 2259531
60959 2259531 2118125 1993186 1882424 1783572 1694783 1615183 1544690 1483146 1429844 1383774 1343622
60948 1343622 1307224 1271693 1234854 1196559 1158274 1121509 1086876 1054227 1023106 993088 964105
60937 964105 936429 910131 884838 860429 837681 817578 800042 783933 768326 753238 739087
60926 739087 726100 714511 704720 696791 690151 684183 678840 674298 670331 666541 663068 660555 659206 658314
60912 658314 656969 655136 653756 653735 655007 656739 658350 660026 662138 664448 666247 667114 667137 666437 664889 662399
60896 662399 659012 654602 648836 641674 633571 624941 615819 606385 597448 589837 583439 577396 571194 565046
60882 565046 559164 553226 546794 539820 532432 524586 516377 508480 501799 496578 492194 487927 483701 479942
60868 479942 476948 474713 473362 473427 475400 479082 483605 488222 492930 498210 504252 510654 516750 522013 526135
60853 526135 529077 531230 533359 536153 539793 544009 548453 552821 556760 559947 562373 564365 566161 567441
60839 567441 567410 565395 561384 555947 549675 542829 535616 528581 522363 517030 512037 507115 502863 500050 498533
60824 498533 497374 495955 494391 492719 490382 486907 482609 478111 473549 468847 464422 460775 457401 452990
60810 452990 447019 440419 434312 428710 423104 417791 413802 411593 410469 409381 407804 405801 403716 401925
60796 401925 400538 399206 397571 395996 395366 395957 396955 397462 397711 398708 400788 403019 404260 404482 404762 406023
60780 406023 408116 410304 412396 414960 418372 422126 425492 428480 431582 434728 437264 439045 440771 442873
60766 442873 444759 445688 445830 445800 445625 444972 444153 443933 444289 444216 442998 440976 438731 436183 432970 429260 425709
60749 425709 422852 420929 419973 419648 419293 418602 418084 418308 418769 418075 415364 411151 406606 402316 398007 393314
60733 393314 388497 384275 381034 378412 375826 373267 371236 369901 368782 367493 366367 365944 366197 366773 367650
60718 367650 368935 370201 370809 371037 372123 374800 378277 381036 382367 382824 383511 385223 387997 391144 393889
60703 393889 396263 399117 402993 407279 410807 413049 414316 415049 415487 415979 416991 418545 419986 420592 420302
60688 420302 419722 419538 419971 420700 421225 421351 421297 421320 421430 421622 422129 423154 424486 425766 427030 428560 430242
60671 430242 431514 432104 432325 432382 431780 429794 426352 422110 417792 413731 409980 406555 403534 401104 399488
60656 399488 398696 398384 398205 398291 399184 401150 403692 405934 407530 409090 411550 415085 418769 421394 422485 422333
60640 422333 421197 418893 415267 410768 406292 402579 399889 398090 396843 395814 394926 394399 394433 394922 395567 396175
60624 396175 396687 397024 397135 397145 397294 397640 397994 398177 398249 398443 398885 399395 399603 399332 398820 398496 398559 398913 399491 400325
60604 400325 401286 402106 402840 403969 405731 407601 408832 409366 409821 410682 411924 413439 415351 417690 420114 422209
60588 422209 423949 425720 427935 430676 433540 435831 437061 437343 437197 436992 436719 436280 435792 435592 436181 438124
60572 438124 441688 446489 451813 457475 464128 472592 483066 495129 508263 522082 536202 550104 563114
60559 563114 574418 583173 588697 590535 588429 582598 574128 564729 555810 547956 541429 536749 534322 533760
60545 533760 534181 535211 537330 541239 547274 555484 565776 577801 591097 605698 622309 641509 662807
60532 662807 684712 705689 724809 741576 755437 765645 771502 772738 769777 763725 755951 747482 738726
60519 738726 729774 720805 712089 703670 695419 687557 680909 676284 673612 671920 670278 668617 667662 668328 671268
60504 671268 676751 684751 695307 708958 726689 749306 777017 809786 847839 891511 940675 994557
60492 994557 1051990 1111424 1170711 1227285 1278793 1323480 1359985 1386990 1403100 1406963 1397622 1375081
60480 1375081 1340602 1296255 1244189 1186495 1125545 1063829 1003253 944944 889901 839340 794029
60469 794029 753678 717503 685230 657074 632862 611705 592689 575552 560482 547501 536258
60458 536258 526376 517802 510721 505080 500208 495137 489414 483539 478445 474634 471924 469800 467773 465495
60444 465495 462917 460383 458345 456936 455997 455423 455195 455051 454537 453531 452403 451464 450543 449309 447758 446033
60428 446033 443988 441409 438638 436538 435671 435791 436325 437103 438362 440223 442510 445066 447890 450778 453139
60413 453139 454448 454795 454727 454587 454331 454027 454110 454885 456047 457088 458012 459248 460900 462514 463715 464687 465884
60396 465884 467579 469842 472641 475698 478551 481118 483956 487572 491637 495299 498197 500690 503132 505435
60382 505435 507531 509782 512614 515980 519423 522501 524989 526948 528840 531328 534623 538190 541353 544069
60368 544069 546839 550034 553674 557679 561856 565675 568600 570802 573107 575995 579086 581900 584800 588767
60354 588767 594443 601789 610512 620358 630998 642007 652996 663441 672420 678951 682759 684296 683851
60341 683851 681070 675726 668565 660877 653349 645822 638139 630676 623928 618085 613285 609797 607470 605267
60327 605267 601955 597301 592178 587379 582745 577676 572189 567131 563448 561529 561215 562142 563935 566319 569312
60312 569312 573465 579814 589335 602199 617468 633716 649993 666153 682313 698334 713953 729107
60300 729107 743671 756962 767813 775115 778082 776139 769118 757648 742936 725922 706997 686765
60288 686765 666669 648396 632873 620136 609946 601986 595550 589599 583393 576885 570465 564568 559505
60275 559505 555332 551733 548296 544975 542078 539774 537908 536410 535462 534986 534288 532588 529857 526852 524403
60260 524403 522886 522276 522391 522923 523431 523518 523210 523143 524170 526448 528978 530404 530344 529588 528871 528037 526756 525543
60242 525543 525394 526560 528315 529830 530694 530627 529445 527564 525992 525444 525834 526855 528569 531028 533767 536283
60226 536283 538758 541747 545251 548619 551440 554071 557180 561083 565665 570654 575862 581340 587392 594228
60212 594228 601596 609028 616454 624243 632492 640632 648079 655027 662191 669823 677354 684050 689714 694521
60198 694521 698398 700976 702227 702876 703819 705085 705644 704422 701398 697450 693292 688910 684068 678897 673699
60183 673699 668493 663141 657786 652730 647923 642949 637616 632292 627533 623603 620478 618054 616193 614713
60169 614713 613553 612801 612488 612472 612640 613005 613424 613501 613082 612665 612919 613863 614905 615690 616462 617451 618378 618870 619088
60150 619088 619611 620833 622732 625115 627803 630636 633497 636322 638999 641438 643974 647530 653042 660697
60136 660697 669922 680007 690409 700645 710428 719999 729806 739537 747853 753449 756176 756819 756044 754057
60122 754057 751236 748535 746913 746537 746778 746929 746802 746615 746468 746122 745392 744557 744077 743819 742929 740720 737465
60105 737465 733975 730536 726702 722086 716838 711201 705068 698427 691956 686674 683015 680606 678984 678169
60091 678169 678420 679807 682286 685890 690409 694960 698410 700495 702252 705046 709171 713581 716904 718544
60077 718544 718788 718133 716598 713617 708558 701407 692902 683833 674262 663700 652124 640501 630077 621333
60063 621333 613888 607257 601348 596239 591805 587798 584092 580726 577708 574892 572091 569342 567090 566069
60049 566069 566837 569405 573340 578205 583832 590157 596897 603459 609244 614153 618733 623650 628873 633577
60035 633577 636944 638864 639648 639345 637772 635081 631791 628115 623700 618226 611959 605401 598575 590974 582186
60020 582186 572373 562170 552211 542745 533615 524642 515967 507983 500951 494914 489922 486118 483510 481907
60006 481907 481126 480969 480920 480285 478970 477786 477596 478350 479360 480366 481781 483877 486256 488412 490519 493300
59990 493300 497169 501659 505785 508883 511097 513077 515286 517719 520187 522527 524332 524804 523291 519990
59976 519990 515809 511546 507444 503601 500471 498714 498567 499483 500411 500600 500235 500258 501513 504203 508201 513512
59960 513512 520021 527030 533600 539370 544586 549265 552772 554405 554082 552313 549837 547394 545468 543943
59946 543943 542289 540256 538116 535985 533259 529115 523417 516862 510408 504787 500389 497256 495180 493962
59932 493962 493510 493673 494312 495736 498701 503623 509974 516741 523283 529481 535322 540751 545696 549841 552549
59917 552549 553478 553089 552148 550989 549840 549578 551316 555126 559935 564843 569857 575111 580142 584429 588086
59902 588086 591536 594904 598119 601160 603701 604984 604670 603516 602649 602447 602749 603857 606461 610541 615128
59887 615128 619441 623693 628522 634108 640175 646549 653346 660781 668965 677765 686715 695236 703017 710019
59873 710019 716054 720674 723579 724861 724667 722954 719858 716088 712554 709599 706795 703526 699600 695308
59859 695308 691058 687040 683193 679370 675447 671256 666690 662105 658514 656992 657865 660771 665558 672606
59845 672606 681903 692107 700957 706662 708810 708286 706683 705593 705872 707340 709288 711250 713094 714531
59831 714531 714978 714001 711662 708332 704422 700364 696588 693341 690617 688201 685584 681892 676388 669243 661539
59816 661539 654239 647372 640442 633363 626609 620615 615393 610680 606082 601107 595507 589758 584916 581715
59802 581715 579909 578632 577216 575526 573659 571626 569340 566659 563395 559458 555181 551382 548859 547670
59788 547670 547038 546131 544886 543908 543592 543644 543619 543647 544242 545551 547208 549020 551324 554402 557787 560606 562535
59771 562535 564157 566353 569566 573631 578056 582337 586195 589693 593086 596507 599839 602940 605934 609229
59757 609229 613268 618298 624309 631130 638549 646309 654069 661610 669217 677617 687170 697152 706235 713879
59743 713879 720951 728698 737301 745729 752857 758368 762514 765409 766841 766667 765178 762985 760541 757811
59729 757811 754480 750525 746567 743509 741842 741304 741176 740814 739991 738846 737533 735874 733455 730135 726280
59714 726280 722304 718171 713707 709313 705834 703552 701778 699759 697632 696037 694999 693796 691988 690106
59700 690106 689054 689115 689814 690602 691356 692240 693353 694610 695783 696473 696173 694649 692319 690023 688215 686535
59684 686535 684452 682156 680399 679406 678436 676688 674209 671501 668504 664583 659390 653190 646235 638481 630236
59669 630236 622620 616795 612826 609679 606316 602539 598805 595629 593287 591820 591060 590704 590539 590617 591145 592232
59653 592232 593789 595687 597949 600690 603829 606901 609249 610473 610669 610145 608960 606844 603662 599827 596114
59638 596114 593043 590578 588480 586738 585533 584950 585013 585841 587306 588451 587832 584847 580481 576312 572968
59623 572968 569970 566853 563786 561019 558379 555629 552840 550037 546872 543129 539344 536478 535044 534889
59609 534889 535684 537167 538959 540592 541932 543269 544917 546960 549438 552433 555739 558703 560734 561872
59595 561872 562653 563502 564499 565720 567473 569961 572787 575036 575950 575463 574035 572045 569516 566450 563233
59580 563233 560481 558520 557185 556139 555246 554569 554125 553754 553188 552194 550765 549296 548514 548982 550489 552075
59564 552075 552882 552995 553204 553993 555009 555655 555799 555594 554946 553705 552285 551431 551232 550962 550161 549429 549711 551235
59546 551235 553673 557037 561780 568021 575276 583171 592192 603640 618983 638913 662412 686500 707251
59533 707251 721481 727797 726636 719884 710325 700669 692625 686948 684167 684702 688211 693439 699067 704312
59519 704312 708524 710794 710567 708281 704752 699990 693155 683783 672630 661127 650186 639732 629342
59506 629342 619230 610403 603715 598877 594713 590408 586188 582638 579800 577199 574404 571282 568026 565265
59492 565265 563799 563794 564460 564981 565506 566727 568714 570814 572611 574295 576060 577856 579939 583017 587533 593249
59476 593249 599811 607183 615094 622616 628865 633918 638480 642764 646186 648135 648639 648340 648191 649106 651436
59461 651436 654713 658281 662271 667502 674314 682017 689863 698101 707441 717692 727665 736592 744942 753399
59447 753399 761466 767739 771353 772471 771262 767168 759642 749264 737590 726089 715633 706772 699882
59434 699882 694814 690888 687489 684518 682215 680815 680580 681819 684632 688758 693961 700527 709242 720926
59420 720926 736083 754853 776980 801762 828186 855364 883029 911684 942046 973793 1004431
59409 1004431 1029429 1044026 1045600 1034959 1015800 992911 970484 951531 938314 932753 935855 946471
59397 946471 960682 972777 977342 971236 954509 929960 901687 873440 847638 825273 806334 790346
59385 790346 776862 765677 756565 748888 741795 734919 728638 723408 719023 714817 710541 706752 704219 703102
59371 703102 702822 702671 702472 702644 703695 705727 708442 711493 714770 718474 723090 729166 736868 745774 755376
59356 755376 765760 777519 790994 805998 822385 840478 860650 882719 905992 929686 953092
59345 953092 975633 997071 1017425 1036360 1052790 1065430 1073635 1077457 1077084 1072596 1064126 1051889 1036124
59332 1036124 1017313 996345 974061 950733 926368 901442 876846 853178 830592 809420 790359
59321 790359 773814 759418 746423 734284 722752 711802 701694 692804 685181 678541 672828 668353
59309 668353 665125 662534 660186 658740 659370 662496 667560 674055 682327 693174 706993 723368 741012
59296 741012 757655 770200 775721 772940 762956 748400 731838 714933 698826 684634 673163 664419
59284 664419 657899 653311 650705 650066 651280 654473 659893 667431 676787 688177 702175 718616 736281
59271 736281 754134 772377 791738 811992 831648 848901 862614 872769 880318 886246 890445 891823
59259 891823 889847 885363 879474 872356 864003 855403 847650 840270 831800 822170 813202 806475 801903 798924
59245 798924 797856 799144 802083 805331 808300 811358 815005 819572 825278 831819 838068 842877 846067 848089
59231 848089 848868 847504 843028 835014 823703 810065 795504 780880 765931 750200 734280 719453
59219 719453 706241 694151 682849 672726 664066 656452 649445 643277 638400 634762 631972 629828 628299
59206 628299 627238 626533 626337 626820 627793 628925 630214 632012 634551 637598 640581 643033 645018 647054 649502
59191 649502 652106 654386 656344 658364 660473 662234 663490 664654 666060 667509 668838 670417 672686 675519
59177 675519 678552 681782 685359 689032 692369 695436 698726 702506 706704 711413 716944 723259 729777 735911
59163 735911 741509 746584 750870 753743 754500 752707 748480 742363 734795 725756 715185 703543 691670 680152
59149 680152 669201 659006 649766 641328 633260 625433 618180 611821 606337 601579 597431 593631 589795 585769
59135 585769 581677 577633 573822 570882 569592 569867 570640 571177 572068 574425 578458 583413 588640 594082 599891
59120 599891 606240 613541 622161 631741 641379 650776 660754 672245 685108 698325 711130 723486 735544
59107 735544 747145 757978 767832 776453 783400 788381 791695 794021 795656 796150 794852 791675 787202 782176
59093 782176 777077 772145 767584 763677 760780 759118 758427 757895 756710 754602 751607 747460 741715 734532 726808
59078 726808 719272 711869 704346 696969 690157 683730 677198 670739 665233 661137 657755 653926 649173 643991
59064 643991 639170 635074 631573 628491 625975 624240 623018 621553 619364 616777 614412 612381 610357 608287
59050 608287 606535 605354 604633 604190 603874 603381 602506 601660 601565 602137 602272 601180 599483 598381 598079 597744 596947
59033 596947 596389 596990 598903 601876 606156 612426 620905 631083 642579 655867 671708 689953 709350
59020 709350 728642 747387 765381 781610 794392 802621 806422 806506 803347 797260 788936 779461 769840
59007 769840 760743 752639 745967 741166 738615 738420 740222 743426 747719 753138 759459 765831 771368 775898
58993 775898 779850 783538 786896 789750 791897 792863 792037 789221 784903 779969 775294 771520 768887 767225 766374
58978 766374 766613 768423 771867 776631 782713 790586 800430 811594 823170 834836 846805 859186 871902
58965 871902 885114 899229 914294 929619 944097 956782 967179 975226 981107 984911 986277 984434
58953 984434 978656 968719 955032 938476 920115 900817 880994 860811 840776 822031 805760 792248
58941 792248 780702 770207 760764 753193 748009 744701 742289 740325 739039 738575 738544 738546 738791 739849 741754
58926 741754 743565 743918 741982 737967 732845 727624 722803 718437 714530 711146 708157 705208 702183 699512
58912 699512 697718 696755 696208 696197 697693 701616 707791 715126 722855 731361 741671 754327 768899 784513
58898 784513 800557 816759 832849 848563 864047 879925 896725 914435 932925 952653 974513
58887 974513 998858 1024985 1051671 1077815 1102284 1123484 1139772 1150482 1156176 1157663 1155054 1148036
58875 1148036 1136813 1122287 1105247 1085870 1064374 1041917 1020334 1000902 983772 968733 956057
58864 956057 946114 938375 931436 924192 916582 909021 901527 893748 885569 877223 868861 860387 851746 843031
58850 843031 834301 825599 817281 809966 803876 798326 792121 784420 775103 764450 752745 740318 727715
58837 727715 715609 704469 694381 685259 677156 670301 664771 660222 656109 652216 648886 646635 645564
58824 645564 645268 645334 645854 647326 650111 654095 658904 664246 669872 675331 680079 683923 687138 690002 692417
58809 692417 694154 695251 695887 695973 695198 693453 690927 687780 684043 679912 675800 671925 668036 663680 658543
58794 658543 652452 645394 637806 630561 624308 618923 614014 609877 607527 607644 609767 612685 615467 618028
58780 618028 620892 624568 629032 633654 637648 640714 643187 645478 647406 648196 647119 644034 639300 633408
58766 633408 626901 620567 615294 611461 608654 606289 604441 603688 604270 605880 608409 612259 617434 622757 626673
58751 626673 628718 629617 629979 629612 628343 626916 626544 627823 630465 633963 638188 643336 649572 656719 664264
58736 664264 671774 679406 687764 697097 706847 716250 725191 734128 743316 752485 761229 769233 775990 780850
58722 780850 783719 785498 787444 790209 793784 798235 804000 811347 819891 828851 837495 845140 851016 854560
58708 854560 855840 855312 853083 848605 841206 830728 817567 802281 785268 766652 746392 724654 702210
58695 702210 680293 659967 641734 625758 612090 600425 590014 580260 571291 563571 557075 551239
58683 551239 545651 540342 535385 530645 526059 521810 518118 515262 513849 514530 517158 520656 524167 528042
58669 528042 533286 540286 548645 558184 569505 583311 599481 617010 634580 650876 664447 673697
58657 673697 677454 675757 669977 661921 652759 642889 632693 622918 614097 605990 598070 590495 584197 579955
58643 579955 577671 576628 576200 576164 576534 577374 578741 580638 582953 585477 588102 590931 594072 597240 599697
58628 599697 600780 600427 599054 597007 594498 592100 590829 591446 593902 597790 603067 609910 617913 625949 632977
58613 632977 638737 643519 647464 650316 651739 651703 650502 648440 645602 642021 638083 634567 632045 630305 628513
58598 628513 625981 622645 618886 615150 611825 609268 607760 607476 608553 611127 615260 620909 628132 637234
58584 637234 648498 661646 675703 689569 702694 715044 726475 736473 744718 751647 758064 764204
58572 764204 769579 773966 778376 784796 794861 808778 825578 844503 866065 891515 921206 953880
58560 953880 987757 1021792 1055263 1086498 1112970 1132864 1145913 1152616 1153412 1148999 1140805 1130541
58548 1130541 1119532 1108701 1098619 1089208 1079885 1070376 1060826 1050622 1037823 1020647 999218 975182
58536 975182 949985 924371 899236 875846 855041 836896 821287 808186 797360 788469 781550 776782
58524 776782 773700 771212 768548 765708 762918 760247 757772 755523 753120 750065 746537 743258 740447 737501
58510 737501 733927 729987 726155 722511 718891 715119 710936 706352 702241 699815 699133 698832 697757 696169 694868
58495 694868 693888 692808 691735 691174 691307 692191 694328 698258 703759 710173 717370 725718 735259 745753 757560
58480 757560 771672 788547 807455 827182 846902 865967 883196 896876 905563 908769 906879 900583
58468 900583 890526 877518 862819 847916 834028 822054 812821 806846 803811 802870 803790 807327 814137
58455 814137 823782 835257 848057 862131 876957 891171 903023 910929 913882 911837 905668 896443 884928
58442 884928 871949 858806 846806 836596 828370 822356 818540 816210 814532 813522 813837 815654 818383
58429 818383 821544 825336 830230 836524 844385 853800 864221 874627 884134 892267 898474 901749 901058 896184
58415 896184 888078 878393 868481 858648 848374 837335 825943 814847 804342 794616 786094 778998 772847
58402 772847 767106 762174 759138 758564 760038 762812 766337 770188 774111 778218 782648 786935 790253 792354
58388 792354 793783 795140 796682 798684 801449 804665 807338 808813 809526 810430 812042 814332 817209 820747 825050
58373 825050 830193 836235 843204 851134 860073 869877 880103 890404 900999 912387 924670 937503 950702
58360 950702 964439 978735 993130 1006952 1019599 1030514 1039228 1045498 1049193 1050130 1048460 1045180 1041771
58347 1041771 1039261 1037903 1037711 1038844 1041495 1045932 1052619 1061856 1073272 1086138 1100162 1115464 1131873
58334 1131873 1148872 1166199 1183824 1201285 1217748 1232808 1246523 1258545 1268034 1274630 1278796 1281000
58322 1281000 1281409 1280668 1280138 1280837 1282806 1285858 1290137 1295472 1301047 1306444 1312427 1320025 1329386 1340111 1352099
58307 1352099 1365300 1379182 1393299 1407996 1423802 1440446 1457267 1474289 1492074 1510654 1529366
58296 1529366 1547691 1565582 1583050 1600155 1617434 1635707 1655253 1675606 1696294 1717425 1739489
58285 1739489 1762912 1787844 1814130 1841429 1869551 1898720 1929370 1961685 1995340 2029590 2063663
58274 2063663 2097415 2131715 2167930 2206829 2248185 2291465 2336566 2383840 2433776 2486721 2542537
58263 2542537 2600494 2659923 2720910 2783836 2848370 2913680 2979547 3046292 3113505 3180012 3245500
58252 3245500 3311154 3378211 3446977 3517850 3592198 3671314 3755475 3844954 3941053 4044963 4156275
58241 4156275 4273701 4396710 4525534 4660281 4801297 4949954 5107775 5274945 5450806
58232 5450806 5635657 5831182 6039264 6261287 6498412 6751715 7022206 7311415 7621727
58223 7621727 7955548 8314673 8701163 9118250 9569554 10058171 10587711 11163808 11793552
58214 11793552 12483841 13241391 14074041 14991424 16005405 17131525 18389864 19803661 21398135
58205 21398135 23202491 25253255 27595947 30287457 33403299 37047874 41362886 46534537
58197 46534537 52802435 60465190 69874399 81422106 95540306 112722486 133557850
58190 133557850 158762231 189175886 225633588 268539997 317071572 368281508 416788416
58183 416788416 455698970 478703492 482337132 467089925 436781212 396790283 352316790
58176 352316790 307440047 264945908 226489928 192812393 163976601 139638676 119277979
58169 119277979 102329086 88241220 76515621 66728643 58529851 51627907 45783894
58162 45783894 40808800 36553499 32895858 29735378 26991955 24600502 22504608 20655966
58154 20655966 19016000 17553205 16239297 15050068 13968192 12982263 12083611 11265347
58146 11265347 10522281 9848951 9238340 8683968 8181774 7728138 7317421 6943195 6600368
58137 6600368 6284166 5988453 5707560 5439300 5184453 4943913 4717727 4505867 4307994
58128 4307994 4122934 3949811 3789039 3640751 3503089 3373603 3251654 3137824 3031613
58119 3031613 2931506 2836869 2748116 2665181 2587361 2514449 2446534 2382757 2321616 2262504 2205736
58108 2205736 2151172 2098087 2046313 1996256 1947706 1899815 1852323 1805801 1760656 1716965 1675286
58097 1675286 1636408 1600035 1564690 1529311 1494222 1460368 1428413 1398799 1371899 1347761 1326155
58086 1326155 1306945 1289869 1273982 1258011 1241368 1224244 1206701 1188385 1169198 1149553 1129763
58075 1129763 1109748 1089470 1069152 1048978 1029094 1009933 991992 975235 959269 944137 930364
58064 930364 918153 907144 897045 887900 879615 871835 864442 857502 850481 842181 831942 820481 809118
58051 809118 798470 788321 778509 769456 761788 755625 750299 744736 738264 731059 723766 716687 709489 701708
58037 701708 693368 685054 677378 670282 662946 654624 645575 636779 628610 620386 611496 602315 593473 584837
58023 584837 576090 567865 561240 556195 551544 546514 541462 536866 532530 528248 524433 521482 519040 516511
58009 516511 513895 511613 509818 508492 507995 508863 510980 513396 515165 516118 516749 517606 519045 521444 525232
57994 525232 530467 536561 542804 549125 555871 562754 568540 572172 573729 573725 571902 567528 560767 552873 544823
57979 544823 536470 527374 517873 508874 501029 494521 489312 485129 481427 477824 474546 472011 470088 468154
57965 468154 465981 464216 463758 464810 466719 468652 470202 471361 472151 472492 472262 471243 469056 465427 460569
57950 460569 455125 449696 444605 440060 436188 432907 430205 428667 429206 432009 436219 441046 446727 453953
57936 453953 462809 472922 484271 497045 510780 524330 536712 547390 555646 560352 560662 556639 549103
57923 549103 539250 528409 517650 507284 496935 486221 475160 463963 452801 441962 432027 423722
57911 423722 417573 413609 411302 409990 409548 410372 412566 415464 418254 420651 422542 423462 423116 422037 421018
57896 421018 420127 419053 418210 418568 420474 423473 427295 432073 437463 442540 446920 451162 455751 460389 464636
57881 464636 468494 471929 474535 476050 476607 476047 473655 469089 463054 456580 450119 443767 437810 432548 427987
57866 427987 424122 421125 418936 417167 415728 415016 415225 416129 417901 421322 426589 432646 438369 443801 449517
57851 449517 455454 461243 467015 472916 478247 482123 484637 486389 487176 486312 484168 482175 481146 480537 479595
57836 479595 478319 476997 475623 474239 473207 472774 472794 473129 473782 474430 474412 473555 472550 472081 471967 471511 470356
57819 470356 468583 466333 463801 461442 459647 458081 455689 451563 445669 438561 430491 421134 410293 398602
57805 398602 387223 376956 367992 360351 353979 348389 342910 337598 333266 330200 327480 324168 320630 317967
57791 317967 316565 316024 316136 317000 318254 319173 319670 320500 322316 325201 329220 334690 341661 349710 358403 367435
57775 367435 376194 383895 390434 396514 402621 408359 413033 416354 418293 418791 418005 416399 414258 411493 408172
57760 408172 404746 401416 397765 393420 388685 384128 379980 376326 373436 371401 369768 368143 366865 366587
57746 366587 367393 368792 370350 371748 372399 371680 369620 366981 364631 363113 362653 363105 363948 364730 365481 366325
57730 366325 366874 366581 365630 364864 364758 365099 365766 367105 369204 371481 373560 376014 379525 383621 387008 389040
57714 389040 390235 391399 392912 394978 397768 400966 403713 405455 406472 407126 407052 405632 403024 400136 397713
57699 397713 396017 395266 395694 397001 398294 398798 398238 396397 392804 387191 379935 371795 363521 355840 349371
57684 349371 344200 339872 336120 333320 331999 332269 334123 337997 344612 354536 368236 386361 409613 438667
57670 438667 474537 518714 572512 636439 710096 791347 874216 947995 1000182 1021690 1010005
57659 1010005 968779 905837 831152 754316 681925 616953 560397 512724 473545 441210 413934
57648 413934 391124 372887 358581 346693 336091 326738 319015 312887 307929 303832 300560 298106 296260
57635 296260 294733 293444 292558 292126 291799 291116 290004 288750 287584 286592 285939 285696 285426 284439 282645 280682
57619 280682 278961 277093 274618 271892 269694 268194 266793 264878 262279 259049 255376 251925 249752 249490
57605 249490 250682 252278 253745 255348 257297 259083 260075 260445 260845 261124 260163 257338 253579 250365 248111
57590 248111 246174 244074 241891 239580 236817 233736 231113 229488 228527 227468 225793 223334 220208 216880
57576 216880 213952 211659 209779 208023 206238 204315 202359 200856 200143 199761 198912 197569 196529 196318 196694
57561 196694 197270 197886 198280 198187 197993 198489 199657 200510 200446 199986 199829 200035 200585 201839 203755 205431 206223 206695
57543 206695 207753 209426 211275 213344 215845 218382 220441 222240 224239 226093 227002 226916 226533 226257 225974 225787
57527 225787 226193 227528 229821 233099 237209 241486 245297 248907 253220 258719 265105 271822 278338 284113
57513 284113 288970 293412 298019 302648 306740 310158 313127 315596 317368 318561 319185 318629 316435 313351 310489
57498 310489 307648 303681 298593 293873 290377 287153 283165 279094 276452 275526 275191 274440 273259 272110 271218
57483 271218 270420 269298 267504 265255 263391 262625 262845 263398 263973 264831 266164 267582 268501 268872 269201 269772 270209
57466 270209 270113 269929 270567 272172 273885 275050 276006 277274 278592 279346 279539 279688 280102 280820 281867 282923 283207
57449 283207 282516 282054 283269 286026 288873 291006 292972 295409 298123 300679 303036 305236 307150 308811 310418
57434 310418 311854 312794 313396 314247 315499 316718 317726 318877 320382 322080 323997 326371 328914 330891 332167
57419 332167 333428 335092 336824 338457 340483 343151 345797 347645 348734 349645 350906 353004 356249 360132
57405 360132 363485 365717 367351 368969 370433 371596 372969 374977 377237 379303 381528 384404 387602 390505
57391 390505 393239 396333 399633 402420 404510 406578 409445 413525 418801 424758 430452 435164 438978 442466
57377 442466 446028 449799 453892 458321 462909 467577 472423 477258 481517 485023 488430 492458 497081 501884
57363 501884 506806 511950 517051 521640 525521 528719 531377 534124 538043 543601 549938 555788 560849 565686
57349 565686 570698 575858 581209 586880 592691 598341 603935 609866 616273 622959 629690 636174 642055 647335
57335 647335 652540 658107 663953 670024 676742 684304 692023 699111 705807 712897 720449 727772 734491 740831
57321 740831 746965 752872 758888 765672 773497 782135 791419 801285 811283 820728 829565 838542 848338 858841
57307 858841 869435 879611 889304 898966 909335 920832 933181 945852 958692 971794 984934 997677
57295 997677 1009975 1022276 1035051 1048507 1062668 1077392 1092387 1107513 1122903 1138595 1154270
57284 1154270 1169684 1184994 1200308 1215273 1229570 1243427 1257084 1270071 1281607 1291547 1300414 1308770
57272 1308770 1317123 1326150 1336335 1347457 1358951 1370643 1382618 1394664 1406389 1417748 1428944 1440123
57260 1440123 1451651 1464311 1478541 1493828 1509544 1526006 1543950 1563296 1583324 1603768 1624740
57249 1624740 1645807 1666206 1686012 1706130 1727018 1748287 1769630 1791247 1813226 1835355 1857703
57238 1857703 1880613 1903964 1927199 1950189 1973324 1996637 2019643 2042230 2064906 2087965 2111192
57227 2111192 2134624 2158783 2183767 2208786 2232984 2256163 2278451 2299943 2321002 2342310 2364144
57216 2364144 2386040 2407521 2428859 2450858 2474198 2499090 2525145 2551455 2577248 2602671 2628624
57205 2628624 2655778 2684121 2713355 2743255 2773546 2803934 2834288 2864455 2894026 2922679 2950584
57194 2950584 2977947 3004381 3029358 3053049 3076022 3098272 3119355 3139304 3158568 3177160 3194776
57183 3194776 3211830 3229459 3248398 3268610 3290072 3313040 3337393 3362498 3387906 3413429 3438489
57172 3438489 3462233 3484558 3506300 3528206 3550307 3572305 3593843 3614305 3633117 3650354 3666487
57161 3666487 3681641 3695784 3709497 3723642 3738263 3752601 3766110 3778679 3790069 3800110 3809306
57150 3809306 3818241 3826517 3833366 3839214 3845504 3853025 3861422 3870208 3879122 3887670 3895567 3903454 3911900 3919822
57136 3919822 3925220 3927296 3926450 3922515 3914754 3903478 3889840 3873936 3854907 3833048 3810084 3787239
57124 3787239 3764914 3744364 3727722 3715976 3708688 3705774 3707541 3712815 3719224 3725761 3733149 3741792 3751833
57111 3751833 3765415 3786269 3816677 3857373 3910524 3979951 4068280 4177185 4310931 4476534 4680528
57100 4680528 4929990 5237792 5623096 6106304 6708266 7455022 8377267 9502511 10851237
57091 10851237 12438978 14272000 16335925 18593916 20996749 23485513 25985888 28421392
57083 28421392 30746300 32947971 34993109 36781544 38185439 39143662 39697627 39924302
57075 39924302 39850502 39442436 38658891 37493058 35973075 34149523 32090547 29874861 27578010
57066 27578010 25264925 22992914 20812927 18764274 16872060 15150917 13607253 12237626
57058 12237626 11030232 9970719 9044945 8237047 7529617 6907537 6359248 5873991 5440841
57049 5440841 5051078 4698648 4377647 4081811 3806892 3550952 3311780 3086489 2874132
57040 2874132 2676188 2493630 2325598 2171464 2031924 1907252 1796460 1698940 1615121 1544863
57030 1544863 1487068 1441726 1410641 1395168 1394333 1405338 1423913 1443131 1453506 1446034 1415540 1361905
57018 1361905 1289831 1207623 1124099 1044907 971832 905238 845781 793571 747530 706661 671020
57007 671020 640698 614766 591960 571730 554061 538836 525761 514364 503876 493702 484073 475580
56995 475580 468130 461111 454446 448582 443624 439615 437547 438766 443198 449488 457165 467437 481290 497817
56981 497817 514708 529314 538821 540709 534124 520395 501859 480704 458974 438542 420444 404788
56969 404788 391543 380800 372318 365795 361778 361225 363956 368723 375198 384705 398453 416176 437078
56956 437078 460827 486430 510816 529536 538690 536055 521597 497979 469893 441731 415706 392317
56944 392317 371720 353967 338743 325945 316278 310553 308786 310692 316753 327977 344801 367001
56932 367001 394618 428164 467461 510140 551027 583047 599719 598099 579879 549733 512654 472606
56920 472606 432612 395011 361315 332163 307508 286822 269436 254883 242861 232799 223830 215355
56908 215355 207378 200097 193474 187477 182428 178749 176415 174861 173477 172203 171689 172703 175295 178852
56894 178852 183245 189525 199072 212393 229427 250622 276848 308340 344522 384544 426712 467259
56882 467259 501028 524171 535680 536369 527707 512191 493512 474965 457956 442646 429457 419260
56870 419260 412718 410300 412593 419938 432136 449193 472028 501980 540085 587378 645153 713523
56858 713523 789241 865083 931234 977666 996992 987229 952626 901396 842195 782161 726619 678841
56846 678841 639759 608817 585639 570767 565192 569834 585413 612202 649928 698629 759748 835891
56834 835891 929192 1039540 1163028 1290277 1405958 1491844 1533175 1524358 1470226 1382800 1276472
56823 1276472 1164291 1056155 958393 874089 803849 746916 702205 668773 645843 632973 630375
56812 630375 638764 658840 691243 737015 797327 871976 957802 1048020 1132284 1197683 1231901 1228132
56800 1228132 1188241 1121246 1038558 950032 862711 781153 708071 645025 592809 551177 518769
56789 518769 494150 476950 467530 465710 470657 482151 501215 529091 565895 610097 658333 705004
56777 705004 742647 763952 764543 744497 707717 659868 606450 552009 500175 453467 412688 377033
56765 377033 345432 317772 294532 275566 259860 246392 234619 224132 214509 205695 198021 191551
56753 191551 185815 180439 175684 172049 169520 167479 165221 162431 159311 156411 154219 152756 151599 150267
56739 150267 148570 146663 144967 143931 143608 143536 143248 142880 142962 143697 144760 145867 147075 148408 149538 150183
56723 150183 150587 151295 152472 153691 154487 154999 155920 157749 160203 162565 164544 166439 168346 169674 169891 169493
56707 169493 169689 171114 173260 175198 176528 177574 179008 181329 184415 187462 189640 190861 191710 192678 193831
56692 193831 195220 197103 199534 202078 204213 205811 207013 207904 208589 209399 210658 212296 213910 215213 216205
56677 216205 216917 217177 216748 215623 214074 212461 211118 210342 210264 210545 210484 209779 209144 209710 211685 213985 215467
56660 215467 216128 216772 217833 219019 219911 220400 220586 220656 220815 220943 220459 218970 216963 215368 214457 213741 212925
56643 212925 212349 212296 212511 212745 213219 214092 214808 214543 213173 211437 210187 209662 209431 208810 207406 205350 202929
56626 202929 200091 196683 193242 191002 190706 191659 192375 192038 190969 189840 188890 187929 186711 185136 183287 181445
56610 181445 179955 178920 178041 176822 175080 173266 172253 172575 173871 175244 176154 176767 177408 178073 178664 179396
56594 179396 180604 182291 184201 186208 188319 190308 191685 192169 192016 191744 191625 191458 190798 189420 187690 186424
56578 186424 186245 187148 188761 190896 193544 196457 199095 201121 202713 204269 206017 208021 210347 212996 215904
56563 215904 219259 223646 229542 236677 244215 251565 258636 265252 270772 274632 277008 278561 279678 280366
56549 280366 280796 281394 282236 282793 282582 281783 280904 280010 278679 276629 274135 271802 270103 269064 268187 266751
56533 266751 264416 261584 258987 256960 255365 254116 253380 253130 252889 252266 251562 251503 252397 253782 254870 255136
56517 255136 254455 252991 251127 249357 247914 246536 244829 242942 241635 241444 241954 242116 241248 239495 237313
56502 237313 234938 232473 230227 228599 227679 227148 226558 225658 224567 223746 223677 224376 225302 225814 225656 224975 224139
56485 224139 223667 224054 225222 226326 226499 225831 225238 225324 225781 226067 226248 226780 227679 228398 228585 228538 228685 228924 228891
56466 228891 228762 229260 230598 231868 231924 230728 229329 228596 228507 228788 229575 231074 232976 234676 235851 236503 236680
56449 236680 236524 236375 236415 236410 236195 236173 236854 238028 238984 239506 240097 241162 242492 243695 244626 245199 245210 244712 244203
56430 244203 244153 244470 244670 244367 243465 242136 240915 240606 241679 243725 245754 247093 247849 248474 249079 249421 249452
56413 249452 249589 250212 251126 251878 252548 253754 255764 258015 259804 261049 262090 263155 264435 266290 268732
56398 268732 270971 272107 272191 271999 271974 272159 273088 275728 280144 285002 288849 291382 293060 294120 294599 294863
56382 294863 295410 296259 297059 297716 298473 299439 300418 301164 301526 301389 300776 299951 299158 298285 297028 295437 294071 293543
56364 293543 293969 294826 295315 294965 293969 292903 292148 291693 291443 291504 292052 293104 294474 295826 296816 297420 298109 299406
56346 299406 301254 303082 304500 305557 306298 306581 306540 306763 307699 309180 310782 312336 313812 315059 315988 316784
56330 316784 317614 318375 318976 319635 320627 322039 324050 327080 331212 335717 339630 342641 345064 347079 348517
56315 348517 349342 349923 350770 352207 354230 356492 358607 360669 363239 366536 369987 373043 376177 380411 385974
56300 385974 392017 397690 402878 407785 412362 416472 420187 423608 426719 429631 432744 436386 440552 445213
56286 445213 450649 457176 464650 472577 480684 489190 498373 508029 517533 526553 535584 545582 556982 569243
56272 569243 581502 593512 605778 618980 633541 649607 667051 685481 704593 724707 746745
56261 746745 771612 799829 831809 868158 909445 955861 1007469 1064880 1129458 1202709 1285465
56250 1285465 1377728 1479233 1589956 1709990 1839107 1976622 2121516 2272256 2426424 2580865
56240 2580865 2732369 2877872 3013815 3135772 3239285 3321081 3379247 3412565 3420281 3402624
56230 3402624 3361092 3297989 3215926 3117779 3006744 2886073 2758786 2627671 2495355 2364186
56220 2364186 2236082 2112538 1994653 1883084 1778044 1679434 1586984 1500355 1419269 1343619
56210 1343619 1273406 1208583 1149018 1094582 1045128 1000422 960164 924083 891876 863131 837411
56199 837411 814387 793794 775368 758971 744642 732216 720929 709741 698271 687224 677695 670108
56187 670108 663968 658608 653921 650198 647337 644564 641198 637525 634543 632834 632060 631727 631947 632997 634467
56172 634467 635474 635814 636330 637954 640717 643943 647124 650301 653816 658080 663525 670428 678572 687271 695915
56157 695915 704472 713441 723418 734786 747688 762078 777823 795025 814313 836552 862090 890631
56145 890631 922254 958433 1001636 1053914 1116315 1189754 1275916 1376734 1492862 1622471 1761019
56134 1761019 1901843 2037447 2161224 2268923 2359316 2434143 2497502 2554448 2608886 2661795
56124 2661795 2710983 2752408 2782038 2797214 2797191 2783070 2757374 2723337 2683611 2638586 2585461 2519343
56112 2519343 2436002 2334392 2217309 2090288 1959815 1831820 1710958 1600661 1503283 1419844
56102 1419844 1349804 1291588 1243505 1204086 1171837 1145331 1123624 1106158 1092295 1081395 1073308
56091 1073308 1068104 1065220 1063505 1062257 1061537 1061374 1061531 1062346 1064894 1069726 1076176 1083456 1091560 1100496 1109540
56076 1109540 1118256 1127547 1138579 1151162 1164328 1178073 1193272 1209963 1227037 1243786 1260734 1278635
56064 1278635 1297464 1316664 1335626 1353707 1370444 1386080 1401348 1416547 1431320 1445361 1458764
56053 1458764 1471583 1483798 1495978 1509358 1524825 1542215 1560844 1580373 1600892 1622429 1644689
56042 1644689 1667262 1690150 1714092 1740063 1768197 1797606 1827642 1858798 1891690 1925716 1959775
56031 1959775 1994124 2030367 2069469 2110785 2153356 2197166 2242553 2289013 2335320 2380692 2425624
56020 2425624 2471775 2521021 2574303 2631317 2691452 2754722 2821348 2890909 2962727 3036892 3114075
56009 3114075 3194470 3277872 3364793 3456530 3553901 3656685 3764514 3877569 3996287 4121097
55999 4121097 4252621 4391427 4537363 4689678 4847878 5012004 5182214 5358875 5542980
55990 5542980 5735895 5938963 6154020 6383754 6630519 6895338 7179229 7484851 7815268
55981 7815268 8171778 8555015 8967939 9415485 9901356 10427671 10998296 11620257 12301374
55972 12301374 13048978 13871856 14781303 15789670 16910725 18163008 19570958 21162462
55964 21162462 22969276 25032918 27409652 30171296 33408585 37241540 41830636 47383279
55956 47383279 54158329 62468228 72671879 85163703 100380668 118836267 141161290
55949 141161290 168118542 200531132 238983354 283140441 330803589 377303325 416026678
55942 416026678 440309726 445880062 432437505 403462066 364540387 321352732 278341121
55935 278341121 238327442 202741551 172028851 146022914 124241357 106096852 91014443
55928 91014443 78475323 68028459 59294689 51963543 45781788 40541801 36075086 32247185
55920 32247185 28950516 26097635 23617430 21452281 19554506 17883797 16406618 15095424
55912 15095424 13926431 12878202 11932616 11076128 10298890 9592701 8949974 8363842 7828308
55903 7828308 7338356 6890119 6480390 6105538 5761268 5443760 5150579 4880131 4630686
55894 4630686 4400365 4187549 3990719 3808172 3638313 3480014 3332456 3194991 3067478
55885 3067478 2950422 2844331 2749020 2663455 2585682 2512696 2440995 2367926 2292485 2215010 2136711
55874 2136711 2059611 1985973 1916952 1852068 1790368 1731610 1675952 1623170 1572927 1525442 1481144
55863 1481144 1439769 1400391 1362213 1324880 1288249 1252313 1217286 1183381 1150723 1119741 1091253
55852 1091253 1065582 1041883 1018942 996465 974966 954530 934386 913764 892620 871372 850465
55841 850465 830362 811530 794093 777719 761976 746652 731633 716807 702356 688993 677544
55830 677544 668083 659587 650707 640999 631334 623015 616622 611738 607412 602556 596212 588151 579217 570517
55816 570517 562150 553272 543476 533516 524524 517177 511913 509151 508683 509427 510510 512281 515747 521365 528974
55801 528974 538422 549429 561032 571916 581248 588494 592589 592193 587032 578284 567379 554982 541451
55788 541451 527662 514828 503767 494759 487857 482757 478363 473063 465855 457195 448584 441480 436813
55775 436813 435476 438705 447562 462197 481865 505279 530190 552624 567488 570860 562013 543396
55763 543396 519043 492861 467496 443969 422333 402904 386633 374201 365276 358981 354623 351469
55751 351469 348212 343403 336357 327337 317069 306542 296969 289249 283425 279009 275730 273583 272392 271895
55737 271895 272133 273062 273752 272586 268637 262596 256258 251219 247966 245819 243701 241151 238551 236225 233743
55722 233743 230522 226822 223462 220728 218287 216199 215255 216027 218263 221565 226192 232715 241030 249975 257761
55707 257761 262798 264547 263822 262029 259894 257128 253236 248222 242281 235368 227492 219147 211022 203426
55693 203426 196330 189891 184550 180634 178056 176509 175795 175924 176977 178932 181653 185069 189261 194275 199899
55678 199899 205749 211485 216803 221325 224807 227340 229013 229372 227678 223952 219431 215647 213154 211435
55664 211435 209924 208817 208732 209763 211163 212118 212732 214013 216788 220855 225345 229665 233793 237825 241657
55649 241657 245112 247988 249825 249903 247684 243174 236922 229780 222594 215776 209087 202049 194673 187574 181310
55634 181310 175861 170922 166481 162843 160099 157783 155232 152359 149934 148848 149020 149335 148825 147609 146419
55619 146419 145516 144567 143417 142363 141625 141013 140260 139305 138128 136686 135129 133702 132298 130484 128126 125670
55603 125670 123563 121669 119585 117325 115437 114458 114353 114477 114137 113287 112589 112611 113122 113439 113254 112709 111887
55586 111887 110986 110867 112545 115754 118794 120318 120794 121740 124051 127628 132077 137022 141989 146813 152092
55571 152092 158645 166503 174974 183565 192231 200689 208147 213928 217854 219809 219404 216399 211192 204614
55557 204614 197454 190261 183264 176257 168844 161066 153630 147351 142515 138951 136394 134531 132906 131243
55543 131243 129862 129451 130248 131648 132683 132873 132560 132508 133157 134234 135073 135368 135499 135991 136723 136862 135652
55526 135652 133178 130217 127462 124964 122297 119132 115530 111729 107746 103340 98418 93348 88710 84738
55512 84738 81207 77904 74964 72605 70738 69163 68073 67985 69072 70794 72348 73283 73549 73250 72703 72589
55496 72589 73628 75892 78610 80759 81801 81883 81536 81383 81983 83583 85831 87841 88855 88968 89009 89621 90611
55479 90611 91360 91655 91755 91825 91796 91793 92137 92718 92923 92555 92376 93199 94757 96050 96648 97008 97530 97981 98028 97806
55459 97806 97594 97309 96685 95827 95251 95364 95976 96396 96047 95100 94403 94642 95630 96624 97147 97207 96829 95847 94232
55440 94232 92275 90358 88879 88403 89388 91502 93581 94645 94813 94999 95901 97506 99337 100843 101612 101566
55424 101566 101059 100669 100763 101289 102017 103028 104939 108460 113576 119259 124281 128260 131722 135171 138421 140852
55408 140852 141988 141629 139697 136200 131412 126001 120896 116753 113383 109934 105965 102125 99396 97879
55394 97879 96826 95749 94867 94478 94589 95229 96358 97298 97050 95620 94286 94027 94361 94410 94424 95300 96956 98236
55376 98236 98387 97728 96722 95252 93164 90906 89111 87872 86874 86075 85916 86757 88341 89918 90994 91833
55360 91833 93047 94790 96640 98311 99925 101310 101628 100353 98327 97077 97148 97746 98120 98553 99629 101091
55344 101091 101955 101618 100421 99135 98194 97559 97132 97050 97385 97700 97294 96051 94733 94163 94335 94642 94719 94616
55326 94616 94307 93609 92623 91725 90997 90107 88978 88119 88023 88607 89575 91007 93105 95473 97155 97512 96821 95915
55308 95915 95356 95068 94615 93705 92486 91515 91379 92163 93165 93373 92456 91247 90946 91842 93069 93705 93737 93757
55290 93757 94099 94633 95238 96033 97166 98616 100205 101626 102576 103035 103257 103260 102592 100962 98864 97147 96082
55273 96082 95360 94882 94938 95500 95988 96005 95871 96072 96533 96806 96685 96307 95796 95197 94723 94744 95430 96535 97582
55254 97582 98301 98871 99717 101011 102422 103477 104052 104311 104295 103877 103098 102203 101332 100495 99871 99703 99836 99796 99577
55235 99577 99897 101265 103105 104243 104166 103453 103016 103226 103760 104111 104178 104450 105481 107065 108174 107962 106715
55218 106715 105478 104860 104535 103968 103251 102983 103516 104564 105528 106038 106126 105956 105518 104661 103371 101919 100687
55201 100687 99844 99216 98491 97608 96983 97154 98098 99059 99339 99148 99311 100158 101103 101444 101155 100635 100088 99526 99170
55182 99170 99369 100181 101361 102711 104149 105448 106265 106499 106440 106481 106862 107636 108639 109448 109637 109186 108549 108256
55164 108256 108499 109084 109596 109657 109243 108806 108889 109616 110725 112050 113686 115582 117301 118355 118597 118155 117226
55147 117226 116067 114920 113701 112022 109856 107955 107246 107838 108990 109978 110637 111109 111557 112177 113064 113815
55131 113815 113658 112222 109959 107661 105925 105229 105947 107757 109371 109540 108345 107028 106608 107091 108016 109110
55115 109110 110238 111151 111625 111700 111624 111704 112146 112741 112751 111614 109875 108929 109531 110955 111927 112082 112142 112869 114182
55096 114182 115235 115220 114262 113531 114105 115643 116716 116635 116293 116780 117852 118545 118758 119240 120257 121271 121968
55079 121968 122628 123300 123504 123128 122853 123199 123742 123782 123334 122932 122889 123255 124109 125255 125900 125333 123891 122620
55061 122620 121932 121185 119803 118282 117667 118311 119569 120637 121325 121906 122523 122972 122991 122501 121534 120135 118481
55044 118481 116984 116077 115876 116101 116287 116081 115520 115139 115641 117190 119083 120320 120465 119801 118809 117801 117006
55027 117006 116620 116598 116596 116321 115869 115697 116279 117676 119307 120328 120482 120486 121207 122581 123722 124080 123944 123712 123237
55008 123237 122225 120924 119923 119479 119398 119493 119832 120516 121480 122529 123425 123973 124159 124183 124262 124425 124630 124971 125531
54989 125531 126010 125737 124284 122053 120104 119292 119675 120740 122015 123253 124245 124909 125558 126616 127965 129085
54973 129085 130026 131641 134341 137139 138592 138444 137679 137198 137159 137465 138035 138523 138521 138237 138318 138830 139067 138625 137989
54954 137989 137774 137994 138406 138984 139654 140102 140228 140305 140334 139801 138569 137429 137148 137357 137016 135770 134294 133492
54936 133492 133732 134730 135817 136544 137269 138831 141383 144093 146360 148765 152212 156695 161692 167383 174557
54921 174557 183364 192905 201995 209699 215274 218360 219263 218461 215842 211084 204703 197924 191411 184865 178100
54906 178100 171752 166537 162352 158563 154779 151031 147518 144542 142446 141325 140950 141085 141639 142435 143141
54891 143141 143624 144147 145069 146540 148561 151112 154102 157418 161083 165165 169562 174198 179421 185780 193239
54876 193239 201016 208270 214610 219714 222919 223624 221914 218442 213751 208020 201436 194538 188059 182432
54862 182432 177521 172829 168033 163266 158928 155342 152654 150883 149830 149056 148112 146776 145010 142930 140920
54847 140920 139409 138226 136463 133472 129825 126874 125506 125732 127178 129277 131084 131709 131163 130272 129648
54832 129648 129329 129449 130443 132184 133599 133729 132815 131828 131293 131076 130989 130973 130737 129825 128207 126527 125594 125694
54814 125694 126420 127052 127157 126903 126782 127070 127677 128455 129400 130485 131555 132513 133435 134401 135394 136419 137502
54797 137502 138482 139044 139065 138765 138476 138458 138956 140075 141483 142575 143087 143283 143422 143402 143166 143028 143259 143652 143971
54778 143971 144656 146566 149962 154121 158135 161891 166037 171088 176771 182414 187861 193734 200690 208567
54764 208567 216465 223440 228916 232631 234554 234790 233289 229772 224323 217853 211428 205188 198508 191247
54750 191247 184153 177872 172242 166946 162287 158782 156392 154699 153610 153408 154151 155329 156143 156033 155094
54735 155094 154111 153942 154775 156161 157736 159559 161705 164130 167133 171381 177067 183486 189876 196306 203228
54720 203228 210418 216824 221335 223362 222821 219959 215206 209022 201988 194938 188628 183102 177833 172606
54706 172606 167813 163672 159800 155952 152611 150382 149302 149167 149930 151166 151788 151114 149773 148731 147836
54691 147836 146277 144162 142598 142235 142689 143395 144123 144512 144054 142821 141466 140291 139034 137720 136872 136552
54675 136552 136061 135131 134621 135281 136431 136692 135745 134590 134146 134337 134641 134922 135355 135852 135952 135330 134190 133039
54657 133039 132176 131554 131165 131275 132067 133258 134327 135011 135347 135385 135219 135226 135893 137349 139256 141083 142266 142328
54639 142328 141269 139776 138656 138160 138241 139173 141187 143526 144721 144112 142522 141167 140504 140423 140890 141758 142336
54622 142336 141857 140320 138486 137101 136380 136145 136094 136015 135969 136286 137170 138347 139220 139340 138716 137748 136913 136384
54604 136384 135998 135702 135876 136840 138124 138767 138438 137813 137600 137669 137515 137161 137115 137611 138392 139172 139938 140698 141251
54585 141251 141325 140824 139864 138677 137512 136627 136314 136762 137786 138832 139484 139942 140724 141917 143014 143519 143423
54568 143423 143017 142488 141858 141110 140340 139874 140121 141052 141990 142356 142499 143244 144657 145885 146366 146463 146658 146774
54550 146774 146498 146103 146056 146328 146638 147172 148449 150604 153121 155234 156322 156197 155337 154645 154641 155024 155239 155154
54532 155154 154923 154535 153924 153224 152516 151578 150272 148936 147988 147443 147165 147263 147789 148417 148946 149689 150722 151200
54514 151200 150257 148391 147020 146769 147052 147340 147816 148574 149092 149016 148765 148912 149484 150244 151063 151612 151272 149954
54496 149954 148570 148102 148467 148826 148784 148692 148905 149351 149881 150553 151375 152092 152426 152424 152401 152648 153274 154281 155639
54477 155639 157181 158455 158937 158562 157926 157683 157832 157849 157512 157185 157264 157672 158098 158438 158808 159293 159873 160512 161184
54458 161184 161905 162740 163607 164155 164088 163620 163294 163334 163493 163557 163520 163130 161837 159590 157298 156031 155925 156189 156036
54439 156036 155300 154348 153748 153966 155054 156582 158026 159141 159906 160324 160473 160534 160572 160541 160593 161018 161624 161729 161275
54420 161275 161449 163447 166794 169686 170994 171174 171072 170653 169376 167292 165174 163777 163374 163889 165163 167005
54404 167005 169140 171110 172350 172613 172273 171957 171848 171643 171153 170526 169863 169146 168687 169016 169972 170462 169663 168067
54386 168067 166820 166408 166612 167377 168833 170542 171670 172142 172874 174443 176162 177002 176957 176890 177277 177804 178218
54369 178218 179039 181073 184460 188396 191846 194436 196625 199046 201779 204427 206741 208816 210604 211632
54355 211632 211467 210197 208228 205886 203485 201460 199913 198199 195532 192059 188824 186556 184912 183139
54341 183139 181058 179121 177844 177500 178087 179143 179789 179373 178088 176663 175529 174648 174097 174293 175398 176869
54325 176869 177892 178126 177756 177018 176020 174985 174298 174187 174482 174834 174981 174735 173920 172632 171449 171013 171268
54308 171268 171430 170941 170232 170183 170868 171329 170757 169573 168967 169504 170548 171073 170696 169784 168886 168378 168532 169501
54290 169501 171058 172549 173385 173585 173652 173888 173997 173535 172626 172014 172374 173665 175253 176500 177131 177146 176648 175879
54272 175879 175225 174925 174759 174244 173293 172522 172647 173578 174379 174309 173738 173815 175269 177749 180309 182288 183642 184645
54254 184645 185546 186519 187741 189307 190981 192138 192188 191194 189900 188985 188326 187223 185299 182934 180795 179213
54238 179213 178161 177629 177787 178801 180559 182578 184218 185155 185615 186010 186346 186334 186087 186315 187578 189631 191744
54221 191744 193443 194608 195166 195074 194515 193649 192279 190191 187785 185812 184396 182896 180993 179393 178875 179047
54205 179047 178761 177736 177050 177658 178909 179082 177337 174704 173057 173406 175278 177395 178667 178729 177970 177196
54189 177196 177009 177367 177761 177830 177646 177410 177167 176876 176610 176536 176814 177564 178733 179899 180520 180496 180246 180063 179722
54170 179722 179060 178589 178994 180086 180816 180444 179323 178376 178138 178447 178836 179009 179080 179389 180008 180445 180155 179326
54152 179326 178826 179164 179860 180083 179709 179417 179775 180513 180749 179853 178056 176226 175083 174646 174494 174446 174734 175546
54134 175546 176693 177823 178813 179812 181033 182557 184220 185635 186544 187177 188064 189390 190784 191821 192426 192634
54118 192634 192351 191774 191811 193534 197079 201394 205192 207975 210068 211917 213635 215174 216669 218407 220528
54103 220528 222991 225993 230198 236288 244242 253251 262223 270079 275688 278107 277202 273762 268760 262752
54089 262752 256173 249761 244270 240032 237174 235988 236563 238241 240106 242008 244508 247709 250735 252620
54075 252620 253164 252566 250714 247425 243187 239079 235841 233358 231072 228618 226000 223413 221107 219274 217888
54060 217888 216670 215345 213936 212750 212075 211928 212129 212539 213129 213857 214638 215511 216741 218613 221194 224307
54044 224307 227670 230927 233736 236117 238703 242345 247351 253257 259405 265568 271894 278419 284887 290982
54030 290982 296639 302095 307705 313550 319147 323631 326438 327795 328473 329107 329929 331049 332611 334440 335702
54015 335702 335313 332830 328852 324393 319944 315310 310351 305539 301553 298385 295149 290908 285500 279477
54001 279477 273434 267676 262478 258278 255350 253423 251868 250305 248831 247645 246627 245475 244099 242629
53987 242629 241124 239548 238055 236970 236287 235430 233819 231604 229600 228548 228594 229385 230352 230943 230970 230845 231200
53970 231200 232156 233215 234062 235152 237256 240609 244891 249943 256064 263584 272441 282407 293496 305900
53956 305900 319506 333565 346689 357026 362643 362269 356120 346070 334778 324388 315860 309324 304707
53943 304707 301865 300354 299550 299103 299075 299505 300101 300546 300952 301739 303158 305133 307508 310206 313158 316327
53927 316327 319824 323809 328179 332510 336379 339674 342612 345690 349547 354576 360496 366582 372529 378941
53913 378941 386685 395882 405751 415292 423817 430863 436044 439293 441076 442096 442778 443126 443043 442528 441489
53898 441489 439505 436062 431159 425559 420268 415699 411402 406532 400462 393042 384632 375936 367591 359678
53884 359678 351844 344046 336902 331002 326129 321525 316796 312130 307746 303664 300052 297209 294982 292659
53870 292659 289754 286508 283298 279961 276153 272116 268530 265691 263273 260910 258579 256378 254298 252296
53856 252296 250285 247982 245135 242051 239622 238560 238669 239012 238745 237762 236626 235934 235763 235746 235650 235651 235885 236002
53838 236002 235506 234481 233603 233458 234117 235311 236621 237538 237793 237745 238026 238707 239236 239351 239520 240198 241161 241970
53820 241970 242696 243642 244662 245298 245503 245734 246421 247725 249698 252250 254970 257402 259502 261546 263733 266306
53804 266306 269859 274850 280752 286313 290927 295283 300431 306661 313533 320528 327195 332987 337470 340635
53790 340635 342779 344211 345301 346509 348047 349604 350706 351111 350625 348782 345266 340537 335593 331055 326801
53775 326801 322478 317907 312974 307613 302113 297079 292791 288891 284899 280854 277152 273976 271110 268285
53761 268285 265464 262812 260476 258375 256211 253832 251549 249832 248697 247736 246823 246218 245668 244091 240879
53746 240879 237186 234975 234795 235343 235388 235277 236039 237735 239424 240420 240811 240871 240632 240145 239671 239466 239615 240104
53728 240104 240801 241363 241462 241192 241033 241427 242533 244319 246610 249099 251600 254295 257450 260887 264037 266490
53712 266490 268261 269546 270585 271707 273073 274356 275150 275755 277107 279774 283525 287976 293056 298533 303718
53697 303718 308181 312316 316655 320988 324748 327921 330869 333438 334987 335336 335044 334630 334074 333248 332363 331752
53681 331752 331541 331688 332024 332135 331539 330218 328720 327603 326950 326502 325976 325226 324357 323836 324141 325175 326234
53664 326234 326681 326368 325392 323921 322483 321909 322467 323291 323136 321674 319767 318537 318478 319377 320675 321820 322538
53647 322538 322915 323139 323225 323142 323125 323572 324591 325906 327345 329198 331793 334800 337251 338429 338670 339076 340417
53630 340417 342467 344541 346549 349223 353232 358356 363751 368878 373940 379422 385523 392153 399220 406580
53616 406580 413745 419971 424904 428974 432887 436749 439963 442080 443503 445153 447541 450346 452858 454727
53602 454727 456315 458335 461037 463772 465637 466582 467503 469009 470531 471024 470238 468779 467206 465743 464757
53587 464757 464724 465484 466105 465780 464429 462261 459356 456020 453039 450954 449382 447536 445262 443071 441288
53572 441288 439660 437813 435664 433294 430726 428018 425400 423217 421760 421107 421002 420975 420743 420458 420390 420470 420387
53555 420387 420119 420138 420856 421983 422674 422463 421908 422007 422975 424018 424556 425238 427128 430139 433067 435207 437165
53538 437165 439770 442982 446422 450346 455285 461024 466711 471913 476997 482512 488694 495608 503274 511682
53524 511682 521033 531905 544627 558457 571922 584199 595859 608094 621585 636284 651957 668593
53512 668593 686316 705141 724896 745450 766975 789811 813903 838578 863105 887363 911679
53501 911679 936119 960197 983186 1004501 1023991 1042255 1060541 1079908 1100418 1121321 1141897
53490 1141897 1161857 1181188 1200074 1218812 1237402 1255357 1272445 1289382 1307140 1325711 1344295
53479 1344295 1362620 1381223 1400243 1418821 1436043 1451723 1465867 1478060 1487936 1495655 1501335 1504546
53467 1504546 1504967 1503096 1499639 1494510 1487042 1476948 1464507 1450140 1434488 1418656 1403584 1389119
53455 1389119 1374332 1358774 1342804 1326554 1309311 1290309 1269744 1248642 1227914 1207866 1188459
53444 1188459 1169670 1151456 1133597 1115891 1098631 1082686 1068764 1056722 1045977 1036551 1029143 1024037
53432 1024037 1020551 1017969 1016378 1015983 1016157 1016056 1016000 1017352 1020971 1026514 1033350 1041390 1050748 1061270 1072862
53417 1072862 1085885 1100825 1117796 1136634 1157134 1178982 1201718 1225119 1249363 1274600 1300608
53406 1300608 1327223 1354912 1384525 1416486 1450509 1486162 1523497 1563045 1605248 1649996 1696795
53395 1696795 1745346 1795753 1848045 1901755 1956334 2011784 2068391 2125801 2182948 2239087 2294395
53384 2294395 2349188 2402996 2454930 2504682 2552563 2598573 2641964 2681916 2718238 2751165 2780637
53373 2780637 2806086 2826952 2843209 2855254 2863309 2867022 2865662 2858525 2845008 2824518 2796685 2761821
53361 2761821 2721030 2675844 2627765 2578020 2527295 2475652 2422965 2369554 2316169 2263371 2211369
53350 2211369 2160622 2112108 2066588 2023848 1982970 1943047 1903310 1862946 1821455 1779255 1737487
53339 1737487 1697184 1658936 1623143 1589995 1559165 1530134 1503059 1478843 1457967 1439657 1422663
53328 1422663 1406637 1392240 1379919 1369038 1358258 1346441 1333050 1318068 1302010 1285976 1271225
53317 1271225 1258327 1246797 1235816 1225319 1216136 1208945 1203340 1198247 1193138 1188496 1185079 1183071 1182180
53304 1182180 1182318 1183849 1187168 1192293 1199032 1207440 1217875 1230508 1244909 1260375 1276733 1294594 1314640
53291 1314640 1336794 1360340 1384752 1410016 1436087 1462371 1488023 1512570 1535978 1558205 1578943
53280 1578943 1597855 1614886 1630225 1643966 1655795 1664945 1670555 1672233 1670347 1665745 1659117 1650601 1639886
53267 1639886 1626639 1610844 1592817 1572900 1551143 1527370 1501560 1474124 1445723 1416887 1387844
53256 1387844 1358676 1329464 1300282 1271178 1242201 1213355 1184590 1155957 1127779 1100473 1074112
53245 1074112 1048383 1023136 998783 975787 953830 931902 909436 887033 865763 845911 826778
53234 826778 807705 788944 771387 755724 742079 730294 720300 712114 705523 699792 693760 686438 677650
53221 677650 667991 658045 647759 636642 624435 611397 598050 584839 571937 559237 546599 534218
53209 534218 522584 511924 501906 492231 483258 475543 468803 462050 454895 448079 442274 436852 430463
53196 430463 422598 413974 405459 397302 389510 382374 376143 370527 364981 359452 354499 350562 347311 343940
53182 343940 340035 335996 332481 329611 326902 323944 320838 317892 315163 312506 309856 307241 304690 302448
53168 302448 301054 300774 300965 300478 298802 296495 294377 292684 291193 289814 288712 287957 287364 286648 285618 284303
53152 284303 282983 281971 281258 280514 279538 278518 277703 277004 276146 275076 274041 273380 273354 274001 274978 275732 276074
53135 276074 276425 277269 278541 279779 280688 281255 281543 281821 282713 284696 287385 289787 291344 292312 293110 293796 294364
53118 294364 295069 296100 297283 298393 299501 300772 302186 303659 305117 306193 306268 305209 303662 302190 300500
53103 300500 298144 295621 293919 293010 291721 289341 286592 284617 283629 283098 282695 282354 281736 280484 278992 278187
53087 278187 278314 278483 277745 276265 275070 274892 275639 276870 278306 279747 280807 281044 280370 279181 278064 277352
53071 277352 276916 276325 275263 273896 272821 272473 272583 272392 271533 270521 270135 270410 270585 270117 269385 269164 269619
53054 269619 270169 270267 269928 269457 269013 268637 268453 268536 268684 268648 268599 269092 270401 272054 273197 273384 272851 272103 271436
53035 271436 270927 270664 270793 271357 272191 273000 273537 273789 274056 274767 276048 277472 278403 278626 278532 278652 279095 279507
53017 279507 279477 278928 278201 277792 277896 278100 277670 276325 274704 273913 274535 276154 277823 278917 279536 280224 281312
53000 281312 282488 283044 282627 281697 281063 281046 281263 281329 281463 282202 283663 285355 286697 287532 288088 288615 289179 289710
52982 289710 290145 290501 290929 291691 293023 294909 296926 298468 299259 299651 300259 301265 302236 302699 302734 302851 303422
52965 303422 304432 305692 307057 308435 309768 311049 312207 312970 313034 312420 311435 310178 308332 305636 302444
52950 302444 299563 297561 296406 295728 295211 294730 294324 294146 294306 294616 294569 293712 292096 290278 288863 288119 288004
52933 288004 288368 288932 289212 288797 287844 287014 286710 286610 286240 285762 285718 286024 285799 284466 282579 281231 280910 281326
52915 281326 282117 283244 284736 286448 288131 289493 290257 290405 290297 290205 289790 288464 286273 283979 282184 280802
52899 280802 279612 278872 279001 279941 281210 282475 283747 285077 286342 287321 287848 287974 288100 288768 290130 291707
52883 291707 292866 293416 293582 293591 293551 293537 293462 292979 291859 290440 289364 288912 288949 289479 290810 293032 295767 298579
52865 298579 301347 304004 306306 308110 309594 310810 311252 310265 307807 304496 300962 297564 294705 292862 291984
52850 291984 291159 289312 286285 282952 280233 278220 276391 274480 272788 271653 270938 270328 269948 270315 271544
52835 271544 272912 273387 272549 270823 268960 267467 266473 265900 265648 265722 266189 266983 267760 268088 267790 267071 266290 265794
52817 265794 265950 267075 269089 271389 273394 275300 278022 282138 286987 291051 293233 293559 292603 290560 287255
52802 287255 282889 278349 274513 271461 268645 265715 262964 260987 260097 260113 260473 260480 259707 258399 257376 257288 258050
52785 258050 259162 260440 262040 263717 264594 264071 262744 261919 262178 262805 262725 261673 260274 259266 259017 259595
52769 259595 260842 262287 263298 263652 263843 264647 266253 267898 268441 267398 265437 263871 263622 264668 266390
52754 266390 268271 270188 272168 274029 275340 275764 275518 275396 276106 277507 278814 279701 280860 283082 286056
52739 286056 288597 290028 290810 291743 293028 294348 295386 295931 295872 295509 295607 296668 298246 299409 299727 299376 298371
52722 298371 296343 293244 289769 286712 284225 282005 279997 278561 278020 278341 279220 280316 281373 282316 283197
52707 283197 284026 284705 285202 285660 286175 286628 286956 287396 288185 289075 289570 289663 289916 290577 291019 290452 289032 287819
52689 287819 287637 288340 289295 290221 291300 292647 293994 294903 295065 294324 292682 290531 288751 288146 288616 289116 288774
52672 288774 287940 287760 288657 289728 289851 289045 288269 288141 288388 288601 288979 290087 292113 294641 296986 298673 299738
52655 299738 300700 302107 303995 305954 307721 309386 310918 311853 311768 310797 309353 307534 305226 302706 300700
52640 300700 299772 299872 300521 301224 301696 301962 302311 303085 304556 307057 310979 316312 322303 327906 332477 335676
52624 335676 336896 335409 331287 325744 320271 315681 312059 309185 306753 304502 302469 300936 299935 299135
52610 299135 298408 298148 298642 299440 299822 299648 299252 298617 297305 295353 293738 293586 295115 297564 299957 301729
52594 301729 302786 303263 303298 302944 302232 301364 300800 301044 302255 304019 305594 306500 306952 307630 308966 310656 311904
52577 311904 312130 311447 310501 309904 309783 309823 309679 309299 308843 308484 308363 308625 309273 310110 310946 311724 312232 311943 310603
52558 310603 308871 307794 307598 307530 307041 306524 306562 307017 307349 307400 307340 307170 306823 306543 306563 306641 306425 306110 306161 306487
52538 306487 306526 306083 305442 304673 303569 302416 302088 302949 304240 305039 305461 306383 308167 310172 311510 311969 312056
52521 312056 312306 312681 312744 312353 312020 312376 313488 314907 316195 317121 317617 318101 319677 323308 328577 333776 337333
52504 337333 338690 337918 335337 331801 328454 325559 322268 318128 314193 311791 310710 309630 308151 307241 307561
52489 307561 308364 308548 308028 307530 307470 307651 307813 307964 308212 308626 309287 310192 311087 311540 311236 310169 308660 307312
52471 307312 306890 307919 310214 312898 315119 316824 318734 321535 325280 329653 334460 339449 343781 346249
52457 346249 346173 343788 339691 334408 328678 323580 319810 317102 314801 312772 311269 310076 308470 306088 303403
52442 303403 301171 299806 299339 299578 300094 300319 299927 299009 297861 296793 296178 296354 297244 298280 298915 299132 299355
52425 299355 299948 300929 302101 303299 304480 305622 306644 307534 308563 310162 312481 315227 318086 321148 324770
52410 324770 329230 334705 341421 349544 359126 370351 383483 397988 411822 422184 427173 426586 421381
52397 421381 412986 403027 392906 383243 374064 365699 358981 354376 351381 349184 347580 346919 347389 348597
52383 348597 349712 349911 348993 347680 347000 347258 347997 348935 350351 352394 354777 357510 361177 365862 370497 374033
52367 374033 376736 379484 382247 384263 385411 386254 386756 386144 384283 382186 380738 379820 379136 379024 379742 380675
52351 380675 381097 381320 382293 384295 386739 389146 391657 394522 397648 400713 403392 405523 407452 410148 414432
52336 414432 420015 425749 430963 436117 442015 448887 456605 465315 475244 486053 496997 507934 519685
52323 519685 533126 548139 563763 579253 594590 610050 625665 641373 657350 673861 690910
52312 690910 708364 726324 744995 764163 783243 802000 820895 840417 860373 880141 899423
52301 899423 918373 937148 955709 973931 991368 1006847 1018973 1027447 1033577 1038971 1043852 1047000
52289 1047000 1047221 1044417 1039236 1032294 1024103 1015413 1007073 999537 992764 986627 981152 976352 972125 968451
52275 968451 965470 963213 961523 960518 960985 963920 969550 976928 984554 991370 997285 1003032 1009587 1017620
52261 1017620 1027336 1038753 1051911 1066656 1082392 1098435 1114608 1131189 1148174 1164864 1180331
52250 1180331 1194078 1206128 1216720 1226015 1233803 1239266 1241373 1239833 1235569 1229978 1223885 1217382 1210351
52237 1210351 1202622 1193814 1183621 1172398 1161047 1150160 1139595 1128982 1118256 1107501 1096590 1085266
52225 1085266 1073440 1061285 1049231 1037998 1028356 1020598 1014420 1009471 1005794 1003499 1002292 1001716 1001768 1002894
52211 1002894 1005344 1008842 1012927 1017281 1021590 1025337 1028068 1029887 1031537 1033936 1037617 1042487 1047958 1053269
52197 1053269 1057922 1062160 1067059 1073765 1082281 1091165 1098740 1104555 1109277 1113350 1116279 1117353 1116434 1113688
52183 1113688 1109020 1102326 1094058 1085110 1076254 1067941 1060335 1053151 1045771 1038051 1030875 1025298 1021279 1017845
52169 1017845 1014501 1011789 1010382 1010261 1011043 1012559 1014810 1017807 1021721 1026721 1032338 1037386 1040915 1042961
52155 1042961 1044089 1044630 1044740 1044806 1045219 1045907 1046599 1047403 1048692 1050521 1052591 1054694 1056761 1058508 1059468 1059449 1058677
52138 1058677 1057507 1056299 1055520 1055592 1056583 1058361 1061043 1064992 1070399 1077234 1085657 1096087 1108774 1123643
52124 1123643 1140665 1160020 1181707 1205258 1230071 1255707 1281653 1307037 1331023 1353499 1375145
52113 1375145 1396763 1418647 1440567 1462138 1483019 1502784 1520927 1537327 1552723 1568349 1584811
52102 1584811 1601432 1616862 1630187 1641233 1650056 1656553 1660525 1661726 1659781 1654374 1645525 1633507 1618565
52089 1618565 1601109 1582086 1562699 1543604 1524741 1506020 1487808 1470639 1454864 1440758 1428598
52078 1428598 1418411 1409896 1402773 1396955 1392376 1389068 1387485 1388257 1391410 1396341 1402779 1411126 1421426 1432624
52064 1432624 1443582 1454484 1466537 1480485 1496023 1512472 1529349 1546314 1563189 1580030 1596587
52053 1596587 1611699 1623839 1632407 1637937 1640993 1641471 1639214 1634591 1628026 1619405 1608502 1595774 1582321
52040 1582321 1569138 1556599 1544441 1531998 1518634 1504276 1489433 1474600 1459787 1444843 1429901
52029 1429901 1415121 1400106 1383997 1366248 1347141 1327539 1308285 1289874 1272515 1256374 1241695
52018 1241695 1228637 1217014 1206334 1196146 1186283 1176792 1167819 1159576 1152115 1144879 1136725 1126682 1114584
52005 1114584 1100724 1085145 1067730 1049013 1030388 1013168 997685 983558 970668 959414 950006
51994 950006 941844 933797 924926 914759 903101 889928 875517 860391 845008 829619 814435 799562
51982 799562 784569 768459 750551 731390 712472 695104 679742 666322 654707 644669 635965 628828
51970 628828 624158 622838 624864 629354 635306 642079 649269 656499 663441 669800 675083 678481 679104 676405
51956 676405 670440 661871 651863 641883 633321 626948 622561 619309 616633 614967 615427 618834 625215 634174
51942 634174 645490 659219 675449 694114 714920 737338 760882 785479 811400 838622 866502
51931 866502 894190 920927 945425 965096 976566 977217 966193 944175 912921 875250 834789 794788
51919 794788 756972 721731 689349 660633 636273 616027 598915 584236 572176 563394 558188 556122
51907 556122 556343 558073 560778 564094 567766 571681 575726 579465 581957 582026 578805 572116 562511 551079 539085
51892 539085 527442 516322 505435 494896 485730 479215 475675 474188 473591 473585 474722 477631 482574 489571
51878 489571 498528 509149 521013 533767 546911 559347 569488 576174 579360 579735 577822 573722 567669
51865 567669 560531 553538 547518 542477 538049 534352 532218 532382 534590 537756 540921 543663 545629 546258 545272
51850 545272 542967 539674 535235 529455 522712 515612 508232 500308 492109 484517 478182 473118 469205 466481
51836 466481 464715 463274 461898 461201 461963 464117 466846 469477 471818 473748 474962 475190 474400 472731 470531
51821 470531 468442 467057 466321 465576 464398 463199 462804 463615 465396 467724 470236 472390 473358 472537 470174 467288
51805 467288 464888 463332 462394 461706 460993 460142 459371 459252 460224 461932 463366 463794 463343 462493 461298 459523 457361
51788 457361 455577 454850 455265 456429 457756 458618 458637 458108 457852 458424 459679 461347 463725 467491 472987 480020
51772 480020 488198 497120 506344 515621 525088 534803 544081 551745 557130 560339 561379 559592 554378 546087
51758 546087 535763 524273 512129 499949 488537 478460 469881 462731 456766 451560 446867 442972 440392
51745 440392 439244 439214 440062 441762 444206 447214 450808 455080 459846 464896 470507 476997 483692 489066 492204
51730 492204 493555 493971 493779 493279 493369 494781 497111 499384 501269 502888 503660 502423 498856 494005 489136 484771
51714 484771 481147 478841 478296 479031 479869 479915 479169 478427 478850 481367 486041 491891 497418 501349 503048 502614
51698 502614 500785 498557 496640 495289 494656 495074 496798 499553 502478 504466 504629 502642 498847 494032 489046
51683 489046 484557 480974 478385 476679 475883 476250 477713 479449 480417 480343 479766 479164 478618 478503 479907 483883
51667 483883 490546 499226 509232 520013 530734 540115 546844 550045 549475 545494 538925 530906 522872 516409
51653 516409 512789 512573 515840 522597 532316 542988 551415 555069 553471 547559 538253 526215 512595 499141
51639 499141 487423 478245 471749 467635 465255 463950 463396 463455 463759 463776 463231 462177 460754 459193 457930 457222
51623 457222 456618 455239 452699 449428 446007 442545 438868 434970 431006 427055 423116 419318 415901 413028
51609 413028 410691 408849 407660 407533 408743 410998 413565 416004 418585 421934 426590 433131 442269 454271
51595 454271 468372 483177 497466 510185 519912 525107 525102 520504 512637 503100 493717 486118 480966 478085
51581 478085 477564 480205 486582 496217 508198 522193 538268 555937 574058 591840 609630 628531
51569 628531 649137 670483 690205 706085 717794 727147 736806 749142 766240 790105 821931 861151
51557 861151 905560 952310 998640 1041993 1080012 1110574 1131861 1142789 1143669 1135983 1120948 1098507
51545 1098507 1068326 1031525 990675 948085 904799 861458 819381 780325 745636 716026 691763
51534 691763 672543 657404 645247 635368 627161 619505 611083 601341 590736 579886 568907 557826
51522 557826 547245 538089 530685 524424 518365 511936 505042 497878 490864 484529 479174 474672 470731 467172
51508 467172 463795 460190 456106 451997 448768 446889 445971 445284 444366 443048 441283 439252 437430 436264 435857
51493 435857 436072 436734 437606 438393 439032 439836 441192 443239 445901 448928 451711 453393 453488 452196 449918 446818
51477 446818 443190 439833 437442 435841 434380 432877 431522 429965 427359 423491 419195 415374 412252 409858
51463 409858 408426 407769 406842 404808 402263 400641 400428 400679 400422 399903 400169 401910 405144 409675 415340 421817
51447 421817 428738 436230 445255 457066 472192 489800 507960 524452 537498 546185 550696 552347 553185
51434 553185 555060 558581 562716 565425 564902 560427 552263 541126 528100 514804 502876 492870 484054
51421 484054 475725 468328 462704 458566 454634 450327 446462 443946 442607 441807 441470 441684 441797 440937 439402
51406 439402 438626 439559 441760 444308 446985 450123 453811 457725 461515 464947 467871 470467 473436 477600 483295
51391 483295 490431 499005 509230 521144 534521 549392 566495 587008 611909 641695 676589 716813
51379 716813 762558 813774 870110 931086 996059 1063573 1130471 1192048 1243725 1282920 1309275
51368 1309275 1323261 1325069 1314863 1293424 1261896 1221172 1172108 1116323 1056271 994404 932654
51357 932654 872764 816546 765377 719659 679073 643275 612147 585558 563126 544141 527655
51346 527655 512876 499665 488448 479381 471870 465166 459170 454239 450443 447528 445499 444615 444732 445240
51332 445240 445879 447080 449147 451493 453094 453502 452968 451761 449783 446913 443380 439692 436323 433548 431453
51317 431453 430034 429272 429052 429112 429241 429577 430446 431748 432721 432549 431108 428925 426564 424310 422345 420846
51301 420846 419809 418973 418044 416879 415401 413503 411146 408518 406029 404196 403455 403948 405376 407189 409087
51286 409087 411355 414645 419369 425305 431831 438423 444865 451011 456545 461014 463955 465015 464325 462919
51272 462919 462363 463482 465614 467569 469190 471324 474303 477230 479127 480054 480537 480386 478827 475613 471309
51257 471309 466535 461531 456516 451913 447950 444406 440963 437614 434577 431980 429695 427366 424603 421401
51243 421401 418359 416271 415405 415328 415436 415464 415568 416148 417584 419853 422373 424490 426151 427860 429956 432211
51227 432211 434150 435450 435945 435549 434257 432077 428969 425198 421743 419834 419862 421079 422539 423906 425126
51212 425126 425890 425961 425790 426220 427675 430005 433032 436791 441214 445990 450798 455349 459143 461566 462455 462433
51196 462433 462494 463268 464592 465644 465564 464211 462373 461042 460462 460069 459342 458405 457642 457104 456573 456038 455763 455902
51178 455902 456319 456807 457257 457581 457738 458001 458952 460940 463566 465934 467375 467769 467241 465950 464338 463232
51162 463232 463266 464180 464935 464586 462950 460557 458144 456115 454286 452130 449438 446618 444157 441952 439562
51147 439562 437084 435260 434530 434369 433812 432384 430379 428550 427743 428482 430519 432976 435221 437389 439759
51132 439759 441946 443230 443573 443809 444710 446219 447681 448625 449292 450528 453002 456279 458888 459740 459361 459322
51116 459322 460531 462617 464960 467530 470404 473095 474962 476008 476783 477648 478556 479464 480518 481813 483350
51101 483350 485317 488061 491534 494936 497178 497793 497283 496535 496001 495538 494940 494372 494163 494452 495216 496403 497697
51084 497697 498370 497891 496716 496027 496545 497933 499501 500976 502344 503449 504265 505256 506935 509171 511359 513256
51068 513256 515295 518182 522525 528775 537086 547208 558924 572682 589418 609681 633147 658836
51056 658836 685201 709884 730187 744665 754356 762097 770515 780571 791636 802378 811483 817913
51044 817913 820937 820153 815582 807683 797198 784968 771963 759419 748660 740550 735085 731403 727975
51031 727975 722894 714502 702250 686980 670290 653717 638464 625449 615160 607606 602685 600485
51019 600485 600977 603656 607971 614008 622238 632617 644432 657142 670796 685392 700285 714629 728111
51006 728111 740877 753003 764405 774998 784481 792084 797008 799193 799334 798099 795593 791576 785974
50993 785974 779171 772096 765978 761688 759202 757955 757722 758938 762194 767868 776342 788054 802938 819986
50979 819986 837676 854849 871118 886731 902332 918785 937064 958286 983742 1014512 1050801
50968 1050801 1091909 1137056 1186055 1239038 1295919 1356494 1420777 1488692 1559483 1631812 1704417
50957 1704417 1776242 1845917 1911602 1971600 2024925 2071155 2109986 2141150 2164698 2181249 2191945
50946 2191945 2198041 2200430 2199726 2196936 2193663 2191102 2188776 2184700 2176852 2164301 2147185 2126355 2103238
50933 2103238 2079332 2055323 2030886 2005419 1978507 1949476 1917188 1880871 1840782 1797518 1751033
50922 1751033 1701013 1648000 1593484 1538912 1485163 1432943 1383062 1336213 1292896 1253640 1218754
50911 1218754 1187740 1159500 1133336 1109316 1087496 1067330 1048223 1030250 1013936 999557 986982
50900 986982 975875 965732 956003 946645 938396 932030 927445 923917 921161 919612 919534 920334 921007 921080 920942
50885 920942 921423 923171 926221 930007 933921 937994 942866 948983 955996 963239 970671 979108 989405 1001643
50871 1001643 1015250 1029743 1045152 1061734 1079560 1098562 1118904 1141045 1165411 1192216 1221743
50860 1221743 1254635 1291723 1333611 1380633 1433232 1492188 1558383 1632448 1714767 1805713 1905742
50849 1905742 2015191 2134029 2261859 2398176 2542536 2694330 2852310 3014367 3177765
50840 3177765 3339442 3495922 3643190 3777105 3894246 3992277 4069598 4124974 4157840 4168857
50830 4168857 4159949 4133792 4093469 4042552 3985195 3925823 3868617 3817097 3773877 3740474 3717068
50819 3717068 3702279 3693207 3686009 3676849 3662493 3640121 3606926 3560423 3499360 3424066 3335764 3235732
50807 3235732 3125333 3006499 2881714 2753455 2624010 2495925 2372260 2255996 2149095
50798 2149095 2052191 1965124 1887726 1820098 1762285 1713836 1673829 1641417 1616183 1597788 1585338
50787 1585338 1577368 1572487 1569836 1568864 1568968 1569638 1570708 1572099 1573270 1573172 1570863 1566042 1559048 1550472 1540805
50772 1540805 1530189 1518400 1505107 1490181 1473622 1455262 1434827 1412421 1388713 1364442 1339955
50761 1339955 1315452 1291513 1269008 1248538 1230276 1214347 1200925 1189858 1180632 1173023 1167525 1164831
50749 1164831 1165155 1168500 1175373 1186621 1202523 1222550 1246205 1273603 1305022 1340408 1379763 1423606
50737 1423606 1472419 1525805 1582828 1643177 1707429 1776043 1848572 1924069 2001845 2081556 2162819
50726 2162819 2244951 2326834 2406924 2483686 2556198 2623916 2685522 2738262 2778811 2804610 2814234
50715 2814234 2807107 2783724 2746266 2698395 2644193 2587388 2531381 2479311 2433642 2395796 2366332
50704 2366332 2345321 2332446 2326798 2326647 2329444 2332260 2332512 2328174 2317169 2296938 2265288 2221770 2167784
50691 2167784 2105367 2036409 1963109 1888405 1815308 1745992 1681845 1624055 1573598 1530850 1495670
50680 1495670 1467913 1447555 1434423 1428171 1428628 1435951 1450365 1471828 1499840 1533352 1570864 1610727
50668 1610727 1651352 1691142 1728550 1762543 1792909 1819857 1843341 1863082 1879244 1892817 1905187
50657 1905187 1917352 1929467 1941002 1951357 1960489 1968933 1977237 1985552 1993934 2002876 2013278 2026040
50645 2026040 2041839 2061164 2084262 2111107 2141669 2176071 2214158 2255060 2297597 2341108 2385481
50634 2385481 2430352 2474726 2517585 2558616 2598258 2637391 2677185 2718783 2762355 2805897 2844538
50623 2844538 2871048 2877885 2860334 2818961 2759579 2690739 2620782 2556036 2500201 2454490 2418573
50612 2418573 2391940 2374433 2365485 2363370 2365750 2370794 2377269 2383528 2386860 2384120 2372962 2352418 2322460
50599 2322460 2283188 2234627 2177419 2113497 2045704 1976580 1907659 1839806 1773738 1709982 1648739
50588 1648739 1590073 1534070 1480660 1429750 1381894 1338373 1300034 1266293 1235825 1208129 1183884
50577 1183884 1163911 1148399 1137101 1129612 1125323 1123667 1124665 1128821 1136244 1146282 1158187 1171700 1186816
50564 1186816 1203472 1221767 1242090 1264638 1289071 1314938 1342203 1371065 1401586 1433726 1467398
50553 1467398 1502126 1537084 1571905 1607066 1642862 1678275 1711646 1742432 1771683 1800733 1830107
50542 1830107 1859884 1890515 1922933 1958218 1997330 2040730 2088047 2138593 2192515 2250980 2314924
50531 2314924 2384121 2458046 2537226 2623040 2716453 2817582 2926285 3042191 3163896 3288818
50521 3288818 3414244 3538043 3658107 3771681 3875727 3967539 4044470 4103532 4142101 4159080
50511 4159080 4154773 4129607 4083594 4017286 3932739 3833188 3722134 3603180 3480497 3358863 3243072
50500 3243072 3137464 3045873 2971501 2916467 2881430 2865859 2868794 2889363 2926445 2977677 3038690
50489 3038690 3103416 3165244 3218004 3256212 3275016 3270486 3240152 3183405 3101724 2998767 2880027
50478 2880027 2751800 2619918 2489030 2362540 2242771 2131166 2028541 1935199 1850693 1773642
50468 1773642 1702244 1635203 1572132 1513136 1458372 1408053 1362564 1322239 1287168 1257362 1232951
50457 1232951 1213998 1200228 1191059 1185819 1183786 1184270 1186943 1192012 1199762 1209954 1221989 1235714 1251717
50444 1251717 1270685 1292619 1316770 1342043 1367197 1390865 1411807 1429280 1443038 1452995 1459147 1461891
50432 1461891 1462160 1460942 1458780 1455909 1452857 1450519 1449548 1449942 1451484 1454418 1459360 1466645 1476192 1488164
50418 1488164 1503409 1522989 1547458 1576901 1611534 1651910 1698441 1750950 1808783 1871168 1937327
50407 1937327 2006319 2076941 2147782 2217347 2284161 2346875 2404288 2455320 2498934 2534000 2559200
50396 2559200 2573051 2574160 2561526 2534728 2494039 2440579 2376391 2304249 2227291 2148687 2071312
50385 2071312 1997384 1928392 1865620 1810692 1765243 1729979 1704475 1688250 1681673 1685304 1698380 1718449
50373 1718449 1742530 1768146 1793053 1814519 1829495 1835507 1831127 1815806 1789731 1753959 1710368 1661247
50361 1661247 1609002 1556041 1504515 1455938 1411264 1371393 1337212 1308950 1285826 1266718 1250984
50350 1250984 1238235 1227380 1216238 1202131 1182689 1156484 1123787 1087011 1049871 1015461 985084
50339 985084 958920 937233 920340 907745 898177 890772 885683 883202 882753 883285 884512 887191 892000 898527
50325 898527 905618 912479 919103 925720 932277 938629 944968 951696 958879 966056 972699 978719 984377 989733
50311 989733 994312 997455 999029 999732 1000602 1002217 1004441 1006935 1009692 1013003 1017058 1021801 1026995 1032292 1037377
50296 1037377 1042266 1047339 1052790 1058172 1062871 1066881 1070697 1074463 1077741 1080082 1081259 1080784 1077921 1072689
50282 1072689 1066382 1060631 1056324 1053760 1053241 1054761 1057543 1060773 1064666 1069971 1076538 1083353 1090141 1097936
50268 1097936 1107564 1118290 1128595 1137846 1146686 1156184 1167241 1180623 1196992 1216771 1240106 1266713
50256 1266713 1295507 1324697 1352695 1378858 1403175 1425578 1445961 1464632 1482265 1499397 1516237
50245 1516237 1532718 1548197 1561140 1569529 1571749 1567010 1555236 1537127 1514333 1489089 1463457 1439050
50233 1439050 1417309 1399508 1386253 1377171 1370972 1365422 1357334 1343326 1321272 1291191 1254847 1214812
50221 1214812 1173772 1134066 1097212 1063754 1033606 1006440 981825 959379 938970 920609 904137
50210 904137 889342 876414 865806 857392 850130 842911 835502 828420 822176 816924 812528 808495 804126
50197 804126 799151 794134 789785 786024 782168 777950 773803 770119 766761 763479 760334 757452 754718 752045
50183 752045 749669 747902 746738 745956 745465 745291 745383 745660 746203 747157 748515 750271 752714 756257 760821 765673
50167 765673 770100 774150 778432 783190 787877 791815 795104 798589 803008 808479 814943 822757 832560 844734
50153 844734 859247 875918 894432 914139 934253 954513 975476 998072 1023048 1050907 1082112
50142 1082112 1117084 1156074 1199188 1246316 1296866 1349625 1403121 1456239 1508569 1560406 1612527
50131 1612527 1665653 1719666 1773182 1823886 1869139 1906195 1932249 1944952 1943145 1927013 1897499
50120 1897499 1855900 1804062 1744585 1680434 1614323 1548462 1484709 1424691 1369728 1320652 1277546
50109 1277546 1239634 1205563 1174068 1144402 1116239 1089313 1063287 1037879 1013027 989060 966768
50098 966768 947055 930287 916028 903576 892688 883631 876611 871355 867240 863727 860757 858851 858583
50085 858583 859738 861212 862176 863206 865675 869949 874780 878750 881821 885062 889313 894598 900547 906681
50071 906681 912427 917458 922120 926942 931653 935194 936937 937397 937410 937040 935693 933000 929157 924631 919990
50056 919990 915814 912223 908517 903908 898711 894289 891586 890177 889112 888328 888723 891064 895412 901657 910069
50041 910069 920981 934185 948931 964448 980315 996452 1013040 1030406 1048750 1067860 1087216
50030 1087216 1106491 1125833 1145611 1165970 1186779 1207998 1229975 1253295 1278367 1305137 1333173
50019 1333173 1362017 1391353 1420660 1448695 1473645 1494167 1510375 1523713 1535927 1548320 1561649
50008 1561649 1575908 1589708 1600184 1604114 1599349 1585239 1562179 1531302 1494485 1453974 1411637 1368735
49996 1368735 1326354 1285610 1247244 1211397 1178090 1147614 1120085 1094839 1070649 1046551 1022196
49985 1022196 997582 972879 948570 925392 903945 884450 866871 851055 836691 823434 811219
49974 811219 800334 791101 783561 777476 772477 768150 764200 760685 757952 756192 755172 754507 754120 754342 755656
49959 755656 758454 762933 769107 776988 786799 798812 812785 827689 842186 855339 866675 875751 882124
49946 882124 885900 887989 889396 890228 889510 886048 879463 870494 860376 849918 839085 827331 814210
49933 814210 799631 783753 767079 750717 736145 724197 714283 705015 695812 687667 682117 679687 679646
49920 679646 681051 683526 686941 690872 694802 698607 702417 706201 709928 714072 719420 726240 734117 742786
49906 742786 752715 764497 778069 792931 808731 825059 840814 854510 865392 873831 880457 885330
49894 885330 888059 888221 885383 879110 869373 856787 842177 826178 809489 793167 778148 764624 752306
49881 752306 741090 730951 721346 711427 701087 691293 683076 676522 670951 665728 660668 656040 652518
49868 652518 650823 651054 652594 655053 659006 665317 674011 684413 696270 709981 725561 742083 758488
49855 758488 774384 789640 803693 815834 825887 834055 840315 844546 847076 848433 848429 846082 840597 832016
49841 832016 820805 807435 792677 777831 764086 751851 741025 731671 724082 718331 714161 711221
49829 711221 709136 707515 706242 705698 706379 708473 712124 717832 726026 736315 747763 759972 773244 787519
49815 787519 801736 814617 825630 834836 842311 848267 853290 857698 860647 860497 856310 848693 839168 829030
49801 829030 818889 808877 798948 789004 778940 768682 758258 747917 738080 729032 720762 713263 706888
49788 706888 702123 699029 697164 696117 695867 696559 698131 700261 702528 704516 705976 707103 708605 711382 716127
49773 716127 723149 732318 742949 753840 763686 771674 777751 782341 785811 788236 789684 790505 791063 791064 789466
49758 789466 785348 778761 770435 760772 749559 736762 723184 710108 698474 688534 680041 672481 665329
49745 665329 658498 652533 648101 645229 643284 641750 640770 640725 641471 642317 642820 643365 644798 647586 651501 656011
49729 656011 660735 665554 670610 676407 683680 692903 703997 716579 730250 744396 757930 769736 779408
49716 779408 787266 793611 798262 800836 801087 798897 794267 787549 779440 770542 761080 751137 740947 730863
49702 730863 721330 713007 706539 701900 698291 695047 692422 691117 691218 692175 693741 696401 700626 706149 712261
49687 712261 718655 725663 733731 742890 752747 762902 773309 784281 796241 809511 824328 840892
49675 840892 859153 878321 896509 911051 919685 921940 919540 915241 911103 907756 904957 902361 899740
49662 899740 897018 894418 892164 889641 885164 877149 865516 851595 836777 821686 806618 792164 779044
49649 779044 767586 757639 748923 741329 734961 730071 726931 725717 726413 728682 731826 735023 737811 740163
49635 740163 741962 742610 741457 738477 734263 729409 724224 718943 713792 708758 703610 698300 693110 688350
49621 688350 684099 680313 676970 674089 671754 670046 668775 667434 665769 664296 663818 664475 665719 667188 669009
49606 669009 671152 673167 674771 676082 676958 676767 675399 673924 673530 674163 674948 675660 676949 679120 681573 683646
49590 683646 685388 687112 688738 689985 690907 691828 692848 693712 694113 693976 693543 693239 693353 693804 694351 695078 696478
49573 696478 698990 702558 706759 711268 716196 722083 729561 738884 749776 761834 774883 788678 802391
49560 802391 814921 825702 834682 841331 844363 843023 838260 832011 825529 818980 812506 806772 802243 798589
49546 798589 795327 792632 791010 790347 789772 788515 786568 784500 782884 781991 781870 782582 784345 787433 791994
49531 791994 798149 806288 816933 830059 844862 860623 877767 897665 921389 948835 978709 1008644
49519 1008644 1035332 1055462 1067322 1071549 1070305 1066108 1061441 1058510 1058488 1061099 1065430 1070822 1076451 1080451
49505 1080451 1080447 1075153 1064938 1050856 1033815 1014851 995397 976811 959943 945300 933105 922882
49493 922882 913563 904473 895934 888541 882299 876909 872525 869603 868190 867901 868518 870085 872432 875078 877724
49478 877724 880495 883602 887019 890543 893961 897112 899971 902677 905361 907996 910542 913126 915862 918661
49464 918661 921413 924184 926868 928845 929417 928683 927552 926766 926117 924690 921669 916931 911145 905332 900143
49449 900143 895447 890750 885918 881297 877280 874143 872317 872353 874474 878462 884062 891109 899107 907136 914584
49434 914584 921747 929332 937535 945933 954262 962848 972163 982192 992482 1002805 1013577 1025447 1038313
49421 1038313 1050712 1060226 1064623 1062818 1055094 1042804 1027979 1012902 999578 989255 982327 978713
49409 978713 978371 981467 988063 997744 1009756 1023523 1038854 1055604 1073338 1091555 1110037 1128788
49397 1128788 1147687 1166428 1184687 1202149 1218456 1233310 1246555 1257985 1267182 1273755 1277584 1278584
49385 1278584 1276447 1271030 1262897 1253007 1241833 1229190 1215003 1199870 1184785 1170680 1158360 1148460
49373 1148460 1141156 1136187 1133367 1132876 1134835 1138801 1143847 1149026 1153665 1157471 1160538 1163077 1164970 1165641
49359 1165641 1164429 1161000 1155483 1148496 1141080 1134247 1128357 1123101 1118159 1113595 1109625 1106411 1104263 1103641
49345 1103641 1104599 1106477 1108483 1110445 1112669 1115121 1117062 1117490 1115841 1112263 1107298 1101360 1094681 1087756
49331 1087756 1081559 1076947 1074093 1073029 1074566 1079981 1089783 1103651 1121785 1145307 1174424 1206676 1237716
49318 1237716 1263653 1282264 1292632 1294733 1289533 1278690 1263748 1245756 1225561 1204084 1182245 1160927
49306 1160927 1140962 1122962 1107219 1093886 1082950 1073920 1066058 1059329 1054696 1052818 1052896 1053453 1053894 1054506
49292 1054506 1055215 1055384 1054849 1054168 1053588 1052532 1050358 1046905 1042093 1035847 1028812 1022423 1017690 1014476 1012403
49277 1012403 1011810 1013184 1016175 1019940 1024206 1029414 1035995 1044022 1053331 1063362 1072955 1080937 1087022 1091759
49263 1091759 1095664 1098851 1101576 1104745 1109691 1117703 1129774 1146400 1167357 1191772 1218466 1246045
49251 1246045 1272556 1295351 1311661 1319514 1318207 1308135 1290458 1266989 1240063 1212040 1184712 1159258
49239 1159258 1136660 1117691 1102263 1089274 1077745 1068042 1061450 1058539 1058535 1060445 1064137 1069883 1077217
49226 1077217 1084847 1091725 1098001 1104933 1113843 1124883 1136667 1147351 1156235 1164038 1171567 1178548 1184084
49213 1184084 1187829 1190239 1191997 1193735 1196252 1200421 1206711 1215097 1225558 1238428 1254143 1272725 1293533
49200 1293533 1315486 1337648 1359650 1381452 1402701 1422668 1440917 1457672 1473214 1487258 1499319
49189 1499319 1509457 1518173 1525701 1531894 1536817 1541082 1545564 1551070 1558250 1567515 1579071 1593382 1611583
49176 1611583 1635180 1665386 1703085 1749174 1804115 1866653 1933078 1997740 2054151 2096174 2119684
49165 2119684 2124396 2114146 2094888 2072035 2049325 2029176 2012971 2000780 1991488 1983774 1976996 1971136
49153 1971136 1966301 1962641 1960621 1960872 1963577 1968226 1974142 1981132 1989471 1999409 2010977 2024135 2038657
49140 2038657 2053831 2068729 2083109 2097752 2113557 2130549 2148050 2165592 2183134 2200478 2217096
49129 2217096 2232726 2247705 2262405 2276712 2290440 2304088 2318699 2334913 2352454 2370745 2389894
49118 2389894 2410834 2434475 2461028 2490446 2523483 2562006 2608216 2663984 2731328 2813157 2912492
49107 2912492 3029933 3161252 3297600 3429148 3550452 3663598 3775504 3889845 3999483
49098 3999483 4086519 4131366 4124494 4071942 3990705 3897925 3802030 3701675 3591825 3470950 3343606
49087 3343606 3217790 3100831 2997225 2908744 2835321 2775840 2728660 2691805 2662875 2639245 2618775
49076 2618775 2600356 2583699 2568701 2555190 2543051 2532252 2522638 2513866 2505660 2498093 2491538 2486242
49064 2486242 2481841 2477363 2471869 2465213 2458089 2451351 2445410 2440303 2436082 2432926 2430916 2429963 2430054 2431507 2434815
49049 2434815 2440118 2446932 2454686 2463529 2474171 2486503 2498501 2506978 2509588 2506035 2497687 2486541 2474552
49036 2474552 2463281 2453690 2446339 2441820 2440754 2443245 2448602 2455623 2462994 2469547 2474676 2478684 2482273 2485510
49022 2485510 2487668 2488259 2487705 2486780 2485974 2485769 2486992 2490187 2494906 2500166 2505515 2511282 2518018 2526153 2535878
49007 2535878 2546805 2557884 2568219 2577890 2587570 2597551 2607650 2617762 2627783 2637093 2644915 2651200
48995 2651200 2656420 2660454 2662502 2662300 2660666 2658488 2655915 2652940 2650044 2647613 2645254 2642283 2638535 2634111
48981 2634111 2628738 2622047 2614284 2606111 2597790 2589047 2579597 2569274 2557847 2545310 2532288 2519601 2507439
48968 2507439 2495568 2484319 2474638 2466962 2460756 2455619 2452217 2451535 2453546 2457300 2462241 2468842 2477790 2489009
48954 2489009 2501698 2515110 2529095 2544003 2560266 2577946 2596488 2614966 2632782 2650171 2667857
48943 2667857 2686195 2704868 2723630 2743115 2764588 2788973 2816497 2847231 2881384 2918712 2958132
48932 2958132 2998507 3039705 3082455 3127201 3173540 3220835 3268956 3318402 3370067 3424966 3483670
48921 3483670 3545672 3609563 3674062 3738625 3802964 3866479 3928634 3989563 4049761 4109288 4167796
48910 4167796 4225257 4282073 4338170 4392409 4443289 4490207 4533861 4575553 4616232 4656191 4695446
48899 4695446 4734094 4772022 4808189 4840553 4867190 4887619 4902970 4914922 4924656 4932681 4939155 4944103
48887 4944103 4947524 4949440 4949700 4947720 4942697 4934322 4923131 4909901 4894738 4876819 4854952 4828300 4796736
48874 4796736 4760620 4720236 4675464 4626174 4572910 4516862 4459086 4400077 4340273 4280524 4221655
48863 4221655 4163854 4107000 4051470 3998107 3947388 3899097 3852930 3808953 3767217 3727272 3688492
48852 3688492 3650850 3615086 3582097 3552241 3525307 3501120 3480035 3462744 3449595 3440264 3434135 3430766
48840 3430766 3429857 3431076 3434192 3439235 3446194 3454801 3464950 3477118 3491783 3508460 3525925 3543454 3561302
48827 3561302 3579809 3598674 3617439 3636167 3655274 3675033 3695649 3717348 3739922 3762506 3784355
48816 3784355 3805701 3827292 3849275 3871074 3892312 3913275 3934332 3955427 3976359 3997300 4018795
$$ [...]
##END NTUPLES=NMR SPECTRUM
##END=
