
##TITLE=AC1244__6608867_OtYWXq1r5D
##JCAMPDX= 6.0         $$ Bruker NMR JCAMP-DX V2.0
##DATA TYPE= NMR SPECTRUM
##DATA CLASS= NTUPLES
##ORIGIN= BRUKER
##OWNER= Administrator
$$ 1.72 TOPSPIN		Version 2.1
$$ 2012-08-01 17:34:07.500 -0500  Administrator@TOPSPIN
$$ Compression mode = diff/dup
##.OBSERVE FREQUENCY= 400.02188249412
##.OBSERVE NUCLEUS= ^1H
##.ACQUISITION MODE= SIMULTANEOUS (DQD)
##.ACQUISITION SCHEME= undefined
##.AVERAGES= 8
##.DIGITISER RES= 22
##SPECTROMETER/DATA SYSTEM= spect
##.PULSE SEQUENCE= zg30
##.SOLVENT NAME= COFFEE_meoh
##.SHIFT REFERENCE= INTERNAL, COFFEE_meoh, 1, 14.98509
##AUDIT TRAIL= $$ (NUMBER, WHEN, WHO, WHERE, PROCESS, VERSION, WHAT)
$$ ##TITLE= Audit trail, TOPSPIN		Version 2.1
$$ ##JCAMPDX= 5.01
$$ ##ORIGIN= Bruker BioSpin GmbH
$$ ##OWNER= Administrator
$$ $$ C:\Bruker\TOPSPIN/data/COFFEE/nmr/AC1244__6608867_OtYWXq1r5D/10/pdata/1/auditp.txt
$$ ##AUDIT TRAIL=  $$ (NUMBER, WHEN, WHO, WHERE, PROCESS, VERSION, WHAT)
(   1,<2012-08-01 17:33:42.656 -0500>,<Administrator>,<TOPSPIN>,<go>,<TOPSPIN 2.1>,
      <created by zg
	started at 2012-08-01 17:32:34.281 -0500,
	POWCHK enabled, PULCHK disabled,
       configuration hash MD5:
       6B 1B 68 BB D9 2E 58 E2 7F 35 AD 54 07 DF 0E 41
       data hash MD5: 64K
       EF E5 8F 36 FF 81 57 11 35 A1 C2 B4 90 9F 11 4D>)
(   2,<2012-08-01 17:33:54.750 -0500>,<Administrator>,<TOPSPIN>,<proc1d>,<TOPSPIN 2.1>,
      <Start of raw data processing
       efp LB = 0 FT_mod = 6 PKNL = 1 PHC0 = 0 PHC1 = 0 SI = 32K 
       data hash MD5: 32K
       DD 57 52 1E 78 31 B8 85 39 DD 84 BD 2C 6D 92 CF>)
(   3,<2012-08-01 17:33:55.609 -0500>,<Administrator>,<TOPSPIN>,<proc1d>,<TOPSPIN 2.1>,
      <pk PHC0 = 174.5782 PHC1 = 0 
       data hash MD5: 32K
       F8 7E 9C 3F 6B 07 A3 7E 8C 87 A0 59 0E AB 1E 54>)
(   4,<2012-08-01 17:33:56.062 -0500>,<Administrator>,<TOPSPIN>,<proc1d>,<TOPSPIN 2.1>,
      <abs ABSG = 1 
       data hash MD5: 32K
       DA 3F C0 8A 96 61 8E 69 0C 55 BE 08 EC FA 80 E5>)
(   5,<2012-08-01 17:33:56.375 -0500>,<Administrator>,<TOPSPIN>,<proc1d>,<TOPSPIN 2.1>,
      <abs ABSG = 2 
       data hash MD5: 32K
       A7 58 52 5A A3 96 A7 B1 DF 0D E5 CC A6 8A 75 6D>)
(   6,<2012-08-01 17:33:56.640 -0500>,<Administrator>,<TOPSPIN>,<proc1d>,<TOPSPIN 2.1>,
      <abs ABSG = 3 
       data hash MD5: 32K
       4D 65 61 A4 BA A7 18 3B 07 8F DD 80 82 D1 AD 37>)
(   7,<2012-08-01 17:33:56.953 -0500>,<Administrator>,<TOPSPIN>,<proc1d>,<TOPSPIN 2.1>,
      <abs ABSG = 4 
       data hash MD5: 32K
       A7 D6 B7 3B FE 45 DE 00 41 CC 8A 1B BC B0 EF 88>)
(   8,<2012-08-01 17:33:57.390 -0500>,<Administrator>,<TOPSPIN>,<proc1d>,<TOPSPIN 2.1>,
      <abs ABSG = 5 
       data hash MD5: 32K
       EC 11 F1 FB 03 1C 44 B9 3D 81 C7 1C A2 9C C2 71>)
$$ ##END=
$$ 
$$ $$ hash MD5
$$ $$ AC B8 96 68 31 9E 68 1A 11 9D 60 28 C4 EE 05 07
##$RELAX= 
##$RELAX= 
##$RELAX= 
##$RELAX= 
##$RELAX= 
##$RELAX= 
##$RELAX= 
$$ Bruker specific parameters
$$ --------------------------
##$DU= <C:\Bruker\TOPSPIN>
$$ [...]
##$TP= (0..7)
150 150 150 150 150 150 150 150
##$TP07= 0
##$TPNAME0= <>
##$TPNAME1= <>
##$TPNAME2= <>
##$TPNAME3= <>
##$TPNAME4= <>
##$TPNAME5= <>
##$TPNAME6= <>
##$TPNAME7= <>
##$TPOAL= (0..7)
0.5 0.5 0.5 0.5 0.5 0.5 0.5 0.5
##$TPOFFS= (0..7)
0 0 0 0 0 0 0 0
##$TUNHIN= 0
##$TUNHOUT= 0
##$TUNXOUT= 0
##$USERA1= <user>
##$USERA2= <user>
##$USERA3= <user>
##$USERA4= <user>
##$USERA5= <user>
##$V9= 5
##$VALIST= <valist>
##$VCLIST= <CCCCCCCCCCCCCCC>
##$VD= 0
##$VDLIST= <DDDDDDDDDDDDDDD>
##$VPLIST= <PPPPPPPPPPPPPPP>
##$VTLIST= <TTTTTTTTTTTTTTT>
##$WBST= 1024
##$WBSW= 4
##$XGAIN= (0..3)
0 0 0 0
##$XL= 0
##$YL= 0
##$YMAX_a= 468068
##$YMIN_a= -609315
##$ZGOPTNS= <>
##$ZL1= 120
##$ZL2= 120
##$ZL3= 120
##$ZL4= 120
##$ABSF1= 14.98509
##$ABSF2= -5.573092
##$ABSG= 5
##$ABSL= 3
##$ALPHA= 0
##$AQORDER= 0
##$ASSFAC= 0
##$ASSFACI= 0
##$ASSFACX= 0
##$ASSWID= 0
##$AUNMP= <proc_prof1d_extract_pilot.lims>
##$AXLEFT= 0
##$AXNAME= <>
##$AXNUC= <1H>
##$AXRIGHT= 0
##$AXTYPE= 0
##$AXUNIT= <>
##$AZFE= 0.1
##$AZFW= 0.1
##$BCFW= 0
##$BC_mod= 0
##$BYTORDP= 0
##$COROFFS= 0
##$CY= 15
##$DATMOD= 1
##$DC= 0
##$DFILT= <>
##$DTYPP= 0
##$F1P= 0
##$F2P= 0
##$FCOR= 0.5
##$FTSIZE= 32768
##$FT_mod= 6
##$GAMMA= 0
##$GB= 0
##$INTBC= 1
##$INTSCL= 1
##$ISEN= 128
##$LB= 0
##$LEV0= 0
##$LPBIN= 0
##$MAXI= 10000
##$MC2= 0
##$MEAN= 0
##$ME_mod= 0
##$MI= 0
##$NCOEF= 0
##$NC_proc= -8
##$NLEV= 6
##$NOISF1= 0
##$NOISF2= 0
##$NSP= 0
##$NTH_PI= 0
##$NZP= 0
##$OFFSET= 14.98509
##$PC= 1
##$PHC0= 174.5782
##$PHC1= 0
##$PH_mod= 1
##$PKNL= yes
##$PPARMOD= 0
##$PPDIAG= 0
##$PPIPTYP= 0
##$PPMPNUM= 2147483647
##$PPRESOL= 1
##$PSCAL= 4
##$PSIGN= 0
##$PYNMP= <proc.py>
##$REVERSE= no
##$SF= 400.02
##$SI= 32768
##$SIGF1= 0
##$SIGF2= 0
##$SINO= 400
##$SIOLD= 32768
##$SPECTYP= <>
##$SREGLST= <1H.CDCl3>
##$SSB= 0
##$STSI= 32768
##$STSR= 0
##$SW_p= 8223.68421052631
##$SYMM= 0
##$S_DEV= 0
##$TDeff= 65536
##$TDoff= 0
##$TI= <>
##$TILT= no
##$TM1= 0
##$TM2= 0
##$TOPLEV= 0
##$USERP1= <user>
##$USERP2= <user>
##$USERP3= <user>
##$USERP4= <user>
##$USERP5= <user>
##$WDW= 1
##$XDIM= 32768
##$YMAX_p= 464356669
##$YMIN_p= -794265
##$CURPLOT= <Network HP LaserJet P1505>
##$CURPRIN= <$Network HP LaserJet P1505>
##$DFORMAT= <normdp>
##$LAYOUT= <+/1D_H.xwp>
##$LFORMAT= <normlp>
##$PFORMAT= <normpl>
##$SURQMSG= 1
$$ End of Bruker specific parameters
$$ ---------------------------------
##NTUPLES= NMR SPECTRUM
##VAR_NAME=  FREQUENCY,     SPECTRUM/REAL,   SPECTRUM/IMAG
##SYMBOL=    X,             R,               I
##VAR_TYPE=  INDEPENDENT,   DEPENDENT,       DEPENDENT
##VAR_FORM=  AFFN,          ASDF,            ASDF
##VAR_DIM=   32768,         32768,           32768
##UNITS=     HZ,            ARBITRARY UNITS, ARBITRARY UNITS
##FACTOR=    0.250966925370066, 1,           1
##FIRST=     8223.43324360094, 40693,        -87898
##LAST=      0,             -49398,          -52285
##MIN=       0,             -794265,         0
##MAX=       8223.43324360094, 464356669,    0
$$ Real data points
##PAGE= N=1
##DATA TABLE= (X++(R..R)), XYDATA
$$ [...]
19491B46997c8260F4764k4450L2292b17315A32836a56411A8583a79750N7323b0399
19479b08518P9219O462c5623k41296g4487r8258p2426J01908R181G2969B3919
19467f4445M109j38730j55656B88628A34280b39922H9179d25179C4294N4579b06973
19455F8386I227a34947I8038D1995e2835k66092h5826l53847a31137k23835a4660
19443A08177c45994B13799q1785Q5262b57904a01588A24947J29110N5302B8793
19432I3966b90215H6852b76331A54657a59023j32777H3894b6711o3225j8235q010
19421a16181k22112A65702E5425b15902K1861j5393H693a33267r2262A14102b28388
19409G9633a67433A94444p8288a51763j01066E8736R2527a88436H0550a40011
$$ plain form
19491 246997 -38260 64764 40314 72606 -217315 132836 -156411 18583 -179750 -122427 -20399
19479 -208518 -129299 -122837 -35623 -276919 -74487 -172745 -245171 -143263 -134082 72969 23919
19467 -64445 -60336 -199066 -354722 288628 134280 -239922 89179 -425179 34294 88873 -206973
19455 68386 9227 -134947 98038 41995 -52835 -318927 -85826 -439673 -131137 -354972 -14660
19443 108177 -345994 213799 132014 217276 -257904 -101588 124947 254057 309359 28793
19432 93966 -290215 86852 -276331 154657 -159023 -291800 83894 -26711 -89936 -108171 -116181
19421 -116181 -338293 165702 55425 -215902 -194041 -209434 8693 -133267 -225529 114102 -228388
19409 79633 -167433 194444 116156 -151763 -252829 58736 151263 -188436 80550 -140011
19398b83292C876K36328a22308b7037q0840l6592N0243k4097q5330j16780a4127
19386F9766d2915A04980a49832H7290e6672j53573J63r722L2668B97011c34911
19374b59500B41453h2269j67888J08963d1946r7538F6418A3813K97061a63787
19363a5173l19546B8305a10490E6766M75021b57897J12457n8000A55251b52156
19352a29106q2462f6055E9719k1502b39957A11681c9070o364j64417i666j82565
19341a92231q507o7475J00041g7972A55174a22058F5442a95650e1412B4481p378
19330A7103a67840h519g09A20647a63529A04929a87652A91467b16864D08525c20214
19318A92258k3153b54895A98490b66940f2980j28850L470H4932e8765B88351p6841
$$ plain form
19398 -283292 3876 240204 -122308 -27037 -107877 -144469 -94226 -118323 -203653 -320433 -14127
19386 69766 -42915 104980 -149832 87290 -56672 -210245 -210082 -219804 -187136 297011 -334911
19374 -259500 241453 -82269 -250157 -141194 -41946 -139484 66418 13813 310874 -163787
19363 -15173 -334719 28305 -110490 56766 531787 -257897 -145440 -203440 155251 -252156
19352 -129106 -211568 -66055 59719 38217 -239957 111681 -39070 -45434 -209851 -9666 -192231
19341 -192231 -200738 -268213 -168172 -77972 155174 -122058 65442 -195650 -51412 24481 17103
19330 17103 -167840 -8519 -709 120647 -163529 104929 -187652 191467 -216864 408525 -320214
19318 192258 169105 -254895 198490 -266940 -62980 -191830 -188360 84932 -58765 288351 211510
19307B11510a69473a1469r7265C89697E7195a39841E081a91336P3352A75358b2270
19295H7730J8018a60589g8396G2353A0302d3845C00365a17383j66981N0751j63532
19284c97145F6011H649b4587j12003B32014b05076j4926l8473q4526j1081A6397
19272A4498b11103i4069c6200j66405b2180k39006a138r6505q8391c5071j44869
19261a79940q9288A00287b9330I6840D0589c4769l9125j12527b1405A20337a80284
19249a32472O3776p6796a3311H3977a57139g2496r0111O6441j10365e9218I6023
19237A77514b8843l09084C9649h8024j00193B18135a99869P5360M7323C30738
19226A42497f3193k50410E5771a41864j35463F9942b21913F3068h3042p4698e3004
$$ plain form
19307 211510 -169473 -11469 -108734 389697 57195 -139841 5081 -191336 -117984 175358 -22270
19295 87730 105748 -160589 -78396 72353 10302 -43845 300365 -117383 -284364 -233613 -397145
19284 -397145 66011 8649 -24587 -136590 232014 -205076 -220002 -258475 -343001 -354082 16397
19272 14498 -211103 -94069 -36200 -202605 -22180 -261186 -1138 -97643 -186034 -35071 -179940
19261 -179940 -269228 100287 -29330 96840 40589 -34769 -73894 -186421 -21405 120337 -180284
19249 -132472 -68696 -145492 -13311 83977 -157139 -72496 -162607 -96166 -206531 -59218 96023
19237 177514 -28843 -337927 39649 -88024 -188217 218135 -199869 -124509 -77186 330738
19226 142497 -63193 -313603 55771 -141864 -277327 69942 -221913 63068 -83042 -157740 -53004
19214a7344B23660b18310G2481K1537l0948b05972j98645J27167A74022b43396
19203a94130e1438A08333j4338C2958j1825g6852A68721d17334c9965A40245K33556
19192C73801b48523k4498P3183j8564A51830e4156B5453P2299b63872b7508j13893
19181a41401A14006a16774g062j50081l4788F285c8397j3052D1845h5846l8828
19170a24674j46440q6284j31450H1521a42885q3381Q1352k10085p3086J47600
19160b80485e7577m1663M1153o3117A67334l4847h1802a3A24597a18849b3897
19148a77611C18090a88122q6355C9334c95002A96358q6968c02367A76769a18865
19137c60112E7242c6969q7712G4458a71629B8945J05587a79015G6227A2298P8419
$$ plain form
19214 -17344 223660 -218310 72481 94018 63070 -205972 -404617 -277450 174022 -243396
19203 -194130 -51438 108333 93995 32958 21133 -76852 168721 -417334 -39965 140245 373801
19192 373801 -248523 -273021 -199838 -218402 151830 -54156 25453 97752 -263872 -27508 -141401
19181 -141401 114006 -116774 -7062 -157143 -191931 6285 -38397 -51449 41845 -85846 -124674
19170 -124674 -271114 -357398 -488848 81521 -142885 -226266 -144914 -354999 -428085 -280485
19160 -280485 -57577 -99240 -58087 -121204 167334 132487 -81802 -13 124597 -118849 -23897
19148 -177611 318090 -188122 -274477 39334 -395002 196358 109390 -302367 176769 -118865
19137 -360112 57242 -36969 -124681 74458 -171629 28945 134532 -179015 76227 12298 90717
19126I0717L073d00349G40d1939j21851K9597D4689A5102K3318d4279k35072b7972
19113f3154i180F9757b95647a45414a9072b19A14496c16799h1644l74744D09e0166
19100a06066j595j61898E1240d1329C21733F2317J28898e4437A80071a10169q797
19089a18966j9089a4907A62916c87507c3402l5426k04019h6587j86860A39744
19078F3998c50191A96049a8003D70210d2370A02169K7562c34186B9638a19040
19067a055j50113B85902G4199g4059F4306c89596J77988L9980A74708n8707A7377
19055a54071j63614H3620e8284E3969P0314K98758a8996j43085M9293B14151a07434
19043c73380j568a56906q2420a15462B7212c21667D30672a50811f1813B0036J64420
$$ plain form
19126 90717 93790 -400349 740 -41939 -163790 -134193 44689 15102 38420 -44279 -279351 -27972
19113 -63154 -9180 69757 -295647 -145414 -19072 -219 114496 -316799 -81644 -456388 409 -50166
19100 -106066 -107661 -269559 51240 -41329 321733 62317 191215 -54437 180071 -110169 -118966
19089 -118966 -138055 -14907 162916 -387507 -33402 -68828 -272847 -86587 -273447 139744
19078 63998 -350191 196049 -18003 470210 -42370 102169 129731 -334186 29638 -119040
19067 -1055 -151168 285902 74199 -74059 64306 -389596 -211608 -171628 174708 116001 17377
19055 -154071 -317685 83620 -58284 53969 124283 423041 -18996 -162081 -112788 214151 -107434
19043 -373380 -374948 -156906 -239326 -115462 27212 -321667 430672 -150811 -61813 20036 184456
19032A84456a49539k1374Q298k23973h3245L7168n0096B64362I1549J13073e5233
19020h4348A91641b8563k00121e0752A00129g1934A3980a25003j69429C40784
19009F3001L4128e3490B689f3577k18127i9851k84005A3881a04290H1080l3679
18998D7401b40642A15618J33796a81780K4971c0360j2987I5687B3508a0669B00308
18986a33637r5780f9101j7037j19107E4575a57211D05070g6157B49020c46081
18975B54270n6214c27705D7300J72860J21581M05134k42407A63629p7476k0058
18965F6095N1158n1181C469f8174r4767H5419a17565j16740P0630D8610J07147
18954A55757A8085a18884A08545b13646O4089C586K46349a80352n8938e0617k20275
$$ plain form
19032 184456 -149539 -170913 -162615 -386588 -83245 -46077 -96173 264362 91549 204622 -55233
19020 -84348 191641 -28563 -228684 -50752 100129 -71934 13980 -125003 -294432 340784
19009 63001 97129 -53490 2689 -63577 -281704 -99851 -383856 13881 -104290 81080 47401
18998 47401 -240642 115618 249414 -181780 -156809 -30360 -43347 95687 23508 -10669 200308
18986 -133637 -229417 -69101 -86138 -205245 54575 -157211 405070 -76157 249020 -346081
18975 254270 198056 -327705 47300 220160 341741 746875 504468 163629 86153 66095
18965 66095 117253 66072 3469 -68174 -162941 85419 -117565 -234305 -163675 48610 155757
18954 155757 18085 -118884 108545 -213646 -149557 3586 249935 -180352 -239290 -50617 -270892
18943b70892B46001b78891A42216c09312c8250m4541o4699r7532C4038a8533k28504
18932b47037J10047d723j01075a5145A94395c6841m6560j13790E0257b57115J0727
18921b46388A52546a55242D3927O1782R4669b29848e9141A15217d895k48311M5680
18910b07526n4122B00872M46640R4355C39557G2948O4873b6166B01457I0472C1377
18898c27624E0203h9767k50359E2947K5049J74409b8792B03046b02923A26926
18887h2850B90554b85028C17367A0250Q4529L2280p80A6277f59662A03676a94997
18875A79909O44H3417a9395l14848I1591A2607L89810a57568p0666h0020j26653
18864b06673B0045d5719b0697p8256A09538f192k94741J28449a2191A20369a06723
$$ plain form
18943 -270892 246001 -278891 142216 -309312 -38250 -82791 -147490 -245022 34038 -18533 -247037
18932 -247037 -136990 -4723 -105798 -15145 194395 -36841 -83401 -197191 50257 -257115 -246388
18921 -246388 152546 -155242 43927 105709 200378 -229848 -59141 115217 -4895 -253206 -207526
18910 -207526 -261648 200872 647512 741867 339557 72948 137821 -26166 201457 90472 31377
18898 -327624 50203 -89767 -340126 52947 77996 252405 -28792 203046 -202923 126926
18887 -82850 290554 -285028 317367 10250 94779 127059 126279 16277 -659662 103676 -194997
18875 179909 180553 83417 -19395 -334243 91591 12607 402417 -157568 -228234 -80020 -206673
18864 -206673 20045 -45719 -20697 -98953 109538 -6192 -300933 -172484 -12191 120369 -106723
18852A09169a68160l33586K16361B00734n7520P5495d4677p4188k07934C0328
18841b5713A47242a09846a1701A25194d478C84744b67101a28040A72997k265H5301
18829A1494J14225P7971a31633A17196b86326O0083f6839j28808k4650A06559
18818A66067i1580o9585f5372A45093o9200e0996k59997h6771B5590b959B22486
18806A94893a5009q2901C0710e7386A49107a94345O5173A8415b99803N2205d0857
18794a58922b0761A16411b62829J08592j35656a22275E4853b34202C13393I7165
18783a49062A9558a33801f6741r0925G6015f0892o1566j72037E2693L7459R592
18772I9744a53487D2703c16608A94615a81846A73907a42768m4230e4237q0836
$$ plain form
18852 109169 -168160 -501746 -285385 200734 143214 218709 -44677 -118865 -326799 30328
18841 -25713 147242 -109846 -11701 125194 -4478 384744 -267101 -128040 172997 170732 85301
18829 11494 125719 203690 -131633 117196 -286326 -226243 -66839 -195647 -220297 106559
18818 166067 -91580 -161165 -65372 145093 75893 -50996 -310993 -86771 25590 -2959 222486
18806 194893 -15009 -97910 30710 -57386 149107 -194345 -129172 18415 -299803 -247598 -40857
18794 -158922 -20761 116411 -262829 -154237 -289893 -122275 54853 -234202 313393 97165
18783 -149062 19558 -133801 -66741 -157666 76015 -60892 -122458 -294495 52693 90152 99744
18772 99744 -153487 42703 -316608 194615 -181846 173907 -142768 -186998 -54237 -135073
18762a35073e2247D8767b5494A50107a99099N4897n9176C13280A13204E2343a5427
18750e4573A63142a87775D49521c2690p8621A9618i2324j33456C2481c0114A64166
18738a35606I408J05994c10703A9114M0217f1302K1021A02267a89914j40518h7607
18726F869K66186o1854r2985a34581o7111k06826B63892g0804K7397A80404a77811
18714b68881i1617n5974o8880A85375b15203R4007D0333a37437j9448e5760A00297
18702I9K9337d3815n4888d392j35718a0477l15443r654R9592L3206Q4170A71551
18689a01224B04091a92227P148L017M1464j91813H1431A1063a17561G2797e4973
18677A32854d205m0131N255k2317j54256N6821b1679A87102e2348B43494b95287
$$ plain form
18762 -135073 -52247 48767 -25494 150107 -199099 -144202 -203378 313280 113204 52343 -15427
18750 -54573 163142 -187775 449521 -32690 -111311 19618 -92324 -225780 32481 -30114 164166
18738 -135606 9408 115402 -310703 19114 59331 -61302 -40281 102267 -189914 -330432 -87607
18726 6869 273055 211201 118216 -134581 -201692 -408518 263892 -70804 -43407 180404 -177811
18714 -268881 -91617 -147591 -216471 185375 -215203 -121196 40333 -137437 -156885 -55760 100297
18702 99 29436 -43815 -98703 -4392 -140110 -10477 -325920 -335574 -235982 -202776 -118606 171551
18689 -101224 204091 -192227 -185079 -182062 -140598 -332411 81431 11063 -117561 72797 -54973
18677 132854 -4205 -44336 -39081 -61398 -215654 -158833 -21679 187102 -52348 243494 -295287
18665a76063C04417F2039a84053o6050g4910K3742j49536g2115k04929A6800P8326
18654I5126a21126H6713K01000d2223D8719d3945l1868j78111i6047j31783a01180
18642A38190j5533P8766a42044l1573M7339j17040a00056F2751a5817j60002b4543
18630C9881a75157l7976h7741A39866a4869j49790G1242a53530A75774M1037a04432
18618i8447A1501a1840A84738b1969A16917L79043b47382C45660h0226j95370
18608b75596O3881G9829a3251j89989a3728G7810d8109m6783j93135P3118L8118
18597a76791h0428a2028C8069G93L89450a78947P4218j5241q7620j62202k9169
18586c98961B37344d54461F4054f5644p3521a0544o7911A34425a07847K118B18642
$$ plain form
18665 -176063 304417 62039 -184053 -250103 -74910 -51168 -200704 -72115 -277044 16800 95126
18654 95126 -121126 86713 287713 -42223 48719 -43945 -75813 -253924 -96047 -227830 -101180
18642 138190 122657 201423 -142044 -173617 -126278 -243318 -100056 62751 -15817 -175819 -24543
18630 39881 -175157 -213133 -87741 139866 -14869 -164659 71242 -153530 175774 216811 -104432
18618 -98447 11501 -11840 184738 -21969 116917 495960 -247382 345660 -80226 -275596
18608 -275596 -211715 79829 -13251 -203240 -13728 77810 -48109 -94892 -288027 -214909 -176791
18597 -176791 -80428 -12028 38069 793 390243 -178947 -104729 -119970 -207590 -369792 -398961
18586 -398961 237344 -454461 64054 -65644 -139165 -10544 -78455 134425 -107847 -105729 218642
18574D01331c97121a13577k8697q9604B49568i3384K4174j681j18408b1399r0651
18563a12050j10396K4545d9551I7193a53858A25708n7540b249C43352a66349e5417
18551b68648I3991e3605E9105d7113j51599a5465A9701a20505p3256A3908g5630
18539a7085H5489a90667F9086a36016K2449C43844i6852n710A18438g2662A7610
18527C6548O1655Q2802b42798A72157h807j28153j78044a31443A02741a86517
18516A23401b55676A38874o0018a46447B1356L298a87797B2298a9813a745D682
18504B13077o9452a0724F2138K14479A13048e2875r9629q1211D36266b52086J22555
18493a29531H0544a97950E1667f9626q8792b3862m9362k08730h8090b6972m5926
$$ plain form
18574 401331 -397121 -113577 -142274 -231878 249568 -93384 -69210 -70891 -189299 -21399 -112050
18563 -112050 -222446 -197901 -49551 97193 -153858 125708 68168 -2249 343352 -166349 -55417
18551 -268648 93991 -53605 59105 -47113 -198712 -15465 19701 -120505 -193761 13908 -75630
18539 -17085 85489 -190667 69086 -136016 -113567 343844 -96852 -102562 118438 -72662 17610
18527 36548 98203 181005 -242798 172157 -8807 -136960 -315004 -131443 102741 -186517
18516 123401 -255676 138874 78856 -146447 21356 24654 -187797 22298 -19813 -1745 4682
18504 213077 143625 -10724 62138 276617 113048 -52875 -152504 -233715 436266 -252086 -129531
18493 -129531 80544 -197950 51667 -69626 -158418 -23862 -73224 -281954 -88090 -26972 -72898
18482g2898E5395A1532d4360o7383B28750m2133A6376c03956J02804g9577o6841
18471a46418C1882a002D1618f7570k5054A20382B9703a12693m6510d3738k85352
18460c29090P9637i4759A57109a91298H1520a35721A27234D9047O0051K9337c59699
18448c20959A16766d08378a11361i983j08506e6786G036K33575e5982i548G4044
18436D1355b5596j24641b7019q139j23452f0584C9010a9989H1281J7583P037b04327
18423I8080l2157G022J15714a18056j11530b2272E7912j4865P7810n718q113b15862
18410a72171D1959b23067a03122D2178a22959F741b33679c9514A41396J7343f5251
18398A34477n7950J18157H1678E782K65572a01602a1898l9451j19983K4600E9780
$$ plain form
18482 -72898 55395 11532 -44360 -111743 228750 186617 16376 -303956 -201152 -79577 -146418
18471 -146418 31882 -1002 41618 -67570 -92624 120382 29703 -112693 -159203 -43738 -329090
18460 -329090 -249453 -94759 157109 -191298 81520 -135721 127234 49047 109098 138435 -359699
18448 -320959 116766 -408378 -111361 -9983 -118489 -56786 7036 240611 -55982 -9548 74044
18436 41355 -25596 -150237 -27019 -35158 -158610 -60584 39010 -19989 81281 98864 105901 -204327
18423 98080 65923 7022 122736 -118056 -229586 -22272 57912 43047 120857 115139 107026 -215862
18410 -172171 41959 -223067 -103122 42178 -122959 6741 -233679 -39514 141396 158739 -65251
18398 134477 76527 194684 81678 5782 271354 -101602 -11898 -51349 -171332 -146732 59780
18386E132K04840a4088n5428j17413j18136A1112K33462c912B4483b81685a06045
18374B17891o8975d5555A92009q158K8272c43237H1563b85793C3589A1900a19619
18362C6354K27314A9874h9556k36401I7841g1215B3329a01172E3091P1962b22757
18350B5026p414K673c62035R2996j05794J09527i2604B03242g2324G2579a59725
18338C8875g7688d960j78202B68455F5876a02250k99095a38237e4765D5255K50336
18327B95591A4817P7435e7749A00925a07659N0457k7438b5535H7767a88137r0351
18316b78488A36587O3118b47721A81936C5799J47971c46264a04216m6316F669
18305c29051A29786b31505D7195a8711A67259e5648F1250N505b42742A8497c07984
$$ plain form
18386 5132 209972 -14088 -69516 -186929 -305065 11112 244574 -3912 24483 -281685 -106045
18374 217891 148916 -45555 192009 183851 212123 -343237 81563 -285793 33589 11900 -119619
18362 36354 263668 19874 -89556 -325957 97841 -71215 23329 -101172 53091 125053 -222757
18350 25026 17612 20285 -362035 -269039 -374833 -265306 -92604 203242 -72324 72579 -159725
18338 38875 -77688 -4960 -183162 268455 65876 -102250 -401345 -138237 -54765 45255 295591
18327 295591 14817 92252 -57749 100925 -107659 -57202 -84640 -25535 87767 -188137 -278488
18316 -278488 136587 199705 -247721 181936 35799 183770 -346264 -104216 -150532 6669
18305 -329051 129786 -231505 47195 -18711 167259 -55648 61250 66755 -242742 18497 -307984
18293D0258a2069I6880K09273E225b19768O0051c2939l6272l42236e8077A9348
18281f2532E8716g359E6576E50b8170r0841L94k1982G1509L1793b11998a9434
18268a86305k25418J96054d9667n2355C0434J67053a12921B568d9837j06330O5552
18257i0615j3583j06443G6026K92931f2647B82814n3554a8041l4575K5699C47891
18245c17920B6978K08590j02985E458i6687I345a9093q4612j93273B67586j02510
18234A65076L6491p7826l6260k8366b37677A35611J03917I9343J4604R8498a61691
18222b19729e2442J2924k69454a48641H4622c38341b4669m36137A03001B5934
18211f3837A2343R3973A6627b94876J12370Q9080A09326J86150f0240m2537a7714
$$ plain form
18293 40258 -12069 96880 306153 5225 -219768 -159717 -32939 -69211 -411447 -58077 19348
18281 -62532 58716 -7359 56576 550 -28170 -119011 -118617 -140599 71509 103302 -211998 -19434
18268 -186305 -411723 -215669 -49667 -102022 30434 197487 -112921 2568 -49837 -156167 -90615
18257 -90615 -104198 -210641 76026 368957 -62647 282814 229260 -18041 -52616 -26917 347891
18245 -317920 26978 235568 132583 5458 -96687 9345 -19093 -103705 -296978 267586 165076
18234 165076 201567 123741 87481 59115 -237677 135611 239528 99343 113947 212445 -161691
18222 -219729 -52442 -39518 -308972 -148641 84622 -338341 -24669 -460806 103001 25934
18211 -63837 12343 106316 16627 -294876 -182506 -93426 109326 295476 -60240 -102777 -17714
18199b8886E3409c82488a77691k8398J3610B1063e2749a6921A00598B214e05592
18187h7856A72007J17854a47221l34740a4294j19881j47803i531B776d65225F5796
18175a89934l4722k4497A7854b15399A78631k2639a87148j28476A85597a10289
18164I1292a41436A87979d2998j01120O4631A30272b01302j95750c4096k08226
18154b42322C047P7973J9907g612k11623c3724A27087n5969k6862O38B1337J03781
18142A25118a7421m09084A57754d0974A38254k3558b19977e7378A54425h5249
18131a89288G7743e193A98598l6747O3029m3221b9999H2217K17646d1833r8105
18120a39938C54566j71339a98426F3169A5429c4034G3227b94386C12333h8375
$$ plain form
18199 -28886 53409 -382488 -177691 -206089 -192479 21063 -52749 -16921 100598 2214 -505592
18187 -87856 172007 289861 -147221 -481961 -14294 -134175 -281978 -9531 2776 -465225 65796
18175 -189934 -224656 -249153 17854 -215399 178631 155992 -187148 -315624 185597 -110289
18164 91292 -141436 187979 -42998 -144118 -79487 130272 -201302 -397052 -34096 -242322
18154 -242322 3047 81020 100927 -7612 -219235 -33724 127087 71118 44256 44894 21337 125118
18142 125118 -17421 -426505 157754 -40974 138254 114696 -219977 -57378 154425 -85249
18131 -189288 77743 -5193 198598 161851 224880 181659 -29999 82217 299863 -41833 -139938
18120 -139938 354566 183227 -198426 63169 15429 -34034 73227 -294386 312333 -88375
18109b56464C9118K16782a12598A22581a22697j10571O3120A13072e6412J807
18099e4605j26963j5719g095B57696a19285k74455M1477A10330R6870o7883J8357
18088A57674a27118p6474A53672i0151C9686a31034c0359B78460K9564i4382B20062
18076b45978H1771M7375b80479b0207q4622E6817f2756m3790b1026H2918J25753
18065B08671a88360A09434a659A47994f9821b9673n8247B8815i5699a8024o1739
18054g9763I3796c08261f4668A5924c25554a41501K2225L6355j44904a05864e2874
18042A41861i0316l4888B50107A06025R6922O3394j4206E1379K53514A6206J09330
18031A25536b21704D7805c6438F7379b13245B577J19229a22289J0477E8777O1876
$$ plain form
18109 -256464 39118 255900 -112598 122581 -122697 -233268 -170148 113072 -56412 -54605
18099 -54605 -181568 -197287 -7095 257696 -119285 -393740 -352263 110330 207200 139317 157674
18088 157674 -127118 -203592 153672 -90151 39686 -131034 -30359 278460 308024 -94382 220062
18076 -245978 81771 129146 -280479 -20207 -104829 56817 -62756 -106546 -21026 82918 208671
18065 208671 -188360 109434 -1659 147994 -69821 -29673 -87920 28815 -95699 -18024 -79763
18054 -79763 93796 -308261 -64668 15924 -325554 -141501 -119276 -82921 -227825 -105864 -52874
18042 141861 -90316 -125204 250107 106025 202947 266341 252135 51379 304893 16206 125536
18031 125536 -221704 47805 -36438 67379 -213245 2577 121806 -122289 -111812 58777 120653
18020A20653k5436L6496K10282a9130F293a00996j54333B67789A18749B9430a31117
18008A40151a74880E167P3234a02337A21040A4556M8451J50654k5391a645A99484
17996c08086E9957a5559A8045f5963F7976a44555a6980N760C02325j10672B8853
17984A33230B9341J2933g7152F7247J42015J0354m2582b3988A92620A946P464
17973I410a68148E6987e2518B26357F4078b4505C29340A11242J2319f0419B33435
17961A15295E3164a70943A94136B0741K04308C4378K8435a85937j8450h4618A54187
17949b16951C58890a1999j59920B5669a49344F5070O0641c9467k89j58647A12896
17937E3995c01004B19702I0324N8636E7616R7477P7836e0948A6547J55785a4261
$$ plain form
18020 120653 95217 131713 341995 -19130 6293 -100996 -255329 267789 118749 29430 -131117
18008 140151 -174880 5167 78401 -102337 121040 14556 63007 213661 188270 -1645 199484
17996 -308086 59957 -15559 18045 -65963 67976 -144555 -16980 -11220 302325 191653 28853
17984 133230 29341 42274 -77152 67247 209262 219616 177034 -23988 192620 1946 9410
17973 9410 -168148 56987 -52518 226357 64078 -24505 329340 111242 123561 -60419 233435
17961 115295 53164 -170943 194136 20741 225049 34378 62813 -185937 -204387 -84618 154187
17949 -216951 358890 -11999 -171919 25669 -149344 65070 125711 -39467 -39756 -198403 112896
17937 53995 -301004 219702 90324 148960 57616 155093 232929 -50948 16547 172332 -14261
17925B1863p581e3519j29161d0718A42426a85068A11172b03507C7487K16335A2263
17913a22820B15380m2774a95296A33776f0309o0493e7309A5423M47133k28087
17903B34469d8108A18700K2933b29389B83720G4160J45655P6103A20884d1867
17892B40882a48296c8051a5621m5977l9878c7331l18045B49636A22514J71003
17882B93517J3561A17646a40486N9974l8195q3359n9223g7668B8949a3792j6484
17871c0276q005J6371C18435d0676C11637d3311r2489r1A83386q3853c23532B75143
17858C6619i9780j05633d2943c214A90638K2374a23911c7958j2107A84922c02529
17846a15334B7339M0190c03384j3685B15123H292a73721K9004A39839F0300J89561
$$ plain form
17925 21863 14282 -53519 -182680 -40718 142426 -185068 111172 -203507 37487 253822 12263
17913 -122820 215380 172606 -195296 133776 -60309 -120802 -57309 15423 462556 234469
17903 234469 -48108 118700 141633 -229389 283720 74160 219815 295918 120884 -41867
17892 240882 -148296 -38051 -15621 -61598 -101476 -37331 -355376 249636 122514 293517
17882 293517 307078 117646 -140486 -80512 -118707 -202066 -261289 -77668 28949 -13792 -30276
17871 -30276 -38281 -21910 318435 -40676 311637 -43311 -135800 -135891 183386 99533 -323532 275143
17858 36619 -99780 -205413 -42943 -3214 190638 213012 -123911 -37958 -50065 184922 -302529
17846 -115334 27339 67529 -303384 -317069 215123 8292 -173721 -144717 139839 60300 249861
17835B49861A10615k1816A0460J49488a1318j86592J9138a4180l61670E8814d5179
17823E2283b08374F9938i7399A59065o8625K21993E3190J70853F0699J84927A2689
17811A97358n3365P2153h6026H2343b06468G7540K49468m7535p3289l2392E42
17799C4219M6048k9579K11358a90787A21737b38437g5503o8835B34409a86016
17788C5430h9633l6989a1529D6884i6706J6906m2739j02425A87144c72794a51203
17776D9942m575f3986k66430A64151J98470a35279F6255j9574J44132b74957E6157
17764A93254E0545M9254g3774C8209a71123D12208A92489E493K37740r7179j2732
17753A33322i3634C03881n1863I9009Q5957q4387L11643a35993L330p1950B869
$$ plain form
17835 249861 110615 88799 10460 159948 -11318 -197910 -178772 -14180 -375850 58814 -45179
17823 52283 -208374 69938 -97399 159065 90440 312433 53190 224043 60699 245626 12689
17811 197358 143993 216146 -86026 82343 -206468 77540 327008 279473 206184 173792 542
17799 34219 80267 50688 262046 -190787 121737 -238437 -75503 -144338 234409 -186016
17788 35430 -89633 -126622 -11529 46884 -96706 -79800 -122539 -224964 187144 -372794 -151203
17776 49942 45367 -63986 -330416 164151 362621 -135279 66255 46681 190813 -274957 56157
17764 193254 50545 99799 -73774 38209 -171123 412208 192489 5493 243233 146054 133322
17753 133322 -93634 303881 252018 99009 184966 100579 412222 -135993 -132663 -204613 2869
17741C26410I9198c9782E2652a54204B60957g9335p0793B39643A16336J18654
17731B34990F645P8061N8760n7142K6896a33268j36013d2156A61948G391a17192
17719A49566b86559G6521a4998j34425F63J84429f1065k19552b239C45205A28830
17707B5935J51345e4201A08217L087K27097c1642B93182C987a97043i8036C61249
17695E0308L51226h5843D78171e4474B33769c6564E3211e7432A43678B5616K63129
17684B88745i8103C44932q9068j3890A6329R7090b8853l7263C37864j55339H8774
17672A26510a06716E3186b71840R7386B80422A24509K68123A18549K43365A33904
17661C70148l6812A24284k173Q5247J50658A26825d3028l0008C44666a22055e138
$$ plain form
17741 326410 99198 -39782 52652 -154204 260957 -79335 -150128 239643 116336 234990
17731 234990 6645 84706 143466 86324 113220 -133268 -269281 -42156 161948 7391 -117192
17719 149566 -286559 76521 -14998 -149423 663 185092 -61065 -280617 -2239 345205 128830
17707 25935 177280 -54201 108217 111304 338401 -31642 293182 3987 -197043 -98036 361249
17695 50308 401534 -85843 478171 -54474 233769 -36564 53211 -57432 143678 25616 288745
17684 288745 -98103 344932 255864 241974 16329 113419 -28853 -66116 337864 182525 88774
17672 126510 -106716 53186 -271840 -174454 280422 124509 392632 118549 361914 133904
17661 370148 333336 124284 122111 207358 358016 126825 -43028 -73036 344666 -122055 -5138
17649I4251K12345Q6098f1346m9066A74738Q7564J25144A44505n5417K09900A15053
17637H5353d0021C62052A21694l4596L08297A50195A1259J19718O8372d6214A22614
17625C83092A19471b42810E4808b5478D61044E9441M2895L1955n2419J31246c3161
17613c8587B51251b07211A0099J43747m6097C843N2985M00753A12755K23864P4301
17602D10920A05473J60282J10331j26960I1703J08230J90482B822a31085E77643
17591H79h7561I736L3568L99107a53611A40689c6590B87398K5160r7013r3266
17580A22279N5736K73436E5953Q4060N0421a82099E5198K91570a18333B02646
17569A74618K05983j12124j17500g635l6434A7292a0670A02488B1355J91585q518
$$ plain form
17649 94251 306596 392694 -61346 -110412 174738 262302 387446 144505 89088 298988 115053
17637 85353 -40021 362052 121694 87098 395395 150195 11259 130977 199349 -46214 122614
17625 383092 119471 -242810 54808 -25478 461044 59441 102336 134291 81872 213118 -33161
17613 -38587 251251 -207211 10099 153846 107749 3843 56828 457581 112755 336619 410920
17602 410920 105473 265755 376086 249126 91703 199933 390415 2822 -131085 577643
17591 879 -87561 9736 43304 442411 -153611 140689 -36590 287398 312558 215545 122279
17580 122279 178015 451451 55953 140013 190434 -182099 55198 346768 -118333 202646
17569 174618 380601 268477 150977 -7635 -44069 17292 -10670 102488 21355 212940 204422
17558B04422B74R0994J8845J05316E561E10J45973F0524J21469B8473J09014R5347
17546B32834J66198F4990K89974O2271B03105B6514M2809L30129m1669n1635A50242
17534A86766b73189A99705j3177k8789J73918J82128k17025J72398L62635l4389
17524G97404J34339j95916L10191m37378K28649l61457B23268R6071o629J38342
17514D51052A57128m4877P44572K53007j22539j54123M2863K10083l10504l30473
17504D45137R4349A90981J30893j1300j17456P5855r9427D6507k2298K46354J67873
17493D38436G2680M28897k35874J25549N6050A09390M0023J05883P6545F8920
17482D06756A23055K91791j84856L18255n2521r6600k0969p2395j04861I238J63
$$ plain form
17558 204422 274 91268 110113 215429 5561 510 146483 60524 181993 28473 137487 232834
17546 232834 399032 64990 354964 417235 203105 26514 69323 399452 357783 306148 150242
17534 186766 -273189 199705 186528 157739 331657 513785 296760 469158 831793 797404
17524 797404 931743 735827 1046018 608640 837289 475832 223268 319339 312710 451052
17514 451052 157128 112251 856823 1109830 987291 833168 876031 1086114 775610 445137
17504 445137 539486 190981 321874 310574 193118 268973 169546 46507 24209 270563 438436
17493 438436 72680 501577 265703 391252 447302 109390 149413 255296 331841 68920
17482 406756 123055 414846 229990 548245 495724 399124 378155 305760 200899 9238 9401
17471I401K33350K14493A23541R1410R1572Q6839b84623A45778e745I0656J02939
17460A93595F9198M19817G1871L98106l4404j76035K87348r9229k02379L3787
17450B79065K39175R272K6724J84543C50055J43543j7426k1590j46101n4541J03231
17439C57171A36118K06323q5772K67151l8460J60984k64161n8322a64680E09797
17428C86281k2150j23910J12537q5186J55587J31896B63671K17101j51888J25421
17418D54305m1145A97788I1591K54451J97247A83270M7768M32328K7651k28610
17408D62407A85713K78397j39659r7265J14710H6082K69544j66219j8707J70436
17398C41136l5766j42699R0410L7522k3918h7987E76439A15005K4193h328A80731
$$ plain form
17471 9401 242751 457244 123541 214951 306523 393362 -284623 145778 -5745 90656 193595
17460 193595 69198 489015 71871 469977 435573 259538 546886 447657 245278 279065
17450 279065 518240 527512 554236 738779 350055 493598 476172 454582 308481 253940 357171
17439 357171 136118 342441 256669 523820 485360 646344 382183 323861 -164680 509797
17428 386281 364131 240221 352758 267572 423159 555055 263671 480772 328884 454305
17418 454305 413160 197788 91591 346042 543289 183270 231038 663366 691017 462407
17408 462407 185713 464110 324451 227186 341896 86082 355626 189407 170700 341136
17398 341136 305370 162671 253081 290603 266685 -87987 576439 115005 139198 -8328 180731
17386A76431F5199K36583A01434J05589K0371L06223B16592J11269N4052N6432
17376D38345j14273j53108K00091l0553J13223H2616K18937m4707L9267L6899
17366C33012K22939b9998B99312P7188A12205b2446B25931j11891L29328j46033
17356B97335l9129F9345J24534L9318o8365K34315d4424B93909K82248A81639
17345F639b74903F13632A78196l8084L02152A2658D012L85391A33304Q9739J8101
17334B41144J18211q0015K31501k11958j46095J05955I9237K31920R0197D4074
17323a0227F09994j42814j09200G0014N04100B21816K8287J90320R1648A81357
17312a11912B86248Q523L85154l28406k236L5823j0651n3486j56475J65343L0111
$$ plain form
17386 176431 65199 301782 101434 207023 227394 533617 216592 327861 381913 438345
17376 438345 324072 170964 371055 340502 453725 82616 301553 256846 296113 333012
17366 333012 555951 -29998 299312 376500 112205 -22446 225931 114040 443368 297335
17356 297335 258206 69345 193879 233197 164832 399147 -44424 293909 576157 181639
17345 6639 -274903 613632 178196 140112 442264 12658 4012 389403 133304 223043 241144
17334 241144 359355 279340 510841 298883 152788 258743 99237 331157 421354 44074
17323 -10227 609994 467180 357980 70014 574114 221816 250103 440423 532071 181357
17312 -111912 286248 294771 679925 351519 349283 385106 374455 320969 164494 329837 359948
17301C59948L0947j50863K95623B63171r0475J14165Q3109c7467D26786j94065
17291B32721p0967K35954j24194l1638N0440J07702l5367I4509K71821A55789
17280A51315L73701k36127G4634p43K57472q0458q4756L91340j69473j93710P2011
17269B66317N92734C64164a48106F02576k71174J40091I7545J82407K68563k48985
17259B99530K12706C323L05686J74650a1833E95887J34907B46257K15923r01n7136
17248D04143R9591j53862J70445B54520J818n1064M1993L14123k49917J77885
17238D89358B29822J61071Q0550J07569n0707A12595J63540L3436J75735A52467
17227E38124K3270A10271L67977k06208L72586A73779K25504I4135L89371j95538
$$ plain form
17301 359948 390895 240032 535655 263171 172696 286861 369970 -37467 426786 232721
17291 232721 161754 397708 273514 241876 292316 400018 364651 94509 366330 155789
17280 151315 525016 288889 74634 73891 331363 250905 166149 557489 388016 194306 266317
17269 266317 859051 364164 -148106 602576 331402 471493 97545 279952 548515 299530
17259 299530 512236 3323 309009 483659 -11833 595887 730794 246257 462180 461279 404143
17248 404143 503734 349872 520317 254520 256338 205274 247267 561390 311473 489358
17238 489358 229822 390893 471443 579012 528305 112595 276135 309571 485306 152467
17227 538124 561394 110271 478248 272040 644626 173779 399283 94135 483506 287968
17217B87968p3331M89029K0906B22469J289M21649k31959L2706j40869p5355K98064
17206E27994j32215N25726m08108j36360K4937o8424A19846K49420J2398H2093
17195D88004k5059A95422m5212K6131L01947K99483k45582j84162N34923k78384
17185F04566K7606j46549j43880J98906r6316n3892Q0075J36102k07843K14847
17175F13622P3757F6382K00308L27189B93466L02572k21900J48682K86250C62002
17164C17139J43541l4436J72860k8713B77173J56833J17882J18060k37438J23549
17154E56059j54604L01617k66408G8656O01470l36224J80146N2346O4824B91064
17143C09120K66969L33944m43131r5677K93331k48513K27407j92852J21504K2472
$$ plain form
17217 287968 214637 703666 724572 222469 223758 645407 413448 446154 305285 229930 527994
17206 527994 395779 921505 513397 377037 401974 333550 119846 369266 381664 82093
17195 488004 462945 195422 150210 176341 478288 777771 532189 348027 882950 604566
17185 604566 632172 485623 341743 540649 444333 390441 470516 606618 398775 613622
17175 613622 687379 66382 266690 593879 293466 596038 374138 522820 809070 362002
17164 317139 460680 426244 599104 570391 277173 434006 551888 669948 432510 556059
17154 556059 401455 703072 436664 78656 680126 343902 524048 576394 641218 291064
17143 309120 576089 910033 466902 371225 664556 416043 643450 450598 572102 594574
17133E94574j94696J39225O4476P715k19783n3832L46995J78557l49570K98012
17123H11673k03473j07383J80117q1774R6956k78709m2064K02289m9349J8795
17113E47078J55001P6894B30293M43405n6233j2530j05794k9933L92053A59292
17102E72168p3663R3140P1111j23376M56417K21976k87873l34976L601K03893
17092H02418k67111K2134j81089L87623j83616K71747n1999J04365m3911j92674
17082F67887K48373k69028J38664k05583L0042L52331k75843J80203k36077K30063
17072H61032J07759k12124J16921k32438M71520D30782O53584m81133R1326j3205
17062F81354L81059D92714K40309K14576j13159k13353O2376P475M66601m29234
$$ plain form
17133 594574 399878 539103 603579 611294 391511 337679 684674 863231 513661 811673
17123 811673 608200 500817 680934 599160 696116 417407 375343 577632 528283 547078
17113 547078 702079 778973 230293 673698 617465 604935 499141 469208 861261 159292
17102 572168 498505 591645 662756 539380 995797 1217773 929900 594924 598525 802418
17092 802418 535307 557441 376352 763975 580359 852106 800107 904472 860561 667887
17082 667887 916260 647232 785896 580313 610355 962686 686843 867046 630969 861032
17072 861032 968791 756667 873588 641150 1112670 430782 1084366 603233 694559 681354
17062 681354 1062413 492714 733023 947599 834440 621087 683463 690938 1157539 728305
17052G28305J98674j18237K58300m01780J7988J74145R9148k70068K86632m2242
17042I30865K01772j25552M9986l47129O91707o45318M8871L46663j73128Q1037
17032A059774k4559q2950j00166J03612J8234k97070M3306K99266j02290K81835
17022A198992m36355N05683m69087K74958j45607J37403l5148R5513j38178J39476
17012A127650K46795j63314l47932K95190J79839k00035q4072j1875J11820N4436
17002A208502j87507M78713l11743P2891K25542n17072M82700J95897l22803j82863
16992A142257K79560j16044K09764m72663L31398N9886O3552n5024k35852J66676
16982A373510o5800J65462j13900k8707J41123M1114J72997j89720j38280j86964
$$ plain form
17052 728305 926979 808742 1067042 665262 683250 857395 956543 686475 973107 930865
17042 930865 1132637 1007085 1057071 709942 1401649 756331 805202 1151865 978737 1059774
17032 1059774 1035215 952265 852099 955711 973945 676875 720181 1019447 917157 1198992
17022 1198992 762637 1268320 799233 1074191 928584 1065987 1030839 1126352 988174 1127650
17012 1127650 1374445 1211131 863199 1158389 1338228 1138193 1054121 1042246 1154066 1208502
17002 1208502 1020995 1499708 1187965 1260856 1486398 969326 1452026 1647923 1325120 1142257
16992 1142257 1421817 1305773 1515537 1042874 1374272 1434158 1497710 1442686 1206834 1373510
16982 1373510 1307710 1473172 1359272 1330565 1471688 1512802 1685799 1496079 1357799 1170835
16972A170835O39885k68169J11310J93235r6756n6726O3953l61025M77275l79296
16962A494521J68978k641o2708L1581O6698p6965K33668k95275j50674N51953
16952A959136l48977J45030l7320J17969k49433K06355J75035J11904O4771j17548
16942B026922m23600L57695R9357M883l71620N69124k14142M9725J4688l40188
16932A772844K26861K56280M4763k86222K42710n0244m6430L7252J31130j22100
16922B206844M8166n634P3649J86890k37726J42324q6341K04131j7247n6661J62325
16911B620720n0665j6460j0528N2332k0118J49922p791K46111k65186J14474O5420
16900B878231j6176k66987O89101K67055q32448K08792J28676j87179K72305L62045
$$ plain form
16972 1170835 1810720 1542551 1653861 1847096 1750340 1693614 1757567 1396542 1873817 1494521
16962 1494521 1663499 1660858 1598150 1629731 1696429 1619464 1853132 1557857 1407183 1959136
16952 1959136 1610159 1755189 1717869 1835838 1586405 1792760 1967795 2079699 2144470 2026922
16942 2026922 1603322 1961017 2060374 2065257 1693637 2262761 2048619 2098344 2113032 1772844
16932 1772844 1999705 2255985 2300748 2014526 2257236 2206992 2160562 2197814 2328944 2206844
16922 2206844 2255010 2249376 2323025 2509915 2272189 2414513 2328172 2532303 2515056 2458395 2620720
16911 2620720 2570055 2553595 2543067 2595399 2575281 2725203 2717412 2963523 2698337 2812811 2878231
16900 2878231 2862055 2595068 3284169 3551224 2718776 2927568 3056244 2869065 3141370 3503415
16890C503415j71438J16800k19612J04097L587N4114l9973L98063p1811j82499
16880C494743L11003l67174o1135P4671j38698O24622l7521J9695L53446j63173
16870D110479M54771m60748K75156k4606L48671o23189N85754k88817M03424l54386
16860D426509L27105J34395j83874k36009O18732m50767L70887N7064L62908j72321
16850E254629K36881K1195Q7915k03608N3865N65146l65937M72072L3978q7467
16840F068669Q9040K91056J442K87069r3410M413J02072N19307m56491M08114
16830G221281K27418j13471J48336M31970J1096p230M68399j91307Q0972K60079
16820H537543N32215k01138K97155q6880Q5366O36084J906J86153j24437N63562
$$ plain form
16890 3503415 3331977 3448777 3229165 3333262 3336849 3390963 3350990 3749053 3677242 3494743
16880 3494743 3805746 3438572 3377437 3452108 3313410 3938032 3900511 3920206 4273652 4110479
16870 4110479 4565250 4104502 4379658 4355052 4703723 4080534 4666288 4377471 4780895 4426509
16860 4426509 4753614 4888009 4704135 4468126 5086858 4636091 5006978 5064042 5426950 5254629
16850 5254629 5491510 5512705 5600620 5397012 5450877 6016023 5650086 6122158 6156136 6068669
16840 6068669 6157709 6448765 6450207 6737276 6643866 6648279 6750351 7269658 6813167 7221281
16830 7221281 7448699 7335228 7483564 7915534 7926630 7919400 8387799 8196492 8277464 8537543
16820 8537543 9069758 8868620 9165775 9078895 9164261 9800345 9802251 9988404 9863967 10427529
16810A0427529L39700O2112L92719k39065P76310q6980K73936J50002K42040L75164
16800A2713467N10281P1687L71823K60871N10361L73542J08784P92142q754L29566
16790A6033770J56638J007687J24607L50530M09878Q00205O45464R5722O57020
16781B0281521L25653Q91629M21084O25737O34492Q41635Q00041O70109N42882
16772B6034783R89542R32973O90078Q81886Q68134J063142O77228J231800J174580
16763C4544146J007698J122447J159479J376481J698077Q73475J581031J842927
16755D5205761J262193J628604J859991J537434K253504J640102J724749K370591
16747E9482929J870950K437245K662780K338713K265988J884985L033894K632268
$$ plain form
16810 10427529 10767229 10829341 11222060 10982995 11759305 11672325 11946261 12096263 12338303 12713467
16800 12713467 13223748 13295435 13667258 13928129 14438490 14812032 14920816 15712958 15704204 16033770
16790 16033770 16190408 17198095 17322702 17673232 18083110 18883315 19528779 19624501 20281521
16781 20281521 20607174 21498803 21919887 22545624 23180116 24021751 24821792 25491901 26034783
16772 26034783 27024325 27957298 28647376 29529262 30397396 31460538 32137766 33369566 34544146
16763 34544146 35551844 36674291 37833770 39210251 40908328 41781803 43362834 45205761
16755 45205761 46467954 48096558 49956549 51493983 53747487 55387589 57112338 59482929
16747 59482929 61353879 63791124 66453904 68792617 71058605 72943590 75977484 78609752
16739G8609752K852448K406688K574000K862458K793067K327714K997465K675837
16731A00099429K358526K513594K345354K126477J817459K008660J315049J387288
16723A15971836Q57984O34451N96677l74452N14217o01393l78366j460440j263014
16714A14497500j697163j963378j513634k422062j922444l046076k342712k810825
16706I6779206k537335k556232l261378k448894k881993k670182k728126k791963
16698G4903103k753745k344705k532333k233922k450328k165500k282800k092903
16690E6046867j918632j718290k233343j460133k173955j288577j975672j121342
16682D2156923j524515j385285j205323j235693j388327j377611p48590j323499
$$ plain form
16739 78609752 81462200 83868888 86442888 89305346 92098413 94426127 97423592 100099429
16731 100099429 102457955 104971549 107316903 109443380 111260839 113269499 114584548 115971836
16723 115971836 116829820 117464271 118060948 117686496 118200713 117599320 117220954 115760514 114497500
16714 114497500 112800337 110836959 109323325 106901263 104978819 101932743 99590031 96779206
16706 96779206 94241871 91685639 88424261 85975367 83093374 80423192 77695066 74903103
16698 74903103 72149358 69804653 67272320 65038398 62588070 60422570 58139770 56046867
16690 56046867 54128235 52409945 50176602 48716469 46542514 45253937 43278265 42156923
16682 42156923 40632408 39247123 38041800 36806107 35417780 34040169 33291579 31968080
16674C1968080p10980q48114j331626j103484n73465j070337l08529j189699o65338
16665B4166508p20481o46224m54352j046296j44146p39475l96154p44370m49169
16656A8825841p16339k83530k77248q63819n26960K14504q25392j01444o73306
16647A4772307l54154m30751R8794o38057k15752k03343l94971l50310o4337l73365
16637A1846061j97362n27874l22757k84856O7322m02971j48845j71275k86989
16628I570454K26012k64482n03934l4217k75571q9341n59065K78210l24204K92075
16618H315937o92154J93865k16582k10868k67316L81607o16577K75745k07315
16609F956342l13647k3633r3853j61524k83377j30054L61612k69924p8730n48015
$$ plain form
16674 31968080 31257100 30408986 29077360 27973876 27400411 26330074 26021545 24831846 24166508
16665 24166508 23446027 22799803 22345451 21299155 21155009 20415534 20019380 19275010 18825841
16656 18825841 18109502 17825972 17548724 16684905 16157945 16372449 15547057 15445613 14772307
16647 14772307 14418153 13987402 14086196 13448139 13232387 13029044 12634073 12283763 12219426 11846061
16637 11846061 11648699 11120825 10798068 10513212 10580534 10177563 10028718 9857443 9570454
16628 9570454 9796466 9531984 9028050 8993833 8718262 8628921 8069856 8348066 8023862 8315937
16618 8315937 7623783 7817648 7601066 7390198 7122882 7504489 6887912 7163657 6956342
16609 6956342 6642695 6619062 6525209 6363685 6080308 5950254 6311866 6041942 5963212 5415197
16599E415197K6900M9681j13868p4269J43364R1878l42620j69816k22984j20025
16589D683438L16448l14113k13664K9791M42598m11530j41337k05512J16835j51110
16579D151844l2313r1555R0221j87429Q0755l02418K82237q3716m88700L79858
16569C798784n0483k54716R5841Q9778n4238l63238J91672k14840j74631J80263
16559C244192l02341K80753O7866k56105K50480k41192n8946K13768o74488K20277
16549B744264K47510l2941l55477m3452K04283k79239m8039M01459m73012L74505
16539B739861l28132j16294J85495q1116j41204K39201j07198j40483O6763k89091
16529B027802P4950k163p5172K02037m5013j27663J59410j49682K8204p8072J0414
$$ plain form
16599 5415197 5442097 5491778 5377910 5303641 5447005 5538883 5196263 5026447 4803463 4683438
16589 4683438 4999886 4685773 4472109 4501900 4944498 4532968 4391631 4186119 4302954 4151844
16579 4151844 4119531 4027976 4118197 3930768 4011523 3709105 3991342 3907626 3418926 3798784
16569 3798784 3748301 3493585 3589426 3679204 3624966 3261728 3453400 3238560 3063929 3244192
16559 3244192 2941851 3222604 3290470 3034365 3284845 3043653 2984707 3198475 2523987 2744264
16549 2744264 2991774 2958833 2603356 2559904 2764187 2484948 2436909 2838368 2365356 2739861
16539 2739861 2411729 2295435 2480930 2399814 2258610 2497811 2390613 2250130 2316893 2027802
16529 2027802 2102752 2100589 2025417 2227454 2182441 2054778 2214188 2064506 2092710 2014638 2025052
16518B025052q2923J00962l72757j1750K71627O9071l40166J56988O5684Q632
16508A890420j93959K95150p6529k14410M14487n46588K10900J95406M0971m30299
16498A585549j98482M13641k67159q9099j91251M25299l4710l08671J47411O26
16488A483154J96548J4030R5443j22267k47613J41373n77071N06612j26987J68959
16478A532181k83117K64569M5919l73481J81075L9564R2019l07095j38770L69662
16468A422526l9638l5417M7719K26766l12065j35760N2121j44629O1459R3186
16458A236268m7398O5303J05805n14844k033J51374J11700m1353J5421M30845
16448A511088k56965m2282p1241j67938J9005m1528K48862J50660r6209m08536
$$ plain form
16518 2025052 1942129 2043091 1670334 1658584 1930211 1999282 1659116 1816104 1881788 1890420
16508 1890420 1696461 1991611 1915082 1700672 2115159 1568571 1779471 1974877 2015848 1585549
16498 1585549 1387067 1800708 1533549 1444450 1253199 1678498 1643788 1335117 1482528 1483154
16488 1483154 1679702 1693732 1789175 1666908 1419295 1560668 983597 1490209 1363222 1532181
16478 1532181 1249064 1513633 1559552 1186071 1367146 1406710 1498729 1191634 1052864 1422526
16468 1422526 1382888 1347471 1395190 1621956 1309891 1174131 1226252 1081623 1143082 1236268
16458 1236268 1188870 1254173 1359978 845134 843101 994475 1106175 1064822 1080243 1511088
16448 1511088 1254123 1211841 1140600 972662 991667 950139 1199001 1349661 1253452 844916
16438H44916L7237J4369O9928K33448k4589l07981o2965J16759j20682L43421
16428A143861j64587Q9054D16284M77452m5277L6543k33248L79158l23043Q4224
16418G92093n8389K65986m8670l4899o9684J08698l55009K01884O1782k58618
16408F05174j31157J35110l6887K58264k34560J26945m4132O000k7562n368J18681
16397G70508O2552k42419J03623N8479J9286Q4253j78295N08169n64804K206L72993
16386I96551D48039J04925J68764l02330l9734M66491j97725N1493J67739m17286
16376D50376M86197l5112j59177A86535L92101M9641n043J72486r6575J65272
16366H64417j34249k15468J78218l40955M43240J11776C38745L36651M1411k21969
$$ plain form
16438 844916 882153 896522 966450 1199898 1175309 867328 804363 921122 800440 1143861
16428 1143861 979274 1068328 416284 893736 848459 885002 651754 1030912 707869 792093
16418 792093 733704 999690 951020 916121 846437 955135 600126 802010 863792 605174
16408 605174 474017 609127 572240 830504 595944 722889 678757 684757 657195 651827 770508
16397 770508 833060 590641 694264 752743 772029 856282 677987 1186156 621352 623558 996551
16386 996551 448039 552964 721728 419398 379664 846155 648430 699923 867662 450376
16376 450376 936573 901461 742284 186535 578636 628277 623234 795720 699145 864417
16366 864417 730168 514700 692918 351963 795203 906979 338745 675396 716807 494838
16356D94838K93782k30993J5403k27738K90283O327j29867j75896K09274O0975
16346F06388B23995K06461q8464N01716B97798M56781B84287J25004J71978j89166
16336C92103K02368J46118q4744J7032J8586C04883K61542J67379k20470K18097
16326G31431k24674J92333B55166J76762K39984B71574K80586k50672J79551J29755
16316F10794J10303k39594j50053Q8594P1616k14858J29163B00405M40755B25740
16305D19824J04663k17123C4994M59813j27459A78063K51967O7221r6908q3988
16295C16355A37056M67908k8192A56974K08273j24765K12032p3994J04873n7853
16285D25540o4328p3710F3709J74452H8584J25452K88183a46451F53073I5772
$$ plain form
16356 494838 788620 557627 573030 345292 635575 641902 512035 336139 545413 606388
16346 606388 223995 430456 341992 843708 297798 754579 284287 409291 581269 392103
16336 392103 594471 740589 655845 672877 691463 304883 566425 733804 513334 731431
16326 731431 506757 699090 255166 431928 671912 271574 552160 301488 481039 610794
16316 610794 721097 481503 331450 420044 491660 276802 405965 200405 641160 225740
16305 419824 524487 307364 34994 494807 367348 178063 430030 497251 400343 316355
16295 316355 137056 604964 576772 156974 365247 240482 452514 378520 483393 425540
16285 425540 361212 287502 63709 238161 88584 214036 502219 -146451 653073 95772
16274C31764K28132k55759q01P1104J37199j54698j47591J86425l7344J91675
16264E50106n8469J10738A75293M29614k81951m8876j21136J95772k2942n4565
16254B71209J49239p197l0184A82082b6734C12356k6780k1933j0453I4414K30928
16243C25342N394G5720L36097k04944M80148B64845R9110R4935o2224K1950A33179
16231B27133J45628q8149c145B70533r2490M01959D7442L16490j32199O076P297
16220B45106F3309O5685J77891a09419B15751J73618j21302J8076L02961A69349
16209B30568j09360J51931H8480M0736K65059L1787A15944O8084l8606K0955c1642
16197B47479m7369g3125C45711h6204G2267J5733K92384K10201l9246k42525k4325
$$ plain form
16274 331764 559896 304137 303336 374440 511639 356941 209350 395775 358431 550106
16264 550106 491637 602375 175293 604907 322956 274080 152944 348716 325774 271209
16254 271209 420448 413251 383067 182082 -26734 312356 285576 263643 253190 94414 325342
16243 325342 330736 75720 411817 206873 687021 264845 363955 458890 396666 418616 133179
16231 227133 372761 284612 -3145 270533 178043 580002 47442 363932 231733 237809 245106
16220 245106 63309 128994 306885 -109419 215751 389369 268067 286143 589104 169349
16209 230568 121208 273139 88480 129216 394275 426062 115944 184028 145422 166377 -31642
16197 247479 200110 -73125 345711 -86204 72267 88000 380384 590585 551339 308814 284489
16186B84489J5613g2921J8337E03753A03452P7218A2927c4298C53971E9949L84057
16175D44006A42507a7494j01797E20971k41476G4244J26381l9297K32824h8371
16164D4254L2644b638F2475K96061I8761L26593k03672N5627H1668L17546j83743
16153B15471b63539A26576a21157D60041c10901A40941K31234j85347R0062j501
16143B75389F9420D155J45191C9371J0918O9281M4109a03231A51414a80090B39960
16131E872K04298P7216A24992a20360G1933J12847c19831A0269d918D02323o8630
16120C33693p0646A8883a72140C05331n6216b32247C72532j73212M4860p0070
16110A74110A2955K0374J56996K24379H8603N241c80857a13379d9792A77163J19447
$$ plain form
16186 284489 300102 -72921 -54584 503753 103452 180670 12927 -34298 353971 59949 444006
16175 444006 142507 -17494 -119291 520971 279495 74244 200625 161328 394152 -88371
16164 44254 76898 -2638 62475 358536 98761 425354 221682 277309 81668 399214 215471
16153 215471 -263539 126576 -121157 460041 -310901 140941 372175 186828 276890 275389
16143 275389 69420 4155 149346 39371 50289 119570 163679 -103231 151414 -180090 239960
16131 5872 210170 287386 124992 -120360 71933 184780 -319831 10269 -4918 402323 333693
16120 333693 263047 18883 -172140 305331 249115 -232247 372532 199320 244180 174110
16110 174110 12955 33329 190325 414704 88603 93844 -380857 -113379 -49792 177163 296610
16099B96610L6151b09492J855A34139N6473J01660a11902B39848E8246e585A76661
16087B36626b03436D8959M2805J63178J42594h7126E4402L14795j31820G3046
16076a00661B15039a9534A41005B0526J25344C9073K2000d2878k840E4368P873
16065F2241a62817D98347C2633J36683J29066q9819N7907b63207A84315J840D6414
16053G4453d6396A71862N5079P4967j40662a92949C2841f7199A42172k2645K86959
16042D06486j79465O9037r3527R422b65533A38715J0475N3523J0193d5415J6766
16031b8649j5894m8040A25135J64234e1620l5871G9940g2344k38546A28361m1014
16020H7347C4114R6179e407r4057A32055a36825B0384O2238N1974E4983b79903
$$ plain form
16099 296610 332761 -209492 -207637 134139 190612 292272 -111902 239848 58246 -5585 176661
16087 236626 -203436 48959 91764 254942 397536 -87126 54402 369197 237377 73046
16076 -100661 215039 -19534 141005 20526 145870 39073 61073 -42878 -45718 54368 62241
16065 62241 -162817 498347 32633 169316 298382 208563 266470 -263207 184315 186155 46414
16053 74453 -46396 171862 226941 301908 161246 -192949 32841 -67199 142172 119527 406486
16042 406486 227021 296058 202531 211953 -265533 138715 149190 202713 212906 -45415 -28649
16031 -28649 -44543 -92583 125135 289369 -51620 -87491 79940 -72344 -310890 128361 87347
16020 87347 34114 130293 -5407 -99464 132055 -136825 20384 82622 134596 54983 -279903
16008a91437B76547D9983A2311a06178C48427A58356l9182J36211l240c90713
15997a10260B84663p6498A1600J18863J1310P4063a94922B04163i9859A31162
15986F52338J68071L51769J80993m6114n66487m9755l27387b6694C12393a78140
15975B7808M9228c24112B31627A11682N4710B009J00216a20421E0183R0751B0863
15963E784d24083A91860a01464j79145B04502C9296h157A31405J6167c0753A11304
15951a47942n1028a1754D5270c87007a09890B09926b08415b2879j84175c2653
15940F9250b36382A26250j2672c12193A08956H211K14231J13048a8946P080j47472
15929a59338P7484a9553I7700c6830j7897D3163K73758a188A55789k5548a18929
$$ plain form
16008 -191437 276547 49983 12311 -106178 348427 158356 119174 255385 252145 -390713
15997 -110260 284663 208165 11600 130463 141773 215836 -194922 204163 -99859 131162
15986 652338 820409 1172178 1353171 1307057 740570 690815 363428 -26694 312393 -178140
15975 27808 77036 -324112 231627 111682 166392 2009 102225 -120421 50183 140934 20863
15963 5784 -424083 191860 -101464 -280609 204502 39296 -8157 131405 147572 -30753 111304
15951 -147942 -198970 -11754 45270 -387007 -109890 209926 -208415 -22879 -207054 -32653
15940 69250 -236382 126250 113578 -312193 108956 8211 222442 335490 -18946 -11866 -159338
15929 -159338 -81854 -19553 97700 -36830 -54727 43163 316921 -1188 155789 130241 -118929
15917F958a19951I5692b4950j33193A1991J51815a58080O5991j79815a26936B9928
15905H550L38653b3722I3410f0227B47957J56328d64945A30347b2784A83910g7782
15893E5946R4347b41800j2218I221J41129B1069P4586a64982C69440b47312C1417
15881b30441N4708J3389A67329q2128G266K24300c69690A77298K2350c43435A60604
15869c8938j2444C2312d9929j17191A4493K23258b49041A40204a7193F0403a11782
15857f7417B74705A12357O8747a57531A21626N7957L7963J4447j10289c7347C06643
15845f3091j77208B9991b77655C6064K06062b92471C5028b42138m0503P7260A18472
15833b1713A2734f7078o4409j37535j21292H8141e8240F1570c302n49151a14580
$$ plain form
15917 6958 -119951 95692 -24950 -158143 11991 163806 -158080 -92089 -271904 -126936 29928
15905 8550 347203 -23722 93410 -60227 247957 404285 -464945 130347 -22784 183910 -77782
15893 55946 150293 -241800 -254018 9221 150350 21069 95655 -164982 369440 -247312 31417
15881 -230441 -175733 -162344 167329 85201 7266 231566 -369690 177298 199648 -343435 160604
15869 -38938 -51382 32312 -49929 -167120 14493 237751 -249041 140204 -17193 60403 -111782
15857 -67417 274705 112357 181104 -157531 121626 179583 217546 231993 121704 -37347 306643
15845 -63091 -240299 29991 -277655 36064 242126 -292471 35028 -242138 -282641 -205381 118472
15833 -21713 12734 -67078 -131487 -269022 -390314 88141 -58240 61570 -3302 -552453 -114580
15821h8135a6938l08034A42834c27204q8022i9280F4354J2952a10221p0396L5796
15810a44821a5788m03477a63852B06298a55153A94424D3425J14182J38660K39210
15800E35477c24547J47103O2743k35080H1041J30015a0270p0468n1819c9306j92423
15789b31729B59592b27888P2330j77613G550a32645M2145j93321A65481F9790
15778B21076a08376B3148J26923I476a88643f2627j31245E6123J20570A9392R3871
15767A13263g4405j096h355o922r3523k4074F0503e2015B96903c6067B9495J73397
15755B02892l5669b35636L2625B35727a8496H9657J55507b39827c7553l10780
15745c48333A41155L6787C6551i0166A33030g1872a3218C3161b34783A1704J52910
$$ plain form
15821 -88135 -16938 -324972 142834 -327204 -415226 -99280 64354 77306 -110221 -180617 -144821
15810 -144821 -15788 -419265 -163852 206298 -155153 194424 43425 157607 296267 535477
15800 535477 -324547 -177444 -114701 -349781 81041 211056 -10270 -80738 -132557 -39306 -231729
15789 -231729 259592 -227888 -155558 -333171 7550 -132645 -90500 -283821 165481 69790
15778 221076 -108376 23148 150071 9476 -188643 -62627 -193872 56123 176693 19392 113263
15767 113263 -74405 -75501 -8355 -15277 -108800 -132874 60503 -52015 296903 -36067 29495 202892
15755 202892 167223 -235636 -203011 235727 -18496 89657 245164 -239827 -37553 -348333
15745 -348333 141155 177942 36551 -90166 133030 -71872 -13218 33161 -234783 11704 164614
15734A64614a71165l26131b2882A78455D872a45242J585G7674a22552e219E9570
15722a55134b1555B05159c9706C30447i8743j86157G9999b12129A08869O0935
15712A69804a28765B55014J80138b3308j69270P6159M7748A22643B7284c0650
15701a875j5464H601J29263K5255c0408r3765d0473a3453l9607B18182n8644L3607
15689A93145f194A53731G1854A5102J3921N208L6702k3137b3309B75836o0813
15678B15023b9846C3849b43590j60916a42910B00128a25283C7366a50763E0699
15667a74604e7380r2595a550I194K4035a85348C13268A37455l9967d15827J55819
15656b60008a25852A10767c54377h8070P848A16616a10874B0730N3368d4822m1286
$$ plain form
15734 164614 -171165 -497296 -22882 178455 4872 -145242 -143657 77674 -122552 -5219 59570
15722 -155134 -21555 205159 -39706 330447 -98743 -284900 79999 -212129 108869 169804
15712 169804 -128765 255014 435152 -23308 -192578 -116419 -68671 122643 27284 -30650
15701 -1875 -17339 8601 137864 163119 -30408 -124173 -40473 -13453 -53060 218182 159538 193145
15689 193145 -6194 153731 71854 15102 29023 34231 70933 47796 -23309 275836 215023
15678 215023 -29846 33849 -243590 -404506 -142910 200128 -125283 37366 -150763 50699
15667 -174604 -57380 -149975 -1550 9194 33229 -185348 313268 137455 97488 -415827 -260008
15656 -260008 -125852 110767 -354377 -88070 -80222 116616 -110874 20730 74098 -44822 -86108
15645h6108B4361A0962J33399j0500b32435O4271B7375d39527i4969K1746A52623
15633a49747g2886o5734M2608D4867h8283J5932C43418A42573c18727h0195j41467
15622b21662c3396A23998k7015a08413C7150a80446J2014A3057i7897M4623F7944
15610b23545A09744l2394l8488K79753I3732b71657a2107j97922A72862j239J40670
15599C12293b7014C6370l370c51881J46844C13257a34528d7559o2306l9105K6087
15588a22883C60872F1581J69923d3577j52667B14708A04382K65077A67796P3135
15578B40931a36573o2866A87032J34356D0671M7885J0845a66666J7308D0272c78078
15566e6313k3657I4975K21754c0922k42644A35933J773c279B18408B5736b44293
$$ plain form
15645 -86108 24361 10962 144361 133861 -232435 -168164 27375 -439527 -94969 -73223 152623
15633 -149747 -72886 -138620 -96012 44867 -88283 -72351 343418 142573 -318727 -80195 -221662
15622 -221662 -33396 123998 96983 -108413 37150 -180446 -168432 13057 -97897 -53274 67944
15610 -223545 109744 77350 38862 318615 93732 -271657 -12107 -210029 172862 171623 312293
15599 312293 -27014 36370 33000 -351881 -205037 313257 -134528 -47559 -109865 -148970 -122883
15588 -122883 360872 61581 231504 -43577 -196244 214708 104382 369459 167796 240931
15578 240931 -136573 -199439 187032 321388 40671 88556 99401 -166666 -149358 40272 -378078
15566 -56313 -79970 94975 316729 -30922 -273566 135933 137706 -3279 218408 25736 -244293
15554B33858F5176l1776a16330j78466h623C3913a41337j5277J5167B13928a02549
15542C84515b22471G6809l0971J46429B7891a27108A03271M1920D2123a41974
15531A7368b7306A25412j7666A9913K85586a32841C47296c02796D9641O4474N2555
15520A66670E1605L48883j62806q0506l6092K42279A03829K67978I0369J73997
15510B64366I5366m5606J88198A01955K13604e6075A27714J41753d0766A02851
15499B99565e6460K8207j63577I4494a8655A64518j8483f4023r3936H2251C5315
15487C28196D3877K27681b350A62882E9120a07376A39350J35196A14398K72739
15477C87137A71844M0296B5503Q19751j07948j34495k03847O5102j93608o1586
$$ plain form
15554 233858 65176 33400 -116330 -294796 -8623 33913 -141337 -156614 -141447 213928 -102549
15542 384515 -222471 76809 45838 192267 27891 -127108 103271 145191 42123 -141974
15531 17368 -27306 125412 107746 19913 305499 -132841 347296 -302796 49641 114115 166670
15520 166670 51605 400488 237682 157176 121084 363363 103829 371807 90369 264366
15510 264366 95366 49760 237958 101955 315559 -56075 127714 269467 -40766 102851
15499 299565 -56460 -28253 -191830 94494 -18655 164518 146035 -64023 -157959 82251 35315
15487 328196 43877 271558 -2350 162882 59120 -107376 139350 274546 114398 387137
15477 387137 171844 212140 25503 845254 737306 602811 398964 464066 270458 208872
15467B08872m1423a34441A00410l4230k1107L31124j51512q4387m0964J48833
15457B48167a75925N8736B78175A00843a12532A05706E1512L67680A20728J52041
15447B72769j24456N9327J40801j61317K18211L21712K37160N25050n65534l00194
15437F23529B72926j00407q4360J77081C5095b26001A15117b40475k1772G1264
15426B0376a8258r1290d3718n265e974A01273h4595B5030i9369B70276i9A06799
15413a55357A070e1326C6147a34205a0494j08462j48287D3533O2177C9512c24646
15401e07041D15506H0871a14996c6840k0064k2365A86806N3740b63639O4435C08149
15389F8811a20596j80983A32651a45149N1728A2887J81442M1722A8856O9776b25841
$$ plain form
15467 208872 167449 -134441 100410 66180 45073 376197 224685 140298 99334 248167
15457 248167 -175925 -117189 278175 100843 -112532 105706 51512 419192 120728 272769
15447 272769 148313 207640 348441 187124 405335 727047 964207 1489257 923723 623529
15437 623529 272926 172519 88159 265240 35095 -226001 115117 -240475 -262247 71264
15426 20376 -18258 -109548 -43718 -48983 -5974 101273 -84595 25030 -99369 270276 -99 106799
15413 -155357 1070 -51326 36147 -134205 -10494 -118956 -267243 43533 105710 39512 -324646
15401 -507041 415506 80871 -114996 -36840 -56904 -79269 186806 240546 -263639 -199204 308149
15389 68811 -120596 -301579 132651 -145149 -93421 12887 194329 236051 18856 88632 -225841
15377B86628G693K36885O4815j39908K20388j14109l6726K04532k8849A14679
15366C13284A51381a66400b5961h757B8458N07760A47178Q4960C9405K52178A30793
15354C76828j55800F9323a76548B9691K65994j3596J24381b41112D26462A41147
15343E80232B22685J28114F9397L74557A81095R0396i8434C64139o5343Q9176
15333C87972K23230G2725K53114j08772R1730j38825l5428o3203e9819A72182
15322C91599n7593A66904Q688h3413I8802N31178g549B3393L4453J15737b20008
15310c8518n5310M5537C85468j33454a12531j12140C1861i3763H6943C2359K01714
15299B34073J0765j8976r6940c147C15726C1719a98274f4606E7485d8515D7858
$$ plain form
15377 286628 7693 244578 309393 169485 389873 275764 239038 443570 414721 114679
15366 313284 151381 -166400 -25961 -8757 28458 536218 147178 232138 39405 291583 130793
15354 376828 221028 69323 -176548 29691 295685 282089 406470 -241112 426462 141147
15343 580232 222685 350799 69397 443954 181095 271491 -98434 364139 298796 387972
15333 387972 611202 72725 325839 217067 308797 169972 134544 71341 -59819 172182
15322 391599 334006 166904 175592 -83413 98802 629980 -7549 23393 57846 173583 -220008
15310 -38518 -93828 -48291 385468 252014 -112531 -224671 31861 -93763 86943 32359 234073
15299 234073 244838 225862 128922 -3147 315726 31719 -198274 -64606 57485 -48515 47858
15287E6850A7810d9652F5350J26041Q6739m4984d9772B80772a79467A12620C5850
15275b8322I0322J08316j1643a95731Q0395B51191e1426j89170e7416B61182l7878
15264B23304E6394M64971B44845D1938L1439L926M1747m8556K8022f7925m3762
15253a11687A48499n9673a39934A8571O6317L3988R0028o2775L10536Q1634L28882
15242H67181J082110o69463M42752k31838o60668g319G512i5179B79022a25216
15231b86813G3956e03997e9759C32566H5856R8416g4318B08215m4290L39294h5103
15219a61759B99840j06286m9151E3919a80688A75313k8295d3443A03586b32389
15208E14932k49993h3817b9016E7951L49725I8660A3910K65944a9733A33536Q760
$$ plain form
15287 56850 17810 -49652 65350 191391 278130 233146 -49772 280772 -179467 112620 35850
15275 -28322 90322 198638 186995 -195731 -115336 251191 -51426 -240596 -57416 261182 223304
15264 223304 56394 521365 244845 41938 73377 77303 119050 70494 98516 -67925 -111687
15253 -111687 148499 88826 -139934 18571 84888 118876 208904 146129 456665 538299 867181
15242 867181 1949291 1279828 1722580 1490742 830074 -7319 7512 -95179 279022 -125216
15231 -286813 73956 -503997 -59759 332566 85856 184272 -74318 208215 163925 503219 -85103
15219 -161759 299840 193554 144403 53919 -180688 175313 147018 -43443 103586 -232389
15208 514932 264939 -83817 -29016 57951 407676 98660 13910 279854 -19733 133536 142296
15197A42296b7946k02751B41651p1298D7266L10781K02179A35317N8424B2014
15186C16128m4898C1252j2128a4271I5772a13851F7285d7740A44765a8222B80590
15174B58399A16208j8591c45260D66548A6910g9774D7657K52123d5707A49287
15163a41590b4774H2459J8290J46725b43932A36776L4816M7862K362m6604n9283
15152A15929P6849d7430C36070b3821A8328b83406A99200I1304A2308J95640H5586
15140B3324J52450a7572A32461J7786a81033C29348a36902J1313B81995m5041
15130B36954m7979j721q2918R4055a21265A52048c08302A51718Q9374A07779m3439
15119F4340K31811J18448K99898A79704J62388A25024M2144k2777B2735d2766
$$ plain form
15197 142296 -27946 -230697 241651 170353 47266 358047 560226 135317 193741 22014
15186 316128 271230 31252 19124 -14271 95772 -113851 67285 -47740 144765 -18222 280590
15174 258399 116208 97617 -345260 466548 16910 -79774 47657 299780 -45707 149287
15163 -141590 -24774 82459 100749 247474 -243932 136776 171592 219454 221816 175212 115929
15152 115929 192778 -47430 336070 -23821 18328 -283406 199200 91304 12308 207948 85586
15140 23324 175774 -17572 132461 150247 -181033 329348 -136902 -125589 281995 236954
15130 236954 188975 187254 104336 198391 -121265 152048 -308302 151718 241092 107779 64340
15119 64340 296151 414599 714497 179704 342092 125024 167168 144391 22735 -42766
15108C46975J54500H4912K09749f0327E47255a66974A40425O821K8988a8674A15210
15096a4113q8875C05973j13400N7272I6895L1939a66590A90200p0771J01404a78978
15084A18247J3853k6131J10047L4507o3795O0102f7961C59999j08192J16785A06934
15072h1814A64135a40618A33237a8353r288g794D1713K5774K21658o567n7355
15061B25223b8837A80141B8385K33243J88546j69456A39743K05144j21041K06426
15051D30272A29352j4048L2567O92873k53499j24747j15977G6294K04978q8296
15041A92976K41632A03944L00126j21955K0248J09347j14913K82710J91778k83816
15031D87469R0242Q8298P6821j08717p1990j20311R0207O7229k14877J06860R324
$$ plain form
15108 346975 501475 84912 294661 -60327 547255 -166974 140425 147246 176234 -18674 115210
15096 -14113 -102988 305973 192573 249845 96895 128834 -166590 190200 119429 220833 -178978
15084 118247 132100 105969 216016 250523 186728 246830 -67961 359999 251807 368592 106934
15072 -81814 164135 -140618 133237 -18353 -27641 -7794 41713 67487 289145 282578 225223
15061 225223 -28837 180141 28385 261628 450174 280718 139743 344887 223846 430272
15051 430272 129352 115304 147871 840744 587245 462498 346521 76294 281272 192976
15041 192976 434608 103944 404070 282115 302363 411710 296797 579507 771285 487469
15031 487469 577711 666009 742830 634113 562123 441812 532019 599248 384371 491231 500555
15020E00555M8965j03641J5104J29332k34846K93991j71022j7371q6006j23784
15010B51277P0412o2421K00767n6358A53772F7491N7273c7375E84326k6264J16907
14999F74969k25355J37335k62364K613R7683j23627l3125p4365Q7978M33910B77958
14987E41695J20149j5165k59297K4360m5957M06279J55925n8255o2963o1826J7822
14976G62767k20014m9796J1791o2309J11196q9162N27286D80963K02776k74479
14966D09260J29504k62573J65049j20283J53761K64630k48731l5934A69131J55811
14956C24942O960P7205l6183J6364K62494d7472E23350e4334D58053A32112N13514
14945F45626m9325j68525K35570j28387N13779l95194B62906R7898K12203J75184
$$ plain form
15020 500555 549520 445879 460983 590315 355469 649460 478438 461067 375061 251277
15010 251277 321689 259268 460035 403677 153772 67491 124764 -37375 584326 558062 674969
14999 674969 449614 586949 324585 327198 424881 301254 268129 193764 281742 715652 277958
14987 541695 661844 646679 387382 411742 365785 772064 927989 869734 806771 744945 762767
14976 762767 542753 492957 504748 442439 553635 464473 991759 480963 683739 409260
14966 409260 538764 276191 441240 320957 474718 739348 490617 454683 169131 324942
14956 324942 331902 409107 372924 389288 651782 -47472 523350 -54334 458053 132112 645626
14945 645626 596301 427776 663346 534959 1048738 653544 262906 360804 573007 748191
14935G48191j25067j68699j0058j1628K91997K49281K90095K78375l92720L3230
14925A182997M09128O5409K38000k25225k59700J10021J37085K91201M00259j26455
14915B222720O6113j23790q84996K97459k34867n94580k88162A54303J86946k6077
14905C15172o5l3048l8911M20403k85749J84301j05209j5310K33964a78779D99490
14893F63982A70219J11334r1520K08237j01718J11336k9773n149P5484N21324
14883I69774j82256J75757r1489k72135Q5726l7868L11812m26481o6123J71407
14873F38124O6973k47451L00341k79621Q1909J33419m2884N6885K03802k30212
14863F81285K5715O4714j37547K04810l75379k3353K67297k53647O5124j35125
$$ plain form
14935 748191 623124 454425 444367 432739 724736 974017 1264112 1542487 1149767 1182997
14925 1182997 1592125 1657534 1895534 1670309 1410609 1520630 1657715 1948916 2349175 2222720
14915 2222720 2288833 2165043 1280047 1577506 1342639 748059 459897 154303 341249 315172
14905 315172 315107 282059 243148 663551 377802 562103 456894 441584 675548 -178779 499490
14893 663982 170219 281553 190033 398270 296552 407888 378115 372966 448450 969774
14883 969774 787518 963275 871786 599651 685377 647509 959321 532840 466717 638124
14873 638124 705097 457646 757987 478366 560275 693694 650810 707695 911497 681285
14863 681285 707000 771714 634167 838977 463598 440245 707542 453895 519019 383894
14853C83894p1142K52645k82344J79017O9871O7771j92538j80131M35990N58948
14843A221981n2783O3257M412k26118Q8752j82563M4319j00048o6369L620k95766
14832E02694n2784j40272L41492k58047J90645Q3069n894B08460K37151K55047
14822G00658l19732M55492j29211k6905N0124K83693k29881J62912k21145L9101
14812G65106l38140L12200J01119k15331K4778J09596L74068k02904J18741k31719
14802H17514o7358j3912j84347k0772K60521C12221K59718L17306C04810N20441
14792H25251j58856j41535m3184J08391J91801J72946k82953j80709R2616P0084
14782F53852j10670L53387q6696Q1797J55171j46029m8995L42990j60105k59000
$$ plain form
14853 383894 312752 565397 283053 462070 531941 599712 407174 227043 663033 1221981
14843 1221981 1169198 1232455 1236867 1010749 1099501 916938 961257 861209 794840 798460 502694
14832 502694 449910 309638 651130 393083 583728 666797 660903 208460 445611 700658
14822 700658 380926 836418 707207 680302 730426 1014119 784238 947150 726005 765106
14812 765106 426966 739166 840285 624954 649732 759328 1133396 930492 1049233 817514
14802 817514 750156 736244 551897 531125 791646 312221 571939 889245 304810 825251
14792 825251 666395 524860 481676 590067 781868 954814 671861 491152 583768 653852
14782 653852 543182 896569 809873 891670 1046841 900812 851817 1194807 1034702 775702
14772G75702J78355j99179p4203k51746K13168j57374j21983M77631r6298k35361
14762E08712K14523k55494L10798k68577K53545j50924j03692K10397J0419Q9377
14752H19084j6833j00602p8360n1490L27934j60938k31273N5205L5567M3852O5872
14741G08018P3269m6556l3955j64883p101K39361j7776j7684L78444l08885K32064
14730A034316L62406Q4225j98970K80669L53627m8583k19044l40656j30781k98015
14720H79194J63364D68913M24733O1200l00921J62269j18070J05196N5544J50885
14710A009749J25299k78335J59930J25075k13988K068q7766N07886K13482J57028
14700A720428P0744J83608l03278l78728P8435l17032L23205n86221L30214k56030
$$ plain form
14772 775702 954057 754878 680675 428929 642097 484723 362740 840371 744073 508712
14762 508712 723235 467741 778539 509962 763507 612583 508891 719288 729707 819084
14752 819084 802251 701649 623289 571799 899733 738795 507522 562727 598294 642146 708018
14741 708018 781287 734731 700776 535893 528792 768153 750377 732693 1111137 802252 1034316
14730 1034316 1396722 1480947 1281977 1562646 1916273 1867690 1648646 1307990 1177209 879194
14720 879194 1042558 468913 893646 954846 653925 816194 698124 803320 858864 1009749
14710 1009749 1135048 856713 1016643 1141718 927730 929798 842032 1349918 1563400 1720428
14700 1720428 1791172 1974780 1671502 1292774 1371209 1054177 1377382 791161 1121375 865345
14690H65345j20536o1203J54858M534J07634R3781l26026L43347k22844j03948
14680G34942K13485N3092k76144R8546J60385n1420k49493L79377k5485l7842
14670I99443J53682k06380K3905q1900K85190k81102j73087j46552N39873k39266
14660H73806P6306j83793J26689N5171K5949M60163m65581K90601M2021Q8905
14650A390237j32544l19019L16128o7620j60502J58316j75385J09800j08364L70017
14640A381064l42704J95593j9620N8509l09268k50503K39052N46160l14529k16378
14630I67376J63307J92823l52270M11931k84182K9160M11557k27791Q8474K83674
14620A684059j82918j40142J61938P7086l30217K0848Q5763j9662J71155K6226
$$ plain form
14690 865345 744809 683606 838464 842998 950632 1044413 718387 1061734 838890 734942
14680 734942 948427 1001519 725375 823921 984306 932886 683393 1062770 1037285 999443
14670 999443 1153125 946745 970650 888750 1173940 892838 719751 573199 1113072 873806
14660 873806 950112 766319 893008 948179 974128 1434291 968710 1259311 1301332 1390237
14650 1390237 1257693 938674 1254802 1187182 1026680 1184996 1009611 1119411 1011047 1381064
14640 1381064 1038360 1233953 1214333 1272842 963574 713071 952123 1498283 1183754 967376
14630 967376 1130683 1323506 971236 1383167 1098985 1128145 1539702 1311911 1400385 1684059
14620 1684059 1501141 1360999 1522937 1600023 1269806 1290654 1376417 1356755 1527910 1554136
14610A554136J61266m8883n24875p2892Q12574m30924k66969M28565n9570n1273
14600A501155j45593R6476k8500n8338K57754r6121o2173N39491k76005j14309
14590A613837J92486J95292m62659J54330K19869J62618k16707K02094l35248
14581A725912O9709J45354l37982L13727J59181k38205J58J24804n6238P9819
14571A986239Q0072l21011K72139J47169j99661J63453q142M86204K54377l62596
14561B498243Q5464n2156L08512k82701K51828K30620J49371L28672J67394J72590
14551C857837O14131Q31795J275852L776522Q745286K1982362L637457B0042771
14542G880750l822193r59881l50352N46156J883415j220832j470271l98105m12504
$$ plain form
14610 1554136 1715402 1666519 1141644 1068752 1881326 1450402 1183433 1611998 1552428 1501155
14600 1501155 1355562 1452038 1423538 1365200 1622954 1526833 1464660 2004151 1728146 1613837
14590 1613837 1806323 2001615 1538956 1693286 1913155 2075773 1859066 2061160 1725912
14581 1725912 1795621 1940975 1602993 1916720 2075901 1837696 1837854 1962658 1906420 1986239
14571 1986239 2066311 1745300 2017439 2164608 1964947 2128400 2120258 2606462 2860839 2498243
14561 2498243 2583707 2531551 2840063 2557362 2809190 3039810 3189181 3517853 3685247 3857837
14551 3857837 4471968 5303763 6579615 10356137 19101423 41083785 44721242 20042771
14542 7880750 4058557 3098676 2748324 3294480 5177895 3957063 2486792 2088687 1676183
14533A676183L70457p905l93081J24035M51655J50768j77199Q1029m6326K50616
14523B480232k20804K66019k12593K18940j37607K41907k41426k61810L88936
14514B521794M82389m48758J83314j01830M5559l88451M54835m5905m7552J70088
14504B825483J10439L17499k15968k4734K15956k58304J25068K8138q533l945
14494C111099J56611L9089m5088K22810k50970L75792j98043J09056K57738k48625
14484C529469J24048Q7597K30758r8751k38526K81652k19513N33422j99920k59376
14474C770860L38560j62050M02154j91065Q2674M2350J77070r0669j16660L75796
14464D629020J90075k26418L11956j12812M2045n1433J88807J72787L01528k44627
$$ plain form
14533 1676183 2046640 2038735 1645654 1769689 2221344 2372112 2194913 2275942 2229616 2480232
14523 2480232 2259428 2525447 2312854 2531794 2394187 2636094 2394668 2132858 2521794
14514 2521794 3004183 2555425 2738739 2636909 2682468 2294017 2748852 2702947 2655395 2825483
14504 2825483 2935922 3253421 3037453 3012719 3228675 2970371 3095439 3123577 3115044 3111099
14494 3111099 3267710 3306799 3261711 3484521 3233551 3609343 3411300 3520356 3778094 3529469
14484 3529469 3653517 3741114 3971872 3873121 3634595 3916247 3696734 4230156 4030236 3770860
14474 3770860 4109420 3947370 4349524 4158459 4241133 4283483 4460553 4369884 4253224 4629020
14464 4629020 4819095 4592677 4904633 4791821 4833866 4782433 4971240 5144027 5445555 5200928
14454E200928J09281j54262O9374M26270l7734m1591j82847M1944K46296J76359
14444E854018q9449L40304l54399N12304l08242L12809K10092j09859L42245j54070
14434F555753j31999J7825L80877k00287L77854n5806J89702J38452n23215M74090
14424G223246L41479K42756J51819j64321M14292L76811j86392r2222J68284J34175
14414H609927q4008L62344l46669R0757L75112K75249J46714m00358N61686M91895
14404A0082649K39094j28160Q7984O6127j41106J24436K98996M44890K28804J15048
14394A1418762n758K29268K42587K32775K24357J70634j64241N12510N1591L16874
14384A3229359J24175O46252J00395N96928K79825K07286K50717J06113r3332
$$ plain form
14454 5200928 5310209 5155947 5225321 5651591 5613857 5572266 5389419 5431363 5677659 5854018
14444 5854018 5764569 6104873 5750474 6262778 5954536 6267345 6477437 6367578 6709823 6555753
14434 6555753 6423754 6441579 6822456 6622169 7000023 6944217 7133919 7272371 6749156 7223246
14424 7223246 7564725 7807481 7959300 7794979 8209271 8586082 8399690 8307468 8475752 8609927
14414 8609927 8525919 8888263 8541594 8632351 9007463 9282712 9429426 9029068 9590754 10082649
14404 10082649 10321743 10193583 10281567 10347694 10206588 10331024 10630020 11074910 11303714 11418762
14394 11418762 11413004 11642272 11884859 12117634 12341991 12512625 12348384 12860894 12912485 13229359
14384 13229359 13353534 13999786 14100181 14697109 14976934 15184220 15434937 15541050 15447718
14375A5447718K99245M70104L70396K79424N6804M22912P30782K39397P62670
14366A9079452J9731J122409m9169K91629O1019Q54669L09717N63120L37752L81924
14356B2972253P11934L91046R18382P65089L25724N02913Q42212L80832J213574
14347B9023959J90251O84166J290741N85960Q52055P61422J259140O71386J529342
14338C6848422P05693J251974J041807R83879J113486J135234J501567J545049
14330D6127111J724438J369301J541516J441856J901308J884356J793808J745093
14322E9528787K402066K470381K183132K620557K552481K527324K593987L187227
14314H0065942L140526K809830L576314M048018L719525M474848M201953M506365
$$ plain form
14375 15447718 15746963 16217067 16587463 16866887 16923691 17346603 18077385 18316782 19079452
14366 19079452 19099183 20221592 20172423 20464052 20525071 21379740 21689457 22252577 22590329 22972253
14356 22972253 23684187 24075233 24993615 25758704 26084428 26587341 27429553 27810385 29023959
14347 29023959 29214210 29898376 31189117 31775077 32627132 33388554 34647694 35319080 36848422
14338 36848422 37554115 38806089 39847896 40831775 41945261 43080495 44582062 46127111
14330 46127111 47851549 49220850 50762366 52204222 54105530 55989886 57783694 59528787
14322 59528787 61930853 64401234 66584366 69204923 71757404 74284728 76878715 80065942
14314 80065942 83206468 86016298 89592612 93640630 97360155 101835003 106036956 110543321
14306A10543321N334842M987254N511363N833800O367461O325971O958851P877082
14298A59739945O959192Q627332Q657678R296091R811012J0321014J0847479J1269069
14290B35528812J2173156J2639581J3063653J3422817J4161300J4254599J4915815
14283C30159733J4944223J4808642J5089607J4393301J4181674J3466165J2609218
14276D29652563J1285810R581368P775650M704209J357069j532274m157059m085422
14268D54581914m969285m496753p534079j0806095j2949952j4434184j5522178
14261C83869388j5898507j5774270j6119189j6037827j5330372j5165628j4408687
14254B75134908j3798572j3574671j2843851j1960550j1277849j0194267q949891
$$ plain form
14306 110543321 115878163 120865417 126376780 132210580 138578041 144904012 151862863 159739945
14298 159739945 166699137 175326469 183984147 193280238 203091250 213412264 224259743 235528812
14290 235528812 247701968 260341549 273405202 286828019 300989319 315243918 330159733
14283 330159733 345103956 359912598 375002205 389395506 403577180 417043345 429652563
14276 429652563 440938373 450519741 458295391 462999600 464356669 462824395 458667336 454581914
14268 454581914 449612629 445115876 437581797 426775702 413825750 399391566 383869388
14261 383869388 367970881 352196611 336077422 320039595 304709223 289543595 275134908
14254 275134908 261336336 247761665 234917814 222957264 211679415 201485148 192535257
14247A92535257j0008538r257814q313070p631108p348634p315259o575054o237361
14239A29848419n872771m835649n537259n166757m564351m373185m215365l664319
14231I1618763l421528l337695l549867l083749k949054l099079k630798k625957
14223F6921036k386837k186840j987611j929143j610604k195500k174192j467472
14215E0982837j685657j029347j132692j911958j488327j178044j154425j444962
14207C9957425p5695j356738j199112j253196j102968j069281m24881l68456j360641
14198C1746457j061163q78391p11538o78620k16797n79650j223083o36612n07761
14189B5252842n72193m79996p03963l94468m79425m43113p62432k85288m40025
$$ plain form
14247 192535257 182526719 173268905 164955835 157324727 149976093 142660834 136085780 129848419
14239 129848419 123975648 119139999 113602740 108435983 103871632 99498447 95283082 91618763
14231 91618763 88197235 84859540 81309673 78225924 75276870 72177791 69546993 66921036
14223 66921036 64534199 62347359 60359748 58430605 56820001 54624501 52450309 50982837
14215 50982837 49297180 48267833 47135141 45223183 43734856 42556812 41402387 39957425
14207 39957425 39881730 38524992 37325880 36072684 34969716 33900435 33475554 33107098 31746457
14198 31746457 30685294 29806903 29095365 28416745 28199948 27620298 26397215 25760603 25252842
14189 25252842 24680649 24200653 23496690 23102222 22622797 22179684 21417252 21131964 20691939
14180B0691939n73913n68188J2572p82107j65617k62711n29056m34648l07940
14171A7080331j04636l76104l75302o51577K049k39690o8187n96057k50686L8918
14161A4459059n38665j23189j40298l59780l46042j60763j00429k03083k9622
14152A2457188l37028j75609m79694R4805l29148k03291n7797j26287l62109k46846
14142A0234184k22173k63786M83487l73449k97943J9242j50694l99912m1991j46374
14132H840591l06006J10798l80623J43097l63281J51449k04541J05555m35744
14123G661295k25690K8955J80597l69409j73813R129L15942k66042m28323M6879
14113F779520r6332J30336K44693m24464k76553O2550N0374k73065l29377j08975
$$ plain form
14180 20691939 20118026 19549838 19562410 18780303 18614686 18351975 17822919 17388271 17080331
14171 17080331 16975695 16599591 16224289 15572712 15574761 15335071 15266884 14670827 14420141 14459059
14161 14459059 13920394 13797205 13656907 13297127 12951085 12790322 12689893 12486810 12457188
14152 12457188 12120160 11944551 11464857 11559662 11230514 11027223 10969426 10843139 10481030 10234184
14142 10234184 10012011 9748225 10231712 9858263 9560320 9579562 9428868 9028956 8986965 8840591
14132 8840591 8534585 8645383 8264760 8407857 8044576 8196025 7991484 8097039 7661295
14123 7661295 7435605 7464560 7645157 7275748 7101935 7111064 7427006 7160964 6732641 6779520
14113 6779520 6683188 6813524 7058217 6633753 6357200 6419750 6470124 6197059 5867682 5758707
14103E758707J43303l0650j92445K40465l67583k04225J69475J1364J49463l83111
14093E294763l70262K81759j12815J39675n14461M70872l57490j57930K38251
14084D912362l09011k01678J21752j2546j19787k22281L82896m23522p877j50518
14074C969790K82700j81168J07509L8426j46248n6208k2427J00913j46261k8122
14064C918904P343l7202K2755K49177q3947k41455R4533k95173j97084R9794Q9607
14053C627252m4457j55763R1872m09288N42924k01533J17344j73842l7882j57658
14043C198969k00917k5961L29598M4682l59045k622J18201J63413l96781J98271
14033C067808J66346n7645l01729L40043k49210j18388M58513l59579k64385K18725
$$ plain form
14103 5758707 5902010 5871360 5678915 5919380 5551797 5347572 5517047 5528411 5677874 5294763
14093 5294763 4924501 5206260 5093445 5233120 4718659 5189531 4832041 4674111 4912362
14084 4912362 4603351 4401673 4523425 4510879 4391092 4168811 4551707 4128185 4120308 3969790
14074 3969790 4252490 4071322 4178831 4217257 4071009 4014801 3992374 4093287 3947026 3918904
14064 3918904 3926247 3889045 3911800 4160977 4077030 3835575 3930108 3634935 3437851 3537645 3627252
14053 3627252 3582795 3427032 3518904 3109616 3652540 3451007 3568351 3394509 3356627 3198969
14043 3198969 2998052 2972091 3301689 3346371 2987326 2984704 3102905 3266318 2869537 3067808
14033 3067808 3234154 3176509 2874780 3214823 2965613 2847225 3305738 2946159 2681774 2900499
14023B900499l45750O7932r5405m6956l5923p7480K46876k00050j34170K89628
14013B569201m09951O1306N0119n1811M11316m26933M0948j64149P8383j18525
14003B039904J04812K26816k69713Q492L02120m59640K54642n38018M85431J62384
13993B317230l27721J05524Q5142K15272P40683J870704O087861K0552114J5795947
13984D7442756k0486344j3049262n841679k578443j038775m60425n50748l02121
13976C134959k56097q6333n44676M78461j01340j6657l08193j4280j38182n7738
13966B089924M13211n82974L01174k10253M2104Q0932r9942J62362m8485k29407
13956A918646R0769j47965J01355k59472L54636j48171R6889j97931J01836K1290
$$ plain form
14023 2900499 2554749 2622681 2527276 2480320 2444397 2366917 2613793 2413743 2279573 2569201
14013 2569201 2159250 2220556 2270675 2218864 2630180 2203247 2244195 2080046 2158429 2039904
14003 2039904 2144716 2371532 2101819 2110311 2412431 1952791 2207433 1669415 2154846 2317230
13993 2317230 1989509 2095033 2180175 2395447 3136130 5006834 11094695 31646809 47442756
13984 47442756 26956412 13907150 8065471 5487028 4448253 3987828 3437080 3134959
13976 3134959 2878862 2792529 2247853 2726314 2624974 2608317 2300124 2285844 2147662 2089924
13966 2089924 2503135 1920161 2221335 2011082 2053186 2134118 2034176 2196538 2148053 1918646
13956 1918646 2009415 1861450 1962805 1703333 2057969 1909798 2006687 1808756 1910592 1931882
13946A931882j9526j17544J34090j08159k21757P3273p9341j26890J43624l7134
13936A572518J30608K14222m02532J58709j04856o4378J61548m23098J61978K00027
13926A604746j6893j60672j66110M14090k66489O1261o919J7659k25733L75073
13916A630013p3711k80197K26965P565J27287j97199n7875J30469l50529p4394
13906A088394r6910L79690l3909N2199j23989n6314L12513k74460L88813l61516
13896A274511J82142l39106l8296R8333J88780R9057n07429M08708j77122j8355
13886A171223l7294q0167N6459O7693J76655j73366k00960L22436l08374J07532
13876A101837p1575J12114J51021J3773l01250K94205j5665n6804j1278p3436
$$ plain form
13946 1931882 1912356 1794812 1928902 1820743 1598986 1672259 1592918 1466028 1609652 1572518
13936 1572518 1703126 1917348 1514816 1673525 1568669 1504291 1665839 1242741 1404719 1604746
13926 1604746 1587853 1427181 1261071 1675161 1408672 1469933 1463014 1480673 1254940 1630013
13916 1630013 1556302 1276105 1503070 1510635 1637922 1440723 1382848 1513317 1162788 1088394
13906 1088394 991484 1371174 1337265 1389464 1265475 1209161 1521674 1247214 1636027 1274511
13896 1274511 1456653 1117547 1079251 1177584 1366364 1465421 957992 1366700 1189578 1171223
13886 1171223 1133929 1053762 1110221 1177914 1354569 1181203 980243 1302679 994305 1101837
13876 1101837 1030262 1142376 1293397 1307170 1005920 1300125 1284460 1227656 1216378 1142942
13866A142942j65270j35600J87960j41538J72098J20589l06170K76764K29837
13857A381612k26454J01851j20504j53226R1265l3429J1569j57692j11010K62344
13847A046326j21626J19246k09584K14666P5213n3091K46543n03011J86695j54815
13837H46562N2021J7043j49479k1341L2759P7811j46643j4785N02290l90898j28834
13826F76506M84048k56854j7929k9803p6880k1963j40692M76783k87744O3776
13816H69248K7819k86949L18882q6767j33047L46048k9167n8363m57170K04980
13806G15514Q50K97740m67172J59859J16118o2767j31736r7720K32630q4458P1756
13795G50614j82372R6347J93960k72654J04088l10374J28547N33655l90710j27839
$$ plain form
13866 1142942 977672 842072 1030032 888494 1060592 1181181 875011 1151775 1381612
13857 1381612 1155158 1257009 1136505 983279 1074544 1041115 1052684 894992 783982 1046326
13847 1046326 924700 1043946 834362 1049028 1124241 1071150 1317693 814682 1001377 846562
13837 846562 898583 915626 766147 744806 777565 855376 708733 693948 1196238 805340 676506
13826 676506 1160554 903700 885771 855968 779088 757125 616433 1093216 805472 869248
13816 869248 897067 610118 929000 842233 709186 1055234 1026067 967704 510534 715514
13806 715514 716364 1014104 546932 706791 822909 760142 628406 530686 763316 678858 750614
13795 750614 568242 664589 858549 585895 689983 379609 508156 1041811 651101 523262
13785E23262K18092J01568j73061j26208R1975k40071K48014j32963K40861o701
13775G44768k05639M28463k9225k18991J95373j99027j02313K28866k15227j8632
13765F08416Q1032j16775J70188Q6228N2932D30443J69130p4846j45641L63208
13755G42294j7717j33206M17636m79750N5605K2500J13459k08001J85174N1189
13745G49183C34137J51482p6729R7182o8864J00459k5428J40886N6021k6007K06807
13734H89946o6878k66946Q1090o8896k1270K09847k82278j84217J51313J06581
13724E48292j76811K66151k30362L2423J20712m0180L491J65701r2312j01215
13714D95890K14009l10671o1303K7337K597J61061J80548j18492J5662n0207l3828
$$ plain form
13785 523262 741354 842922 669861 543653 635628 395557 643571 510608 751469 744768
13775 744768 539129 967592 938367 719376 914749 715722 613409 842275 627048 608416
13765 608416 689448 572673 742861 829089 882021 430443 599573 524727 379086 742294
13755 742294 724577 591371 1009007 529257 584862 607362 720821 512820 697994 749183
13745 749183 334137 485619 408890 506072 437208 537667 512239 653125 709146 683139 889946
13734 889946 823068 556122 637212 568316 547046 756893 474615 290398 441711 548292
13724 548292 371481 637632 407270 439693 560405 520225 523716 689417 597105 495890
13714 495890 709899 399228 337925 365262 367859 528920 709468 590976 606638 556431 522603
13703E22603J78970k69364j26912J3922m4234J03807K15330B22046K57442J31684
13693F11172B91680Q4352j52186L19410L4369B09409N04385k29400A32587K85618
13683D18205J3919M29473m29563M5124M33A76590Q2523K25367q4466J51586k74130
13672B77470J86254K67029B64785L5853L20092L8421k25116P5501P5799O0232
13662F45567j71419Q0669J41662B61381L57808m0659P7117o3141A62609K85491
13652D48100k06026J14542L19279C29888J25786j63490R8375o6036q5850K93841
13642E32514A46184J12310N9251L05517m7145k62486K55005K7400A06126f599
13631A39724L08152M4203B22436J24745r2001O6228k1563K63204k15102K74644
$$ plain form
13703 522603 701573 432209 305297 319219 274985 378792 594122 222046 479488 611172
13693 611172 291680 376032 223846 543256 577625 209409 713794 484394 132587 418205
13683 418205 432124 861597 432034 477158 477591 176590 259113 484480 400014 551600 277470
13672 277470 463724 730753 264785 300638 620730 659151 434035 509536 585335 645567
13662 645567 474148 554817 696479 261381 619189 578530 655647 592506 162609 448100
13652 448100 242074 356616 675895 329888 455674 292184 390559 324523 238673 532514
13642 532514 146184 258494 317745 623262 576117 313631 568636 596036 106126 -6599
13631 139724 447876 492079 222436 347181 255180 321408 299845 563049 347947 622591
13621F22591k05039K7529J00622r9238o0484j45467l6384P3002k1298K62666J603
13610E20103M4809I2785a42920A55459K76916A27338J65516j34605K90816A70343
13599E18735j49167m197l3874l3016A00793K03582q92p3773J90533J40539B63038
13587A75475J44916k9201J64436A75369J90584j42698J52594A70514d2180D17670
13576E06332k44253M8025K05995B27973p7412J77008e3994D03646M0111j43593
13566C00164K07241A30051P6894K23060A85902K59461j04252K6082A69845J08165
13556B78010j20580l1309L31974c2634I1558J59537I7554K60366M5118J19523
13546E22561A38582J77264j32459G1893K99280m0439r3652K8491f9203B97881
$$ plain form
13621 622591 417552 445081 545703 446465 385981 240514 204130 277132 255834 518500 520103
13610 520103 564912 92785 -142920 155459 432375 127338 292854 158249 449065 170343
13599 518735 369568 365371 331497 298481 100793 304375 303483 229710 420243 560782 263038
13587 175475 320391 291190 455626 175369 365953 223255 375849 170514 -42180 417670
13576 506332 262079 310104 516099 227973 150561 327569 -53994 403646 443757 300164
13566 300164 507405 130051 206945 430005 185902 445363 341111 367193 169845 278010
13556 278010 157430 126121 458095 -32634 91558 251095 97554 357920 403038 522561
13546 522561 138582 315846 183387 71893 371173 330734 237082 265573 -69203 297881
13535E12409n6347k1063a11393G9250J11521J66257A12585J52009M5531M9601
13525C59726j43826L25453B22797M4193j805L74380C12175n5141L4519M7948q9467
13514B50034C6513A3305K99855P7039J40247h6620C3308R2377L32120A78453i161
13502D36309j77157J08729j28917K5925C0529K48860D0650M2118L08571A64199
13491C457K03617f1880A25828O6825D3428J51305J56828M6941j08355r5861J15137
13480C09423C5235M24807A30613a73280A86403n9152m4571C4044K73044L7382
13470C44470p8971a13279C90510g954D79490b72G9290e3622B44709R2708j7893
13459C19524j29437g5978A04481J97465J82654E177Q7053Q4540L95169j41689
$$ plain form
13535 512409 456062 434999 -111393 79250 190771 357028 112585 264594 310125 359726
13525 359726 215900 541353 222797 266990 265185 639565 312175 257034 291553 339501 250034
13514 250034 36513 13305 313160 390199 530446 -86620 33308 125685 457805 178453 -9161
13502 436309 259152 367881 238964 264889 30529 279389 40650 82768 391339 164199
13491 3457 207074 -61880 125828 192653 43428 194733 351561 398502 290147 194286 309423
13480 309423 35235 460042 130613 -173280 186403 127251 82680 34044 307088 344470
13470 344470 265499 -113279 390510 -7954 479490 -272 79290 -53622 244709 337417 319524
13459 319524 190087 -75978 104481 301946 484600 5177 92230 176770 571939 430250
13449D30250J49082A67859J9856k2506N8987R5292J01970j17584b2645B0738b3253
13437B60805j28289J66664J88160k36781K9344K15778B39346L21893A83807Q9987
13427B73794C4627R1695q207J19370g4014E27334C6363g0979E2139J71938J56993
13416C81070a43883f7704A88300J39792a5300B17239N3460b07968C75543H7962
13405E6387a59802B82207p2550N1124C4493d5965D72944H6531c5106D3380N7315
13394A00695J06507K3879J40646j48375j07421b40j02152C60253f4328B37029
13383C23421j50164o0020b06539H1104a00927H3040a16054B74157J5812A9939
13372C77666c4694B68380j14467M0742q3258l5665K57319o7496R269A03260k6583
$$ plain form
13449 430250 579332 167859 187715 165209 224196 319488 421458 303874 -22645 20738 -23253
13437 260805 132516 299180 487340 250559 279903 495681 239346 561239 183807 273794
13427 273794 34627 126322 118115 237485 -74014 527334 36363 -70979 52139 224077 381070
13416 381070 -143883 -67704 188300 328092 -15300 217239 270699 -207968 375543 87962
13405 56387 -159802 282207 209657 260781 34493 -45965 472944 86531 -35106 43380 100695
13394 100695 207202 231081 371727 223352 115931 -240 -102392 360253 -64328 237029
13383 323421 173257 113237 -206539 81104 -100927 83040 -116054 274157 289969 19939
13372 377666 -34694 268380 153913 194655 111397 75732 333051 265555 274824 103260 76677
13361G6677K93104m5386n542h0894H2851K44208k4836H0490i7A63748J20608I7159
13348B45952r3176J00756J63152A60469J38494I5589K23324l0463K26420j9490
13338D95380E3145L82033O4349B44324J82200j48508L7096c9506B81430F5108
13327D8436N461K32669j22260J09999j29259C4462a26563D44519A92542p1494
13317A21048a58940C18273P1900j60361Q8380N5227k4016D3050c866D52257j12485
13306C39772j07164a31532d3731o8052B23011I3998J39997j01840J31367K30996
13296D94518j50379a25911D25321g129j9982A34465K57995p7917j30224C7636
13285G997K91979l9695a7371q3377C28453A04053K49462r312c3997D1863J34724
$$ plain form
13361 76677 369781 324395 318853 -80894 82851 327059 302223 80490 -97 163748 284356 97159
13348 245952 152776 253532 416684 160469 298963 95589 318913 288450 514870 495380
13338 495380 53145 435178 499527 244324 426524 278016 315112 -39506 281430 65108
13327 48436 53897 286566 164306 274305 145046 34462 -126563 444519 192542 121048
13317 121048 -158940 318273 390173 229812 318192 373419 349403 43050 -3866 452257 339772
13306 339772 232608 -131532 -43731 -111783 223011 93998 233995 132155 263522 494518
13296 494518 344139 -125911 425321 -7129 -27111 134465 392460 314543 184319 37636
13285 7997 299976 260281 -17371 -100748 328453 104053 353515 344203 -33997 41863 176587
13274A76587c64350C34712k0201b15977D72643G2042J12096q7671M8569L6409
13264A81445l2381n7173a53683n0702F44L3528J4306O3954l005J2306K73533A66041
13251A89681G0271a8602B85646a13977A51277o8113a5023A62291n911a81928A46624
13239A71892b1413D01348A83005e2325E38500C0477R4911E6549K19680M9734C0419
13227D0583a24841b1652p225A35602l2023G85L1644a45046E9144K65397h2771
13215a59603A02358d1482A04939K1663k3800b90784A61044Q5398p9154O2925o4471
13204A65742a7858A14494D9469a31602l2667r4816D02004A68804B7573R991K3609
13193F1173J71231F6839R0620a7295A68055B1697O7367j3793M388J673d6888E43948
$$ plain form
13274 176587 -364350 334712 314511 -215977 472643 72042 184138 96467 145036 181445
13264 181445 149064 91891 -153683 -204385 644 34172 48478 112432 109427 121733 395266 166041
13251 189681 70271 -18602 285646 -113977 151277 83164 -15023 162291 156380 -181928 146624
13239 171892 -21413 401348 183005 -52325 538500 30477 125388 56549 276229 325963 30419
13227 40583 -124841 -21652 -28877 135602 103579 785 32429 -145046 59144 324541 -82771
13215 -159603 102358 -41482 104939 126602 102802 -290784 161044 246442 167288 230213 165742
13204 165742 -17858 114494 49469 -131602 -164269 -259085 402004 168804 27573 37564 61173
13193 61173 232404 66839 157459 -17295 168055 21697 89064 75271 79659 81332 -46888 543948
13180A09997c76980A03333i790A86625a1995H3213a2604B13564J7902o6792K3086
13169A87760H5649C1893K6808j7986J52991d8243g309r8269A20177B5179a61476
13157a7530F7476K42133j30732a95547O0106C3055A258L18918a48213B22981A04731
13145E26588a10694A34157c1213F9448B8265J34900q862b58328b561D30244C9735
13133d4033H2406f442B1612a70753H4433e0995j80871Q0994B93621a9070j34267
13122a53337E25459d14443a6292n3194K5921j03204H4307J88026j32550a61717
13111h544A11628K42562f6945H4716J36654H9871a6121C42587e5896p0896A05946
13099b63355E30056k38577J1787A42874i5212F9005A6998b98356A15304A6092
$$ plain form
13180 109997 -376980 103333 -9790 186625 -11995 83213 -12604 213564 231466 164674 187760
13169 187760 85649 31893 58701 40715 193706 -48243 -7309 -105578 120177 25179 -161476
13157 -17530 67476 309609 178877 -195547 -135441 33055 1258 320176 -148213 222981 104731
13145 526588 -110694 134157 -31213 69448 28265 163165 154303 -258328 -2561 430244 39735
13133 -44033 82406 -6442 21612 -170753 84433 -50995 -231866 -150872 293621 -19070 -153337
13122 -153337 525459 -414443 -16292 -69486 -43565 -146769 84307 272333 139783 -161717
13111 -8544 111628 354190 -66945 84716 221370 89871 -16121 342587 -55896 -126792 105946
13099 -263355 530056 291479 303266 142874 -95212 69005 16998 -298356 115304 16092
13088A26626b66285B00069b35527b4733m0291B67825b65321i1868B54653O0666
13078C15319L7065A7928g2582B84027A38422d546A60562f9224B6401a40994A75006
13066C25559a40102B14595C613J50020J95880A23100a62807K6628A39254f175
13055B22656e3766D73766f4627A93728D6160J39533K91340f6822n9198B27710
13044G9613J97962F1641M8211D6103J2807A4178K3538K4020A9859K58007A2113
13032A23795a8299A42648b12950G0415c31168F6997J43755f3111B3356d8792A73610
13020c4904C8211K70815g1932c1484j18339a7548A23994h3399C3329a6671l4762
13009e1433C9074J6079K16101j23317o7063K9248J00540c13758A5158J1942J87955
$$ plain form
13088 126626 -266285 200069 -235527 -24733 -65024 267825 -265321 -91868 254653 315319
13078 315319 352384 17928 -72582 284027 138422 -4546 160562 -69224 26401 -140994 175006
13066 325559 -140102 214595 3613 153633 349513 123100 -162807 -136179 139254 -6175
13055 222656 -53766 473766 -64627 193728 46160 185693 477033 -66822 -126020 227710
13044 79613 277575 61641 109852 46103 58910 14178 37716 61736 19859 277866 12113
13032 123795 -18299 142648 -212950 70415 -331168 66997 210752 -63111 23356 -48792 173610
13020 -34904 38211 309026 -71932 -31484 -149823 -17548 123994 -83399 33329 -16671 -51433
13009 -51433 39074 55153 271254 147937 80874 110122 210662 -313758 15158 27100 215055
12998B15055G3472M3950J23310b6003q2314K7962B24617f231B45359r0800C5821
12986A33057k3928i9934A80752L5209Q9488c3825A48480J33103c34402A2927J72336
12975A85263a74849B3736a04530A433L4930A1262L78003A57971R0540b15892g3702
12963C0208a57549A60793o3334f0041A35717i2727J657k166C9552i2052E8567
12951G3584a55711K131E8339b6007A55141F1992A3363f4194C36413a78256E4621
12939a7750A69558p9931l3681g1304r3239k2811j59567N7100c7794A53684a18234
12927B87087q2172j8436D7028Q7938J22061I9995d525l04551C14847c14805A04916
12915g7093k17308b3082j1057C1884a35361k2239E5609Q6449b259C85320G7842
$$ plain form
12998 215055 73472 117422 240732 -26003 -108317 -80355 224617 -6231 245359 154559 35821
12986 133057 109129 -99934 180752 215961 305449 -33825 148480 281583 -334402 12927 185263
12975 185263 -174849 23736 -104530 1433 36363 11262 389265 157971 248511 -215892 -73702
12963 30208 -157549 160793 97459 -60041 135717 -92727 -91070 -93236 39552 -92052 58567
12951 73584 -155711 -153580 58339 -26007 155141 61992 13363 -64194 336413 -178256 54621
12939 -17750 169558 89627 55946 -71304 -164543 -187354 -346921 -289821 -37794 153684 -118234
12927 287087 204915 186479 47028 134966 257027 99995 -4525 -309076 314847 -314805 104916
12915 -77093 -294401 -23082 -34139 31884 -135361 -157600 55609 142058 -2259 385320 77842
12903F50g8956j4652A51976c52584d9889D3042K37873A14973b35586B77500f5331
12891b48879K7777A88924b67661P1170H0590d51100A34202D5306A3290L00474
12881C13764b7308g297j41923I2667b41058J4392N9522D9563M3910a85950F5127
12869G0719K7208J25664q1359o2691b0429C2166j1188a1348B37536c40310d8814
12857E1407b70012i1445j71858D4011a66650B1441J11875j3031B0249J22381E4005
12845A01756L10249a79620e1048A06230k8702b27458g1920A21469J02284a03128
12834i5909G8236b32800a6368A43605c0922p9203e449l3713k10242n8285d2007
12822G078a4756n6561o4385H005a03597j3529D75608o2132A44604j5767J06831
$$ plain form
12903 650 -78956 -93608 151976 -352584 -49889 43042 280915 114973 -235586 277500 -65331
12891 -248879 -221102 188924 -267661 -196491 80590 -451100 134202 45306 13290 313764
12881 313764 -27308 -7297 -149220 92667 -241058 -226666 -167144 49563 93473 -185950 65127
12869 70719 97927 223591 142232 79541 -20429 32166 20978 -11348 237536 -340310 -48814
12857 51407 -270012 -91445 -263303 44011 -166650 21441 133316 120285 20249 142630 54005
12845 101756 412005 -179620 -51048 106230 77528 -227458 -71920 121469 223753 -103128
12834 -95909 78236 -232800 -16368 143605 -30922 -110125 -5449 -39162 -249404 -307689 -42007
12822 7078 -14756 -71317 -135702 8005 -103597 -117126 475608 413476 144604 128837 235668
12811B35668A0864L54684a41337E7345k7752a18241L7206A1365N8246a11609B80986
12799a41955h973a715B09714k345a6177o9349C8749b33947G3397a6465k21559
12788b38024B33954h3018K4157l5044o2796j71564A80296D3490a52572B45909
12777b80399b0078l54953J02007d8986j32m3127C0599a64394A07276g3638j89084
12766b62722b629l8093B648a10005K7803j19274j07376A24868b92594e9302I6973
12754a32370j36973A40081c2093H2208a40832B7312a83598P7999A31036m0049
12744I0987O6483K64752g1681H4931H103K28335J16618I0307h4962C9311L168
12733D2479c16566B89369a39995j10473B01822I8907m6854Q107K42225b10358
$$ plain form
12811 235668 10864 365548 -141337 57345 29593 -118241 -81035 11365 69611 -111609 280986
12799 -141955 -8973 -1715 209714 207369 -16177 -85526 38749 -233947 73397 -16465 -238024
12788 -238024 233954 -83018 -58861 -93905 -156701 -328265 180296 43490 -152572 245909
12777 -280399 -20078 -375031 -273024 -48986 -49118 -92245 30599 -164394 107276 -73638 -262722
12766 -262722 -2629 -40722 2648 -110005 -82202 -201476 -308852 124868 -292594 -59302 96973
12754 -132370 -269343 140081 -32093 82208 -140832 27312 -183598 -105599 131036 90987
12744 90987 157470 422222 -71681 84931 8103 236438 353056 90307 -84962 39311 42479
12733 42479 -316566 289369 -139995 -250468 201822 98907 52053 60160 302385 -210358
12722a88916j9723D6756b2407A52979g2717A57932f2414m8651A63600O0286m0418
12711A83468B9003L5950e3792A10605M7433K58092A66633p3177h9958B18515j4842
12700B03673F6025b44007I6379l3048c45352A94207c03794A69279Q2045b17739
12689A77249o8652a94701j81162c7712C74057A58078n9606B4353J39600J36507
12679C00460G6667J61215A02561b5698a1749C1199b26459H9153C8283O9026b3281
12667D6159K12491a56842A10238A3913b33613B17766A8534g2413j29550G0827
12656A05900e745G0838J71223a2019F3775K68391A16044a61265H4803J90393b9381
12644f498B56762q6013b09993f4208m2355d1787k342B36694b10627D83778b84075
$$ plain form
12722 -188916 -208639 46756 -22407 152979 -72717 157932 -62414 -111065 163600 223886 183468
12711 183468 29003 64953 -53792 110605 158038 416130 166633 93456 -89958 218515 203673
12700 203673 66025 -244007 96379 63331 -345352 194207 -303794 169279 251324 -217739
12689 177249 108597 -194701 -375863 -37712 374057 158078 98472 24353 163953 300460
12679 300460 76667 237882 102561 -25698 -11749 31199 -226459 89153 38283 107309 -23281
12667 46159 258650 -156842 110238 13913 -233613 217766 18534 -72413 -201963 70827
12656 105900 -5745 70838 242061 -12019 63775 332166 116044 -161265 84803 275196 -29381
12644 -6498 256762 170749 -209993 -64208 -106563 -41787 -44129 236694 -210627 483778 -284075
12632A81351O08769A12236K58016G6492c519G0853J68015j1939p9968K18053b08463
12620A26762O0000A9039M94899c64780J46654Q5057A02235b0212A31434b16368
12609a65831j13314a00109B33748r5189L9677b09356C0219L71205j44063h5287
12598a07822c1314D7334O0341J49293b3471j5009B3720c3806C7823J19187D282
12586C3747a8389N529j29713d8942m54095a09484j52709A9301O8882b93529g7013
12574E4642M7880b81894H6781b50141P3428B67210c8832j08695C06231A19864
12563D16880A39566b51500A71531a43127F5140M0359a58328C43978j53268G7625
12552B6326i9177j67024J12792l1842A47312c994l6401k55239L7403k8531B30721
$$ plain form
12632 181351 790120 112236 370252 76492 -3519 70853 238868 226929 146961 365014 -208463
12620 126762 186762 19039 513938 -364780 -218126 -133069 102235 -20212 131434 -216368
12609 -165831 -279145 -100109 233748 138559 178236 -209356 30219 401424 257361 -85287
12598 -107822 -31314 47334 107675 256968 -23471 -38480 23720 -33806 37823 157010 4282
12586 33747 -18389 -12860 -142573 -48942 -503037 -109484 -262193 19301 88183 -293529 -77013
12574 54642 102522 -281894 86781 -250141 -176713 267210 -38832 -147527 306231 119864
12563 416880 139566 -251500 171531 -143127 65140 105499 -158328 343978 190710 77625
12552 26326 -99177 -266201 -153409 -185251 147312 -3994 -40395 -295634 -258231 -286762 230721
12540C1609a30742o2089h4604C53965I9128m2445J82490F7098c22660a60463g0264
12528c1848j38955n1352A68065f1350j24687A6381i3351k2250C125a22084r0381
12517b12465b490A79715a73376m1386A63421J43718o6910E3064j1355N0256d7297
12505A29937a6751C6081q119J15539a29619A14372B505h4979B9126R6361a41964
12493a8768j36649B01877e2944j17208e6611A30093J36622c855A20066m7045b75116
12481a97804C24319B0926J88462R0167A26227J44314a18597A08655m4304a09051
12470g777A21208M0587P967a40213q0288n0388A49889a53371j60710c835k09558
12459b13393B85003i1420q3004Q6149j35666F875b75721C84115H4749C8084a31955
$$ plain form
12540 31609 -130742 -192831 -84604 353965 99128 56683 239173 67098 -322660 -160463 -70264
12528 -31848 -170803 -222155 168065 -61350 -186037 16381 -93351 -115601 3125 -122084 -212465
12517 -212465 -2490 179715 -173376 -214762 163421 307139 240229 53064 41709 91965 -47297
12505 129937 -16751 36081 27962 143501 -129619 114372 2505 -84979 29126 125487 -141964
12493 -18768 -155417 201877 -52944 -170152 -56611 130093 266715 -3855 120066 73021 -275116
12481 -197804 324319 20926 209388 299555 126227 270541 -118597 108655 64351 -109051
12470 -7777 121208 161795 169762 -140213 -220501 -270889 149889 -153371 -314081 -3835 -213393
12459 -213393 285003 -91420 -174424 -88275 -223941 6875 -275721 384115 84749 38084 -131955
12447b54797N3391B54694b81726I3130D5984d2127q6495B18475a52117m9086p9644
12436b80847A45099a83762e2949D8301b90193I6068Q6420c7693J3689C65501c3792
12424a89655d2563G4647a47281F3035K05787B8323P3290a7096l66947G419a43754
12412A98039a17239n0650q2591A27302m4045a319j2442r4717A62590J7141f7780
12400a32247C7199a44376A10070h3891c174B25437f9381L1372k9993c556A12573
12388C8725a8434j99075B66333C6275K55391j42989F4240e3484j9390A73993a11570
12376D66174B00783E5000Q5796i4474K9279A79525c9583A24462f9247B051O1872
12365F3923i4994k80297J82595a9876f861A26492J21763e8018k2912B15913b61684
$$ plain form
12447 -254797 -201406 254694 -281726 93130 45984 -42127 -128622 218475 -152117 -201203 -280847
12436 -280847 145099 -183762 -52949 48301 -290193 96068 182488 -37693 -24004 365501 -33792
12424 -189655 -42563 74647 -147281 63035 268822 28323 101613 -17096 -384043 7419 -143754
12412 198039 -117239 -167889 -250480 127302 83257 -1319 -13761 -108478 162590 179731 -67780
12400 -132247 37199 -144376 110070 -83891 -3174 225437 -69381 -38009 -68002 -3556 112573
12388 38725 -18434 -217509 266333 36275 291666 148677 64240 -53484 -72874 173993 -111570
12376 466174 200783 55000 140796 -94474 -65195 179525 -39583 124462 -69247 2051 63923
12365 63923 -94994 -375291 -192696 -19876 -6861 126492 248255 -58018 -80930 215913 -261684
12353c45729a03042I8822J47547a18807c8988l160j5457l7340j6406b2243A71110
12341a35635d7325A66148K40538d31855A54814J0999D0410g999C37411r4495J9840
12330B62756k9957p3756c0138C92225G0754i3181A35061E7326e9283B1541Q6094
12319A07635i5364B57407G5196i2503C39754C8188Q9661a9B00112b9933j71544
12308b01477C33687b06526C47628d3228I365K04727J03255A49359j2365R6418
12298B33412A00120B9711E51b38909D3879J4031j5518a25785A25339d559q2742
12287h7301B24594h6089A45150J62168L384k9627j03528H2867b82754C72683j11930
12276B60753g9104B12226q920C9793K17009A460K9416R9932b03148I9160d5934
$$ plain form
12353 -345729 -103042 98822 246369 -118807 -38988 -42148 -57605 -94945 -111351 -22243 171110
12341 -135635 -47325 166148 406686 -431855 154814 165813 40410 -7999 337411 242916 262756
12330 262756 232799 159043 -30138 392225 70754 -93181 135061 57326 -59283 21541 107635
12319 107635 -95364 257407 75196 -92503 339754 38188 127849 -19 200112 -29933 -201477
12308 -201477 333687 -206526 347628 -43228 9365 214092 317347 149359 136994 233412
12298 233412 100120 29711 551 -238909 43879 57910 42392 -125785 125339 -4559 -87301
12287 -87301 224594 -86089 145150 307318 310702 281075 177547 82867 -282754 372683 260753
12276 260753 -79104 212226 203306 39793 256802 1460 30876 130808 -203148 99160 -45934
12264F8204j5393J22153g2871C00668e2207B13178a73695B34731p5941a7697j08466
12253a26163D612J84103C3952L2498K72839j04526f9519G029J87304k0524C6617
12241e3309k28830A71583m46k5849L2013G6165A213a1434I198J11026c5612k33208
12229b68820f8031D6035J69093R4990j32239J65871A38390C6311J20795J62479
12219C19585L69655a1343d291A73295m4572M39872j35101H2394K67519j71798
12209A78115G7986O5140n2320J29452C5036a62840B96973A03074L0098J81340
12199C14512M2004I5443L03143j93973J11953q5718J24248A30403a9590A32898
12188E8394N24896p8017I0435a13611B63586J61000A13355R5722C4130J08459
$$ plain form
12264 68204 52811 174964 -72871 300668 -52207 213178 -173695 234731 158790 -17697 -126163
12253 -126163 4612 188715 33952 66450 339289 234763 -69519 7029 194333 173809 36617
12241 -53309 -282139 171583 171137 145288 177301 76165 1213 -11434 9198 120224 -35612 -268820
12229 -268820 -68031 46035 215128 310118 177879 343750 138390 36311 157106 319585
12219 319585 689240 -11343 -4291 173295 128723 568595 433494 82394 349913 178115
12209 178115 77986 143126 90806 220258 35036 -162840 296973 103074 133172 314512
12199 314512 356516 95443 398586 204613 316566 230848 355096 130403 -19590 132898
12188 58394 583290 505273 90435 -113611 263586 424586 113355 209077 34130 142589
12178A42589n7703J10587M7630I1068J19318a33524J4165E96893A64159P7115
12168B41274N0816J31325A41593K0450M1288P4817K45601k33851A27463b1477
12157b20390B45691h7870A42382a60196F673K74948i8586b898A15554n3900J63799
12146B25453o0165A1043J63378M6961B5389J89504J8267e6763A07619m652J07930
12135B10897r2171L18046g6666A68981A4047M1155J76325Q8446f0921C10262J87433
12124D97695E2240J58747I4779B4023K38665J70585b6058B5197K33982D8437P5407
12113A23844J08699D0010J47586m4132n5496K6657Q9481b38667A57426a0612m33829
12102d44441C15064a78295h0602B69641I0790J70665j18224M24548a33650j41881
$$ plain form
12178 142589 84886 195473 243103 91068 210386 -133524 -119359 596893 164159 241274
12168 241274 292090 423415 141593 162043 203331 278148 523749 289898 127463 -21477
12157 -220390 245691 -87870 142382 -160196 6673 281621 -98586 -2898 115554 61654 225453
12146 225453 165288 11043 174421 221382 25389 214893 233160 -56763 107619 102967 210897
12135 210897 118726 436772 -76666 168981 14047 55202 231527 319973 -60921 310262 497695
12124 497695 52240 210987 94779 24023 262688 433273 -26058 25197 259179 48437 123844
12113 123844 232543 40010 187596 143464 87968 114625 204106 -238667 157426 -10612 -444441
12102 -444441 315064 -178295 -80602 269641 90790 261455 143231 567779 -133650 -275531
12092b75531A55343J09332j00966K64307b64524F3446a10719B2839J38326a86236
12081B40600I8962K42576c7879A8116J02816a60432a1891C15937h0166A65977
12070h9900A62612M5127I0209j9191B5196d1917B66921c21294f4760A05963n2745
12059E3218F12a00701B77111C1528d235o2873B23374F2582D719M2204b2537r8638
12047a21175A66858m1148K0412c6156A04684b313o7901H9278b69235a26680l8090
12036a64770a3349k5950j2885B27591A00180K05218f5266B61493a07716E6121
12025A10843a20672o9749j04957B93712f5658C02121H5560P8985K1559a25734
12014H4441c18534B33911I8511l1102K39182H0555a9825A10799a03358C08324
$$ plain form
12092 -275531 155343 264675 163709 428016 -264524 63446 -110719 22839 161165 -186236
12081 240600 98962 341538 -37879 18116 120932 -160432 -11891 315937 -80166 165977
12070 -89900 162612 207739 90209 71018 25196 -41917 266921 -321294 -64760 105963 53218
12059 53218 612 -100701 277111 31528 -4235 -67108 223374 62582 4719 46923 -22537 -121175
12047 -121175 166858 125710 146122 -36156 104684 -2313 -70214 89278 -269235 -126680 -164770
12036 -164770 -13349 -39299 -52184 227591 100180 305398 -65266 261493 -107716 56121
12025 110843 -120672 -190421 -295378 293712 -65658 302121 85560 164545 186104 -125734
12014 84441 -318534 233911 98511 67409 306591 80555 -19825 110799 -103358 308324
12003C52450A50351C1258K65721b92172J26030C5263a06485c0746C9971a97344
11992e9186j09438k6456B26704H4631C9807a09438A36078c07253g0026l40675
11982d10701B71108a24158e0261B36411i3240A14282c43917C08507a59158e5079
11971b6198k42215A08692K26572d6587k12480K2430N9380A18889B3996h2689l9343
11960a22032k675m4741A44098E9828M4393q561b72E517i6938k14514J07839H6485
11947a25424r4868e5825j16731B36920H6709M281J7034d1327l153A16384k7506
11936H8878k946L5774a00485b3743F91b27605f0225j88463f9596k05541a17204
11924f4754a9468C4811c12517A07511L9992f3303j52061b0466I9564C1782b28788
$$ plain form
12003 352450 150351 31258 296979 -292172 -166142 35263 -106485 -30746 39971 -197344
11992 -59186 -168624 -195080 226704 84631 39807 -109438 136078 -307253 -70026 -410701
11982 -410701 271108 -124158 -50261 236411 -93240 114282 -343917 308507 -159158 -55079
11971 -26198 -268413 108692 335264 -46587 -259067 -236637 -177257 118889 23996 -82689 -122032
11960 -122032 -124707 -169448 144098 59828 104221 95660 -272 5517 -96938 -311452 -203613 86485
11947 -125424 -220292 -55825 -172556 236920 86709 90990 108024 -41327 -44480 116384 88878
11936 88878 85932 121706 -100485 -23743 691 -227605 -60225 -248688 -69596 -275137 -117204
11924 -64754 -19468 34811 -312517 107511 147503 -63303 -215364 -20466 99564 31782 -228788
11912E2255l680R642a41494j9467B13214i9317l8581D9160J09505a92411F06K08651
11900B09257E9091i5509j30244k1047E2014a40763b272j88915G7978L0713c6534
11888c85040d713l18996H1155b9255j72406F9596f4712B31555F256M2272J30723
11877A79251H5156a55147O3292j9308B496J86981r3925c15538c3344D9853d1023
11865H8607m3589b66179E0a06120q8193R3895M5465C2264f8686k5092k2645o6101
11853a82524I6913d12812J94318a2930k40752K3000b2960D6301a97421A56955
11842A17410b31627E263K2133b41451f3991n5088F8065K30632C8624c36873e8048
11830A06886a47187K7770G1054P7717e7344p0703A1843b8207F6195n866B815P4590
$$ plain form
11912 52255 48575 58217 -141494 -160961 213214 -99317 -137898 49160 158665 -192411 606 209257
11900 209257 59091 -95509 -225753 -246800 52014 -140763 -2272 -191187 77978 108691 -36534
11888 -385040 -4713 -323709 81155 -29255 -201661 69596 -64712 231555 6256 48528 179251
11877 179251 85156 -155147 -91855 -111163 2496 189477 95552 -315538 -33344 49853 -41023
11865 88607 45018 -266179 50 -106120 -194313 -100418 -54953 32264 -68686 -93778 -116423 -182524
11853 -182524 96913 -412812 -218494 -12930 -253682 -230682 -22960 46301 -197421 156955
11842 117410 -231627 5263 27396 -241451 -63991 -119079 68065 298697 38624 -336873 -58048
11830 106886 -147187 -119417 71054 148771 -57344 -128047 11843 -28207 66195 60329 2815 77405
11818G7405g0937k43746m5001L09b2150L523A1016K61279b19683A3575b20587
11806G7480b86608H3803G92a0395j9597A22268h4479n9035b3583j47418A11989
11794A63219c95650J12181i5827o7333L7432e8834j60547A73441b3425A40437
11783C90509L0819G2497b60710c6696q5540A9294a66990a3259F3158a82093f6182
11771E0294c3872j37031a6587j3057j03146d6008F8126K20333k7417q0129a92803
11759d375j57099K2032A45190a9818B15101a12218B00698b4854D6869a45941B60727
11747A23088g3722F8490J12663J06458l4594B0335b59113k5497B5460a46587C6925
11735g8585A32829c6248F4133J31241e2596C6944K07287E2174J93021h8606A29137
$$ plain form
11818 77405 -70937 -314683 -359684 -359375 -22150 -18627 11016 272295 -219683 13575 -220587
11806 77480 -286608 83803 792 -10395 -29992 122268 -84479 -143514 -23583 -171001 111989
11794 163219 -395650 -283469 -95827 -163160 -125728 -58834 -219381 173441 -23425 140437
11783 390509 421328 72497 -260710 -36696 -122236 19294 -166990 -13259 63158 -182093 -66182
11771 50294 -33872 -170903 -16587 -29644 -132790 -46008 68126 288459 261042 180913 -192803
11759 -4375 -161474 -139442 145190 -19818 215101 -112218 200698 -24854 46869 -145941 260727
11747 123088 -73722 68490 181153 287611 253017 20335 -259113 -284610 25460 -146587 36925
11735 -78585 132829 -36248 64133 195374 -52596 36944 244231 52174 245195 -88606 129137
11723a47225B30241h8462H5714J7209B7581P4981e2234A30266b87805A42504b0550
11711A09393J4304a18708B93935e0656A03310J95015c00002A4289h5959C5478
11700B19251a1310n5920C09058F1675K46890A09044J04291J47008e0297m2019
11690i2316k8599A1999h4669K2385k55818a31412E4267e2853f870A93923b9593
11678h2805H977J17725a10319L7471E0877L2363Q9340a46286b3541p2327G831
11666c13102k5765a3226o9593G175L4792H547a54249g4294F3848g3641A81215
11654f9478p3015K1659q0756H3023a55437C32229K4632a38229G5744P7026c96349
11642a54705a3548k06340j76341O7207a53921A57645h4656B60309A16772J37292
$$ plain form
11723 -147225 230241 -88462 85714 102923 27581 102562 -52234 130266 -287805 142504 -20550
11711 109393 123697 -118708 293935 -50656 103310 298325 -300002 14289 -85959 35478
11700 219251 -11310 -67230 309058 61675 308565 109044 213335 360343 -50297 -92316
11690 -92316 -120915 11999 -84669 -62284 -318102 -131412 54267 -52853 -6870 193923 -29593
11678 -82805 8977 126702 -110319 -72848 50877 83240 172580 -146286 -23541 -95868 7831
11666 -313102 -338867 -13226 -82819 7175 41967 8547 -154249 -74294 63848 -73641 181215
11654 -69478 -142493 -120834 -201590 83023 -155437 332229 356861 -138229 75744 152770 -396349
11642 -154705 -13548 -219888 -396229 -329022 -153921 157645 -84656 260309 116772 254064
11632B54064d9011j6851k4429B10824a93130A81733g6512p6531f9247B55151g7754
11620a60133B3937J22434c85671D4700f294D34837i7609B72364n2138a03128m1454
11609a44582B87417A6682J61721a21136A40204J67589a20701b2038k2962j4255
11599e9255F2077b42554A59711m6468A5392K56783a20152B05312b44319E11142
11588c17410J26591B6851J1230b26847C63506e4290F3696J18455b06969R9070
11578a07899B67573o102A4791b1488B62336C4910K87242A33698N4018C6697J22929
11567A59626J1220f9380j1096A36083a26763B46756a43858r7922A95128N0687
11557B45815A13123l186a29368A98118b1205o1511a1956k00477B33982o9079J2547
$$ plain form
11632 254064 -49011 -65862 -90291 210824 -193130 181733 -76512 -153043 -69247 255151 -77754
11620 -160133 23937 146371 -385671 44700 -6294 434837 -97609 272364 220226 -103128 -144582
11609 -144582 287417 16682 178403 -121136 140204 307793 -120701 -22038 -45000 -59255
11599 -59255 62077 -242554 159711 113243 15392 272175 -120152 205312 -244319 511142
11588 -317410 -190819 26851 38081 -226847 363506 -54290 63696 182151 -206969 -107899
11578 -107899 267573 261471 14791 -21488 262336 34910 322152 133698 187716 36697 159626
11567 159626 170846 -69380 -80476 136083 -126763 246756 -143858 -241780 195128 245815
11557 245815 113123 109937 -129368 198118 -21205 -82716 -11956 -212433 233982 164903 177450
11546A77450a06185b9432B13298J30191n4549b32197G7536J43342J23737A4285
11535C79a3704l8504a7020q4461A80150p1840j3132P6413a18660A48279J62483
11524C10762a36296A97524m6948b154B12440c8737j03965d4922E644f1042A43653
11512a08142H4381f454C03283G0199n390l2110J84608a08192B65562a26382l01527
11501d27909C62091B6129J78069i8076A19682M8204N3265M226B9781N8726Q0400
11490A68907K0947D3789e9634O056B56453p1679F7323K10302a46157A42688O723
11479A49411a70092N2602B16571b8542q2691r798F585L08766j05818K0066h7729
11467B25225G3247i6920C0055N0856K20026k6045q9366b65555H7060J13941H396
$$ plain form
11546 177450 -106185 -29432 213298 343489 288940 -232197 77536 220878 344615 14285
11535 379 -13704 -52208 -17020 -101481 180150 108310 95178 171591 -118660 148279 310762
11524 310762 -136296 197524 150576 -2154 212440 -38737 -142702 -44922 5644 -61042 143653
11512 -108142 84381 -6454 303283 70199 64809 32699 217307 -108192 265562 -126382 -427909
11501 -427909 362091 26129 204198 -98076 119682 167886 221151 225377 29781 88507 168907
11490 168907 189854 43789 -59634 -53578 256453 184774 67323 277625 -146157 142688 149411
11479 149411 -170092 -117490 216571 -28542 -111233 -121031 6585 315351 209533 229599 -87729
11467 225225 73247 -96920 30055 80911 300937 274892 185526 -265555 87060 201001 8396
11455A0889K76538J23033A63798h3903A25054D7805j6428J7311L13351j45693
11445B16346H0006C7757O4442g1988n5848A11119J48674J51225I8110m1624J34431
11434A90917d2681B20214B5530f2227B3508J161J05564m8805b3252A5397d7954
11422c15252f4619A4176K9184f0556j96230A21088J14429b3708B63260E5077h461
11410a70552O1923n9581B0179J12600k5009F059J85340P6582F3509A6450l474
11399A2976J20073J59211j26542c4962A8438N9075b14194a00501I913O9416N4823
11388A34152a6237j46404a628A53470a54314a3758j1497A24828Q0405b45834G9347
11376e4890a639k27459F6820a86435k28787A36033c2910I6030f4430B76122a07459
$$ plain form
11455 10889 287427 410460 163798 -83903 125054 47805 31377 48688 362039 216346
11445 216346 80006 37757 102199 -71988 -127836 111119 259793 411018 98110 56486 190917
11434 190917 -42681 220214 25530 -62227 23508 24669 130233 81428 -23252 15397 -47954
11422 -315252 -64619 14176 43360 -60556 -256786 121088 235517 -23708 263260 55077 -8461
11410 -170552 -108629 -168210 20179 132779 107770 6059 191399 267981 63509 16450 12976
11399 12976 133049 292260 165718 -34962 18438 77513 -214194 -100501 9913 79329 134152
11388 134152 -16237 -162641 -1628 153470 -154314 -13758 -25255 124828 205233 -245834 79347
11376 -54890 -1639 -229098 66820 -186435 -415222 136033 -32910 96030 -64430 276122 -107459
11364A50780C354M2370a41183H8542J3403O7169c22479a52126k45155B26807A7502
11352B63054A01254B4807J56479a04898B02528J108d42595a42077N9998k74778
11342c56857g7949G6110J79005d3834M557E9788a73431H2830c7138j87797H1278
11330a78455j51455A6148a33832I4695C6702Q4707E5339c4606k2220D8799j2244
11319C6555h3829q594b2990H4837B7172a2755q1400E0752b07992c0528k47428
11308b77956B75228b93881A74760a29377B15504a60321j6466P528O5097L7491
11298f6671j4781k16400a11500f173B62884a11656A88518G2529d85425a13672
11287a73073J7276A52978a73779A60250p5886g6768B7787a26578A2288a12490
$$ plain form
11364 150780 3354 45724 -141183 88542 101945 169114 -322479 -152126 -397281 226807 17502
11352 263054 101254 24807 181286 -104898 202528 203636 -442595 -142077 -82079 -356857
11342 -356857 -77949 76110 255115 -43834 -39277 59788 -173431 82830 -37138 -224935 81278
11330 -178455 -329910 16148 -133832 94695 36702 121409 55339 -34606 -56826 48799 36555
11319 36555 -83829 -92423 -22990 84837 27172 -12755 -94155 50752 -207992 -30528 -277956
11308 -277956 275228 -293881 174760 -129377 215504 -160321 -176787 -169259 -104162 -66671
11298 -66671 -81452 -297852 -111500 -6173 262884 -111656 188518 72529 -485425 -113672
11287 -173073 -155797 152978 -173779 160250 84364 -76768 27787 -126578 12288 -112490
11276A55956f15913b16724h5083k62712g5529B5727G994K15988M8190A16137m5891
11265G0246c2899r963G3497a29432H4969b479A1238J04717O8299i8447L946D1130
11252A6899g1233r4939E9315a4772C03268b03033P2644j07645I6702a52841B07853
11240a174j58919O1670B14627A00381f2677A21421h5095k20218B22987r2808c122
11228a65291l9349M4458C6055N720J15256i8893k1628h964B0657a14735m3183
11217a57918A91792b682l85102a75996j40338c8953H0971e531m08573a6269A16573
11205c3765E9154J23731A037a57879r8056J592p4821f8195A97945a61537j82162
11194c43699J32543k6302a0129r174l24038M5891O2737g2557A15453b43084C1950
$$ plain form
11276 155956 -615913 -216724 -85083 -347795 -75529 25727 7994 223982 272172 116137 70246
11265 70246 -32899 -42862 73497 -129432 84969 -2479 11238 115955 184254 -98447 -94501 41130
11252 16899 -71233 -166172 59315 -14772 303268 -203033 -130389 -238034 96702 -152841 207853
11240 -1174 -160093 -98423 214627 100381 -62677 121421 -85095 -305313 222987 130179 -3122
11228 -165291 -204640 -160182 36055 41775 157031 -98893 -120521 -8964 20657 -114735 -157918
11217 -157918 191792 -2682 -387784 -175996 -316334 -38953 80971 -5531 -414104 -16269 116573
11205 -33765 59154 182885 1037 -157879 -255935 -254343 -329164 -68195 197945 -161537 -343699
11194 -343699 -211156 -237458 -10129 -19303 -343341 -297450 -234713 -72557 115453 -243084 31950
11182h9330K70j19483i6427D7486a04048a2626E8770N3833J7953b20994A4290
11170A49056f8231q9946P1226D0663a09885C45336F3087a6326q2008o7668F0765
11158A2032M3287J12932b29249J986h2931J9636G7142d15817A45917a86212q2602
11147b68814D7699J197M7027b07449e9821A94516m8448R2070i4068n1113D588
11135e5280i413e89D1887h0095B32385a03377A58795O2134a47664A34447a09838
11123B01254a1027B59509D5996g7495D5742K82205C9591a848E9274b20025E1688
11111A69068b35389h6622b0133k07621O9064G5685f562r3005M9300F9738R2513
11100A62251a40160D96397a31162B47643k7840a40186B56129K30475D9664L24865
$$ plain form
11182 -89330 -89060 -208543 -96427 47486 -104048 -12626 58770 112603 130556 -220994 14290
11170 149056 -68231 -158177 -86951 40663 -109885 345336 63087 -16326 -98334 -166002 60765
11158 12032 55319 168251 -229249 -227263 -82931 -63295 77142 -415817 145917 -186212 -268814
11147 -268814 47699 48896 95923 -207449 -59821 194516 146068 238138 -94068 -145181 4588
11135 -55280 -9413 -589 41887 -80095 232385 -103377 158795 220929 -147664 134447 -109838
11123 201254 -11027 259509 45996 -77495 45742 327947 39591 -1848 59274 -220025 51688
11111 169068 -235389 -86622 -20133 -227754 -158690 75685 -6562 -99567 -50267 69738 162251
11100 162251 -140160 496397 -131162 247643 219803 -140186 256129 486604 49664 374529
11090C74529j58209N7637C0806K45438A1655b1862A97399Q9847q9256h9744D25457
11078C0902f5972a4112C43430L3509i6836C23798K63308k41585J1253K1084I4956
11066G76592l04526j03143J20450A39367k0380O8564K52329p8608J45628J08911
11056F15811k7392J28290j03642M0639J13441k76889N56032l51502K00730o4189
11046H31329J24308r6905M0526L21622J67194j08985m69427M32936k98622k10194
11036G33782P3081J24645k50534K82021J04546m6506o5910k19373L30773j23509
11026I43016j91533J83493r3829J36230j86967j8437l64017J33019L77413j39177
11016G79211k30780K10342J25914k07390q8806M12179j59708J92119m52342K12996
$$ plain form
11090 374529 216320 273957 30806 276244 11655 -21862 197399 287246 197990 -89744 425457
11078 30902 -65972 -14112 343430 376939 -96836 323798 587106 345521 356774 377858 94956
11066 776592 472066 368923 489373 139367 118987 187551 439880 361272 506900 615811
11056 615811 588419 716709 613067 653706 767147 490258 1046290 694788 895518 831329
11046 831329 955637 858732 899258 1220880 1388074 1279089 809662 1242598 943976 733782
11036 733782 806863 931508 680974 962995 1067541 1021035 955125 735752 1066525 943016
11026 943016 751483 934976 841147 977377 790410 771973 407956 540975 918388 779211
11016 779211 548431 758773 884687 677297 588491 1000670 840962 1033081 580739 793735
11006G93735j70722J73866l19593N93998n02072O3785l2659L43568K5792M1206
10996A010904l708J60171E33635J68707n5846M68038m10588L45623k63481j21151
10986F64937K95358k09726P902L84302k07712M52045K7767l53574J8315K96871
10976A376485L06209L4092k2378J21866N23204K5897L60078K01240M72361j7955
10966C381099P8392k81069J28228K41675o13173o59781m33187L60014n67517j67155
10956A467526K38588K14150k19799j9439P7346o34569K05633L6650k64224k91676
10946H10186k9320P9764l23106A81573J75252R5286A14214K96311A87014K26642
10936D13656A95441h6311L525H2865J79037j29192J49355K4225O9592a08969q8936
$$ plain form
11006 793735 623013 796879 477286 1071284 569212 632997 600338 943906 969698 1010904
10996 1010904 1007196 1167367 533635 702342 646496 1114534 703946 1049569 786088 664937
10986 664937 960295 750569 758471 1142773 935061 1387106 1414873 1061299 1079614 1376485
10976 1376485 1682694 1716786 1694408 1816274 2339478 2365375 2725453 2926693 3399054 3381099
10966 3381099 3459491 3178422 3306650 3548325 2935152 2275371 1842184 2202198 1634681 1467526
10956 1467526 1706114 1920264 1700465 1681026 1758372 1123803 1329436 1366086 1101862 810186
10946 810186 780866 860630 537524 181573 356825 452111 114214 410525 187014 413656
10936 413656 195441 -86311 -82786 82865 261902 132710 282065 306290 375882 -108969 -197905
10925a97905J1390E7987P3951f7833B22774F9556J56362n4975b15141a05993A12392
10913B42434a41962D1915a33767B31659e7738j2172j88162k53955d9074k86073
10903c35147B1624N3254J54265a34257O5196A23559B7431M6799c1178A10694a87784
10891i2748G0049b70908j09080A15400B319a76962e6144j5457k01249J9464E3842
10879B1139g1272J8043H3476a72026A43471D9815b581j01315G402L87692c57086
10867B97122i0778A29007c76197g9904A2952h8383h677j74383B38071a56595A06640
10855b975k61186E6299a69952A20702c27209A70123c622B83832b86012B49761
10844D2782a8542p238A7889c06109d7999j35104N9227E6580B5068N929a47366
$$ plain form
10925 -197905 -186515 57987 131938 -67833 222774 69556 225918 170943 -215141 -105993 112392
10913 242434 -141962 41915 -133767 231659 -57738 -69910 -258072 -512027 -49074 -335147
10903 -335147 21624 74878 229143 -134257 -69061 123559 27431 74230 -31178 110694 -187784
10891 -92748 70049 -270908 -379988 115400 2319 -176962 -56144 -71601 -272850 -253386 53842
10879 21139 -71272 -53229 83476 -172026 143471 49815 -2581 -103896 7402 395094 -357086
10867 297122 -90778 129007 -376197 -79904 12952 -88383 -8677 -183060 238071 -156595 106640
10855 -2975 -264161 56299 -169952 120702 -327209 170123 -3622 283832 -286012 249761
10844 42782 -18542 -25780 17889 -306109 -47999 -183103 -123876 56580 25068 30997 -147366
10832g1711A07291L7529o8459c16892a07045A69944G6190e3264i666A19875j3529
10821A06346b55384P6230P0753B35365a76719r1214H4004c96197J16138Q5233
10811a94826h5086B07734C4010P0563i8181q9752N0916B2559L16734d6114k51036
10800b97150a3279m96935a97174g2662a9247j07054j06808M6986B03514r8725
10790A04789a65867j53820A01384f7132l5896k9489l03416B17730b5211r1162
10780a16373o3406c7553h20D37d58154C8095J47731b59633o6952B25405F9335
10768F8392K09460a62633j9768A53525a57387I6004b62479A03582m5318c37097
10757i9655b2453B2262Q4864C3549i2972L8798f282A8251J21737a31891j89931
$$ plain form
10832 -71711 107291 144820 76361 -316892 -107045 169944 76190 -53264 -9666 119875 106346
10821 106346 -255384 -179154 -108401 235365 -176719 -267933 84004 -396197 -280059 -194826
10811 -194826 -85086 207734 34010 104573 -98181 -187933 -137017 22559 339293 -46114 -297150
10800 -297150 -13279 -510214 -197174 -72662 -19247 -126301 -233109 -186123 203514 104789
10790 104789 -165867 -319687 101384 -67132 -103028 -132517 -435933 217730 -25211 -116373
10780 -116373 -179779 -37553 -820 437 -458154 38095 185826 -259633 -326585 225405 69335
10768 68392 277852 -162633 -182401 153525 -157387 96004 -262479 103582 58264 -337097
10757 -99655 -22453 22262 107126 33549 -92972 -54174 -6282 18251 139988 -131891 -321822
10746c21822l7327J33516A73286J04n9285a81747f6322j08603r108A26165J24528
10735B50693M5575b65081k7070B38276j14485a86980E3175b5335j24893B73051
10724B8475R6920a28936K5627A32378a9218k54803d8333k28546a05517H1943b11367
10712d974k3349j16464m1103D1313N17691B7029b76101g8995n1590r2698i6480
10700E5552i5339C95693a74703A28246a29116H6254d9683I1303O7747a08997C7170
10688B59890c96044A40614h3266a2674p0230A14395L527l9492e4597E9673e3233
10676c1264j77665H8388a53314D712P7797P2718G0505d13065A44159e6308B39086
10664h4555K3881p084m5240L1835j79366e07C04742E121N1363b32480A30341b4191
$$ plain form
10746 -321822 -359149 -225633 173286 173390 114105 -181747 -66322 -174925 -184033 126165 250693
10735 250693 296268 -265081 -292151 238276 123791 -186980 53175 -25335 -150228 273051
10724 28475 125395 -128936 -103309 132378 -19218 -274021 -48333 -276879 -105517 81943 -211367
10712 -4974 -28323 -144787 -185890 41313 559004 27029 -276101 -78995 -130585 -223283 -96480
10700 55552 -95339 395693 -174703 128246 -129116 86254 -49683 91303 159050 -108997 37170
10688 259890 -396044 140614 -83266 -12674 -82904 114395 117922 78430 -54597 59673 -53233
10676 -31264 -208929 88388 -153314 4712 82509 155227 70505 -413065 144159 -56308 239086
10664 -84555 -60674 -67758 -112998 -81163 -260529 -507 304742 5121 56484 -232480 130341 -24191
10651g2521i697k33746b3978n981a0639F3525a33151e0617r7737Q316G4a9778
10638B0882c53537b0575o4844k69492B0933O018a19275c5913D59827b11200J00505
10627a10695Q446A71380c14931B81209a12665f56j40377J3929B91299i3058B71907
10615a2153j45167c4943J5611L511j99666O6404r1063C2601g7094C655b1186l59612
10603c80798g9624C4252a20709A25286a03454A94188b94178i8890j7497M1890
10593g4497k3548B15438d1960B1452a8474j44722g8060m0781b055j34750p0944
10582b07749A90743a33797M4860l68331b26635j00190J13696c9390b834B06056
10571a62979B47838b18373B24639r1034c0749r2624j78198G4938i5767j86595
$$ plain form
10651 -72521 -9697 -243443 -23978 -29959 -10639 63525 -133151 -50617 -148354 -140038 74 -19778
10638 20882 -353537 -20575 -85419 -354911 20933 26951 -119275 -35913 459827 -211200 -110695
10627 -110695 -102249 171380 -314931 281209 -112665 -656 -141033 -127104 291299 -93058 271907
10615 -12153 -157320 -34943 -19332 -15821 -215487 -149083 -240146 32601 -77094 3655 -21186 -380798
10603 -380798 -79624 34252 -120709 125286 -103454 194188 -294178 -98890 -116387 -74497
10593 -74497 -98045 215438 -41960 21452 -18474 -163196 -78060 -118841 -2055 -136805 -207749
10582 -207749 190743 -133797 -88937 -457268 -226635 -326825 -213129 -39390 -2834 206056
10571 -162979 247838 -218373 224639 133605 -30749 -123373 -301571 74938 -95767 -282362
10561b82362k05322B52616f6849b3013B13503b0069F5827Q0470a8086B33318n2864
10550A80454f6846b0280A59079A1108K21160D3368a79150p0335K1499Q7708N8901
10539h1377c9461N006A22260d7833A3119R3669D1231b34436a02820K2410g371
10527a13527N4728j5485r7788e0942k62275J5385B04333d23478J51670E6414A43
10515a33351r0238a055j70853j1261o2170a9296A64912B0414K01368I0712i3500
10503c07304B7676g1583k32631E1294G519a69941L6170B34386a70719A93920j1766
10492A82154a07232H0981R2007e1380j29023B53005a70728B52207a717C7657J53390
10481A91047E9410a08704D7916J21684a19061D94361O4893A63125F5439J67103
$$ plain form
10561 -282362 -487684 252616 -66849 -23013 213503 -20069 65827 146297 -18086 233318 180454
10550 180454 -66846 -20280 159079 11108 232268 43368 -179150 -249485 -227986 -140278 -81377
10539 -81377 -39461 -34455 122260 -47833 13119 106788 41231 -234436 -102820 -80410 -7371
10527 -113527 -58799 -74284 -172072 -50942 -313217 -297832 204333 -423478 -271808 56414 143
10515 -133351 -223589 -1055 -171908 -183169 -245339 -19296 164912 20414 221782 90712 -93500
10503 -307304 27676 -71583 -304214 51294 7519 -169941 -133771 234386 -170719 193920 182154
10492 182154 -107232 80981 172988 -51380 -180403 253005 -170728 252207 -1717 37657 191047
10481 191047 59410 -108704 47916 169600 -119061 494361 559254 163125 65439 232542
10471B32542o1141a37367M9159B90112c6293C8767d5390o0616B56792L9189b03077
10459A52443f0191j3726G4396a06938H1731J20788l8620i4659B69158b19523D6161
10447a50428j07210e742F361b52550d3367A32369b22867j15272a18367a6874m480
10436b1354A47233D8232a23078K8990m0372A33847b10426d7868A48139d36313
10425a53448p4925c6566l50369J74891Q0956B35991a74757A56772a40328A96979
10414d03842J11456c8430I3422j1811f6073j83953N4990A71445N9606a06375b4057
10402c70768d6151A34953j0277f5924j47707j72294B16043i5103B54232f8403
10391A63056K85528f2362n4389C27979g5178A90696b6365A96228r2596i4025G5810
$$ plain form
10471 232542 171401 -137367 -88208 290112 -36293 38767 -45390 -106006 256792 295981 -203077
10459 152443 -60191 -73917 74396 -106938 81731 202519 163899 -94659 269158 -219523 46161
10447 -150428 -257638 -5742 6361 -252550 -43367 132369 -222867 -338139 -118367 -16874 -21354
10436 -21354 147233 48232 -123078 -94088 -134460 133847 -210426 -47868 148139 -436313
10425 -153448 -228373 -36566 -386935 -212044 -131088 235991 -174757 156772 -140328 196979
10414 -403842 -292386 -38430 93422 81611 -66073 -250026 -195036 171445 231051 -106375 -24057
10402 -370768 -46151 134953 124676 -65924 -213631 -385925 216043 -95103 254232 -68403
10391 163056 448584 -62362 -116751 327979 -75178 190696 -26365 196228 103632 -94025 75810
10379H4550e6066G765K25403l572a51232C40043P7338o9647j66478n4726M9270
10368A75800K67246j35222c6885C25439Q8388J69972j16163m4885k07231p3110
10358A42410P7586J54548J0535A9178I066L05668L4837l4760J7312Q1448L37223
10347G50794O5754C89837m7139p8887A01923e1569A56899N08808j75020E629K13722
10336B19351q4544N6878J28171l0931L9516A58232h265C87880A8552J44587l3787
10325A29352n1218J68558j0458p943Q2807G1801B9354G091M76812B40233b40003
10313B54048c31538C03629i793k6316B04897a74006p9795a00728a0429j8267j9496
10302d8192j05987f3647b0986I4602j9622a44776B68913b7821D3032L2578j7168
$$ plain form
10379 84550 -56066 7765 233168 229596 -151232 340043 417381 347734 181256 126530 175800
10368 175800 443046 307824 -36885 325439 413827 583799 467636 422751 215520 142410
10358 142410 219996 374544 385079 19178 9066 314734 349571 314811 332123 413571 750794
10347 750794 816548 389837 342698 263811 101923 -51569 156899 665707 490687 5629 219351
10336 219351 134807 191685 319856 288925 328441 158232 -8265 387880 18552 163139 129352
10325 129352 78134 246692 236234 228291 311098 71801 29354 7091 483903 240233 -240003
10313 254048 -331538 303629 -9793 -36109 204897 -174006 -253801 -100728 -10429 -28696 -48192
10302 -48192 -154179 -63647 -20986 94602 74980 -144776 268913 -27821 43032 75610 58442
10291E8442d56135e0332m557p39376A2409b37671A53223C4185N4952B6627O3929
10280I0556f3687l39558f3829A41933a36995B68160A23453a93224C7120J93848
10270B30968a93505f0629A02717A3465J4155K1295b26356I2973m5779a77574e7350
10258C62851m8077A50489A6887a34419B59129o689I2972B063P5858L4558R6604
10247B09083F7160J00483a13078A29005Q4204J38161A10927b40349E5748N9503
10237A15251R0407r8423b0264A36402D8104Q6223f8722p7585M3366n2952J6023
10226a39870J7056J3180E3229a94867d9438j56298C528a69663f9545B26881b78805
10214a24395M6523L07j58927a16741A71198b09244j19999I6031C3195b81609q8377
$$ plain form
10291 58442 -456135 -50332 -54889 -794265 12409 -237671 153223 34185 89137 26627 90556
10280 90556 -63687 -403245 -63829 141933 -136995 268160 123453 -193224 37120 230968
10270 230968 -193505 -60629 102717 13465 27620 48915 -226356 92973 47194 -177574 -57350
10258 362851 314774 150489 16887 -134419 259129 252440 92972 2063 77921 112479 209083
10247 209083 67160 167643 -113078 129005 213209 351370 110927 -240349 55748 115251
10237 115251 205658 107235 -20264 136402 48104 134327 -68722 -146307 -102941 -155893 -139870
10226 -139870 -122814 -109634 53229 -194867 -49438 -205736 3528 -169663 -69545 226881 -278805
10214 -124395 -77872 -77565 -236492 -116741 171198 -209244 -329243 96031 33195 -281609 -369986
10203c69986a83279F0000a80021c6089k98961A84306a20118b7446k09314C09807
10192g6558A23692O8948P3893d1197j29928A66087a65129P1167r806E5335c7978
10180a21292k5555O4833j50934a07571G5432O2155d1907K0405j0310B1470a71652
10168b155j56356m6865M2588B41025I9185g0501B69109f734j79289m7994p7675
10157c11692N6141g7253C6135J22002A3355a3083l48021B0391a15190j58755C6029
10145c69048b84F8107a30052M3019j36843A20312M8401c09069G7947O1765e8879
10133D5403c75735A03414c18887C09989i7303l38435B39212B619b00850A27448
10122A61362O5534A07332b08619j15161a13054b3073A14162b65536B02474a53626
$$ plain form
10203 -369986 -183279 60000 -180021 -36089 -335050 184306 -120118 -27446 -236760 309807
10192 -76558 123692 192640 266533 -41197 -171125 166087 -165129 -93962 -103768 55335 -37978
10180 -121292 -146847 -82014 -232948 -107571 75432 137587 -41907 -21502 -31812 21470 -171652
10168 -2155 -158511 -205376 -162788 241025 99185 -70501 269109 -6734 -186023 -234017 -311692
10157 -311692 -255551 -77253 36135 158137 13355 -13083 -361104 20391 -115190 -273945 36029
10145 -369048 -284 68107 -130052 -87033 -223876 120312 168713 -309069 77947 139712 -58879
10133 45403 -375735 103414 -318887 309989 -97303 -435738 239212 2619 -200850 127448
10122 161362 226896 107332 -208619 -323780 -113054 -23073 114162 -265536 202474 -153626
10111c61585b2424A86047e414k52690i7329I4117a34406N697B6939b02041d2436
10099g8768J2896F5605a46372f7190F9710a5878k47174P3718d1733j12681j44444
10088b98858h9601l68093E7992g2700m6161A76904M7335j0124a31148b7582E1030
10076d0066G229b41150C1247b50815R9624b0465k0024n9747e532A07388a26777
10064a42384r9109J16557q756b6106j88171D6483j620j0853d18446A37826P196
10053A45022b29198R9765e5186C5728A5332R6496a31427m6641D9019a17004E6943
10041a86360C2967a47452d6167j7342A57596a29732K5705a6452k47096c7896l5205
10030g3101m1284A48880c27734A09075c38207D9707h6262j12757P2058J0872P161
$$ plain form
10111 -361585 -22424 186047 -5414 -258104 -97329 94117 -134406 -128709 26939 -202041 -42436
10099 -78768 -65872 65605 -146372 -67190 69710 -15878 -263052 -189334 -41733 -154414 -298858
10088 -298858 -89601 -457694 57992 -72700 -118861 176904 224239 214115 -131148 -27582 51030
10076 -40066 7229 -241150 31247 -250815 -151191 -20465 -40489 -100236 -5532 107388 -126777
10064 -142384 -241493 -124936 -133692 -26106 -214277 46483 44863 34010 -418446 137826 145022
10053 145022 -229198 -129433 -55186 35728 15332 111828 -131427 -178068 49019 -117004 56943
10041 -186360 32967 -147452 -46167 -63509 157596 -129732 -104027 -16452 -263548 -37896 -73101
10030 -73101 -114385 148880 -327734 109075 -338207 49707 -86262 -199019 -126961 -116089 -108928
10019a08928k30827l2302A45056F1407a92202G5997F589J1999c53807g7454k47359
10008c24813f5546k33412R8120m9110P1649K1999A79356c2293H2613a4455k97514
9997c11969A91626a50240k96054J32899a51341N5141o980A62628c9677k30017
9987b69694J3721d8598B4096J56005c14544a29931B82742e6862j09173j6336P3946
9976a08425o3339C6335b55968E4823J2175a74420B03959b43574a06679k24588
9966c31267A63447a25248q3360C263b52349C8251n916b58968p583F9417b54949
9954A44387a38856m4951j2728h6637l15344J95823e141j48463p9413k21688B25433
9942i9024p5759N4196A47391b35712B17340F8723J29014c0067k44907A04858D7789
$$ plain form
10019 -108928 -339755 -372057 145056 61407 -192202 75997 6589 18588 -353807 -77454 -324813
10008 -324813 -65546 -298958 -200838 -249948 -178299 -156300 179356 -32293 82613 -14455 -311969
9997 -311969 191626 -150240 -446294 -313395 -151341 -96200 -103180 162628 -39677 -269694
9987 -269694 -255973 -48598 24096 180101 -314544 -129931 282742 -56862 -166035 -182371 -108425
9976 -108425 -171764 36335 -255968 54823 66998 -174420 203959 -243574 -106679 -331267
9966 -331267 163447 -125248 -208608 3263 -252349 38251 32335 -258968 -266551 69417 -254949
9954 144387 -138856 -183807 -196535 -86637 -401981 -206158 -5141 -153604 -233017 -454705 225433
9942 -99024 -174783 -120587 147391 -235712 217340 68723 197737 -30067 -274974 104858 47789
9930A02666d03780J69559Q013f0868b275k13423h2919q2040j49294F1508B2588
9918i7571A61030b14449A36632a27878H2958a14218C1268b24071A03810a0701
9907a31246p4142j84070J20688H333a80394D8569K00889F6058e1673j42396l4270
9896b28339c0763Q55j17380j41375A53060m5778J4070M3348b92494D5666e316
9884i7483H5374a43592D04250b62932f0924C5556b18192d2821A65537a07601A54320
9872A41687c47115J58584N1411a8199A87198a36622j97413b9429k7261G4081b08353
9860a13492F3465c2174m6060A0991m896Q9168b4863p9935j60216a18176A67122
9848d168A47421g6222m2619j37117F7682a34872A47749a83302B6999a60185k42375
$$ plain form
9930 102666 -403780 -234221 -226208 -60868 -2275 -215698 -82919 -164959 -314253 61508 22588
9918 -97571 161030 -214449 136632 -127878 82958 -114218 31268 -224071 103810 -10701
9907 -131246 -205388 -389458 -268770 8333 -180394 48569 249458 66058 -51673 -194069 -228339
9896 -228339 -30763 -29908 -147288 -288663 153060 107282 121352 164700 -292494 45666 -5316
9884 -97483 85374 -143592 404250 -262932 -60924 35556 -218192 -42821 165537 -107601 154320
9872 141687 -347115 -188531 -137120 -18199 187198 -136622 -334035 -29429 -56690 74081 -208353
9860 -113492 63465 -32174 -78234 10991 6095 95263 -24863 -104798 -265014 -118176 167122
9848 -4168 147421 -76222 -118841 -255958 67682 -134872 147749 -183302 26999 -160185 -402560
9837d02560A82971c26654e4986p4816d4639j45652j11169n2979a65505d1671k4026
9826f5697a6154l1888j38469E1172a38112j85277K7503I1780P7571a57052G6628
9814f832o4987L5061A57897M5993c67619R2458o8294b2370r7581B2996K39614
9803B62610a6515B52242C459K09639a49804A46812d2816q3974k7304l287N0003
9792a07378g678o3134q1290m4658K6939f6403m23314C2607O3653a2374j40445
9781a52819b9859A00773l8849A0836a93549b8959j49947D15186a02549J9820F379
9769a70995H0953a78874A67564q1559i6469A9655b03919E635J39751b3968D3857
9757A75807J04400b7605r5596k50650N9494h7976B1137N6002K77084C7240J41396
$$ plain form
9837 -402560 182971 -326654 -54986 -129802 -44639 -190291 -301460 -354439 -165505 -41671 -65697
9826 -65697 -16154 -48042 -186511 51172 -138112 -323389 -295886 91780 169351 -157052 76628
9814 -6832 -71819 -36758 157897 203890 -367619 -275161 -343455 -22370 -119951 22996 262610
9803 262610 -16515 252242 3459 213098 -149804 146812 -42816 -126790 -154094 -157381 -107378
9792 -107378 -7678 -70812 -152102 -196760 -169821 -66403 -489717 32607 96260 -12374 -152819
9781 -152819 -29859 100773 61924 10836 -193549 -28959 -178906 415186 -102549 -82729 6379
9769 -170995 80953 -178874 167564 86005 -96469 19655 -203919 5635 145386 -23968 43857
9757 175807 280207 -27605 -123201 -373851 -314357 -87976 21137 77139 354223 37240 178636
9746A78636c28832d0403l2148A78353a34611G7307K14586a1252l15476j32145
9736d58873a4220B21156J48195A03045K50502a98991L6676C9720g7337j5159k19146
9725c11642c322r0268J0080A06710N09b39034L7234j53747b0559k33719j556a07914
9712A36683a67540j17165Q7976A63777a59714A01153h2616j16537A78208d4137
9701a55206r6843H4533a94543K1144j21847J18420l1616b0409l49512P2522H7033
9689c2947k06760b2469D4618a44108D7199f8554C7713g2782n3593m9918j75865
9678c52158h8330k5454A86287a08626m6488b637m00051A2381a56265n9911h7649
9666a39277D1205p454N4388k7055a84212J6630p6948O0272A35006j1557l426g3038
$$ plain form
9746 178636 -328832 -40403 -72551 178353 -134611 77307 291893 -11252 -326728 -458873
9736 -458873 -14220 221156 369351 103045 353547 -198991 -162315 39720 -77337 -92496 -311642
9725 -311642 -3322 -93590 -83510 106710 107219 -239034 -201800 -355547 -20559 -254278 -255834 -107914
9712 136683 -167540 -284705 -196729 163777 -159714 101153 -82616 -199153 178208 -44137
9701 -155206 -252049 84533 -194543 -173399 -295246 -176826 -208442 -20409 -369921 -297399 87033
9689 -32947 -239707 -22469 44618 -144108 47199 -68554 37713 -72782 -126375 -176293 -352158
9678 -352158 -88330 -113784 186287 -108626 -155114 -2637 -402688 12381 -156265 -216176 -87649
9666 -139277 41205 33751 88139 61084 -184212 -167582 -244530 -184258 135006 123449 120023 -73038
9653c11479j78032h2785j35393K3376Q7357k99350F7961f0754k40264M393g2211
9641a62426B10630A7124a7657l78550G1623e3291j56275r1289a27893K9786a9752
9629b5040H0203b04025l7939f8815k72616C97010b33901B6531B542b48997r0769
9618c39766d6548A24527A5748b50907J08200A62754n2321b9361B14455g9073l3201
9607a12274H2384a2914A29017D9016J08224a85193b3752r4793o1887D8858b1890
9595B58681P3804a03551q2652J2541a6399A0968K29388O6466A9434l730c7858
9583G2381c6617l3328R388B56981b18471n7122a04611A15575b80767E3389a65048
9571c15349A80267a45483e8971j95863f1501j38488c7719k56446e1504j77737
$$ plain form
9653 -311479 -489511 -82785 -218178 -194802 -107445 -406795 67961 -60754 -301018 -296625 -72211
9641 -162426 210630 17124 -17657 -396207 71623 -53291 -209566 -300855 -127893 -98107 -19752
9629 -25040 80203 -204025 -241964 -68815 -341431 397010 -233901 26531 2542 -248997 -339766
9618 -339766 -46548 124527 15748 -250907 -142707 162754 110433 -29361 214455 -79073 -112274
9607 -112274 82384 -12914 129017 49016 157240 -185193 -23752 -118545 -180432 48858 -21890
9595 258681 332485 -103551 -186203 -173662 -16399 10968 240356 306822 19434 15704 -37858
9583 72381 -36617 -69945 -60557 256981 -218471 -275593 -104611 115575 -280767 53389 -165048
9571 -315349 180267 -145483 -58971 -254834 -61501 -199989 -37719 -294165 -51504 -229241
9561b29241A0427i0882A66660p294b79218e8716A96989b97662B16775J3893b77319
9549c64477h9519G7422a3140l15266j2448d4418A27556J00710b97046K4976C7361
9537d63224b0230G9419a59131j2812D2950J492b519a098k82539i0088b7996j09988
9525a37984M6465n4920j8020J2065A98112b73156m0152h9257j73521C1452L53519
9514C84971E0655b20888A84778F7386A2676c22402A37314f2002A37119g9757B23116
9502a22172B6767A0807a13647c6883l49860B229e6272C1652Q3729g8537k09514
9491b88051A02133c01087A16835a58911B25831f0230j59739N0533n3939A05197
9480A24231R4681c26437G934J76902d77878b01287C30134G6677b03246d46B15396
$$ plain form
9561 -229241 10427 -90882 166660 159366 -279218 -58716 196989 -297662 216775 230668 -277319
9549 -364477 -89519 77422 -13140 -328406 -340854 -44418 127556 228266 -297046 -272070 37361
9537 -463224 -20230 79419 -159131 -171943 42950 44442 -2519 -1098 -283637 -90088 -27996 -137984
9525 -137984 -91519 -146439 -164459 -152394 198112 -273156 -313308 -89257 -262778 31452 384971
9514 384971 50655 -220888 184778 67386 12676 -322402 137314 -62002 137119 -79757 223116
9502 -122172 26767 10807 -113647 -36883 -386743 2229 -56272 31652 115381 -78537 -288051
9491 -288051 102133 -301087 116835 -158911 225831 -60230 -219969 -169436 -223375 105197
9480 124231 218912 -326437 7934 184836 -477878 -201287 330134 76677 -203246 -446 215396
9468a2680j00671g540j65789l5202B649J16128E4201J47622p9993a94677M9229
9457a45448A67293J51921d091j32969p1219h7822g782k05479P6792N3096A35724
9445a47104p567j41584p5196f3709a2096k36584m4276A76528b25960l0996J18466
9434a38490a0587n1197j97565H8602a29373C33875e1823l0354k06400J28762K8615
9423a31200p3981c5988a3454I7866a39664E1271a30255L9170n110k95684E8871
9411a08022B9051P5841D002R2486P1411g6867k12068a01005g974E1500d7315A49056
9398a04769k47393A647b17247M2439B5503b99367h1543D0231a31438k29567c4710
9386a672m742I377d1685k1330F1996d00029k487e2178k73275Q8250J03973L5073
$$ plain form
9468 -12680 -113351 -7540 -173329 -208531 2649 118777 54201 201823 121830 -194677 -145448
9457 -145448 167293 319214 -4091 -137060 -208279 -87822 -7782 -213261 -136469 -83373 135724
9445 -147104 -154671 -296255 -371451 -63709 -12096 -248680 -292956 176528 -225960 -256956 -138490
9434 -138490 -10587 -61784 -259349 88602 -129373 333875 -51823 -82177 -288577 -159815 -131200
9423 -131200 -205181 -35988 -13454 97866 -139664 51271 -130255 -91085 -96195 -391879 58871
9411 -108022 29051 104892 4002 96488 167899 -76867 -288935 -101005 -7974 51500 -47315 149056
9398 -104769 -352162 1647 -217247 -174808 25503 -299367 -81543 40231 -131438 -361005 -34710
9386 -1672 -6414 9377 -41685 -63015 61996 -400029 -402516 -52178 -325453 -237203 -133230 -98157
9374i8157p1225j10042R3155A85887q8999a75239C76705A3794L0624c5207A17851
9362a37774A6296L38098b34482Q9752j974a5682O317k44231C31682p5921I2796
9350b39721E3133a51727d1753A23727b08456p6451O7309c9736G6451l4611a4645
9338a71597h0394c7141m1311j08938C4921a08630A7191K08969i9604H3522N6855
9327A40377F9547a10449a9012B3306a84801A66918b67988a09617j16826j9137
9317b45580D2695a60352j23453A26969A0727a65060l64178H9430c5080D08510
9306A01786R9519l0915h4678A18916D0834L08610a57199M3829J6044m21370i6235
9294d37006b00309g8594l02905J45002J00928B85079a37503H686a79138F7018
$$ plain form
9374 -98157 -169382 -279424 -186269 185887 96888 -175239 376705 13794 44418 -35207 117851
9362 -137774 16296 354394 -234482 -144730 -146704 -15682 -9365 -253596 331682 255761 92796
9350 -239721 53133 -151727 -41753 123727 -208456 -284907 -217598 -39736 76451 41840 -14645
9338 -171597 -80394 -37141 -78452 -187390 34921 -108630 17191 226160 -99604 83522 140377
9327 140377 69547 -110449 -19012 23306 -184801 166918 -267988 -109617 -226443 -245580
9317 -245580 42695 -160352 -283805 126969 10727 -165060 -529238 89430 -35080 408510
9306 101786 201305 170390 -84678 118916 40834 349444 -157199 -113370 -97326 -518696 -96235
9294 -437006 -200309 -78594 -381499 -236497 -135569 285079 -137503 8686 -179138 67018
9283c8983A34979C8720O160c65022J28021L4314R6380A09594e0415k41189F0161
9271b96049B8032Q8821B6248b11413A19664b23859j25284C59589A68895b35331
9260a18869I8591i8562J621n6625l3891M3811L9562B5714b69680b989D2167a5975
9247A06588a84669B00389N964c65526E1653a76507f688A5961a58510B92033a78885
9235C1385P6718a75411l0204a5343k62329I1941a67578B51296b1853G7717a68483
9223a66956j09679A71529d5382j35958Q5127C4428j1090e19013a51571O193h193
9211A75386J41923b66820k24686e3916p9909b9138j38838e2029a8275k53591J34426
9200a37440o8943A28327b9681k62534a22475K9504j97136Q2515h876j07324B3603
$$ plain form
9283 -38983 134979 38720 44880 -365022 -237001 -202687 -106307 109594 -50415 -291604 60161
9271 -296049 28032 116853 26248 -211413 119664 -223859 -349143 359589 168895 -235331
9260 -118869 98591 -98562 -96941 -153566 -187457 -143646 -104084 25714 -269680 -2989 42167 -15975
9247 106588 -184669 200389 206353 -365526 51653 -176507 -6688 15961 -158510 292033 -178885
9235 31385 108103 -175411 -205615 -15343 -277672 91941 -167578 251296 -21853 77717 -168483
9223 -166956 -276635 171529 -45382 -181340 -96213 34428 23338 -519013 -151571 -145378 -8193
9211 175386 317309 -266820 -491506 -53916 -133825 -29138 -167976 -52029 -18275 -271866 -137440
9200 -137440 -206383 128327 -29681 -292215 -122475 -92971 -290107 -207592 -8876 -116200 23603
9188g746j09121I7619J14671a06428k2190C7174b26412n1691B46203I5477d24983
9176E3106a29006H5778J9597C1020P4171b86496D6742J14885b04061o244j38625
9165c48930E05768B5067a27409b0069E742a58433j94938B23907a81811j71855
9155c53666N3108A08167K51319g574A16031e2957N310k323k06334c0701D8521
9143D024a8799m4696L542A30391a66330C5560h6252A78440d6100A5473J82164
9132A97637c4877j34304j23352F8902h7606k06587J1397a14753H003N0562i1534
9120b108j39883r7280a06410G8258L92192b01558A1105J09931a99114j2468N9049
9109a52533F1540J67500G64J0479J85107O1340q9631p2084d0535A81253c9484
$$ plain form
9188 -7746 -116867 97619 212290 -106428 -128618 37174 -226412 -278103 246203 95477 -424983
9176 53106 -129006 85778 105375 31020 105191 -286496 46742 161627 -204061 -210305 -348930
9165 -348930 505768 25067 -127409 -20069 5742 -158433 -353371 223907 -181811 -353666
9155 -353666 -300558 108167 359486 -7574 116031 -52957 -47647 -49970 -256304 -30701 48521
9143 4024 -18799 -63495 -59953 130391 -166330 35560 -86252 178440 -46100 15473 197637
9132 197637 -34877 -169181 -292533 68902 -87606 -294193 -282796 -114753 8003 58565 -91534
9120 -2108 -141991 -239271 -106410 78258 470450 -201558 11105 121036 -199114 -211582 -152533
9109 -152533 61540 229040 764 11243 196350 257690 168059 95975 -40535 181253 -39484
9097A58242c89241E1371B3309a82461A57271m5945i9174F5305O7379i131j65686
9086a74817M0718J2337J5710l5747O8243B27697b66149O3028a8714j63291d6581
9074I5715a9631j48496k3064f7289J8236k70404d2076k10779A10437j9720J08240
9063A98957b7149l6991B48360A04768c3096h284B18670a36373l3125A71415D6455
9051b84091j27345a14071j24146i7991D8409a23314B50869b02652O0032L5403
9041a07217F9196K1999l5550b14735J4552L5120A87562J4023b01103A24055a46680
9029B12839k8556r1967k6984d5319j65171P6919b0676e030H3386N7081e6136A36374
9016g1919k21575a607k94867J09349I2734a60460n7750h4433m06348a39463E4568
$$ plain form
9097 158242 -389241 51371 23309 -182461 157271 111326 -99174 65305 132684 -9131 -174817
9086 -174817 -134099 -121762 -106052 -141799 -73556 227697 -266149 -203121 -18714 -182005 -46581
9074 95715 -19631 -168127 -191191 -67289 -49053 -319457 -42076 -252855 110437 90717 198957
9063 198957 -27149 -64140 248360 104768 -33096 -8284 218670 -136373 -169498 171415 46455
9051 -284091 -411436 -114071 -238217 -97991 48409 -123314 250869 -202652 -142620 -107217
9041 -107217 69196 91195 55645 -214735 -200183 -165063 187562 201585 -201103 124055 -146680
9029 212839 184283 92316 65332 -45319 -210490 -133571 -20676 -5030 83386 140467 -56136 136374
9016 -71919 -293494 -1607 -296474 -187125 92734 -160460 -218210 -84433 -490781 -139463 54568
9004F9918i6858A0431d7230B5730a8841l54578C09585a87877A57375a46280j77797
8993c24077B2989J54720a08481K8038L9654k5264j15549r0780a23944A44136b3328
8981b0985j00720c905E5660e56929a45310j91790k38939K66886J34839r3076C11248
8969C8052c17105f1096K9080O289k79524D8953J6904K75610e3525l73028c8542
8957b82604C05678A03618a56514J3384A7936c3504A55953e33832a2265k12866
8947b25131E7608P9216d8947C9161K8389a5881k62765C9814a58814b2619n4514
8936g7133A55074J4683A1204R0740K47703A27604l7007l7172a25454G1847k043
8925F9804K53161b34785B28613K58027J630132N898417O811339D764110A879712
$$ plain form
9004 69918 -96858 10431 -47230 25730 -18841 -373419 309585 -187877 157375 -146280 -324077
8993 -324077 22989 177709 -108481 -80443 -40789 -66053 -181602 -272382 -123944 144136 -23328
8981 -20985 -121705 -3905 55660 -556929 -145310 -337100 -576039 -309153 -174314 -267390 311248
8969 38052 -317105 -61096 -32016 -25727 -305251 48953 65857 341467 -53525 -426553 -38542
8957 -282604 305678 103618 -156514 -143130 17936 -33504 155953 -533832 -12265 -225131
8947 -225131 57608 136824 -48947 39161 67550 -15881 -278646 39814 -158814 -22619 -77133
8936 -77133 155074 169757 11204 101944 349647 127604 90597 53425 -125454 71847 69804
8925 69804 322965 -234785 228613 486640 2116772 8015189 14826528 4764110 1879712
8915D40315B12218r76o0559D881J59685m8536j6972a40540b574C80503F5824j5399
8903E0425b36518O9874f8698B07486B9782H288h2628E3207M2752C8090f3280G7570
8890A9902a97516Q6063M5946A27916D1749O6507k5708A8908L9867a64109A00568
8878A38339j1124d9728B9582c19542R640B47741B1277a87115P2664j63164D4618
$$ plain form
8915 440315 212218 211242 150683 4881 164566 116030 99058 -140540 -2574 380503 65824 50425
8903 50425 -236518 -166644 -68698 207486 29782 8288 -82628 53207 95959 38090 -63280 77570
8890 19902 -197516 -111453 -65507 127916 41749 108256 82548 18908 58775 -164109 100568
8878 138339 127215 -49728 29582 -319542 -309902 247741 21277 -187115 -114451 -277615 44618
$$ [...]
##END NTUPLES=NMR SPECTRUM
##END=
