
##TITLE=AC1244__6608867_OtYWXq1r5D
##JCAMPDX= 6.0         $$ Bruker NMR JCAMP-DX V2.0
##DATA TYPE= NMR SPECTRUM
##DATA CLASS= NTUPLES
##ORIGIN= BRUKER
##OWNER= Administrator
$$ 1.72 TOPSPIN		Version 2.1
$$ 2012-08-01 17:47:43.921 -0500  Administrator@TOPSPIN
$$ Compression mode = diff/dup
##.OBSERVE FREQUENCY= 400.02188249412
##.OBSERVE NUCLEUS= ^1H
##.ACQUISITION MODE= SIMULTANEOUS (DQD)
##.ACQUISITION SCHEME= undefined
##.AVERAGES= 64
##.DIGITISER RES= 22
##SPECTROMETER/DATA SYSTEM= spect
##.PULSE SEQUENCE= noesygpps1d.comp
##.SOLVENT NAME= COFFEE_meoh
##.SHIFT REFERENCE= INTERNAL, COFFEE_meoh, 1, 14.96237
##AUDIT TRAIL= $$ (NUMBER, WHEN, WHO, WHERE, PROCESS, VERSION, WHAT)
$$ ##TITLE= Audit trail, TOPSPIN		Version 2.1
$$ ##JCAMPDX= 5.01
$$ ##ORIGIN= Bruker BioSpin GmbH
$$ ##OWNER= Administrator
$$ $$ C:\Bruker\TOPSPIN/data/COFFEE/nmr/AC1244__6608867_OtYWXq1r5D/12/pdata/1/auditp.txt
$$ ##AUDIT TRAIL=  $$ (NUMBER, WHEN, WHO, WHERE, PROCESS, VERSION, WHAT)
(   1,<2012-08-01 17:47:38.187 -0500>,<Administrator>,<TOPSPIN>,<go>,<TOPSPIN 2.1>,
      <created by zg
	started at 2012-08-01 17:36:07.890 -0500,
	POWCHK enabled, PULCHK disabled,
       configuration hash MD5:
       6B 1B 68 BB D9 2E 58 E2 7F 35 AD 54 07 DF 0E 41
       data hash MD5: 64K
       7D B4 F0 46 8D 22 B7 5B E2 49 85 33 1B D0 35 9F>)
(   2,<2012-08-01 17:47:41.265 -0500>,<Administrator>,<TOPSPIN>,<proc1d>,<TOPSPIN 2.1>,
      <Start of raw data processing
       efp LB = 0.3 FT_mod = 6 PKNL = 1 PHC0 = 0 PHC1 = 0 SI = 128K 
       data hash MD5: 128K
       34 D1 7B 27 D0 8A 29 9D 04 9A B2 7D 52 F7 8A F0>)
(   3,<2012-08-01 17:47:42.656 -0500>,<Administrator>,<TOPSPIN>,<proc1d>,<TOPSPIN 2.1>,
      <pk PHC0 = -2.828979 PHC1 = 0 
       data hash MD5: 128K
       84 68 FD 02 82 8E 52 2B ED D6 7E 4A 1B 0A 62 CA>)
(   4,<2012-08-01 17:47:43.484 -0500>,<Administrator>,<TOPSPIN>,<proc1d>,<TOPSPIN 2.1>,
      <abs ABSG = 1 
       data hash MD5: 128K
       00 26 FC 56 18 22 76 2A BB E8 26 04 03 2E 86 5E>)
(   5,<2012-08-01 17:47:43.609 -0500>,<Administrator>,<TOPSPIN>,<proc1d>,<TOPSPIN 2.1>,
      <abs ABSG = 2 
       data hash MD5: 128K
       68 3E 22 98 96 00 FB 9D F4 4A FB 35 DE 24 2F 2F>)
(   6,<2012-08-01 17:47:43.687 -0500>,<Administrator>,<TOPSPIN>,<proc1d>,<TOPSPIN 2.1>,
      <abs ABSG = 3 
       data hash MD5: 128K
       DA 01 1A 0C 01 B4 CC 68 84 F1 E8 FA 17 55 27 DE>)
(   7,<2012-08-01 17:47:43.765 -0500>,<Administrator>,<TOPSPIN>,<proc1d>,<TOPSPIN 2.1>,
      <abs ABSG = 4 
       data hash MD5: 128K
       63 05 90 01 E1 07 FE 72 13 63 E3 9B 7D D4 A5 98>)
(   8,<2012-08-01 17:47:43.812 -0500>,<Administrator>,<TOPSPIN>,<proc1d>,<TOPSPIN 2.1>,
      <abs ABSG = 5 
       data hash MD5: 128K
       16 2E 78 4C F1 66 39 13 6A FD FF 03 99 6E 5D 9F>)
$$ ##END=
$$ 
$$ $$ hash MD5
$$ $$ F5 40 24 20 3D 37 8D CF 5A 16 0C E4 3D FA E1 10
##$RELAX= 
##$RELAX= 
##$RELAX= 
##$RELAX= 
##$RELAX= 
##$RELAX= 
##$RELAX= 
##$RELAX= 
$$ Bruker specific parameters
$$ [...]
##$TP07= 0
##$TPNAME0= <>
##$TPNAME1= <>
##$TPNAME2= <>
##$TPNAME3= <>
##$TPNAME4= <>
##$TPNAME5= <>
##$TPNAME6= <>
##$TPNAME7= <>
##$TPOAL= (0..7)
0.5 0.5 0.5 0.5 0.5 0.5 0.5 0.5
##$TPOFFS= (0..7)
0 0 0 0 0 0 0 0
##$TUNHIN= 0
##$TUNHOUT= 0
##$TUNXOUT= 0
##$USERA1= <user>
##$USERA2= <user>
##$USERA3= <user>
##$USERA4= <user>
##$USERA5= <user>
##$V9= 5
##$VALIST= <valist>
##$VCLIST= <CCCCCCCCCCCCCCC>
##$VD= 0
##$VDLIST= <DDDDDDDDDDDDDDD>
##$VPLIST= <PPPPPPPPPPPPPPP>
##$VTLIST= <TTTTTTTTTTTTTTT>
##$WBST= 1024
##$WBSW= 4
##$XGAIN= (0..3)
0 0 0 0
##$XL= 0
##$YL= 0
##$YMAX_a= 16782765
##$YMIN_a= -10995856
##$ZGOPTNS= <>
##$ZL1= 120
##$ZL2= 120
##$ZL3= 120
##$ZL4= 120
##$ABSF1= 14.96237
##$ABSF2= -5.595812
##$ABSG= 5
##$ABSL= 3
##$ALPHA= 0
##$AQORDER= 0
##$ASSFAC= 0
##$ASSFACI= 0
##$ASSFACX= 0
##$ASSWID= 0
##$AUNMP= <proc_prof1d_extract.lims>
##$AXLEFT= 0
##$AXNAME= <>
##$AXNUC= <1H>
##$AXRIGHT= 0
##$AXTYPE= 0
##$AXUNIT= <>
##$AZFE= 0.1
##$AZFW= 0.1
##$BCFW= 0
##$BC_mod= 0
##$BYTORDP= 0
##$COROFFS= 0
##$CY= 15
##$DATMOD= 1
##$DC= 0
##$DFILT= <>
##$DTYPP= 0
##$F1P= 0
##$F2P= 0
##$FCOR= 0.5
##$FTSIZE= 131072
##$FT_mod= 6
##$GAMMA= 0
##$GB= 0
##$INTBC= 1
##$INTSCL= 1
##$ISEN= 128
##$LB= 0.3
##$LEV0= 0
##$LPBIN= 0
##$MAXI= 10000
##$MC2= 0
##$MEAN= 0
##$ME_mod= 0
##$MI= 0
##$NCOEF= 0
##$NC_proc= -2
##$NLEV= 6
##$NOISF1= 0
##$NOISF2= 0
##$NSP= 0
##$NTH_PI= 0
##$NZP= 0
##$OFFSET= 14.96237
##$PC= 1
##$PHC0= -2.828979
##$PHC1= 0
##$PH_mod= 1
##$PKNL= yes
##$PPARMOD= 0
##$PPDIAG= 0
##$PPIPTYP= 0
##$PPMPNUM= 2147483647
##$PPRESOL= 1
##$PSCAL= 4
##$PSIGN= 0
##$PYNMP= <proc.py>
##$REVERSE= no
##$SF= 400.020009089214
##$SI= 131072
##$SIGF1= 0
##$SIGF2= 0
##$SINO= 400
##$SIOLD= 131072
##$SPECTYP= <>
##$SREGLST= <1H.CDCl3>
##$SSB= 0
##$STSI= 131072
##$STSR= 0
##$SW_p= 8223.68421052631
##$SYMM= 0
##$S_DEV= 0
##$TDeff= 65536
##$TDoff= 0
##$TI= <>
##$TILT= no
##$TM1= 0
##$TM2= 0
##$TOPLEV= 0
##$USERP1= <user>
##$USERP2= <user>
##$USERP3= <user>
##$USERP4= <user>
##$USERP5= <user>
##$WDW= 1
##$XDIM= 131072
##$YMAX_p= 433108738
##$YMIN_p= -12547
##$CURPLOT= <Network HP LaserJet P1505>
##$CURPRIN= <$Network HP LaserJet P1505>
##$DFORMAT= <normdp>
##$LAYOUT= <+/1D_H.xwp>
##$LFORMAT= <normlp>
##$PFORMAT= <normpl>
##$SURQMSG= 1
$$ End of Bruker specific parameters
$$ ---------------------------------
##NTUPLES= NMR SPECTRUM
##VAR_NAME=  FREQUENCY,     SPECTRUM/REAL,   SPECTRUM/IMAG
##SYMBOL=    X,             R,               I
##VAR_TYPE=  INDEPENDENT,   DEPENDENT,       DEPENDENT
##VAR_FORM=  AFFN,          ASDF,            ASDF
##VAR_DIM=   131072,        131072,          131072
##UNITS=     HZ,            ARBITRARY UNITS, ARBITRARY UNITS
##FACTOR=    0.0627417313425164, 1,          1
##FIRST=     8223.62146879497, 2128,         -68026
##LAST=      0,             4200,            -68140
##MIN=       0,             -12547,          0
##MAX=       8223.62146879497, 433108738,    0
$$ Real data points
##PAGE= N=1
##DATA TABLE= (X++(R..R)), XYDATA
$$ [...]
63225F91900K5754K5664K5173K4058K2705K1522K0422J9382J8829J8997J9445
63214I33851J9673J9604J9170J8016J6006J3386J0132N819N00n035j0294j5685
63202A025143k1501k6949l0871l2944l3637l3440l2631l1396k9666k7112k3688
63191G01308j9883j6203j2806r788p238m751j578K277N704P797R018J0468J2426
63178F76751J4264J5483J6221J6791J7294J7668J7806J7634J7235J6787J6256
63167H60190J5359J3966J2339J0820R452P949N873K826j160n415r201j2508j5927
63154H94563j9629k2908k4925k5566k5352k4828k4158k3171k1665j9752j7808
63143F44801j5973j3945j1571r369p984p341o800n999n067m212l510k964k314
$$ y = [691900, 717654, 743318, 768491, 792549, 815254, 836776, 857198, 876580, 895409, 914406, 933851, 953524, 973128, 992298, 1010314, 1026320, 1039706, 1049838, 1055657, 1056157, 1051122, 1040828, 1025143, 1003642, 976693, 945822, 912878, 879241, 845801, 813170, 781774, 752108, 724996, 701308, 681425, 665222, 652416, 642628, 635390, 630639, 629061, 631338, 637042, 644839, 653857, 664325, 676751, 691015, 706498, 722719, 739510, 756804, 774472, 792278, 809912, 827147, 843934, 860190, 875549, 889515, 901854, 912674, 922126, 930075, 935948, 938774, 937614, 932199, 922998, 910490, 894563, 874934, 852026, 827101, 801535, 776183, 751355, 727197, 704026, 682361, 662609, 644801, 628828, 614883, 603312, 593943, 585959, 578618, 571818, 565819, 560752, 556540, 553030, 550066, 547752]
63130E47752j141M14J507J798K158L323M512M511L636L166L199K729J784J739
63116E81087L068M407M567M052L788L632L066K392K206K368K446K564L083L872
63102F26598M513M735M259K859J006k29l96j28j7J14M03M18P5J50J046J909J862
63085F49177J334J229J565J921K600M093N827O662O519O476P215Q338R281J0083
63071G22320J1046J2149J3048J3373J3070J2646J2875J3995J5472J6818J8192
63060H75004J9877K1643K3131K4511K6202K8253L0445L2752L5296L8108M1157
63049A196379M4278M6906M8517M9556N1075N3027N3878N2750N0876M9953M9831
63038A747026M9197M7943M7301M7737M8304M8315M8323M8825M9039M7755M4683
$$ y = [547752, 546611, 547025, 548532, 550330, 552488, 555811, 560323, 564834, 568470, 571636, 574835, 577564, 579348, 581087, 584155, 588562, 593129, 597181, 600969, 604601, 607667, 610059, 612265, 614633, 617079, 619643, 622726, 626598, 631111, 635846, 640105, 642964, 643970, 643741, 643345, 643217, 643200, 643314, 643717, 644135, 644210, 644360, 645406, 647315, 649177, 650511, 651740, 653305, 655226, 657826, 661919, 667746, 674408, 680927, 687403, 694618, 702956, 712237, 722320, 733366, 745515, 758563, 771936, 785006, 797652, 810527, 824522, 839994, 856812, 875004, 894881, 916524, 939655, 964166, 990368, 1018621, 1049066, 1081818, 1117114, 1155222, 1196379, 1240657, 1287563, 1336080, 1385636, 1436711, 1489738, 1543616, 1596366, 1647242, 1697195, 1747026, 1796223, 1844166, 1891467, 1939204, 1987508, 2035823, 2084146, 2132971, 2182010, 2229765, 2274448]
63027B274448M0268L4613K7228J7717O288o269j8926l0850m1771n1846o1014o8605
63015B121281p3697p5815p5225p2561o8336o2861n6585n0199m4124l8090l1630
63004A472158k4912j8608j2966p632k462K146O005R581J3149J6158J8045J9282
62992A489944K0876K3018K4816K5342K4492K2870K1264K0149J9319J8080J6018
62981A726188J3386J0454O736J434n447j2913k0001k6675l3510m0629m7181n1958
62969A519884n4570n5733n6210n5799n3943n1032m8275m6110m3608l9937l5702
62958I78965l2206k9807k7676k4923k1436j7800j4809j2938j1932j1049r852q568
62946G55969p564o899o554o640p081p543p932q566r479j0128j0104r643r101q413
$$ y = [2274448, 2314716, 2349329, 2376557, 2394274, 2400562, 2394293, 2375367, 2344517, 2302746, 2250900, 2189886, 2121281, 2047584, 1971769, 1896544, 1823983, 1755647, 1692786, 1636201, 1586002, 1541878, 1503788, 1472158, 1447246, 1428638, 1415672, 1408040, 1405578, 1407724, 1413729, 1423310, 1436459, 1452617, 1470662, 1489944, 1510820, 1533838, 1558654, 1583996, 1608488, 1631358, 1652622, 1672771, 1692090, 1710170, 1726188, 1739574, 1750028, 1756764, 1758198, 1752751, 1739838, 1719837, 1693162, 1659652, 1619023, 1571842, 1519884, 1465314, 1409581, 1353371, 1297572, 1243629, 1192597, 1144322, 1098212, 1054604, 1014667, 978965, 946759, 916952, 889276, 864353, 842917, 825117, 810308, 797370, 785438, 774389, 764537, 755969, 748405, 741506, 734952, 728312, 721231, 713688, 705756, 697190, 687711, 677583, 667479, 657836, 648735, 640322]
62932F40322p547o860o546o226n612n039m800m568m039l599l570l424k615j669
62918E74208j448j674j368n62l99j373k553k949k746k691k837k583j627l55O52
62903E49695J193J515J918K410K742K734K448K023J560J126O39k17j558k819l289
62888E62120l116l171l692l917l411k919l178l602l092j689n07k08l88m01o2M66
62872E29233R17J008P35N40P84J244J486J485J485J511J464J409J328R12J41l27
62856E45355L4Q34J394J726K133K233J461K77j49M82J332J757J951K064J717Q77
62840E65478L32O63J362J530J156R84J398J940K003J613J310J365J377Q05j90
62825E83126p53l64N40J200J485J741J965J721Q80q1n98n90m01m39q52j434j821
$$ y = [640322, 632775, 625915, 619369, 613143, 607531, 602492, 597692, 593124, 589085, 585486, 581916, 578492, 575877, 574208, 572760, 571086, 569718, 569156, 568757, 567384, 564831, 561882, 559136, 556445, 553608, 551025, 549398, 549043, 549695, 550888, 552403, 554321, 556731, 559473, 562207, 564655, 566678, 568238, 569364, 570003, 569786, 568228, 565409, 562120, 559004, 555833, 552141, 548224, 544813, 541894, 538716, 535114, 532022, 530333, 529826, 529618, 529230, 528829, 528767, 529233, 530150, 531158, 531893, 532433, 533217, 534461, 535947, 537432, 538917, 540428, 541892, 543301, 544629, 545541, 545682, 545355, 545389, 546223, 547617, 549343, 551476, 553709, 555170, 555447, 555298, 555780, 557112, 558869, 560820, 562884, 564601, 565478, 565810, 566473, 567835, 569365, 570521, 571505, 572903, 574843, 576846, 578459, 579769, 581134, 582511, 583316, 583126, 582373, 582009, 582549, 583749, 585234, 586975, 588940, 590661, 591541, 591460, 590862, 590272, 589871, 589432, 588580, 587146, 585325]
62808E85325j881j803j683j315n69L20J097J857K755L628M212M553M939N610O811
62793F13856Q680J0840J2438J3074J3375J4278J6053J8350K0846K3359K5719K8090
62781H18958L1163L5441M0546M5697N0722N5998O1625O7279P2798P8294Q3695
62770A442216Q8532R2243R4400R4646R2628Q7977Q0353O9894N7529M4297L0197
62759B274912J4471k685j9578l4729m8251o0753p1738q0176q6019q9991r2243
62748A703220r2345r0477q7519q3997p9860p5215p0396o5346n9867n4396m9667
62737H94135m5650m1728l7864l4603l1876k8914k5498k2390k0111j8203j6043
62726E71255j3715j1687j0157r098q369p624o512n181m067l131j884l38P91J107
$$ y = [585325, 583444, 581641, 579958, 578643, 578074, 578394, 579491, 581348, 584103, 587731, 591943, 596496, 601435, 607045, 613856, 622536, 633376, 645814, 658888, 672263, 686541, 702594, 720944, 741790, 765149, 790868, 818958, 850121, 885562, 926108, 971805, 1022527, 1078525, 1140150, 1207429, 1280227, 1358521, 1442216, 1530748, 1622991, 1717391, 1812037, 1904665, 1992642, 2072995, 2142889, 2200418, 2244715, 2274912, 2289383, 2286698, 2267120, 2232391, 2184140, 2123387, 2051649, 1971473, 1885454, 1795463, 1703220, 1610875, 1520398, 1432879, 1348882, 1269022, 1193807, 1123411, 1058065, 998198, 943802, 894135, 848485, 806757, 768893, 734290, 702414, 673500, 648002, 625612, 605501, 587298, 571255, 557540, 545853, 535696, 526598, 518229, 510605, 504093, 498912, 494845, 491714, 489830, 489492, 490283, 491390]
62712D91390J190J860L187M614N795O922Q355J0196J2257J4405J6772J9440K1998
62699F18381K3970K5755K8463L2435L6673M0244M3563M7432N1483N4580N6359
62688A059338N7295N7548N6862N5362N3302N0030M4388L6240K6592J6185N005
62677A518147o577j7377k6593l4535m1746m8118n3252n6961n9049n9266n7898
62666A056775n5829n3632n1101m7946m4456m1155l8258l5623l2953k9933k6571
62655E99318k3363k0721j8423j6139j4171j2950j2032j0627r069q566r349j0089
62643D33819r599q174o772n757n067m867n232n651n465m666l867l591l812l994
62629C57305l560k512j531j198j273j219j053j098j117n66L93J003J105J397K303
$$ y = [491390, 492580, 494440, 497627, 502241, 508036, 514958, 523313, 533509, 545766, 560171, 576943, 596383, 618381, 642351, 668106, 696569, 729004, 765677, 805921, 849484, 896916, 948399, 1002979, 1059338, 1116633, 1174181, 1231043, 1286405, 1339707, 1389737, 1434125, 1470365, 1496957, 1513142, 1518147, 1511570, 1494193, 1467600, 1433065, 1391319, 1343201, 1289949, 1232988, 1173939, 1114673, 1056775, 1000946, 947314, 896213, 848267, 803811, 762656, 724398, 688775, 655822, 625889, 599318, 575955, 555234, 536811, 520672, 506501, 493551, 481519, 470892, 461823, 453257, 443908, 433819, 424220, 416046, 409274, 403517, 398450, 393583, 388351, 382700, 377235, 372569, 368702, 365111, 361299, 357305, 353745, 351233, 349702, 348504, 347231, 346012, 344959, 343861, 342744, 342178, 342571, 343574, 344679, 346076, 348379]
62614C48379L416M216M717N184N787O630P622Q319Q458Q516R092R988J0685J1443
62600D52452J2925J4904J6458J7422J8511K0015K1620K3523K6404L0046L3342
62589F87622L6033L9081M2852M6243M8178M8779M8373M6651M3538L9698L5265
62578A162313K9173K0781J1207K059o354j4454k1898k7863l2394l6263l9718m2273
62566A004316m3585m3777m3005m1349l9058l6422l3552l0603k7948k5794k3938
62555F15285k2151k0510j9123j7948j7016j6352j5674j4702j3803j3548j3596
62544D30862j2986j1641j0551j0075r273p488n566m630m536m275l322j901n23
62531C44095K27O3l39J90J798L337M030M362M843N060M776M858O075P820R100
$$ y = [348379, 351795, 356011, 360728, 365912, 371699, 378329, 385951, 394270, 402728, 411244, 420336, 430324, 441009, 452452, 465377, 480281, 496739, 514161, 532672, 552687, 574307, 597830, 624234, 654280, 687622, 723655, 762736, 805588, 851831, 900009, 948788, 997161, 1043812, 1087350, 1127048, 1162313, 1191486, 1212267, 1223474, 1225533, 1219179, 1204725, 1182827, 1154964, 1122570, 1086307, 1046589, 1004316, 960731, 916954, 873949, 832600, 793542, 757120, 723568, 692965, 665017, 639223, 615285, 593134, 572624, 553501, 535553, 518537, 502185, 486511, 471809, 458006, 444458, 430862, 417876, 406235, 395684, 385609, 376336, 368848, 363282, 358652, 354116, 349841, 346519, 344618, 344095, 344322, 344385, 344046, 344236, 346034, 349371, 353401, 357763, 362606, 367666, 372442, 377300, 383375, 391195, 400295]
62516D00295J0041J1427J3343J5311J7163J8918K0416K1945K4508K8392L2111
62505F13870L3918L3889L3418L3067L2032K9604K6010K1823J7272J2234O408l19
62493H93226p303j3351j7879k1353k4250k6415k7785k8807k9425k8704k6414k3967
62481F17573k2663k1890k0325j8023j5971j4298j2465j0672r501q453o429l582
62469D53301j304l65k44l10l87j61P53K058L041L676M437N252N599N632O078O966
62453D94022P532P349O700N950N530O222Q258J0266J0502R061P510O315M263P70
62439E90250k878n330o884q563j0566j2458j4034j5110j5177j4095j2644j1637
62427D60874j0959r961q461o800n303m105l183k229q63P45J937K546L238M517
$$ y = [400295, 410336, 421763, 435106, 450417, 467580, 486498, 506914, 528859, 553367, 581759, 613870, 647788, 681677, 715095, 748162, 780194, 809798, 835808, 857631, 874903, 887137, 893545, 893226, 885923, 872572, 854693, 833340, 809090, 782675, 754890, 726083, 696658, 667954, 641540, 617573, 594910, 573020, 552695, 534672, 518701, 504403, 491938, 481266, 471765, 463312, 456883, 453301, 451997, 451632, 451388, 451078, 450691, 450530, 451283, 453341, 456382, 460058, 464495, 469747, 475346, 480978, 487056, 494022, 501554, 508903, 515603, 521553, 527083, 533305, 541563, 551829, 562331, 571392, 578902, 585217, 589480, 590250, 587372, 582042, 575158, 566595, 556029, 543571, 529537, 514427, 499250, 485155, 472511, 460874, 449915, 439954, 431493, 424693, 419390, 415285, 412102, 409873, 409010, 409755, 411692, 414238, 417476, 421993]
62413D21993N881O506O352O095O199O571O980P356P635P641P300O833O623O777
62399E16742O839O139M589K875J661Q04l20j930l646m971n678n860n942o416p218
62384D97668p602o998n751m576l592k411r00P35K432M300O385Q829J1911J5412
62370E15842J8358K0128K1511K3769K7006L0363L3617L7412M1863M6034M9125
62359H65028N1326N3160N4633N5327N4692N2061M6976L9769L1318K2163J2482
62348A338935K885n584j2532j8548k4187k9190l3062l5805l7771l9284m0582m1564
62336A023711m1429l9330l5695l2148k9671k7516k4599k1338j9220j8862j9292
62325G14611j9233j8381j7188j5905j4331j2278r950p692n636l771k206j024k2
$$ y = [421993, 427874, 434380, 440732, 446827, 453026, 459597, 466577, 473933, 481568, 489209, 496509, 503342, 509965, 516742, 523581, 529720, 534309, 537184, 538845, 539649, 539329, 537399, 533753, 528782, 523104, 517244, 511302, 504886, 497668, 490066, 483068, 477317, 472741, 469149, 466738, 465838, 466573, 469005, 473305, 479690, 488519, 500430, 515842, 534200, 554328, 575839, 599608, 626614, 656977, 690594, 728006, 769869, 815903, 865028, 916354, 969514, 1024147, 1079474, 1134166, 1186227, 1233203, 1272972, 1304290, 1326453, 1338935, 1341820, 1336236, 1323704, 1305156, 1280969, 1251779, 1218717, 1182912, 1145141, 1105857, 1065275, 1023711, 982282, 942952, 907257, 875109, 845438, 817922, 793323, 771985, 752765, 733903, 714611, 695378, 676997, 659809, 643904, 629573, 617295, 607345, 599653, 594017, 590246, 588040, 587016, 586994]
62312E86994R62J494R33m89j630j928k219l435n063n865n698n588o075o496o182
62297E39715n458n054n096n146m835m199l557l198l021k489j284J28R87J272J765
62282E00530L073M963O723P803Q123Q100Q431R480J0835J1736J1873J1605J1580
62269F14855J2359J4162J6570J8748K0363K2049K4568K7862L1474L5442M0026
62258H78478M4811M8950N2234N5032N7139N7436N4976M9871M2798L4199K4249
62247A400173J3352K419p440j5621k2502k8910l4946l9812m2998m4988m6247m6276
62235A086204m4387m0985l7143l3358k9520k5758k2363j9137j5815j2835j0721
62224G94182q954o578l787j727p77k04L95N47O0m39n47o79j158j539j372q68l79
$$ y = [586994, 587956, 589450, 590383, 589894, 588264, 586336, 584117, 580682, 575619, 569754, 564056, 558468, 552393, 545897, 539715, 534257, 529203, 524107, 518961, 514126, 509927, 506370, 503172, 500151, 497662, 496378, 496506, 497493, 498765, 500530, 503603, 508566, 515289, 523092, 531215, 539315, 547746, 557226, 568061, 579797, 591670, 603275, 614855, 627214, 641376, 657946, 676694, 697057, 719106, 743674, 771536, 803010, 838452, 878478, 923289, 972239, 1024473, 1079505, 1136644, 1194080, 1249056, 1298927, 1341725, 1375924, 1400173, 1413525, 1415944, 1408504, 1392883, 1370381, 1341471, 1306525, 1266713, 1223715, 1178727, 1132480, 1086204, 1041817, 1000832, 963689, 930331, 900811, 875053, 852690, 833553, 817738, 804903, 794182, 785228, 778650, 774863, 773136, 772359, 772155, 772550, 773097, 773157, 772718, 772171, 771492, 770334, 768795, 767423, 766555, 766176]
62207G66176K28J251K646M088N236N937O555P877J0102J2245J3434J4429J6725
62194H66929K0368K3990K7056L0480L4676L8448M0631M1527M1873M1359L9187
62183A246524L5294L0108K3766J6537R452L573j061m981q032r351q463n766k056
62170A325544K035O228J0655J5612K0932K5708K8956L0380L0288K8949K6364K2539
62158A574190J7837J3023Q973O073L873J524j366m364o634p616p493p137p323
62145A583560p777p373n607l296j402K89K530N201P388Q600R047Q987Q660Q576
62131A617383R042R587R736J0055J1455J3755J5933J7592J9009K0050K0302K0209
62119A794108K0739K1891K2828K3450K4474K5857K6634K6549K6409K6522K6251
$$ y = [766176, 766404, 767655, 770301, 774389, 779625, 785562, 792117, 799994, 810096, 822341, 835775, 850204, 866929, 887297, 911287, 938343, 968823, 1003499, 1041947, 1082578, 1124105, 1165978, 1207337, 1246524, 1281818, 1311926, 1335692, 1352229, 1361681, 1365254, 1364193, 1359212, 1351180, 1341829, 1333366, 1327600, 1325544, 1327579, 1333807, 1344462, 1360074, 1381006, 1406714, 1435670, 1466050, 1496338, 1525287, 1551651, 1574190, 1592027, 1605050, 1614023, 1620096, 1623969, 1625493, 1624127, 1619763, 1613129, 1605513, 1598020, 1590883, 1583560, 1575783, 1568410, 1562803, 1559507, 1558105, 1558394, 1560924, 1566125, 1573513, 1582113, 1591160, 1600147, 1608807, 1617383, 1626425, 1636012, 1645748, 1655803, 1667258, 1681013, 1696946, 1714538, 1733547, 1753597, 1773899, 1794108, 1814847, 1836738, 1859566, 1883016, 1907490, 1933347, 1959981, 1986530, 2012939, 2039461, 2065712]
62108B065712K5567K5514K6490K7488K7790K8102K9239L0797L2058L3202L4835
62097B386794L7104L9907M3127M6164M8182M9232N0095N0651M9808M7673M6356
62086B895093M7615N0937N4815N8714O2613O5758O7211O6889O4963O1040N5079
62075C550727M8369M2450L7663L3675L0706K9086K8294K7545K6827K6363K5613
62064C907318K3852K1203J8070J4079Q719K624k894p299j0966j4153j6872j9453
62052C924228k2318k5317k8039l0490l2800l4582l5364l5378l5212l4881l3942
62041C575905l2237k9958k7238k4232k1262j8411j5387j2253r756q399p668o704
62029C362400n271l570j855p47j168l152n390o663p139p674q517r498j0663j1857
$$ y = [2065712, 2091279, 2116793, 2143283, 2170771, 2198561, 2226663, 2255902, 2286699, 2318757, 2351959, 2386794, 2423898, 2463805, 2506932, 2553096, 2601278, 2650510, 2700605, 2751256, 2801064, 2848737, 2895093, 2942708, 2993645, 3048460, 3107174, 3169787, 3235545, 3302756, 3369645, 3434608, 3495648, 3550727, 3599096, 3641546, 3679209, 3712884, 3743590, 3772676, 3800970, 3828515, 3855342, 3881705, 3907318, 3931170, 3952373, 3970443, 3984522, 3993241, 3995865, 3992971, 3985672, 3974706, 3960553, 3943681, 3924228, 3901910, 3876593, 3848554, 3818064, 3785264, 3750682, 3715318, 3679940, 3644728, 3609847, 3575905, 3543668, 3513710, 3486472, 3462240, 3440978, 3422567, 3407180, 3394927, 3385171, 3376772, 3369104, 3362400, 3357129, 3353559, 3351704, 3350957, 3349789, 3346637, 3341247, 3334584, 3327445, 3319771, 3311254, 3301756, 3291093, 3279236]
62015C279236j2393j2062j1813j2458j3434j3772j3650j3776j3845j2861j0673
62004C138499q043n394k568L02K632L996M214K991P8m516j0932j9418k9284l8642
61990C033915m6028n1626n6099n9076n9910n9065n7475n5089n1437m7126m3397
61979B447587m0434l7476l4402l1896l0104k8329k6172k3925k1846j9978j8540
61968B134485j7763j7406j7150j7115j7235j6747j5277j3867j3658j4060j3569
61957A960638j2016j0604r897r246q130o754n225l434j723m28J136L941P542J0523
61943A916323J2631J5012J8094K0814K2387K3450K4867K6612K8405L0343L2263
61932B171201L3523L4031L4564L5557L6461L6913L7628L9359M1829M4498M7807
$$ y = [3279236, 3266843, 3254781, 3242968, 3230510, 3217076, 3203304, 3189654, 3175878, 3162033, 3149172, 3138499, 3130456, 3125062, 3122494, 3122796, 3125428, 3129424, 3133638, 3136629, 3136707, 3132191, 3121259, 3101841, 3072557, 3033915, 2987887, 2936261, 2880162, 2821086, 2761176, 2702111, 2644636, 2589547, 2538110, 2490984, 2447587, 2407153, 2369677, 2335275, 2303379, 2273275, 2244946, 2218774, 2194849, 2173003, 2153025, 2134485, 2116722, 2099316, 2082166, 2065051, 2047816, 2031069, 2015792, 2001925, 1988267, 1974207, 1960638, 1948622, 1938018, 1928121, 1918875, 1910745, 1903991, 1898766, 1895332, 1893609, 1893181, 1894317, 1898258, 1905800, 1916323, 1928954, 1943966, 1962060, 1982874, 2005261, 2028711, 2053578, 2080190, 2108595, 2138938, 2171201, 2204724, 2238755, 2273319, 2308876, 2345337, 2382250, 2419878, 2459237, 2501066, 2545564, 2593371]
61921B593371N2835O0064O9163P9778R1964J05968J21963J39968J59873J81721
61911C656668K05955K33228K63940K98325L36911L80499M29614M84281N44087
61902F833508O07796O72645P33850P84441Q15227Q15719P76435O91443N59879
61893A3290943L86859J84307k9919k36078m17693n64303o71355p39266p72373
61884A0431122p77028p59534p25639o80970o30566n77712n24166m71636m22110
61875D861761l76715l35234k97150k62572k31817k04813j81206j60654j42709
61866B668891j26756j12219r8715q6143p4797o4948n6082m7031l7356k7981j9926
61855A916937j3047o774j246L254P320J1609J5472J7615J7844J7048J5653J3314
$$ y = [2593371, 2646206, 2706270, 2775433, 2855211, 2947175, 3053143, 3175106, 3315074, 3474947, 3656668, 3862623, 4095851, 4359791, 4658116, 4995027, 5375526, 5805140, 6289421, 6833508, 7441304, 8113949, 8847799, 9632240, 10447467, 11263186, 12039621, 12731064, 13290943, 13677802, 13862109, 13832190, 13596112, 13178419, 12614116, 11942761, 11203495, 10431122, 9654094, 8894560, 8168921, 7487951, 6857385, 6279673, 5755507, 5283871, 4861761, 4485046, 4149812, 3852662, 3590090, 3358273, 3153460, 2972254, 2811600, 2668891, 2542135, 2429916, 2331201, 2245058, 2170261, 2105313, 2049231, 2002200, 1964844, 1936863, 1916937, 1903890, 1897116, 1895870, 1899124, 1906444, 1918053, 1933525, 1951140, 1968984, 1986032, 2001685, 2014999]
61843B014999R920N788J055l938p897r500q996p777o514m785k268R15M767Q987
61829A994756J2226J3288J2780J2096J0940P714K365l123p428j1189j5066j8292
61817B011067j9980k0378j9944j8491j6013j3138j0072o161j138M362J0019J6230
61805A916363K2769K8512L3266L8450M4993N1892N7937O3632P0111P7304Q4505
61794B489734R1968J00546J10271J20565J31485J43729J57658J73254J90846K11092
61784C921148K34424K61102K91684L26948L67669M14745M69204N31820O03181
61775G421925O84246P76080Q78597R89917J106782J224143J333406J421546J472549
61766A7309191J469691J397532J244859J009187P00165L39357m3291m14775p45338
$$ y = [2014999, 2024919, 2030707, 2031762, 2027824, 2019927, 2010427, 2001431, 1993654, 1987140, 1982355, 1980087, 1981002, 1985769, 1994756, 2006982, 2020270, 2033050, 2045146, 2056086, 2063800, 2066165, 2063042, 2055614, 2044425, 2029359, 2011067, 1991087, 1970709, 1950765, 1932274, 1916261, 1903123, 1893051, 1886890, 1885752, 1890114, 1900133, 1916363, 1939132, 1967644, 2000910, 2039360, 2084353, 2136245, 2194182, 2257814, 2327925, 2405229, 2489734, 2581702, 2682248, 2792519, 2913084, 3044569, 3188298, 3345956, 3519210, 3710056, 3921148, 4155572, 4416674, 4708358, 5035306, 5402975, 5817720, 6286924, 6818744, 7421925, 8106171, 8882251, 9760848, 10750765, 11857547, 13081690, 14415096, 15836642, 17309191, 18778882, 20176414, 21421273, 22430460, 23130625, 23469982, 23426691, 23011916, 22266578]
61757B2266578j014107j211153j335742j393831j396542j357836j290702j204776
61749A2061889j107429j005631r05447q10535p22445o42051n69817n05266m47526
61740E345742l96315l51698l13068k79210k49215k22639j98926j77368j57646
61731B999657j39906j24291j10700r8931q8829q0429p3904o9117o5304o1723n8580
61720B027943n6588n5661n4887n3830n2799n1622m9306m5412m0869l6766l3313
61709A496890l0388k8127k6296k4095k1319j8881j7486j6686j5956j5703j6242
61698A265711j6752j6282j5154j4292j3810j3256j2684j2475j2541j2687j3196
61687A112582j4138j4601j3705j1982j0786j0679j1266j2167j3046j3153j1958
$$ y = [22266578, 21252471, 20041318, 18705576, 17311745, 15915203, 14557367, 13266665, 12061889, 10954460, 9948829, 9043382, 8232847, 7510402, 6868351, 6298534, 5793268, 5345742, 4949427, 4597729, 4284661, 4005451, 3756236, 3533597, 3334671, 3157303, 2999657, 2859751, 2735460, 2624760, 2525829, 2437000, 2356571, 2282667, 2213550, 2148246, 2086523, 2027943, 1971355, 1915694, 1860807, 1806977, 1754178, 1702556, 1653250, 1607838, 1566969, 1530203, 1496890, 1466502, 1438375, 1412079, 1387984, 1366665, 1347784, 1330298, 1313612, 1297656, 1281953, 1265711, 1248959, 1232677, 1217523, 1203231, 1189421, 1176165, 1163481, 1151006, 1138465, 1125778, 1112582, 1098444, 1083843, 1070138, 1058156, 1047370, 1036691, 1025425, 1013258, 1000212, 987059, 975101]
61676I75101j0182r123r015q999q532p935p469o933o275n823n653n396m852m276
61662H74638l887l582l215k783k275j603p54J97J179K029K507K648K879L514M387
61647H75879N136N588N658N251M560L993L575K791J419O8n18l59RL55R87K295
61631I16687M351O719Q610R505R677R631R129P379M210L35l623p588j1310j4085
61617I49627j5548j6050j5953j5314j4415j3730j3069j1752r911q603q204p842
61605G99236o919o029n703n465m869m416m517m557l945l120k643k197j437q43
61591G42576p34l58Q53K125K558K651L324M352N045N716O978Q346R039R617J1174
61576H13262J3334J4715J5130J5736J7100J8666K0133K1942K4191K6365K8295
$$ y = [975101, 964919, 955796, 946781, 937782, 929250, 921315, 913846, 906913, 900638, 894815, 889162, 883766, 878914, 874638, 870751, 867169, 863954, 861171, 858896, 857293, 856539, 856736, 857915, 859944, 862451, 865099, 867978, 871492, 875879, 881015, 886603, 892261, 897512, 902072, 906065, 909640, 912431, 913850, 913918, 913400, 913041, 913050, 913405, 914392, 916687, 921038, 927757, 936367, 945872, 955549, 965180, 974309, 981688, 985898, 986233, 982610, 975022, 963712, 949627, 934079, 918029, 902076, 886762, 872347, 858617, 845548, 833796, 823885, 815282, 807078, 799236, 792317, 786288, 780585, 775120, 770251, 765835, 761318, 756761, 752816, 749696, 747053, 744856, 743419, 742576, 741842, 741484, 742337, 744462, 747020, 749671, 752995, 757347, 762392, 768108, 775086, 783432, 792471, 802088, 813262, 826596, 841311, 856441, 872177, 889277, 907943, 928076, 950018, 974209, 1000574, 1028869]
61565A028869L0208L1763L2216L1698L1164L0888L0102K8420K6555K5346K4920
61554A352149K5083K5542K5572K4350K2072J9924J8582J7448J5655J3083R970
61543A569430O213J635l405q140j2064j5196j7826k0035k1501k1791k0945j9521
61531A416854j7968j6284j4364j2206r571o073k000J586M187O705J0340J5074
61519A376280K0018K4769K9690L5109M1001M7356N4328O2106P0975Q1185R2553
61508A935370J04661J17719J32498J49164J66962J85525K05403K26585K47384
61499C471271K65602K79719K88001K87471K75300K50754K14852J69034J15560
61490E617564N8482K481m9277r5187j33797j63825j85265j99027k05582k05185
$$ y = [1028869, 1059077, 1090840, 1123056, 1154754, 1185918, 1216806, 1246908, 1275328, 1301883, 1327229, 1352149, 1377232, 1402774, 1428346, 1452696, 1474768, 1494692, 1513274, 1530722, 1546377, 1559460, 1569430, 1575643, 1577278, 1573873, 1565733, 1553669, 1538473, 1520647, 1500612, 1479111, 1457320, 1436375, 1416854, 1398886, 1382602, 1368238, 1356032, 1346461, 1340388, 1338388, 1339974, 1344161, 1350866, 1361206, 1376280, 1396298, 1421067, 1450757, 1485866, 1526867, 1574223, 1628551, 1690657, 1761632, 1842817, 1935370, 2040031, 2157750, 2290248, 2439412, 2606374, 2791899, 2997302, 3223887, 3471271, 3736873, 4016592, 4304593, 4592064, 4867364, 5118118, 5332970, 5502004, 5617564, 5676046, 5678527, 5629250, 5534063, 5400266, 5236441, 5051176, 4852149, 4646567, 4441382]
61480D441382j99172j89633j77811j63924j48405j32182j15861r9690q4157o9616
61470C060931n5588m1594k8260j6409n516N456J6136K5242L2820M0097M7140N2461
61458C132916N5298N6569N7078N6408N4318N1750M9600M7651M5624M4207M4206
61447C695625M5350M6774M8153M9753N1814N4262N6653N8194N8273N7063N5041
61436D276955N2012M7313M0971L3786K6159J7739Q375j374j0892j9975k8502l6287
61424D406280m3314m9443n3953n6140n6333n5448n3656n0347m5390l9441l2908
61413C869907k5662j8013j0957n204p05K660M707N489N442M767L244P28k709p061
61399C826633j2080j6824k0187k1745k1451j8848j3585o319K040J1793K3996L8702
$$ y = [4441382, 4242210, 4052577, 3874766, 3710842, 3562437, 3430255, 3314394, 3214704, 3130547, 3060931, 3005343, 2963749, 2935489, 2919080, 2913564, 2919020, 2935156, 2960398, 2993218, 3033315, 3080455, 3132916, 3188214, 3244783, 3301861, 3358269, 3412587, 3464337, 3513937, 3561588, 3607212, 3651419, 3695625, 3740975, 3787749, 3835902, 3885655, 3937469, 3991731, 4048384, 4106578, 4164851, 4221914, 4276955, 4328967, 4376280, 4417251, 4451037, 4477196, 4494935, 4503310, 4501936, 4491044, 4471069, 4442567, 4406280, 4362966, 4313523, 4259570, 4203430, 4147097, 4091649, 4037993, 3987646, 3942256, 3902815, 3869907, 3844245, 3826232, 3815275, 3810071, 3809366, 3812026, 3816733, 3822222, 3827664, 3832431, 3835675, 3836403, 3833694, 3826633, 3814553, 3797729, 3777542, 3755797, 3734346, 3715498, 3701913, 3695594, 3697634, 3709427, 3733423, 3772125]
61387C772125N4891P2157R1151J12219J34768J58216J82457K07211K31783K55539
61377E272517K77564K95833L07735L11471L05935K89522K60611K19641J69598
61368G710427J14324N7282J749m9496r5215j35445j70077j98812k22288k41696
61358F770753k56969k66914k71258k71132k67223k59273k47852k34940k21884
61349D473308k08287j93653j78742j64387j50311j36118j22242j09044r5995q2665
61339C031864o9514n6969m4745l2811k1908j2279k959O805J6380K4889L2422L9200
61327B910375M4555M7799M9394N0274N0681N0436M9543M7808M4640M0113L5493
61316C421111L1870K9031K6483K4658K4081K4043K3293K1543J9333J6814J3545
$$ y = [3772125, 3827016, 3899173, 3990324, 4102543, 4237311, 4395527, 4577984, 4785195, 5016978, 5272517, 5550081, 5845914, 6153649, 6465120, 6771055, 7060577, 7321188, 7540829, 7710427, 7824751, 7882033, 7883782, 7834286, 7739071, 7603626, 7433549, 7234737, 7012449, 6770753, 6513784, 6246870, 5975612, 5704480, 5437257, 5177984, 4930132, 4695192, 4473308, 4265021, 4071368, 3892626, 3728239, 3577928, 3441810, 3319568, 3210524, 3114529, 3031864, 2962350, 2905381, 2860636, 2827825, 2805917, 2793638, 2790679, 2797484, 2813864, 2838753, 2871175, 2910375, 2954930, 3002729, 3052123, 3102397, 3153078, 3203514, 3253057, 3300865, 3345505, 3385618, 3421111, 3452981, 3482012, 3508495, 3533153, 3557234, 3581277, 3604570, 3626113, 3645446, 3662260, 3675805]
61305C675805R223L870k473r543j6637k3175k9200l4982m0508m5735n0762n5327
61293C380556n8713o0621o1575o2074o1894o0606n8193n4724n0068m4382l8305
61282B769401l2247k6120k0074j4803j0682p316m386k297j504j862l003m732o643
61269B633732q069q699q727q226p076n674m767m332l506j832M16L309P517J3244
61255B597310K0083K8198L8416N0715O3932P7359R1321J05590J18719J29582J38059
61244C459284J43331J43029J35177J19654R6852O6513K9358j1369n1572q8680
61234D041577j21130j46833j64091j73369j76579j74939j68931j59760j49205
61225B606740j38122j26386j14209j02365r1293q0976p1611o3441n6057m8806
$$ y = [3675805, 3685028, 3688898, 3686425, 3676882, 3660245, 3637070, 3607870, 3572888, 3532380, 3486645, 3435883, 3380556, 3321843, 3261222, 3199647, 3137573, 3075679, 3015073, 2956880, 2902156, 2852088, 2807706, 2769401, 2737154, 2711034, 2690960, 2676157, 2665475, 2658159, 2653773, 2651476, 2649972, 2648110, 2645107, 2640375, 2633732, 2625663, 2616964, 2608237, 2600011, 2592935, 2587261, 2582494, 2578162, 2574656, 2572824, 2573240, 2576549, 2584066, 2597310, 2617393, 2645591, 2684007, 2734722, 2798654, 2876013, 2967334, 3072924, 3191643, 3321225, 3459284, 3602615, 3745644, 3880821, 4000475, 4097327, 4163840, 4193198, 4181829, 4130257, 4041577, 3920447, 3773614, 3609523, 3436154, 3259575, 3084636, 2915705, 2755945, 2606740, 2468618, 2342232, 2228023, 2125658, 2034365, 1953389, 1881778, 1818337, 1762280, 1713474]
61215A713474m1847l6012l1646k8216k4938k1304j7220j3038r189n460j094L975
61203A487485Q708J2215J4787J7123J9245K0756K1509K1404K0093J7550J4271
61192A675146J0509O063J357k296m283n635p605j0114j2440j4591j6958j9386
61180A599767k1508k3494k5498k6998k7533k7597k7911k8406k8644k8671k8749
61169A304758k8732k8463k8204k8079k7754k7191k6950k7169k7108k6335k5434
61158A003339k4834k3914k2067j9713j7446j5226j3201j2201j2528j3329j4063
61147H14817j5346j7321j8620j8247j7268j7052j6943j5428j2694j0252q621p054
61135F39971n158l198j227P48K167K777L600N610P963Q960Q406P658P698Q458
$$ y = [1713474, 1671627, 1635615, 1603969, 1575753, 1550815, 1529511, 1512291, 1499253, 1490064, 1484604, 1483510, 1487485, 1496193, 1508408, 1523195, 1540318, 1559563, 1580319, 1601828, 1623232, 1643325, 1660875, 1675146, 1685655, 1691718, 1693075, 1690779, 1686496, 1680861, 1673256, 1663142, 1650702, 1636111, 1619153, 1599767, 1578259, 1554765, 1529267, 1502269, 1474736, 1447139, 1419228, 1390822, 1362178, 1333507, 1304758, 1276026, 1247563, 1219359, 1191280, 1163526, 1136335, 1109385, 1082216, 1055108, 1028773, 1003339, 978505, 954591, 932524, 912811, 895365, 880139, 866938, 854737, 842209, 828880, 814817, 799471, 782150, 763530, 745283, 728015, 710963, 694020, 678592, 665898, 655646, 647025, 639971, 634813, 631615, 630388, 631136, 633303, 636080, 639680, 645290, 653253, 662213, 670619, 678277, 685975, 694433]
61121F94433R708J1225J2295J2282J1595J1092J0831J0420J0069J0250J0773J1185
61109H26158J1604J2043J1558R357O206L509J448p66l322n741p827r487j0137
61096H44603r520q688q827r625j0013r993j0396j1308j2123j2748j3474j4003
61084G13885j3826j3189j2570j1674j0168q770q338q428p982o870n518l789j599
61071F01164J13N49N13J162K121K399K413L192M217M106L062K601L026L113K356
61056F36107J672J711J980J897J472Q73L74N66J578K515K676K676L271L931L986
61041F67285M220N649P581Q677R142J0006J1052J1415J1538J2434J3677J4180
61029G86856J4314J5088J5924J5533J4452J4226J4589J3986J2577J2086J2768
$$ y = [694433, 704141, 715366, 727661, 739943, 751538, 762630, 773461, 783881, 793950, 804200, 814973, 826158, 837762, 849805, 861363, 870720, 876926, 880435, 881883, 881117, 877795, 872054, 864227, 854740, 844603, 835083, 826395, 817568, 807943, 797930, 787937, 777541, 766233, 754110, 741362, 727888, 713885, 700059, 686870, 674300, 662626, 652458, 643688, 635350, 626922, 618940, 612070, 606552, 602763, 601164, 601277, 601826, 602339, 603501, 605622, 608021, 610434, 613626, 617843, 621949, 625011, 627612, 630638, 633751, 636107, 637779, 639490, 641470, 643367, 644839, 645712, 646086, 646652, 648230, 650745, 653421, 656097, 659368, 663299, 667285, 671505, 677154, 684735, 693412, 702554, 712560, 723612, 735027, 746565, 758999, 772676, 786856, 801170, 816258, 832182, 847715, 862167, 876393, 890982, 904968, 917545, 929631, 942399]
61018I42399J3104J2586J2351J2992J3998J5405J7741K0369K2120K3554K6333
61007A132952L0577L4960L9119M3509M7425M9799N1588N4625N8596O2183O6533
60996A671866P4167Q4742R5569J06145J18303J31936J44822J57089J71785J90686
60986B947110K14079K44940K88140L44591M11870M92048N93210P22244Q84305
60977G142537J092228J364809J703857K074440K412049K641608K682908K458130
60969B3572566J937051J201815M53449q2175k83352j84063Q3306L74221N62916
60960B7635734N32013J95558m31181j196847j882767k328805k502793k466946
60952A7553966k302816k071499j815759j566265j338127j132936r49721p90156
$$ y = [942399, 955503, 968089, 980440, 993432, 1007430, 1022835, 1040576, 1060945, 1083065, 1106619, 1132952, 1163529, 1198489, 1237608, 1281117, 1328542, 1378341, 1429929, 1484554, 1543150, 1605333, 1671866, 1746033, 1830775, 1926344, 2032489, 2150792, 2282728, 2427550, 2584639, 2756424, 2947110, 3161189, 3406129, 3694269, 4038860, 4450730, 4942778, 5535988, 6258232, 7142537, 8234765, 9599574, 11303431, 13377871, 15789920, 18431528, 21114436, 23572566, 25509617, 26711432, 27164881, 27082706, 26799354, 26615291, 26698597, 27072818, 27635734, 28167747, 28363305, 27932124, 26735277, 24852510, 22523705, 20020912, 17553966, 15251150, 13179651, 11363892, 9797627, 8459500, 7326564, 6376843, 5586687]
60944E586687o54223n38557m41238l63251l03740k58137k22277j94630j73526
60935B437108j55986j40569j28035j18028j08109r7198q7028p8927p1866o4961
60925A386401n9356n6119n4319n2562n0687m8777m6163m2588l8940l5844l2796
60914H68250k9427k6324k3863k1476j8733j6045j3776j1768j0135r351r182q696
60902F69474p579o388n306l918k408j606j508j043K88J704K497K939L488M084
60888F54718M561M826M442L007J117p2m04q36j974l494n051o647p963q501q526
60873F29203q815r351r321q469p369o284m904l350k268j774j338q28m44K27J886
60858E66801M079N479N846O361P691R098R874J0419J1307J2410J3461J4548J5605
$$ y = [5586687, 4932464, 4393907, 3952669, 3589418, 3285678, 3027541, 2805264, 2610634, 2437108, 2281122, 2140553, 2012518, 1894490, 1786381, 1689183, 1602155, 1523228, 1451362, 1386401, 1327045, 1270926, 1216607, 1164045, 1113358, 1064581, 1018418, 975830, 936890, 901046, 868250, 838823, 812499, 788636, 767160, 748427, 732382, 718606, 706838, 696703, 687352, 678170, 669474, 661895, 655507, 650201, 646283, 643875, 642269, 640761, 639718, 640006, 641710, 644207, 647146, 650634, 654718, 659279, 664105, 668547, 671554, 672671, 672599, 672195, 671359, 669385, 665891, 660840, 654193, 646230, 637729, 629203, 620388, 611037, 601716, 593247, 585878, 579594, 574690, 571340, 569072, 567298, 565960, 565132, 564688, 564915, 566801, 570880, 576359, 582205, 588566, 596257, 605355, 615229, 625648, 636955, 649365, 662826, 677374, 692979]
60845F92979J6370J7190J8742K0651K1452K0408J8194J5491J2140Q342N325L855
60833H71139L150K214J354J327J695J137r09l751o272p637p582o743o364p064
60819H35694q142q627q588q819r617j0571j1440j2369j3210j3265j2148j0434
60807G08464r093q374p614o256m637l501k966k468j706r97n45M2J126K428L522
60792F67425M443N416O375P351Q834J1011J3043J3909J3799J3850J4545J5138
60780G95139J4758J3443J1914J0747R998R410Q854Q518Q492Q307P417O136N411
60767I18544N421N321M730M449M910N008L546J130o32j331j897k900l917m459
60753I37923m448l911l133k899l630m510m426l579l081l222l364l426m109n544
$$ y = [692979, 709349, 726539, 745281, 765932, 787384, 807792, 825986, 841477, 853617, 861959, 867284, 871139, 874289, 876503, 877857, 879184, 880879, 882016, 881107, 877356, 871084, 863447, 855865, 849122, 842758, 835694, 827552, 818925, 810337, 801518, 791901, 781330, 769890, 757521, 744311, 731046, 718898, 708464, 699371, 690997, 683383, 677127, 672490, 668989, 666023, 663555, 661849, 660852, 660307, 660349, 661475, 663903, 667425, 671868, 677284, 683659, 691010, 699844, 710855, 723898, 737807, 751606, 765456, 780001, 795139, 809897, 823340, 835254, 846001, 855999, 865409, 874263, 882781, 891273, 899580, 906997, 913133, 918544, 923965, 929286, 934016, 938465, 943375, 948383, 951929, 953059, 952427, 951096, 949199, 946299, 942382, 937923, 933475, 929564, 926431, 923532, 919902, 915392, 910966, 907387, 904306, 901084, 897720, 894294, 890185, 884641]
60739H84641o861p439p489p235o494n418m656m425m214l731l296l018k342r15
60725H17108P39J798J976J530Q74L41j4m03p76n38O25J860J890O17q00j460j573
60708H23794j745k128k568k919l060k953k839k989l407m061n148o609p744q016
60694G67608p941q430r525j0530j1165j1647j1868j1437j0503r658r076q553q228
60681F39047q366q451p591n864m322l535l036k309j450n81M88J732K764L530M471
60666F06527N801P110P848P807P090O039N169M693M314L872L744M040M027L225
60652F81306K470K807L840M494N018O559Q858J0024R042P122N973N946O380O753
60638G66592O864O705O690P377Q618R673J0280J0897J1690J2160J2008J1532J0915
$$ y = [884641, 877780, 870341, 862852, 855617, 849123, 843705, 839049, 834624, 830410, 826679, 823383, 820365, 818023, 817108, 817847, 819645, 821621, 823151, 824025, 824366, 824352, 823949, 823173, 822635, 823260, 825120, 827010, 827627, 826827, 825367, 823794, 822049, 819921, 817353, 814434, 811374, 808421, 805582, 802593, 799186, 795125, 789977, 783368, 775624, 767608, 759667, 751237, 741712, 731182, 720017, 708370, 696502, 685065, 674562, 664904, 655828, 647275, 639047, 630681, 622230, 614639, 608775, 604453, 600918, 597882, 595573, 594123, 593542, 594030, 595762, 598526, 602056, 606527, 612328, 619438, 627286, 635093, 642183, 648222, 653391, 658084, 662398, 666270, 670014, 674054, 678081, 681306, 683776, 686583, 690423, 694917, 699935, 706494, 715352, 725376, 734418, 741540, 747513, 753459, 759839, 766592, 773456, 780161, 786851, 794228, 802846, 812519, 822799, 833696, 845386, 857546, 869554, 881086, 892001]
60625H92001R889Q335O428M074J045k181m640o115p288q520r463j0083j0848j1643
60611H50991j1540j0213q507p089n554l410j088Q26K510M278N697O048N270L763
60597H31982J709p96l289n168o253o718o679o050m706k715n17J260K444L490M610
60582H02604N172M599L528L124L429L369K382J125M94P44J605K405K191O93r25
60567H36539j250n37l34j264k483l431m673o530q236r100r450r689r400q172o541
60552G55449n328m596l808k617j035P13K255L385M460O005Q032J0298J3028J6542
60538H02783K0416K4107K8199L3723M0241M5974M9877N2089N2100M8293M0077
60527A237879K9004J6907M229q756k0361k8481l2564l3528l2323k9355k4842j9019
$$ y = [892001, 901890, 910225, 916653, 920727, 921772, 919591, 914951, 908836, 901548, 893028, 883565, 873482, 862634, 850991, 839451, 829238, 820731, 813642, 808088, 804678, 803590, 804416, 806926, 811204, 816901, 822949, 828219, 831982, 833691, 832895, 829606, 824438, 818185, 811467, 804788, 798738, 794032, 791317, 790800, 792060, 794504, 797994, 802604, 807776, 812375, 815903, 819027, 822456, 825825, 828207, 829332, 829826, 830570, 832175, 834580, 836771, 837464, 836539, 835289, 834752, 834418, 833154, 830671, 827240, 822567, 816037, 807801, 798701, 789251, 779562, 770162, 761990, 755449, 750121, 745525, 741717, 739100, 738065, 738778, 741033, 744418, 748878, 754883, 762915, 773213, 786241, 802783, 823199, 847306, 875505, 909228, 949469, 995443, 1045320, 1097409, 1149509, 1197802, 1237879, 1266883, 1283790, 1288019, 1279263, 1258902, 1230421, 1197857, 1164329, 1132006, 1102651, 1077809, 1058790]
60515A058790j2269n532o3L589N864P198P540P040O360N938N748O068P502R896
60501A113669J2305J4539J7671K2507K8516L4937M1884M9670N7969O6365P4890
60490A534922Q3433R1494R9123J07219J16439J26932J39754J57449J82300K14901
60480B853966K54763L00860L50295L97366M34920M55807M52674M18582L50483
60471F269716K52188J32942L568j25235k42479l37869m04738m41840m52497m42486
60461D211270m18200l85319l48270l10401k74018k40100k08664j79928j54570
60452A691800j32793j14002r7767q4148p2716o2462n3193m5829m0587l6175l1657
60441I20471k7774k5267k3248k0675j8285j7395j7573j7256j6064j4841j3806
$$ y = [1058790, 1046521, 1040989, 1040926, 1044515, 1050379, 1057577, 1065117, 1072157, 1078517, 1084455, 1090203, 1096271, 1103773, 1113669, 1125974, 1140513, 1158184, 1180691, 1209207, 1244144, 1286028, 1335698, 1393667, 1460032, 1534922, 1618355, 1709849, 1808972, 1916191, 2032630, 2159562, 2299316, 2456765, 2639065, 2853966, 3108729, 3409589, 3759884, 4157250, 4592170, 5047977, 5500651, 5919233, 6269716, 6521904, 6654846, 6658414, 6533179, 6290700, 5952831, 5548093, 5106253, 4653756, 4211270, 3793070, 3407751, 3059481, 2749080, 2475062, 2234962, 2026298, 1846370, 1691800, 1559007, 1445005, 1347238, 1263090, 1190374, 1127912, 1074719, 1028890, 988303, 952128, 920471, 892697, 867430, 844182, 823507, 805222, 787827, 770254, 752998, 736934, 722093, 708287]
60430G08287j2328j0458r108q603q245p432o243m890l608k861k824k783k026j003
60416F25875o21p29l70O32J538K025K437K753K472J670J136J185J342J327J509
60401F44181K027K436K584L066M316N759O467O309O028O282O897P140O617N726
60387G15835N064M572L699K350J089K59m14j147j705k038k590l478m055l821l169
60372G10451k619k015j081j91J94K38K70J31k93n05j00N14Q85J394K539L873M564
60355G18249M557M351M084L779L970N083O536P453P959Q798R943J0668J0812J0891
60341H17133J1049J0848J0182R510R083Q656Q095P599P288P148P428Q493J0320
60328I32832J2528J4869J7292J9633K1629K2953K2943K0682J5900R481K637m053
$$ y = [708287, 695959, 685501, 676393, 667790, 659545, 652113, 645870, 640980, 637372, 634511, 631687, 628904, 626878, 625875, 625254, 624525, 624155, 624787, 626325, 628350, 630787, 633540, 636012, 637682, 638818, 640003, 641345, 642672, 644181, 646208, 648644, 651228, 654294, 658610, 664369, 670836, 677145, 683173, 689455, 696352, 703492, 710109, 715835, 720899, 725471, 729170, 731520, 732609, 732868, 732454, 731307, 729602, 727564, 724974, 721496, 717441, 713620, 710451, 707832, 705817, 704736, 704545, 704739, 704977, 705247, 705378, 705085, 704580, 704480, 704994, 705879, 707273, 709812, 713685, 718249, 722806, 727157, 731241, 735020, 738990, 744073, 750609, 758062, 766021, 774819, 784762, 795430, 806242, 817133, 828182, 839030, 849212, 858722, 867805, 876461, 884556, 892155, 899443, 906591, 914019, 922512, 932832, 945360, 960229, 977521, 997154, 1018783, 1041736, 1064679, 1085361, 1101261, 1110742, 1113379, 1109326]
60316A109326j0388j5875j9979k2697k4276k4635k3659k1754j9554j7350j5206
60305H93953j3262j1499r684p882o552n702m701l303k108j452p10O32K045K920
60291H32695L575M428M992M689L988L634L508L234L171L625L875L222K349K266
60277H83251K567K181J318J106J657K137K499L506N057O134O556P274Q671J0014
60263I43928J1003J2445J4826J7376J9239K0701K2635K5392K8719L2200L5497
60252A183961L8635M2231M6954N2586N8258O3615O9239P5769Q3174R1007R8849
60241A904278J06473J13844J20985J27463J32268J34602J34509J32298J27731
60232C034451J20376J10407R8443Q4878O9927N3992L7422K0390L434j2389k6488
$$ y = [1109326, 1098938, 1083063, 1063084, 1040387, 1016111, 991476, 967817, 946063, 926509, 909159, 893953, 880691, 869192, 859508, 851626, 845074, 839372, 834671, 831368, 829260, 827808, 827098, 827730, 829775, 832695, 836270, 840698, 845690, 850379, 854367, 858001, 861509, 864743, 867914, 871539, 875414, 878636, 880985, 883251, 885818, 887999, 889317, 890423, 892080, 894217, 896716, 900222, 905279, 911413, 917969, 925243, 933914, 943928, 954931, 967376, 982202, 999578, 1018817, 1039518, 1062153, 1087545, 1116264, 1148464, 1183961, 1222596, 1264827, 1311781, 1364367, 1422625, 1486240, 1555479, 1631248, 1714422, 1805429, 1904278, 2010751, 2124595, 2245580, 2373043, 2505311, 2639913, 2774422, 2906720, 3034451, 3154827, 3265234, 3363677, 3448555, 3518482, 3572474, 3609896, 3630286, 3633720, 3621331, 3594843]
60221C594843l9113n0114n8164o2263o3158o2199n9433n4081m6161l6323k4657
60210C039177j1202K841J6089K8895M2763N7883P2893Q7050J00911J14598J26858
60199C678756J36320J42391J44547J41985J34672J23744J10311R4593P6484N6213
60189D840016L4209J1053j2222l4520n5376p4564r1106j03589j11553j15667j16455
60178D170226j13688j07091r6923q3776o8511n2240l5609j8243K87J9261L7434
60167C651127N4420P0292Q4196R4727J01525J05055J04886R9740Q9565P6120O1060
60156D592713M4705K7086R010q407k4235l7311m6408n1337n3015n1890m7225l8388
60144D315298k6112j1876L403J9643L7061N5638P4893R4249J13998J35560J60081
$$ y = [3594843, 3555730, 3505616, 3447452, 3385189, 3322031, 3259832, 3200399, 3146318, 3100157, 3063834, 3039177, 3027975, 3030816, 3046905, 3075800, 3118563, 3176446, 3249339, 3336389, 3437300, 3551898, 3678756, 3815076, 3957467, 4102014, 4243999, 4378671, 4502415, 4612726, 4707319, 4783803, 4840016, 4874225, 4885278, 4873056, 4838536, 4783160, 4708596, 4617490, 4513901, 4402348, 4286681, 4170226, 4056538, 3949447, 3852524, 3768748, 3700237, 3647997, 3612388, 3594145, 3594432, 3613693, 3651127, 3705547, 3775839, 3860035, 3954762, 4056287, 4161342, 4266228, 4365968, 4455533, 4531653, 4592713, 4637418, 4664504, 4673514, 4665107, 4640872, 4603561, 4557153, 4505816, 4452801, 4400911, 4353686, 4315298, 4289186, 4277310, 4280713, 4300356, 4337417, 4393055, 4467948, 4562197, 4676195, 4811755, 4971836]
60133D971836J87105K15403K44545K74607L04698L33232L59535L83708M04745
60124G679414M20158M27895M27516M19266M03152L79343L48469L10939K66791
60115A1082943K16544J61549J03294M2973j8257p9302j39364j97315k51073k98325
60105A0623667l37533l67395l85982l92023l86736l72872l52048l24520k91310
60096G413248k54602k15752j74722j31893q8869m6993o695L1234O5227R4498J19423
60085F804104J39660J53274J58595J55693J45367J27931J03942P5048M3303J0433
60075G917350k1748n1423p7973j02142j24436j44311j61403j76241j89038j98890
60065F669745k04949k07453k06948k03430j96855j87565j75604j60665j43180
$$ y = [4971836, 5158941, 5374344, 5618889, 5893496, 6198194, 6531426, 6890961, 7274669, 7679414, 8099572, 8527467, 8954983, 9374249, 9777401, 10156744, 10505213, 10816152, 11082943, 11299487, 11461036, 11564330, 11607303, 11589046, 11509744, 11370380, 11173065, 10921992, 10623667, 10286134, 9918739, 9532757, 9140734, 8753998, 8381126, 8029078, 7704558, 7413248, 7158646, 6942894, 6768172, 6636279, 6547410, 6500417, 6493722, 6524956, 6590183, 6684681, 6804104, 6943764, 7097038, 7255633, 7411326, 7556693, 7684624, 7788566, 7863614, 7906917, 7917350, 7895602, 7844179, 7766206, 7664064, 7539628, 7395317, 7233914, 7057673, 6868635, 6669745, 6464796, 6257343, 6050395, 5846965, 5650110, 5462545, 5286941, 5126276, 4983096]
60056D983096j24499j05410q5569o4830m3847k2841j060K1781M4687O6740Q8020
60045D756268J08293J26071J39872J49409J54497J54101J47550J35690J19692
60036E991443R9571P5097M7334J8052j1782m1800p1079r8223j22274j42561j58071
60025E585707j67927j72306j72223j68591j61908j52444j40258j25400j08484
60016D216166r0607p2431n3822l4632j5106M660K4933M5777O7011Q8884J11783
60005D292616J35057J57198J77411J95773K11377K21745K24841K20632K10004
59996F046654J93317J70939J44074J14091Q1706M7582J2859k1617n5702q8775
59986F645128j19028j44693j65131j80018j88489j90055j85566j76269j62640
$$ y = [4983096, 4858597, 4753187, 4667618, 4602788, 4558941, 4536100, 4535040, 4556821, 4601508, 4668248, 4756268, 4864561, 4990632, 5130504, 5279913, 5434410, 5588511, 5736061, 5871751, 5991443, 6091014, 6166111, 6213445, 6231497, 6219715, 6177915, 6106836, 6008613, 5886339, 5743778, 5585707, 5417780, 5245474, 5073251, 4904660, 4742752, 4590308, 4450050, 4324650, 4216166, 4125559, 4053128, 3999306, 3964674, 3949568, 3954228, 3979161, 4024938, 4091949, 4180833, 4292616, 4427673, 4584871, 4762282, 4958055, 5169432, 5391177, 5616018, 5836650, 6046654, 6239971, 6410910, 6554984, 6669075, 6750781, 6798363, 6811222, 6789605, 6733903, 6645128, 6526100, 6381407, 6216276, 6036258, 5847769, 5657714, 5472148, 5295879, 5133239]
59977E133239j44896j24025j01394p7812n3636k9261m979J8938M1599O1718P8920
59966D798411R3923J07012J17339J24281J28282J29592J27374J21007J11310R9537
59956E958068Q6065P0992N5136L9459K4300J0031k325j1951j8953k3332k4008
59945F163482j9748j0342L833K2640M5779P2494J02523J36548J74913K16665K60607
59934G169394L06294L53021L98715M40826M77510N06861N25634N29783N15988
59925A1224026M82105M27064L51430K58022J51586L8185p5206j81866k76805l56609
59915A2041932m18223m59617m81936m89098m84216m67997m41311m07292l69438
59906H022804l29185k86920k43856k01202j58710j15861p3569l3059N921M4243
$$ y = [5133239, 4988343, 4864318, 4762924, 4685112, 4631476, 4602215, 4597236, 4616174, 4657773, 4719491, 4798411, 4892334, 4999346, 5116685, 5240966, 5369248, 5498840, 5626214, 5747221, 5858531, 5958068, 6044133, 6115125, 6170261, 6209720, 6234020, 6244051, 6241726, 6229775, 6210822, 6187490, 6163482, 6143734, 6133392, 6137225, 6159865, 6205644, 6278138, 6380661, 6517209, 6692122, 6908787, 7169394, 7475688, 7828709, 8227424, 8668250, 9145760, 9652621, 10178255, 10708038, 11224026, 11706131, 12133195, 12484625, 12742647, 12894233, 12932418, 12857212, 12675346, 12398541, 12041932, 11623709, 11164092, 10682156, 10193058, 9708842, 9240845, 8799534, 8392242, 8022804, 7693619, 7406699, 7162843, 6961641, 6802931, 6687070, 6613501, 6580442, 6586363, 6630606]
59896F630606Q1533J16755J49726J80315K06831K26854K39113K43007K36874K18457
59886H530071J86973J43518Q9918K8540l7096j02903j65431k21869k69619l06910
59876G875192l33368l49176l54399l50029l38556l22334l02123k78356k52665
59867D994186k26824k01196j75696j51375j29529j10153r2874p8621o8717o2898
59857C696303n9818n8836n9681o1046o1249n9909n7478n3609m7530l9610l1049
59846C106488k2419j3899o442j266J328J361j901q886j8202k7734l6680m5015
59834B926733n1724n5385n6006n4578n1296m5931l9391l2939k6248j8043q540
59823B486652O09Q454J5145K0471K4036K6830L0831L6794M3956N1790O0399O9092
$$ y = [6630606, 6712139, 6828894, 6978620, 7158935, 7365766, 7592620, 7831733, 8074740, 8311614, 8530071, 8717044, 8860562, 8950480, 8979020, 8941924, 8839021, 8673590, 8451721, 8182102, 7875192, 7541824, 7192648, 6838249, 6488220, 6149664, 5827330, 5525207, 5246851, 4994186, 4767362, 4566166, 4390470, 4239095, 4109566, 3999413, 3906539, 3827918, 3759201, 3696303, 3636485, 3577649, 3517968, 3456922, 3395673, 3335764, 3278286, 3224677, 3177147, 3137537, 3106488, 3084069, 3070170, 3063728, 3062462, 3063790, 3065151, 3063250, 3054364, 3036162, 3008428, 2971748, 2926733, 2875009, 2819624, 2763618, 2709040, 2657744, 2611813, 2572422, 2539483, 2513235, 2495192, 2486652, 2487261, 2495715, 2510860, 2531331, 2555367, 2582197, 2613028, 2649822, 2693778, 2745568, 2805967, 2875059]
59811B875059P6144Q0136Q0453P6738O9363O0080N0637M0939K9999J8323P697
59800C465568j018q018j2821j4383j2976j0067o178m50P580J7436K8958M2506
59788C496137N7835P4321R2395J13273J37409J64728J96140K32961K74834L19887
59778E159920L66668M13700M56693M87808M98056M79498M26346L37513K19571
59769H845773Q5941m7813j67805k63230l28141l63375l74933l69162l50295l22086
59759F344874k88931k54251k19471j85680j54601j27069j02070p8317n5702l4537
59749D844245j4623M264K2118L9420N6923P4442R1162J07403J24591J43136J62068
59738E655149J81248K02213K26064K52081K79350L08434L40485L75882M14445
$$ y = [2875059, 2951203, 3031339, 3111792, 3188530, 3257893, 3317973, 3368610, 3409549, 3439548, 3457871, 3465568, 3464550, 3456532, 3443711, 3429328, 3416352, 3406285, 3400107, 3399657, 3407237, 3424673, 3453631, 3496137, 3553972, 3628293, 3720688, 3833961, 3971370, 4136098, 4332238, 4565199, 4840033, 5159920, 5526588, 5940288, 6396981, 6884789, 7382845, 7862343, 8288689, 8626202, 8845773, 8931714, 8883901, 8716096, 8452866, 8124725, 7761350, 7386417, 7017255, 6666960, 6344874, 6055943, 5801692, 5582221, 5396541, 5241940, 5114871, 5012801, 4934484, 4878782, 4844245, 4829622, 4833886, 4856004, 4895424, 4952347, 5026789, 5117951, 5225354, 5349945, 5493081, 5655149, 5836397, 6038610, 6264674, 6516755, 6796105, 7104539, 7445024, 7820906, 8235351]
59729H235351M55902M99368N43362N86794O28841O67392O98795P19637P27674
59720A3763116P21001O98152O60157O11383N57650N04473M57398M22181M03165
59711A8798676M01867M17602M48496M91400N41865N94869O45015O86039P11475
59702B3737304P16485O98256O54789N84952M90457L76723K51156J21397m849j19997
59692B7506673k17759k93744l45004l70208l70426l48557l07455k49452j77299
59683B4826769r3888p41J01836K12907L30639M53870N82154P13752Q44912R71059
59673B8943269J086652J183228J249431J273813J246570J159182J005736P87017
59665C7934898N12666J99016j33848m63253p65967j022660j221141j355871j426463
$$ y = [8235351, 8691253, 9190621, 9733983, 10320777, 10949618, 11617010, 12315805, 13035442, 13763116, 14484117, 15182269, 15842426, 16453809, 17011459, 17515932, 17973330, 18395511, 18798676, 19200543, 19618145, 20066641, 20558041, 21099906, 21694775, 22339790, 23025829, 23737304, 24453789, 25152045, 25806834, 26391786, 26882243, 27258966, 27510122, 27631519, 27626670, 27506673, 27288914, 26995170, 26650166, 26279958, 25909532, 25560975, 25253520, 25004068, 24826769, 24732881, 24732140, 24833976, 25046883, 25377522, 25831392, 26413546, 27127298, 27972210, 28943269, 30029921, 31213149, 32462580, 33736393, 34982963, 36142145, 37147881, 37934898, 38447564, 38646580, 38512732, 38049479, 37283512, 36260852, 35039711, 33683840, 32257377]
59656C2257377j437695j398965j321888j218773j103425r91117q95872q28118
59648B3061524p94667p98108q34006q89939r49489r98042j025919j028996j008563
59639A4733795r69551r17311q55977p89591p22592o57902n95992n37015m82393
59630H205471m33114l88149l46214l07920k74469k45194k18100j92253j68166
59621E631892j46349j26720j09104r3235p8614o5153n3538m4462l8132l4921l5483
59610D806181l9633m6100n3987o3330p3659q3318r1081r7240j02246j05471j06236
59599C943880j04834j01611r6255q8981q1156p3667o5787n6702m7041l7820k9045
59588C160981k0442j2459n446J127P520J2926J6869K0185K3476K5767K6039K4956
$$ y = [32257377, 30819682, 29420717, 28098829, 26880056, 25776631, 24785514, 23889642, 23061524, 22266857, 21468749, 20634743, 19744804, 18795315, 17797273, 16771354, 15742358, 14733795, 13764244, 12846933, 11990956, 11201365, 10478773, 9820871, 9224879, 8687864, 8205471, 7772357, 7384208, 7037994, 6730074, 6455605, 6210411, 5992311, 5800058, 5631892, 5485543, 5358823, 5249719, 5156484, 5077870, 5012717, 4959179, 4914717, 4876585, 4841664, 4806181, 4766548, 4720448, 4666461, 4603131, 4529472, 4446154, 4355073, 4257833, 4155587, 4050116, 3943880, 3839046, 3737435, 3641180, 3552199, 3471043, 3397376, 3331589, 3274887, 3227846, 3190026, 3160981, 3140539, 3128080, 3122634, 3123761, 3131281, 3144207, 3161076, 3181261, 3204737, 3230504, 3256543, 3281499]
59576C281499K3782K2699K1475K0699K0984K1946K3339K6136L1084L7192M3244
59565C574079M9842N8311O8415P8866Q9437J00972J13746J27400J42131J58463
59555D561662J76128J94396K13278K33161K53635K73713K92848L10540L25379
59546F834740L35670L40891L41592L37990L29631L16274K98483K77588K55382
59537I668241K33221K10855J86694J59803J31081J02436P5982N4454M0770L6050
59527A0899587L9057M8428O4126Q5712J10506J34809J55785J70750J75825J67074
59517A2051659J42759J03463N0959j1946q1350j53528k25789k95320l58261m11228
59507A0811418m52831m82610m99599n03458m96094m80485m58439m30812l99159
$$ y = [3281499, 3305281, 3327980, 3349455, 3370154, 3391138, 3413084, 3436423, 3462559, 3493643, 3530835, 3574079, 3623921, 3682232, 3750647, 3829513, 3918950, 4019922, 4133668, 4261068, 4403199, 4561662, 4737790, 4932186, 5145464, 5378625, 5632260, 5905973, 6198821, 6509361, 6834740, 7170410, 7511301, 7852893, 8190883, 8520514, 8836788, 9135271, 9412859, 9668241, 9901462, 10112317, 10299011, 10458814, 10589895, 10692331, 10768313, 10822767, 10863537, 10899587, 10938644, 10987072, 11051198, 11136910, 11247416, 11382225, 11538010, 11708760, 11884585, 12051659, 12194418, 12297881, 12348840, 12336894, 12255544, 12102016, 11876227, 11580907, 11222646, 10811418, 10358587, 9875977, 9376378, 8872920, 8376826, 7896341, 7437902, 7007090, 6607931]
59498F607931l65575l31407k97393k64553k33685k04562j76827j51055j27830
59489D455044j06508q6168o7014m9549l3117j6609J2J6296L2678M9812O7204Q4082
59477D346163J01113J19758J40227J61432J82729K04344K26334K48131K68909
59468E999140K87369L01501L09346L09601L00894K81439K50373K08692J58059
59459H406414R9742L5670l0615r5346j55999k10422k55928k90839l15787l32009
59449F854881l39502l38349l30577l18720l03541k85080k64885k45026k25646
59440D203555k05788j86049j68122j52010j36096j20024j05335r2982q2120p1734
59430B883295o1884n2877m4517l6584k9085k1914j5116r245m531r2M928R899J3610
$$ y = [6607931, 6242356, 5910949, 5613556, 5349003, 5115318, 4910756, 4733929, 4582874, 4455044, 4348536, 4262368, 4195354, 4145805, 4112688, 4096079, 4096091, 4112387, 4145065, 4194877, 4262081, 4346163, 4447276, 4567034, 4707261, 4868693, 5051422, 5255766, 5482100, 5730231, 5999140, 6286509, 6588010, 6897356, 7206957, 7507851, 7789290, 8039663, 8248355, 8406414, 8506156, 8541826, 8511211, 8415865, 8259866, 8049444, 7793516, 7502677, 7186890, 6854881, 6515379, 6177030, 5846453, 5527733, 5224192, 4939112, 4674227, 4429201, 4203555, 3997767, 3811718, 3643596, 3491586, 3355490, 3235466, 3130131, 3037149, 2955029, 2883295, 2821411, 2768534, 2724017, 2687433, 2658348, 2636434, 2621318, 2612073, 2607542, 2607450, 2612378, 2622277, 2635887]
59417B635887J6183J8866K2232K5914K9772L4024L8207M0972M0909L7285L0754
59406B971005K4006K0655K2351K7816L5409M5192N7395P0610Q3242R5267J06649
59395C559597J15663J21327J26476J35768J51150J71529J96083K25222K58580
59386E061395K94876L34030L77218M24433M73850N23576N72063O16558O52998
59377I330997O77842O88796O84138O63213O27856N81792N28534M70961M12346
59368A4666475L55964L03719K56384K14574J77823J43254J07130O7495K3939k4347
59358A6292410p8075j35819j94543k51612l04389l48646l80153l98047m04639
59349A3796487m02440l93741l82554l73743l69536l69186l72152l79078l89148
$$ y = [2635887, 2652070, 2670936, 2693168, 2719082, 2748854, 2782878, 2821085, 2862057, 2902966, 2940251, 2971005, 2995011, 3015666, 3038017, 3065833, 3101242, 3146434, 3203829, 3274439, 3357681, 3452948, 3559597, 3675260, 3796587, 3923063, 4058831, 4209981, 4381510, 4577593, 4802815, 5061395, 5356271, 5690301, 6067519, 6491952, 6965802, 7489378, 8061441, 8677999, 9330997, 10008839, 10697635, 11381773, 12044986, 12672842, 13254634, 13783168, 14254129, 14666475, 15022439, 15326158, 15582542, 15797116, 15974939, 16118193, 16225323, 16292818, 16316757, 16292410, 16214335, 16078516, 15883973, 15632361, 15327972, 14979326, 14599173, 14201126, 13796487, 13394047, 13000306, 12617752, 12244009, 11874473, 11505287, 11133135, 10754057, 10364909]
59340A0364909l99191m06306m09462m07977m00689l87536l70033l49365l25652
59331F908698k99514k72606k45968k19507j93469j68717j45259j22341j00308
59322E141009q0537o3238m7277l2531k0220j0501j950N815J1171J3077J2585J0776
59310D938179P096Q88o921j4896k2603l0215l7767m5403n3141n9859o3768o4400
59298D547190o2853n9859n5095m8634m1316l3255k3567j2180k75J1563K4100L7868
59286D283687N2363O7297Q3097R9659J16153J32462J49207J65964J81286J94843
59276E526018K07691K19645K28229K31102K27825K18376K01550J76088J42338
59267G378862J02206N8531J4969k5010n9932r0267j16485j38257j55542j68857
$$ y = [10364909, 9965718, 9559412, 9149950, 8741973, 8341284, 7953748, 7583715, 7234350, 6908698, 6609184, 6336578, 6090610, 5871103, 5677634, 5508917, 5363658, 5241317, 5141009, 5060472, 4997234, 4949957, 4917426, 4897206, 4886705, 4884755, 4890570, 4901741, 4914818, 4927403, 4938179, 4945275, 4946163, 4939242, 4924346, 4901743, 4871528, 4833761, 4788358, 4735217, 4675358, 4611590, 4547190, 4484337, 4424478, 4369383, 4320749, 4279433, 4246178, 4222611, 4210431, 4210156, 4221719, 4245819, 4283687, 4336050, 4403347, 4486444, 4586103, 4702256, 4834718, 4983925, 5149889, 5331175, 5526018, 5733709, 5953354, 6181583, 6412685, 6640510, 6858886, 7060436, 7236524, 7378862, 7481068, 7539599, 7554568, 7529558, 7469626, 7379359, 7262874, 7124617, 6969075, 6800218]
59257F800218j78296j83783j86305j87164j86025j81635j74536j66816j58912
59248E196746j49099j36687j23386j10580r7547q3368o8447n2934l5751j6504
59238D322443L458K3208M3933O7227R3159J21171J51458J84384K19776K57652
59228E487869K98298L40806L82827M22294M57740M86257N03127N04460M88737
59219I372415M55074M02190L30363K42772J43655L6667p3833j81705k80869l67264
59209A0079465m38112m90770n23682n37553n34683n18101m91743m59814m24908
59200E660099l87786l49441l11819k76042k41856k09643j81169j57335j36892
59191C408116j18465j02228q8596p7025o7093n9154n2872m6720m0021l3810k8722
$$ y = [6800218, 6621922, 6438139, 6251834, 6064670, 5878645, 5697010, 5522474, 5355658, 5196746, 5047647, 4910960, 4787574, 4676994, 4579447, 4496079, 4427632, 4374698, 4338947, 4322443, 4325901, 4349109, 4393042, 4460269, 4553428, 4674599, 4826057, 5010441, 5230217, 5487869, 5786167, 6126973, 6509800, 6932094, 7389834, 7876091, 8379218, 8883678, 9372415, 9827489, 10229679, 10560042, 10802814, 10946469, 10983136, 10909303, 10727598, 10446729, 10079465, 9641353, 9150583, 8626901, 8089348, 7554665, 7036564, 6544821, 6085007, 5660099, 5272313, 4922872, 4611053, 4335011, 4093155, 3883512, 3702343, 3545008, 3408116, 3289651, 3187423, 3098827, 3021802, 2954709, 2895555, 2842683, 2795963, 2755942, 2722132, 2693410]
59180B693410k3744j8150j2858q649m696j19M623R085J3918J9399K4491K8610
59168B725320L2752L7721M2780M7341N2121N7419O1882O4480O6080O7674O8591
59157C324161O7806O5476O1765N5787M7167L7198K7005J6152M323p143j6959k5515
59145C657223l3400l9852m4151m6972m8851m8938m6760m3596m0437l6242k9997
59134C198027k2834j6199r449j262P893J6772K5640L5537M6206N6749O7458P9246
59122C483784R1959J04898J18203J32332J46901J61403J76086J91040K05453K19069
59112E031128K33071K48271K63604K77607K89906K99826L05078L03377K94067
59103G545935K76658K49409K11058J62674J06271M3175k4409r1836j54242k09421
$$ y = [2693410, 2669666, 2651516, 2638658, 2630009, 2625313, 2625194, 2629817, 2638902, 2652820, 2672219, 2696710, 2725320, 2758072, 2795793, 2838573, 2885914, 2938035, 2995454, 3057336, 3121816, 3187896, 3255570, 3324161, 3391967, 3457443, 3519208, 3574995, 3622162, 3659360, 3686365, 3702517, 3706840, 3699697, 3682738, 3657223, 3623823, 3583971, 3539820, 3492848, 3443997, 3395059, 3348299, 3304703, 3264266, 3228024, 3198027, 3175193, 3158994, 3149545, 3148283, 3156176, 3172948, 3198588, 3234125, 3280331, 3337080, 3404538, 3483784, 3575743, 3680641, 3798844, 3931176, 4078077, 4239480, 4415566, 4606606, 4812059, 5031128, 5264199, 5512470, 5776074, 6053681, 6343587, 6643413, 6948491, 7251868, 7545935, 7822593, 8072002, 8283060, 8445734, 8552005, 8595180, 8570771, 8478935, 8324693, 8115272]
59093H115272k56861k95358l23638l42254l52800l56109l52818l44660l33311
59084E157463l18892l01193k81406k61132k40752k20355k00966j83298j66541
59075B982928j50129j35273j22989j12103j01163r0915q2741p5950o8952o1961
59065A980752n6235n1490m6309m0469l4860k9813k5233k1581j8936j6117j2466
59054A627243r378q277q273p866p691r313j2343j5108j7289j9547k1331k1322
59042A469505j9602j7340j4834j1794q830o731m939k515J52K371M905Q760J3181
59029A412289J6870K0258K4447K8760L1440L2059L1180K8563K3779J7841J2129
59018A679615O468L44m949p545p634o733n115k101J935O009J0263J5119J9547
$$ y = [8115272, 7858411, 7563053, 7239415, 6897161, 6544361, 6188252, 5835434, 5490774, 5157463, 4838571, 4537378, 4255972, 3994840, 3754088, 3533733, 3332767, 3149469, 2982928, 2832799, 2697526, 2574537, 2462434, 2361271, 2270356, 2187615, 2111665, 2042713, 1980752, 1924517, 1873027, 1826718, 1786249, 1751389, 1721576, 1696343, 1674762, 1655826, 1639709, 1627243, 1617865, 1609588, 1601315, 1593449, 1585758, 1576445, 1564102, 1548994, 1531705, 1512158, 1490827, 1469505, 1449903, 1432563, 1417729, 1405935, 1397105, 1390374, 1385435, 1382920, 1383072, 1385443, 1390348, 1399108, 1412289, 1429159, 1449417, 1473864, 1502624, 1534064, 1566123, 1597303, 1625866, 1649645, 1667486, 1679615, 1686083, 1686427, 1681478, 1673933, 1666299, 1659566, 1654451, 1652350, 1654285, 1660294, 1670557, 1685676, 1705223]
59005A705223K2232K3523K4120K3011J9056J3467Q150K673m274j1397j5914j7723
58993A792147j9247k1353k2357k1242j9160j7290j5525j3539j1307q409m653j167
58981A616898Q18J876L363N194O505P731R850J2260J3756J4888J7084K0032K2359
58968A752614K4239K6895L0079L2568L4593L7169L9547M0017L8904L8187L8373
58957B133185L8237L7427L6767L6274L5356L4786L5979L8636M1411M4533M9151
58946B561742N4638N9297O3449O9007P6182Q3428R0419R8233J06744J14740J22633
58935C500512J32135J43106J53735J64090J76544J92193K09673K28090K48480
58926E148558K71590K96693L23421L52703L85180M20445M58295M99093N42857
$$ y = [1705223, 1727455, 1750978, 1775098, 1798109, 1817165, 1830632, 1838782, 1841455, 1837181, 1825784, 1809870, 1792147, 1772900, 1751547, 1729190, 1707948, 1688788, 1671498, 1655973, 1642434, 1631127, 1622718, 1618065, 1616898, 1617716, 1619592, 1622955, 1628149, 1634654, 1642385, 1652235, 1664495, 1678251, 1693139, 1710223, 1730255, 1752614, 1776853, 1803748, 1833827, 1866395, 1900988, 1938157, 1977704, 2017721, 2056625, 2094812, 2133185, 2171422, 2208849, 2245616, 2281890, 2317246, 2352032, 2388011, 2426647, 2468058, 2512591, 2561742, 2616380, 2675677, 2739126, 2808133, 2884315, 2967743, 3058162, 3156395, 3263139, 3377879, 3500512, 3632647, 3775753, 3929488, 4093578, 4270122, 4462315, 4671988, 4900078, 5148558, 5420148, 5716841, 6040262, 6392965, 6778145, 7198590, 7656885, 8155978, 8698835]
58917H698835N89493O39402O91973P44038P91892Q34014Q69312Q93516R00152
58908A5652627Q84626Q44548P77018O79402N53159M03977K38181O1929j16301
58899A9979166k86294m40130n73314o82224p63827q18424q49489q60110q52139
58890A3853215q28753p94545p52530p04079o52012o00511n51374n03623m57455
58881H008333m15380l78639l45781l15833k89929k68710k50831k35024k21084
58872E287122k08126j94579j80584j67824j56469j44989j33327j23136j14440
58863C863648j05355r5703q7531q1184p4365o6144n8470n2417m6278l8875l1527
58852C125799k5125j8375j0639l625J628O761J3310K0288K6274L1678L7427M3456
$$ y = [8698835, 9288328, 9927730, 10619703, 11363741, 12155633, 12989647, 13858959, 14752475, 15652627, 16537253, 17381801, 18158819, 18838221, 19391380, 19795357, 20033538, 20095467, 19979166, 19692872, 19252742, 18679428, 17997204, 17233377, 16414953, 15565464, 14705354, 13853215, 13024462, 12229917, 11477387, 10773308, 10121296, 9520785, 8969411, 8465788, 8008333, 7592953, 7214314, 6868533, 6552700, 6262771, 5994061, 5743230, 5508206, 5287122, 5078996, 4884417, 4703833, 4536009, 4379540, 4234551, 4101224, 3978088, 3863648, 3758293, 3662590, 3575059, 3493875, 3419510, 3353366, 3294896, 3242479, 3196201, 3157326, 3125799, 3100674, 3082299, 3071660, 3068035, 3069663, 3076424, 3089734, 3110022, 3136296, 3167974, 3205401, 3248857]
58840C248857M9840N7284O5374P2542P8721Q5813R4605J03744J12622J22564J34162
58829D226128J46100J57878J70981J86209K02478K19507K38981K61825K86956
58820F097043L13977L44429L79065M16550M56187M99394N46966N97350O48742
58811A0299703P00358P50377P95217Q31802Q57850Q68867Q58033Q20633P56048
58802A7538888O64470N45182M00144K36461O3337j11240k79673m33801n67026
58793A8056742o75747p57875q12619q42569q52938q47324q26819p94011p54172
58784A0892668p11157o65540o18223n72231n29130m87365m46202m07856l73707
58775F081257l42035l11800k85078k63231k44146k25914k09911j97393j86242
$$ y = [3248857, 3298697, 3355981, 3421355, 3493897, 3572618, 3658431, 3753036, 3856780, 3969402, 4091966, 4226128, 4372228, 4530106, 4701087, 4887296, 5089774, 5309281, 5548262, 5810087, 6097043, 6411020, 6755449, 7134514, 7551064, 8007251, 8506645, 9053611, 9650961, 10299703, 11000061, 11750438, 12545655, 13377457, 14235307, 15104174, 15962207, 16782840, 17538888, 18203358, 18748540, 19148684, 19385145, 19448482, 19337242, 19057569, 18623768, 18056742, 17380995, 16623120, 15810501, 14967932, 14114994, 13267670, 12440851, 11646840, 10892668, 10181511, 9515971, 8897748, 8325517, 7796387, 7309022, 6862820, 6454964, 6081257, 5739222, 5427422, 5142344, 4879113, 4634967, 4409053, 4199142, 4001749, 3815507]
58766C815507j74137j62019j51480j41501j30720j20206j11047j01913r1845q2773
58756B547866p6231p0300o2837n5144m9284m4349l8595l2975k9165k6239k2561
58745B040186j8956j6807j5040j2191r576r177j0158j0676j1450j4249j8287k1271
58733A872348k2842k4142k5134k5088k4531k4359k4158k3576k3835k5772k8003
58722A600908k9138l0044l1845l3608l4176l4288l4662l4110l1881k9681k8953
58711A248522k8355k6390k4186k3146k2227k0234j8488j8333j8267j6477j4056
58700A018363j2810j1973j0130q212p632p478o499n718o171o307m736l197l640
58687I23860m706m505m449o637r651j0777j0455j0665j0795r138o826o099o050
$$ y = [3815507, 3641370, 3479351, 3327871, 3186370, 3055650, 2935444, 2824397, 2722484, 2630639, 2547866, 2471635, 2401335, 2338498, 2283354, 2234070, 2189721, 2151126, 2118151, 2088986, 2062747, 2040186, 2021230, 2004423, 1989383, 1977192, 1967616, 1958439, 1948281, 1937605, 1926155, 1911906, 1893619, 1872348, 1849506, 1825364, 1800230, 1775142, 1750611, 1726252, 1702094, 1678518, 1654683, 1628911, 1600908, 1571770, 1541726, 1509881, 1476273, 1442097, 1407809, 1373147, 1339037, 1307156, 1277475, 1248522, 1220167, 1193777, 1169591, 1146445, 1124218, 1103984, 1085496, 1067163, 1048896, 1032419, 1018363, 1005553, 993580, 983450, 975238, 967606, 960128, 953629, 947911, 941740, 935433, 930697, 927500, 923860, 919154, 914649, 910200, 903563, 893912, 883135, 872680, 862015, 851220, 842082, 835256, 829157, 823107]
58674H23107m113o67J695K516L309M017L358J970J771K701L184L088L360L655
58660H52951L108K344K078J031j886m842n453m326l373k265K06L019M487N349
58646H52428P040Q581Q661Q925J1534J5071J6701J6888J8108K0304K1722K2978
58634A028941K6154L0709L4234L6631L9876M4437M9372N5109O2562P0453P7042
58623A555520Q3583R2653J04121J16201J29271J44962J62583J80189J98148K17864
58613B985095K37961K55318K68846K78503K81608K74039K54234K22718J79109
58604E237431J23726O1080k292o2745j18753j66920k03322k27927k43526k51000
58594D145752k49739k41659k30379k16958k00556j82579j65912j50728j35205
$$ y = [823107, 818994, 818327, 820022, 822538, 825847, 829864, 833222, 835192, 836963, 839664, 842848, 845936, 849296, 852951, 856059, 858403, 860481, 861512, 859626, 854784, 849331, 845005, 841632, 839367, 839573, 842592, 847079, 852428, 859468, 868049, 876710, 885635, 897169, 912240, 928941, 945829, 963937, 984241, 1005963, 1028941, 1055095, 1085804, 1120038, 1156669, 1196545, 1240982, 1290354, 1345463, 1408025, 1478478, 1555520, 1639103, 1731756, 1835877, 1952078, 2081349, 2226311, 2388894, 2569083, 2767231, 2985095, 3223056, 3478374, 3747220, 4025723, 4307331, 4581370, 4835604, 5058322, 5237431, 5361157, 5422237, 5419945, 5357200, 5238447, 5071527, 4868205, 4640278, 4396752, 4145752, 3896013, 3654354, 3423975, 3207017, 3006461, 2823882, 2657970, 2507242, 2372037]
58585B372037j19749j06319r4277q1291o7853n6601m7669l9005l0757k5060k1802
58574A681654j8943j6676j7075j9783k2125k3121k3527k2623j9115j4616j2011
58563A472039j1046r697q911j1299j5985j9660k2151k5927l0456l2294l0790k8734
58551A225089k7194k4572k1028j8995j8835j8451j7478j7579j8503j8270j7204
58540A006980j7387j8270j7426j5390j4982j5950j5260j2676j1074j1047j0300
58529H47218q561q156r299r711r170r654j0806j0324q894r522j1795j2128j0092
58516G19106q930r350q490n791m203m472l714r83J099J494K338M097M380K954
58502F89535K877N094O839O797P061Q576R472R353J0495J3354J5440J5931J6782
$$ y = [2372037, 2252288, 2145969, 2051692, 1970401, 1902548, 1845947, 1798278, 1759273, 1728516, 1703456, 1681654, 1662711, 1646035, 1628960, 1609177, 1587052, 1563931, 1540404, 1517781, 1498666, 1484050, 1472039, 1460993, 1451296, 1442385, 1431086, 1415101, 1395441, 1373290, 1347363, 1316907, 1284613, 1253823, 1225089, 1197895, 1173323, 1152295, 1133300, 1114465, 1096014, 1078536, 1060957, 1042454, 1024184, 1006980, 989593, 971323, 953897, 938507, 923525, 907575, 892315, 879639, 868565, 857518, 847218, 838657, 830501, 821202, 811491, 802321, 792667, 781861, 771537, 762643, 753121, 741326, 729198, 719106, 710176, 700826, 692336, 686545, 682342, 677870, 674156, 673173, 674272, 675766, 678104, 682201, 686581, 689535, 692412, 697506, 704345, 711142, 718203, 726779, 736251, 745604, 756099, 769453, 784893, 800824, 817606]
58489H17606J8231J7843J5146J2575J0801P791L336k33k627o012j0150j2316j2616
58476H59375j4100j6831j7448j5467j4246j4725j4072j1730j0821j2033j2068
58465G05834r872q490r065q712o296m597m816m469k600j591k155k015j008j753
58451F38395l834l448l09J395N71J141M473O760O292O583R598J2430J3409J5098
58437G08554J8340J9860J8678J8381J9941J8987J3523P837N154K829j492n270
58425H45322o514p708j0349j1514r719q397r619j0125p475m512l807l205p48J542
58411G53172K425M428Q493J1215J0922J0805J2642J3372J1305R392Q812N926m42
58398H62467n355n774n633q418j1201j0775r442r718r304o367l997m399m393j493
$$ y = [817606, 835837, 853680, 868826, 881401, 892202, 899993, 903329, 903096, 900469, 894457, 884307, 871991, 859375, 845275, 828444, 810996, 795529, 781283, 766558, 752486, 740756, 729935, 717902, 705834, 695962, 687472, 678407, 669695, 663399, 658802, 653986, 649517, 646917, 645326, 643171, 641156, 640148, 638395, 634561, 631113, 630804, 632199, 632770, 633911, 638384, 645144, 651436, 658019, 667617, 680047, 693456, 708554, 726894, 746754, 765432, 783813, 803754, 822741, 836264, 844101, 849255, 852084, 850592, 845322, 838808, 831100, 820751, 809237, 799518, 791121, 781502, 771377, 763902, 759390, 755583, 752378, 751630, 753172, 755597, 760025, 768518, 779733, 790655, 801460, 814102, 827474, 838779, 848171, 856983, 862909, 862467, 857112, 851338, 845705, 837287, 826086, 815311, 805869, 796151, 786847, 780480, 776483, 772084, 767691, 766198]
58384G66198J255J181R81L043M625L511K646M374N787M500L306M500N467M470
58370H15844M656P746R970Q900P976R599J0454Q417P190R044J0031P619O024Q415
58356I31885J1002J0431R922J2295J4157J2868J1958J3706J3815R533N356M418
58344A061346K296l910q672p459m973o261p639m499m32k1p7L484P132O724N983
58329A043022R395J3443J3444J2376J4438J6668J5412J4170J6627J8931J7294
58318A205220J5864J8576K0947J8844J7276K1026K4702K2020J6955J5502J4429
58307A411361Q785K663J518J578k168n184j829L262L758L642Q862J4903J5014
58294A466165J3127J6005K0088J8927J6290J8820K2967K2398K1164K5982L2634
$$ y = [766198, 767453, 768634, 769615, 772658, 777283, 780794, 783440, 787814, 793601, 798101, 801407, 805907, 811374, 815844, 820500, 828246, 838216, 847116, 855092, 864691, 875145, 883562, 890752, 899796, 909827, 917446, 923470, 931885, 942887, 953318, 963240, 975535, 989692, 1002560, 1014518, 1028224, 1042039, 1051572, 1056928, 1061346, 1063642, 1059732, 1051060, 1043601, 1038628, 1032367, 1024728, 1020229, 1019797, 1019776, 1019699, 1023183, 1030315, 1037039, 1043022, 1052417, 1065860, 1079304, 1091680, 1106118, 1122786, 1138198, 1152368, 1168995, 1187926, 1205220, 1221084, 1239660, 1260607, 1279451, 1296727, 1317753, 1342455, 1364475, 1381430, 1396932, 1411361, 1420146, 1422809, 1424327, 1425905, 1423737, 1418553, 1416724, 1419986, 1423744, 1427386, 1436248, 1451151, 1466165, 1479292, 1495297, 1515385, 1534312, 1550602, 1569422, 1592389, 1614787, 1635951, 1661933, 1694567]
58283A694567L3552L1937L4747L8972L8594L7702M2556M8192M7318M4708M8030
58272B140875N2343M9113M2624M1611M2636L7944L1823L2461L5589L3096K9740
58261B569855L3899M0255L9645L7409M3391N2518N4600N4380O1717P1028P1574
58250C130271O9031P5044Q4373Q5201Q2998R0380J02177J05226J04236J12364
58240D041301J24787J28215J28093J38817J55178J62018J64075J76639J94761
58231E413884K02547K05044K19005K39870K51033K57913K78281L06707L24736
58222G699020L38210L66608M03736M29060M49660M88468N39494N79939O18132
58213A1912327O80943P61956Q34018R05327J007314J134775J258429J389884J568916
$$ y = [1694567, 1728119, 1760056, 1794803, 1833775, 1872369, 1910071, 1952627, 2000819, 2048137, 2092845, 2140875, 2193218, 2242331, 2284955, 2326566, 2369202, 2407146, 2438969, 2471430, 2507019, 2540115, 2569855, 2603754, 2644009, 2683654, 2721063, 2764454, 2816972, 2871572, 2925952, 2987669, 3058697, 3130271, 3199302, 3274346, 3358719, 3443920, 3526918, 3617298, 3719475, 3824701, 3928937, 4041301, 4166088, 4294303, 4422396, 4561213, 4716391, 4878409, 5042484, 5219123, 5413884, 5616431, 5821475, 6040480, 6280350, 6531383, 6789296, 7067577, 7374284, 7699020, 8037230, 8403838, 8807574, 9236634, 9686294, 10174762, 10714256, 11294195, 11912327, 12593270, 13355226, 14189244, 15094571, 16101885, 17236660, 18495089, 19884973, 21453889]
58204B1453889J793197K032324K306083K670397L131348L662257M303802N147960
58196D6501257O223044P510463R085721J1120355J3742786J7055546K1285527
58189A32524699K6640257L2827311L8824006M3192099M4434726M1059153L1929502
58182C91431753J7340311j68912j6641625k8840443l5728225l8119172l7394135
58175B51879552l4732635l1076928k7160424k3383976j9860532j6651392j3853653
58168H5160012j1485331r458830p711114o249364n047177m007125l059999k205714
58160C5935358j418928o03439L05076J251132K113543K779933L111126K899514
58152D6373315J982993M44779j335889k875588l858155m255308m231795l970212
$$ y = [21453889, 23247086, 25279410, 27585493, 30255890, 33387238, 37049495, 41353297, 46501257, 52724301, 60234764, 69320485, 80440840, 94183626, 111239172, 132524699, 159164956, 191992267, 230816273, 274008372, 318443098, 359502251, 391431753, 408772064, 408603152, 391961527, 363121084, 327392859, 289273687, 251879552, 217146917, 186069989, 158909565, 135525589, 115665057, 99013665, 85160012, 73674681, 64215851, 56504737, 50255373, 45208196, 41201071, 38141072, 35935358, 34516430, 33912991, 34218067, 35469199, 37582742, 40362675, 43473801, 46373315, 48356308, 48801087, 47465198, 44589610, 40731455, 36476147, 32244352, 28274140]
58144B8274140l583247l139509k701244k309378j964323j653296j382801j163950
58136A0376392r85325q27379o90948n86304n05782m33107l70180l28912l04188
58127E344267k79932k55471k41482k35232k23732k07095j95653j87545j71651
58118C346474j49706j33644j23464j08985r1306q1672q0624p8370p4410p6919
58108B347374q3833q4150p7536p3857p3771o8466n8311n3137n3515m9911m1195
58097A629692l6502l7550l6267l1358l0499l4374l4731l0298k9024l2436l2983
58086A263670k9023k7595l0062k9506k4796k3114k5976k6409k2582k0871k2936
58075I80800k2729j8920j7426j9148j7823j2592j0243j2320j2450r017q154j1193
$$ y = [28274140, 24690893, 21551384, 18850140, 16540762, 14576439, 12923143, 11540342, 10376392, 9391067, 8563688, 7872740, 7286436, 6780654, 6347547, 5977367, 5648455, 5344267, 5064335, 4808864, 4567382, 4332150, 4108418, 3901323, 3705670, 3518125, 3346474, 3196768, 3063124, 2939660, 2830675, 2739369, 2657697, 2577073, 2498703, 2424293, 2347374, 2263541, 2179391, 2101855, 2027998, 1954227, 1885761, 1827450, 1774313, 1720798, 1670887, 1629692, 1593190, 1555640, 1519373, 1488015, 1457516, 1423142, 1388411, 1358113, 1329089, 1296653, 1263670, 1234647, 1207052, 1176990, 1147484, 1122688, 1099574, 1073598, 1047189, 1024607, 1003736, 980800, 958071, 939151, 921725, 902577, 884754, 872162, 861919, 849599, 837149, 828132, 819978, 808785]
58063H08785j1466o995m445o808q508o532n452p620q800p312p478j0528j1727
58050G05114r757r311j1472j1246p533n702p303p055l191r53k581l389j254l82
58036F23985k286k394P59K317O59P60M265N552J976j091Q6J625L40m48J699L160
58020F40964J507M37K517M087K201l0L72R99n37k122k033k525m742n881m718m097
58004F26399m935m048p89O87j206k605j685k071n423p770p051p182j0480j2813
57990E59028j0837p653o700o111l672j597j711j438J007K681J450J79J358K744
57976E28728K366K544M803O035M031J777K089K898J907R54J579J244j709m163
57962E55083l556k442l481m542l158j404j865l010k857l047n039o372m972l213
$$ y = [808785, 797319, 790324, 785879, 779071, 770563, 764031, 758579, 750959, 742159, 734847, 727369, 716841, 705114, 695357, 686046, 674574, 663328, 655795, 650093, 642790, 635735, 632544, 631591, 629010, 625621, 624367, 623985, 621699, 619305, 620064, 622381, 623040, 623800, 628065, 633617, 635593, 634502, 634588, 636213, 636553, 636105, 637804, 640964, 642471, 642908, 645425, 649512, 651713, 651683, 652055, 653054, 652517, 650395, 648362, 645837, 641095, 635214, 630496, 626399, 621464, 617416, 616627, 617314, 616108, 613503, 611818, 609747, 604324, 596554, 589503, 582321, 571841, 559028, 548191, 540538, 533838, 527727, 524055, 522458, 520747, 519309, 520316, 522997, 524447, 524626, 525984, 528728, 531094, 533638, 538441, 544476, 548507, 550284, 552373, 555271, 557178, 558132, 559711, 560955, 559246, 555083, 551527, 549085, 545604, 541062, 537904, 536500, 534635, 531625, 528768, 525721, 520682, 514310, 509338, 506125]
57948E06125l497l780j632J161K164K603M045M660K966J490K445L449J734r05
57934E23028j600j351k380l857m393n433q191j0463j0385r987j1198j1856r784
57921D32150p283p179p734n958k916j320o72Q01K164J991J941L932O324O876O950
57906D30067Q628J0393R866Q340Q306Q855P777N963N542N703M494K754K238J951
57892E20877K54j404r41J39r73l620n124n302n694n997n084m066m594n559n000
57877D67912l775l792m246l151j191m57p13k56P59J142J435K786M410M996N172
57862D71031N845N929M574L539M282M909L200N52n84r71k635m673m885l905l839
57847D82369m327l669k492k554l303l112k575l055l494k248n56n60j391r16L9
$$ y = [506125, 502628, 498848, 497216, 498377, 500541, 503144, 507189, 511849, 514815, 516305, 518750, 522199, 523933, 523028, 521428, 520077, 517697, 513840, 509447, 504014, 495823, 485360, 474975, 464988, 453790, 441934, 432150, 424867, 417688, 409954, 403996, 401080, 399760, 399088, 399889, 402053, 404044, 405985, 409917, 416241, 423117, 430067, 438695, 449088, 458954, 467294, 475600, 484455, 492232, 498195, 503737, 509440, 513934, 516688, 518926, 520877, 521131, 519727, 518786, 518925, 517952, 514332, 509208, 503906, 498212, 492215, 487131, 483065, 478471, 472912, 467912, 464137, 460345, 456099, 452948, 451757, 451300, 450587, 450331, 451090, 452232, 453667, 456453, 460863, 465859, 471031, 476876, 482805, 487379, 490918, 495200, 500109, 503309, 503861, 503277, 502306, 499671, 494998, 490113, 486208, 482369, 478042, 474373, 471881, 469327, 466024, 462912, 460337, 457282, 453788, 451540, 450984, 450424, 449033, 448117, 448156]
57832D48156p70k712l496l476m685o590o941o092o402p883q353p556p404q331
57818C67465q913q767q615p941n844l630l273l922l298j789j705k978l257j947
57804C01586p16k13M37J163J221J547L653O485P663P362P686Q636Q211O309N005
57789C66035M857M380L319L187M262N043M936M656L934J724j272l124l763m771
57775C93403o242o757o420o893q302q929q199p235o353m741k718j659j513r51
57761C16491P1M55M62J426L108M017M204N001O256O589O188O439P053O519N280
57746C79559N274O434O783O098O177P314P744P037O839P727Q288P994Q055Q768
57732D80091Q821P859P104O934O438N826O503Q348R634J0017J0838J2101J2237
$$ y = [448156, 447386, 444674, 441178, 437702, 433017, 426427, 419486, 413394, 406992, 399109, 390756, 383200, 375796, 367465, 358552, 349785, 341170, 333229, 327385, 323755, 320482, 316560, 313262, 311473, 309768, 306790, 303533, 301586, 300870, 300657, 301094, 302257, 303478, 305025, 308678, 315163, 322826, 330188, 337874, 346510, 354721, 361030, 366035, 370892, 375272, 378591, 381778, 386040, 391083, 396019, 400675, 404609, 406333, 405061, 401937, 398174, 393403, 387161, 380404, 373984, 367091, 358789, 349860, 341661, 334426, 328073, 323332, 320614, 318955, 317442, 316491, 316562, 317017, 317479, 318905, 322013, 326030, 330234, 335235, 341491, 348080, 354268, 360707, 367760, 374279, 379559, 384833, 391267, 398050, 404148, 410325, 417639, 425383, 432420, 439259, 446986, 455274, 463268, 471323, 480091, 488912, 496771, 503875, 510809, 517247, 523073, 529576, 537924, 547558, 557575, 568413, 580514, 592751]
57719E92751J1411J1949J4606J7293J8532J9359K0727K1693K1387K0582K0170
57708G90460K0174K0998K3519K7186L0294L2684L6022M0911M6054N0844N6285
57697A175431O2765O9236P5310Q1876Q9222R6902J05855J18082J33740J51009
57687B159428J69222J89343K10809K30829K47412K60167K67401K65455K52137
57678D252203K28160J94473J51277J01023M9516K591l6029o3142p5927p5390o7553
57667D661202n9872n8615o9795r7956j40972j88525k28574k54225k63901k58610
57657C040157k41725k18880j94770j70836j47343j25625j06606q9300p2845n8254
57647A613973m6376l6042k6118j7367j0435l952L336J0472J6449K2556L0254L8495
$$ y = [592751, 604162, 616111, 630717, 648010, 666542, 685901, 706628, 728321, 749708, 770290, 790460, 810634, 831632, 855151, 882337, 912631, 945315, 981337, 1022248, 1068302, 1119146, 1175431, 1238196, 1307432, 1382742, 1464618, 1553840, 1650742, 1756597, 1874679, 2008419, 2159428, 2328650, 2517993, 2728802, 2959631, 3207043, 3467210, 3734611, 4000066, 4252203, 4480363, 4674836, 4826113, 4927136, 4976652, 4979243, 4943214, 4880072, 4804145, 4728755, 4661202, 4601330, 4542715, 4472920, 4374964, 4233992, 4045467, 3816893, 3562668, 3298767, 3040157, 2798432, 2579552, 2384782, 2213946, 2066603, 1940978, 1834372, 1745072, 1672227, 1613973, 1567597, 1531555, 1505437, 1488070, 1477635, 1473683, 1477019, 1487491, 1503940, 1526496, 1556750, 1595245]
57635A595245M5700N2888O2313P4007Q6200R8373J11539J26098J41400J57125
57625B550888J73351J89481K04265K16388K24003K24433K15434J96152J66320
57616D360715J25922P6714K2810l1418q2982j29269j67243j95157k13707k24211
57606C542174k27022k22846k14050k02944j90081j75473j60200j45369j30940
57597A873249j17032j05005r5651q7575p9021p0203o2331n5584m9523m4445m0668
57586A066211l7352l3540k9493k5924k2834k0214j8627j7969j6967j5062j3416
57575H14813j2819j2136j0248q008o703n974m829l435k324j087N50J684J822K144
57561G53450L685N599O840Q054J0046J1912J2576J2889J4196J6048J7290J8274
$$ y = [1595245, 1640945, 1693833, 1756146, 1830153, 1916353, 2014726, 2126265, 2252363, 2393763, 2550888, 2724239, 2913720, 3117985, 3334373, 3558376, 3782809, 3998243, 4194395, 4360715, 4486637, 4563351, 4586161, 4554743, 4471761, 4342492, 4175249, 3980092, 3766385, 3542174, 3315152, 3092306, 2878256, 2675312, 2485231, 2309758, 2149558, 2004189, 1873249, 1756217, 1651212, 1555561, 1467986, 1388965, 1318762, 1256431, 1200847, 1151324, 1106879, 1066211, 1028859, 995319, 965826, 939902, 917068, 896854, 878227, 860258, 843291, 828229, 814813, 801994, 789858, 779610, 771602, 764899, 758925, 754096, 750661, 748337, 747250, 747800, 749484, 751306, 753450, 757135, 762734, 769574, 777628, 787674, 799586, 812162, 825051, 839247, 855295, 872585, 890859]
57549H90859K0011K2318K4660K7653L1743L5693L8450M1365M6318N2798N9096
57538A290964O5302P2759Q1499R0652J00628J12359J25047J37043J48442J60316
57528B385011J71787J80103J83337J80824J71347J53283J26546R2548N2637Q577
57518C706000l5915p6468j10815j38534j58725j70332j74456j73796j69724j62030
57508B335205j51403j39846j28422j16785j05080r4266q4393p4615o5101n6919
57498A318375m9862m2482l4528k7299k1323j5763j0475o478l746n83L977Q908
57486A118721J3133J7064K1404K5852K9965L4024L8372M2960M8146N4827O3298
57475A507766P2861Q2950R3635J04915J16580J28890J42130J55236J65988J72779
$$ y = [890859, 910870, 933188, 957848, 985501, 1017244, 1052937, 1091387, 1132752, 1179070, 1231868, 1290964, 1356266, 1429025, 1510524, 1601176, 1701804, 1814163, 1939210, 2076253, 2224695, 2385011, 2556798, 2736901, 2920238, 3101062, 3272409, 3425692, 3552238, 3644786, 3697423, 3706000, 3670085, 3593617, 3482802, 3344268, 3185543, 3015211, 2840755, 2666959, 2497235, 2335205, 2183802, 2043956, 1915534, 1798749, 1693669, 1599403, 1515010, 1440395, 1375294, 1318375, 1268513, 1226031, 1191503, 1164204, 1142881, 1127118, 1116643, 1110165, 1106419, 1105836, 1109813, 1118721, 1131854, 1148918, 1170322, 1196174, 1226139, 1260163, 1298535, 1341495, 1389641, 1444468, 1507766, 1580627, 1663577, 1757212, 1862127, 1978707, 2107597, 2249727, 2404963, 2570951, 2743730]
57465B743730J74998J71549J60385J40070J10947P4554L2926j1321n5095r5423
57455C447320j29581j55297j71876j80800j84031j82129j75090j64366j52314
57446A951836j40016j27277j14524j02888r2480q2462p2907o4867n8391n2227
57436A043797m5780l9828l4958l0924k7642k5351k3465k0905j7856j5616j4525
57425G46947j3573j2273j1249j0661r739q347p323o867o141m898l864l150j954
57412F46908l12N94M60M52J153J621J278R88J442J990K032K067K456K620K341
57397F68090K450L307L950L754L533L955M281L774L189L519M396M918N178N741
57383G24035O360O390N926N556N366N046M578M249M287M803N596O001N581M998
$$ y = [2743730, 2918728, 3090277, 3250662, 3390732, 3501679, 3576233, 3609159, 3597838, 3542743, 3447320, 3317739, 3162442, 2990566, 2809766, 2625735, 2443606, 2268516, 2104150, 1951836, 1811820, 1684543, 1570019, 1467131, 1374651, 1292189, 1219282, 1154415, 1096024, 1043797, 998017, 958189, 923231, 892307, 864665, 839314, 815849, 794944, 777088, 761472, 746947, 733374, 721101, 709852, 699191, 689452, 681105, 673782, 666915, 660774, 655876, 652012, 648862, 646908, 646596, 647190, 647650, 648102, 649255, 650876, 652154, 653142, 654584, 656574, 658606, 660673, 663129, 665749, 668090, 670540, 673847, 677797, 681551, 685084, 689039, 693320, 697094, 700283, 703802, 708198, 713116, 718294, 724035, 730395, 736785, 742711, 748267, 753633, 758679, 763257, 767506, 771793, 776596, 782192, 788193, 793774, 798772]
57369G98772N186N842N889N447N720O765P130O216N335N605O381O676O676O868
57355H84508P020P090P836R445J0735J0767J0194J0003J0045R892R997J0789J1608
57342A009929J1660J1279J1209J1399J1526J1763J2164J2129J1406J0853J1202
57331A136519J1947J2278J2296J2467J2747J3119J4016J5326J5973J5434J4707
57320A286829J4822J5370J5583J5789J6630J7729J8392J8826J9486K0030K0100
57309A479586K0352K1449K2760K3263K3157K3396K4191K5124K6159K7417K8556
57298A745410K9378L0495L2247L3742L4162L4324L5610L7888L9865M1123M2439
57287B136683M4250M6068M7434M8359M8899M9060M9059M8956M8205M6147M2697
$$ y = [798772, 803958, 809800, 815689, 821136, 826856, 833621, 840751, 846967, 852302, 857907, 864288, 870964, 877640, 884508, 891528, 898618, 906454, 915899, 926634, 937401, 947595, 957598, 967643, 977535, 987532, 998321, 1009929, 1021589, 1032868, 1044077, 1055476, 1067002, 1078765, 1090929, 1103058, 1114464, 1125317, 1136519, 1148466, 1160744, 1173040, 1185507, 1198254, 1211373, 1225389, 1240715, 1256688, 1272122, 1286829, 1301651, 1317021, 1332604, 1348393, 1365023, 1382752, 1401144, 1419970, 1439456, 1459486, 1479586, 1499938, 1521387, 1544147, 1567410, 1590567, 1613963, 1638154, 1663278, 1689437, 1716854, 1745410, 1774788, 1805283, 1837530, 1871272, 1905434, 1939758, 1975368, 2013256, 2053121, 2094244, 2136683, 2180933, 2227001, 2274435, 2322794, 2371693, 2420753, 2469812, 2518768, 2566973, 2613120, 2655817]
57276B655817L8065L2349K5910J9478J3321P042P79m317p631j0021j2230j3399
57264B745163j2446r983p479n143k167J468M887P805J0699J3677J6344J8674K1003
57251B802502K3251K5148K6973K9117L1155L2334L2789L3347L4319L5290L5953
57240C142178L6337L6514L6689L7306L8428L9385L9673L9674L9950M0474M1168
57229C567776M2407M4187M5722M6657M7752M9428N0690N0605M9801M9237M8466
57218D092728M6627M4225M2302M0516L7798L4419L1717L0109K8985K8291K8579
57207D486296K9641L0604L1343L2465L4004L5413L6673L8072L9133L9109L8401
57196D871154L8124L8519L8947L9275L9875M0545M0861M1365M2924M5073M6477
$$ y = [2655817, 2693882, 2726231, 2752141, 2771619, 2784940, 2791982, 2792761, 2788444, 2780813, 2770792, 2758562, 2745163, 2732717, 2722734, 2715255, 2710112, 2707945, 2709413, 2714300, 2722105, 2732804, 2746481, 2762825, 2781499, 2802502, 2825753, 2850901, 2877874, 2906991, 2938146, 2970480, 3003269, 3036616, 3070935, 3106225, 3142178, 3178515, 3215029, 3251718, 3289024, 3327452, 3366837, 3406510, 3446184, 3486134, 3526608, 3567776, 3610183, 3654370, 3700092, 3746749, 3794501, 3843929, 3894619, 3945224, 3995025, 4044262, 4092728, 4139355, 4183580, 4225882, 4266398, 4304196, 4338615, 4370332, 4400441, 4429426, 4457717, 4486296, 4515937, 4546541, 4577884, 4610349, 4644353, 4679766, 4716439, 4754511, 4793644, 4832753, 4871154, 4909278, 4947797, 4986744, 5026019, 5065894, 5106439, 5147300, 5188665, 5231589, 5276662, 5323139]
57185E323139M6900M7215M7561M7082M5632M4203M3362M2621M1530M0260L8860
57174E808365L7081L5036L3033L0776K7785K4503K1792J9527J6907J3973J1475
57163F080253R375O995M493K782J884Q66m81j308j220p16R3J775M371P041R255
57148F125458J1286J3433J5694J8149K0639K2283K2484K2088K2245K2453K1230
57137F337442J8388J5051J1668P765L591J66k362m706o754p638p491p355p238
57124F350527o207m520l692m011m005k766r01J364N021J0487J6710K2845K9185
57111F410037L5891M2494M9487N8885P2606R1643J17192J50853J93214K44022
57101G466324L04480L78014M68586N80224P18583Q90898J103538J360892J666332
$$ y = [5323139, 5370039, 5417254, 5464815, 5511897, 5557529, 5601732, 5645094, 5687715, 5729245, 5769505, 5808365, 5845446, 5880482, 5913515, 5944291, 5972076, 5996579, 6018371, 6037898, 6054805, 6068778, 6080253, 6089628, 6096623, 6101116, 6103898, 6105782, 6106648, 6106167, 6104859, 6103639, 6102923, 6103016, 6104791, 6109162, 6116203, 6125458, 6136744, 6150177, 6165871, 6184020, 6204659, 6226942, 6249426, 6271514, 6293759, 6316212, 6337442, 6355830, 6370881, 6382549, 6390314, 6393905, 6394071, 6391709, 6387003, 6380249, 6372611, 6365120, 6357765, 6350527, 6344320, 6339800, 6336108, 6332097, 6328092, 6325326, 6324425, 6325789, 6330810, 6341297, 6358007, 6380852, 6410037, 6445928, 6488422, 6537909, 6596794, 6669400, 6761043, 6878235, 7029088, 7222302, 7466324, 7770804, 8148818, 8617404, 9197628, 9916211, 10807109, 11910647, 13271539, 14937871]
57092A4937871K021364K422643K861247L324457L795316M250078M659235M992091
57084D3264302N218716N310731N248824N032319M673215M173783L515961K684130
57076G9121981J700682O33512m33127j432229k322909l080457l689940m149640
57068F6347873m472797m679754m786464m799572m720626m553522m308501m001454
57060C0025183l651698l280188k907108k548576k215005j912408j644138j410785
57052A0455277j209923j037675q90527p65259o58451n67341m90514m26646l73249
57043D035692l27631k88421k55173k27103k03207j82912j65627j50341j36457
57034B098820j24245j13628j03544r3440q4189p6506o9637o2875n7006n2742m9015
$$ y = [14937871, 16959235, 19381878, 22243125, 25567582, 29362898, 33612976, 38272211, 43264302, 48483018, 53793749, 59042573, 64074892, 68748107, 72921890, 76437851, 79121981, 80822663, 81456175, 81023048, 79590819, 77267910, 74187453, 70497513, 66347873, 61875076, 57195322, 52408858, 47609286, 42888660, 38335138, 34026637, 30025183, 26373485, 23093297, 20186189, 17637613, 15422608, 13510200, 11866062, 10455277, 9245354, 8207679, 7317152, 6551893, 5893442, 5326101, 4835587, 4408941, 4035692, 3708061, 3419640, 3164467, 2937364, 2734157, 2551245, 2385618, 2235277, 2098820, 1974575, 1860947, 1757403, 1663963, 1579774, 1503268, 1433631, 1370756, 1313750, 1261008, 1211993]
57023A211993m4606m0237l7093l4396l0646k6496k3906k2895k1522j8886j5795
57012H95515j2489q085k548L035Q753J6374K6985M0111N6057P7000J04389J36484
57000A341581J69053J96221K08890J94850J45470O4876k8382j10825j66846j94172
56990A820716j99466j90697j73375j51223j27382j04120q2613o3812m8945l8746
56980F40337l2912l0701l1379l3661l5669l6194l5296l3241k9728k4792j9482
56969B97282j4665j0088n391j189J919M618P977J1999J6061K0224K4898K9761
56957C83406L3948L6842L7563L4432K6188J3684m71j3538k3405k8750k9774k8260
56945D41865k5914k3033j9482j5977j3199j0495o807k323K099O474J1403J6835
$$ y = [1211993, 1167387, 1127150, 1090057, 1055661, 1025015, 998519, 974613, 951718, 930196, 911310, 895515, 883026, 874941, 872393, 875428, 884181, 900555, 927540, 967651, 1023708, 1100708, 1205097, 1341581, 1510634, 1706855, 1915745, 2110595, 2256065, 2320941, 2292559, 2181734, 2014888, 1820716, 1621250, 1430553, 1257178, 1105955, 978573, 874453, 791840, 728028, 679083, 640337, 607425, 576724, 545345, 511684, 476015, 439821, 404525, 371284, 341556, 316764, 297282, 282617, 272529, 267138, 265949, 267868, 272486, 280463, 292462, 308523, 328747, 353645, 383406, 417354, 454196, 491759, 526191, 552379, 566063, 565592, 552054, 528649, 499899, 470125, 441865, 415951, 392918, 373436, 357459, 344260, 333765, 326958, 324635, 326734, 333208, 344611, 361446]
56933C61446K2436K8550L5356M1442M4382M2333L4339K0228J871j6333l0068l8044
56921E47938m1386m1107l7889l3372k9333k5769k1638j7256j4152j2734j1916
56910B61386j0970j0050r018p500o032n453n215m044k151r82p52j68J249K539
56896B02839L304M404O205P884R183J1167J4540J8569K2444K6337L0408L3772
56884C91056L5124L3564K8498J9885R039j699j0550j6862k0234k0340j7841j4378
56872D15262j1182q318n358j910K421P740J3505J9360K6035L4513M4618N5498
56860E92184O6697P7198Q3716Q1798O9062M6586J7870j2068l7372n3767o1065
56849H70839o2054n9041n2875m4693l6174k7704j8312p774K991J3909K6129M0095
$$ y = [361446, 383882, 412432, 447788, 489230, 533612, 575945, 610284, 630512, 632383, 616050, 585982, 547938, 506552, 465445, 427556, 394184, 364851, 339082, 317444, 300188, 286036, 273302, 261386, 250416, 240366, 231348, 223848, 217816, 212363, 207148, 203104, 200953, 199971, 199219, 199051, 200300, 202839, 206143, 210547, 216752, 224636, 233819, 244986, 259526, 278095, 300539, 326876, 357284, 391056, 426180, 459744, 488242, 508127, 517166, 515467, 504917, 488055, 467821, 447481, 429640, 415262, 404080, 395762, 390404, 388494, 390915, 398655, 412160, 431520, 457555, 492068, 536686, 592184, 658881, 736079, 819795, 901593, 970655, 1017241, 1035111, 1023043, 985671, 931904, 870839, 808785, 749744, 696869, 652176, 616002, 588298, 569986, 562212, 565203, 579112, 605241, 645336]
56837F45336N5158P1514R0212J10368J28031J38376J37347J21115Q7250L8688
56827A623395j5008o2434r6291j14805j19784j15030j05144r3444q0847o7273
56817G53335n3332l9930k7171j4721k484R833K3161L8238N4706P1380Q6545R7386
56805I96946R9845R0050O6460L1436q580m5177p2052q7724r4032r2995q6325p6778
56793G21074o7268n8398m8847l8413k8584j9922j1204j815P195J5356K3976L3869
56781E27019M3560N0660N3462N0269L9253K0745j501k2582l9293n0298n5248n5119
56769E60927n2128m8010m3042l7323l1824k7305k3429j9773j6650j4222j2021
56758B35200r992q773q281p385n636l999l107k345j392j061j685k187j805j203
$$ y = [645336, 700494, 772008, 862220, 972588, 1100619, 1238995, 1376342, 1497457, 1584707, 1623395, 1608387, 1545953, 1449662, 1334857, 1215073, 1100043, 994899, 901455, 820608, 753335, 700003, 660073, 632902, 618181, 615697, 625530, 648691, 686929, 741635, 813015, 899560, 996946, 1096791, 1186841, 1253301, 1284737, 1276157, 1230980, 1158928, 1071204, 977172, 884177, 797852, 721074, 653806, 595408, 546561, 508148, 479564, 459642, 448438, 446623, 453818, 469174, 493150, 527019, 570579, 621239, 674701, 724970, 764223, 784968, 783467, 760885, 721592, 671294, 616046, 560927, 508799, 460789, 417747, 380424, 348600, 321295, 297866, 278093, 261443, 247221, 235200, 225208, 216435, 208154, 200769, 195133, 191134, 188027, 185682, 184290, 183229, 181544, 179357, 177552, 176349]
56744A76349r98o63NJ0j073j968j682j158j552k288k274j867k018k544k731k764
56728A50784l126l394k935k125j688j510j136p09n27l24J04M08M49O74J164J309
56712A37418R97Q97J061O56l08n59K04M56p37k058k006j057m20j64N4j97j018
56695A33219j219n4J228J170L11N6M14N15M36Q48J465J483R81N89K85k42o15l26
56677A40544L05O75Q38J063J150R52P53M95m05j838k721k647k515k850k951k566
56661A28282k817m357o083o868p202p858q299p760o681n869n336m966n058n277
56647D3851m574l005k049k146j794j26J556K201K791M189N292N187N149O411P766
56632G0699P537O316N614N297M521L831M120M761M775M556M610M038K290Q36Q76
$$ y = [176349, 175351, 174688, 174693, 174703, 173630, 171662, 169980, 168822, 167270, 164982, 162708, 160841, 158823, 156279, 153548, 150784, 147658, 144264, 141329, 139204, 137516, 136006, 134870, 134161, 133634, 133310, 133414, 133822, 134271, 134945, 136109, 137418, 138415, 139312, 140373, 141029, 140721, 140162, 140366, 140822, 140085, 138027, 136021, 134964, 134544, 134380, 134434, 134237, 133219, 132000, 131946, 133174, 134344, 134655, 134711, 135125, 135640, 136076, 136924, 138389, 139872, 140853, 141442, 141727, 141485, 140870, 140544, 140849, 141524, 142362, 143425, 144575, 145527, 146280, 146775, 146370, 144532, 141811, 139164, 136649, 133799, 130848, 128282, 125465, 121108, 115025, 108157, 100955, 93097, 84798, 77038, 70357, 64488, 59152, 54186, 49128, 43851, 39277, 36272, 34223, 32077, 30283, 30157, 31713, 33914, 36705, 40894, 46186, 51373, 56522, 62933, 70699, 78236, 84552, 90166, 95463, 99984, 103815, 107935, 112696, 117471, 122027, 126637, 130675, 132965, 133801, 134677]
56617A34677J056l04k165k524j692j283j219m12O74R12R37K009L289K945J300
56602A38200L84Q60J745K505L117K773R81p82q27K0k23j404j782j129p11p02j92
56585A42833O71R44R07J522K297J992R88P32J244J380J099J275J732J682J518
56570A62816K035K540K012J425K450M447N257M546L916M114M518M930N599N834
56556B16439M894L754L835M555M471L934M189M653L846K265J544J315j17k464
56542B57113l682l315k804k787k747k966m069n007m323l033l307m740m944l601
56528B05788k711k930k860k129k036k832l247k913k637k253j002R4p19k588k920
56513A72105j542q72j699k249j746j498j868j487k66p1j440k624k733k955l716
$$ y = [134677, 135733, 135429, 133264, 130740, 129048, 127765, 126546, 126134, 126808, 127720, 128657, 130666, 133955, 136900, 138200, 138584, 139444, 141189, 143694, 146811, 149584, 150565, 149783, 148956, 148976, 148753, 147349, 145567, 144438, 143727, 143025, 142833, 143504, 144448, 145355, 146877, 149174, 151166, 152154, 152886, 154130, 155510, 156609, 157884, 159616, 161298, 162816, 164851, 167391, 169403, 170828, 173278, 177725, 182982, 187528, 191444, 195558, 200076, 205006, 210605, 216439, 221333, 225087, 228922, 233477, 237948, 241882, 246071, 250724, 254570, 256835, 258379, 259694, 259577, 257113, 253431, 250116, 247312, 244525, 241778, 238812, 234743, 229736, 225413, 222380, 219073, 214333, 209389, 205788, 203077, 200147, 197287, 195158, 193122, 190290, 187043, 184130, 181493, 179240, 178238, 178332, 177613, 175025, 172105, 170563, 169691, 167992, 165743, 163997, 162499, 160631, 159144, 158878, 158807, 157367, 154743, 152010, 149055, 145339]
56498A45339l567j988n86m14m84J5L75J63J50O26R13J050J904L119L240K271J830
56481A53956K432K930K930L366M320M674M210L833L612K899K247K732L599L317
56467B01057K566L208M632M494K933K403L310L466K199J295J325P82n31q86j26
56452B32127q4q57l86J376J819K49p39K78J406J196Q06R98N03r23j319j3R91N49
56434B37977M1J20o86k560l239j981j183k235l230k700k165k885l494l049l102
56419B05629m477n167l814k256k219k435j445l92n89r09j41O48L48J6N76P78l96
56402A83755j623j666j524k084k079n00J202J397P43N51Q03J277K429L743L658
56387A90082K360K068L301L924L102K899M316N205M097K691K489K248J012M21
$$ y = [145339, 141772, 139784, 139198, 138784, 138300, 138315, 138690, 138853, 139003, 139629, 140542, 141592, 143496, 146615, 149855, 152126, 153956, 156388, 159318, 162248, 165614, 169934, 174608, 178818, 182651, 186263, 189162, 191409, 194141, 197740, 201057, 203623, 206831, 211463, 215957, 218890, 221293, 224603, 228069, 230268, 231563, 232888, 233670, 233139, 232253, 232127, 232043, 231186, 230800, 232176, 233995, 234244, 233505, 233783, 235189, 236385, 237191, 238189, 238692, 237769, 236450, 236437, 237428, 237977, 238018, 238138, 237452, 234892, 231653, 229672, 228489, 226254, 223024, 220324, 218159, 215274, 211780, 208731, 205629, 201152, 195985, 192171, 189915, 187696, 185261, 183816, 183424, 182835, 181926, 181785, 182433, 182781, 182797, 183373, 184151, 183755, 182132, 180466, 178942, 176858, 174779, 174279, 175481, 176878, 177621, 178172, 178975, 180252, 182681, 186424, 190082, 192442, 194510, 197811, 201735, 204837, 207736, 212052, 217257, 221354, 224045, 226534, 228782, 229794, 230215]
56373B30215J591K801K610K342L159L775L342L452M869N477L960K312K152J848
56359B73905l0j589r60L84M93J98O47O30o59j233L48K065J910J263J811K188R41
56342B82312r8J112L152L940M494O417Q262Q111P250P752Q611P856O348N997O260
56327C67776N766N363O330P596P830Q146R603J0390Q773O576O290O936O156M315
56313D67846L182K455R97l88o47r45k441l623k960j921k279k688j221R49J722
56298D58038J773K696L678L342K900M024N602N823N501O297P630Q426R609J1896
56284E37235J3555J3402J3512J5800J8561J9634K0262K2367K4838K6103K7624
56273G52893L1179L5284L8133M1355M7042N3692N8979O3994P0863P8814Q6470
$$ y = [230215, 231806, 234607, 237217, 239559, 242718, 246493, 249835, 253287, 258156, 263633, 267593, 269905, 272057, 273905, 273875, 272286, 271326, 271710, 272203, 272401, 273048, 273678, 273019, 271786, 272134, 274199, 276109, 277372, 279183, 281371, 282312, 282214, 283326, 286478, 290418, 294912, 301329, 309591, 317702, 324952, 332704, 341315, 349171, 355519, 361516, 367776, 373542, 378905, 385235, 392831, 400661, 408807, 418410, 428800, 437573, 444149, 450439, 457375, 463531, 467846, 471028, 473483, 474480, 474092, 473445, 472500, 470059, 466436, 463476, 461555, 459276, 456588, 455367, 456316, 458038, 459811, 462507, 466185, 469527, 472427, 476451, 482053, 487876, 493377, 499674, 507304, 515730, 525339, 537235, 550790, 564192, 577704, 593504, 612065, 631699, 651961, 674328, 699166, 725269, 752893, 784072, 819356, 857489, 898844, 945886, 999578, 1058557, 1122551, 1193414, 1272228, 1358698]
56262A358698R5362J07176J20117J31924J43743J57132J70140J80542J89834J99664
56252B854332K07315K09246K06204K00180J89437J71522J48404J23476R6188O4850
56242D471154L2150K532k3688m8398p0223q6213r6958j04991j10179j11529j11246
56231C742411j12021j12566j10732j08533j09031j10962j11617j12280j15280
56222B739389j18459j18445j16794j16928j17528j15078j10582j07420j04729
56213A713426r9241r1744q5455p9917p2727o5319o0656n7143n1281m4474m0685
56202I64784l9128l5893l1063k7578k4845k0284j5587j4382j5177j3553j0019
56191G17275q652r297q228n446m149l938j671J769K630J474K277N138O728P012
$$ y = [1358698, 1454060, 1561236, 1681353, 1813277, 1957020, 2114152, 2284292, 2464834, 2654668, 2854332, 3061647, 3270893, 3477097, 3677277, 3866714, 4038236, 4186640, 4310116, 4406304, 4471154, 4503304, 4505836, 4482148, 4433750, 4363527, 4277314, 4180356, 4075365, 3965186, 3853657, 3742411, 3630390, 3517824, 3407092, 3298559, 3189528, 3078566, 2966949, 2854669, 2739389, 2620930, 2502485, 2385691, 2268763, 2151235, 2036157, 1925575, 1818155, 1713426, 1614185, 1522441, 1436986, 1357069, 1284342, 1219023, 1158367, 1101224, 1049943, 1005469, 964784, 925656, 889763, 858700, 831122, 806277, 785993, 770406, 756024, 740847, 727294, 717275, 708623, 699326, 691098, 685652, 681503, 677565, 675894, 677663, 680293, 681767, 684044, 689182, 695910, 702922]
56177G02922Q679J0882J0607R223J0582J3571J3796J1549J0765J1094Q712M228
56165H26610J987K125R08j571j783k31p96l037k881n01K53l25J535N184O403N691
56149H39571P570J2011J4879J6458K1009K8096L3028L5982M1990N1717O0955O9526
56137A232792Q1885R8407J14555J29003J43884J56719J61214J56777J48771J39139
56127B563146J25713J11042J02139J00230R9362R5708Q9533P8126N6862K8390
56117C450251J426k0462m0040n6852o6997p2967q2902r8583j13957j26360j38593
56106B633964j49047j51063j44080j34852j25837j12983r6514q2800p3466o3598
56096A499724n2717m6394m4924m1691l5052l0635k9562k6008j8973j4792j5093
$$ y = [702922, 711601, 722483, 733090, 742313, 752895, 766466, 780262, 791811, 802576, 813670, 822382, 826610, 828597, 830722, 831630, 830059, 828276, 828045, 827249, 824212, 821331, 820830, 821083, 820758, 822293, 827477, 833880, 839571, 847141, 859152, 874031, 890489, 911498, 939594, 972622, 1008604, 1050594, 1102311, 1163266, 1232792, 1314677, 1413084, 1527639, 1656642, 1800526, 1957245, 2118459, 2275236, 2424007, 2563146, 2688859, 2799901, 2902040, 3002270, 3101632, 3197340, 3286873, 3364999, 3421861, 3450251, 3451677, 3431215, 3391175, 3334323, 3267326, 3194359, 3111457, 3012874, 2898917, 2772557, 2633964, 2484917, 2333854, 2189774, 2054922, 1929085, 1816102, 1719588, 1636788, 1563322, 1499724, 1447007, 1400613, 1355689, 1313998, 1278946, 1248311, 1218749, 1192741, 1173768, 1158976, 1143883]
56085A143883j3854r271o907q229p680m036k777m412k617L127N509L022K882P198
56071A105838R225O868O624J0392J1640Q729Q573J2941J4684J1779J1286J5104
56059A233683J5954J2132J1630J6697J9082J5834J4856J9219K1181J7789J7039
56048A415096K2190K5348K3162K3473K9467L2887K9996K8741L2965L5237L2474
56037A731036L2533L8030M0148L5916L4706L9941M1864L6537L4084L9533M3704
56026B148032M1935M3156N1160N5925N3260N3511O0775O3636N7224N3805O0106
56015B742525O5031O1892O1365O9737P5927P3530P3869Q3400R0305Q7802Q8123
56004C573506R8666J07426J07201J10343J23836J34461J34998J39636J56252J69979
$$ y = [1143883, 1130029, 1120758, 1113851, 1105622, 1097942, 1093906, 1091129, 1086717, 1084100, 1087227, 1092736, 1095758, 1098640, 1105838, 1115063, 1121931, 1128555, 1138947, 1150587, 1159316, 1167889, 1180830, 1195514, 1207293, 1218579, 1233683, 1249637, 1261769, 1273399, 1290096, 1309178, 1325012, 1339868, 1359087, 1380268, 1398057, 1415096, 1437286, 1462634, 1485796, 1509269, 1538736, 1571623, 1601619, 1630360, 1663325, 1698562, 1731036, 1763569, 1801599, 1841747, 1877663, 1912369, 1952310, 1994174, 2030711, 2064795, 2104328, 2148032, 2189967, 2233123, 2284283, 2340208, 2393468, 2446979, 2507754, 2571390, 2628614, 2682419, 2742525, 2807556, 2869448, 2930813, 3000550, 3076477, 3150007, 3223876, 3307276, 3397581, 3485383, 3573506, 3672172, 3779598, 3886799, 3997142, 4120978, 4255439, 4390437, 4530073, 4686325, 4856304]
55994D856304J72166J78084J96902K12698K15443K21318K40882K57839K62015
55985F813651K71563K98260L23654L35318L52490L88479M23422M43652M70939
55976A0121428N21369N74009O13652O63922P42285Q25118Q95935R82882J107113
55967A7047713J242612J372370J532465J751100K000645K265483K596620L037976
55959C2846984L566663M177977M956066N978590P234085Q734453J0626343J3085756
55951I1206917J6213720K0171380K5243220L1450091L8070210M3712011M6789030
55944C12856579M5739775L9123791K6379196R009397r338053k4635336l4618693
55937C64516656l9346808m0117276l8290329l4952985l0983697k6970273k3150626
$$ y = [4856304, 5028470, 5206554, 5403456, 5616154, 5831597, 6052915, 6293797, 6551636, 6813651, 7085214, 7383474, 7707128, 8042446, 8394936, 8783415, 9206837, 9650489, 10121428, 10642797, 11216806, 11830458, 12494380, 13236665, 14061783, 14957718, 15940600, 17047713, 18290325, 19662695, 21195160, 22946260, 24946905, 27212388, 29809008, 32846984, 36413647, 40591624, 45547690, 51526280, 58760365, 67494818, 78121161, 91206917, 107420637, 127592017, 152835237, 184285328, 222355538, 266067549, 312856579, 358596354, 397720145, 424099341, 433108738, 423770685, 399135349, 364516656, 325169848, 285052572, 246762243, 211809258, 180825561, 153855288, 130704662]
55930A30704662j9604911j6441130j3737704j1451121r502152p878234o574994
55923D5514416n519597m632251l900319l326037k860945k453719k109231j843167
55915A8869150j625727j422088j243890j111177j003415q93815p94500p24310
55907A0050228o66501n99131n35057m93000m59320m15122l72534l48739l31042
55898E829782l01670k71686k57613k48331k26902k02763j91809j85558j69347
55889C774103j51241j44848j42182j30382j17360j15103j15008j04692r2459r0869
55879B569959r2395q4821p5009p4195p5145o6687n6229n5565n8183n2504m4226
55868A835000m4302m7567m3973l8609m0372m2908l6654k8055k7295k8483k1338
$$ y = [130704662, 111099751, 94658621, 80920917, 69469796, 59967644, 52089410, 45514416, 39994819, 35362568, 31462249, 28136212, 25275267, 22821548, 20712317, 18869150, 17243423, 15821335, 14577445, 13466268, 12462853, 11569038, 10774538, 10050228, 9383727, 8784596, 8249539, 7756539, 7297219, 6882097, 6509563, 6160824, 5829782, 5528112, 5256426, 4998813, 4750482, 4523580, 4320817, 4129008, 3943450, 3774103, 3622862, 3478014, 3335832, 3205450, 3088090, 2972987, 2857979, 2753287, 2660828, 2569959, 2477564, 2392743, 2317734, 2243539, 2168394, 2101707, 2045478, 1989913, 1931730, 1879226, 1835000, 1790698, 1743131, 1699158, 1660549, 1620177, 1577269, 1540615, 1512560, 1485265, 1456782, 1435444]
55857A435444j1450r714j2257r981p742j4949k6342l0652k9901l2392l5196l1016
55845A183852k4275k3303k4211j8982j1711j0812j2980j0784q243j2802j9489
55834A006260j9270j5832j8132k3188k2324j8018j8584k2056k0859j7023j7620
55823G93354k0319j8277j4327j5837k0298k0079j6696j6629j7828j4142q438p665
55811F02819r342o371p89M80q69J493N505M898K119L851P647O247J438M05J838
55796F21369j116p210r562q886j1344j5762j5728j2329j2295j5241j4924j1420
55784D85552j0362j1620j0165o616n771o319l098K002K327j953n101o833j1223
55771D10820j6493j6941j3704j2854j4034j1727o547m455n613m680j562j438m470
$$ y = [1435444, 1423994, 1414280, 1402023, 1392042, 1384300, 1369351, 1343009, 1312357, 1282456, 1250064, 1214868, 1183852, 1159577, 1136274, 1112063, 1093081, 1081370, 1070558, 1057578, 1046794, 1038551, 1025749, 1006260, 986990, 971158, 953026, 929838, 907514, 889496, 870912, 848856, 827997, 810974, 793354, 773035, 754758, 740431, 724594, 704296, 684217, 667521, 650892, 633064, 618922, 610484, 602819, 593477, 587106, 586317, 586797, 585928, 587421, 592926, 597824, 599943, 603794, 611441, 617688, 619126, 619531, 621369, 620253, 613043, 603481, 594595, 583251, 567489, 551761, 539432, 527137, 511896, 496972, 485552, 475190, 463570, 453405, 446789, 441018, 434699, 431601, 433603, 435930, 433977, 428876, 422043, 410820, 394327, 377386, 363682, 350828, 336794, 325067, 318520, 314065, 308452, 303772, 302210, 300772, 296302]
55758B96302n685m802o251r636r969p250o395p745o961m118l679n504n009k144
55744B11154j355k758k196Q4k60k866k944l80J05j994k262Q3J265O81J474L293
55728B01124K485m06j273l33j549m451m682k479k467m994n791m234l890m872l745
55713A58443j102r78k678j394K762M667L542M025P225Q986Q043P863R197Q598
55699B17199N585L774L725K088j092j689P38J899O14L99K067K069m05j842j282
55684B33847j873m214m971l381k411k392l71L202M202K346J827L357K850n12k371
55669B29135j094l01j502j379J270K769J357J96J127J651N13K61J817K382J077
55654B39279Q68K674L302J447M1M47mk518m447m552n240p416q514p682p609r185
$$ y = [296302, 290617, 285815, 279564, 269928, 259959, 252709, 246314, 238569, 231608, 227490, 223811, 218307, 213298, 211154, 209799, 207041, 204845, 204929, 204669, 201803, 198859, 198479, 198584, 196590, 194328, 194411, 195676, 196357, 197831, 201124, 203609, 203203, 201930, 201597, 200048, 195597, 190915, 188436, 185969, 180975, 175184, 170950, 167060, 162188, 158443, 157341, 156363, 153685, 152291, 155053, 159720, 163262, 167287, 174512, 183498, 191541, 199404, 208601, 217199, 222784, 226558, 230283, 232371, 231279, 229590, 230328, 232227, 232841, 233240, 235307, 237376, 236971, 235129, 233847, 231974, 227760, 222789, 219408, 216997, 214605, 214234, 217436, 221638, 223984, 225811, 229168, 232018, 231506, 229135, 228041, 227740, 226238, 224859, 226129, 228898, 230255, 230451, 231578, 233229, 233742, 234003, 235820, 238202, 239279, 240147, 242821, 246123, 247570, 247611, 248058, 248054, 245536, 241089, 236537, 231297, 223881, 215367, 207685, 200076, 190891]
55638A90891r674q179p570q942r522q007o788o910o198m217l673m952m776k352
55624I9131j237k937m197k996j782k239k247o58J21r43j122Q20J933L34j517j476
55608G8988j059j565j411P1O55n33j140j33J41j329k005n87N70O7p7J208J796
55591G3657P73M89J860K242M20r07o9P20m9l33J065J881Q07J28J227K020J534
55574H7465K449O019R002Q961Q409J0367J3654J5862J7332J8897J9184J7207J4535
55561B49343J2096Q176J989m108q367j2064j5883j7731j6618j4947j4419j3484
55549A53983j1235r803j0169r643o524l446l023l729l180k048j739j450l91J85
55535H7788j65N04K834M292L365K106K085J651j92j158J24J162j28j776j525o22
$$ y = [190891, 181217, 173038, 165468, 156526, 147004, 138997, 132209, 125299, 119101, 114884, 111211, 106259, 101483, 99131, 97894, 94957, 90760, 87764, 85982, 83743, 81496, 80838, 80959, 80016, 78894, 79714, 81647, 81981, 80464, 78988, 77929, 76364, 74953, 75024, 75679, 75146, 74006, 73873, 74014, 72685, 70680, 70093, 70663, 70730, 70653, 71861, 73657, 74430, 74919, 76779, 79021, 79441, 78534, 78465, 79185, 79136, 78803, 79868, 81749, 82556, 82684, 83911, 85931, 87465, 89914, 95933, 104935, 113896, 122305, 132672, 146326, 162188, 179520, 198417, 217601, 234808, 249343, 261439, 269615, 271604, 267496, 259129, 247065, 231182, 213451, 196833, 181886, 167467, 153983, 142748, 132945, 122776, 113133, 106609, 103163, 100140, 96411, 93231, 91183, 89444, 87994, 87603, 87788, 87623, 88127, 90961, 95253, 98618, 100724, 102809, 104460, 104268, 103110, 103234, 104396, 104268, 102492, 100967, 100345]
55519A00345q14j072l69k61j561k054o65k62k910n916o171n080n334o059n084
55504E6733l226k427k106r22J33k07o95L5O71j68j046l83N47K28j24Q32J712J068
55486E0655K38N14L34j646l504l292k494l001l471k088k41N0j65Q51J869J026
55470C5635n48q33m87j000j521q27k37j233k324j582j44j7n30j57L03l51q54J86
55452B3479J256M85q90q01L0M5M8J194J933N58j314j297k79m08j069m78N66K09
55434B3267q12n20P30J321J433J930J879L30j125p09L40K3q36m35M89K39n40l91
55416B6613n2p32j239j69J028N17l73M99K103K248J608K055K817K086P75P79J171
55399D1734k2j754j686m77m37j234r35k9l88j313o98Q17Q50l88o17L44P76O48
$$ y = [100345, 99531, 98459, 98090, 97829, 96268, 94214, 93549, 93287, 90377, 84461, 78290, 73210, 67876, 61817, 56733, 53507, 51080, 48974, 48052, 48185, 47978, 47283, 47318, 47989, 47821, 46775, 46392, 46939, 47167, 47043, 47875, 49587, 50655, 50893, 51407, 51741, 50095, 46591, 43299, 40805, 37804, 34333, 32245, 32004, 32054, 31889, 32740, 34609, 35635, 35087, 34254, 33767, 32767, 31246, 30419, 30182, 28949, 26625, 25043, 24899, 24882, 24352, 24195, 24498, 24147, 23293, 23479, 24735, 25220, 24330, 23529, 23559, 23604, 23652, 24846, 26779, 27337, 26023, 24726, 24447, 24039, 22970, 22492, 23058, 23267, 22455, 21935, 22665, 23986, 25419, 27349, 29228, 29558, 28433, 27724, 28064, 28087, 27251, 26816, 27305, 27544, 27004, 26613, 26561, 25829, 24590, 24421, 25449, 25966, 25593, 26092, 28195, 30443, 32051, 34106, 36923, 39009, 39784, 40563, 41734, 41712, 39958, 38272, 37795, 37358, 36124, 35189, 35160, 34772, 33459, 32761, 33578, 34428, 34040, 33423, 33767, 34543, 35191]
55381C5191J326K307J855M33n0L16J6o27k35M49l62j979k315j623j728k271j502
55364B9201K4K02p48r05n38j558l455l673j946o52p97j050p51o12m84M73J423
55347A4154P38r55j544r07o71r45m05P93J267J154J563J875P04j025j242l38l05
55330A3911r48m36Q95R78j11k68P50J149O57P37J296O95q59j393o58l21o17j78
55312A5279Q13O43n63q75n4J66n03n01M32Q18L26P2O4o38j348n66Q77Q16l60l68
55292A4530O90N72o03k68J820K870J800P67R98R30l16j189q22o30j402j783r32
55275A7032K5L40P29J264Q65k55m02O27J021J66m79k89l87r25n30P92J142L6p23
55256B0049l61l25j206j449l48N43J93k69O1L99K42L12O48K04p93o93N83J058
$$ y = [35191, 36517, 38824, 40679, 41112, 41062, 41378, 41394, 40767, 40532, 40981, 40619, 38640, 36325, 34702, 32974, 30703, 29201, 29225, 29427, 28679, 27774, 27236, 25678, 22223, 18550, 16604, 15952, 15155, 14105, 13354, 12742, 12258, 12731, 14154, 14892, 13937, 12393, 11486, 10815, 9870, 9465, 10258, 11525, 12679, 14242, 16117, 16821, 15796, 14554, 14216, 13911, 12963, 12527, 13422, 14400, 14289, 14021, 14771, 15920, 16577, 17314, 18610, 19305, 18446, 17053, 16395, 16074, 15457, 15279, 16092, 16735, 16172, 15297, 15243, 15409, 14906, 14405, 14837, 15655, 15981, 16053, 16117, 15479, 14131, 13565, 14442, 15258, 14898, 14530, 15220, 15792, 15189, 14921, 16741, 19611, 21411, 22178, 23176, 24106, 23790, 22601, 21779, 21149, 19747, 17964, 17032, 17057, 17397, 18126, 19390, 20255, 20000, 19598, 20225, 21246, 21412, 20933, 20644, 20257, 19332, 18802, 19594, 20736, 20772, 20049, 19688, 19363, 18157, 16708, 16360, 16903, 17096, 16827, 16888, 17287, 17529, 17841, 18489, 18693, 17900, 17207, 17790, 18848]
55238A8848Q7n37J39P01K04k02K40M20l18p93j99N02N55N57P45L60m45l94M68
55219B0938N98j61j43R07J035m83j748j416n64j95L78J425J729R38M65Q46P37
55202B5286l04q20l55n01j677j818J2J611J169N9J37O97L28m94p87j018j660j726
55184A8139o65J22m48j239r40k87l85n72K02J481K430L265L964L312R58j211j448
55167B6678m94K7O0L93Q72R60Q33O24j62j344j587n12L27k61j304j435r48p76
55149B1951q39o94n37m62M4Q91J111N84M54J029J047l1q33l24N87O96J96l20q73
55130B3677j163l99J080J833J717K173L326L242J227o01n27K47M3n09l9J009J331
55113C7667Q52K73j97m05Q3Q73P90q3k07P34J155L80j28M58Q35K15q2P08J071
$$ y = [18848, 18935, 18398, 18537, 19238, 19442, 19240, 19480, 19900, 19582, 18789, 18590, 19092, 19647, 20204, 20949, 21309, 20864, 20470, 20938, 21536, 21375, 21232, 22139, 23174, 22691, 20943, 19527, 18963, 18768, 19146, 20571, 22300, 23238, 23703, 24549, 25286, 24982, 24162, 23807, 23306, 21629, 19811, 19823, 21434, 22603, 22662, 22799, 23496, 23824, 23330, 22543, 21525, 19865, 18139, 17474, 17596, 17148, 15909, 14969, 14682, 14297, 13725, 13927, 15408, 17838, 21103, 25067, 28379, 29337, 28126, 26678, 26184, 26211, 26271, 26664, 27536, 28496, 29329, 29953, 29791, 28447, 26860, 26348, 26675, 26414, 25110, 23675, 22727, 21951, 21112, 20418, 19881, 19419, 19463, 20354, 21465, 22049, 22503, 23532, 24579, 24548, 23715, 23391, 23978, 24674, 24870, 24550, 23677, 22514, 22115, 23195, 25028, 26745, 28918, 32244, 35486, 36713, 36112, 35585, 35832, 35875, 35366, 35327, 36336, 37667, 38519, 38792, 38595, 38190, 38273, 39146, 39936, 39853, 39646, 40380, 41535, 41915, 41787, 42245, 43080, 43295, 43213, 43921, 44992]
55094D4992j2r51k21J039J209Q18R27R01K4n92J44J253J561J758K561K772J435
55077E9618N6K98J101N98p07j087n98m02m03J22O44M02J36O55R54p8j336j154
55059E8819r7J78k66l49l46j188k213k029r28l39m79n48n97j199j932j985j623
55042D2879j394p67P36K018J854R69Q47J351J284N15j89o72j150j252q22n85p71
55025D4851l37J050J848J062J45N54J247P33j24J48P29J30p52j23J302J384K28
55008E4075k35K76K65n85j106j096j386j667q05P84J438R29N45O13K79l05L4J265
54990E3318J979J679J208R35L29m54n99j78j6rN73J298R93r3m75J39N15J43k9
54971F1256O37J538J964J740P71p38j613q00J014K239K659L398M782N934O482
$$ y = [44992, 44980, 44029, 43808, 44847, 46056, 46874, 47801, 48702, 48726, 48134, 48278, 49531, 51092, 52850, 55411, 58183, 59618, 59674, 59972, 61073, 61671, 60964, 59877, 59279, 58877, 58474, 58596, 59240, 59642, 59778, 60433, 61387, 61309, 59973, 58819, 58722, 58900, 58634, 58285, 57939, 56751, 54538, 52509, 51581, 51242, 50763, 50215, 49618, 48419, 46487, 44502, 42879, 41485, 40718, 41454, 43472, 45326, 46295, 47142, 48493, 49777, 50292, 50103, 49431, 48281, 47029, 46207, 45622, 44851, 44514, 45564, 47412, 48474, 48619, 49173, 50420, 51153, 51029, 51177, 51906, 52036, 51284, 51161, 52463, 53847, 54075, 53840, 54116, 54381, 53796, 52690, 51594, 50208, 48541, 47736, 48520, 49958, 50887, 51432, 52045, 52324, 52019, 52053, 53318, 55297, 56976, 58184, 59119, 59448, 58994, 58395, 58217, 58201, 58192, 58765, 60063, 61056, 60963, 60488, 60627, 61142, 61285, 61256, 61893, 63431, 65395, 67135, 67906, 67168, 65555, 64755, 65769, 68008, 70667, 74065, 78847, 84781, 91263]
54956I1263P089Q111R054R616J0090J0723J1588J2938J4677J5779J5230J3152
54944B29310J0194O479K084k332o448j0759j4905j6906j5746j3426j2491j2583
54932A42471j1679r665q157p436o250m491l474l448l126j966r57p75r31r94j067
54917G8055q88kJ139J715K088L362N545P609R197J0764J2270J3305J4189J5401
54903A73749J6189J5323J2885R780N990J039m299q547j1477j3733j5044j4758
54891A67097j3608j2882j2208j0339p786o359o244n907m876m313m550m416l445
54878G0164k606k414k241j877j930k251j831o92o2k92l92QM1n52q31l35K09L79
54860E2495O33R73O41l68r31m97K56P78J255J594J227L34j31Q7K32q5n10r57j632
$$ y = [91263, 98352, 106463, 115517, 125133, 135223, 145946, 157534, 170472, 185149, 200928, 216158, 229310, 239504, 245983, 248067, 245735, 239287, 228528, 213623, 196717, 180971, 167545, 155054, 142471, 130792, 121127, 112970, 105534, 99284, 94793, 91319, 87871, 84745, 82779, 81822, 81047, 80116, 79122, 78055, 77167, 77165, 78304, 80019, 82107, 85469, 91014, 98623, 107820, 118584, 130854, 144159, 158348, 173749, 189938, 205261, 218146, 227926, 233916, 234955, 230656, 222109, 210632, 196899, 181855, 167097, 153489, 140607, 128399, 118060, 110274, 103915, 97671, 91764, 86888, 82575, 78025, 73609, 70164, 67558, 65144, 62903, 61026, 59096, 56845, 55014, 54322, 54260, 53968, 53576, 53584, 53625, 53073, 52242, 51907, 52116, 52495, 53128, 54101, 54742, 54374, 53443, 52946, 53202, 53980, 55235, 56829, 58056, 58390, 58259, 58346, 58578, 58493, 57983, 57026, 55394]
54841E5394k051j525o28o22j454j813j276p31o10l28L03P07Q22J251K007K398
54825E1844K227J726O59j019k018j110O52J142L40J20R75J446R32O66J322J960
54809F1864K018K246K965L406L366L687M512M957N055N965P761R080R626J0863
54795A37371J3352J5515J6053J5645J5119J3858J1194P732M102o9m772q672j0695
54782B25733j1415j1840j2005j1652j0971r969q277o282n106m807m041k254p08
54769A26406n10j065j324j246j010j61J460K985L636L767M193N326P363J0251
54755A60071J3198J5283J6785J8663K0724K1765K1609K1128K0099J6985J1442
54744C57752N064r47o943j2930j7529j9871k0777k1103k0561j9063j7573j6570
$$ y = [55394, 53343, 51818, 51190, 50568, 49114, 47301, 46025, 45294, 44684, 44356, 44659, 45366, 46188, 47439, 49446, 51844, 54071, 55797, 56456, 55437, 53419, 52309, 52961, 54103, 54443, 54563, 55538, 56984, 57916, 58582, 59904, 61864, 63882, 66128, 69093, 72499, 75865, 79552, 84064, 89021, 94076, 100041, 107802, 116882, 126508, 137371, 150723, 166238, 182291, 197936, 213055, 226913, 238107, 245839, 249941, 249872, 245100, 236428, 225733, 214318, 202478, 190473, 178821, 167850, 157881, 149604, 143322, 138216, 133409, 129368, 127114, 126406, 125896, 124831, 123507, 122261, 121251, 121090, 122550, 125535, 129171, 132938, 137131, 142457, 149820, 160071, 173269, 188552, 205337, 224000, 244724, 266489, 288098, 309226, 329325, 346310, 357752, 362816, 361869, 354926, 341996, 324467, 304596, 283819, 262716, 242155, 223092, 205519, 188949]
54732A88949j5228j3113j1152r972q887p483o552o401n880m259k610k057k085
54719I3270j751j236j087j145j280j872k631k394j011p6o16j605j724j200p57
54704G2885k10O85J283J150Q88Q51L86o91j270p41j09k59n30j97J44o0r6N97J201
54685G5907J036R17J544J999J359M85N94J261J448J407J938K745L051L071L368
54670A02130L661L487L217L227L073K599K707L734M331L432K087J846K424K599
54656A44554K393K622L161L307L209L461L929M345N277P123Q991R987J0752J2312
54642B25423J4284J5689J6686J7828J8348J6855J3271Q672L689j545o492j0576
54630C32132j4021j7089j9134j9551j8944j8173j7041j5139j3114j1693j0376
$$ y = [188949, 173721, 160608, 149456, 139484, 130597, 123114, 116562, 110161, 104281, 100022, 97412, 95355, 93270, 91519, 90283, 89196, 88051, 86771, 84899, 82268, 79874, 78863, 78787, 78171, 76566, 74842, 73642, 72885, 72675, 73360, 74643, 75793, 76681, 77532, 77918, 77227, 75957, 75216, 75107, 74848, 74318, 74121, 74265, 74205, 74109, 74706, 75907, 76943, 77860, 79404, 81403, 82762, 83247, 83841, 85102, 86550, 87957, 89895, 92640, 95691, 98762, 102130, 105791, 109278, 112495, 115722, 118795, 121394, 124101, 127835, 132166, 135598, 137685, 139531, 141955, 144554, 146947, 149569, 152730, 156037, 159246, 162707, 166636, 170981, 176258, 183381, 192372, 202359, 213111, 225423, 239707, 255396, 272082, 289910, 308258, 325113, 338384, 347056, 350745, 349200, 342708, 332132, 318111, 301022, 281888, 262337, 243393, 225220, 208179, 193040, 179926, 168233, 157857]
54619A57857q450o489n292m325k781j365j249j978k189j802j644j419q2J959K932
54604A23683K120O82j40k96l56q05j903l268l844l145k142j942k170j879j421
54589A03174j918l291m211l982l193k584k315k200j879j002J1J1j252k301j812
54574G1256m61J83j41o86j338k350l023k336o71N85R39J029J171J070P69O55O67
54557F7318N26M67P66R36M80n3J54Q25J170J163J170J008N74O89J857K965K771
54540H4786K013K341L737M835N369O304P742Q593Q544Q492Q839Q848Q004O645
54526A75092M984K777K25j914l376m579n775o826p726q465q629q036p313o862
54512A13577n944m037k379k521l870m436l670k816k567k298j679j258j123o06
$$ y = [157857, 149407, 142918, 137626, 133301, 130520, 129155, 127906, 125928, 123739, 121937, 120293, 118874, 118792, 120751, 123683, 125803, 126485, 126345, 126049, 125693, 124888, 122985, 119717, 115873, 112728, 110586, 108644, 106474, 104595, 103174, 101256, 97965, 93754, 89772, 86579, 83995, 81680, 79480, 77601, 76599, 76610, 76621, 75369, 73068, 71256, 70795, 70978, 70837, 70151, 68813, 66463, 63440, 61104, 60433, 61018, 61957, 62986, 64157, 65227, 65996, 66651, 67318, 67844, 68311, 69077, 70013, 70493, 70440, 70594, 71419, 72589, 73752, 74922, 75930, 76504, 77193, 79050, 82015, 84786, 86799, 89140, 92877, 97712, 103081, 109385, 117127, 125720, 134264, 142756, 151595, 160443, 168447, 175092, 180076, 182853, 183078, 181164, 177788, 173209, 167434, 160608, 152882, 144417, 135788, 127752, 120439, 113577, 107633, 103596, 101217, 98696, 94826, 90390, 86720, 83904, 81337, 79039, 77360, 76102, 74979, 74373]
54498G4373L34Q07M40j80o75j195j475q85K95J024J099J309J850J965J469J228
54482H1783J694K184K118J817J651J389Q95N46N20N13L86L79M79L02k47q93j502
54465I4014j960j815r13j20l22j027j046l51M3j71l06j19j40m84o22n09o68j074
54447H2410j119q63j003j507j553j018p45j076j352j164q55n23K06J060J072J12
54431G2082o58m19K52N32N61Q72J340J415Q96R7m55l82J26M31L28M69J266J987
54413H0740J837J297J304J640J548J331J738K132J225m37o87J199L431M246L865
54398A06409L366L152L279L917M663M502L210J757Q39N8q71j322r48n49q98j571
54382A28993j756j592j837k698l648m116l916l296k757k540k358k000j896k414
$$ y = [74373, 74707, 75514, 75954, 75774, 75099, 73904, 72429, 71544, 71839, 72863, 73962, 75271, 77121, 79086, 80555, 81783, 83477, 85661, 87779, 89596, 91247, 92636, 93531, 94077, 94597, 95110, 95496, 95875, 96354, 96656, 96409, 95516, 94014, 92054, 90239, 89326, 89206, 88884, 87857, 86811, 86460, 86503, 86332, 86026, 85907, 85767, 85283, 84661, 84152, 83484, 82410, 81291, 80428, 79425, 77918, 76365, 75347, 74602, 73526, 72174, 71010, 70155, 69632, 69838, 70898, 71970, 72082, 71424, 71005, 71257, 71789, 72350, 73222, 74562, 75977, 76873, 76970, 76515, 76133, 76259, 76690, 77018, 77487, 78753, 80740, 82577, 83874, 85178, 86818, 88366, 89697, 91435, 93567, 94792, 94355, 93668, 94867, 98298, 102544, 106409, 109775, 112927, 116206, 120123, 124786, 129288, 132498, 134255, 135094, 135152, 134281, 132959, 132011, 131462, 130564, 128993, 127237, 125645, 123808, 121110, 117462, 113346, 109430, 106134, 103377, 100837, 98479, 96479, 94583, 92169]
54368I2169k911k396r42M44J179J347Q90k52j354j507r71p09o80K9J376K213K079
54351I0004J756J784J816J770K130K761K827K348K394L291L968L686L022K576
54337A26133K034J256R29J318J471N31j042k281k884k973k592k055j954k330k575
54322A12986k494k564k881k896k538k447k783k944k848l181l876l750k328q25
54308G4631n06j167j897k318k290j521l07L49Q2l46m37p38j554k038j517o28k21
54291E7577j25R9J13m47j039j058q60r91j133p25n4K58K88M82P80Q58P84P22N43
54272E6072L09N76J504K202J713K75j010j349o62O42J818K158J680J106Q79P32
54256F8645M19J87K62N02P90J113J103L30p66j164p02j96j6L15Q37Q12J56j10
$$ y = [92169, 89258, 86862, 85920, 86364, 87543, 88890, 89780, 89528, 88174, 86667, 85696, 84987, 84307, 84336, 85712, 87925, 90004, 91760, 93544, 95360, 97130, 99260, 102021, 104848, 107196, 109590, 112881, 116849, 120535, 123557, 126133, 128167, 129423, 130352, 131670, 133141, 133672, 132630, 130349, 127465, 124492, 121900, 119845, 117891, 115561, 112986, 110492, 107928, 105047, 102151, 99613, 97166, 94383, 91439, 88591, 85410, 81534, 77784, 75456, 74631, 74125, 72958, 71061, 68743, 66453, 64932, 64625, 64974, 65056, 64710, 64273, 63535, 61981, 59943, 58426, 57798, 57577, 57452, 57551, 57664, 57217, 56178, 55120, 54260, 53269, 52136, 51411, 51357, 51615, 51903, 52385, 53165, 54023, 54807, 55529, 56072, 56381, 56957, 58461, 60663, 62376, 62651, 61641, 60292, 59630, 60272, 62090, 64248, 65928, 67034, 67913, 68645, 69064, 69251, 69513, 70015, 70805, 71918, 73021, 73351, 72585, 71421, 70719, 70523, 70507, 70822, 71659, 72471, 72627, 72517]
54238G2517M33P09r5j063q46L52J203J004J21q14j319j118m32Q3J09o1j62k62
54220G0359l06r9J15p0l01J51R97J174O35N13J135J385O31k16l16j08j12J34R35
54201G6636J497J147M19m0m61j066j287r23q06j332j546p73m0n53j778k321j810
54184F4963q29J91R27Q35j0o13n05n86j574k711k967k447j553n5J738K319J015
54167E8138m57j54J350K110J760J435J458J107K84l11n35p79q06q5R22J168N35
54150F7140k60r32j541j607o46O21R63L40k74m81o04o21k36K20K36J68O22J050
54132F4158L87j137k149k014j356p86l96l75r76j750j933j512r87l25P40J685
54116E1274J676Q95K40j20n68p98j63Q52R68N3o83n68k17j27O6O00J001R69P69
$$ y = [72517, 72950, 73659, 73564, 72501, 71655, 72007, 73210, 74214, 74335, 73521, 72202, 71084, 70652, 70735, 70844, 70783, 70621, 70359, 70053, 69954, 70069, 69999, 69698, 69849, 70846, 72020, 72655, 73168, 74303, 75688, 76319, 76103, 75787, 75679, 75567, 75701, 76636, 78133, 79280, 79699, 79659, 79198, 78132, 76845, 75922, 75116, 73784, 72238, 71465, 71425, 70872, 69094, 66773, 64963, 64134, 64325, 65252, 66087, 66077, 65464, 64959, 64373, 62799, 60088, 57121, 54674, 53121, 53066, 54804, 57123, 58138, 57681, 57527, 58877, 60987, 62747, 64182, 65640, 66747, 67031, 66720, 66185, 65406, 64600, 64515, 65437, 66605, 67140, 66880, 65948, 64407, 62800, 62154, 62775, 63738, 64078, 63804, 63323, 62719, 62098, 61862, 62082, 62318, 62486, 63108, 64158, 64545, 63408, 61259, 59245, 57889, 57103, 56707, 56332, 55356, 53606, 51673, 50161, 49174, 48849, 49589, 51274, 52950, 53845, 54085, 53965, 53397, 52599, 52436, 53288, 54256, 54309, 53626, 53058, 52841, 52714, 52780, 53380, 54381, 55350, 56119]
54097E6119M39l11j171j218l26M37L49j0J60O47P69M27K0k71m45l49J30O06M98
54078E6500k57r18n96P20J905J799N73m20l21L37O13L66l2m50p55m55O27J726
54060F0962J994J585J232J150J086R84Q91O43L65O76J606J969R33l99j99J565
54044G7043L109L155K141J171Q68J359K408L320L534L398L753M779N867O511O700
54029A29116O533O168N961O105O265O098N795N588N138M150L131K792L043L327
54015A99210L451L375K693J241j75o37m14n43j474k811l991m487l928k822k494
54000A86194l401m273l888k908k718l204l206k533j984j755j380j045j402k211
53986A50286k551k313k166k231k088j899k096k184j328j3M21j28m50m6L46M16
$$ y = [56119, 56558, 56247, 55076, 53858, 53532, 53969, 54318, 54308, 54468, 55115, 55884, 56311, 56331, 56060, 55615, 55266, 55396, 56002, 56500, 56243, 55325, 54729, 55449, 57354, 59153, 59726, 59306, 58985, 59322, 59935, 60301, 60269, 59819, 59064, 58609, 59236, 60962, 62956, 64541, 65773, 66923, 68009, 68993, 69884, 70527, 70892, 71568, 73174, 75143, 76076, 75677, 75478, 77043, 80152, 83307, 85448, 86619, 87487, 88846, 91254, 94574, 98108, 101506, 105259, 110038, 115905, 122416, 129116, 135649, 141817, 147778, 153883, 160148, 166246, 172041, 177629, 182767, 186917, 190048, 192840, 195883, 199210, 202661, 206036, 208729, 209970, 209795, 209158, 208744, 208201, 206727, 203916, 199925, 195438, 191510, 188688, 186194, 182793, 178520, 174632, 171724, 169006, 165802, 162596, 160063, 158079, 156324, 154944, 153899, 152497, 150286, 147735, 145422, 143256, 141025, 138937, 137038, 134942, 132758, 131430, 131417, 131838, 131710, 131260, 131214, 131560, 131976]
53970A31976Q01J598J874J234N56O13J110J551J927K137J668M57p47j307j284
53955A44164r40m01O2J43QP8L81P16J143J554J313L13k12Q04K538L476L810M815
53937A63765O176O106M263K532K265K535J878K70j349k344k421j508j63P31J002
53922A83738J134J191R31Q96J936L572M278L725L175L474M129M743N716O967P584
53907B37189P341P175P509P595P033O425N902M628K559J067Q07N16r13k564k958
53892B89311k217j465j147j149j751l150m743n825o482o945o910o315n951o400
53878B28861p072p165o828o559o155n221m044l132k489k061k192k890l376l191
53864A66486l042l657m476m443l570k814k784l292l890m068l413k116j027p01
$$ y = [131976, 132777, 134375, 136249, 137483, 138039, 138652, 139762, 141313, 143240, 145377, 147045, 147502, 146755, 145448, 144164, 143224, 142823, 142885, 143028, 143036, 143114, 143495, 144211, 145354, 146908, 148221, 148534, 148322, 149126, 151664, 155140, 158950, 163765, 169941, 176047, 180310, 182842, 185107, 187642, 189520, 189790, 188441, 186097, 183676, 182168, 182005, 182736, 183738, 184872, 186063, 186994, 187890, 189826, 193398, 197676, 201401, 204576, 208050, 212179, 216922, 222638, 229605, 237189, 244530, 251705, 259214, 266809, 273842, 280267, 286169, 290797, 293356, 294423, 295230, 295746, 294833, 292269, 289311, 287094, 285629, 284482, 283333, 281582, 278432, 273689, 267864, 261382, 254437, 247527, 241212, 235261, 228861, 221789, 214624, 207796, 201237, 195082, 189861, 185817, 182685, 180196, 178135, 175943, 173053, 169677, 166486, 163444, 159787, 155311, 150868, 147298, 144484, 141700, 138408, 134518, 130450, 127037, 124921, 123894, 123193]
53850A23193q39j010j312j813k022j587j023j067j678k133j867r56j6K07l45p81
53834A04951l94J64k52j389j867j311p80p80m95M74J110O34j96m27l66o28q21
53817I7627l05N32Q96P92P62J017J534K416L399L805L488L031K558J534K56J80
53801A23522J745L300L331K580K628L483M101M363M910N634N898N838O016O162
53787A83511N553M428L688L473L108K361J668J256J030J075J395J352L75j011
53773B13262j760j663j376j289j292j377j663j969k111k385l152m079m497m184
53759A80465l423k610k262k741l503l339k025q56q13j156q32k98n69j254j106
53744A53678j50K90m15j532k265k582k620k359j979j735j465r18m44n27q88q53
$$ y = [123193, 122354, 121344, 120032, 118219, 116197, 114610, 113587, 112520, 110842, 108709, 106842, 105886, 105870, 106077, 105732, 104951, 104557, 104721, 104469, 103080, 101213, 99902, 99122, 98342, 97847, 98321, 99431, 100065, 99869, 99442, 99076, 98448, 97627, 97322, 97854, 98750, 99542, 100304, 101321, 102855, 105271, 108670, 112475, 115963, 118994, 121552, 123086, 123342, 123522, 125267, 128567, 131898, 134478, 137106, 140589, 144690, 149053, 153963, 159597, 165495, 171333, 177349, 183511, 189064, 193492, 197180, 200653, 203761, 206122, 207790, 209046, 210076, 211151, 212546, 213898, 214273, 213262, 211502, 209839, 208463, 207174, 205882, 204505, 202842, 200873, 198762, 196377, 193225, 189146, 184649, 180465, 177042, 174432, 172170, 169429, 165926, 162587, 160562, 159706, 158893, 157737, 156905, 156607, 156038, 154784, 153678, 153528, 153818, 153403, 151871, 149606, 147024, 144404, 142045, 140066, 138331, 136866, 135948, 135504, 134977, 134089, 133236]
53728A33236m59k50k42l5K66J63k13j84L87R40J135J094Q29K69k07j15K53K16
53710A37083n6L73J692K872L040K577K410K797L308L611L785L958L967L576K968
53695A77961K755L275L994M168L980M280N156N631N061L988L166K627K232K223
53681B30497K532K429J679J180J585K174K087J790K102K551K089R22J69M9j68
53666B53667o31p76o83j116k030k301j398k22J11m40j164j496j289p44k96j97
53650B38995j53K31P65Q81M15l12j008j485j480r62m33l71n98p40q91j263j549
53633B30042j336q30m62q6O40J429J691J445J210J190J239J366J609J725J651
53618B42523J909K845L902M338M223M017L794L625M074N257O122N792N015M979
$$ y = [133236, 132777, 132527, 132285, 132250, 132516, 132679, 132466, 132282, 132669, 133609, 134744, 135838, 136667, 136936, 136729, 136614, 136867, 137083, 137027, 137400, 139092, 141964, 145004, 147581, 149991, 152788, 156096, 159707, 163492, 167450, 171417, 174993, 177961, 180716, 183991, 187985, 192153, 196133, 200413, 205569, 211200, 216261, 220249, 223415, 226042, 228274, 230497, 233029, 235458, 237137, 238317, 239902, 242076, 244163, 245953, 248055, 250606, 252695, 253617, 253786, 253835, 253667, 253036, 252260, 251577, 250461, 248431, 246130, 244732, 244510, 244621, 244181, 243017, 241521, 240232, 239488, 239192, 238995, 238842, 239073, 239838, 240719, 241134, 240822, 239814, 238329, 236849, 235887, 235454, 235083, 234485, 233745, 232854, 231591, 230042, 228706, 227876, 227414, 227328, 227968, 229397, 231088, 232533, 233743, 234933, 236172, 237538, 239147, 240872, 242523, 244432, 247277, 251179, 255517, 259740, 263757, 267551, 271176, 275250, 280507, 286629, 292421, 297436, 302415]
53604C02415N356N010M146M060M889N420N219N235N940O449O135N713O009O692
53590C78688O999O876O737O721O720O620O183N253M214L645L462L094K571K605
53576D50388L302L704L027J698O89L75M39N15N52O61P53L79q28k354k983k197
53560D58120r53m53o81q93r21j029r47k75M31J81q62j489j136m27QJ73Q6m21j081
53541D47431j306j072q49o42m8P60J142J178J649K656L332L190K785K747L062
53526D66015L559M230M870N262N834P154Q748R505R370R427J0094J0615J0742
53513E65425J1458J3275J5100J5807J5913J6656J8146J9573K0665K1834K3158
53502G57010K4203K4816K5349K6061K6872K7716K8738L0010L1357L2474L3202
$$ y = [302415, 307771, 312781, 316927, 320987, 325876, 331296, 336515, 341750, 347690, 354139, 360274, 365987, 371996, 378688, 385687, 392563, 399300, 406021, 412741, 419361, 425544, 430797, 435011, 438656, 442118, 445212, 447783, 450388, 453690, 457394, 460421, 462119, 462808, 463183, 463622, 464137, 464689, 465350, 466103, 466482, 465654, 463300, 460317, 458120, 457167, 456714, 456033, 455140, 454219, 453190, 452243, 451968, 452399, 452580, 451718, 450229, 449093, 448666, 448674, 448847, 448933, 448512, 447431, 446125, 445053, 444204, 443562, 443514, 444274, 445416, 446594, 448243, 450899, 454231, 457421, 460206, 462953, 466015, 469574, 473804, 478674, 483936, 489770, 496924, 505672, 515177, 524547, 533974, 544068, 554683, 565425, 576883, 590158, 605258, 621065, 636978, 653634, 671780, 691353, 712018, 733852, 757010, 781213, 806029, 831378, 857439, 884311, 912027, 940765, 970775, 1002132, 1034606, 1067808]
53491A067808L3598L3817L3909L3887L3948L4297L4629L4299L3302L2592L2825
53480A438911L3388L3345L2845L2764L3229L3540L3255L2540L1536L0256K8923
53469A794532K7670K6101K4011K2154K1310K0948J9927J8212J6598J5087J3083
53458B019633J1022J0111J0128R122N889J389k848o439r556j1913j3294j4319
53446B008925j5842j8076k0760k3527k5854k7292k8146k9203l0608l1764l2493
53435A725360l3342l4450l5135l4941l4282l3633l2919l2034l1073k9782k7671
53424A366098k4973k2601k0893j9356j7868j6987j6658j5744j3406j0066o549
53413A180997l232m41J388K553M176O837R920J2774J5560J8522K1208K3067K4110
$$ y = [1067808, 1101406, 1135223, 1169132, 1203019, 1236967, 1271264, 1305893, 1340192, 1373494, 1406086, 1438911, 1472299, 1505644, 1538489, 1571253, 1604482, 1638022, 1671277, 1703817, 1735353, 1765609, 1794532, 1822202, 1848303, 1872314, 1894468, 1915778, 1936726, 1956653, 1974865, 1991463, 2006550, 2019633, 2030655, 2040766, 2050894, 2060016, 2065905, 2067294, 2064446, 2058007, 2048451, 2036538, 2023244, 2008925, 1993083, 1975007, 1954247, 1930720, 1904866, 1877574, 1849428, 1820225, 1789617, 1757853, 1725360, 1692018, 1657568, 1622433, 1587492, 1553210, 1519577, 1486658, 1454624, 1423551, 1393769, 1366098, 1341125, 1318524, 1297631, 1278275, 1260407, 1243420, 1226762, 1211018, 1197612, 1187546, 1180997, 1177765, 1177324, 1178712, 1181265, 1185441, 1192278, 1202198, 1214972, 1230532, 1249054, 1270262, 1293329, 1317439]
53400A317439K4635K5039K6113K8538L1835L4815L7209L9696M2234M3913M4836
53389A696302M6446M9279N2017N3718N5397N8206O1493O4095O6343O9194P2330
53378B344820P4631P6018P7347P8855P9924Q0096P9426P8110P6544P5230P3934
53367C194935P1570O7643O3090N8889N4638M9510M3863L8711L4208K9752K5169
53356C731978K0689J6050J0677M602j535p299j2682j7898k3432k9901l7360m5247
53344C608642n3295o1689o9828p6044p9341q0540q0872q0431p8987p7285p6232
53333B794098p5535p4396p2993p2016p1252o9903o7960o6077o4374o2411o0108
53322B037073n7646n4821n1400m7833m4656m1568l8056l4506l1717k9720k8045
$$ y = [1317439, 1342074, 1367113, 1393226, 1421764, 1453599, 1488414, 1525623, 1565319, 1607553, 1651466, 1696302, 1742748, 1792027, 1844044, 1897762, 1953159, 2011365, 2072858, 2136953, 2203296, 2272490, 2344820, 2419451, 2495469, 2572816, 2651671, 2731595, 2811691, 2891117, 2969227, 3045771, 3121001, 3194935, 3266505, 3334148, 3397238, 3456127, 3510765, 3560275, 3604138, 3642849, 3677057, 3706809, 3731978, 3752667, 3768717, 3779394, 3783996, 3782461, 3775162, 3762480, 3744582, 3721150, 3691249, 3653889, 3608642, 3555347, 3493658, 3423830, 3347786, 3268445, 3187905, 3107033, 3026602, 2947615, 2870330, 2794098, 2718563, 2644167, 2571174, 2499158, 2427906, 2358003, 2290043, 2223966, 2159592, 2097181, 2037073, 1979427, 1924606, 1873206, 1825373, 1780717, 1739149, 1701093, 1666587, 1634870, 1605150, 1577105]
53311A577105k6722k5846k4598k2040j8703j6115j4799j3777j2078r749p258m938
53299A380482l081j890j116l55L92J012J775K976M347N598P050R068J1247J3082
53285A430587J4998J7723K1015K4035K6694K9563L2556L4835L6014L6577L7037
53274A741634L7414L7526L7168L6140L4707L3670L3329L2752L0896K7980K4911
53263B108127K1947J8900J6155J4186J2434R972P040M607K620K2l498p174j0623
53250B194715j4253j7993k1036k3254k5679k9062l2881l6263l8897m0817m2087
53239A872493m3134m4444m5607m5528m3984m2075m0733l9577l7864l5788l4149
53228A419610l3272l2866l2575l2286l1998l1734l1344l0438k8907k7417k6767
$$ y = [1577105, 1550383, 1524537, 1499939, 1477899, 1459196, 1443081, 1428282, 1414505, 1402427, 1392678, 1385420, 1380482, 1377401, 1375511, 1374395, 1374040, 1374432, 1375444, 1377219, 1380195, 1384542, 1390140, 1397190, 1406258, 1417505, 1430587, 1445585, 1463308, 1484323, 1508358, 1535052, 1564615, 1597171, 1632006, 1668020, 1704597, 1741634, 1779048, 1816574, 1853742, 1889882, 1924589, 1958259, 1991588, 2024340, 2055236, 2083216, 2108127, 2130074, 2148974, 2165129, 2179315, 2191749, 2201721, 2208761, 2213368, 2215988, 2216010, 2212512, 2205338, 2194715, 2180462, 2162469, 2141433, 2118179, 2092500, 2063438, 2030557, 1994294, 1955397, 1914580, 1872493, 1829359, 1784915, 1739308, 1693780, 1649796, 1607721, 1566988, 1527411, 1489547, 1453759, 1419610, 1386338, 1353472, 1320897, 1288611, 1256613, 1224879, 1193535, 1163097, 1134190, 1106773, 1080006]
53217A080006k6648k5786k3525k0680j8503j7303j6504j5613j4718j4147j4021
53206H72558j4190j4476j4982j5893j7031j7835j7941j7418j6381j4870j3407
53195F98134j2814j3082j3095j2246j1476j1819j2716j2978j2818j3409j4684
53184E56997j5209j4369j3278j3090j3587j3922j3777j3223j2278j1149j0278
53173D12837r779r304q746q453q500q405p789o870o052n515n261n188n016m680
53159C13279m615n151n771n677m983m471m354m177l873l886m084l746k823k187
53145B53481k249k318j880j424j400j293n45K69J74p14j327j115o75q04j458j814
53129B34908j253j41N05J78m85m86L36J326J987K391K721K983L206L415L410L005
$$ y = [1080006, 1053358, 1027572, 1004047, 983367, 964864, 947561, 931057, 915444, 900726, 886579, 872558, 858368, 843892, 828910, 813017, 795986, 778151, 760210, 742792, 726411, 711541, 698134, 685320, 672238, 659143, 646897, 635421, 623602, 610886, 597908, 585090, 571681, 556997, 541788, 527419, 514141, 501051, 487464, 473542, 459765, 446542, 434264, 423115, 412837, 403058, 393754, 385008, 376555, 368055, 359650, 351861, 344991, 338939, 333424, 328163, 322975, 317959, 313279, 308664, 303513, 297742, 292065, 287082, 282611, 278257, 274080, 270207, 266321, 262237, 258491, 255668, 253481, 251232, 248914, 247034, 245610, 244210, 242917, 242372, 242641, 242815, 242101, 240774, 239659, 238984, 238180, 236722, 234908, 233655, 233514, 234019, 234197, 233712, 233226, 233562, 234888, 236875, 239266, 241987, 244970, 248176, 251591, 255001, 258006]
53113B58006K411J858J073k18j506k012j896k092k894l612l728l524l316k956
53099B35594k418k124k272k545k769l239m048m702m757m323l639k782k025j939
53085A92012k699l768m490m605m057k856j386k91J72K45N4n00j162j408j298j469
53069A62494j973k036j338p63j135j906j959j228o63p79j026p42j19Q8m00r69
53053A45546q34l0N81M19q1k49k45p46j668k015j182K15J078R74K67m92j018j379
53035A39141j763k142k196j736j056n84l95l37m19o13o54l73n4J3m7j24n06j226
53017A24929j551r19P8M86L19J77L2m46p96l34M36M04l10n36o4J42j50J7Q54J148
52997A23916K76o13l66M29N76O1l30l59k91r7K89M86K24q2M5M31P70J224J855
$$ y = [258006, 260417, 262275, 263348, 263130, 261624, 259612, 257716, 255624, 252730, 249118, 245390, 241866, 238550, 235594, 233176, 231052, 228780, 226235, 223466, 220227, 216179, 211477, 206720, 202397, 198758, 195976, 193951, 192012, 189313, 185545, 181055, 176450, 172393, 169537, 168151, 167860, 168032, 168277, 168331, 167831, 166669, 165261, 163963, 162494, 160521, 158485, 157147, 156384, 155249, 153343, 151384, 150156, 149493, 148714, 147688, 146946, 146827, 146915, 146515, 145546, 144712, 144682, 145263, 145682, 145601, 145352, 145107, 144361, 142693, 140678, 139496, 139711, 140789, 141763, 142030, 141538, 140520, 139141, 137378, 135236, 133040, 131304, 130248, 129664, 129269, 128932, 128513, 127900, 127246, 126873, 126819, 126832, 126785, 126661, 126155, 124929, 123378, 122459, 122537, 123023, 123342, 123519, 123551, 123105, 122309, 121975, 122411, 122815, 122505, 121969, 121905, 122047, 121897, 121914, 122768, 123916, 124192, 123579, 123213, 123642, 124218, 124279, 123949, 123590, 123299, 123202, 123491, 123977, 124201, 124119, 124164, 124595, 125365, 126589, 128444]
52978A28444K085J492O91O38J436K409L089L439L498L326L200L357L690L893L677
52963A68364K823J497M46L23O70M44m37r57o85m73j065j966k410k481k528k342
52947A59223j752j413j952k835k949k083j084p12r61j328j322q20j57L06O97J291
52931A42149J772J563R63R64J737K283J941J227P58M21J88N90J597K051J167k83
52915A61088j120j245j122p26n0J66n36j287r69J73J118J648K213K662K397J465
52899A65875M65l72j010r35K08J597K018J441P54K34m81j081o33Q46K075K132
52883A73133J468R82R22J045J147J090P50K40j90m92p05o36j67K86K17j56j73
52866A78761L05Q24J196J658K149K150J485O86L38M51P13R85J383K042K873L502
$$ y = [128444, 130529, 132021, 132712, 133350, 134786, 137195, 140284, 143723, 147221, 150547, 153747, 157104, 160794, 164687, 168364, 171187, 172684, 173130, 173453, 174123, 174567, 174130, 173173, 172488, 172015, 170950, 168984, 166574, 164093, 161565, 159223, 157471, 156058, 154106, 151271, 148322, 146239, 145155, 144443, 143482, 142154, 140832, 140012, 139855, 140161, 140858, 142149, 143921, 145484, 146447, 147411, 149148, 151431, 153372, 154599, 155357, 155778, 155966, 156556, 158153, 160204, 161371, 161088, 159968, 158723, 157601, 156875, 156825, 156991, 156455, 155168, 154199, 154372, 155490, 157138, 159351, 162013, 164410, 165875, 166340, 165968, 164958, 164023, 164231, 165828, 167846, 169287, 170041, 170275, 169794, 168713, 168080, 168926, 171001, 173133, 174601, 175583, 176505, 177550, 178697, 179787, 180537, 180777, 180587, 180095, 179390, 178754, 178587, 178873, 179090, 178934, 178761, 179066, 179890, 181086, 182744, 184893, 187043, 188528, 189214, 189552, 190003, 190716, 191701, 193084, 195126, 197999, 201501]
52850B01501L572L237L045L199L317L177L171L567L811L206J938Q12K30l3k83
52835B37467p50j613k676l223k849k189k179k871l540l719l460k879k190j898
52821B01431k251k680k529k148k406l240l620l011k006j404j343j546j727j543
52807A69977p62J95M63k57j274j779j731j646j791j936j778j370j068j094j236
52792A52913j147q25n96o05p43r95j424j726j467q96q25j407j779j369p16n12
52776A35881n50m49o11j503k487k428j261m5L75N3n19q63p11l37m73j330k165
52759A20577k348k265k439k459j758r40j046j880k231j684r87p32p26p01o66m62
52743I7253O2L88j25j064j301o39o8k36o84q40q40r36r05m83J70P72J135J048
$$ y = [201501, 205073, 208310, 211355, 214554, 217871, 221048, 224219, 227786, 231597, 234803, 236741, 237553, 237783, 237750, 237467, 236717, 235104, 232428, 229205, 226356, 224167, 221988, 219117, 215577, 211858, 208398, 205519, 203329, 201431, 199180, 196500, 193971, 191823, 189417, 186177, 182557, 179546, 177540, 176136, 174793, 173247, 171520, 169977, 169215, 169410, 169873, 169616, 168342, 166563, 164832, 163186, 161395, 159459, 157681, 156311, 155243, 154149, 152913, 151766, 150941, 150345, 149740, 148997, 148002, 146578, 144852, 143385, 142489, 141664, 140257, 138478, 137109, 136393, 135881, 135331, 134882, 134271, 132768, 130281, 127853, 126592, 126547, 126922, 126975, 126456, 125593, 124882, 124545, 124072, 122742, 120577, 118229, 115964, 113525, 111066, 109308, 108368, 107322, 105442, 103211, 101527, 100540, 99808, 99082, 98381, 97715, 97253, 97315, 97703, 97578, 96514, 95213, 94574, 94506, 94270, 93586, 92746, 91906, 90970, 90065, 89582, 89752, 90524, 91659, 92707]
52725I2707M45k29m84n60j002j606j598r20l22j24J50O46P63K26l45m20k97l10
52707H6720j84L17P25O21N20J280K871M296M648L887K700J892J749J898J807J332
52691A17079O36k32j209j890j871j367r60q29q22j074j831k629k527j381j90P3
52675I8976n63j434k051k218j903j323q35o05o06r24j590k212k281j794j136m72
52659G7029J58L78j13p74p18mM24J60j80p2J55L2l05m58k76K07Q38J160P48p5
52639G8314n13l24jJ59L83P12P86N58M79O40N57J03r0L80R20O68m80j820k449
52620G8982j793j62J185J163J82l53R1O54N81K20J62L32M57O39Q96Q81N86N62
52602H5265R78J148N67k68o14m35r1L50Q81J246J355J481J625J309N39J84P26
$$ y = [92707, 93152, 92923, 92439, 91879, 90877, 89271, 87673, 86753, 86431, 86307, 86457, 87103, 87866, 88092, 87747, 87327, 87030, 86720, 86536, 86853, 87578, 88199, 88719, 89999, 92870, 97166, 101814, 105701, 108401, 110293, 112042, 113940, 115747, 117079, 117715, 117483, 116274, 114384, 112513, 111146, 110186, 109357, 108535, 107461, 105630, 103001, 100474, 99093, 98903, 98976, 98413, 96979, 94928, 92710, 90807, 89484, 88649, 88044, 87438, 86514, 84924, 82712, 80431, 78637, 77501, 77029, 77187, 77565, 77452, 76678, 75960, 75956, 76380, 76540, 76360, 76288, 76443, 76475, 76170, 75712, 75436, 75643, 76481, 77641, 78389, 78314, 77801, 77477, 77476, 77635, 78018, 78730, 79516, 80074, 80553, 81193, 81750, 81853, 81763, 82143, 83063, 83731, 83251, 81431, 78982, 77189, 77027, 78212, 79375, 79557, 79204, 79295, 79949, 80530, 80750, 80912, 81244, 81701, 82340, 83236, 84117, 84703, 85265, 86243, 87391, 87958, 87690, 87076, 86641, 86550, 86900, 87781, 89027, 90382, 91863, 93488, 94797, 95336, 95520, 96246]
52585I6246J406J290O04K03K98N29Q09J249J624J697J777K195K584K440K026J988
52569A18965K236K113J494R86R88J248J377J263R57O26O09J049J473J265M86j64
52553A36971k18M4R5k08m98l21L77J092J274R90P88R36J130J092R41P87M82Q3
52535A45837O1N78J100J174J121J378J626J229L05l09j93K07K33l05j083j583
52519A51376j474r18m75m67n89l50K64P74O92n3r39j081l5J437J977J223K15j19
52501A51458j50o31j256j100k15L46J23o5O43J899K604K241J282N07L25P15J428
52484A60154K054K090J296J06o05m30J21L60L43N65R56R33M95M22J064J676J465
52467A73065P70N13Q56J086P20J12r2K73P95R71P82P22J150J679J594Q80L34M36
$$ y = [96246, 97652, 98942, 99546, 99749, 100047, 100576, 101385, 102634, 104258, 105955, 107732, 109927, 112511, 114951, 116977, 118965, 121201, 123314, 124808, 125794, 126782, 128030, 129407, 130670, 131627, 132253, 132862, 133911, 135384, 136649, 137135, 136971, 136753, 136797, 136892, 136684, 136186, 135865, 136242, 137334, 138608, 139598, 140386, 141322, 142452, 143544, 144485, 145272, 145754, 145837, 145898, 146476, 147576, 148750, 149871, 151249, 152875, 154104, 154409, 154100, 153907, 154114, 154347, 154042, 152959, 151376, 149902, 148984, 148509, 148042, 147453, 147103, 147367, 148141, 148833, 148780, 147841, 146760, 146725, 148162, 150139, 151362, 151577, 151458, 151308, 150677, 149421, 148321, 148106, 148452, 148575, 148510, 149153, 151052, 153656, 155897, 157179, 157686, 158011, 158726, 160154, 162208, 164298, 165594, 165700, 165095, 164665, 164786, 165146, 165489, 166054, 167010, 167943, 168438, 168860, 169924, 171600, 173065, 173835, 174348, 175204, 176290, 177010, 177122, 177030, 177303, 178098, 179069, 179851, 180573, 181723, 183402, 184996, 185876, 186210, 186646]
52449A86646O79M41K5J56Q18J189P82K7m27n50p52j137j316j045p40r75j556j610
52431A80655p85J44L08q2k27j33n35j501k000j245K04J086P81k62j067r40m6P20
52413A75075O89J91q5j19l32n45j30Q08J423J414J331J397J145N51M23J044J503
52396A85783J065K68j19l21q46j311r95j9R46J675K255K394J849J179J204J790
52380A96797K035J535Q20N77R91J724K174J911J212R08J372K091K521K784L105
52365B22557L156K633J930J578J446J205J095J488K037K062J522R77Q15J071J685
52350B47257K371K536K011J479J656K386L060L420L335K398O91n90k69J299K699
52335B75739L152K901K252J323O27P18J299J501J185J079J516J897J685J219J175
$$ y = [186646, 187325, 187766, 187791, 187947, 188765, 189954, 190736, 190763, 190336, 189786, 189034, 187897, 186581, 185536, 184796, 183821, 182265, 180655, 179870, 180014, 180322, 180240, 180013, 179880, 179345, 177844, 175844, 174599, 174803, 175889, 176670, 176408, 175341, 174401, 174355, 175075, 175764, 175955, 175870, 175751, 175419, 174874, 174744, 175552, 176975, 178389, 179720, 181117, 182262, 182813, 183236, 184280, 185783, 186848, 187116, 186997, 186676, 185830, 184519, 183524, 183505, 184451, 186126, 188381, 190775, 192624, 193803, 195007, 196797, 198832, 200367, 201187, 201764, 202755, 204479, 206653, 208564, 209776, 210684, 212056, 214147, 216668, 219452, 222557, 225713, 228346, 230276, 231854, 233300, 234505, 235600, 237088, 239125, 241187, 242709, 243686, 244501, 245572, 247257, 249628, 252164, 254175, 255654, 257310, 259696, 262756, 266176, 269511, 271909, 272600, 272010, 271741, 273040, 275739, 278891, 281792, 284044, 285367, 285994, 286712, 288011, 289512, 290697, 291776, 293292, 295189, 296874, 298093, 299268]
52320B99268J725K521L170L521L731M085M617M999N028M978N221N777O470P164
52306C62275P634P690P742Q592J0212J1457J1655J1659J2551J4005J4983J5416
52294D95871J5975J6636J6786J6560J6773J7518J7968J7698J7194J6938J6914
52283F82831J7146J7715J8134J7592J6032J4251J2801J1581J0578J0090R912R242
52271H47905P711N901M457L352K275J182J36r12j866k422k506k479k803l681m922
52256H51328n902n920n000m061l843l973l678k921k113j105M95K270L378L873
52242H22828M655O041P420Q426R387J0446J1257J1819J2684J3918J4697J4400
52230I47978J3429J2502J1749J0911R892Q775P668O775O197N574M422K864J494
$$ y = [299268, 300993, 303514, 306684, 310205, 313936, 318021, 322638, 327637, 332665, 337643, 342864, 348641, 355111, 362275, 369909, 377599, 385341, 393933, 404145, 415602, 427257, 438916, 451467, 465472, 480455, 495871, 511846, 528482, 545268, 561828, 578601, 596119, 614087, 631785, 648979, 665917, 682831, 699977, 717692, 735826, 753418, 769450, 783701, 796502, 808083, 818661, 828751, 838663, 847905, 855616, 861517, 865974, 869326, 871601, 872783, 872919, 872007, 870141, 867719, 865213, 862734, 859931, 856250, 851328, 845426, 839506, 834506, 830445, 826602, 822629, 818951, 816030, 813917, 812812, 813307, 815577, 818955, 822828, 827483, 833524, 840944, 849370, 858757, 869203, 880460, 892279, 904963, 918881, 933578, 947978, 961407, 973909, 985658, 996569, 1006461, 1015236, 1022904, 1029679, 1035876, 1041450, 1045872, 1048736, 1050230]
52217A050230M23r31k920n095o757p648q033q467r470j0940j2101j2464j2578
52204I53249j3172j3847j3561j2211j0763r883r398r098q993q737p835o578n780
52191H23393n432m740l683l283l850m179l229j618o90p77j205j359j168q87r31
52176G86362j538k263k373j894j641j962k263k114j967k282k716k852l021l654
52162G53822m353m335l529k688k584l388m555n110m474l152k262k248k586k753
52148G05805k824k921k851k623k629k972l229l176l135l359l682l979m276m283
52134F59866l627k721k436k689k484j666j482k686m224m672m056l364l025k808
$$ y = [1050230, 1050653, 1049722, 1046802, 1041707, 1034950, 1027302, 1019269, 1010802, 1001332, 990392, 978291, 965827, 953249, 940077, 926230, 912669, 900458, 889695, 879812, 870414, 861316, 852323, 843586, 835751, 829173, 823393, 817961, 813221, 809538, 806255, 802405, 798226, 794997, 793379, 792689, 791912, 790707, 789348, 788180, 787293, 786362, 784824, 782561, 780188, 778294, 776653, 774691, 772428, 770314, 768347, 766065, 763349, 760497, 757476, 753822, 749469, 745134, 741605, 738917, 736333, 732945, 728390, 723280, 718806, 715654, 713392, 711144, 708558, 705805, 702981, 700060, 697209, 694586, 691957, 688985, 685756, 682580, 679445, 676086, 672404, 668425, 664149, 659866, 656239, 653518, 651082, 648393, 645909, 644243, 642761, 640075, 635851, 631179, 627123, 623759, 620734, 617926]
$$ [...]
##END NTUPLES=NMR SPECTRUM
##END=
