
##TITLE=AC1245_NSAAH12035_6944943_z8plN1EjMy
##JCAMPDX= 6.0         $$ Bruker NMR JCAMP-DX V2.0
##DATA TYPE= NMR SPECTRUM
##DATA CLASS= NTUPLES
##ORIGIN= BRUKER
##OWNER= Administrator
$$ 1.72 TOPSPIN		Version 2.1
$$ 2012-10-18 13:44:26.864 -0700  Administrator@X
$$ Compression mode = diff/dup
##.OBSERVE FREQUENCY= 400.02188249412
##.OBSERVE NUCLEUS= ^1H
##.ACQUISITION MODE= SIMULTANEOUS (DQD)
##.ACQUISITION SCHEME= undefined
##.AVERAGES= 64
##.DIGITISER RES= 22
##SPECTROMETER/DATA SYSTEM= spect
##.PULSE SEQUENCE= noesygpps1d.comp
##.SOLVENT NAME= COFFEE_meoh
##.SHIFT REFERENCE= INTERNAL, COFFEE_meoh, 1, 14.96091
##AUDIT TRAIL= $$ (NUMBER, WHEN, WHO, WHERE, PROCESS, VERSION, WHAT)
$$ ##TITLE= Audit trail, TOPSPIN		Version 2.1
$$ ##JCAMPDX= 5.01
$$ ##ORIGIN= Bruker BioSpin GmbH
$$ ##OWNER= Administrator
$$ $$ C:\Bruker\TOPSPIN/data/COFFEE/nmr/AC1245_NSAAH12035_6944943_z8plN1EjMy/12/pdata/1/auditp.txt
$$ ##AUDIT TRAIL=  $$ (NUMBER, WHEN, WHO, WHERE, PROCESS, VERSION, WHAT)
(   1,<2012-10-13 16:30:40.718 -0500>,<Administrator>,<TOPSPIN>,<go>,<TOPSPIN 2.1>,
      <created by zg
	started at 2012-10-13 16:19:10.500 -0500,
	POWCHK enabled, PULCHK disabled,
       configuration hash MD5:
       6B 1B 68 BB D9 2E 58 E2 7F 35 AD 54 07 DF 0E 41
       data hash MD5: 64K
       88 B4 EF E2 19 38 93 91 E6 C5 CA 84 67 69 4B E2>)
(   2,<2012-10-13 16:30:44.718 -0500>,<Administrator>,<TOPSPIN>,<proc1d>,<TOPSPIN 2.1>,
      <Start of raw data processing
       efp LB = 0.3 FT_mod = 6 PKNL = 1 PHC0 = 0 PHC1 = 0 SI = 128K 
       data hash MD5: 128K
       D2 98 7A 51 31 EC 4F EF D9 C4 44 00 FF A7 00 39>)
(   3,<2012-10-13 16:30:46.031 -0500>,<Administrator>,<TOPSPIN>,<proc1d>,<TOPSPIN 2.1>,
      <pk PHC0 = 2.087402 PHC1 = 0 
       data hash MD5: 128K
       B8 19 C7 38 C9 A9 55 13 D8 33 99 1C F2 22 57 16>)
(   4,<2012-10-13 16:30:46.359 -0500>,<Administrator>,<TOPSPIN>,<proc1d>,<TOPSPIN 2.1>,
      <abs ABSG = 1 
       data hash MD5: 128K
       D2 11 05 A2 B7 3A 9E C4 77 1F D4 1F 26 50 12 8D>)
(   5,<2012-10-13 16:30:46.703 -0500>,<Administrator>,<TOPSPIN>,<proc1d>,<TOPSPIN 2.1>,
      <abs ABSG = 2 
       data hash MD5: 128K
       81 C2 A0 9D EF 78 1E 48 9E F6 EB 37 37 CA 66 A3>)
(   6,<2012-10-13 16:30:46.828 -0500>,<Administrator>,<TOPSPIN>,<proc1d>,<TOPSPIN 2.1>,
      <abs ABSG = 3 
       data hash MD5: 128K
       85 AB ED A3 04 D0 0D C5 99 03 CC 7D FA 38 BB 8E>)
(   7,<2012-10-13 16:30:46.890 -0500>,<Administrator>,<TOPSPIN>,<proc1d>,<TOPSPIN 2.1>,
      <abs ABSG = 4 
       data hash MD5: 128K
       A8 9F 60 A8 82 2A 42 0E 16 20 CD E1 93 B2 73 D2>)
(   8,<2012-10-13 16:30:46.953 -0500>,<Administrator>,<TOPSPIN>,<proc1d>,<TOPSPIN 2.1>,
      <abs ABSG = 5 
       data hash MD5: 128K
       0F 08 45 01 9C C4 90 0D 27 10 78 0F 88 E6 15 FE>)
(   9,<2012-10-13 16:30:47.296 -0500>,<Administrator>,<TOPSPIN>,<audit>,<TOPSPIN 2.1>,
      <user comment:
       ICON-NMR User ID: COFFEE
       data hash MD5: 128K
$$ [...]
##$TP07= 0
##$TPNAME0= <>
##$TPNAME1= <>
##$TPNAME2= <>
##$TPNAME3= <>
##$TPNAME4= <>
##$TPNAME5= <>
##$TPNAME6= <>
##$TPNAME7= <>
##$TPOAL= (0..7)
0.5 0.5 0.5 0.5 0.5 0.5 0.5 0.5
##$TPOFFS= (0..7)
0 0 0 0 0 0 0 0
##$TUNHIN= 0
##$TUNHOUT= 0
##$TUNXOUT= 0
##$USERA1= <user>
##$USERA2= <user>
##$USERA3= <user>
##$USERA4= <user>
##$USERA5= <user>
##$V9= 5
##$VALIST= <valist>
##$VCLIST= <CCCCCCCCCCCCCCC>
##$VD= 0
##$VDLIST= <DDDDDDDDDDDDDDD>
##$VPLIST= <PPPPPPPPPPPPPPP>
##$VTLIST= <TTTTTTTTTTTTTTT>
##$WBST= 2048
##$WBSW= 25
##$XGAIN= (0..3)
0 0 0 0
##$XL= 0
##$YL= 0
##$YMAX_a= 11957946
##$YMIN_a= -9010466
##$ZGOPTNS= <>
##$ZL1= 120
##$ZL2= 120
##$ZL3= 120
##$ZL4= 120
##$ABSF1= 14.96091
##$ABSF2= -5.597272
##$ABSG= 5
##$ABSL= 3
##$ALPHA= 0
##$AQORDER= 0
##$ASSFAC= 0
##$ASSFACI= 0
##$ASSFACX= 0
##$ASSWID= 0
##$AUNMP= <proc_prof1d_extract.lims>
##$AXLEFT= 0
##$AXNAME= <>
##$AXNUC= <1H>
##$AXRIGHT= 0
##$AXTYPE= 0
##$AXUNIT= <>
##$AZFE= 0.1
##$AZFW= 0.1
##$BCFW= 0
##$BC_mod= 0
##$BYTORDP= 0
##$COROFFS= 0
##$CY= 15
##$DATMOD= 1
##$DC= 0
##$DFILT= <>
##$DTYPP= 0
##$F1P= 0
##$F2P= 0
##$FCOR= 0.5
##$FTSIZE= 131072
##$FT_mod= 6
##$GAMMA= 0
##$GB= 0
##$INTBC= 1
##$INTSCL= 1
##$ISEN= 128
##$LB= 0.3
##$LEV0= 0
##$LPBIN= 0
##$MAXI= 10000
##$MC2= 0
##$MEAN= 0
##$ME_mod= 0
##$MI= 0
##$NCOEF= 0
##$NC_proc= -2
##$NLEV= 6
##$NOISF1= 0
##$NOISF2= 0
##$NSP= 0
##$NTH_PI= 0
##$NZP= 0
##$OFFSET= 14.96091
##$PC= 1
##$PHC0= 2.087402
##$PHC1= 0
##$PH_mod= 1
##$PKNL= yes
##$PPARMOD= 0
##$PPDIAG= 0
##$PPIPTYP= 0
##$PPMPNUM= 2147483647
##$PPRESOL= 1
##$PSCAL= 4
##$PSIGN= 0
##$PYNMP= <proc.py>
##$REVERSE= no
##$SF= 400.020009674967
##$SI= 131072
##$SIGF1= 0
##$SIGF2= 0
##$SINO= 400
##$SIOLD= 131072
##$SPECTYP= <>
##$SREGLST= <1H.CDCl3>
##$SSB= 0
##$STSI= 131072
##$STSR= 0
##$SW_p= 8223.68421052631
##$SYMM= 0
##$S_DEV= 0
##$TDeff= 65536
##$TDoff= 0
##$TI= <>
##$TILT= no
##$TM1= 0
##$TM2= 0
##$TOPLEV= 0
##$USERP1= <user>
##$USERP2= <user>
##$USERP3= <user>
##$USERP4= <user>
##$USERP5= <user>
##$WDW= 1
##$XDIM= 131072
##$YMAX_p= 299876363
##$YMIN_p= -11550
##$CURPLOT= <Network HP LaserJet P1505>
##$CURPRIN= <$Network HP LaserJet P1505>
##$DFORMAT= <normdp>
##$LAYOUT= <+/1D_H.xwp>
##$LFORMAT= <normlp>
##$PFORMAT= <normpl>
##$SURQMSG= 1
$$ End of Bruker specific parameters
$$ ---------------------------------
##NTUPLES= NMR SPECTRUM
##VAR_NAME=  FREQUENCY,     SPECTRUM/REAL,   SPECTRUM/IMAG
##SYMBOL=    X,             R,               I
##VAR_TYPE=  INDEPENDENT,   DEPENDENT,       DEPENDENT
##VAR_FORM=  AFFN,          ASDF,            ASDF
##VAR_DIM=   131072,        131072,          131072
##UNITS=     HZ,            ARBITRARY UNITS, ARBITRARY UNITS
##FACTOR=    0.0627417313425164, 1,          1
##FIRST=     8223.62146879497, -2070,        -60945
##LAST=      0,             -1139,           -61991
##MIN=       0,             -11550,          0
##MAX=       8223.62146879497, 299876363,    0
$$ Real data points
##PAGE= N=1
##DATA TABLE= (X++(R..R)), XYDATA
$$ [...]
61606C30786j575j572j833k488l319l845l602k541j279p22j186j997k274j915
61592C00638j470j277j252j413j966k706k947k366j493j052j090j120q57n12m23
61577B78694o87j074j169p18P0O96Q47N40j10r26j400j011L2Q04P62L88L92P27
61559B76857R46J081J412J664J233K62l90l08j8j0j2L58Q07P17N2o14p88m05L40
61540B83184J159J738J917J780J453J017P03P82J093J050N21K44P78J447J089
61525B99955l17j569j878j640j415j030k80K60jn93n41J22L51m02j426j755j285
61508B86556n07K63R24J182P21k53j044j162p14j32K82M56L65k5n77q97o30L8
61490B84846M24R1n34o00J41J073J534J524J478J570J551J086J17r71j490r73
$$ y = [330786, 329211, 327639, 325806, 323318, 319999, 316154, 312552, 310011, 308732, 308010, 306824, 304827, 302553, 300638, 299168, 297891, 296639, 295226, 293260, 290554, 287607, 285241, 283748, 282696, 281606, 280486, 279629, 279117, 278694, 278007, 276933, 275764, 275046, 275116, 275812, 276659, 277199, 277089, 276163, 274763, 273752, 273784, 274588, 275350, 275738, 276130, 276857, 277803, 278884, 280296, 281960, 283193, 283455, 283065, 282757, 282739, 282729, 282717, 283075, 283882, 284599, 284651, 284037, 283249, 282844, 283184, 284343, 286081, 287998, 289778, 291231, 292248, 292951, 293733, 294826, 295876, 296397, 296641, 297419, 298866, 299955, 299638, 298069, 296191, 294551, 293136, 292106, 291826, 292086, 292085, 291492, 290951, 291073, 291424, 291022, 289596, 287841, 286556, 286049, 286312, 287236, 288418, 289139, 288886, 287842, 286680, 285966, 285834, 286116, 286572, 286937, 286912, 286335, 285438, 284808, 284846, 285270, 285361, 284827, 284227, 284368, 285441, 286975, 288499, 289977, 291547, 293098, 294184, 294301, 293330, 291840, 290867]
61474B90867L06J515K038J852J146J31o69n45M58J272J011J15l59k80m08r69j232
61457B96249p03P8L29O5j40M1N28J214J956K432K390K017J717J619J551J409J288
61440C14040J243J159R96R73J374K159K866L021K596J968J402R25O68Q98J443
61425C37731J572R19J96L04R74J081K45p06r71p08m47k89j10M7J83M50P48O83
61407C41902K49k9L2j23q71j688j929j769j673j529j022m53l78p07r85j176j368
61390C26483j045K69J828K234J308L15J81M74N25N03Q01J207J369J465J698J641
61374C41256Q61j52m21K97J319J993K273K364K323K155J978J915K035K328K615
61359C65139K561K090J708K027K904L418K971K092J843K560L609M379M974N669
$$ y = [290867, 291173, 292688, 294726, 296578, 297724, 297855, 297186, 296641, 297099, 298371, 299382, 299497, 299138, 298858, 298450, 297481, 296249, 295546, 295624, 295953, 296018, 295878, 295919, 296447, 297661, 299617, 302049, 304439, 306456, 308173, 309792, 311343, 312752, 314040, 315283, 316442, 317438, 318411, 319785, 321944, 324810, 327831, 330427, 332395, 333797, 334722, 335390, 336288, 337731, 339303, 340222, 340418, 340722, 341696, 342777, 343022, 342316, 341345, 340637, 340190, 339901, 339791, 339838, 340021, 340471, 341219, 341902, 342151, 342122, 342154, 342031, 341160, 339472, 337543, 335774, 334101, 332572, 331550, 331097, 330719, 330012, 329027, 327851, 326483, 325438, 325707, 327535, 329769, 331077, 331392, 331573, 332047, 332572, 333075, 333876, 335083, 336452, 337917, 339615, 341256, 342117, 341965, 341544, 341841, 343160, 345153, 347426, 349790, 352113, 354268, 356246, 358161, 360196, 362524, 365139, 367700, 369790, 371498, 373525, 376429, 379847, 382818, 384910, 386753, 389313, 392922, 397301, 402275, 407944]
61345D07944O086N553M114K642J879J866K383L282M110M186L486K935L119L310
61331D56895K505J041J20k6l70j390k252k087j195l82J53N98P98M96K2P3Q32J809
61313D57640K463K709K821L109L653M209M535M821N541O704P670P898P581P200
61299E28554O791O075N062M107L390K737J912Q53l81j660k760l444l648l614l796
61284E40178m498n480o066n873n267m662l756k080j71P17L37r4M42J475J991J884
61268E09077J680J474J154J200K152L461L974L625L556M346N127N007M509M755
61254E55097N715O067M869K705J020O23J114J577J542J148O77K13k36o57j134
61239E80340j713k086j828j159r88j774k734k689j448P7R84J126R44J054J849
$$ y = [407944, 414030, 419583, 423697, 426339, 428218, 430084, 432467, 435749, 439859, 444045, 447531, 450466, 453585, 456895, 459400, 460441, 460561, 460535, 460165, 458775, 456523, 454436, 453241, 452859, 453012, 453610, 454408, 454904, 454926, 454999, 455831, 457640, 460103, 462812, 465633, 468742, 472395, 476604, 481139, 485960, 491501, 498205, 505875, 513773, 521354, 528554, 535345, 541420, 546482, 550589, 553979, 556716, 558628, 559481, 559100, 557440, 554680, 551236, 547588, 543974, 540178, 535680, 530200, 524134, 518261, 512994, 508332, 504576, 502496, 502325, 503042, 503379, 503285, 503727, 505202, 507193, 509077, 510757, 512231, 513385, 514585, 516737, 520198, 524172, 527797, 531353, 535699, 540826, 545833, 550342, 555097, 560812, 566879, 571748, 574453, 575473, 576096, 577210, 578787, 580329, 581477, 582154, 582367, 582131, 581474, 580340, 578627, 576541, 574713, 573554, 572566, 570792, 568058, 565369, 563921, 563998, 564982, 566108, 567052, 568106, 569955]
61224E69955L025L702L490L135L505M280M487M176M417N536O419O127N259N013
61210F32526N459N600M803L493K566K529L221L997M299M198M247M636M910M770
61196F91254M718N458O941Q468R543J0149J0310R932R077Q059P113O179N059L659
61182G95919K105P34j79p86j581k728l730m085m006m172m816n484n665n379n128
61167G51019n497o704q283r295r229q589q282q558q957r180r350r313q463o693
61153F34626n016m507m899m805l373j186N63J274J097L36q03j994k796l047l027
61138F02443l109l329l438l179k444j240K40J536K188K212K192K734L898N222
61124F05926O291P093P940R146J0805J2680J4277J5181J5479J5727J6383J7290
$$ y = [569955, 572980, 576682, 580172, 583307, 586812, 591092, 595579, 599755, 604172, 609708, 616127, 622254, 627513, 632526, 637985, 643585, 648388, 651881, 654447, 656976, 660197, 664194, 668493, 672691, 676938, 681574, 686484, 691254, 695972, 701430, 708371, 716839, 726382, 736531, 746841, 756773, 765850, 773909, 781022, 787201, 792260, 795919, 798024, 798758, 798579, 797793, 796212, 793484, 789754, 785669, 781663, 777491, 772675, 767191, 761526, 756147, 751019, 745522, 738818, 730535, 721240, 712011, 703422, 695140, 686582, 677625, 668445, 659095, 649782, 641319, 634626, 629610, 625103, 620204, 615399, 612026, 610840, 611403, 612677, 613774, 614110, 613307, 611313, 608517, 605470, 602443, 599334, 596005, 592567, 589388, 586944, 585704, 585944, 587480, 589668, 591880, 594072, 596806, 600704, 605926, 612217, 619310, 627250, 636396, 647201, 659881, 674158, 689339, 704818, 720545, 736928, 754218]
61112G54218J7928J8033J7828J7627J7481J7253J6814J6015J4676J2852J0938
61101I31663R284P857O407M791K886M37k515n254p008p969r100j0841j2623j3883
61087H94132j4746j5372j5297j4217j2842j2168j2111j1705j0515r045p808o759
61075G51547n738m744l634k216p42L12J129K390M149N632O466P258Q466R606J0262
61060G90143J1109J2924J5195J6721J7363J8091J9436K0833K1733K2457K3717
61049I89722K5756K8218L0427L1750L2185L2667L4198L6661L8998M0711M2422
61038A363715M4709M7163M9117N0688N2461N4505N6478N8453O0886O3649O5781
61027A967605O6580O6587O7150O9172P2593P7048Q2600Q9569R7783J06467J15040
$$ y = [754218, 772146, 790179, 808007, 825634, 843115, 860368, 877182, 893197, 907873, 920725, 931663, 940947, 948804, 955211, 960002, 962888, 963325, 960810, 955556, 948548, 940579, 931479, 920638, 908015, 894132, 879386, 864014, 848717, 834500, 821658, 809490, 797379, 785674, 775159, 766114, 758306, 751547, 745809, 741065, 737431, 735215, 734473, 734785, 735914, 738304, 742453, 748085, 754551, 761809, 770275, 779881, 790143, 801252, 814176, 829371, 846092, 863455, 881546, 900982, 921815, 943548, 966005, 989722, 1015478, 1043696, 1074123, 1105873, 1138058, 1170725, 1204923, 1241584, 1280582, 1321293, 1363715, 1408424, 1455587, 1504704, 1555392, 1607853, 1662358, 1718836, 1777289, 1838175, 1901824, 1967605, 2034185, 2100772, 2167922, 2237094, 2309687, 2386735, 2469335, 2558904, 2656687, 2763154, 2878194]
61016B878194J23926J34375J47639J64454J85140K09944K39355K74139L14980
61007D672146L61977M15213M76376N49380O38208P43386Q59523R73281J060413
60998A0749903J085940J015585Q37845N80915L06369Q0533n5079r4257n8415J3846
60988A4463185P2415O4672m4376k50548n07808p51582r31162j027113j046338
60979A0041345j007292r29823q31978p28387o28401n36411m54562l84396l26171
60970D213924k78352k38946k06833j81247j60822j43985j29994j18779j09954
60961B645012j02551r5650q8745q1661p4668o8551o3986o0712n7813n4838n2152
60950A843685n0067m8186m6007m3763m2191m1457m0771l9146l6396l3260l0679
$$ y = [2878194, 3002120, 3136495, 3284134, 3448588, 3633728, 3843672, 4083027, 4357166, 4672146, 5034123, 5449336, 5925712, 6475092, 7113300, 7856686, 8716209, 9689490, 10749903, 11835843, 12851428, 13689273, 14270188, 14576557, 14657090, 14602011, 14507754, 14449339, 14463185, 14535600, 14600272, 14555896, 14305348, 13797540, 13045958, 12114796, 11087683, 10041345, 9034053, 8104230, 7272252, 6543865, 5915464, 5379053, 4924491, 4540095, 4213924, 3935572, 3696626, 3489793, 3308546, 3147724, 3003739, 2873745, 2754966, 2645012, 2542461, 2446811, 2358066, 2276405, 2201737, 2133186, 2069200, 2008488, 1950675, 1895837, 1843685, 1793618, 1745432, 1699425, 1655662, 1613471, 1572014, 1531243, 1492097, 1455701, 1422441, 1391762]
60939A391762k9125k8554k8707k9167k9306k8602k7167k5682k4639k3912k3323
60928A093578k3095k3313k3285k2229k0505j9352j9206j9040j7820j5935j4548
60917H75250j3976j3454j2363j0949r797r131q829q643q274p563o805o475o549
60904G52442o416n671m659l949l611l396l346l716m407m865m723m185l739l655
60890F92104l923m338m607m548m364m570n370o326o836o836o775o975p300p516
60876F11820p599p560p251o697o330o493o833o656n924n347n304n161m154k584
60862E27927j527j511k039k443k565k482k199j950k226l027l505k918j723j103
60848D96709j526k309k573k118j288n42k80o13j148j423j634k384l602m339m011
$$ y = [1391762, 1362637, 1334083, 1305376, 1276209, 1246903, 1218301, 1191134, 1165452, 1140813, 1116901, 1093578, 1070483, 1047170, 1023885, 1001656, 981151, 961799, 942593, 923553, 905733, 889798, 875250, 861274, 847820, 835457, 824508, 814711, 805580, 796751, 788108, 779834, 772271, 765466, 758991, 752442, 746026, 740355, 735696, 731747, 728136, 724740, 721394, 717678, 713271, 708406, 703683, 699498, 695759, 692104, 688181, 683843, 679236, 674688, 670324, 665754, 660384, 654058, 647222, 640386, 633611, 626636, 619336, 611820, 604221, 596661, 589410, 582713, 576383, 569890, 563057, 556401, 550477, 545130, 539826, 534665, 530511, 527927, 526400, 524889, 522850, 520407, 517842, 515360, 513161, 511211, 508985, 505958, 502453, 499535, 497812, 496709, 495183, 492874, 490301, 488183, 486895, 486353, 486073, 485460, 484312, 482889, 481255, 478871, 475269, 470930, 466919]
60833D66919l224k820k721k347j731j426j536j656j665j755j754j212l06K05R2
60818D43063r2r1m60j504k569k941k840k789k650k078j486j545k052k149j669
60803D16148j320j509j872k143k612l403l971l849l324k949k712k242j534j016
60789C81692r33j082j191j333j833k746l515l383k294j145p90j001q92j95N19
60774C59878P63O72M82K31J43N92J400J747J309P99R29J392J408Q83L94L48P28
60757C74098J309J680J366M34l67n59o20j068j426q72L92J340J534J379J098M19
60741C80137o21j503k069k744l700m523m935n119n090m524l542k885k861k826
60727C33195k171j223o74o87j034j594k111k013j098l4M19L32J99L9m00q93r50
$$ y = [466919, 463695, 460875, 458154, 455807, 454076, 452650, 451114, 449458, 447793, 446038, 444284, 443072, 442766, 442971, 443063, 442971, 442880, 442420, 440916, 438347, 435406, 432566, 429777, 427127, 425049, 423563, 422018, 419966, 417817, 416148, 414828, 413319, 411447, 409304, 406692, 403289, 399318, 395469, 392145, 389196, 386484, 384242, 382708, 381692, 380759, 379677, 378486, 377153, 375320, 372574, 369059, 365676, 363382, 362237, 361447, 360446, 359554, 359359, 359878, 360641, 361313, 361795, 362026, 362169, 362761, 364161, 365908, 367217, 368016, 368945, 370337, 371745, 372628, 373022, 373370, 374098, 375407, 377087, 378453, 378887, 378520, 377961, 377341, 376273, 374847, 373975, 374367, 375707, 377241, 378620, 379718, 380137, 379516, 378013, 375944, 373200, 369500, 364977, 360042, 354923, 349833, 345309, 341767, 338882, 336021, 333195, 331024, 329801, 329127, 328440, 327406, 325812, 323701, 321688, 320590, 320556, 320975, 321307, 321506, 321545, 321145, 320252, 319302]
60710C19302o05l02p3L94R87J146P52L68M03N46K91l00o22j48J046K193K395J536
60692C29309N79N49J395K198K377K173J974J791J581J563J877K290K473K397K297
60677C56823K413K818L251L142K192Q98J29M8k0n86j367j877k104k235k201j935
60661C59389j730j798j825j507j199j425j864j596l95Q88J424J361J304J417J434
60646C53878J258J076R62P22K20m44j096j651k086k383k510k415k066j553j105
60631C40807r17r71j093j134j049q73o74n02k89J63R06J651J927J503O46j21m69
60614C39511n12n51o49n30o8L70L38N6K45J080J731J383M04r5L00R08J013P04
60596C45638M65M24M06L54L56M57P09J232J961K534K631K238J514P44M43J012
$$ y = [319302, 318697, 318395, 318322, 318716, 319703, 320849, 321601, 321969, 322372, 322918, 323209, 322909, 322287, 322139, 323185, 325378, 327773, 329309, 329888, 330437, 331832, 334030, 336407, 338580, 340554, 342345, 343926, 345489, 347366, 349656, 352129, 354526, 356823, 359236, 362054, 365305, 368447, 370639, 371537, 371666, 371714, 371694, 371108, 369741, 367864, 365760, 363525, 361324, 359389, 357659, 355861, 354036, 352529, 351330, 349905, 348041, 346445, 346050, 346938, 348362, 349723, 351027, 352444, 353878, 355136, 356212, 357174, 357896, 358116, 357672, 356576, 354925, 352839, 350456, 347946, 345531, 343465, 341912, 340807, 339890, 338919, 337826, 336692, 335643, 334770, 334096, 333594, 333305, 333468, 334374, 336025, 337952, 339455, 340101, 339980, 339511, 338999, 338448, 337799, 337269, 337201, 337571, 337909, 337965, 338210, 339290, 341021, 342404, 342808, 342713, 343013, 343921, 344934, 345638, 346103, 346527, 346933, 347287, 347643, 348100, 348809, 350041, 352002, 354536, 357167, 359405, 360919, 361663, 362106, 363118]
60580C63118J972K107R76k34l3J513K993L548L644L976M497M843N022N320N944
60565D09206O986Q258Q986Q280O264M175K934K111P61j089k498k911k739k569
60551D46155k369j724o24L98R24J297K251L862N230N557N269N487O528P584P995
60536D93820Q027Q203Q494Q619Q444P748O153L866J893Q82J89j105k700l401k818
60521E46314j817j346j492j828k064k091j818j168p7J415K903L748L845L963M782
60506E53269N903O512O738P521R210J1221J3156J5330J7866K0160K1727K2929
60494G11542K4346K5809K6559K6020K4090K0976J7012J2353O729n1p248j3531
60482H74606j8396k2532k6380k9116k9857k9130k8243k7522k6256k4206k2102
$$ y = [363118, 365090, 367197, 368173, 367939, 367906, 369419, 372412, 375960, 379604, 383580, 388077, 392920, 397942, 403262, 409206, 416192, 424450, 433436, 441716, 447980, 452155, 455089, 457200, 457961, 456872, 454374, 451463, 448724, 446155, 443786, 442062, 441438, 441836, 442760, 444057, 446308, 450170, 455400, 460957, 466226, 471713, 478241, 485825, 493820, 501847, 510050, 518544, 527163, 535607, 543355, 549508, 553374, 555267, 556149, 556338, 555233, 552533, 549132, 546314, 544497, 543151, 541659, 539831, 537767, 535676, 533858, 532690, 532613, 534028, 536931, 540679, 544524, 548487, 553269, 559172, 565684, 572422, 579943, 589153, 600374, 613530, 628860, 646726, 666886, 688613, 711542, 735888, 761697, 788256, 814276, 838366, 859342, 876354, 888707, 895436, 895385, 888137, 874606, 856210, 833678, 807298, 778182, 748325, 719195, 690952, 663430, 637174, 612968, 590866]
60471E90866k0511j9080j7287j5191j3033j0785q598p205p159p870q023p024n543
60458D43557m552m269m250m131l884l498k909k303k106k430k802k698k222j884
60444C99619j823j688j276r13r61j283j465j366j199j152j171j103q96o53n69
60429C82101o80p03k79M81R23N88j78o20m95k45k55l37r3M65R03Q38K73m75r51
60410C81261q14q5Q04J395J623J694J685J509J339J617K409L050K805J717N11
60395D02520k15l15J32Q43J216Q64L13N67J770K968L402L355L333L200K706K167
60379D28826J890J470O28J88J181L180M614M681L944L085K231J630J804K578K925
60364D64855K347J518J140J017Q52J026J830K645K828K754L118L680L730L445
$$ y = [590866, 570355, 551275, 533988, 518797, 505764, 494979, 486381, 479176, 472017, 464147, 456124, 449100, 443557, 439005, 434736, 430486, 426355, 422471, 418973, 416064, 413761, 411655, 409225, 406423, 403725, 401503, 399619, 397796, 396108, 394832, 393919, 392958, 391675, 390210, 388844, 387645, 386493, 385322, 384219, 383323, 382670, 382101, 381421, 380718, 380439, 380920, 381843, 382431, 382253, 381633, 381138, 380893, 380638, 380301, 380208, 380673, 381576, 382414, 382687, 382212, 381261, 380447, 380362, 381166, 382561, 384184, 385878, 387563, 389072, 390411, 392028, 394437, 397487, 400292, 402009, 402520, 402305, 401990, 402122, 402965, 404181, 405045, 405358, 405925, 407695, 410663, 414065, 417420, 420753, 423953, 426659, 428826, 430716, 432186, 432814, 433002, 434183, 437363, 441977, 446658, 450602, 453687, 455918, 457548, 459352, 461930, 464855, 467202, 468720, 469860, 470877, 471729, 472755, 474585, 477230, 480058, 482812, 485930, 489610, 493340, 496785]
60350D96785L729M779N717N747M918L627K123O19n89j429k143k938l745m349m520
60335E08331m175l554l068k792k410j931j915k575l150k897k238k119k530k613
60321D70364k139j799j932j906j118J57J287K055K562K901L278M017N162O414
60307D89303P584Q733R747J0298J0397J0331R935Q528N910K784j19k751n241p324
60293E58115q820j0071j1279j1914j1413j0084q675p368n925m507l592l163k753
60280D58551k201j724j266n70Q1q4j215k470l002k835k390j741q33o1%o69j421
60263D36150j662j385r97q66j014j146r45m35j1Nk27k67K3K73Q4m11o36k79K91
60244D26545M82K72K65Q46J580J712J099L29qJ58N69R86J211J065O25K65K80N61
$$ y = [496785, 500514, 505293, 511010, 516757, 521675, 525302, 527425, 528044, 527455, 526026, 523883, 520945, 517200, 512851, 508331, 504156, 500602, 497534, 494742, 492332, 490401, 488486, 485911, 482761, 479864, 477626, 475507, 472977, 470364, 468225, 466426, 464494, 462588, 461470, 461627, 462914, 464969, 467531, 470432, 473710, 477727, 482889, 489303, 496887, 505620, 515367, 525665, 536062, 546393, 556328, 564856, 570766, 573550, 573431, 570680, 565439, 558115, 549295, 539224, 527945, 516031, 504618, 494534, 485859, 478491, 472566, 468059, 464467, 461304, 458551, 456350, 454626, 453360, 452790, 452871, 452787, 451572, 449102, 446100, 443265, 440875, 439134, 438301, 438240, 438240, 437571, 436150, 434488, 433103, 432106, 431240, 430226, 429080, 428135, 427700, 427689, 427694, 427467, 427200, 427223, 427496, 427580, 427169, 426533, 426254, 426545, 427027, 427299, 427564, 428410, 429990, 431702, 432801, 433130, 433122, 433280, 433849, 434835, 436046, 437111, 437736, 438001, 438281, 438842]
60226D38842Q44J092J457J896K153K113K009K169K671L235L441L076K400K014
60212D69412K348L233M116M691N144N703O108N795M677L481L133L749M527M644
60198E30761M107L498L082K574J856J331J270J160L12j026j807j522q91q98j602
60183E42205k284k521k575k861l453m141m623m519l623k278j297j231j805k180
60169E02814j778p43K88Q06P61M40R7j64k43p2J79J79m8jO62J535J911J652J220
60150E09495R57Q84J118J843K698K839J955Q15M05Q32J484J903K119K363K920
60135E34630M035N483O367N861M168K375J356J145J305J477J497J335J088Q11
60121E72933M01j37m11n5O17Q93O03L21M87Q07Q43O93O32M75j51j024j435j119
$$ y = [438842, 439686, 440778, 442235, 444131, 446284, 448397, 450406, 452575, 455246, 458481, 461922, 464998, 467398, 469412, 471760, 474993, 479109, 483800, 488944, 494647, 500755, 506550, 511227, 514708, 517841, 521590, 526117, 530761, 534868, 538366, 541448, 544022, 545878, 547209, 548479, 549639, 549951, 548925, 547118, 545596, 544705, 543807, 542205, 539921, 537400, 534825, 531964, 528511, 524370, 519747, 515228, 511605, 509327, 508030, 506799, 504994, 502814, 501036, 500293, 500581, 501387, 502148, 502588, 502685, 502521, 502278, 502206, 502385, 502564, 502516, 502515, 503177, 504712, 506623, 508275, 509495, 510452, 511336, 512454, 514297, 516995, 519834, 521789, 522604, 523009, 523841, 525325, 527228, 529347, 531710, 534630, 538665, 544148, 550515, 556376, 560544, 562919, 564275, 565420, 566725, 568202, 569699, 571034, 572122, 572933, 573334, 573197, 572786, 572731, 573348, 574241, 574844, 575165, 575652, 576459, 577302, 577995, 578627, 579102, 578951, 577927, 576492, 575373]
60103E75373o85q98j845k969l684l787l417k903k540k326j925j069l1N50M22O2
60087E48328P9M32O16M81M64Q54J311J333R41N12J81k17o74r66j089j392k114
60070E49080l028l711m050m338m919n720o203n878m933m112l834l751l423l063
60056D88117l086l168k531j169m6J39k51m93m63l26J18J094K193K710K561K255
60040D87654K023J585R33O12R43J408J280O00R4J87N39N55P8o10j266j861k432
60023D92322k986l620m465n358n754n271m263l549l545l832l721l010k100j573
60009D39275j769k603l508l766l139k207j816k236k951l249k805j749m71N82J119
59994D08707J214J215J335J419J257J032J227J983K740K771K000J123P76Q39P70
$$ y = [575373, 574688, 573790, 571945, 568976, 565292, 561505, 558088, 555185, 552645, 550319, 548394, 547325, 547294, 547844, 548266, 548328, 548407, 548839, 549455, 549936, 550400, 551254, 552565, 553898, 554839, 555351, 555532, 555315, 554641, 553675, 552586, 551194, 549080, 546052, 542341, 538291, 533953, 529034, 523314, 517111, 511233, 506300, 502188, 498354, 494603, 491180, 488117, 485031, 481863, 479332, 478163, 478117, 478256, 478005, 477512, 477049, 476723, 476841, 477935, 480128, 482838, 485399, 487654, 489677, 491262, 492195, 492807, 493750, 495158, 496438, 497038, 497132, 497319, 497858, 498413, 498491, 497881, 496615, 494754, 492322, 489336, 485716, 481251, 475893, 470139, 464868, 460605, 457056, 453511, 449679, 445958, 442948, 440848, 439275, 437506, 434903, 431395, 427629, 424490, 422283, 420467, 418231, 415280, 412031, 409226, 407477, 407006, 407588, 408707, 409921, 411136, 412471, 413890, 415147, 416179, 417406, 419389, 422129, 424900, 426900, 428023, 428799, 429638, 430408]
59979D30408M44K34K66J19n19j264j505j203q46p17o78n76m20j28M55J160J530
59962D26760J406J109Q81N56J33J60J000K003K056R69k33n39m7L36q8j257k433
59945D32772k712j717n4J120J186N17j61n42o90o78o10o95r79j133r14n36l34
59928D23840k32L4M94J087J980L210M224M430M026L704L609L342K859K572K500
59913D61679K174J579J313J553J733J612J709K205K363J861J677K621L745L518
59899D91342K114J129J206J361Q40K75M70J113J413J228R77R30J176J789K540
59884E09903K838K473K026K103K502K636K463K479K874L263L174K468J306O5p01
59869E41872o00J11O21L42m78j080j097r26j033j162p06K25P57N63N18J390K502
$$ y = [430408, 430852, 431086, 431352, 431471, 430952, 429688, 428183, 426980, 426134, 425417, 424739, 424163, 423743, 423615, 424070, 425230, 426760, 428166, 429275, 430156, 430712, 430845, 431005, 432005, 434008, 436064, 437033, 436800, 436261, 436214, 436550, 436462, 435205, 432772, 430060, 428343, 428289, 429409, 430595, 431112, 430951, 430409, 429719, 429041, 428431, 427736, 426757, 425624, 424710, 424174, 423840, 423608, 423642, 424136, 425223, 427203, 430413, 434637, 439067, 443093, 446797, 450406, 453748, 456607, 459179, 461679, 463853, 465432, 466745, 468298, 470031, 471643, 473352, 475557, 477920, 479781, 481458, 484079, 487824, 491342, 493456, 494585, 495791, 497152, 497992, 498267, 498737, 499850, 501263, 502491, 503468, 504398, 505574, 507363, 509903, 512741, 515214, 517240, 519343, 521845, 524481, 526944, 529423, 532297, 535560, 538734, 541202, 542508, 542573, 541872, 541272, 541383, 542004, 542346, 541868, 540788, 539691, 538765, 537732, 536570, 535864, 536089, 536846, 537409, 537927, 539317, 541819]
59852E41819K671K134K312L601M618M129K651J419O19l89j636k381k264j767j511
59837E56025j645k065k692l456m253m940n264m956m155l464l240l105k549j715
59823E08526j133q59n50k68n44j486k395k590k208j927k118k532k689k377j827
59808D83023j461j428j479j346j138j093j123q55j89N25Q46O40K2p68j388j519
59792D71269j154p26p48j326k059k385k052j299n86j78p6k67q16j572k008j668
59776D52349o94K57P06P47P11O64M39K4k36k0N39J019J284J622K243K948L482
59759D68084L911M308M400M029L713M074M822N048M612M399M913N473N267M509
59745E31562L906L554L125K706K670K909K967K843K913L122K885J939P34j59o25
$$ y = [541819, 544490, 546624, 548936, 552537, 557155, 561284, 563935, 565354, 565973, 565584, 563948, 561567, 559303, 557536, 556025, 554380, 552315, 549623, 546167, 541914, 536974, 531710, 526754, 522599, 519135, 515895, 512790, 510241, 508526, 507393, 506534, 505984, 505716, 505172, 503686, 501291, 498701, 496493, 494566, 492448, 489916, 487227, 484850, 483023, 481562, 480134, 478655, 477309, 476171, 475078, 473955, 473100, 472911, 473436, 474282, 474922, 474944, 474176, 472788, 471269, 470115, 469389, 468641, 467315, 465256, 462871, 460819, 459520, 458934, 458756, 458680, 458413, 457597, 456025, 454017, 452349, 451655, 451912, 452618, 453365, 454076, 454740, 455179, 455203, 454967, 454947, 455486, 456505, 457789, 459411, 461654, 464602, 468084, 471995, 476303, 480703, 484732, 488445, 492519, 497341, 502389, 507001, 511400, 516313, 521786, 527053, 531562, 535468, 539022, 542147, 544853, 547523, 550432, 553399, 556242, 559155, 562277, 565162, 567101, 567835, 567676, 567051]
59730E67051r15j279j787k226k200j609r57q82j465k247k768k745k041q94mJ50
59714E43182q9j74l34j147k315k761k103j171p64p12n15k55k09k47j85l29r39
59697E28933j547j457p57j95j12j83j61k81p19j195j394j419j452j347q50j08
59681E15756L95L70p2o67j206j561j822k390l541m749m910l653j989j199j357
59666D87405j574j502j654k221k459j838r83p79j092j125o42m6N05J188J754J610
59650D76547Q25L34P50J601K024J821J358Q41J78n78j026q40k46M2n00j526k046
59633D79559j500m49Q9j89p06r12r22j179j857k660k967k300r31J37Q2q88j926
59616D60481k555k764k430j467m69l19r33j168l56Q35J453J495J480J409R20J63
$$ y = [567051, 566136, 564857, 563070, 560844, 558644, 557035, 556078, 555196, 553731, 551484, 548716, 545971, 543930, 543036, 543032, 543182, 543093, 542919, 542585, 541438, 539123, 536362, 534259, 533088, 532324, 531612, 531097, 530842, 530633, 530386, 530201, 529872, 528933, 527386, 525929, 525172, 524977, 524865, 524682, 524521, 524240, 523521, 522326, 520932, 519513, 518061, 516714, 515864, 515756, 516151, 516521, 516449, 515782, 514576, 513015, 511193, 508803, 505262, 500513, 495603, 491950, 489961, 488762, 487405, 485831, 484329, 482675, 480454, 477995, 476157, 475174, 474395, 473303, 472178, 471536, 471490, 471995, 473183, 474937, 476547, 477372, 477706, 478456, 480057, 482081, 483902, 485260, 486101, 486279, 485701, 484675, 483835, 483589, 483631, 483131, 481605, 479559, 478059, 477610, 477699, 477510, 476804, 475892, 474970, 473791, 471934, 469274, 466307, 464007, 463076, 463213, 463295, 462407, 460481, 457926, 455162, 452732, 451265, 450796, 450477, 449544, 448376, 448020, 448855, 450308, 451803, 453283, 454692, 455612, 455775]
59600D55775l23m44n95q42p40j27M12K73l14n04J48J206J946K124J992J704J097
59583D62788J95n58q21q77j229j875k381k486k174j329Q3J491K003J425M39k53
59567D54441m92l03L29J052J144L82n76j056j127j122r31k86N83J172J397J555
59551D56162J777J947K001K020K099K428L259M457N375N521N167M979N323O303
59537E08818P992J0005J1139J0219P378L866O48k166m478n642n297m142l237k737
59523E32366j920m62Q96J192M08n24q09n05j70j77o09j520k793l864m125l688
59507E13696l391l837m718n285n134m409l540l027l149l570l549k818j981j676
59493D63612j666j281n41k34p95j628j787j037QN88M76J00J40R45K163K986K915
$$ y = [455775, 455452, 455008, 454413, 453571, 452831, 452704, 453116, 453389, 453075, 452571, 452719, 453925, 455871, 457995, 459987, 461691, 462788, 462983, 462425, 461604, 460727, 459498, 457623, 455242, 452756, 450582, 449253, 449336, 450827, 452830, 454255, 454694, 454441, 453949, 453646, 453975, 455027, 456171, 456553, 455977, 454921, 453794, 452672, 451741, 451455, 452038, 453210, 454607, 456162, 457939, 459886, 461887, 463907, 466006, 468434, 471693, 476150, 481525, 487046, 492213, 497192, 502515, 508818, 516810, 526815, 537954, 548173, 555551, 559417, 560065, 557899, 553421, 547779, 542482, 538340, 535103, 532366, 530446, 529984, 530880, 532072, 532480, 531956, 531147, 530642, 530472, 530295, 529686, 528166, 525373, 521509, 517384, 513696, 510305, 506468, 501750, 496465, 491331, 486922, 483382, 480355, 477206, 473636, 470087, 467269, 465288, 463612, 461946, 460665, 460124, 459890, 459095, 457467, 455680, 454643, 454651, 455239, 455715, 455815, 455955, 456900, 459063, 462049, 464964]
59476D64964K305K074K708L662L928L233K374K232K745L178L127K766K278J662
59462E03236J136J124J665K254K555K797L267L824M162M267M325M455M692M905
59448E48664M642L550K136J441J669J749P23r72k221k741l068l432l467l021k457
59433E43195k064j714j242o84rR52K141L141L612L665L805M518N915P611R075
59418E81917J0170J1169J2191J3024J3659J4570J6005J7323J7491J5918J2511
59407G35948P333R83m985q867j0181r767q455o238k836J292M713N712L398j425
59393G06625o626j0419j2628j4035j4820j4321j2239r353o802n193m519m436m368
59380E86866l734k396p91M24P79K67m67m49O35J851K045J340R60J498K146J954
$$ y = [464964, 467269, 469343, 472051, 475713, 479641, 482874, 485248, 487480, 490225, 493403, 496530, 499296, 501574, 503236, 504372, 505496, 507161, 509415, 511970, 514767, 518034, 521858, 526020, 530287, 534612, 539067, 543759, 548664, 553306, 556856, 558992, 560433, 562102, 563851, 564574, 563602, 561381, 558640, 555572, 552140, 548673, 545652, 543195, 541131, 539417, 538175, 537491, 537482, 538434, 540575, 543716, 547328, 550993, 554798, 559316, 565231, 572842, 581917, 592087, 603256, 615447, 628471, 642130, 656700, 672705, 690028, 707519, 723437, 735948, 743281, 744264, 739279, 730412, 720231, 710464, 702009, 695771, 692935, 694227, 698940, 704652, 708050, 706625, 699999, 689580, 676952, 662917, 648097, 633776, 621537, 612184, 605382, 600189, 595670, 591234, 586866, 583132, 580736, 579945, 580369, 581148, 581415, 580948, 580499, 581134, 582985, 585030, 586370, 587330, 588828, 590974, 592928]
59364E92928J134O02O95R37R38J016J835L629N817P382P760P239O484N825N296
59349F49517N089N433O142O818P501Q514R578R850R104Q192P867P666O570M421
59335G52262K065K64r57j923k854l993n671p851r801j0598j0149r455r617j0551
59321F71171j1026j0081q134o418n539n094m568m076l961m086l873k946j511j04
59307E99754Q86J483J987K696L660M616N039M373K516N3k264m259o211q025r069
59292E97235r026q358p493o269m600l173k698k882k901k541k079j381p8J441K279
59277E47476K322K447L278M564N868P007P686P624P273P546Q421Q743P842O472
59263F34569N637N248M620L619K554J467K25j007k029k956l831m321m288m213
$$ y = [592928, 594062, 594664, 595359, 596296, 597234, 598250, 600085, 603714, 609531, 616913, 624673, 631912, 638396, 644221, 649517, 654606, 660039, 666181, 672999, 680500, 689014, 698592, 708442, 717546, 725738, 733605, 741271, 747841, 752262, 754327, 754591, 753634, 751711, 748857, 744864, 739193, 731342, 721541, 710943, 700794, 691339, 681722, 671171, 660145, 650064, 641930, 635512, 629973, 624879, 620311, 616235, 612274, 608188, 604315, 601369, 599858, 599754, 600640, 602123, 604110, 606806, 610466, 615082, 620121, 624494, 627010, 627063, 624799, 620540, 614329, 606304, 597235, 588209, 579851, 572358, 566089, 561489, 558316, 555618, 552736, 549835, 547294, 545215, 543834, 543756, 545197, 547476, 549798, 552245, 555523, 560087, 565955, 572962, 580648, 588272, 595545, 603091, 611512, 620255, 628097, 634569, 640206, 645454, 650074, 653693, 656247, 657714, 657939, 656932, 654903, 651947, 648116, 643795, 639507, 635294]
59249F35294m454m558l989l144k826k932k508j059Q33K183K464J860J184J352
59235F19700K432L347L064J897R91P57N66Rm92o10q19j638k714l316l465l907
59219F15802m950n903n955n304m989n576o431o531n732m832m424m228l716l002
59205E44229k661k913l360l484l097k346j534r23n43j70L87R70J178Q43L04K27
59189E27107R29J936K354J927J410J581K172K355K091K201K979L644L525L043
59175E59254K977L337L599L562L347K951K500K541L398M410M610L985L363L125
59161F06959K834K163J415Q66K88n06j239j666k123l063m278n051n051m725m744
59146E82079n237n738n797n471n122m872m571m179l881l703l469l227l286l530
$$ y = [635294, 630840, 626282, 622293, 619149, 616323, 613391, 610883, 609824, 610657, 612840, 615304, 617164, 618348, 619700, 622132, 625479, 628543, 630440, 631431, 632188, 632754, 632763, 632271, 631661, 630842, 629204, 626490, 623174, 619709, 615802, 610852, 604949, 598994, 593690, 588701, 583125, 576694, 570163, 564431, 559599, 555175, 550947, 547231, 544229, 541568, 538655, 535295, 531811, 528714, 526368, 524834, 523911, 523368, 523198, 523585, 524555, 525733, 526576, 526880, 527107, 528036, 529972, 532326, 534253, 535663, 537244, 539416, 541771, 543862, 546063, 549042, 552686, 556211, 559254, 562231, 565568, 569167, 572729, 576076, 579027, 581527, 584068, 587466, 591876, 596486, 600471, 603834, 606959, 609793, 611956, 613371, 614237, 614525, 614019, 612780, 611114, 608991, 605928, 601650, 596599, 591548, 586823, 582079, 576842, 571104, 565307, 559836, 554714, 549842, 545271, 541092, 537211, 533508, 530039, 526812, 523526, 519996]
59132E19996l209j920l79L99M12M39P27P94N26N47J178J902K311K925M319N936
59116E36903O616O118N404N292N564N624N469N521N803N912N709N573N769N924
59102F17201N449M222K618J067j67r00j146j245j543j918j986j763j671j784j581
59087F14853p81P3K34l26j019j497j913k467l116l737m300m749m954m821m393
59072E77087l891l653l871m246m153l371k407j948k107k496k727k625k186j657
59058E35749j482j759j951j512o83j91k96n79o48n56m34k30j0n3l79n03mP81J079
59039E26339O13l1r7M98J177J451J405J402J612K024K609L155L206K664K321L117
59023E53465M864O368O960P229P867Q646Q993Q876Q440P345N404L335J971R99
$$ y = [519996, 516787, 514867, 514488, 514887, 515299, 515738, 516465, 517259, 517785, 518332, 519510, 521412, 523723, 526648, 530967, 536903, 543519, 549637, 555041, 560333, 565897, 571521, 576990, 582511, 588314, 594226, 599935, 605508, 611277, 617201, 622650, 626872, 629490, 630557, 630390, 629490, 628344, 627099, 625556, 623638, 621652, 619889, 618218, 616434, 614853, 614072, 614145, 614379, 614053, 613034, 611537, 609624, 607157, 604041, 600304, 596004, 591255, 586301, 581480, 577087, 573196, 569543, 565672, 561426, 557273, 553902, 551495, 549547, 547440, 544944, 542217, 539592, 537406, 535749, 534267, 532508, 530557, 529045, 528362, 528171, 527875, 527296, 526648, 526092, 525658, 525428, 525418, 525365, 524986, 524483, 524479, 525260, 526339, 526952, 526921, 526824, 527322, 528499, 529950, 531355, 532757, 534369, 536393, 539002, 542157, 545363, 548027, 550348, 553465, 558329, 564697, 571657, 578886, 586753, 595399, 604392, 613268, 621708, 629053, 634457, 637792, 639763, 640762]
59009F40762m05j952k461j756j078j239j526j028o0N81R59J661K560L033L103
58994F41154L418M047M212L464K421J887J831J682J258Q66O30L24j03k38K48J060
58978F68161J574J585J488J724K319L073L991N186O465P265P225O729O658P478
58964G30921Q623R010Q257P154O740P022O972N849M083K639J727O15j358l931
58950G94323o234p750q701r519j0261j0733j0941j1042j0857r939q340o849o055
58937F77102n549m613l390k661k584k408j569l81N98J154J113J56j446k512k035
58922F50975l64J207J855J712J141K16r76j893j891r58P0L15r1j21P27J647J721
58905F55292J523K448M586O386O803O614P017P944Q641R060R639J0155R918Q959
$$ y = [640762, 640357, 638405, 635944, 634188, 633110, 631871, 630345, 629317, 629257, 629838, 630797, 632458, 635018, 638051, 641154, 644572, 648619, 652831, 656295, 658716, 660603, 662434, 664116, 665374, 666240, 666870, 667194, 667091, 666853, 667101, 668161, 669735, 671320, 672808, 674532, 676851, 679924, 683915, 689101, 695566, 702831, 710056, 716785, 723443, 730921, 739544, 748554, 756811, 763965, 770705, 777727, 784699, 790548, 794631, 797270, 798997, 799612, 798254, 794323, 788089, 780339, 771638, 762119, 751858, 741125, 730184, 719142, 708285, 698346, 690006, 683157, 677102, 671553, 666940, 663550, 660889, 658305, 655897, 654328, 653947, 654545, 655699, 656812, 656968, 655522, 653010, 650975, 650611, 651818, 653673, 655385, 656526, 656742, 655766, 653873, 651982, 651024, 651094, 651409, 651318, 651197, 651924, 653571, 655292, 656815, 659263, 663849, 670235, 677038, 683652, 690669, 698613, 707254, 716314, 725953, 736108, 746026, 754985]
58891G54985Q190Q387R550J1169J2580J3256J3255J3139J3181J2893J1799J0159
58879H92543Q427O484M045J377j046l182n123o629p665q836j0467j1771j1860
58866H46297j1138j0624j0407r799q682p491o203m672l732m476o359p521p274
58853G47919o851p258p751p212n847m677m172m159m492m997n324n380n494n769
58839F68536n755n262m878n213o021o559o428n753m915m385m334m163l034j116
58825F00720K43Q7r69j552j045J61J484K585L290L586L608L418K926K207J621
58810F22370J347J148P55K55j49m19n78o06o10q82j553k402l061l317l233l174
58794F05891l557m321m851m743m309l926l359k382j626j857k644k780j993j137
$$ y = [754985, 763175, 771562, 781112, 792281, 804861, 818117, 831372, 844511, 857692, 870585, 882384, 892543, 900970, 907454, 911499, 912876, 911830, 908648, 903525, 896896, 889231, 880395, 869928, 858157, 846297, 835159, 824535, 814128, 804329, 795647, 788156, 781953, 777281, 773549, 769073, 762714, 755193, 747919, 741068, 733810, 726059, 718847, 713000, 708323, 704151, 699992, 695500, 690503, 685179, 679799, 674305, 668536, 662781, 657519, 652641, 647428, 641407, 634848, 628420, 622667, 617752, 613367, 609033, 604870, 601836, 600720, 600963, 601050, 600081, 598529, 597484, 597645, 599129, 601714, 605004, 608590, 612198, 615616, 618542, 620749, 622370, 623717, 624865, 625620, 625875, 625726, 625307, 624729, 624123, 623513, 622631, 621078, 618676, 615615, 612298, 609065, 605891, 602334, 598013, 593162, 588419, 584110, 580184, 576825, 574443, 572817, 570960, 568316, 565536, 563543, 562406]
58780E62406o77j06Q41J562J622J483J653J866J681J171N41k73j231j961k347
58765E68231k777l481m143m470m473l985k670q53M39P03N60P62J272J719K077
58750E48911K370K424K276K273K458K453K236K218K371K188J810K108L181L927
58736E83204L711L366L739M349M422M285M648N271N462N256N058M674L789K907
58722F44141K742L034K931K318J887K059K614L169L430L314L293M053N279N523
58708F89787M054K132J376J497Q48j190l609n447o843q299r785j0883j1251j0919
58694F31468j0432j0490j1040j1153j0221q819p810p189o484n714n149m620l947
58681E28400l519l611l627k990k222k033j945j004M31J094Q37Q57J741K620K671
$$ y = [562406, 561729, 561623, 562464, 564026, 565648, 567131, 568784, 570650, 572331, 573502, 574043, 573770, 572539, 570578, 568231, 565454, 561973, 557830, 553360, 548887, 544902, 542232, 541379, 541818, 542521, 543081, 543843, 545115, 546834, 548911, 551281, 553705, 555981, 558254, 560712, 563165, 565401, 567619, 569990, 572178, 573988, 576096, 579277, 583204, 586915, 590281, 594020, 598369, 602791, 607076, 611724, 616995, 622457, 627713, 632771, 637445, 641234, 644141, 646883, 649917, 652848, 655166, 657053, 659112, 661726, 664895, 668325, 671639, 674932, 678985, 684264, 689787, 693841, 695973, 697349, 698846, 699694, 698504, 694895, 689448, 682605, 674306, 664521, 653638, 642387, 631468, 621036, 610546, 599506, 588353, 578132, 569313, 561503, 554314, 547830, 542116, 536967, 532347, 528400, 524881, 521270, 517643, 514653, 512431, 510398, 508453, 507449, 507880, 508974, 509811, 510668, 512409, 515029, 517700]
58666E17700K346K603L675N064O239O889O943O537N759M468K695J025M9m36j204
58651E70352k659m442n805o054m972l226j912j328p29K96R98O49k71r53j460k026
58635E36458j917l70J856L291L659L691L460K479J236R28J568J907J458J123J415
58620E62242J575R76J39l25o04r06p99r5N21N61O99J836L640M800M507L151J725
58603E83643R55R55J423K083K791L258L079K354J807J871K044J723J135Q43P64
58588F10728N57M69R28J691K369L318M906O432P016P189Q082R390R782R201Q966
58573F91024R364R040P378N757N541O275O899P513Q741J0324J1548J2523J3881
58560H05808J5532J6579J6474J5598J4655J3789J2406R913O664L868K222J071
$$ y = [517700, 520046, 522649, 526324, 531388, 537627, 544516, 551459, 557996, 563755, 568223, 570918, 571943, 571992, 571556, 570352, 567693, 563251, 557446, 551392, 546420, 543194, 541282, 539954, 539225, 539521, 540519, 541168, 540897, 539944, 538484, 536458, 534541, 534171, 536027, 539318, 542977, 546668, 550128, 552607, 553843, 554771, 556339, 558246, 559704, 560827, 562242, 563817, 564793, 564932, 564607, 564003, 563097, 562298, 562203, 562724, 563285, 563984, 565820, 569460, 574260, 578767, 581918, 583643, 584598, 585553, 586976, 589059, 591850, 595108, 598187, 600541, 602348, 604219, 606263, 607986, 609121, 609964, 610728, 611285, 611754, 612682, 614373, 616742, 620060, 624966, 631398, 638414, 645603, 653685, 663075, 672857, 682058, 691024, 700388, 709428, 716806, 722563, 728104, 734379, 741278, 748791, 757532, 767856, 779404, 791927, 805808, 821340, 837919, 854393, 869991, 884646, 898435, 910841, 920754, 927418, 931286, 933508, 934579]
58548I34579n15k373l735m578n326n702n185m486n002o767q355r069r765j1111
58534H52610j2477j3079j2990j2412j1138r323p737o652n501m137l277l148k945
58521G47794k242j771k070k510k510k527k927k984k134j262j497k477k958k663
58507G15262k370k550k857k849k431j781j298j376j816j877j247m02K62R27J618
58492F95215J780J258R29J608K896L738L778L535L636M285N199N772N700N516
58478G44845N966O909P637Q179R140J0127R728P531M889L037J717L15q87j525
58464H17608k008k629k778k068j240r87p87M4J125J859K594L751M628M457L933
58449H27502M265N200N282L851J613n64k305l374l678l588l469l110k270j410
$$ y = [934579, 934064, 931691, 927956, 923378, 918052, 912350, 907165, 902679, 897677, 890910, 882555, 873486, 863721, 852610, 840133, 827054, 814064, 801652, 790514, 781191, 773454, 766802, 761301, 757164, 753887, 750739, 747794, 745552, 743781, 741711, 739201, 736691, 734164, 731237, 728253, 726119, 724857, 723360, 720883, 717925, 715262, 712892, 710342, 707485, 704636, 702205, 700424, 699126, 697750, 695934, 694057, 692810, 692408, 692670, 693597, 695215, 696995, 698253, 699182, 700790, 703686, 707424, 711202, 714737, 718373, 722658, 727857, 733629, 739329, 744845, 750811, 757720, 765357, 773536, 782676, 792803, 802531, 810062, 814951, 817988, 819705, 820020, 819133, 817608, 815600, 812971, 810193, 808125, 806885, 805898, 805111, 805155, 806280, 808139, 810733, 814484, 819112, 823569, 827502, 831767, 836967, 842249, 846100, 847713, 847149, 844844, 841470, 837792, 834204, 830735, 827625, 825355, 823945]
58435H23945j032o87M06J970K901K824K586L146M533O009O848O927O791O947P062
58420H81176O304M625L019K171J617O21q09k286l691m880n405n087m344l527k585
58405H66919j753j694k359k662j896p37j42m3J76P04J527K818M377N412N557N359
58389H81563N174M503L090J737J155R35N10K33O52J546K545L809N272O194O354
58374I25272O733P960R106R075Q244P655P469P402P692Q424Q813Q424Q231R165
58360A039665J0443J0788J0411J0347J0542J0224R556R342R453Q994P849O761
58348A154375O162O044O587P761Q682Q550P941Q074R142J0287J0952J1299J1693
58335A267549J2496J3905J5352J5775J5120J4699J5300J6049J5944J5321J4770
$$ y = [823945, 822913, 822226, 822632, 824602, 827503, 830327, 832913, 836059, 840592, 846601, 853449, 860376, 867167, 874114, 881176, 887480, 892105, 895124, 897295, 898912, 899533, 898724, 896438, 892747, 887867, 882462, 877375, 873031, 869504, 866919, 865166, 863472, 861113, 858451, 856555, 855818, 855676, 855633, 855809, 856513, 858040, 860858, 865235, 870647, 876204, 881563, 886737, 891240, 894330, 896067, 897222, 898157, 898667, 898900, 899552, 901098, 903643, 907452, 912724, 918918, 925272, 932005, 939965, 949071, 958146, 966390, 974045, 981514, 988916, 996608, 1005032, 1013845, 1022269, 1030500, 1039665, 1050108, 1060896, 1071307, 1081654, 1092196, 1102420, 1111976, 1121318, 1130771, 1139765, 1147614, 1154375, 1160537, 1166581, 1173168, 1180929, 1189611, 1198161, 1206102, 1214176, 1223318, 1233605, 1244557, 1255856, 1267549, 1280045, 1293950, 1309302, 1325077, 1340197, 1354896, 1370196, 1386245, 1402189, 1417510, 1432280]
58324A432280J3929J2623J1957J2769J3979J4019J3002J2102J1756J1844J2637
58313A572897J4118J5301J5669J6322J8273K0732K2442K3529K4503K4774K3946
58302A792506K3285K4009K5285K5852K6367K8023L0061L0938L1081L2036L3733
58291B103176L4868L5313L5951L6731L7069L7602L9390M1962M4164M6274M9242
58280B541742N2556N4995N6842N9269O2086O4185O5643O7563P0366P3901P8370
58269C247518Q3533Q8140R1741R5694J00771J05594J09323J13701J20153J27101
58259D283269J32906J39170J48034J58403J68276J78558J90891K03817K15174
58250E818498K26354K39884K54607K67698K79758K93179L06970L18259L27704
$$ y = [1432280, 1446209, 1458832, 1470789, 1483558, 1497537, 1511556, 1524558, 1536660, 1548416, 1560260, 1572897, 1587015, 1602316, 1617985, 1634307, 1652580, 1673312, 1695754, 1719283, 1743786, 1768560, 1792506, 1815791, 1839800, 1865085, 1890937, 1917304, 1945327, 1975388, 2006326, 2037407, 2069443, 2103176, 2138044, 2173357, 2209308, 2246039, 2283108, 2320710, 2360100, 2402062, 2446226, 2492500, 2541742, 2594298, 2649293, 2706135, 2765404, 2827490, 2891675, 2957318, 3024881, 3095247, 3169148, 3247518, 3331051, 3419191, 3510932, 3606626, 3707397, 3812991, 3922314, 4036015, 4156168, 4283269, 4416175, 4555345, 4703379, 4861782, 5030058, 5208616, 5399507, 5603324, 5818498, 6044852, 6284736, 6539343, 6807041, 7086799, 7379978, 7686948, 8005207, 8332911]
58241H332911L38337L50012L60230L69674L81677L96925M13869M33590M58653
58232A1835878M87550N15665N41440N66209N88720O05973O19245O33349O49948
58223A7043977O67592O88126P16627P54725P99944Q51534R10752R75776J043118
58214B4452171J113724J190964J273493J357945J447965J552373J674806J814031
58206C5877472J973878K163377K387648K649054K957256L327360L768823M288032
58198E9392900M900683N627328O477058P451446Q565536R849151J1330019J3037406
58190A26631527J5017418J7298963J9798544K2225774K4031711K4412676K2457649
58183B71874262J7547610R866306N88185q550410j6033312k1101634k3744351
$$ y = [8332911, 8671248, 9021260, 9381490, 9751164, 10132841, 10529766, 10943635, 11377225, 11835878, 12323428, 12839093, 13380533, 13946742, 14535462, 15141435, 15760680, 16394029, 17043977, 17711569, 18399695, 19116322, 19871047, 20670991, 21522525, 22433277, 23409053, 24452171, 25565895, 26756859, 28030352, 29388297, 30836262, 32388635, 34063441, 35877472, 37851350, 40014727, 42402375, 45051429, 48008685, 51336045, 55104868, 59392900, 64293583, 69920911, 76397969, 83849415, 92414951, 102264102, 113594121, 126631527, 141648945, 158947908, 178746452, 200972226, 225003937, 249416613, 271874262, 289421872, 299288178, 299876363, 291325953, 275292641, 254191007, 230446656]
58176B30446656k4369044k3517252k1728874j9464857j7053611j4699424j2532127
58169I7081467j0630225r014157p659374o531608n601660m835490m195324l655810
58161D4957819l205379k830794k513599k241813k011865j817439j647397j495795
58153B7193738j363599j249357j147381j055819r77387r10919q50247p92631p40905
58144A8105493o96288o56095o19277n87561n60075n32963n05150m78946m54586
58135A3014552m29764m04790l82704l63884l45827l28420l13990l01973k88948
58126I854252k74508k61925k52353k43365k33905k25788k19433k12709k04970
58117G725296j98097j92746j87533j82361j78537j75252j70111j63627j58916
$$ y = [230446656, 206077612, 182560360, 160831486, 141366629, 124313018, 109613594, 97081467, 86451242, 77437085, 69777711, 63246103, 57644443, 52808953, 48613629, 44957819, 41752440, 38921646, 36408047, 34166234, 32154369, 30336930, 28689533, 27193738, 25830139, 24580782, 23433401, 22377582, 21400195, 20489276, 19639029, 18846398, 18105493, 17409205, 16753110, 16133833, 15546272, 14986197, 14453234, 13948084, 13469138, 13014552, 12584788, 12179998, 11797294, 11433410, 11087583, 10759163, 10445173, 10143200, 9854252, 9579744, 9317819, 9065466, 8822101, 8588196, 8362408, 8142975, 7930266, 7725296, 7527199, 7334453, 7146920, 6964559, 6786022, 6610770, 6440659, 6277032, 6118116]
58108F118116j56362j52795j46736j40204j34481j28240j21067j14863j10401
58099D912967j06085j01409r8161r6920r5641r3123r0810q9843q9170q7761q5906
58088C878138q3334p8849p2964o8129o5324o3041o0442n8774n8681n8938n8919
58077C150743n9545o0761o0757n8889n6821n5628n4278n2133n0437m9984m9733
58066B541777m8949m8498m8663m7963m5459m2294l9715l7462l5214l3683l3146
58055B080731l2665l1813l1385l1547l1221l0045k9084k8809k8428k7924k8427
58044A749383k9716k9816k8190k6911k7329k7944k7183k5994k5891k6344k6036
58033A448029k5122k4392k3607k2359k1311k1096k1097k0656k0248k0282k0006
$$ y = [6118116, 5961754, 5808959, 5662223, 5522019, 5387538, 5259298, 5138231, 5023368, 4912967, 4806882, 4705473, 4607312, 4510392, 4414751, 4321628, 4230818, 4140975, 4051805, 3964044, 3878138, 3794804, 3715955, 3642991, 3574862, 3509538, 3446497, 3386055, 3327281, 3268600, 3209662, 3150743, 3091198, 3030437, 2969680, 2910791, 2853970, 2798342, 2744064, 2691931, 2641494, 2591510, 2541777, 2492828, 2444330, 2395667, 2347704, 2302245, 2259951, 2220236, 2182774, 2147560, 2113877, 2080731, 2048066, 2016253, 1984868, 1953321, 1922100, 1892055, 1862971, 1834162, 1805734, 1777810, 1749383, 1719667, 1689851, 1661661, 1634750, 1607421, 1579477, 1552294, 1526300, 1500409, 1474065, 1448029, 1422907, 1398515, 1374908, 1352549, 1331238, 1310142, 1289045, 1268389, 1248141, 1227859, 1207853]
58022A207853j8931j7923j7682j7465j6608j5927j6189j6627j6378j6065j6419
58011A021639j6619j5702j4498j4376j4986j4941j4046j3178j2575j1794j1048
58000H67876j1029j1646j2125j2238j2448j3001j3628j3931j3564j2378j0871
57989G31017r906r616r277q538p853p391o664n791n836p086q290q447q179q332
57975F19811q430p761o843o496o340n560m485m041m252m505m762n313n770n412
57961E39841m386l533l294l524m001m417m271l573l170l712m714n287n283n071
57947D81605m839m751n100n552m949k783k32J207J560J945K768L380L254K690
57933D70203K316K505L077L297K479R27k70o32q45j592k674l743m911o063o450
$$ y = [1207853, 1188922, 1170999, 1153317, 1135852, 1119244, 1103317, 1087128, 1070501, 1054123, 1038058, 1021639, 1005020, 989318, 974820, 960444, 945458, 930517, 916471, 903293, 890718, 878924, 867876, 856847, 845201, 833076, 820838, 808390, 795389, 781761, 767830, 754266, 741888, 731017, 721111, 711495, 702218, 693680, 685827, 678436, 671772, 665981, 660145, 653059, 644769, 636322, 628143, 619811, 611381, 603620, 596777, 590281, 583941, 578381, 573896, 569855, 565603, 561098, 556336, 551023, 545253, 539841, 535455, 531922, 528628, 525104, 521103, 516686, 512415, 508842, 505672, 501960, 497246, 491959, 486676, 481605, 476766, 472015, 466915, 461363, 456414, 453631, 453399, 454606, 456166, 458111, 460879, 464259, 467513, 470203, 472519, 475024, 478101, 481398, 483877, 484804, 484534, 483902, 483057, 481465, 478791, 475048, 470137, 464074, 457624]
57918D57624n804n032n024n507n842o153o732p040o349m881l464k487j919j753
57904C89637j699j054L47J543J576O46m90j550k389k484j662p80p18j254j707
57889C77962k040k441k528j989j403j442j769j680j289j119j107r68j007j545
57875C55635k093k134k199k998m001m102l356k801k815k823k499k098j689j097
57861C18930n37l17l8J001K625L854M123L725L173K918L348M298M780M040K593
57846C58516J493R28M00j49n06j014k102l180l260k564k347l089l993m350m347
57831C30436m333m235l981l667l175k261j174m82k67j21J17K48K87M14M28m4q46
57814C07344j448j736k029k478l078m003n205n983n755m962m410m052l315k315
$$ y = [457624, 451820, 446788, 441764, 436257, 430415, 424262, 417530, 410490, 404141, 399260, 395796, 393309, 391390, 389637, 387938, 386884, 387231, 388774, 390350, 390996, 390506, 388956, 386567, 384083, 382421, 381641, 380923, 379669, 377962, 375922, 373481, 370953, 368964, 367561, 366119, 364350, 362670, 361381, 360262, 359155, 358187, 357180, 355635, 353542, 351408, 349209, 346211, 342210, 338108, 334752, 331951, 329136, 326313, 323814, 321716, 320027, 318930, 318393, 318076, 318038, 319039, 321664, 325518, 329641, 333366, 336539, 339457, 342805, 347103, 351883, 355923, 358516, 360009, 360937, 361337, 361188, 360682, 359668, 357566, 354386, 351126, 348562, 346215, 343126, 339133, 334783, 330436, 326103, 321868, 317887, 314220, 311045, 308784, 307610, 307128, 306861, 306740, 306857, 307105, 307392, 307806, 308234, 308190, 307344, 305896, 304160, 302131, 299653, 296575, 292572, 287367, 281384, 275629, 270667, 266257, 262205, 258890, 256575]
57800B56575j697j519j339j152j114n89J173L488M656M149L175K921L400M194
57786B76321N118N801N741N158M866M973M757M027L555L781M131M061L758L371
57772C39419K595J533R44J055J011K21o68q50o42q56j551k172k535k889l384m001
57756C27230m744n459n758n551n208m954m527l774l072k758k598k229j668j023
57742B73907j75Q74J701J967J811J462Q81J35l09j54K23L16K11L68R32J613K087
57725B87850K263K253K289K455K495K143J606J361J398J199N45j18l43k47k14
57710C06935m59j021j835k623l071l248l422l514l177k498j984j785j552j168
57696B75578r59j003r09n59m06o79r56r17q58j000r04j46Q92J521J688J894K475
$$ y = [256575, 254878, 253359, 252020, 250868, 249754, 249165, 250338, 253826, 258482, 262631, 265806, 268727, 272127, 276321, 281439, 287240, 292981, 298139, 303005, 307978, 312735, 316762, 320317, 324098, 328229, 332290, 336048, 339419, 342014, 343547, 344491, 345546, 346557, 346778, 346110, 345260, 344618, 343762, 342211, 340039, 337504, 334615, 331231, 327230, 322486, 317027, 311269, 305718, 300510, 295556, 291029, 287255, 284183, 281425, 278827, 276598, 274930, 273907, 273732, 274606, 276307, 278274, 280085, 281547, 282428, 282563, 282254, 282100, 282323, 282639, 282850, 283218, 284150, 285763, 287850, 290113, 292366, 294655, 297110, 299605, 301748, 303354, 304715, 306113, 307312, 307857, 307739, 307396, 307149, 306935, 306476, 305455, 303620, 300997, 297926, 294678, 291256, 287742, 284565, 282067, 280083, 278298, 276746, 275578, 274619, 273616, 272707, 272148, 271742, 271063, 270107, 269190, 268332, 267332, 266428, 266282, 267174, 268695, 270383, 272277, 274752]
57679B74752L440M799O444P895Q652Q881R472J1292J4442J8261K2075K5897L0048
57666D46350L3943L5759L3869K8218J9737Q977l513j5766k4932k9763l1566l2163
57654D69150l1825k9806k6045k1472j7130j3655j1229r581q285p312o839o452
57642B79519n355l636k507k678l270k940j550r9N28J96n85r50l80N85Q61L30K4
57625B58093L90M55o52k253l132l156k943k627j970j166n38O5O55N26o80j936
57609B39131k063j522j676k614l096k590j922j747j671j217o28l23l23n59r92
57594B16188j307j212j069j454k072k062j441j189j647j938j411o78o07j127j683
57579A95291k154k592k606j837p16p8k25q42j542k055k088j528p23j69m0j61l13
$$ y = [274752, 278192, 282991, 289435, 297330, 305982, 314863, 324335, 335627, 350069, 368330, 390405, 416302, 446350, 480293, 516052, 549921, 578139, 597876, 606853, 603340, 587574, 562642, 532879, 501313, 469150, 437325, 407519, 381474, 360002, 342872, 329217, 317988, 308407, 300122, 292810, 285971, 279519, 274164, 270528, 268021, 265343, 262073, 259133, 257583, 257484, 258012, 258208, 257623, 256673, 256293, 256878, 257739, 258069, 258093, 258483, 258938, 258286, 256033, 252901, 249745, 246802, 244175, 242205, 241039, 240501, 240566, 241221, 241747, 241067, 239131, 237068, 235546, 233870, 231256, 228160, 225570, 223648, 221901, 220230, 219013, 218385, 218062, 217739, 217180, 216188, 214881, 213669, 212600, 211146, 209074, 207012, 205571, 204382, 202735, 200797, 199386, 198708, 198101, 196974, 195291, 193137, 190545, 187939, 186102, 185386, 185308, 185083, 184241, 182699, 180644, 178556, 177028, 176305, 176136, 176096, 175935, 175622]
57562A75622l19r3J98K05j05l21j36K03K80N3k64o12j014j305j275r76o01j73
57544A69367L50P60P92O01O66J137J570J509J090Q55J065J440J647J772K147K786
57528A89554L255L197K758K413K436K681K828K714K438K231K237K417K622K756
57514B26537K782K726K733K960L279L225K618K029K174K915L440L453L477L781
57500B68129L775K970J938J650K261L215M161N076N755N894N614N258M767L888
57486C24351K916K526K742K723J824L89p70j286j437j641j994k250k226k129k286
57471C21452k487k130j216o33r10j327r62j26J96pJ95J041J649J410Q34O17Q03
57454C18399J218J937K781L122K715K200K255K739L125L246L241L165L191L620
$$ y = [175622, 175303, 175210, 175408, 175613, 175508, 175187, 175051, 175254, 175534, 175587, 175323, 174711, 173697, 172392, 171117, 170141, 169540, 169367, 169717, 170477, 171269, 171870, 172536, 173673, 175243, 176752, 177842, 178697, 179762, 181202, 182849, 184621, 186768, 189554, 192809, 196006, 198764, 201177, 203613, 206294, 209122, 211836, 214274, 216505, 218742, 221159, 223781, 226537, 229319, 232045, 234778, 237738, 241017, 244242, 246860, 248889, 251063, 253978, 257418, 260871, 264348, 268129, 271904, 274874, 276812, 278462, 280723, 283938, 288099, 293175, 298930, 304824, 310438, 315696, 320463, 324351, 327267, 329793, 332535, 335258, 337082, 337471, 336701, 335415, 333978, 332337, 330343, 328093, 325867, 323738, 321452, 318965, 316835, 315619, 314986, 314076, 312749, 311787, 311661, 311857, 311850, 312045, 313086, 314735, 316145, 316979, 317596, 318399, 319617, 321554, 324335, 327457, 330172, 332372, 334627, 337366, 340491, 343737, 346978, 350143, 353334, 356954]
57440C56954M318M522L775K666K194K641L521M251M542M383M062L951M066M127
57426D09973M160M448M785M492L575L053L544M283M253L591L019K592K057J850
57412D59675K542L578L833L320L092L474L696L493L737M920O094O154N318M607
57398E17533M468M649M948N272N320M857M230M092M674N656O561O992O711N857
57384E91820M888M119L560L330L701M448M732M210L786M527O146P340P488P244
57370F61339P407P986Q491Q583Q167P426O906P135P926Q560Q776R019R490R617
57356G76828Q922P908P484P867Q575R208R638R688R236Q639Q446Q649Q752Q571
57342H98411Q487Q774R159R309R290R345R533R799J0096J0252J0003R461R191
$$ y = [356954, 361272, 365794, 369569, 372235, 374429, 377070, 380591, 384842, 389384, 393767, 397829, 401780, 405846, 409973, 414133, 418581, 423366, 427858, 431433, 434486, 438030, 442313, 446566, 450157, 453176, 455768, 457825, 459675, 462217, 465795, 469628, 472948, 476040, 479514, 483210, 486703, 490440, 495360, 501454, 507608, 512926, 517533, 522001, 526650, 531598, 536870, 542190, 547047, 551277, 555369, 560043, 565699, 572260, 579252, 585963, 591820, 596708, 600827, 604387, 607717, 611418, 615866, 620598, 624808, 628594, 633121, 639267, 646607, 654095, 661339, 668746, 676732, 685223, 693806, 701973, 709399, 716305, 723440, 731366, 739926, 748702, 757721, 767211, 776828, 785750, 793658, 801142, 809009, 817584, 826792, 836430, 846118, 855354, 863993, 872439, 881088, 889840, 898411, 906898, 915672, 924831, 934140, 943430, 952775, 962308, 972107, 982203, 992455, 1002458, 1011919, 1021110]
57329A021110R557J0172J0368J0003R486R200R241R554R926R926R367Q795R106
57316A145811J0404J1700J2061J1821J2223J3855J5854J6871J6634J6137J6270
57305A299641J6729J6610J5769J4980J4751J4673J4236J3692J3561J3765J3857
57294A462264J3963J4591J5634J6294J6233J6110J6554J7167J7105J6249J5288
57283A637452J4725J4447J4244J4233J4590J5148J5588J5891J6369J7288J8551
57272A808526J9866K1113K2450K4006K5633K7083K8352K9642L1013L2318L3498
57261B103500L4643L5665L6223L6165L5815L5598L5544L5429L5254L5286L5675
57250B494797L6328L7152L8108L9086L9992M0996M2340M3774M4556M4274M3467
$$ y = [1021110, 1030667, 1040839, 1051207, 1061210, 1070696, 1079896, 1089137, 1098691, 1108617, 1118543, 1127910, 1136705, 1145811, 1156215, 1167915, 1179976, 1191797, 1204020, 1217875, 1233729, 1250600, 1267234, 1283371, 1299641, 1316370, 1332980, 1348749, 1363729, 1378480, 1393153, 1407389, 1421081, 1434642, 1448407, 1462264, 1476227, 1490818, 1506452, 1522746, 1538979, 1555089, 1571643, 1588810, 1605915, 1622164, 1637452, 1652177, 1666624, 1680868, 1695101, 1709691, 1724839, 1740427, 1756318, 1772687, 1789975, 1808526, 1828392, 1849505, 1871955, 1895961, 1921594, 1948677, 1977029, 2006671, 2037684, 2070002, 2103500, 2138143, 2173808, 2210031, 2246196, 2282011, 2317609, 2353153, 2388582, 2423836, 2459122, 2494797, 2531125, 2568277, 2606385, 2645471, 2685463, 2726459, 2768799, 2812573, 2857129, 2901403, 2944870]
57239B944870M3115M3533M4142M4308M4138M4214M4734M5267M5456M5649M6600
57228C436026M8595N1196N3831N6385N9022O1697O4199O6493O8761P1083P3349
57217D110637P5534P7685P9548Q0536Q0321P9257P8041P7016P6018P4827P3531
57206D962951P2505P2190P2835P4271P5933P7216P7851P7847P7200P5894P4164
57195E790857P2548P1525P1129P0895P0138O8416O5835O2919O0038N7147N4289
57184F515736N2127N1476N2315N3709N4959N6397N8716O1859O5001O7564O9802
57173G159661P2392P5710P9635Q3794Q7791R1192R3446R4051R2952R0768Q8386
57162H109778Q6303Q4541Q3271Q3120Q4670Q7891R2283R7423J03035J08786J14383
$$ y = [2944870, 2987985, 3031518, 3075660, 3119968, 3164106, 3208320, 3253054, 3298321, 3343777, 3389426, 3436026, 3484621, 3535817, 3589648, 3646033, 3705055, 3766752, 3830951, 3897444, 3966205, 4037288, 4110637, 4186171, 4263856, 4343404, 4423940, 4504261, 4583518, 4661559, 4738575, 4814593, 4889420, 4962951, 5035456, 5107646, 5180481, 5254752, 5330685, 5407901, 5485752, 5563599, 5640799, 5716693, 5790857, 5863405, 5934930, 6006059, 6076954, 6147092, 6215508, 6281343, 6344262, 6404300, 6461447, 6515736, 6567863, 6619339, 6671654, 6725363, 6780322, 6836719, 6895435, 6957294, 7022295, 7089859, 7159661, 7232053, 7307763, 7387398, 7471192, 7558983, 7650175, 7743621, 7837672, 7930624, 8021392, 8109778, 8196081, 8280622, 8363893, 8447013, 8531683, 8619574, 8711857, 8809280, 8912315, 9021101, 9135484]
57151I135484J19991J26318J34161J43818J54674J65236J73836J79578J82611
57142A0515707J83334J81563J76654J68081J55620J39181J19007R6084P2163M9354
57132A1856748K9607J4112K875m907r898j2396j3355j5096k0279l0302m4829o2444
57120A1689836q1176r8883j13971j25762j33927j38001j37969j34730j29349j22335
57110A0473733j14357j06906j01231r7141r3838r1185q8624q3416p1756n1665
57100I573614k3445J2247N4986J03630J57153K16900K86154L67056M59354N61660
57090A1769309O71025P80883Q82150R67251J030749J066171J066013J025286R40784
57081B0199621Q07791O27982M27225K56101J56483J22994J04280M5611p3000k36925
$$ y = [9135484, 9255475, 9381793, 9515954, 9659772, 9814446, 9979682, 10153518, 10333096, 10515707, 10699041, 10880604, 11057258, 11225339, 11380959, 11520140, 11639147, 11735231, 11807394, 11856748, 11886355, 11900467, 11903342, 11898435, 11888537, 11876141, 11862786, 11847690, 11827411, 11797109, 11752280, 11689836, 11608660, 11509777, 11395806, 11270044, 11136117, 10998116, 10860147, 10725417, 10596068, 10473733, 10359376, 10252470, 10151239, 10054098, 9960260, 9869075, 9780451, 9697035, 9625279, 9573614, 9550169, 9562416, 9617402, 9721032, 9878185, 10095085, 10381239, 10748295, 11207649, 11769309, 12440334, 13221217, 14103367, 15070618, 16101367, 17167538, 18233551, 19258837, 20199621, 21007412, 21635394, 22062619, 22318720, 22475203, 22598197, 22702477, 22748088, 22675088, 22438163]
57071B2438163m20702o03194p67521q99827r92271j043335j054208j027774r70948
57062A4658383q94228q07330p16555o26144n39677m59531l86671l21680k64925
57053I641642k15695j72538j34583j01533p2573m6643k3657m160J2228K6756L9923
57042H949167N1211O0520O8688P6451Q3946R1404R9175J06911J13794J19909J26465
57031I947641J34361J43082J50964J55656J54513J45997J31376J14414R8942Q7165
57021A1264111P9922P7268P8210Q0887Q3751Q6355Q8825R1160R3210R4632R4581
57010A2212912R2132Q7335Q1291P5031O8975O3594N9738N7843N7658N9091O2548
56999A2978148O7809P3355P7649Q0478Q2371Q3151Q2121P9424P6250P3576P1413
$$ y = [22438163, 22017461, 21414267, 20646746, 19746919, 18754648, 17711313, 16657105, 15629331, 14658383, 13764155, 12956825, 12240270, 11614126, 11074449, 10614918, 10228247, 9906567, 9641642, 9425947, 9253409, 9118826, 9017293, 8944720, 8898077, 8874420, 8870260, 8882488, 8909244, 8949167, 9000378, 9060898, 9129586, 9206037, 9289983, 9381387, 9480562, 9587473, 9701267, 9821176, 9947641, 10082002, 10225084, 10376048, 10531704, 10686217, 10832214, 10963590, 11078004, 11176946, 11264111, 11344033, 11421301, 11499511, 11580398, 11664149, 11750504, 11839329, 11930489, 12023699, 12118331, 12212912, 12305044, 12392379, 12473670, 12548701, 12617676, 12681270, 12741008, 12798851, 12856509, 12915600, 12978148, 13045957, 13119312, 13196961, 13277439, 13359810, 13442961, 13525082, 13604506, 13680756, 13754332, 13825745]
56988A3825745O9478O7898O6908O6252O5413O4229O2991O1942O1009O0089N9358
56977A4531312N9035N8974N8677N7679N5694N2381M7419M1064L4434K8973K5665
56966A5051307K4669K5340K6324K6172K4324K1416J8351J5444J2766J0844J0242
56955A5267199J0594J0708R727P737N309L026J414P87R13J199J157M59j323m433
56941A5314473q506j2806j6867k0352k2620k3214k2783k2649k3214k3563k2944
56930A5094955k1930k1757k3109k5942k9968l4670l9263m3164m6405m9345n2230
56919A4707172n5224n8459o1714o4383o6124o7393o9070p1731p5351p9409q3120
56908A3955194q5872q7631q8680q8969q8241q6824q5603q4827q3640q1281p8268
$$ y = [13825745, 13895223, 13963121, 14030029, 14096281, 14161694, 14225923, 14288914, 14350856, 14411865, 14471954, 14531312, 14590347, 14649321, 14707998, 14765677, 14821371, 14873752, 14921171, 14962235, 14996669, 15025642, 15051307, 15075976, 15101316, 15127640, 15153812, 15178136, 15199552, 15217903, 15233347, 15246113, 15256957, 15267199, 15277793, 15288501, 15298228, 15305965, 15311274, 15314300, 15315714, 15316501, 15317414, 15318613, 15319770, 15320229, 15318906, 15314473, 15305967, 15293161, 15276294, 15255942, 15233322, 15210108, 15187325, 15164676, 15141462, 15117899, 15094955, 15073025, 15051268, 15028159, 15002217, 14972249, 14937579, 14898316, 14855152, 14808747, 14759402, 14707172, 14651948, 14593489, 14531775, 14467392, 14401268, 14333875, 14264805, 14193074, 14117723, 14038314, 13955194, 13869322, 13781691, 13693011, 13604042, 13515801, 13428977, 13343374, 13258547, 13174907, 13093626, 13015358]
56897A3015358p5680p3756p2002p0468p0037p1294p3698p6212p8208p9507p9911
56886A2194585p9221p7707p6191p5496p5963p7566q0312q4134q8424r2105r4532
56875A1292934r6040r7246r8122r8177r7365r6191r4859r2946r0113q6650q3101
56864A0262124p9662p6121p2103o7323o2067n7534n5354n6592o1465o9782q0845
56853I523276r2800j03000j09616j12571j12634j10295j05896j00258r4362q8640
56843H493204q3062p7661p2588o7922o3771o0178n6589n1932m5821l9398l4485
56832G839797l2320l3690l9731n1368o7833q6449j04111j18662j28935j34379
56822G042319j35177j32433j27730j22299j16489j09936j02415r4593q7689q2221
$$ y = [13015358, 12939678, 12865922, 12793920, 12723452, 12653415, 12582121, 12508423, 12432211, 12354003, 12274496, 12194585, 12115364, 12037657, 11961466, 11885970, 11810007, 11732441, 11652129, 11567995, 11479571, 11387466, 11292934, 11196894, 11099648, 11001526, 10903349, 10805984, 10709793, 10614934, 10521988, 10431875, 10345225, 10262124, 10182462, 10106341, 10034238, 9966915, 9904848, 9847314, 9791960, 9735368, 9673903, 9604121, 9523276, 9430476, 9327476, 9217860, 9105289, 8992655, 8882360, 8776464, 8676206, 8581844, 8493204, 8410142, 8332481, 8259893, 8191971, 8128200, 8068022, 8011433, 7959501, 7913680, 7874282, 7839797, 7807477, 7773787, 7734056, 7682688, 7614855, 7528406, 7424295, 7305633, 7176698, 7042319, 6907142, 6774709, 6646979, 6524680, 6408191, 6298255, 6195840, 6101247, 6013558, 5931337]
56812E931337p7499p2685o7998o4399o2392o1747o2327o4733p0056p9123r1649
56801E156729j05647j18059j26629j31155j32591j31468j27866j22474j16471
56792D044369j10307j03597r6366q9425q3187p7104p0802o4907o0089n5970n1764
56781C180851m7526m4025m1820m1263m3098m8025n5504o3736p1070p6940q1282
56770B566562q3734q3912q2080p9002p5195p0775o5992o1563n8201n5964n4236
56759A795908n2289m9808m6993m4314m2137m0419l8723l6684l4483l2693l1632
56748A345733l1022l0339k9348k8133k6928k6033k5610k5315k4398k2580k0679
56737A055348j9878k0335k1032k1039k0504k0209k0551k1208k1598k1443k0924
$$ y = [5931337, 5853838, 5781153, 5713155, 5648756, 5586364, 5524617, 5462290, 5397557, 5327501, 5248378, 5156729, 5051082, 4933023, 4806394, 4675239, 4542648, 4411180, 4283314, 4160840, 4044369, 3934062, 3830465, 3734099, 3644674, 3561487, 3484383, 3413581, 3348674, 3288585, 3232615, 3180851, 3133325, 3089300, 3047480, 3006217, 2963119, 2915094, 2859590, 2795854, 2724784, 2647844, 2566562, 2482828, 2398916, 2316836, 2237834, 2162639, 2091864, 2025872, 1964309, 1906108, 1850144, 1795908, 1743619, 1693811, 1646818, 1602504, 1560367, 1519948, 1481225, 1444541, 1410058, 1377365, 1345733, 1314711, 1284372, 1255024, 1226891, 1199963, 1173930, 1148320, 1123005, 1098607, 1076027, 1055348, 1035470, 1015135, 994103, 973064, 952560, 932351, 911800, 890592, 868994, 847551, 826627]
56726H26627k0430k0022j9269j7861j6285j5379j5132j4584j3220j1904j1836
56715F50705j2987j4235j4854j5090j5339j5515j5484j5409j5313j4821j3752
56704D87906j2582j1812j1215j0246q985q103p945q111q007p415o491n575n056
56691C76363n079n320n379n324n457n590n198m402m081m590n054m565l558l244
56677C09522l907m539m197l095k255k481l730n088n393m367l113l036m244n505
56663B54572n819n421n120n205n365n191m477l275j986j103p03m19m3J84K8l83
56647B10274q15j210j506j523j238q88o43m81m79p66j141j219j166j703l028m294
56631A88174m601m048l341k847k589k690l168l587l545l305l312l318k721j641
$$ y = [826627, 806197, 786175, 766906, 749045, 732760, 717381, 702249, 687665, 674445, 662541, 650705, 637718, 623483, 608629, 593539, 578200, 562685, 547201, 531792, 516479, 501658, 487906, 475324, 463512, 452297, 442051, 433066, 424963, 417018, 408907, 400900, 393485, 386994, 381419, 376363, 371284, 365964, 360585, 355261, 349804, 344214, 339016, 334614, 330533, 325943, 320889, 316324, 312766, 309522, 305615, 301076, 296879, 293784, 291529, 289048, 285318, 280230, 274837, 270470, 267357, 264321, 260077, 254572, 248753, 243332, 238212, 233007, 227642, 222451, 217974, 214699, 212713, 211610, 210907, 210488, 210445, 210629, 210657, 210274, 209459, 208249, 206743, 205220, 203982, 203094, 202451, 201970, 201491, 200725, 199584, 198365, 197199, 195496, 192468, 188174, 183573, 179525, 176184, 173337, 170748, 168058, 164890, 161303, 157758, 154453, 151141, 147823, 145102, 143461]
56617A43461r25r43j099p78k07J0j62j34M46J133J125K21q66j343j269j336j748
56600A35586j835j031K55J118J214R20O73N34L52N1k41k63O1L96L97K96N79J021
56582A40083Q39om61J11R04Q55J60l00m03n81o44k7R49J301R51R48J812K725K801
56563A52017K309K087K414L007L673M329M672M330L306J976P67n3l92l67k28j77
56547A83670k71m67o54p70q77j025r54l29O29J151Q25N5o15j188j812k276k375
56530A72717k322k265j904j222r26j409j867j362k74L14J72j69o19j374j884j396
56514A54210m00j22o21p70k99k46j056j682j243k50M51Q59J220J251P75K98L31
56497A52706P64J361K108K590K056N98o13q14n03l24j40J49k8q85j525j138j82
$$ y = [143461, 142536, 141593, 140494, 139716, 139509, 139519, 139357, 139223, 139669, 140802, 141927, 142148, 141282, 139939, 138670, 137334, 135586, 133751, 132720, 132975, 134093, 135307, 136227, 136900, 137434, 137786, 137837, 137596, 137333, 137394, 137790, 138187, 138483, 139062, 140083, 140922, 140916, 140455, 140566, 141470, 142325, 142485, 142185, 141782, 141201, 140557, 140530, 141479, 142780, 143731, 144679, 146491, 149216, 152017, 154326, 156413, 158827, 161834, 165507, 169836, 174508, 178838, 182144, 184120, 184887, 184834, 184442, 184075, 183847, 183670, 183399, 182932, 182278, 181508, 180631, 179606, 178652, 178323, 178952, 180103, 180928, 180983, 180368, 179180, 177368, 175092, 172717, 170395, 168130, 166226, 165004, 164078, 162669, 160802, 159440, 159166, 159480, 159652, 159483, 158864, 157490, 155606, 154210, 153810, 153688, 153067, 152297, 151998, 151752, 150696, 149014, 147771, 147521, 147972, 148831, 150051, 151302, 152077, 152375, 152706, 153470, 154831, 156939, 159529, 161585, 162183, 161570, 160756, 160253, 159929, 159789, 159938, 159910, 159025, 157500, 156362, 156180]
56480A56180L92L79J6o63j362j251j23R95J264J234J679K121J708P78K95K87J51
56463A64080o9O8K54j32p72q25l69k02m17l92p0m2l90n89m90l92k01L80R28P00
56443A61058k2j64N59J355J713J870J871J376O31L79N23J21r17j357n44M52L93
56426A69297m20q11m51P5L57M71N14N23O27Q21P96M24Q7J44L93M44L41L99O61
56407A74692R34J167J460J870K385K899L066K492J333M02L25Q60J293J260R09
56392A97347M35p6m16k49M79J341J825J869J823J836J611R17J69m4R9k46j364
56375B07356k436k618k050j351o71J56R34J315J416J534J521J102O85R88J964
56360B09845K771K850K456K093K031K332K740K622J599K06o64q39q08p68m77N5
$$ y = [156180, 156572, 156951, 156967, 156304, 154942, 153691, 153568, 154563, 155827, 157061, 158740, 160861, 162569, 163347, 163642, 163929, 164080, 164011, 164079, 164333, 164201, 163429, 162604, 162235, 162033, 161616, 161224, 161154, 161112, 160722, 160133, 159643, 159251, 159050, 159430, 160358, 161058, 161036, 160872, 161431, 162786, 164499, 166369, 168240, 169616, 170247, 170626, 171149, 171270, 170353, 168996, 168452, 168904, 169297, 168877, 168066, 167615, 167690, 168047, 168518, 169032, 169555, 170182, 171003, 171799, 172223, 172310, 172454, 172847, 173291, 173632, 174031, 174692, 175626, 176793, 178253, 180123, 182508, 185407, 188473, 190965, 192298, 192700, 193025, 193885, 195178, 196438, 197347, 197782, 197706, 197290, 197041, 197520, 198861, 200686, 202555, 204378, 206214, 207825, 208742, 208911, 208867, 208966, 208720, 207356, 204920, 202302, 200252, 198901, 198230, 198386, 199320, 200635, 202051, 203585, 205106, 206208, 206893, 207881, 209845, 212616, 215466, 217922, 220015, 222046, 224378, 227118, 229740, 231339, 231545, 230881, 230042, 229234, 228466, 227989, 228044]
56344B28044N31R81J646K268K304J905J833K336K965L469M063M673M862M678M616
56329B71174M615M042K930K181K124J984J273O56P74J157J111Q63R66J251J231
56314B98332J097J390K071K652K985L257L473L504L443L449L510L689M224M955
56300C42031N218M815M564N212O282O714O275N638N321N392N941P072Q340Q948
56286D27763Q654Q056P893Q382R232R964J0281J0378J0753J1531J2173J2203J1914
56273E59177J1994J2711J3891J5413J7134J8517J9027J8970J9372K0807K2737
56262G49750K4221K5023K5819K7437L0101L3371L6695L9931M3291M7005N1246
56251A133890N6268O2163O8455P4295P9343Q4138Q9279R4469R8674J01156J02052
$$ y = [228044, 228575, 229556, 231202, 233470, 235774, 237679, 239512, 241848, 244813, 248282, 252345, 257018, 261880, 266558, 271174, 275789, 279831, 282761, 284942, 287066, 289050, 290323, 290979, 291753, 292910, 294021, 294884, 295850, 297101, 298332, 299429, 300819, 302890, 305542, 308527, 311784, 315257, 318761, 322204, 325653, 329163, 332852, 337076, 342031, 347249, 352064, 356628, 361840, 368122, 374836, 381111, 386749, 392070, 397462, 403403, 410475, 418815, 427763, 436417, 444473, 452366, 460748, 469980, 479944, 490225, 500603, 511356, 522887, 535060, 547263, 559177, 571171, 583882, 597773, 613186, 630320, 648837, 667864, 686834, 706206, 727013, 749750, 773971, 798994, 824813, 852250, 882351, 915722, 952417, 992348, 1035639, 1082644, 1133890, 1190158, 1252321, 1320776, 1395071, 1474414, 1558552, 1647831, 1742300, 1840974, 1942130, 2044182]
56240B044182J01866J00539R7195R0908Q1717P0539N8045M4021K8166J1111n974
56229B722315k2400l7949n2016o3683p2739p9881q5727r0243r3205r4578r4258
56218A935636r2146q8692q4728q0566p5946p0956o6229o1976n7691n3155m8900
56207A154651m5247m1735l8020l4537l1669k9012k6114k3273k0945j8941j6971
56196H28187j5372j4521j3984j2981j1404r660p983o484n494n165n007m478l711
56183G11943l130k701k198j852j984k278k104j351m37L51R82J344J335J128R74
56168G00022R32J151K029L629N314O358O671O612O496O645P340Q340Q986R210
56154G79735R810J1211J2706J3604J4379J5818J7693J9290K0727K2782K5664K8923
$$ y = [2044182, 2146048, 2246587, 2343782, 2434690, 2516407, 2586946, 2644991, 2689012, 2717178, 2728289, 2722315, 2699915, 2661966, 2609950, 2546267, 2473528, 2393647, 2307920, 2217677, 2124472, 2029894, 1935636, 1843490, 1754798, 1670070, 1589504, 1513558, 1442602, 1376373, 1314397, 1256706, 1203551, 1154651, 1109404, 1067669, 1029649, 995112, 963443, 934431, 908317, 885044, 864099, 845158, 828187, 812815, 798294, 784310, 771329, 759925, 750265, 742282, 735798, 730304, 725139, 720132, 715654, 711943, 708813, 706112, 703914, 702062, 700078, 697800, 695696, 694345, 693908, 694259, 695241, 696585, 697920, 699048, 700022, 700954, 702105, 704134, 707763, 713077, 719435, 726106, 732718, 739214, 745859, 753199, 761539, 770525, 779735, 789545, 800756, 813462, 827066, 841445, 857263, 874956, 894246, 914973, 937755, 963419, 992342]
56142I92342L2427L6534M1459M7106N3289N9376O4020O6043O5387O2584N7754
56131A578321N1038M3648L7351L2864K9590K6850K4498K2103J8571J3042N897
56120A883773j440p594j2190j5922j9684k3715k7952l2937l9443m6889n3164n6564
56108A546279n7145n5700n2490m7806m2725l8118l3557k8362k3019j8497j4745
56097A134115j1095p717n353l971k802j498k82Q19J865K565K881L641N479P643
56083A126290Q945R380R702R960R849J0006J1363J3432J4778J5108J5475J6418
56071A270706J7314J7688J7837J8033J8243J8763J9957K1346K2056K2189K2626
56060A486758K3496K4041K4022K4129K4832K5908K7121K8413K9314K9264K8504
$$ y = [992342, 1024769, 1061303, 1102762, 1149868, 1203157, 1262533, 1326553, 1392596, 1457983, 1520567, 1578321, 1629359, 1673007, 1710358, 1743222, 1772812, 1799662, 1824160, 1846263, 1864834, 1877876, 1883773, 1882333, 1874739, 1862549, 1846627, 1826943, 1803228, 1775276, 1742339, 1702896, 1656007, 1602843, 1546279, 1489134, 1433434, 1380944, 1333138, 1290413, 1252295, 1218738, 1190376, 1167357, 1148860, 1134115, 1123020, 1115303, 1109950, 1105979, 1103177, 1101679, 1101397, 1102216, 1104081, 1106646, 1109527, 1113168, 1118647, 1126290, 1135235, 1144615, 1154317, 1164277, 1174126, 1184132, 1195495, 1208927, 1223705, 1238813, 1254288, 1270706, 1288020, 1305708, 1323545, 1341578, 1359821, 1378584, 1398541, 1419887, 1441943, 1464132, 1486758, 1510254, 1534295, 1558317, 1582446, 1607278, 1633186, 1660307, 1688720, 1718034, 1747298, 1775802]
56049A775802K7863K7793K8378K9862L2186L4503L6311L8501M1968M5766M8209
56038B167142M9344N0606N2373N3709N4464N5825N8551O2247O6488P1201P5847
56027B817797P9670Q2932Q6582R0772R4966R9234J04085J09303J14390J19856
56017C799587J26657J34830J44099J55091J68171J81835J94359K06361K19519
56008E330509K33535K46730K58938K71195K83114K93417L02651L12449L22491
55999G855029L31214L39261L49080L61379L75266L91617M12493M37130M62210
55990A1314679M86261N09982N32131N49651N62676N75163N89621O05521O23919
55981A6349604O48862O82400P22398P67044Q17449Q74138R35274J000146J070284
$$ y = [1775802, 1803665, 1831458, 1859836, 1889698, 1921884, 1956387, 1992698, 2031199, 2073167, 2118933, 2167142, 2216486, 2267092, 2319465, 2373174, 2427638, 2483463, 2542014, 2604261, 2670749, 2741950, 2817797, 2897467, 2980399, 3066981, 3157753, 3252719, 3351953, 3456038, 3565341, 3679731, 3799587, 3926244, 4061074, 4205173, 4360264, 4528435, 4710270, 4904629, 5110990, 5330509, 5564044, 5810774, 6069712, 6340907, 6624021, 6917438, 7220089, 7532538, 7855029, 8186243, 8525504, 8874584, 9235963, 9611229, 10002846, 10415339, 10852469, 11314679, 11800940, 12310922, 12843053, 13392704, 13955380, 14530543, 15120164, 15725685, 16349604, 16998466, 17680866, 18403264, 19170308, 19987757, 20861895, 21797169, 22797315, 23867599]
55972B3867599J145555J223836J306531J399858J508850J634966J781359J955081
55964C5823635K161721K403622K685910L018676L411106L870116M407241N039214
55956F2821241N778338O630690P608598Q737449J0047416J1568888J3337326J5375721
55948A41905667J7630506J9882953K1678755K2321695K1006761J7149724J0798447
55941B72374508K815467n399190j2498843j7669864k0721846k1885147k1578466
55934A75436619k0269150j8388335j6269279j4133673j2122739j0324033q774025
55927G5155385p465239o371277n464875m716302m092298l566554l124793k755640
55919C7598407k443942k176658j947784j752866j584277j435532j305117j192427
$$ y = [23867599, 25013154, 26236990, 27543521, 28943379, 30452229, 32087195, 33868554, 35823635, 37985356, 40388978, 43074888, 46093564, 49504670, 53374786, 57782027, 62821241, 68599579, 75230269, 82838867, 91576316, 101623732, 113192620, 126529946, 141905667, 159536173, 179419126, 201097881, 223419576, 244426337, 261576061, 272374508, 275189975, 269790785, 257291942, 239622078, 218900232, 197015085, 175436619, 155167469, 136779134, 120509855, 106376182, 94253443, 83929410, 75155385, 67690146, 61318869, 55853994, 51137692, 47045394, 43478840, 40354047, 37598407, 35154465, 32977807, 31030023, 29277157, 27692880, 26257348, 24952231, 23759804]
55911B3759804j094109j007161r31443q66359q08665p55896p08537o66818o28764
55902A6292052n93254n61619n34199n08415m82078m55865m30880m06637l83031
55893A1936074l61604l43088l26142l09897k95340k82903k71196k59520k49287
55884I237097k41578k35502k30145k25776k21882k16496k09028k01493j95460
55875G259737j89893j83492j77111j72136j68372j65087j62333j59692j55434
55866E726187j48707j41059j34194j27641j20304j12910j07109j03080r9787r6755
55856D534641r4222r2114r0221q8817q8007q7062q5336q3114q0855p8304p5283
55845C591306p2421p0179o7987o5227o2407o0424n9281n8403n7624n7027n6354
$$ y = [23759804, 22665695, 21658534, 20727091, 19860732, 19052067, 18296171, 17587634, 16920816, 16292052, 15698798, 15137179, 14602980, 14094565, 13612487, 13156622, 12725742, 12319105, 11936074, 11574470, 11231382, 10905240, 10595343, 10300003, 10017100, 9745904, 9486384, 9237097, 8995519, 8760017, 8529872, 8304096, 8082214, 7865718, 7656690, 7455197, 7259737, 7069844, 6886352, 6709241, 6537105, 6368733, 6203646, 6041313, 5881621, 5726187, 5577480, 5436421, 5302227, 5174586, 5054282, 4941372, 4834263, 4731183, 4631396, 4534641, 4440419, 4348305, 4258084, 4169267, 4081260, 3994198, 3908862, 3825748, 3744893, 3666589, 3591306, 3518885, 3448706, 3380719, 3315492, 3253085, 3192661, 3133380, 3074977, 3017353, 2960326, 2903972]
55834B903972n5312n4031n2686n1234m9912m9276m9183m8603m6996m5141m3923
55823B357675m3084m1948m0654l9797l9311l8577l7354l5987l4888l4189l3709
55812A938177l2989l1650k9937k8489k7547k6855k6357k6273k6411k6134k5175
55801A630360k3827k2236k0348j8592j7718j7718j7823j7739j7957j8554j8765
55790A419083j8175j7409j7158j7326j7606j8062j8710j9303j9946k1105k2630
55779A211653k3642k3835k4011k4776k5475k5058k3367k1093j9021j7646j6926
55768I66803j6222j5077j4100j4178j4872j4720j3388j2125j1781j1771j1602
55757H16967j1909j2984j3673j2993j1803j1587j2268j2611j2160j1573j1366
$$ y = [2903972, 2848660, 2794629, 2741943, 2690709, 2640797, 2591521, 2542338, 2493735, 2446739, 2401598, 2357675, 2314591, 2272643, 2231989, 2192192, 2152881, 2114304, 2076950, 2040963, 2006075, 1971886, 1938177, 1905188, 1873538, 1843601, 1815112, 1787565, 1760710, 1734353, 1708080, 1681669, 1655535, 1630360, 1606533, 1584297, 1563949, 1545357, 1527639, 1509921, 1492098, 1474359, 1456402, 1437848, 1419083, 1400908, 1383499, 1366341, 1349015, 1331409, 1313347, 1294637, 1275334, 1255388, 1234283, 1211653, 1188011, 1164176, 1140165, 1115389, 1089914, 1064856, 1041489, 1020396, 1001375, 983729, 966803, 950581, 935504, 921404, 907226, 892354, 877634, 864246, 852121, 840340, 828569, 816967, 805058, 792074, 778401, 765408, 753605, 742018, 729750, 717139, 704979, 693406, 682040]
55746F82040j1443j1738j2325j2965j3222j2939j2175j1017r859r331r484r563
55734E45979r125q731q864q931q152o839n914n584n446n524o202p334q210q403
55720D42720q062p489o931o615o534o345n876n382n009m427l506k768k638k723
55706C68415k483k127k150k379k224j684j346j586k339l434m566n149m848m146
55692C27954l836m054m319m350m292m194l815l045k212j826k080k486k161p99
55678B84485O27P74l96j527j697j555k157l451m578n140n341n260m767m050l585
55663B42382l586l799l712k845j112Q43K026K067J477P95N5p14j167j195j186
55648B30329j295j148o28l39p29j389j788k047k451k771k783k913l612m512m892
$$ y = [682040, 670597, 658859, 646534, 633569, 620347, 607408, 595233, 584216, 574357, 565026, 555542, 545979, 536854, 528123, 519259, 510328, 502176, 495337, 489423, 483839, 478393, 472869, 466667, 459333, 451123, 442720, 434658, 427169, 420238, 413623, 407089, 400744, 394868, 389486, 384477, 380050, 376544, 373776, 371138, 368415, 365932, 363805, 361655, 359276, 357052, 355368, 354022, 352436, 350097, 346663, 342097, 336948, 332100, 327954, 324118, 320064, 315745, 311395, 307103, 302909, 299094, 296049, 293837, 292011, 289931, 287445, 285284, 284485, 285112, 285886, 285490, 283963, 282266, 280711, 278554, 275103, 270525, 265385, 260044, 254784, 250017, 245967, 242382, 238796, 234997, 231285, 228440, 227328, 228171, 230197, 232264, 233741, 234536, 234591, 233877, 232710, 231515, 230329, 229034, 227886, 227258, 226919, 226190, 224801, 223013, 220966, 218515, 215744, 212961, 210048, 206436, 201924, 197032]
55633A97032m603m019l493l294l596m020l783k780j920j840j987j631j026q46
55619A58194j044j176j282j610j927j859j487j037n38k86r02k237l055k643j888
55604A35223j829k068j741j129r70r48l66K46k15j464k064j479n64j09j81p77
55588A19565j807k526k158j081k65J60O89J086P27M2Q7P59R41N50O79J584K158
55571A21190J892J717K267K781K493J823J318N74q80k503l428l594l455l159k602
55556A16434j812q02M02J407J776J819K267K956K858J656L05l96p68j300j735
55541A25067j748j609j520j104k02N45O00L35K73K38q8l62p2N99J056J064P58
55524A23830K62k79o70r66j406j820j730j211r40j179j489j777k603l976m838
$$ y = [197032, 192429, 188410, 184917, 181623, 178027, 174007, 170224, 167444, 165524, 163684, 161697, 160066, 159040, 158194, 157150, 155974, 154692, 153082, 151155, 149296, 147809, 146772, 146234, 145948, 145046, 142809, 139754, 137111, 135223, 133394, 131326, 129585, 128456, 127486, 126538, 126172, 126418, 126203, 124739, 122675, 121196, 120632, 120523, 120342, 119565, 117758, 115232, 113074, 111993, 111728, 111888, 112577, 113663, 114390, 114432, 114519, 115278, 116219, 116769, 117448, 119032, 121190, 123082, 124799, 127066, 129847, 132340, 134163, 135481, 136055, 135175, 132672, 129244, 125650, 122195, 119036, 116434, 114622, 113820, 114222, 115629, 117405, 119224, 121491, 124447, 127305, 128961, 129266, 128870, 128102, 126802, 125067, 123319, 121710, 120190, 119086, 118884, 119429, 120029, 120364, 120637, 120875, 120787, 120425, 120353, 120952, 122008, 123072, 123830, 124092, 123813, 123143, 122177, 120771, 118951, 117221, 116010, 115070, 113891, 112402, 110625, 108022, 104046, 99208]
55509I9208m468l572l165l115k664j760r65n32l80n67j010j066k78P62J024L61
55493G7813m44p36n72l09j75j58k4M17R64J256J411J930K694K826J832K82j042
55476H7965j937k330j882p10K32K84l4N6L93M31L38N79R21Q00L26M4o3m17r12
55457H4084j016o44j76K20N61N54p9r28j256r37m29n2Q8k34r93j517j224n66l78
55438G5078n47k68N40J073R67P43P81P54L53j41l43k48QL39N06K38l32p66q80
55419G7855p25j85P42J404J068L5o01m38j64l15n14l10K2K2k85o79j123j426j083
55400G3300n1Q81J017O17K89K3m94r67p30J82R57J086Q78P30N15N5k92m5N76Q21
55380G9348L85k05m23m68q19j274j137k56N92O39n1q80j407j392o84M24J071P14
$$ y = [99208, 94740, 91168, 88003, 84888, 82224, 80464, 79499, 78967, 78587, 78020, 77010, 75944, 75666, 76428, 77452, 77813, 77369, 76633, 76061, 75752, 75577, 75419, 75395, 75812, 76776, 78032, 79443, 81373, 84067, 86893, 88725, 89007, 87965, 86028, 83698, 81816, 81106, 81338, 81622, 81588, 81644, 82037, 82468, 82806, 83385, 84306, 85106, 85432, 85476, 85413, 84996, 84084, 83068, 82424, 82248, 82468, 83029, 83583, 83504, 82576, 81320, 80383, 79954, 79902, 79990, 79756, 78763, 77246, 76022, 75456, 75078, 74531, 74263, 74803, 75876, 76843, 77586, 78367, 79121, 79474, 79333, 78990, 78742, 78750, 79089, 79595, 79833, 79501, 78735, 77855, 77130, 76945, 77687, 79091, 80159, 80194, 79593, 79155, 78991, 78676, 78162, 77852, 77874, 77896, 77611, 76932, 75809, 74383, 73300, 73249, 74130, 75147, 75764, 76053, 76076, 75582, 74615, 73885, 74067, 75024, 76110, 76988, 77718, 78233, 78288, 77996, 77951, 78527, 79348, 79733, 79528, 79105, 78637, 77818, 76544, 75407, 75151, 75743, 76382, 76331, 75451, 74044, 72652, 71968, 72392, 73463, 74177]
55362G4177k5k3Q44J527J182J36p29j029r89q87q10p84q23q07n11J32Q22J026
55344G2429N13k74n68j17N34P68N98L87K05q4l53l81l74p46j333j379n31O20J225
55325G1139J113P51N11L55P2l16n27l07K80Q65J105R52O38M85P07J173J374R37
55307H1307J76j97n2m6n90j140j007m03o8j79k98k33k08k33L2O41J165J269R91
55288H0927M76j17m39k03K80L21k58q84r89n73R6Q50J507J808J632J078K58o05
55270H5165j033p43j85o5k74q3N23N87l17j166q04M08J084O33k26o40n64l98l86
55251H1516n90j010j429j358n19O91J449J241L20n77q66m83K58R24J142P30j04
55234H1335q18j017q10n47k91J48P75J267J307Q74J92m33p63p84o80n09j20M18
$$ y = [74177, 74152, 74129, 74973, 76500, 77682, 77818, 77089, 76060, 75071, 74184, 73374, 72590, 71767, 70960, 70449, 70581, 71403, 72429, 72942, 72668, 72100, 71983, 72517, 73285, 73883, 74270, 74475, 74391, 74038, 73657, 73283, 72537, 71204, 69825, 69294, 69914, 71139, 72252, 73003, 73514, 73869, 73941, 73625, 73098, 72791, 73071, 73936, 75041, 75993, 76631, 77116, 77823, 78996, 80370, 81307, 81483, 81286, 81234, 81188, 80598, 79458, 78451, 78048, 77980, 77801, 77503, 77270, 77062, 76829, 76861, 77502, 78667, 79936, 80927, 81403, 81286, 80847, 80644, 80924, 81245, 80987, 80103, 79114, 78541, 78637, 79487, 80994, 82802, 84434, 85512, 85770, 85165, 84132, 83389, 83204, 83139, 82865, 82782, 83305, 83892, 83575, 82409, 81605, 82013, 83097, 83730, 83504, 82864, 82300, 81902, 81516, 80926, 79916, 78487, 77129, 76610, 77301, 78750, 79991, 80311, 79734, 78868, 78385, 78643, 79567, 80709, 81439, 81335, 80517, 79500, 78690, 78143, 77852, 78000, 78775, 80042, 81349, 82223, 82415, 81982, 81219, 80435, 79755, 79246, 79126, 79544]
55216G9544N66l8q80j041l42M48N85R7m53n58p5O74J035O67J3k11N1L19M87Q79
55196H1767J363J239L01o71r53p64o71o86n57m09m97o12l86Q2M03N51P31Q25N18
55177H1574j04n79o43l41L24J274J954J629L23j000j427r93l91n5J71N56R95J091
55159H4358P03K75M07J070J479R81o8o61l79J30np99j477j457r63n31k55J67P37
55140H3712R48M34m29r44q94o15l81j43L0k04r27j527j265k22O59O49Q4m5O10
55121G9530J232Q56l23j128r05k01K29M12O97Q81N89J59K77Q46J087P43L82M05
55103H5768N39M99L70J89j43l37N6O22L01r65j788j240j74J79J02O53J724K131
55085H8486J449M98k3l25p23j029j036q93o96k68L66Q31R19P93N71K07j13K6N87
$$ y = [79544, 80110, 80072, 79192, 78151, 77809, 78257, 78842, 78939, 78486, 77928, 77853, 78527, 79562, 80229, 80242, 80031, 80082, 80401, 80888, 81767, 83130, 84369, 84670, 83999, 83046, 82282, 81611, 80925, 80368, 79959, 79462, 78850, 78464, 78546, 78949, 79500, 80231, 81056, 81574, 81470, 80891, 80248, 79907, 80231, 81505, 83459, 85088, 85411, 84411, 82984, 81991, 81600, 81545, 81716, 82272, 83267, 84358, 85061, 85336, 85743, 86813, 88292, 89273, 89205, 88544, 88165, 88295, 88290, 87491, 86014, 84557, 83594, 83063, 82808, 82975, 83712, 84660, 85094, 84665, 83721, 82827, 82212, 81831, 81688, 81718, 81514, 80587, 79060, 77795, 77573, 78232, 78881, 78965, 78920, 79530, 80762, 81618, 81295, 80167, 79262, 79061, 79290, 79702, 80399, 81280, 81869, 82028, 82305, 83151, 84238, 84981, 85363, 85768, 86307, 86806, 87176, 87365, 87222, 86885, 86941, 87563, 87864, 86899, 85111, 83871, 83697, 83876, 83978, 84631, 86355, 88486, 89935, 90433, 90410, 90085, 89362, 88333, 87297, 86404, 85708, 85440, 85806, 86637, 87556, 88349, 88920, 89127, 89014, 89040, 89627]
55066H9627R21N68j72p43r33p90l14L62Q46Q58O02M66N29O00N32L10Kj99n4L48
55046I3366N46K54k26m35m54p64j447j865j370r8J118J545J149M67Nj37j02P0
55028I1622M88J086J459J218M71k04m15l41l80n57n74l92l37n08n34j88J13p1
55010I1956m33l40J01J19n18j050p16L16J343J948K100J861J355P98K91j72l66
54993I8593k7M88L90l27n85K15J078P79k66n63K43J019R73O18N34L21m64j237
54975A01782j139m14j46p58j545j661r51K29J460K251K105J022k49q29n98j42
54959A00417J18L30O62P86L95r0K5O32Q71L51l01m27j95o5M3M71J108J571J791
54940A08493J772J223O5r00p60J83O49N7q52j167q28k56L28Q57J192J397J810
$$ y = [89627, 90548, 91116, 90944, 90201, 89268, 88478, 88164, 88526, 89372, 90230, 90832, 91298, 91827, 92427, 92959, 93269, 93271, 93072, 93018, 93366, 93912, 94166, 93940, 93505, 93051, 92287, 90840, 88975, 87605, 87507, 88625, 90170, 91319, 91786, 91791, 91654, 91552, 91622, 92110, 93196, 94655, 95873, 96344, 96140, 95725, 95384, 95004, 94447, 93873, 93481, 93144, 92636, 92102, 91914, 92027, 91956, 91523, 91183, 91284, 91403, 90885, 89835, 89119, 89435, 90778, 92726, 94826, 96687, 98042, 98840, 99131, 98959, 98593, 98566, 99054, 99444, 99117, 98532, 98747, 99825, 100604, 100338, 99775, 100018, 101037, 102010, 102628, 103162, 103483, 103019, 101782, 100643, 100229, 100083, 99325, 97780, 96119, 95168, 95397, 96857, 99108, 101213, 102235, 101986, 101157, 100559, 100417, 100535, 100865, 101527, 102313, 102708, 102618, 102643, 103275, 104146, 104497, 104196, 103769, 103574, 103509, 103552, 104023, 105131, 106702, 108493, 110265, 111488, 111553, 110653, 109893, 110076, 110725, 110782, 109930, 108763, 107935, 107679, 108007, 108864, 110056, 111453, 113263]
54923A13263K548L209L411L312L339L684M190M531M360L600K653J995J527P37
54909A56359m84j605k209k417k473k435k477k919l676m109l789k979k133j382
54895A21272p86n64o44n45q8K50J35j1K23M59K00k16j25L35N56O08J103J917K160
54876A26239J631J347K122L373L925L505K868K676K830K769K057O56j101k729
54862A52168l910m539m547l907k916k165k043k378k730k841k673k253j731j436
54848A12099j494j494r33qM41J8o03n48l3j57j281k305j993o62K42N3m02j55O02
54829A01387J071J106J125J140P13j40p15n83j62kRK83O61N16l19j179j263n04
54811A03144M03P69O22O24J278K219K471J519k8j040j045n47j89J5M05R30J052
$$ y = [113263, 115811, 119020, 122431, 125743, 129082, 132766, 136956, 141487, 145847, 149447, 152100, 154095, 155622, 156359, 155875, 154270, 152061, 149644, 147171, 144736, 142259, 139340, 135664, 131555, 127766, 124787, 122654, 121272, 120486, 119922, 119278, 118733, 118645, 118895, 119030, 119019, 119242, 119701, 119901, 119685, 119560, 119895, 120451, 121059, 122162, 124079, 126239, 127870, 129217, 131339, 134712, 138637, 142142, 145010, 147686, 150516, 153285, 155342, 155998, 154897, 152168, 148258, 143719, 139172, 135265, 132349, 130184, 128141, 125763, 123033, 120192, 117519, 115266, 113535, 112099, 110605, 109111, 108178, 108170, 108611, 108629, 108026, 107478, 107445, 107288, 106007, 103702, 101709, 101047, 101289, 101342, 100940, 100785, 101387, 102458, 103564, 104689, 105829, 106542, 106402, 105687, 105104, 104942, 104940, 104949, 105232, 105893, 106409, 106090, 104911, 103648, 103144, 103547, 104316, 104938, 105562, 106840, 109059, 111530, 113049, 113021, 111981, 110936, 110389, 110200, 110215, 110620, 111550, 112602]
54794A12602M44n54j275j416j209j008q58n02K46J161J671J374M95k37k66L15
54778A10983R81J378J526J559J466J214R64R98J404J935K259K358K496K787K946
54763A37254K719K394K532L119L461L068K264J560P81n72k282l353l175k263j588
54748A45919j549j828k036k101k097j970j596j106r43j394k066k118j239j27K98
54733A24047lk99j16L62Q43J318J796K071K030J789J483J170J085J519K326K949
54717A44370L082K945K732K313J648R47J85r64k354l123k812k151k105k534k548
54702A39631j911j282j212j586k055k331k112j326m95k58n30p10p03r70j529j722
54686A18899j267p87q16j006q40n71p75j355j707j594j241p37o9L88J16o42r24
$$ y = [112602, 113046, 112492, 111217, 109801, 108592, 107584, 106726, 106224, 106470, 107631, 109302, 110676, 111171, 110934, 110668, 110983, 111964, 113342, 114868, 116427, 117893, 119107, 120071, 121069, 122473, 124408, 126667, 129025, 131521, 134308, 137254, 139973, 142367, 144899, 148018, 151479, 154547, 156811, 158371, 159152, 158580, 156298, 152945, 149770, 147507, 145919, 144370, 142542, 140506, 138405, 136308, 134338, 132742, 131636, 130693, 129299, 127233, 125115, 123876, 123749, 124047, 124044, 123745, 123629, 123991, 124834, 126152, 127948, 130019, 132049, 133838, 135321, 136491, 137576, 139095, 141421, 144370, 147452, 150397, 153129, 155442, 157090, 158037, 158222, 157258, 154904, 151781, 148969, 146818, 144713, 142179, 139631, 137720, 136438, 135226, 133640, 131585, 129254, 127142, 125816, 125321, 125063, 124533, 123823, 123120, 122150, 120621, 118899, 117632, 116845, 116029, 115023, 114183, 113612, 112837, 111482, 109775, 108181, 106940, 106203, 106134, 106522, 106638, 105996, 105072]
54669A05072k75N86O64n8o90n58J68Q18R23N36N7k28m48q98j462j516p01M72J160
54650A03622J189J093J189J180Q61O02P08P79K71n27p89l74p2m50j050j092m88
54633A06652J47L64L24M81R94J491J422O94j40n42o81j056j583j656j161o87m95
54616A04568j1J133K213K317J635J092R96Q91O02N03O36M46l40j217j678j887
54600A11899k169k223j450O0J346J547P78n9l13j88k49n14m82k6K96J81K03R00
54582A09537J673J414J47q71p61oM36L05j0j42Q4P25J460J563O05r02j869j668
54564A11720o36K85M34Qk02K14P84Q51N40M11M31or45j571j311n56R2O46J324
54545A12513J887J922J418O21k03n91lJ332K244J956J094O92O98L18n61j246j391
$$ y = [105072, 104797, 105383, 106047, 105989, 105299, 104741, 104909, 105727, 106650, 107186, 107243, 107015, 106567, 105669, 104207, 102691, 101990, 102462, 103622, 104811, 105904, 107093, 108273, 109134, 109736, 110444, 111223, 111494, 110967, 110178, 109804, 109732, 109282, 108232, 107140, 106652, 106799, 107163, 107487, 107968, 108962, 110453, 111875, 112569, 112429, 111887, 111206, 110150, 108567, 106911, 105750, 105063, 104568, 104557, 105690, 107903, 110220, 111855, 112947, 113943, 114834, 115436, 115939, 116575, 117021, 116681, 115464, 113786, 111899, 109730, 107507, 106057, 106117, 107463, 109010, 109788, 109729, 109416, 109228, 108979, 108465, 107983, 107957, 108253, 108434, 108637, 109537, 111210, 112624, 112771, 111900, 111139, 111133, 111569, 111874, 111864, 111722, 111806, 112531, 113991, 115554, 116159, 115257, 113388, 111720, 111084, 111369, 111803, 111811, 111609, 111823, 112607, 113458, 113998, 114409, 114840, 114834, 113889, 112318, 111007, 110451, 110543, 111189, 112513, 114400, 116322, 117740, 118361, 118158, 117567, 117564, 118896, 121140, 123096, 124190, 124882, 125580, 125898, 125337, 124091, 122700]
54528A22700j314j172p35r2K36R8p4q8k89q13j164r75o02n19n89l68J64N87N90
54509A15581K23k11l74j21L28O66R01J201J369R61P8n45m86k01k35l26J53J107
54491A20069J628J077j49j032r43j99L31J82k52k69K11O29O04L12K6k43m29k46
54473A21307L44R06J100J112J193J181R20P41R28J075O07k74q48r62j133j509
54457A26688j460m94R00J714J423L21q49j433j222n71k9J79K14K52K96K96J73
54440A26398k07q18j244j071m21K22P04J180J488J208M39r9o8M6j47k17K91R30
54422A28614R24L22j83l78o02q80p72k34J79J66O0P7j68r11j562j345k91Q65J567
54403A25448J759J590J295J241J572J831J416M75r0L50J389J985J454Nj451k006
$$ y = [122700, 121386, 120214, 119479, 119387, 119623, 119721, 119647, 119559, 119270, 118457, 117293, 116318, 115716, 115197, 114608, 114240, 114404, 114991, 115581, 115804, 115593, 115219, 115098, 115426, 116092, 116993, 118194, 119563, 120524, 120602, 120057, 119571, 119370, 119135, 118809, 118962, 120069, 121697, 122774, 122625, 121593, 120650, 120451, 120782, 120964, 120712, 120443, 120654, 121283, 121887, 122199, 122225, 121982, 121553, 121307, 121651, 122557, 123657, 124769, 125962, 127143, 128063, 128804, 129732, 130807, 131414, 131140, 130292, 129330, 128197, 126688, 125228, 124734, 125634, 127348, 128771, 129092, 128243, 126810, 125588, 125017, 124988, 125167, 125381, 125633, 125929, 126225, 126398, 126191, 125373, 124129, 123058, 122637, 122859, 123563, 124743, 126231, 127439, 127878, 127779, 127711, 127757, 127610, 127393, 127684, 128614, 129538, 129860, 129677, 129299, 128697, 127817, 127045, 126811, 126990, 127156, 127216, 127293, 127125, 126214, 124652, 123307, 123016, 123881, 125448, 127207, 128797, 130092, 131333, 132905, 134736, 136152, 136627, 136537, 136887, 138276, 140261, 141715, 141720, 140269, 138263]
54387A38263j502o36j42N7N11J215J472R38K05p3q7l82q23p52J0R61J664K084
54369A42983K168J784J202J011J275J266M68o47j138n86P25K199L106K952K118
54354A60886J715K271K902K442J012k91r47j360j800j977j843j838k092k186k006
54339A54888k040k388k310j376l72k95r61j410j362j412j958k593k662j898n20
54324A31331Q82J611J469R80P14O01K73j88l64j57J79M79O43M05k84q62q13m48
54306A36451l54l39J54P52M67o09j129m10N33N23k35p97q99p78l29N50J177P20
54288A35448n07j271r91l07m1j84j67L48J132J593J280L80l41l48Q9L50K55Nl18
54269A36405o88p20k1J075J675J409Q34O54R42J294J386J141O43J19j83j56R1
$$ y = [138263, 136761, 136125, 135983, 136040, 136551, 137766, 139238, 140176, 140381, 140308, 140221, 139839, 139016, 138264, 138274, 139235, 140899, 142983, 145151, 146935, 148137, 149148, 150423, 151689, 152157, 151510, 150372, 149786, 150511, 152710, 155816, 158768, 160886, 162601, 164872, 167774, 170216, 171228, 170937, 169990, 168630, 166830, 164853, 163010, 161172, 159080, 156894, 154888, 152848, 150460, 148150, 146774, 146402, 146107, 145146, 143736, 142374, 140962, 139004, 136411, 133749, 131851, 131331, 132213, 133824, 135293, 136273, 136987, 137588, 137861, 137673, 137309, 137152, 137331, 137810, 138453, 138858, 138574, 137712, 136899, 136451, 136097, 135758, 135912, 136664, 137131, 136522, 135393, 134983, 135516, 136039, 135804, 135007, 134108, 133330, 133001, 133551, 134728, 135448, 134941, 133670, 132679, 132372, 132331, 132147, 131980, 132328, 133460, 135053, 136333, 136713, 136372, 136024, 136113, 136463, 136718, 136723, 136405, 135717, 134997, 134976, 136051, 137726, 139135, 139969, 140623, 141565, 142859, 144245, 145386, 146029, 146148, 145965, 145809, 145900]
54252A45900L42L19j89r94j460j102j74O29R17P25J66n32p93j75Q36J174M81m60
54234A45610p78m93k04k26m38n70l93J02N29M13q2k14L15Q55P26J97kJ94K11j39
54214A45613l46j6N42P22K92n41j408j863j542n34M23N31j60o69j45J072J764
54197A43735J249J52m85m62l80n82p86p46o17m27J30R56J189K40j138j523m78
54180A40027R50J453O92o34j536j410l68Q54J507J413Q87K29m33q85q43l11L78
54163A41970R14J154R27J51p73j151p89k11J20L68P56R34M77k87n84k55J18J34
54145A43973O0J65K49J17O1M06Q91R68N79J52m4q7n8O8J01k31p48q55l35L07N87
54124A46326O96J053J490J489J038P16P85P82K61m19m78K62J130J426J179R17
$$ y = [145900, 146242, 146561, 146372, 145378, 143918, 142816, 142642, 143271, 144188, 144913, 145079, 144547, 143754, 143579, 144415, 145589, 146070, 145610, 144832, 144339, 144135, 143909, 143471, 142901, 142508, 142610, 143139, 143552, 143470, 143256, 143571, 144426, 145152, 145349, 145347, 145541, 145752, 145613, 145267, 145251, 145793, 146515, 146807, 146266, 144858, 142995, 141453, 140919, 141342, 141873, 141713, 141044, 140899, 141971, 143735, 144984, 145136, 144651, 144189, 143809, 143227, 142441, 141695, 141078, 140651, 140781, 141737, 142926, 143166, 142028, 140505, 140027, 140977, 142430, 143122, 142488, 140952, 139542, 139174, 140028, 141535, 142948, 143835, 144064, 143631, 142746, 141903, 141592, 141970, 142884, 144038, 144965, 145116, 144343, 143192, 142403, 142192, 142312, 142680, 143436, 144370, 144847, 144560, 143976, 143721, 143839, 143973, 144033, 144198, 144447, 144564, 144625, 145031, 145922, 146890, 147469, 147621, 147577, 147490, 147432, 147500, 147601, 147370, 146622, 145767, 145432, 145739, 146326, 147022, 148075, 149565, 151054, 152092, 152808, 153593, 154375, 154636, 154217, 153739, 154001, 155131, 156557, 157736, 158653]
54108A58653Q69P31K59k12j58L77P35M86m8k41P5N37P78P62O94P79J037J214J032
54089A68359O43O28J298K184K597K550K708L441M302M612M220L532K914K289J243
54074B07520m50k397l773m105l672l015k307j479p56m95n98o12m17l37n03o41
54058A81963n66l70L2R38K167K869K476J480Q22Q74J370K010K616K964K930K718
54042B07293K567K460K382K640L408M272M738M954N367N818N682M889M129L871
54028B64470L812L535L116K729K178J232J10q03j490k164k830l301l497l401k937
54013B60759k258j978k532l415l661l149k869l532m481m527l554k592k420k695
53999B17096k687k247j723j336j086j039j246j451j275o92n7L46M87L83Mn50j040
$$ y = [158653, 159522, 160253, 160512, 160300, 160142, 160519, 161254, 161740, 161692, 161451, 161526, 162063, 162841, 163603, 164297, 165076, 166113, 167327, 168359, 169002, 169630, 170928, 173112, 175709, 178259, 180967, 184408, 188710, 193322, 197542, 201074, 203988, 206277, 207520, 207070, 204673, 200900, 196795, 193123, 190108, 187801, 186322, 185566, 185071, 184473, 183861, 183444, 183107, 182604, 181963, 181397, 181027, 181059, 181997, 184164, 187033, 189509, 190989, 191811, 192685, 194055, 196065, 198681, 201645, 204575, 207293, 209860, 212320, 214702, 217342, 220750, 225022, 229760, 234714, 240081, 245899, 251581, 256470, 260599, 264470, 268282, 271817, 274933, 277662, 279840, 281072, 281182, 280379, 278889, 276725, 273895, 270594, 267097, 263696, 260759, 258501, 256523, 253991, 250576, 246915, 243766, 240897, 237365, 232884, 228357, 224803, 222211, 219791, 217096, 214409, 212162, 210439, 209103, 208017, 206978, 205732, 204281, 203006, 202314, 202257, 202603, 203090, 203473, 203477, 202927, 201887]
53982B01887j272j174p75l14k55q00j428j408p48j70q2r3K19O68R56J278J850
53965A98339K223J745N99k42j73M37R35J186J429J657J639J446J585K346L264
53950B18415L556L084K607K931M080N482O690P540P898P797P732Q190Q894R021
53936C03917Q269P059N583L418M92k238l733l999l754l388k803j990j112k12O30
53921C06139J072R67P83J030J607K219L081M406N494N268L814K445K108K469K730
53906C45632K549J820L55j587l052l277k599j999j998k348k656k857l142l686
53892C21155m480n253n635n504n130m927n096n530n823n506m419k941j749j339
53878B57823j854l068m266m510l525k181j566j677j659j174p88r27j285j554j911
$$ y = [201887, 200615, 199441, 198666, 198352, 198097, 197297, 195869, 194461, 193713, 193543, 193461, 193368, 193587, 194255, 195211, 196489, 198339, 200562, 202307, 202906, 202664, 202491, 202928, 203863, 205049, 206478, 208135, 209774, 211220, 212805, 215151, 218415, 221971, 225055, 227662, 230593, 234673, 240155, 246845, 254385, 262283, 270080, 277812, 286002, 294896, 303917, 312186, 319245, 324828, 328246, 328738, 326500, 322767, 318768, 315014, 311626, 308823, 306833, 305721, 305509, 306139, 307211, 308178, 308961, 309991, 311598, 313817, 316898, 321304, 326798, 332066, 335880, 338325, 340433, 342902, 345632, 348181, 350001, 350356, 348769, 345717, 342440, 339841, 337842, 335844, 333496, 330840, 327983, 324841, 321155, 316675, 311422, 305787, 300283, 295153, 290226, 285130, 279600, 273777, 268271, 263852, 260911, 259162, 257823, 255969, 252901, 248635, 244125, 240600, 238419, 236853, 235176, 233517, 232343, 231555, 230628, 229343, 227789, 225878]
53863B25878k389k449j817j148j240j955k529k604k342j798r12k1L25R4j92k29
53847B04672k60n29q63r64p61l13L09Q51Q91K93m40n96m6N82O03L5m51l63R8M05
53827B03153M00L54M65O81R64J324J478J004R3k51P26K432L382K792J347L59M53
53810B21156J207J842J994J871J876K192K678L087L269L233L073K840K443J831
53796B54592J265J245J929K801L147K784K072J326N97k2l32l47l49n58j022j754
53780B67374k659l299l302k990l041l502l720l452l254l438l463k918k431k743
53766B23162l421l417k626j908j656j338o29m9j04m56m70j49k9l91r96j455j575
53749B02493j406j155j000q90o82m64m96p18o50j0P51R35N20K27N94J258J462
$$ y = [225878, 223489, 221040, 219223, 218075, 216835, 214880, 212351, 209747, 207405, 205607, 204695, 204674, 204999, 205093, 204901, 204672, 204412, 203883, 203020, 202056, 201295, 200982, 201291, 202142, 203033, 203326, 202886, 202290, 202244, 202826, 203429, 203464, 203013, 202650, 202748, 203153, 203553, 203907, 204372, 205053, 206017, 207341, 208819, 209823, 209916, 209665, 210391, 212823, 216205, 218997, 220344, 220703, 221156, 222363, 224205, 226199, 228070, 229946, 232138, 234816, 237903, 241172, 244405, 247478, 250318, 252761, 254592, 255857, 257102, 259031, 261832, 264979, 267763, 269835, 271161, 271758, 271736, 271404, 271057, 270708, 270150, 269128, 267374, 264715, 261416, 258114, 255124, 252083, 248581, 244861, 241409, 238155, 234717, 231254, 228336, 225905, 223162, 219741, 216324, 213698, 211790, 210134, 208796, 208167, 208118, 208014, 207558, 207088, 206939, 206910, 206519, 205523, 204068, 202493, 201087, 199932, 198932, 198042, 197360, 196896, 196400, 195682, 195032, 195022, 195773, 196708, 197228, 197455, 198049, 199307, 200769]
53732B00769J070P42J042J677J905J485R19P79J088J489J691J631J377J129J108
53717B19901J308J461J381J161R41O86L98L54Q49J727K438K556K133J639J548
53702B40481J960K506K759K738K745K810K623K146J818J852J841J438J035J178
53688B69930J629J599Q18k19r99j444j572j347r21o08m37j56K06K55j09m25l52
53671B65848j95m14q64r55l97M23Q54M96m60j318j410p69j10J2j77j11L13P23
53653B61489R38J170J485J543J090M64K54N84J042J264J295J313J341J322J293
53638B77887J278J186J003R14J041J230J346J607K233K889K955K387J893K018
53624C01867K509K781K704K574K556K549K547K768L378M232M942N180M978M658
$$ y = [200769, 201839, 202581, 203623, 205300, 207205, 208690, 209609, 210388, 211476, 212965, 214656, 216287, 217664, 218793, 219901, 221209, 222670, 224051, 225212, 226153, 226839, 227237, 227591, 228440, 230167, 232605, 235161, 237294, 238933, 240481, 242441, 244947, 247706, 250444, 253189, 255999, 258622, 260768, 262586, 264438, 266279, 267717, 268752, 269930, 271559, 273158, 273976, 273757, 272758, 271314, 269742, 268395, 267474, 266866, 266429, 266273, 266479, 266734, 266625, 266200, 265848, 265653, 265239, 264375, 263420, 263023, 263446, 264300, 264796, 264336, 263018, 261608, 260839, 260729, 260741, 260564, 260453, 260766, 261489, 262427, 263597, 265082, 266625, 267715, 268179, 268433, 269017, 270059, 271323, 272618, 273931, 275272, 276594, 277887, 279165, 280351, 281354, 282268, 283309, 284539, 285885, 287492, 289725, 292614, 295569, 297956, 299849, 301867, 304376, 307157, 309861, 312435, 314991, 317540, 320087, 322855, 326233, 330465, 335407, 340587, 345565, 350223]
53610C50223M384L883K924J921J586J939K210J867J195N92o3p98r79q0J239J669
53594C73712Q62k06n83m60o37j311j801j489o74k82o65j033m62P26J189K78j163
53577C66001j960j882j359o32J55N91N05M19Q11J283J211Q02O32N45np17o99R5
53559C65796P40P87P73J115J503J743K198K959L385L026K311J871J800J919K143
53544C94069K246J928J483J737K863L961M302M259M484M865M999N120N722O658
53530D48696P315P441P269P160P543Q743J0371J1384J1308J0959J1268J1950J2138
53517E73545J1816J1748J2245J2937J3619J4417J5201J5689J6078J6797J7688
53506G31780J8210J8451J8976J9636J9488J8223J6777J6043J5740J5138J4212
$$ y = [350223, 354607, 358490, 361414, 363335, 364921, 366860, 369070, 370937, 372132, 372724, 372661, 371863, 370884, 370804, 372043, 373712, 374574, 374368, 373785, 373325, 372688, 371377, 369576, 368087, 367413, 367131, 366466, 365433, 364971, 365697, 366886, 367164, 366001, 364041, 362159, 360800, 360168, 360323, 360914, 361419, 361838, 362649, 363932, 365143, 365945, 366577, 367122, 367117, 366400, 365701, 365796, 366536, 367323, 368096, 369211, 370714, 372457, 374655, 377614, 380999, 384025, 386336, 388207, 390007, 391926, 394069, 396315, 398243, 399726, 401463, 404326, 408287, 412589, 416848, 421332, 426197, 431196, 436316, 442038, 448696, 456011, 463452, 470721, 477881, 485424, 494167, 504538, 515922, 527230, 538189, 549457, 561407, 573545, 585361, 597109, 609354, 622291, 635910, 650327, 665528, 681217, 697295, 714092, 731780, 749990, 768441, 787417, 807053, 826541, 844764, 861541, 877584, 893324, 908462, 922674]
53495I22674J3461J2993J2544J2134J2111J2534J3072J3460J3725J3891J3817
53484A066416J3425J2882J2404J2035J1636J1039J0181R192Q362P874P476O585
53472A189507M890K825J172J46q27k217l690m637n193o047p318q262q369q104
53458A143876q256r014j0047j0982j1442j1049j0005r267r601j0622j1277j1017
53446A021297j0097r036q285q188q586q659p761o198m636l039j054Q47J611J119
53432I49335N30Q89K177L921N810P347P797P157O568P154Q835J0716J2136J2899
53418A043271J3090J3255J4226J6100J7792J8300J8045J8252J9337K0722K2004
53407A234394K3346K4719K5724K6385K7285K8590K9639K9960L0118L0999L2643
$$ y = [922674, 936135, 949128, 961672, 973806, 985917, 998451, 1011523, 1024983, 1038708, 1052599, 1066416, 1079841, 1092723, 1105127, 1117162, 1128798, 1139837, 1150018, 1159210, 1167572, 1175446, 1182922, 1189507, 1194397, 1197222, 1198394, 1198540, 1197713, 1195496, 1191806, 1187169, 1181976, 1175929, 1168611, 1160349, 1151980, 1143876, 1135620, 1126606, 1116559, 1105577, 1094135, 1083086, 1073081, 1063814, 1054213, 1043591, 1032314, 1021297, 1011200, 1002164, 993879, 985691, 977105, 968446, 960685, 954487, 949851, 946812, 945758, 946605, 948216, 949335, 949865, 950754, 952931, 956852, 962662, 970009, 977806, 984963, 991531, 998685, 1007520, 1018236, 1030372, 1043271, 1056361, 1069616, 1083842, 1099942, 1117734, 1136034, 1154079, 1172331, 1191668, 1212390, 1234394, 1257740, 1282459, 1308183, 1334568, 1361853, 1390443, 1420082, 1450042, 1480160, 1511159, 1543802]
53396A543802L4276L5277L5663L5817L6083L6577L7076L7176L6778L6191L5648
53385A940364L4861L3435L1462K9359K7282K5129K3054K1392K0013J8224J5533
53374B220108J2169Q671N303K038j167m424p935j1664j5234j8427k1587k5062
53362B142789k8439l0855l2051l2669l3391l4238l4826l4971l4674l3878l2564
53351A780233l1048k9891k9433k9431k9182k8184k6783k5995k6391k7234k7142
53340A469519k5654k3679k2265k1405k0374j8810j7000j5291j3714j2193j0831
53329A268303r894r565r694r820r699r774j0676j2086j2626j1320q835o760n918
53316A141636n840n731n303m679m015l394k735j792n21O38J248J584K368L768
$$ y = [1543802, 1578078, 1613355, 1649018, 1684835, 1720918, 1757495, 1794571, 1831747, 1868525, 1904716, 1940364, 1975225, 2008660, 2040122, 2069481, 2096763, 2121892, 2144946, 2166338, 2186351, 2204575, 2220108, 2232277, 2240948, 2246251, 2248289, 2247122, 2242698, 2234763, 2223099, 2207865, 2189438, 2167851, 2142789, 2114350, 2083495, 2051444, 2018775, 1985384, 1951146, 1916320, 1881349, 1846675, 1812797, 1780233, 1749185, 1719294, 1689861, 1660430, 1631248, 1603064, 1576281, 1550286, 1523895, 1496661, 1469519, 1443865, 1420186, 1397921, 1376516, 1356142, 1337332, 1320332, 1305041, 1291327, 1279134, 1268303, 1258409, 1248844, 1239150, 1229330, 1219631, 1209857, 1199181, 1187095, 1174469, 1163149, 1154314, 1147554, 1141636, 1135796, 1130065, 1124762, 1120083, 1116068, 1112674, 1109939, 1108147, 1107626, 1108264, 1109512, 1111096, 1113464, 1117232]
53302A117232N168O014O415O745P160P826R089J0963J2747J3648J3717J3773J4403
53289A244900J5281J5625J5046J3929J2981J2443J1831J0507Q478O455N087M297
53277A376860L447K014k0k320m558o654q686j0640j2306j3472j4141j4491j4746
53264A280287j5255j6414j8249k0084k1038k0926k0473k0491k1094k1725k1809
53253A062729k1165k0109j9224j8949j9161j9226j8624j7507j6600j6498j7091
53242H58575j7633j7485j6740j6041j5740j5485j4776j3697j2742j2094j1424
53231F94718j0455r418q794q806r176r320q850q047p719q365r552j0382j0463
53218E75371j0157r960j0038j0298j0571j0669j0523j0250r881r210q234p450
$$ y = [1117232, 1122400, 1128414, 1134829, 1141574, 1148734, 1156560, 1165649, 1176612, 1189359, 1203007, 1216724, 1230497, 1244900, 1260181, 1275806, 1290852, 1304781, 1317762, 1330205, 1342036, 1352543, 1361021, 1367476, 1372563, 1376860, 1380307, 1382321, 1382301, 1379981, 1375423, 1368769, 1360083, 1349443, 1337137, 1323665, 1309524, 1295033, 1280287, 1265032, 1248618, 1230369, 1210285, 1189247, 1168321, 1147848, 1127357, 1106263, 1084538, 1062729, 1041564, 1021455, 1002231, 983282, 964121, 944895, 926271, 908764, 892164, 875666, 858575, 840942, 823457, 806717, 790676, 774936, 759451, 744675, 730978, 718236, 706142, 694718, 684263, 674845, 666051, 657245, 648069, 638749, 629899, 621852, 614133, 605768, 596216, 585834, 575371, 565214, 555254, 545216, 534918, 524347, 513678, 503155, 492905, 483024, 473814, 465580, 458130]
53206D58130p216p062o341n412n242n890o376o275o338p023p433o685n480n224
53192C70133n992o522o072n143m391l805l263l015l159l263k991k588k356k143
53178C15430j747j505j858k581k978k799k434k273k261k220k183k167k036j801
53164B84587j819k281k717k507j821j492j827k102j589o45k00m59p70o94n12n38
53148B62614n95m97n63j167j977k197j450j99P44R39O16L63M82O51L78k23n11
53131B57408k41j2m16j183j561j409j262j390j343o34N04J369J527J090M16j16
53115B52747j08O22J644K045J300m0r31j074j119j547j926j661j032p79r66j005
53099B46170p90r00j543k017j674q65l80m18n14k49L51R00R11K69l97k37O49J107
$$ y = [458130, 450914, 443852, 437511, 432099, 426857, 420967, 414591, 408316, 401978, 394955, 387522, 380837, 375357, 370133, 364141, 357619, 351547, 346404, 342013, 338208, 334945, 331930, 328771, 325508, 322517, 319929, 317573, 315430, 313683, 312178, 310320, 307739, 304761, 301962, 299528, 297255, 294994, 292774, 290591, 288424, 286388, 284587, 282768, 280487, 277770, 275263, 273442, 271950, 270123, 268021, 266432, 265787, 265587, 265128, 264358, 263664, 263152, 262614, 262019, 261522, 260959, 259792, 257815, 255618, 254168, 253969, 254713, 255652, 256268, 256631, 257113, 257764, 258142, 257919, 257408, 257167, 257155, 256739, 255556, 253995, 252586, 251324, 249934, 248591, 247957, 248461, 249830, 251357, 252447, 252863, 252747, 252639, 253261, 254905, 256950, 258250, 258210, 257279, 256205, 255086, 253539, 251613, 249952, 248920, 248141, 247175, 246170, 245380, 244480, 242937, 240920, 239246, 238381, 238001, 237583, 237069, 236820, 237171, 238071, 238982, 239251, 238854, 238617, 239266, 240373]
53081B40373M28o33r12m06n4k59n24m63l35m38o06o10n33n49n98m94j43L60O68
53062B34272L57n30j268j189n49j82l76o34n37k66q9R6L81N15K47k25m86m09j68
53043B28960L6J06Ok17m75p04q71q67o05j93J19K14J16j62n22o63l38K63O79P03
53023B25585M85J88j00j77O3L07J75q1J97J026J548J116Q6p70j177j240r19j52
53005B26160P40J288J432J417J333J118Q46N89J08p98j680j721p65L55P54M49
52989B31625J31K59O81J015J058Q53N93N26O82P03K04n97q95j81J046J835J917
52972B41455J821J916J861J255L39l15m91l38J0L80L74k12q95r59m07K4j98r03
52954B44717j651k177k290j842j008k77P3J71J75L0k39l77k29L6J94J57j18n59
$$ y = [240373, 240801, 240168, 239256, 238850, 238796, 238537, 238013, 237550, 237215, 236777, 236171, 235561, 235028, 234479, 233881, 233387, 233244, 233604, 234272, 234629, 234099, 232831, 231642, 231093, 230911, 230535, 229901, 229364, 229098, 229009, 229105, 229486, 230001, 230248, 230023, 229537, 229128, 228960, 228996, 229102, 229108, 228891, 228416, 227712, 226841, 225974, 225369, 225176, 225295, 225509, 225625, 225463, 224941, 224278, 223940, 224203, 224882, 225585, 226070, 226258, 226158, 225981, 226044, 226351, 226526, 226445, 226642, 227668, 229216, 230332, 230418, 229648, 228471, 227231, 226312, 226160, 226900, 228188, 229620, 231037, 232370, 233488, 234334, 234923, 235031, 234233, 232553, 230832, 230067, 230422, 231176, 231625, 231756, 232015, 232696, 233711, 234769, 235622, 236215, 236741, 237423, 238126, 238330, 237733, 236838, 236657, 237703, 239538, 241455, 243276, 245192, 247053, 248308, 248647, 248332, 247841, 247503, 247513, 247893, 248267, 248055, 247160, 246201, 245794, 245818, 245620, 244717, 243066, 240889, 238599, 236757, 235749, 235472, 235545, 235716, 235891, 235921, 235682, 235305, 235076, 235112, 235306, 235463, 235345, 234786]
52936B34786q21n81j09n2n41r82r80q10p81p01l58J1J85L67O20M72l03r90q26
52917B27606j66J02J2M06J379J926J363L21j89k9K00R7k30n61p77q43q18p95p63
52898B28241o17m37m39o05n78j36M97R91J304J582J850K018K020J753J011k18
52882B38237j514k233k002j005J01N36%r20j173l05R83J627J356P72M83N13O17
52865B36073O88O81N01K28K28P20J360J581J260O85p8j267k712l483k850j372
52849B32243m47p25j414j426q07n53j186k010j997j069k68n47j624k176j272N51
52833B15273J838J766Q43J15k6jk74p72j039p48j05K88l4q10j258r69l52l0j5
52814B13690J60P30J487K236K923L311L023K087J079M86J68k69q93j435j704j713
$$ y = [234786, 233965, 233384, 233275, 233223, 232682, 231700, 230720, 229910, 229129, 228428, 228070, 228081, 228266, 228633, 229253, 229725, 229422, 228432, 227606, 227440, 227542, 227554, 227960, 229339, 231265, 232628, 232949, 232760, 232731, 232931, 233028, 232798, 232237, 231460, 230617, 229799, 229004, 228241, 227624, 227187, 226748, 226143, 225565, 225429, 225926, 226917, 228221, 229803, 231653, 233671, 235691, 237444, 238455, 238237, 236723, 234490, 232488, 231483, 231584, 232120, 232120, 231200, 230027, 229722, 230705, 232332, 233688, 234460, 234943, 235456, 236073, 236761, 237442, 237943, 238171, 238399, 239119, 240479, 242060, 243320, 244005, 243927, 242660, 239948, 236465, 233615, 232243, 231796, 231071, 229657, 228231, 227424, 226871, 225685, 223675, 221678, 220609, 220341, 219794, 218170, 215994, 214722, 215273, 217111, 218877, 219720, 219835, 219809, 219808, 219534, 218762, 217723, 216975, 216870, 217158, 217124, 216314, 215056, 214087, 213735, 213705, 213690, 213850, 214580, 216067, 218303, 221226, 224537, 227560, 229647, 230726, 231212, 231380, 231111, 230218, 228783, 227079, 225366]
52798B25366j557j354j265j248r34m7J104J782J575P82j5n01o58n24j80M9k42
52781B22133j043j760j723q73J72P26N98J02l22m04j32K83N20L91j3m16o31o62
52763B16946o13n35m07k10PJ10Rk13l36k34j3J08N1l3J33P25J546K093K004J536
52743B22674J298J495J686J466J023P60O75N00K40P9q1m32o87l17N53J132J021
52726B33085P01O48O21L40J94N68Q79K00j287k334k178j261l22M32Q95O62l18
52709B31525j247j269n57M7J77J16O6j13l96m73k40L1J53J76k4p02j602j867j035
52690B22766K63R86Q40L68P4o5k95n80n40K00J465K336J880L04j028j032o9P34
52672B28607Q92P41M77p9p63r04k03P79J299J197P34J42l48l61K54J124J736K012
$$ y = [225366, 223809, 222455, 221190, 219942, 219008, 218961, 220065, 221847, 223422, 224204, 224189, 223688, 223030, 222506, 222326, 222375, 222133, 221090, 219330, 217607, 216734, 216906, 217632, 218230, 218332, 218010, 217606, 217474, 217757, 218277, 218668, 218655, 218239, 217608, 216946, 216333, 215798, 215391, 215181, 215188, 215298, 215307, 215094, 214758, 214524, 214511, 214619, 214670, 214637, 214770, 215495, 217041, 219134, 221138, 222674, 223972, 225467, 227153, 228619, 229642, 230402, 231077, 231577, 231817, 231896, 231815, 231383, 230696, 230379, 230932, 232064, 233085, 233786, 234434, 235055, 235395, 235589, 236157, 237036, 237236, 235949, 233615, 231437, 230176, 229854, 230286, 231181, 231843, 231525, 230278, 229009, 228452, 228499, 228676, 228792, 228858, 228745, 228349, 227876, 227636, 227667, 227820, 227996, 227972, 227270, 225668, 223801, 222766, 223029, 224015, 224855, 225223, 225297, 225232, 224937, 224357, 223817, 224017, 225482, 227818, 229698, 230002, 228974, 227942, 227873, 228607, 229499, 230240, 230717, 230638, 229875, 228971, 228768, 229547, 230846, 232043, 232777, 232919, 232571, 232210, 232464, 233588, 235324, 237336]
52654B37336K265K650K903K577J515J17q80j056p21m54m21m42n99j112j679j623
52638B40376q56n5L86Q23J452J767J498J319J812K368K117J431J396K058K358
52623B60250J787R71L75m05j660k768l055k701k292j917j334o34j50Oq7m13q84
52606B45089j149r42m10R0L65L39km14m56p5K59J83o7j01L7J62L51O50O80J60
52586B44749m66m64K65J160J747J886J494O41j58l50j14r6m13n27k27j6k78o19
52568B48214m63J65Q10J176J125N26m76j299j451j065n81r4M98R74R22L62k55
52551B49088o33q25p92k89O43J435J533R24j2q70j320j130m08L62Q23J065J286
52534B50880J307Q16o6q27j131j015n93P6P35R82P39L95K87L44M11O33J131J516
$$ y = [237336, 239601, 242251, 245154, 247731, 249246, 249363, 248483, 247427, 246706, 246252, 245831, 245389, 244790, 243678, 241999, 240376, 239520, 239465, 239851, 240674, 242126, 243893, 245391, 246710, 248522, 250890, 253007, 254438, 255834, 257892, 260250, 262037, 263008, 263383, 262978, 261318, 258550, 255495, 252794, 250502, 248585, 247251, 246617, 246467, 246473, 246386, 245973, 245089, 243940, 242998, 242588, 242678, 243043, 243382, 243380, 242966, 242510, 242435, 242694, 242877, 242810, 242709, 242746, 242908, 243259, 243909, 244589, 244749, 244283, 243819, 244084, 245244, 246991, 248877, 250371, 251012, 250854, 250504, 250390, 250294, 249881, 249354, 249127, 249111, 248833, 248214, 247751, 247916, 248726, 249902, 251027, 251553, 251077, 249778, 248327, 247262, 246681, 246587, 247085, 248059, 248981, 249343, 249088, 248455, 247630, 246838, 246549, 247192, 248627, 250160, 251084, 251072, 250202, 248882, 247752, 247344, 247706, 248529, 249594, 250880, 252187, 253003, 252937, 252110, 250979, 249964, 249371, 249447, 250182, 251164, 251903, 252298, 252585, 252929, 253340, 253973, 255104, 256620]
52516B56620J201K08o78p08O2R58J503J779K016K074J651R32O03Q78R01l01k310
52499B67389l485k878j370m75n70r17r98j026j155j103o50J0O83J296J483P01
52483B56935q28j838j345R0J028Q45K03j22j50k33k47K06R63J273P71J39L39J339
52465B59368K033J640O91L05P64J434J815J994K010J520M00q54j765k369k710
52450B66276k436j452n39n38j108j148l55L84L15k22m82l56k30k30j57RJ4k41
52432B57504n27o18n81n89o32n20j43L83R00J367J718J699J141M07J78O09J075
52415B63371J055R53J525K669L485L534L435L944M974N890O370O471O035M676
52401C18387K449J29j465k270k862l577l999l534k334j290j003j104r24m84l70
$$ y = [256620, 257821, 258029, 257351, 256643, 256705, 257663, 259166, 260945, 262961, 265035, 266686, 267618, 268221, 269099, 270000, 269699, 267389, 263904, 261026, 259656, 259181, 258611, 257694, 256696, 255670, 254515, 253412, 252762, 252772, 253455, 254751, 256234, 256935, 256107, 254269, 252924, 253014, 254042, 254887, 255090, 254968, 254818, 254585, 254338, 254544, 255507, 256780, 257551, 257690, 258029, 259368, 261401, 263041, 263732, 264037, 264801, 266235, 268050, 270044, 272054, 273574, 273974, 273120, 271355, 268986, 266276, 263840, 262388, 261849, 261311, 260203, 259055, 258700, 259084, 259399, 259177, 258695, 258339, 258109, 257879, 257722, 257731, 257745, 257504, 256977, 256359, 255778, 255189, 254557, 254037, 253894, 254277, 255177, 256544, 258262, 259961, 261102, 261509, 261687, 262296, 263371, 264426, 265379, 266904, 269573, 273058, 276592, 280027, 283971, 288945, 294835, 301205, 307676, 313711, 318387, 320836, 320965, 319500, 317230, 314368, 310791, 306792, 303258, 300924, 299634, 298631, 297527, 296603, 296119, 295749]
52386B95749o96q51l98L22P58Q94J045J303J540J798K183K547K642K562K626K837
52370C16861K826K408J890J754K194L030L832M136L728K812J746P09k19p37n13
52355C46457L11J147J652K014K414K597K313J931K134L091M229M878M893M610
52341C84671M473M708N209N619N672N493N547O247P598R170J0359J0843J0878
52328D76487J1077J1715J2488J3089J3728J4725J5800J6355J6323J6192J6097
52317F34076J5632J4793J4337J4674J5029J4433J3184J2403J2341J2103J1122
52306G84127J0046R662R726R426Q572P640O917O212N381M577L912L167K092P18
52292H72175o71j823k639l199l640m051m363m388l958l093k078j241n59M37K016
$$ y = [295749, 295053, 294202, 293804, 294126, 294884, 295778, 296823, 298126, 299666, 301464, 303647, 306194, 308836, 311398, 314024, 316861, 319687, 322095, 323985, 325739, 327933, 330963, 334795, 338931, 342659, 345471, 347217, 347926, 347707, 346970, 346457, 346768, 347915, 349567, 351581, 353995, 356592, 358905, 360836, 362970, 366061, 370290, 375168, 380061, 384671, 389144, 393852, 399061, 404680, 410352, 415845, 421392, 427639, 435237, 444407, 454766, 465609, 476487, 487564, 499279, 511767, 524856, 538584, 553309, 569109, 585464, 601787, 617979, 634076, 649708, 664501, 678838, 693512, 708541, 722974, 736158, 748561, 760902, 773005, 784127, 794173, 803835, 813561, 822987, 831559, 839199, 846116, 852328, 857709, 862286, 866198, 869365, 871457, 872175, 871504, 869681, 867042, 863843, 860203, 856152, 851789, 847401, 843443, 840350, 838272, 837031, 836472, 836909, 838925]
52277H38925L712M750N041N305O080P117P952Q511Q855Q802Q369Q244R068J0453
52263I41184J1260J0879R701Q431P444O848O629O529O218N658N036M325L388K433
52249A035963J819J295Q9k053m422o215p368q189q692q759q638q687q811q604
52235I58728p967p315p131p545q178q328p541o188n155m784m498l758k903k521
52221H74916k409j808n38Q08J742K347K798L007K956K891K960L012K948K955L146
52206I01731L336L381L467L791M135M084L564K947K599K506K302J739J000N75
52192I41157P19J179J569J863K272K743K881K377J230m03k256l808m552m555m416
52177I38000m501m597m492m456m701m754l963k506j329r55q34j56J036J903J895
$$ y = [838925, 842637, 847387, 852428, 857733, 863813, 870930, 878882, 887393, 896248, 905050, 913419, 921663, 930731, 941184, 952444, 963323, 973024, 981455, 988899, 995747, 1002376, 1008905, 1015123, 1020781, 1025817, 1030142, 1033530, 1035963, 1037782, 1039077, 1039166, 1037113, 1032691, 1026476, 1019108, 1010919, 1002227, 993468, 984830, 976143, 967332, 958728, 950761, 943446, 936315, 928770, 920592, 912264, 904723, 898535, 893380, 888596, 884098, 880340, 877437, 874916, 872507, 870699, 870161, 870969, 872711, 875058, 877856, 880863, 883819, 886710, 889670, 892682, 895630, 898585, 901731, 905067, 908448, 911915, 915706, 919841, 923925, 927489, 930436, 933035, 935541, 937843, 939582, 940582, 941157, 941876, 943055, 944624, 946487, 948759, 951502, 954383, 956760, 957990, 957587, 955331, 951523, 946971, 942416, 938000, 933499, 928902, 924410, 919954, 915253, 910499, 906536, 904030, 902701, 901746, 900912, 900756, 901792, 903695, 905590]
52162I05590J467J583K586L756M070L304K226J708J887K312K568K515K087J345
52148I39004P52R00J774K610K797K622K730L118L200K885K847L503M312M642M875
52133I82571N873P617R105R753J0069J0719J1692J2776J4159J5883J7297J7841
52121A125355J8001J8682J9819K0570K0662K0620K0513J9645J7806J5900J4679
52110A332252J3686J2156J0337Q951P834O134L745J593L59l57j304k600l803m570
52096A384413m923n107n411n981o711p402q035q728r480j0133j0580j0742j0407
52083A280773r378p819o149m539k772p28J238K607L264L687M541O035P670Q747
52069A287177R183R531J0125J0553J0342R775R453R307Q713P527O341N576M923
$$ y = [905590, 907057, 908640, 911226, 914982, 919052, 922356, 924582, 926290, 928177, 930489, 933057, 935572, 937659, 939004, 939756, 940656, 942430, 945040, 947837, 950459, 953189, 956307, 959507, 962392, 965239, 968742, 973054, 977696, 982571, 988444, 996061, 1005166, 1014919, 1024988, 1035707, 1047399, 1060175, 1074334, 1090217, 1107514, 1125355, 1143356, 1162038, 1181857, 1202427, 1223089, 1243709, 1264222, 1283867, 1301673, 1317573, 1332252, 1345938, 1358094, 1368431, 1377382, 1385216, 1391350, 1395095, 1396688, 1397047, 1396690, 1395386, 1392786, 1388983, 1384413, 1379490, 1374383, 1368972, 1362991, 1356280, 1348878, 1340843, 1332115, 1322635, 1312502, 1301922, 1291180, 1280773, 1271395, 1263576, 1257427, 1252888, 1250116, 1249388, 1250626, 1253233, 1256497, 1260184, 1264725, 1270760, 1278430, 1287177, 1296360, 1305891, 1316016, 1326569, 1336911, 1346686, 1356139, 1365446, 1374159, 1381686, 1388027, 1393603, 1398526]
52056A398526L889K409P50p53j647j740j633k441m573p330r911j2263j4497j6202
52042A332584j6961j7099j7197j7237j6877j6265j5813j5370j4436j3098j2002
52031A160229j1318j0546r506q784q837r304r629r832j0230j0716j0842j0480
52019A040205j0030r931j0222j0504j0278r436q517q240q758r499r854r728r367
52006I15841q995q892r437j0704j2134j2922j2796j2211j1849j1988j2250j1931
51994G79732j0654q778p097o060n593n576o143p236q315q884r073r287r496r286
51980F68254q612p993p904q316q873r247r170q473p307o089n093m225l280k243
51966E71429j201j65Q18J541J836J855J904K068K171K037J625Q90k31j624k968
$$ y = [1398526, 1402415, 1404824, 1405574, 1404821, 1403174, 1401434, 1399801, 1397360, 1392787, 1385457, 1375546, 1363283, 1348786, 1332584, 1315623, 1298524, 1281327, 1264090, 1247213, 1230948, 1215135, 1199765, 1185329, 1172231, 1160229, 1148911, 1138365, 1128859, 1120075, 1111238, 1101934, 1092305, 1082473, 1072243, 1061527, 1050685, 1040205, 1030175, 1020244, 1010022, 999518, 989240, 979804, 971287, 963047, 954289, 944790, 934936, 925208, 915841, 906846, 897954, 888517, 877813, 865679, 852757, 839961, 827750, 815901, 803913, 791663, 779732, 769078, 760300, 753203, 747143, 741550, 735974, 729831, 722595, 714280, 705396, 696323, 687036, 677540, 668254, 659642, 651649, 643745, 635429, 626556, 617309, 608139, 599666, 592359, 586270, 581177, 576952, 573672, 571429, 570228, 570063, 570881, 572422, 574258, 576113, 578017, 580085, 582256, 584293, 585918, 586808, 586577, 584953, 581985]
51951E81985m020m796n391n713n532m698l193j114J162K931L665L576L435L729
51937E66026M352N084N942O733O806N805M399L602L464L063J858L38q68j824k705
51922F12075l030k191n51O99P77p9j304k714m340o036p574q981j0436j1829j2614
51907E41872j2228j0660q541o579m942l357j796o63j27K97J037J560P93j450m022
51892D91194n582n888n704n810o332o794o554n321l518j988j194q15l15L61Q93
51877D36633J209J619K370L320M165M722M881M516L578K240Q31l53j169j603j750
51862D65209j821k112k781l614m072l716k600j185O1Q48J046P83N38P10R63M62
51846D48719j040k739l745m115m405m575m072k996k343k767l633l759k742j215
$$ y = [581985, 577965, 573169, 567778, 562065, 556533, 551835, 548642, 547528, 548690, 551621, 555286, 558862, 562297, 566026, 570378, 575462, 581404, 588137, 594943, 600748, 605147, 608749, 612213, 615276, 617134, 617472, 616604, 614780, 612075, 609045, 606854, 606303, 607002, 607779, 607700, 606396, 603682, 599342, 593306, 585732, 576751, 566315, 554486, 541872, 529644, 518984, 510443, 503864, 498922, 495565, 493769, 493106, 492979, 493276, 494313, 495873, 496666, 495216, 491194, 485612, 479724, 474020, 468210, 461878, 455084, 448530, 443209, 439691, 437703, 436509, 435694, 435379, 435740, 436633, 437842, 439461, 441831, 445151, 449316, 454038, 458919, 463435, 467013, 469253, 470084, 469731, 468562, 466959, 465209, 463388, 461276, 458495, 454881, 450809, 447093, 444493, 443308, 443369, 444217, 445263, 446046, 446584, 447294, 448257, 448719, 447679, 444940, 441195, 437080, 432675, 428100, 424028, 421032, 418689, 415922, 412289, 408530, 405788, 404573]
51832D04573k8M72N22O41J096J445Q77o99k196k471j736j274j766k514k480j566
51816C92896m98J54L71L17Q1j91k06K28R52J505J427O68k95q66r42r11r63p78
51798C92949j39M00N6j126k187k426k187k185k443k357j655q39m87n13l76P9M45
51781C75009M14K57L81O63O96N63Q45J667K331K261J897K141L135M227M978N598
51765D07063O294O804O793O259N323M068K709J535M68q96k583m102n224o316p448
51750D20747p894p108n711m714m128l244k029j196r31n75K19R99J485K136L256
51735C91312M324M768M804M818M543L582K239J103J85p31j196o07N50R35j0j470
51719D19149k481k894k908k514j886j537j584j419p82m76j208k215k034n78P24
$$ y = [404573, 404545, 405017, 405539, 406180, 407276, 408721, 409598, 408899, 406703, 404232, 402496, 401222, 399456, 396942, 394462, 392896, 392398, 392552, 392923, 393240, 393321, 393130, 392924, 393152, 394104, 395609, 397036, 397704, 397409, 396543, 395601, 394690, 393727, 392949, 392810, 393210, 393266, 392140, 389953, 387527, 385340, 383155, 380712, 378355, 376700, 375861, 375374, 374861, 374485, 374564, 375009, 375423, 375680, 376061, 376724, 377420, 377983, 378828, 380495, 382826, 385087, 386984, 389125, 392260, 396487, 401465, 407063, 413357, 420161, 426954, 433213, 438536, 442604, 445313, 446848, 447316, 446420, 443837, 439735, 434511, 428195, 420747, 412853, 405745, 400034, 395320, 391192, 387948, 385919, 384723, 383792, 383217, 383436, 384435, 385920, 388056, 391312, 395636, 400404, 405208, 410026, 414569, 418151, 420390, 421493, 421678, 420947, 419751, 419144, 419694, 420629, 420619, 419149, 416668, 413774, 410866, 408352, 406466, 404929, 403345, 401926, 401144, 400668, 399460, 397245, 395211, 394633, 395357]
51704C95357R45Q34J451K463K632J570J96n92q45r91r06j38J212K362K685K291
51688D10526J568N90p59k255l366l821l791l460k755j663m99M16J035J416J544
51673C94726J548J766K221K377J914J431J754K722L341L098K401J651P64j64n07
51658D21043k7N86O79O19J089J922K481K847L594M470M311K506k14k743m637n898
51642D32628o385o107n624n587n964o116n545m354l045k094j599j291q82m78l34
51627C77223l32l2O60J275J387J019L71m55j192j359q39k11r8m31o68n43k55j29
51609C75391k97n59l85N85J887K552K269J782J719J817J797K269L817N676O444
51594D06764N933N193M723L860K158K95r77j874k888l707l547k213k37J782L430
$$ y = [395357, 396302, 397136, 398587, 401050, 403682, 405252, 405448, 404856, 404011, 403020, 402114, 401976, 403188, 405550, 408235, 410526, 412094, 412684, 411925, 409670, 406304, 402483, 398692, 395232, 392477, 390814, 390315, 390731, 391766, 393182, 394726, 396274, 398040, 400261, 402638, 404552, 405983, 407737, 410459, 413800, 416898, 419299, 420950, 421714, 421550, 421043, 421016, 421602, 422281, 422900, 423989, 425911, 428392, 431239, 434833, 439303, 443614, 446120, 445906, 443163, 438526, 432628, 426243, 420136, 414512, 408925, 402961, 396845, 391300, 386946, 383901, 381807, 380208, 378917, 378035, 377557, 377223, 376891, 376859, 377519, 378794, 380181, 381200, 381571, 381116, 379924, 378565, 377726, 377515, 377417, 376986, 376318, 375775, 375520, 375391, 375094, 374535, 374150, 374735, 376622, 379174, 381443, 383225, 384944, 386761, 388558, 390827, 394644, 400320, 406764, 412697, 417890, 422613, 426473, 428631, 428926, 427949, 426075, 423187, 419480, 415933, 413720, 413483, 415265, 418695]
51579D18695M406M708M809N227O023O971P970Q990R874J0578J1363J2307J2799
51566E24720J2130J0481Q910Q282Q629R736J1748J4855J8547K1687K3468K3992
51554F97185K3707K2484J9737J5460J0674O434K716j264n842j0586j5011j8895
51542G46799k1807k3153k3056k2591k2576k2625k1873k0260j8444j6746j4900
51531E18768j2788j0795r290q183p133n929m610l436k740k547k429j958j254q40
51517D44836j006j584k266k840l142l088k810k589k609k916l506m227m722m714
51503D02817m233l424k343j263q00j278k130k469k149j674j223n03L83P29K14
51488C80654n77j030j300j754k161k003j316n93j74j72p08j624k158j682p00l91
$$ y = [418695, 423101, 427809, 432618, 437845, 443868, 450839, 458809, 467799, 477673, 488251, 499614, 511921, 524720, 536850, 547331, 556241, 564523, 573152, 582888, 594636, 609491, 628038, 649725, 673193, 697185, 720892, 743376, 763113, 778573, 789247, 795681, 798397, 797133, 791291, 780705, 765694, 746799, 724992, 701839, 678783, 656192, 633616, 610991, 589118, 568858, 550414, 533668, 518768, 505980, 495185, 485895, 477712, 470579, 464650, 460040, 456604, 453864, 451317, 448888, 446930, 445676, 444836, 443830, 442246, 439980, 437140, 433998, 430910, 428100, 425511, 422902, 419986, 416480, 412253, 407531, 402817, 398584, 395160, 392817, 391554, 390754, 389476, 387346, 384877, 382728, 381054, 379831, 379328, 379711, 380440, 380654, 380077, 379047, 377747, 375993, 373832, 371829, 370513, 369920, 369746, 369574, 368866, 367242, 365084, 363402, 362702, 362311]
51472C62311j119k020k238j850j362r29n71n34q30q55j28Q30J058M87mJ39N55
51455C52940P82Q91R81Q02L84M71J568K993L652L534L593M231M898N291N962P119
51439D00092P693O484L861J455L12J00J22K69O27P56Pj673l588m902n178m456
51423D01981l159j909j205j080j135r49m75O5N13R55J519K078K324K057J422P64
51407D03766M16N44J127J910K469K440J810R40K79LMK21Q53K077L572M686N166
51390D32283N490O175P067P725Q313R529J1534J3538J4820J5780J7536K0578K4208
51377E94576K7328K9498L1081L2418L3076L2079K8929K4195J8953J3745Q429K837
51365H77144k868q458j3901j9135k3893k7768l0284l1068l0375k9282k8704k8255
$$ y = [362311, 361192, 359172, 356934, 355084, 353722, 352793, 352222, 351688, 350858, 350003, 349875, 350705, 351763, 352250, 352246, 352385, 352940, 353722, 354613, 355594, 356396, 356780, 357251, 358819, 361812, 365464, 368998, 372591, 376822, 381720, 387011, 392973, 400092, 407785, 414269, 418130, 419585, 419897, 419997, 420119, 420388, 421015, 421771, 421778, 420105, 416517, 411615, 406437, 401981, 398822, 396913, 395708, 394628, 393493, 392544, 392069, 392134, 392647, 393602, 395121, 397199, 399523, 401580, 403002, 403766, 404182, 404726, 405853, 407763, 410232, 412672, 414482, 415422, 415701, 415704, 415708, 415929, 416782, 418859, 422431, 427117, 432283, 437773, 443948, 451015, 458740, 467053, 476582, 488116, 501654, 516474, 532254, 549790, 570368, 594576, 621904, 651402, 682483, 714901, 747977, 780056, 808985, 833180, 852133, 865878, 874307, 877144, 874276, 865818, 851917, 832782, 808889, 781121, 750837, 719769, 689394, 660112, 631408, 603153]
51353F03153k6753k3941k0888j8482j6474j4449j2768j1785j0948r656q324p656
51341D21029p347o566n416m726m598m328l710l290l188k776j884j248j357j714
51327C68881j758j660j661j383m44P45J469J607J490J304J126J150J370J388J047
51312C74671R29J572K451K409J064q10k259l021l309l221k695j878j187r70j181
51297C62565j447j549j627j833j959j722j279j019r01m71L47R86J019P84R49J727
51281C54570K822L778M151L665K558J539J075R25O28J90m4kj9l33p52p68k7J194
51263C75150K002J702N95l06m80l48m66q28j227j724k296k534k180j650j510j713
51247C62187j823j678j400r45k72K55J58m99j169j462j370j033o97p08j131j511
$$ y = [603153, 576400, 552459, 531571, 513089, 496615, 482166, 469398, 457613, 446665, 437009, 428685, 421029, 413682, 407116, 401700, 396974, 392376, 388048, 384338, 381048, 377860, 375084, 373200, 371952, 370595, 368881, 367123, 365463, 363802, 362419, 361975, 362720, 364189, 365796, 367286, 368590, 369716, 370866, 372236, 373624, 374671, 375600, 377172, 379623, 382032, 383096, 382286, 380027, 377006, 373697, 370476, 367781, 365903, 364716, 363746, 362565, 361118, 359569, 357942, 356109, 354150, 352428, 351149, 350130, 349229, 348758, 349105, 350091, 351110, 351894, 352843, 354570, 357392, 361170, 365321, 368986, 371544, 373083, 374158, 375083, 375711, 375901, 375857, 375855, 375836, 375503, 374751, 373983, 373956, 375150, 377152, 378854, 379449, 379143, 378663, 378315, 377849, 377021, 375794, 374070, 371774, 369240, 367060, 365410, 363900, 362187, 360364, 358686, 357286, 356341, 356069, 356324, 356482, 355983, 354814, 353352, 351982, 350949, 350252, 349544, 348413, 346902]
51231C46902j439j179j233j409r25M69J995K640K146J113L56K26M93Q12J248K026
51215C54241K822K869K030J181J042J190R06L76K69M69L05j88k81J08K26j64k57
51198C67144M55J237J148L52k92m39m40n79p97j004j199j291j075m75L52J021
51182C64118J078M44k60j98P24J730K138K034J811J486Q59K9o30q33n44P4O53
51165C74713Q65Q10R03J235J416J201Q69P53P94Q35Q94Q01Q3j292k474k607j863
51148C77936j053n55k71l54j116k237k903k878k740k841k738k034j114m97K1R46
51132C55572K099K704K408J679J086P46N83O75J028J363J490J670K216K917L224
51117C81460L022K745K668K506J973J306R14P44M93K57M76J218J949K127J716
$$ y = [346902, 345463, 344284, 343051, 341642, 340717, 341186, 343181, 345821, 347967, 349080, 349436, 349662, 350155, 350967, 352215, 354241, 357063, 359932, 361962, 363143, 364185, 365375, 366281, 366657, 366926, 367395, 367700, 367512, 367231, 367339, 367565, 367401, 367144, 367599, 368836, 369984, 370336, 370044, 369605, 369165, 368586, 367789, 366785, 365586, 364295, 363220, 362745, 363097, 364118, 365196, 365640, 365380, 365182, 365906, 367636, 369774, 371808, 373619, 375105, 375964, 375993, 375363, 374530, 373986, 374060, 374713, 375578, 376388, 377291, 378526, 379942, 381143, 382012, 382765, 383559, 384394, 385288, 386089, 386172, 384880, 382406, 379799, 377936, 376883, 376328, 376057, 375703, 374587, 372350, 369447, 366569, 363829, 360988, 358250, 356216, 355102, 354605, 354626, 355572, 357671, 360375, 362783, 364462, 365548, 366294, 366877, 367552, 368580, 369943, 371433, 373103, 375319, 378236, 381460, 384482, 387227, 389895, 392401, 394374, 395680, 396594, 397338, 397831, 398088, 398564, 399782, 401731, 403858, 405574]
51102D05574J024L41j39l25k53P5Q34K020L002K930J832P38M43N69L15l18o33
51085D18029l76n8j58n31p58o18p5P69J572J882J681J472J691K211K650K933L209
51068D35525L432L409L256L413M098N044N990P136Q837J0865J2361J2580J1520
51055E27466R757P908O462N870O380P764R361J0472J0682R886Q316O443M576K495
51041F33838k66l620o717q606q958q047o444m953m445n233o709p881q276q017
51027E45666p192n721l922k589k165k076j337L36K267L614M118M123M187M705
51013E44014N589O253O172N628N588O615Q118R068R262R412R993J0607J0674J0295
50999F57288R991R901R722R292Q759Q226P611O932O319N714M900L989L544L996
$$ y = [405574, 406598, 406939, 406800, 406475, 406222, 406297, 407131, 409151, 412153, 415083, 416915, 417653, 418096, 418665, 418980, 418662, 418029, 417653, 417595, 417437, 416906, 416148, 415530, 415455, 416224, 417796, 419678, 421359, 422831, 424522, 426733, 429383, 432316, 435525, 438957, 442366, 445622, 449035, 453133, 458177, 464167, 471303, 480140, 491005, 503366, 515946, 527466, 537223, 545131, 551593, 557463, 563843, 571607, 580968, 591440, 602122, 612008, 620324, 626767, 631343, 633838, 633572, 629952, 623235, 614629, 605671, 597624, 591180, 586227, 581782, 576549, 569840, 561959, 553683, 545666, 538474, 532753, 528831, 526242, 524077, 522001, 520664, 521000, 523267, 526881, 530999, 535122, 539309, 544014, 549603, 555856, 562028, 567656, 573244, 579859, 587977, 597045, 606307, 615719, 625712, 636319, 646993, 657288, 667279, 677180, 686902, 696194, 704953, 713179, 720790, 727722, 734041, 739755, 744655, 748644, 752188, 756184]
50985G56184N121O278P015P352P630Q211R168J0189J0870J1214J1666J2713J4591
50972H78202J7260K0388K3328K5614K7577L0038L3150L6067L8088L9713M1932
50961A211357M4743M7062M8016M7715M6662M5053M2940M0517L7835L4521L0276
50950A676697K5456K0808J6605J2498Q246M238J098j057k668m182n738p407r383
50937A735211j1663j3738j4966j5294j5414j6078j7450j9140k0691k1870k2721
50926A546186k3603k5041k7243k9739l1775l3069l3978l4837l5389l5130l3973
50915A202409l2318l0503k8514k6321k4133k2175k0330j8320j6132j4086j2475
50904I57102j1371j0679j0164r430q225o806n684m956m197l165k131j329n59L54
$$ y = [756184, 761305, 767583, 774598, 781950, 789580, 797791, 806959, 817148, 828018, 839232, 850898, 863611, 878202, 895462, 915850, 939178, 964792, 992369, 1022407, 1055557, 1091624, 1129712, 1169425, 1211357, 1256100, 1303162, 1351178, 1398893, 1445555, 1490608, 1533548, 1574065, 1611900, 1646421, 1676697, 1702153, 1722961, 1739566, 1752064, 1760310, 1764548, 1765646, 1764589, 1761921, 1757739, 1752001, 1744594, 1735211, 1723548, 1709810, 1694844, 1679550, 1664136, 1648058, 1630608, 1611468, 1590777, 1568907, 1546186, 1522583, 1497542, 1470299, 1440560, 1408785, 1375716, 1341738, 1306901, 1271512, 1236382, 1202409, 1170091, 1139588, 1111074, 1084753, 1060620, 1038445, 1018115, 999795, 983663, 969577, 957102, 945731, 935052, 924888, 915458, 907233, 900427, 894743, 889787, 885590, 882425, 880294, 878965, 878406, 878760]
50890H78760J141J651K331L511M541M541L867L874N099O616P401P565P776Q281
50876I46955R058J0255J1790J3008J3487J3820J4876J6551J8017J9001K0058K1584
50864A128460K3314K4947K6673K8784L1274L3974L6807L9763M2914M6533N0781
50853A514224N5320N9610O3743O8460P4139Q0184Q5694R0281R4022R6971R9217
50842B381865J01115J02908J04063J03357R9709R2828Q3174P1635N9237M6683
50832C246574L4060K1082P889m610j5333k3836l0258l4656l6761l6552l4650l1817
50820C061132k8300k4052j9548j6008j4662j6092k0183k6341l3589m0960m8115
50809B773282n5322o2587o9251p4745p9351q3534q6788q7831q6019q2053p7125
$$ y = [878760, 879901, 881552, 883883, 887394, 891935, 896476, 900343, 904217, 909316, 915932, 923333, 930898, 938674, 946955, 956013, 966268, 978058, 991066, 1004553, 1018373, 1033249, 1049800, 1067817, 1086818, 1106876, 1128460, 1151774, 1176721, 1203394, 1232178, 1263452, 1297426, 1334233, 1373996, 1416910, 1463443, 1514224, 1569544, 1629154, 1692897, 1761357, 1835496, 1915680, 2001374, 2091655, 2185677, 2282648, 2381865, 2482980, 2585888, 2689951, 2793308, 2893017, 2985845, 3069019, 3140654, 3199891, 3246574, 3280634, 3301716, 3309605, 3304995, 3289662, 3265826, 3235568, 3200912, 3164151, 3127599, 3092949, 3061132, 3032832, 3008780, 2989232, 2973224, 2958562, 2942470, 2922287, 2895946, 2862357, 2821397, 2773282, 2717960, 2655373, 2586122, 2511377, 2432026, 2348492, 2261704, 2173873, 2087854, 2005801, 1928676]
50798A928676p1924o6582o1067n5288m9155m2885l7010l1805k7007k2330j8015
50787A445608j4494j1740r376p392o222o034o307o318n901n450n387n729o194
50774A349064o551o893p572q822j0385j1679j2425j2934j3527j3898j3444j2215
50762A218719j1064j0599j0436r816q625p354o273n183l980k903j985p67J234
50749A140968L915O675Q960J0685J2268J4317J7047K0056K2893K5693K8876L2337
50737A344690L5485L8149M0717M3319M5556M7367M9319N1551N3141N3271N2455
50726A855020N1762N1244N0065M7969M5619M3389M0617L6359L0221K2344J3170
50715B287779L426o017j4517k1623k6835k9890l1242l1627l1052k8959k5423k1462
$$ y = [1928676, 1856752, 1790170, 1729103, 1673815, 1624660, 1581775, 1544765, 1512960, 1485953, 1463623, 1445608, 1431114, 1419374, 1409998, 1402606, 1396384, 1390350, 1384043, 1377725, 1371824, 1366374, 1360987, 1355258, 1349064, 1342513, 1335620, 1328048, 1319226, 1308841, 1297162, 1284737, 1271803, 1258276, 1244378, 1230934, 1218719, 1207655, 1197056, 1186620, 1176804, 1168179, 1160825, 1154552, 1149369, 1145389, 1142486, 1140501, 1139734, 1140968, 1144883, 1151558, 1160518, 1171203, 1183471, 1197788, 1214835, 1234891, 1257784, 1283477, 1312353, 1344690, 1380175, 1418324, 1459041, 1502360, 1547916, 1595283, 1644602, 1696153, 1749294, 1802565, 1855020, 1906782, 1958026, 2008091, 2056060, 2101679, 2145068, 2185685, 2222044, 2252265, 2274609, 2287779, 2291205, 2285188, 2270671, 2249048, 2222213, 2192323, 2161081, 2129454, 2098402, 2069443, 2044020, 2022558]
50703B022558j7816j4237j0480p339n925o295p648r709j3187j8567k5023l0970
50691A855362l5471l8800m1624m3946m5023m4230m1749l8298l4467l0471k6355
50680A434928k2139j7797j3330q802m254K65M443P859J0631J3470J6626J9202
50668A441102K0173J9814J9322J9198J8866J7849J6328J4431J2002R505Q184Q629
50656A625403R874J0598J0602J0480J0361R942R398R352R932J0627J1208J2191
50644A749968J4153J6991K0082K2895K5236K7044K8215K8743K8936K9208K9484
50633B020955K9045K7371K4981K3002K1938K1306K0448J8973J6287J1478M180
50622B239964m867j4314k2887k9403l2963l3541l1902k8594k3697j7876j2722
$$ y = [2022558, 2004742, 1990505, 1980025, 1972686, 1966761, 1960466, 1952818, 1943109, 1929922, 1911355, 1886332, 1855362, 1819891, 1781091, 1739467, 1695521, 1650498, 1606268, 1564519, 1526221, 1491754, 1461283, 1434928, 1412789, 1394992, 1381662, 1372860, 1368606, 1368871, 1373314, 1381173, 1391804, 1405274, 1421900, 1441102, 1461275, 1481089, 1500411, 1519609, 1538475, 1556324, 1572652, 1587083, 1599085, 1608590, 1616774, 1625403, 1635277, 1645875, 1656477, 1666957, 1677318, 1687260, 1696658, 1706010, 1715942, 1726569, 1737777, 1749968, 1764121, 1781112, 1801194, 1824089, 1849325, 1876369, 1904584, 1933327, 1962263, 1991471, 2020955, 2050000, 2077371, 2102352, 2125354, 2147292, 2168598, 2189046, 2208019, 2224306, 2235784, 2239964, 2235097, 2220783, 2197896, 2168493, 2135530, 2101989, 2070087, 2041493, 2017796, 1999920, 1987198]
50611A987198r230o703m032j463j12l24j647m062q004j3170j8513k3534k8594
50598A867810l3781l8385m1718m3706m4460m4082m2989m1744m0301l8180l5514
50587A422950l3038l0865k8267k5051k2160k0293j8805j6719j4237j2326j1293
50576A189896j0497r205p026l863j37L083M902N577O204P497R247J0933J2341
50563A218952J3582J4882J6364J7849J8950J9611K0319K1456K2780K3870K4840
50552A433455K5945K6749K6376K4748K2881K1711K1146K0561J9849J9591K0353
50541A683365K2174K4652K7338L0053L2904L6031L9327M2515M5506M8507N1731
50530B084103N5174N8751O2439O6118O9460P2102P3887P4805P4791P3708P1471
$$ y = [1987198, 1977968, 1971265, 1967233, 1965770, 1965658, 1965334, 1963687, 1959625, 1951621, 1938451, 1919938, 1896404, 1867810, 1834029, 1795644, 1753926, 1710220, 1665760, 1621678, 1578689, 1536945, 1496644, 1458464, 1422950, 1389912, 1359047, 1330780, 1305729, 1283569, 1263276, 1244471, 1227752, 1213515, 1201189, 1189896, 1179399, 1170194, 1163168, 1159305, 1159168, 1162251, 1167153, 1172730, 1178934, 1186431, 1195678, 1206611, 1218952, 1232534, 1247416, 1263780, 1281629, 1300579, 1320190, 1340509, 1361965, 1384745, 1408615, 1433455, 1459400, 1486149, 1512525, 1537273, 1560154, 1581865, 1603011, 1623572, 1643421, 1663012, 1683365, 1705539, 1730191, 1757529, 1787582, 1820486, 1856517, 1895844, 1938359, 1983865, 2032372, 2084103, 2139277, 2198028, 2260467, 2326585, 2396045, 2468147, 2542034, 2616839, 2691630, 2765338, 2836809]
50519B836809O8006O3173N6856M9130M0150K9978J8784P186m033j4741k5565l6755
50507C088978m7209n5225o0238o3186o4979o5202o2783n7503n0213m1838l2829
50496B487773k3512j4354n661K507R910J5949K0033K1852K1105J7322J0217M7
50484B563188j2443k6155l9760n2035o2367p0679p6831q0487q1666q0895p8551
50473A901319p4585o9238o3530n8384n3661m8648m3267l8119l3576k9519k5990
50462A362802k3255k1183j9172j6917j4657j2555j0449q455p058o170m781k188
50450A215962Q78L059M015M605N593O916Q151R072R531R415Q902Q380P900P132
50436A309511O013N025M577M489M399M347M572M961N173N191N361N900O654P333
$$ y = [2836809, 2904815, 2967988, 3024844, 3073974, 3114124, 3144102, 3162886, 3170072, 3166039, 3151298, 3125733, 3088978, 3041769, 2986544, 2926306, 2863120, 2798141, 2732939, 2670156, 2612653, 2562440, 2520602, 2487773, 2464261, 2449907, 2444246, 2446753, 2456663, 2472612, 2492645, 2514497, 2535602, 2552924, 2563141, 2563188, 2550745, 2524590, 2484830, 2432795, 2370428, 2299749, 2222918, 2142431, 2060765, 1979870, 1901319, 1826734, 1757496, 1693966, 1635582, 1581921, 1533273, 1490006, 1451887, 1418311, 1388792, 1362802, 1339547, 1318364, 1299192, 1282275, 1267618, 1255063, 1244614, 1236159, 1229101, 1222931, 1218150, 1215962, 1216840, 1219899, 1223914, 1228519, 1234112, 1241028, 1249179, 1258251, 1267782, 1277197, 1286099, 1294479, 1302379, 1309511, 1315524, 1320549, 1325126, 1329615, 1334014, 1338361, 1342933, 1347894, 1353067, 1358258, 1363619, 1369519, 1376173, 1383506]
50422A383506P795Q100Q499R354J0873J2984J5536J8471K1574K4364K6575K8592
50410A576223L0917L3317L5091L6111L6904L7464L6823L4328L0723K7275K4150
50399A939326K0427J5532R845L796k852j0386j8376k5909l2330l7460m1294m3835
50387A776484m5098m5083m3788m1339l7930l3557k8077k1755j5427r844n007n55
50375A449024L413O398Q266R363R615Q181M373j298p527j3504j9254k4798k9520
50362A402732l2752l4573l5638l6282l6215l5080l3049l0733k8615k6717k4667
50351A048411k2098j9052j6014j3469j1389r320o906m214j541P91K413K953K362
50338I52927J029n56k209l921n558o872p669p830p271o143m851l628k255n34J117
$$ y = [1383506, 1391301, 1399401, 1407900, 1417254, 1428127, 1441111, 1456647, 1475118, 1496692, 1521056, 1547631, 1576223, 1607140, 1640457, 1675548, 1711659, 1748563, 1786027, 1822850, 1857178, 1887901, 1915176, 1939326, 1959753, 1975285, 1985130, 1988926, 1986074, 1975688, 1957312, 1931403, 1899073, 1861613, 1820319, 1776484, 1731386, 1686303, 1642515, 1601176, 1563246, 1529689, 1501612, 1479857, 1464430, 1454586, 1449579, 1449024, 1452437, 1458835, 1467101, 1476464, 1486079, 1494260, 1498633, 1497335, 1489808, 1476304, 1457050, 1432252, 1402732, 1369980, 1335407, 1299769, 1263487, 1227272, 1192192, 1159143, 1128410, 1099795, 1073078, 1048411, 1026313, 1007261, 991247, 977778, 966389, 957069, 950163, 945949, 944408, 945199, 947612, 950565, 952927, 953956, 953400, 951191, 947270, 941712, 934840, 927171, 919341, 912070, 905927, 901076, 897448, 895193, 894659, 895776]
50323H95776J980J997J907K294K901L102K711K052J480J191J264J478J255J47
50309I21535j498k723k911k347j747j437j190o81J17J035J915K653L187L540L832
50294I23280M148M391M482M582M912N270N065M088L052K874L473L710K741R94
50280I77062n23j495k323l055l057k096j115j244k289k893k265j074l48j51Q4
50265I53218L98K75l16o67k83N79J544K700M139N475O377P234Q654J0565J2373
50250A012265J3794J5030J6146J6941J7388J7661J7622J6842J5308J3650J2473
50239A185120J1862J1620J1413J0475P849L435j610o036r842j3811j7976k1259
50227A171240k2748k2775k2365k1931k0922j8731j5696j3111j2264j3533j6197
$$ y = [895776, 897756, 899753, 901660, 903954, 906855, 909957, 912668, 914720, 916200, 917391, 918655, 920133, 921388, 921535, 920037, 917314, 914403, 912056, 910309, 908872, 907682, 907001, 907118, 908153, 910068, 912721, 915908, 919448, 923280, 927428, 931819, 936301, 940883, 945795, 951065, 956130, 960218, 963270, 966144, 969617, 973327, 976068, 977062, 976539, 975044, 972721, 969666, 966609, 964513, 963398, 962154, 959865, 956972, 954707, 953633, 953285, 953134, 953218, 953616, 953891, 953575, 952908, 952625, 953204, 954748, 957448, 961587, 967062, 973439, 980673, 989327, 999892, 1012265, 1026059, 1041089, 1057235, 1074176, 1091564, 1109225, 1126847, 1143689, 1158997, 1172647, 1185120, 1196982, 1208602, 1220015, 1230490, 1238339, 1241774, 1240164, 1234128, 1224286, 1210475, 1192499, 1171240, 1148492, 1125717, 1103352, 1081421, 1060499, 1041768, 1026072, 1012961, 1000697, 987164, 970967]
50216I70967j8947k0635k0911k0376k0004k0113k0001j8832j6671j4295j2110
50205G68072r934p774o153n352m931m489m327m832n580n712m996l963l112k590
50191F94327k544l144m095m698m630m263m082m089m005l674l075k205j217n02
50177F48104l09m10l72o2K64L73L76O26J343K367L246L652L696L762M112M685
50161F75453N216N472N429N382N744O540P290P700Q220R450J0986J1572J0600
50148G75054Q916P749P344P177P103P513Q470R479J0288J1382J3334J6080J9120
50135I09009K2167K5231K8301L1177L3539L4935L4976L3820L2352L1467L1231
50124A248205L0982L0192K8866K7133K4869K1863J7986J3033O768n77q107j4916
$$ y = [970967, 952020, 931385, 910474, 890098, 870094, 849981, 829980, 811148, 794477, 780182, 768072, 758138, 750364, 744211, 738859, 733928, 729439, 725112, 720280, 714700, 708988, 703992, 700029, 696917, 694327, 691783, 688639, 684544, 679846, 675216, 670953, 666871, 662782, 658777, 655103, 652028, 649823, 648606, 648104, 647795, 647385, 647013, 646951, 647215, 647588, 647964, 648590, 649933, 652300, 655546, 659198, 662894, 666656, 670768, 675453, 680669, 686141, 691570, 696952, 702696, 709236, 716526, 724226, 732446, 741896, 752882, 764454, 775054, 783970, 791719, 799063, 806240, 813343, 820856, 829326, 838805, 849093, 860475, 873809, 889889, 909009, 931176, 956407, 984708, 1015885, 1049424, 1084359, 1119335, 1153155, 1185507, 1216974, 1248205, 1279187, 1309379, 1338245, 1365378, 1390247, 1412110, 1430096, 1443129, 1449897, 1449320, 1441213, 1426297]
50112A426297k0842k6270l1273l5262l7569l8117l7425l6034l4098l1523k8514
50101A069370k5725k3659k2045k0202j8079j6368j5402j4481j2869j0909r414
50090H80217q256o587m377k703k115j717n32J028J843J705J308R46K11r64j922
50075H58085k191k073k006j953j838k027k778l590l742l355l303l973m733m877
50061H15646m622m656m923m502k823n83R17J077L60m51q49n64M85J891K924L330
50045H02657L722M741O121P058P352P585Q122Q535Q227P255O244N763N986O655
50031H96023P115O679N309L763K770K328K082K061K482L006K967K449K406L410
50017I44850M897O115P210Q695J0300J1263J1664J2455J3951J5115J4821J3283
$$ y = [1426297, 1405455, 1379185, 1347912, 1312650, 1275081, 1236964, 1199539, 1163505, 1129407, 1097884, 1069370, 1043645, 1019986, 997941, 977739, 959660, 943292, 927890, 913409, 900540, 889631, 880217, 871961, 865374, 860997, 858294, 856179, 854462, 853930, 854958, 856801, 858506, 859814, 860760, 860971, 860007, 858085, 855894, 853821, 851815, 849862, 848024, 845997, 843219, 839629, 835887, 832532, 829229, 825256, 820523, 815646, 811024, 806368, 801445, 796943, 794120, 793537, 794454, 795531, 795891, 795440, 794591, 794027, 794512, 796403, 799327, 802657, 806379, 811120, 817241, 824299, 831651, 839236, 847358, 855893, 864120, 871375, 877619, 883382, 889368, 896023, 903138, 909817, 915126, 918889, 921659, 923987, 926069, 928130, 930612, 933618, 936585, 939034, 941440, 944850, 949747, 955862, 963072, 971767, 982067, 993330, 1004994, 1017449, 1031400, 1046515, 1061336, 1074619]
50005A074619J1717J1012J1171J1688J1952J1455J0130Q363O348L633l09n332
49993A166447j0797j6221k1204k5083k7340k8261k8525k8239k7092k5325k3735
49982I04625k2659k1724k0743j9949j9199j7841j5835j4046j2974j2030j0603
49971G17022r074p965o953n582m295l804l893l875l727l777l653k784j650j217
49957F54773j212l14J710L472M049M283N290O684P319P038O665O645O589O001
49943G18992M812L258J677L47q36k253l868n029n400n699o849q736j0432j1399
49929F68585j1785j1626j0646q957p346o448o044n478m458l221k127j393r99o66
49915E87391j1J057K137K669K534K246K483L377M328M689M546M596N225O110O874
$$ y = [1074619, 1086336, 1097348, 1108519, 1120207, 1132159, 1143614, 1153744, 1162107, 1168455, 1172088, 1171779, 1166447, 1155650, 1139429, 1118225, 1093142, 1065802, 1037541, 1009016, 980777, 953685, 928360, 904625, 881966, 860242, 839499, 819550, 800351, 782510, 766675, 752629, 739655, 727625, 717022, 707948, 699983, 693030, 687448, 683153, 679349, 675456, 671581, 667854, 664077, 660424, 657640, 655990, 654773, 653561, 653247, 654957, 658429, 662478, 666761, 672051, 678735, 686054, 693092, 699757, 706402, 712991, 718992, 723804, 727062, 728739, 729086, 728250, 725997, 722129, 717100, 711700, 706001, 699152, 690416, 679984, 668585, 656800, 645174, 634528, 625571, 618225, 611777, 605733, 600255, 595797, 592576, 590449, 589056, 588057, 587391, 587380, 588437, 590574, 593243, 595777, 598023, 600506, 603883, 608211, 612900, 617446, 622042, 627267, 633377, 640251]
49900F40251P668Q617R119Q358O516M744L787L216K239P38r11k522m100n456o363
49885F75901o968p536p984q115q189q618r129q909p770o541n977n840n445m648
49871E74232l783l018k329j822j483r00K05J345J876K064K732L924M828N164N679
49856E88714O878Q170Q826R024R197R046Q050O512N175M157L074J990J283P19
49842F70815m07k101l571m411n121o083o899p058o665o070n327m487l837l396
49828F05382k654j387k93j93p48o95O76K744M358N033N174N434O055O820P442
49813F43148P826P918P514O470N087L910L132K428J467K86r54k312l901n493o556
49798F69970o674o019n390n607o636p485p269o177n061m317l718l226l143l432
$$ y = [640251, 647919, 656536, 665655, 674013, 680529, 685273, 689060, 692276, 694515, 695253, 694342, 691820, 687720, 682264, 675901, 668933, 661397, 653413, 645298, 637109, 628491, 619362, 610453, 602683, 596142, 590165, 584325, 578880, 574232, 570449, 567431, 565102, 563280, 561797, 560897, 561102, 562447, 564323, 566387, 569119, 573043, 577871, 583035, 588714, 595592, 603762, 612588, 621612, 630809, 639855, 647905, 654417, 659592, 663749, 666823, 668813, 670096, 670815, 670408, 668307, 664736, 660325, 655204, 649121, 642222, 635164, 628499, 622429, 617102, 612615, 608778, 605382, 602728, 601341, 601048, 600855, 600107, 599412, 600088, 602832, 607190, 612223, 617397, 622831, 628886, 635706, 643148, 650974, 658892, 666406, 672876, 677963, 681873, 685005, 687433, 688900, 689186, 688232, 685920, 682019, 676526, 669970, 663296, 657277, 651887, 646280, 639644, 632159, 624890, 618713, 613652, 609335, 605617, 602391, 599248, 595816]
49784E95816l522l112k541k186k020j988k189k274j466L78K214K945K654K257
$$ y = [595816, 592294, 589182, 586641, 584455, 582435, 580447, 578258, 575984, 574518, 574896, 577110, 580055, 582709, 584966]
$$ [...]
##END NTUPLES=NMR SPECTRUM
##END=
