
##TITLE=AC1245_NSAAH12035_6944943_z8plN1EjMy
##JCAMPDX= 6.0         $$ Bruker NMR JCAMP-DX V2.0
##DATA TYPE= NMR SPECTRUM
##DATA CLASS= NTUPLES
##ORIGIN= BRUKER
##OWNER= Administrator
$$ 1.72 TOPSPIN		Version 2.1
$$ 2012-10-18 13:44:18.646 -0700  Administrator@X
$$ Compression mode = diff/dup
##.OBSERVE FREQUENCY= 400.02188249412
##.OBSERVE NUCLEUS= ^1H
##.ACQUISITION MODE= SIMULTANEOUS (DQD)
##.ACQUISITION SCHEME= undefined
##.AVERAGES= 8
##.DIGITISER RES= 22
##SPECTROMETER/DATA SYSTEM= spect
##.PULSE SEQUENCE= zg30
##.SOLVENT NAME= COFFEE_meoh
##.SHIFT REFERENCE= INTERNAL, COFFEE_meoh, 1, 14.98509
##AUDIT TRAIL= $$ (NUMBER, WHEN, WHO, WHERE, PROCESS, VERSION, WHAT)
$$ ##TITLE= Audit trail, TOPSPIN		Version 2.1
$$ ##JCAMPDX= 5.01
$$ ##ORIGIN= Bruker BioSpin GmbH
$$ ##OWNER= Administrator
$$ $$ C:\Bruker\TOPSPIN/data/COFFEE/nmr/AC1245_NSAAH12035_6944943_z8plN1EjMy/10/pdata/1/auditp.txt
$$ ##AUDIT TRAIL=  $$ (NUMBER, WHEN, WHO, WHERE, PROCESS, VERSION, WHAT)
(   1,<2012-10-13 16:17:33.546 -0500>,<Administrator>,<TOPSPIN>,<go>,<TOPSPIN 2.1>,
      <created by zg
	started at 2012-10-13 16:16:26.984 -0500,
	POWCHK enabled, PULCHK disabled,
       configuration hash MD5:
       6B 1B 68 BB D9 2E 58 E2 7F 35 AD 54 07 DF 0E 41
       data hash MD5: 64K
       31 CB 50 74 22 01 05 89 3B 34 EF CB CB 2E 89 47>)
(   2,<2012-10-13 16:17:36.656 -0500>,<Administrator>,<TOPSPIN>,<proc1d>,<TOPSPIN 2.1>,
      <Start of raw data processing
       efp LB = 0 FT_mod = 6 PKNL = 1 PHC0 = 0 PHC1 = 0 SI = 32K 
       data hash MD5: 32K
       BD B2 6D 87 60 A1 B7 36 5B 92 EC E2 2A 57 39 14>)
(   3,<2012-10-13 16:17:37.046 -0500>,<Administrator>,<TOPSPIN>,<proc1d>,<TOPSPIN 2.1>,
      <pk PHC0 = 179.9451 PHC1 = 0 
       data hash MD5: 32K
       9B 33 93 CB E4 AF DE EE 1F ED 18 2A C5 FB A5 AF>)
(   4,<2012-10-13 16:17:37.281 -0500>,<Administrator>,<TOPSPIN>,<proc1d>,<TOPSPIN 2.1>,
      <abs ABSG = 1 
       data hash MD5: 32K
       79 6D 66 D3 C0 32 39 07 21 E9 F6 AA D1 CD E1 A2>)
(   5,<2012-10-13 16:17:37.359 -0500>,<Administrator>,<TOPSPIN>,<proc1d>,<TOPSPIN 2.1>,
      <abs ABSG = 2 
       data hash MD5: 32K
       9D 20 91 AE 98 40 1D 49 1E F6 69 66 81 A1 1C D0>)
(   6,<2012-10-13 16:17:37.390 -0500>,<Administrator>,<TOPSPIN>,<proc1d>,<TOPSPIN 2.1>,
      <abs ABSG = 3 
       data hash MD5: 32K
       88 09 05 50 1D 6F C0 2E 87 FA 2E E7 97 8F 86 48>)
(   7,<2012-10-13 16:17:37.437 -0500>,<Administrator>,<TOPSPIN>,<proc1d>,<TOPSPIN 2.1>,
      <abs ABSG = 4 
       data hash MD5: 32K
       0C E2 00 20 31 3C A5 30 F6 43 69 5B 5D 97 02 27>)
(   8,<2012-10-13 16:17:37.453 -0500>,<Administrator>,<TOPSPIN>,<proc1d>,<TOPSPIN 2.1>,
      <abs ABSG = 5 
       data hash MD5: 32K
       24 E4 DE 71 0C 8E F0 D8 62 49 87 76 79 2E D9 8D>)
(   9,<2012-10-13 16:17:41.437 -0500>,<Administrator>,<TOPSPIN>,<audit>,<TOPSPIN 2.1>,
      <user comment:
       ICON-NMR User ID: COFFEE
       data hash MD5: 32K
       24 E4 DE 71 0C 8E F0 D8 62 49 87 76 79 2E D9 8D>)
$$ ##END=
$$ [...]
##$TP= (0..7)
150 150 150 150 150 150 150 150
##$TP07= 0
##$TPNAME0= <>
##$TPNAME1= <>
##$TPNAME2= <>
##$TPNAME3= <>
##$TPNAME4= <>
##$TPNAME5= <>
##$TPNAME6= <>
##$TPNAME7= <>
##$TPOAL= (0..7)
0.5 0.5 0.5 0.5 0.5 0.5 0.5 0.5
##$TPOFFS= (0..7)
0 0 0 0 0 0 0 0
##$TUNHIN= 0
##$TUNHOUT= 0
##$TUNXOUT= 0
##$USERA1= <user>
##$USERA2= <user>
##$USERA3= <user>
##$USERA4= <user>
##$USERA5= <user>
##$V9= 5
##$VALIST= <valist>
##$VCLIST= <CCCCCCCCCCCCCCC>
##$VD= 0
##$VDLIST= <DDDDDDDDDDDDDDD>
##$VPLIST= <PPPPPPPPPPPPPPP>
##$VTLIST= <TTTTTTTTTTTTTTT>
##$WBST= 2048
##$WBSW= 25
##$XGAIN= (0..3)
0 0 0 0
##$XL= 0
##$YL= 0
##$YMAX_a= 486981
##$YMIN_a= -625646
##$ZGOPTNS= <>
##$ZL1= 120
##$ZL2= 120
##$ZL3= 120
##$ZL4= 120
##$ABSF1= 14.98509
##$ABSF2= -5.573092
##$ABSG= 5
##$ABSL= 3
##$ALPHA= 0
##$AQORDER= 0
##$ASSFAC= 0
##$ASSFACI= 0
##$ASSFACX= 0
##$ASSWID= 0
##$AUNMP= <proc_prof1d_extract_pilot.lims>
##$AXLEFT= 0
##$AXNAME= <>
##$AXNUC= <1H>
##$AXRIGHT= 0
##$AXTYPE= 0
##$AXUNIT= <>
##$AZFE= 0.1
##$AZFW= 0.1
##$BCFW= 0
##$BC_mod= 0
##$BYTORDP= 0
##$COROFFS= 0
##$CY= 15
##$DATMOD= 1
##$DC= 0
##$DFILT= <>
##$DTYPP= 0
##$F1P= 0
##$F2P= 0
##$FCOR= 0.5
##$FTSIZE= 32768
##$FT_mod= 6
##$GAMMA= 0
##$GB= 0
##$INTBC= 1
##$INTSCL= 1
##$ISEN= 128
##$LB= 0
##$LEV0= 0
##$LPBIN= 0
##$MAXI= 10000
##$MC2= 0
##$MEAN= 0
##$ME_mod= 0
##$MI= 0
##$NCOEF= 0
##$NC_proc= -8
##$NLEV= 6
##$NOISF1= 0
##$NOISF2= 0
##$NSP= 0
##$NTH_PI= 0
##$NZP= 0
##$OFFSET= 14.98509
##$PC= 1
##$PHC0= 179.9451
##$PHC1= 0
##$PH_mod= 1
##$PKNL= yes
##$PPARMOD= 0
##$PPDIAG= 0
##$PPIPTYP= 0
##$PPMPNUM= 2147483647
##$PPRESOL= 1
##$PSCAL= 4
##$PSIGN= 0
##$PYNMP= <proc.py>
##$REVERSE= no
##$SF= 400.02
##$SI= 32768
##$SIGF1= 0
##$SIGF2= 0
##$SINO= 400
##$SIOLD= 32768
##$SPECTYP= <>
##$SREGLST= <1H.CDCl3>
##$SSB= 0
##$STSI= 32768
##$STSR= 0
##$SW_p= 8223.68421052631
##$SYMM= 0
##$S_DEV= 0
##$TDeff= 65536
##$TDoff= 0
##$TI= <>
##$TILT= no
##$TM1= 0
##$TM2= 0
##$TOPLEV= 0
##$USERP1= <user>
##$USERP2= <user>
##$USERP3= <user>
##$USERP4= <user>
##$USERP5= <user>
##$WDW= 1
##$XDIM= 32768
##$YMAX_p= 445623953
##$YMIN_p= -708125
##$CURPLOT= <Network HP LaserJet P1505>
##$CURPRIN= <$Network HP LaserJet P1505>
##$DFORMAT= <normdp>
##$LAYOUT= <+/1D_H.xwp>
##$LFORMAT= <normlp>
##$PFORMAT= <normpl>
##$SURQMSG= 1
$$ End of Bruker specific parameters
$$ ---------------------------------
##NTUPLES= NMR SPECTRUM
##VAR_NAME=  FREQUENCY,     SPECTRUM/REAL,   SPECTRUM/IMAG
##SYMBOL=    X,             R,               I
##VAR_TYPE=  INDEPENDENT,   DEPENDENT,       DEPENDENT
##VAR_FORM=  AFFN,          ASDF,            ASDF
##VAR_DIM=   32768,         32768,           32768
##UNITS=     HZ,            ARBITRARY UNITS, ARBITRARY UNITS
##FACTOR=    0.250966925370066, 1,           1
##FIRST=     8223.43324360094, 6106,         51617
##LAST=      0,             68407,           -51967
##MIN=       0,             -708125,         0
##MAX=       8223.43324360094, 445623953,    0
$$ Real data points
##PAGE= N=1
##DATA TABLE= (X++(R..R)), XYDATA
$$ [...]
19530b97219C52727c47974P8289A64148h9803l25904M3986a8136m69369J63460
19520c24045a5033B93617c6024A48393b67711A67548B9190L02115A0698b13142
19509h4371j36381c9746B90379h9595A17310a37003p7187J06734q4452j00901
19499b92809J25849g5578p2265M8705m3144B58370A2255c00683B08417C3152h3773
19487a87183b6763A45261K6340a25303M1452j56112B44080e3985A94752b73602
19476C53074A13999i1171A53940a28873E1412b80405c0112E640b56598J07830
19466a48768r5214I6667a5731B8838J4869Q1578a74491o5574B36602L4919b11117
19454A89424H3472A1832J0887a20968j83076a31422A54911o0167K338a86280P383
$$ plain form
19530 -297219 352727 -347974 -269685 164148 -89803 -415707 -371721 -18136 -487505 -324045
19520 -324045 -15033 293617 -36024 148393 -267711 167548 29190 331305 10698 -213142
19509 -84371 -220752 -39746 290379 -89595 117310 -137003 -214190 -107456 -191908 -292809
19499 -292809 -166960 -75578 -147843 -99138 -142282 258370 12255 -300683 208417 33152 -83773
19487 -187183 -26763 145261 171601 -125303 -83851 -239963 244080 -53985 194752 -273602
19476 353074 113999 -91171 153940 -128873 51412 -280405 -30112 5640 -256598 -148768
19466 -148768 -243982 96667 -15731 28838 43707 125285 -174491 -240065 236602 271521 -211117
19454 189424 83472 11832 22719 -120968 -304044 -131422 154911 94744 97082 -186280 -178897
19443a78897G9838b54944c0627l19729h537k28389A16975A9120J6995d24716h0584
19431H532a0362B2365K34614j23523f1325j1724B803P4219g4929l11577A5887
19419a10495K8578k7699p2869j38066B9979b26210P4490b9370E8270g9768c7379
19407b04132R6145k27029a32196f3286A57992B6876K25329b56420B35256b37785
19396a90107L1637L0979f3061c0033j09736D2565e5261G1285R3260p7449c5432
19384I2215P6512e2440A7776N20835c60539O8432A59017c45732J7389e1659o3472
19373a15131e7030j19654h3600H1938K5988l5901I788A148a67881j19028B45660
19361a03345k00482B70744d38466F6501i5697k996A1967a66960b5170n7565C62151
$$ plain form
19443 -178897 79838 -254944 -30627 -350356 -8537 -236926 116975 19120 36115 -424716 -80584
19431 8532 -10362 22365 256979 133456 -61325 -73049 2803 77022 -74929 -386506 15887
19419 -110495 -81917 -109616 -182485 -320551 29979 -226210 -151720 -29370 58270 -79768 -37379
19407 -204132 -107987 -335016 -132196 -63286 157992 26876 252205 -256420 235256 -237785
19396 -190107 -158470 -127491 -63061 -30033 -139769 42565 -55261 71285 164545 87096 -35432
19384 92215 168727 -52440 17776 538611 -360539 -292107 159017 -345732 -328343 -51659 -115131
19373 -115131 -57030 -176684 -83600 81938 107926 72025 9788 1148 -167881 -286909 245660
19361 -103345 -303827 270744 -438466 66501 -95697 -98693 11967 -166960 -25170 -82735 362151
19349b88496g4319H3779J31887b3797I9494c21568I9000e0966h000j14746n7636
19338a80382q8829N2598q0713k3463e8028G4456k5334a20017M1950D486i5849
19326a3931q903m19494J57384A9038b18159j58612a27870A56894d04845Q1626
19316c23219b707A65684B0075a65672j03994a2250k383C44382a06969A2951D106
19304B474c24514B4977c8121j90510R549B65496p8011a05802A33371D6062a29810
19292a06600N1270B55314a2381F7565b60526j67286g9165C7948L7829i9718A17962
19280b56196i008A1719b715B38c15561i9256c6047B5299J42909b64535A47273
19268E0724b81698G57P4182g08125b31913H273a94329G0373h0039o9639a1491
$$ plain form
19349 -288496 -74319 83779 215666 -23797 99494 -321568 99000 -50966 -8000 -122746 -180382
19338 -180382 -269211 -216613 -297326 -320789 -58028 74456 49122 -120017 -78067 4486 -95849
19326 -13931 -22834 -442328 -284944 19038 -218159 -376771 -127870 156894 -404845 -323219
19316 -323219 -2707 165684 20075 -165672 -269666 -12250 -14633 344382 -106969 12951 4106
19304 2474 -324514 24977 -38121 -228631 -219082 265496 187485 -105802 133371 46062 -129810
19292 -106600 -55330 255314 -12381 67565 -260526 -427812 -79165 37948 75777 -99718 117962
19280 -256196 -9008 11719 -2715 238 -315561 -99256 -36047 25299 168208 -264535 147273
19268 50724 -281698 757 74939 -708125 -231913 8273 -194329 70373 -80039 -149678 -11491
19256a86333L1601j08945M5411e4721E5762a5505C41852H3392b56161A49210c3459
19244d02437a55341H8287b6571B23053J93810A17067K15h4921k15103d7662p6945
19233a24607j8232A39058d4047E2803J25084a83481B99605B7764c09691a37840
19222i7985A27572d17924B12756a25783k5971A38421a64794I1737l8930A1577
19211B96086c24098f1950j54436A00159g79k7664j80355A35201l4469b61924J16699
19200a45225K3101A69347D9539a7168A3907P0613A8636c46554e3819O612j6913
19189f4120E2974f1322j16974e2768D3761a34540o0145A32502J45677r2699c40626
19177b00724m1663c4771B80669G9789h5782l27662E5989J73175a12106A3248a02671
$$ plain form
19256 -186333 -154732 -263677 -218266 -54721 55762 -15505 341852 83392 -256161 149210 -33459
19244 -402437 -155341 88287 -26571 223053 416863 117067 117282 -84921 -300024 -47662 -124607
19233 -124607 -142839 139058 -44047 52803 177887 -183481 299605 27764 -309691 -137840
19222 -97985 127572 -417924 212756 -125783 -151754 138421 -164794 91737 52807 11577
19211 296086 -324098 -61950 -216386 100159 -779 -28443 -208798 135201 100732 -261924 -145225
19200 -145225 -122124 169347 49539 -17168 13907 84520 18636 -346554 -53819 -47207 -64120
19189 -64120 52974 -61322 -178296 -52768 43761 -134540 -194685 132502 278179 185480 -340626
19177 -200724 -242387 -34771 280669 79789 -85782 -413444 55989 229164 -112106 13248 -102671
19165A1974b70568A82959a33388q8379L8826Q3787G4515b08921B21075B9700d1115
19153F4105a00859j55583A71840i6406B72290c3492B15705G1624J5874b05808
19142b01896B2789G572J48183c5707l59103J07210J15268A10598e24380a34428
19131a0954m33315A27648d8033A80006g3553j19902A38153k4366d5217k04804
19121b50021K6287J09182B8197a07663j45271h5208p2119H4739a63453O583f5998
19109a86937A69494k4285d8471B63910g9633H1828J43417Q6494f3971A24135b54506
19097g671I7798P0316o5887a33181b0336m56743b28552C42836a53836L7905G2392
19085B68286A23091n8638c00866F6674N919L60534f09q3959D0382e9674l3363
$$ plain form
19165 11974 -270568 182959 -133388 -221767 -182941 -99154 74515 -208921 221075 29700 -41115
19153 64105 -100859 -256442 171840 -96406 272290 -33492 215705 71624 87498 -205808
19142 -201896 22789 7572 155755 -35707 -394810 -287600 -172332 110598 -524380 -134428
19131 -10954 -444269 127648 -48033 180006 -73553 -193455 138153 113787 -45217 -250021
19121 -250021 -223734 -114552 28197 -107663 -252934 -85208 -157327 84739 -163453 -156870 -65998
19109 -186937 169494 145209 -48471 263910 -79633 81828 225245 311739 -63971 124135 -254506
19097 -7671 97798 168114 102227 -133181 -20336 -477079 -228552 342836 -153836 -115931 72392
19085 268286 123091 64453 -300866 66674 72593 433127 -609 -84568 40382 -59674 -93037
19074i3037l0558k01904l9613g384n5310O712A35993c9067B26200F8470a9392
19062a75559A35103e4792B43929m7793J56108G8373h402r9376A12448J20562j04556
19051A28454b10424d279m752j6254B8146c336m1692j3233B27172b48429F1000
19039b73221B6807R3011h3056F5070b00219C7297b19739B4440A440J9369K48237
19028B69046j24563g6957j93624a043j63241A14075l6304N7536D8582e5104B14698
19016G2762b06035k64038J38503a63588F8644c88337a22254j0496J8693J6230
19006i7827k4540M3817j03203N4915J2111B9068A3635J12061m217i1577l11159
18995d02736H9718d5322l10595f5363A2161L1173b6401q6994r3143H6826f0411
$$ plain form
19074 -93037 -123595 -325499 -365112 -7384 -62694 -55982 135993 -39067 226200 68470 -19392
19062 -175559 135103 -54792 243929 196136 352244 78373 -8402 -107778 112448 233010 128454
19051 128454 -210424 -4279 -9031 -25285 28146 -3336 -45028 -58261 227172 -248429 61000
19039 -273221 26807 119818 -83056 65070 -200219 37297 -219739 24440 1440 20809 269046
19028 269046 144483 -76957 -270581 -1043 -164284 114075 77771 135307 48582 -55104 214698
19016 72762 -206035 -470073 -331570 -163588 68644 -388337 -122254 -132750 -114057 -97827
19006 -97827 -122367 -78550 -181753 -126838 -114727 29068 13635 125696 121479 -91577 -402736
18995 -402736 89718 -45322 -355917 -65363 12161 43334 -26401 -113395 -206538 86826 -60411
18983A43381b66034J25576j5157A65253b037G914K00474o7272L50286b75526I3488
18971a84015m0784F1212J28511a11533A59512A5089P6933N9720d5117k66423J34267
18960a77273c2130l2522k58114c5498a7524d151q3351m0547m5871B03831C8584
18948d0380j57044g3103D2736b47277B19346K03985a39387j20577e0770H1563
18937c25680g2806j1252A90784a20449k04995a32683A84403a92375H205J65389
18927A73594J20816a19214A56243b25711i0030E3063b24253A2929c61154A37931
18916A39112R7788G0672O5264c4083m2015j59535p9263K6266b9186m87414a18036
18904b8561A25113b86593a10487j05711N3379L8489D50032i9973B18841A0646
$$ plain form
18983 143381 -266034 -140458 -155615 165253 -2037 7914 208388 141116 491402 -275526 93488
18971 -184015 -224799 61212 189723 -111533 159512 15089 92022 151742 -45117 -311540 -177273
18960 -177273 -32130 -64652 -322766 -35498 -17524 -4151 -87502 -128049 -173920 203831 38584
18948 -40380 -197424 -73103 42736 -247277 219346 423331 -139387 -259964 -50770 81563
18937 -325680 -72806 -84058 190784 -120449 -325444 -132683 184403 -192375 8205 173594
18927 173594 294410 -119214 156243 -225711 -90030 53063 -224253 12929 -361154 137931
18916 139112 236900 70672 135936 -34083 -76098 -235633 -314896 -288630 -29186 -516600 -118036
18904 -28561 125113 -286593 -110487 -216198 -162819 -124330 450032 -99973 218841 10646
18893a52753E1409a04608A58390P2767b97515I1103a69187J2310n866A0149J53659
18882A63808a02498j48079A27149a82397p296N7570N2364j10143p3624j7277g4445
18870b59645a0378p181m14A37871a82510d5736C30020b71239E2419N9196E0096
18858C46521b02701L3954B64084A8092a2654l7486j23326d6305J67B0110K7649
18847D7759R9956a51595m5238b6526a2393B27799D7776a04402j31669e5236A40361
18835A57012c1175F2881b44094a01055A7522a62187B4594h6147E604b13210A48961
18823c2548l9023j94592N0631d8929j25105E10018a51459P2052I7105a09026B53895
18811i5748c5236Q201k59645a23308a6079B10291p3049E303a20128M8181b4472
$$ plain form
18893 -152753 51409 -104608 158390 231157 -297515 91103 -169187 -156877 -162743 10149 163808
18882 163808 -102498 -250577 127149 -182397 -189693 -132123 -79759 -189902 -263526 -280803 -74445
18870 -259645 -10378 -17559 -17973 137871 -182510 -45736 330020 -271239 52419 111615 50096
18858 346521 -202701 -168747 264084 18092 -12654 -50140 -173466 -46305 -46138 20110 47759
18847 47759 147715 -151595 -196833 -26526 -12393 227799 47776 -104402 -236071 -55236 140361
18835 157012 -31175 62881 -244094 -101055 17522 -162187 24594 -86147 5604 -213210 148961
18823 -32548 -71571 -266163 -215532 -48929 -174034 510018 -151459 -79407 97105 -109026 253895
18811 -95748 -35236 -27035 -286680 -123308 -16079 210291 137242 5303 -120128 -71947 -24472
18799F0157a67097k69205f5037A08976Q261b140j02996A49681j6672k1073D4714
18787a90290D9028b41295A50285b82194o1349a25018a543l9562A11451j6592a17449
18775b87720h9458I7470k4231b37984L3075A37436i7768c3668F6600j5927a21684
18763c33693d2978o749A61020A7085a73349B73637j22070a00575c8068j14318
18753a52386l341A13562c14073i6444L8764b3821A42956b74223J34185B14147
18742d0177E9553f5072G2607i2224B52586c5864j35302d0656e516k8741A7950
18730f3299m5836B4260b17833D57534a65923L6440A72498a48155I9175i5478D326
18718d91635a81261D0255M6599a34871R141m3043r848A54425i3278d1459k99237
$$ plain form
18799 60157 -167097 -436302 -65037 108976 117237 -2140 -105136 149681 133009 111936 44714
18787 -190290 49028 -241295 150285 -282194 -343543 -125018 -1543 -41105 111451 94859 -117449
18775 -287720 -89458 97470 73239 -237984 -204909 137436 -97768 -33668 66600 50673 -121684
18763 -333693 -42978 -49727 161020 17085 -173349 273637 151567 -100575 -38068 -152386
18753 -152386 -155727 113562 -314073 -96444 -57680 -23821 142956 -274223 -140038 214147
18742 -40177 59553 -65072 72607 -92224 252586 -35864 -171166 -40656 -5516 -34257 17950
18730 -63299 -109135 24260 -217833 457534 -165923 -129483 172498 -148155 99175 -95478 4326
18718 -491635 -181261 40255 86854 -134871 -125730 -168773 -178621 154425 -93278 -41459 -340696
18707c40696h0314o8338A59043b83549A67378J52552j30921Q0716i2139j39877
18697b32016E389a60504A38582a92716B77668b83024a36678j59280J7653D5475
18686c10717j58030A61086d08820A76064P2447o0641B1392h4471r6742p3452k4782
18675b79447a22689B68279e8871K2422k65941a06793A17134J6487a40167l932
18665a44099K6477n2439B92910B5915f9731B23754a61502F524J52331a38944j28319
18654b67263f0221D4236a77360k6288i7182M7370m2410j24977g3220B61797a3446
18642A45825d6417r1391J5616i789l65944d9912j63033D3038K6882a03393E88004
18630a24798M5698B17911D3581a2084M233j88319c998I9317a33569J3370j48251
$$ plain form
18707 -340696 -80314 -148652 159043 -283549 167378 319930 189009 269725 -92139 -232016
18697 -232016 5389 -160504 138582 -192716 277668 -283024 -136678 -295958 -278305 45475
18686 -310717 -468747 161086 -408820 176064 248511 187870 21392 -84471 -181213 -254665 -279447
18675 -279447 -122689 268279 -58871 -36449 -302390 -106793 117134 133621 -140167 -144099
18665 -144099 -117622 -170061 292910 25915 -69731 223754 -161502 6524 158855 -138944 -267263
18654 -267263 -60221 44236 -177360 -203648 -97182 -49812 -92222 -217199 -73220 261797 -13446
18642 145825 -46417 -137808 -122192 -9789 -375733 -49912 -212945 43038 69920 -103393 588004
18630 -124798 -79100 217911 43581 -12084 -7851 -196170 -3998 99317 -133569 -120199 -268450
18619b68450a15447A4044J39623c19847F791a91851P6293j02862B21734d0152
18608B40681M7761b80823B39147c41776a59679g897l27218a7662j77971B02668
18597A13448e6083I6344b6115j536A93415K9260n5492a78579A67129a44028q9459
18586b33487F3811J66939a27909A77399a60187j5838A12134K12297b77397m5544
18576c22941d4663a5420n3830j20251B9481a66287l5151D3793g934j27331F5630
18564G0698i9363p8957m0074j90254J61249Q1363B15924B494J42635C84J7030
18553A7414c00553h5554B10883j03409m7502R1536a86008a5213D72749c03872
18542g656k63322Q2327j27239g0722A2772c3856F2873a55129A6692N9566e2325
$$ plain form
18619 -268450 -115447 14044 153667 -319847 6791 -191851 -115558 -218420 221734 -40152
18608 240681 288442 -280823 239147 -341776 -159679 -7897 -335115 -17662 -195633 202668
18597 113448 -56083 96344 -26115 -27651 193415 222675 167183 -178579 167129 -144028 -233487
18586 -233487 63811 230750 -127909 177399 -160187 -176025 112134 324431 -277397 -322941
18576 -322941 -44663 -15420 -69250 -189501 29481 -166287 -201438 43793 -7934 -135265 65630
18564 70698 -99363 -178320 -218394 -408648 -247399 -166036 215924 2494 145129 384 17414
18553 17414 -300553 -85554 210883 107474 59972 151508 -186008 -15213 472749 -303872
18542 -7656 -270978 -188651 -315890 -70722 12772 -33856 62873 -155129 16692 76258 -52325
18530A78638i7486A62998a93653K0963A11894f8623a5794A6699a26503A0278H91
18518a26862E5677f8521I5640a61084F3471a35995O2836B13390a98958h8241c8842
18506B72334c92423G2668b37066Q697q0998a06419j9909j50062a599n19096a84133
18494d19116b5086I5361b18158B19925l5227H3343A2714a07786c9258A15217b98604
18482c20707O0230F0546d47774c8088F9865a24294o4164a0217k4256I410g5595
18470C44140f6191B9337a0956k04821c3311I5889B4481J2449a23720O9H0233a3352
18457f2651o7546K2764A03491J74701a83952A24386d04530a90247O0470M6112
18447h3665E0058k4934b82589e4964H0262b15320D33276d31957g7386j42036A08394
$$ plain form
18530 178638 -97486 162998 -193653 -172690 111894 -68623 -15794 16699 -126503 10278 891
18518 -126862 55677 -68521 95640 -161084 63471 -135995 -73159 213390 -198958 -88241 -38842
18506 272334 -392423 72668 -237066 -228369 -309367 -106419 -126328 -276390 -1599 -520695 -184133
18494 -419116 -25086 95361 -218158 219925 184698 83343 12714 -107786 -39258 115217 -298604
18482 -320707 -260477 60546 -447774 -38088 69865 -124294 -188458 -10217 -34473 9410 -75595
18470 344140 -66191 29337 -10956 -215777 -33311 95889 24481 36930 -123720 -123651 80233 -13352
18457 -62651 -130197 -107433 103491 278192 -183952 124386 -404530 -190247 -129777 -83665
18447 -83665 50058 25124 -282589 -54964 80262 -215320 433276 -431957 -77386 -219422 108394
18435B37566n4809j1299L28212a14840B22412J07749a95507Q9141H9770a17613
18424g4005f602j64104B08989g3030A05100j8386a35485A75553q1583a493A49779
18412B46358d9434e815l92C00225H0111c43330F2212f9418H7528e3283j12069
18401a65352A17343d55536G2656J10926a0645A11304c4386I101b0303j44261j48686
18390c13250A29229e6336A49109l5158M8266c04009R107B39063d8918j47912A82704
18378I5636b49865B4341J58747a04525l7401l55293A01558k4956a05194A28169
18367b78063b1214K528p840A2404J13170A7194Q6912C90d09581a08145A7358b26322
18354H3016d21183F6490r44a57798c5017C0752J62435a51072e0749m2093k75269
$$ plain form
18435 237566 182757 171458 499670 -114840 222412 330161 -195507 -106366 89770 -117613
18424 -74005 -6602 -170706 208989 -73030 105100 86714 -135485 175553 93970 -1493 149779
18412 246358 -49434 -5815 -6207 300225 80111 -343330 62212 -69418 87528 -53283 -165352
18401 -165352 117343 -455536 72656 183582 -10645 111304 -34386 9101 -20303 -164564 -313250
18390 -313250 129229 -56336 149109 113951 162217 -304009 -294902 239063 -48918 -196830 182704
18378 95636 -249865 24341 183088 -104525 -141926 -497219 101558 76602 -105194 128169
18367 -278063 -21214 -18686 -26526 12404 125574 17194 104106 390 -409581 -108145 17358 -226322
18354 83016 -421183 66490 65546 -157798 -35017 30752 193187 -151072 -50749 -92842 -368111
18343c68111J57925P1980L2115p068B9035A4014b61960R3812c900j56254B81159
18331a66j52449b4383O276j86636E9473a10763N5353B9551a86351g7167A70404
18319A4010b42454A43518i065j1953l87048D5593L5659f9419l88056a76176C0033
18307b5304B02013f3206j41959d2657o6083q0763d1704I2362a96190B85333b25781
18295A68512c43533b2571A09510a13248k09857J02732a04058d6641D3163d95802
18284b39251A09570g4676o5827p2364M2988P7553K5182F3000b5190H7994b03702
18272c99594H6950L908b12601A41793a85610j37108F8504M8042B9972i1937A23130
18260H8957b12930i5155A08256h1505H4596b34243A7592c0201k4830o3988j72160
$$ plain form
18343 -368111 -210186 -138206 -106091 -113159 29035 14014 -261960 -168148 -3900 -160154 281159
18331 -166 -152615 -24383 -18107 -204743 59473 -110763 -55410 29551 -186351 -77167 170404
18319 14010 -242454 143518 -9065 -21018 -408066 45593 81252 -69419 -457475 -176176 30033
18307 -25304 202013 -63206 -205165 -42657 -108740 -189503 -41704 92362 -196190 285333 -225781
18295 168512 -343533 -22571 109510 -113248 -323105 -220373 -104058 -46641 43163 -495802
18284 -239251 109570 -74676 -140503 -212867 -169879 -92326 -67144 63000 -25190 87994 -203702
18272 -399594 86950 90858 -212601 141793 -185610 -322718 68504 116546 29972 -91937 123130
18260 88957 -212930 -95155 108256 -81505 84596 -234243 17592 -30201 -55031 -119019 -291179
18249b91179C8371a73650I0731b08404j15415p9775F1569a93702C9650L844a83253
18237F3700C631K34996b910o7769n2914I2520K339K06552a77270e8331A0648K28710
18225B39358d4424J5954I9796Q7780D0117b7838F449h6874A0122N7292L0359a82367
18212c32203A34270a47128G5013K36846f3274e65n8435B47993A07018b32069d268
18200F5853M0308J78965g4985A02421J13487a16979j42388a3628j27365h153o2081
18189g0234a7833A16282f4732C1023b32861D5286R0252b84762d2806j46710h1392
18177a28508o0007B82875q0210I1409a1706o617F7811a57597I5540l2792g1659
18165d13385a2079j42113L4816A66716a77977A9245a74673N002A57390J8727a25715
$$ plain form
18249 -291179 38371 -173650 90731 -208404 -323819 -403594 61569 -193702 39650 43494 -183253
18237 63700 3631 238627 -2910 -70679 -123593 92520 94859 301411 -177270 -58331 10648 239358
18225 239358 -44424 -28470 99796 187576 40117 -27838 6449 -86874 10122 67414 97773 -182367
18212 -332203 134270 -147128 75013 311859 -63274 -565 -59000 247993 107018 -232069 -4268
18200 65853 106161 285126 -74985 102421 215908 -116979 -259367 -13628 -140993 -8153 -70234
18189 -70234 -17833 116282 -64732 31023 -232861 45286 135538 -284762 -42806 -189516 -81392
18177 -128508 -188515 282875 202665 91409 -11706 -18323 67811 -157597 95540 62748 -71659
18165 -413385 -12079 -154192 -119376 166716 -177977 19245 -174673 -169671 157390 176117 -125715
18153B13237o2312N3382O681a08023d7263H9032a8823m46297e2069D8300A6247
18141A46082c2368k46665g8206j14560B17375p2968a1208l80522B07071R3099
18131C00170e1463m2016a7518J646A75262E2852a11855C54877a45038H9926M9754
18120A39680g6721j68489g6494r240r3262E6488K663P3879J13953e6172j65176
18109b21348A25842H997b97437I2024d3921j79321N9533j66423F6744J57628H4833
18097I9977b47861E3446b17617H8169g7158m6147c1947j15462B3883K9291k2349
18086C0825J99483k1111a99972d0681j69163R1175A7418b2933E7269a96071j4463
18075b10534J6853P9026j92039I4568h4298c7146A29090g6232j80216d4708i996
$$ plain form
18153 213237 150925 204307 210988 -108023 -47263 89032 -18823 -465120 -52069 48300 16247
18141 146082 -32368 -279033 -78206 -192766 217375 144407 -11208 -391730 207071 300170
18131 300170 -51463 -93479 -17518 -15872 175262 52852 -111855 354877 -145038 89926 139680
18120 139680 -76721 -245210 -76494 -85734 -178996 56488 59151 133030 246983 -56172 -221348
18109 -221348 125842 8997 -297437 92024 -43921 -223242 -163709 -330132 66744 224372 84833
18097 99977 -247861 53446 -217617 88169 -77158 -123305 -31947 -147409 23883 53174 30825
18086 30825 230308 209197 -199972 -40681 -209844 -118669 17418 -22933 57269 -196071 -210534
18075 -210534 -193681 -114655 -306694 94568 -84298 -37146 129090 -76232 -256448 -44708 -9996
18063B82829m0153b2490I8569P8171b72081J11711o6700a06343A73475a27353
18052A2497b66818R647H9001K36057J03834b29756a3879C18390j35727F1349d4884
18040a95084c9386k81075J02632d7499I3777D6325j909a79394E7224a5842G9747
18028a45018A09594a02258D4478f2275q6755L2999M5175c1833l05918K0230E9940
18016f4719q1870A67610K147H343a69693q4484M0784h5502k54320D1427J28283
18005A69710b55525L3154E4910a53850l4021p029M1127A36026a20921B10414b45349
17993a53298I8707m1818K0515B9519b41448a8611j13185m6263B34670a61153D5203
17981a57651j10053g7982C9133K424J53059i6565A06033k679B8989i9957d1768
$$ plain form
18063 282829 242676 -22490 98569 176740 -272081 -160370 -227070 -106343 173475 -127353
18052 12497 -266818 -257171 89001 325058 428892 -229756 -13879 318390 182663 61349 -44884
18040 -195084 -39386 -320461 -217829 -47499 93777 46325 44416 -179394 57224 -15842 79747
18028 -145018 109594 -102258 44478 -62275 -149030 -116031 -70856 -31833 -337751 -317521 59940
18016 -64719 -146589 167610 169757 8343 -169693 -254177 -213393 -85502 -339822 41427 169710
18005 169710 -255525 -222371 54910 -153850 -187871 -194900 -153773 136026 -120921 210414 -245349
17993 -153298 98707 56889 77404 29519 -241448 -18611 -131796 -178059 234670 -161153 45203
17981 -157651 -267704 -77982 39133 41557 194616 -96565 106033 103354 28989 -99957 -41768
17969d8122j2567A09355b1097I5551c06413A27783K76434j16687e7177B22852
17958b7678F963a83478k9673a00745I6194a47902L4625E8978f0272B67574K9193
17947B96767d82179a20095A0590e4105j9253j2313C1470a70706P3044k32972D1699
17935B4611O0494D0512f0163B40806c4291n2942j1484m5671G6075a86674J6075
17924a70599j19724J24299A78473J54298A13358b78392C79850A31651l3200e8197
17913C8689b40033j27857a58118B82623a43988o1235A18838n5144a7622A35114
17902b36954A08008c41749h0479j22448R7842k41686Q9421B07687a5450q7020
17892a02470B05992H279K5910i223k38506h0865A24339l0383b50009h2178r3914
$$ plain form
17969 -48122 -60689 109355 -21097 95551 -306413 127783 404217 287530 -57177 222852
17958 -27678 6963 -183478 -213151 -100745 96194 -147902 -113277 58978 -60272 267574 296767
17947 296767 -482179 -120095 10590 -54105 -73358 -85671 31470 -170706 -97662 -330634 41699
17935 24611 85105 40512 -60163 240806 -34291 -87233 -98717 -144388 76075 -186674 -170599
17924 -170599 -290323 -166024 178473 332771 113358 -278392 379850 131651 98451 -58197
17913 38689 -240033 -367890 -158118 282623 -143988 -205223 118838 63694 -17622 135114
17902 -236954 108008 -341749 -80479 -202927 -105085 -346771 -257350 207687 -15450 -102470
17892 -102470 205992 8279 34189 -9223 -247729 -80865 124339 93956 -250009 -82178 -176092
17881a76092A00772C1117K71959H6295f15851a60321A24529a80219M3998A06515
17870A57627a42902b659k49994A6016Q8749c6903G290c1505J1758q6836c1134
17858F3307J58446J93254F4484K11564A31017i0371l4185C3000J50238a05123
17847H9745g0625j09235L6362Q726A5370d8059j64096J00457A87941B4063a76994
17835B11904a10399F2747M7707a5352o074j59382D3444L42545a97821d1321A30692
17823a2235H1771L4522P4301B4496R0246a4233k42062J23237A10869a14983H0843
17811c07646a1673D8212K06478e1293B64161F717J30287b879j48259C9333a17911
17799b8333A46657J78934C6236a07791B30372a27591A97516b86499a22383E2580
$$ plain form
17881 -176092 100772 31117 303076 86295 -615851 -160321 124529 -180219 -136221 106515
17870 157627 -142902 -2659 -252653 16016 104765 -36903 7290 -31505 -19747 -106583 -31134
17858 63307 221753 415007 64484 276048 131017 -90371 -124556 33000 183238 -105123
17847 89745 -70625 -179860 -143498 -134772 15370 -48059 -212155 -111698 187941 24063 -176994
17835 211904 -110399 62747 110454 -15352 -21426 -180808 43444 385989 -197821 -41321 130692
17823 -12235 81771 116293 190594 24496 114742 -14233 -256295 -133058 110869 -114983 80843
17811 -307646 -11673 48212 254690 -51293 264161 6717 137004 -2879 -151138 39333 -117911
17799 -28333 146657 325591 36236 -107791 230372 -127591 197516 -286499 -122383 52580
17788a79734j16864B68799a32727J5691M9378A92041D8174a75117F9980B4148
17777d1334B0629K87395A3279L31375A16713b395C2209Q516K55137p4404a95924
17765d82200A29811a23839B4963b22753j5343A71674h5769q0787B0592N6424R2
17754G7108K2236L8697a4116j21422N7149B46285d3352j51334C4143K4054K08820
17743B67017A23595a80258B44152b34327R6313e6303B65173H4717c10216e6243
17732A14530a71969K0827O3610q573b5020B37144B9647o550P8600k5488M00986
17721D77195I5307e8788A9806a0920m3201j33189g318j3336A5624i7490h992o8699
17709g7691q1377A02837j2137M9777g4037A9084c13317C7027I912J96870n1628
$$ plain form
17788 -179734 -296598 268799 -132727 -117036 -67658 192041 48174 -175117 69980 24148
17777 -41334 20629 308024 13279 344654 116713 -2395 32209 40725 295862 221458 -195924
17765 -482200 129811 -123839 24963 -222753 -238096 171674 -85769 -166556 20592 77016 77108
17754 77108 99344 138041 -14116 -135538 -78389 246285 -43352 -194686 34143 58197 267017
17743 267017 123595 -180258 244152 -234327 -138014 -56303 265173 84717 -310216 -56243
17732 114530 -171969 -151142 -87532 -96105 -25020 237144 29647 23097 101697 76209 477195
17721 477195 95307 -58788 19806 -10920 -54121 -187310 -7318 -20654 15624 -97490 -8992 -77691
17709 -77691 -159068 102837 90700 140477 -74037 19084 -313317 37027 9912 206782 155154
17698A55154a17487A03534L01625C4134J28666d05543C0372O5774h9700E0839
17687i2825L0629B1201h3938A97354b6385B00957H8051Q644L2423a135A03562
17675b59479J1803A15008a41202L1483i77j51490k7671A93907A3064b00400F6981
17663a0043B8320J18631J19711g2197A79344a76479f7857B84611A31551l2067
17653I9484b50664a08778C55296A53485o0303d077B66519a0686k93955G7798a31930
17641b09772B9812g686q9904l19791i9863j82075A22980e962E7258g709k76588
17630b84297j06104D2253N8613a37534D4172R0382L5411C6473J98680b76044h4432
17618E6662g9025r4292c3574m1991A24370R9649o9742B2488g2951j70877a05669
$$ plain form
17698 155154 -117487 103534 405159 34134 162800 -405543 30372 96146 -89700 50839
17687 -92825 -62196 21201 -83938 197354 -26385 200957 88051 96695 129118 -1135 103562
17675 -259479 -247676 115008 -141202 -109719 -977 -152467 -180138 193907 13064 -200400 66981
17663 -10043 28320 146951 266662 -72197 179344 -176479 -67857 284611 131551 99484
17653 99484 -250664 -108778 355296 153485 93182 -4077 266519 -10686 -304641 77798 -131930
17641 -209772 29812 -7686 -97590 -417381 -99863 -281938 122980 -5962 57258 -7709 -284297
17630 -284297 -390401 42253 100866 -137534 44172 134554 169965 36473 235153 -276044 -84432
17618 56662 -79025 -173317 -33574 -75565 124370 224019 154277 22488 -72951 -243828 -105669
17606g2364C2228g8688j8346h137H1553b8077A49886b55793C11043a79861C18115
17594D15192A06731R5822e1656B05438d7665C22837A0247Q7650a58687P4617B34036
17582A97077a14921a1728A1049i7423p5089i443B25698L264a22169M9620j4370
17571h6919B58858d22588D322J05848r977K9686J77357b11322B03731c02673A33168
17559b61683A58291c0056l5388B75508d7492B25621O766b04480k17347a43085
17548b52296A30080o465C7170o248J04289J02268a98232N9759A21408h4060l3242
17537a17302B90841J71021a7942A06592b6431j8314B08892a9756D6345K32522
17527B78867a66400o4128C17171B5426L68273i2380g794C67432j59268a40907
$$ plain form
17606 -72364 32228 -78688 -97034 -8137 81553 -28077 149886 -255793 311043 -179861 318115
17594 415192 106731 202553 -51656 205438 -47665 322837 10247 97897 -158687 -84070 234036
17582 197077 -114921 -11728 11049 -97423 -172512 -9443 225698 228962 -122169 -72549 -86919
17571 -86919 258858 -422588 4322 110170 100193 129879 307236 -211322 203731 -302673 133168
17559 -261683 158291 -30056 -65444 275508 -47492 225621 232387 -204480 -421827 -143085
17548 -252296 130080 123615 37170 30922 135211 237479 -198232 -138473 121408 -84060 -117302
17537 -117302 290841 461862 -17942 106592 -26431 -44745 208892 -19756 46345 278867
17527 278867 -166400 -230528 317171 25426 393699 -92380 -7794 367432 208164 -140907
17516D8741N2882R6975k8875G6309b97216a8226B11810d04953f5754C04872A11089
17504f33k31096e3190H2242Q8886J0984b62548B9358m499J32169J34611R552L2591
17492C33782j04777a90821l4928Q3302a7731A35436E7788k3773K11560O5316b779
17480a22862C02312j7729A31908d1666C57669A70948o3494N5402J66436J44802
17470D74094D6387a84713H7917C9008J24028P0429J62756H7486g6606A9015K77424
17459B96439R6261A71579k1617O2940j8692q7748K99096j14580B9633L82834p4890
17448C37577F4171J5825R2400Q5273a07617M883H9239J82278b5721I4470L5225
17437A29695l5441a4934B18496I773M11164B2796K08706g404B47135F5586K8653
$$ plain form
17516 48741 101623 198598 169723 76309 -297216 -18226 211810 -404953 -65754 304872 111089
17504 -633 -231729 -53190 82242 171128 182112 -262548 29358 24859 157028 291639 301191 333782
17492 333782 229005 -190821 -225749 -142447 -17731 135436 57788 34015 245575 310891 -2779
17480 -122862 302312 284583 131908 -41666 357669 170948 107454 162856 329292 474094
17470 474094 46387 -184713 87917 39008 163036 233465 396221 87486 -76606 19015 296439
17459 296439 392700 171579 149962 212902 194210 106462 405558 290978 29633 412467 337577
17448 337577 64171 79996 172396 257669 -107617 -102734 89239 271517 -25721 94470 129695
17437 129695 94254 -14934 218496 9773 420937 22796 231502 -7404 247135 65586 94239
17426I4239b37259A73270L1726a4165C44390F6552a8374B18549b3627B72654k0901
17415B51753J6777L53541B09094N1742e8398B16383p1240L11513k13213m8292
17405A95151J14999i443A1319K06217j3147p181Q8588p9321C8467K27182B034
17393B26148J7251G0944J43825I7154k1546N37527G8224L74990H7460K48584J30641
17382D66685A91653m2105F2789J4271O2668J99884G9736k3394K28906A03192M7819
17371A51011b6416B40219i2763l65181B0879J67325L44867G5447l6032a36467
17360f9392D66469A45067K4128p1668L02934B6837P3366K51280p4130B1578L13670
17349C35248N5737b566A10236J60745a7533C68753j55233L0997o1347C6282N743
$$ plain form
17426 94239 -237259 173270 204996 -14165 344390 66552 -18374 218549 -23627 272654 251753
17415 251753 268530 622071 209094 260836 -58398 216383 145143 456656 243443 195151
17405 195151 310150 -9443 11319 217536 204389 197208 285796 206475 38467 265649 2034
17393 226148 243399 70944 214769 97154 75608 613135 78224 453214 87460 336044 466685
17382 466685 191653 149548 62789 77060 139728 339612 79736 56342 285248 103192 151011
17371 151011 -26416 240219 -92763 -457944 20879 188204 533071 75447 39415 -136467
17360 -69392 466469 145067 169195 97527 400461 26837 100203 351483 277353 21578 335248
17349 335248 390985 -2566 110236 270981 -17533 368753 213520 244517 183170 36282 42025
17338D2025L20819j54227B7766a14249I5242N817i2347j86712D2010L9101L66923
17327D48034M1050H6540R1805n9951n4485K0602J02981o7838L05777A95609J00803
17316B96412a43922e4801o9171B98530I0978b22220A18280J50698a86382B31281
17305A17062O8849o7505L21605B03051L1243A09897l2340K35904H3639K29927
17295C13566b6811D13289C0827K62027G1618L0701P1538C3851R8212E3431J39075
17284A92506a63283A93231L1836r0398g4967A57457I181J84677L11805B06504
17273A4004K8456J71344b6528A29252P5125o8098J37852J21412j93799J68435
17263C70179a55889D07836E3381K3065M43160A48229F2680M4655L3830E5573K37027
$$ plain form
17338 42025 362844 208617 27766 -114249 95242 101059 -92347 -279059 42010 81111 448034
17327 448034 489084 86540 178345 118394 63909 84511 187492 119654 425431 195609 296412
17316 296412 -143922 -54801 -123972 298530 90978 -222220 118280 268978 -186382 231281
17305 117062 185911 118406 440011 203051 234294 109897 77557 313461 83639 313566
17295 313566 -26811 413289 30827 292854 71618 102319 173857 33851 132063 53431 192506
17284 192506 -163283 193231 225067 134669 -74967 157457 9181 193858 505663 206504
17273 14004 42460 213804 -26528 129252 204377 136279 274131 395543 201744 370179
17263 370179 -155889 407836 53381 76446 519606 148229 62680 107335 141165 55573 292600
17252B92600o335d0045B3436L68424j06685d1834B2853M46274a90451B72395f198
17240a34630D91994B19038K15936j30343H4000J19225q2183J7313c8632A34286
17229A68461J8303m0880M67948G3278A496K51582J7834J21310a07544j70770A29025
17217B34629L15210a20757A96185K9522f0115A07338J76704L48798A37192J14175
17207B51367A12735L3132M9818m3087K46601D914J39725Q1363A06809L4430i620
17195e8407a9912C91402g2073B24022f0890D39784E8923J35880f8402D40720j94165
17184B46555a3475C67387J78076j74450C678R5152L32824A52273A4736K47158
17174B61894J15834p921j56179q4879J75586L6622K57152k84699o6902P295E4615
$$ plain form
17252 292600 286265 -40045 23436 391860 285175 -41834 22853 469127 -190451 272395 -6198
17240 -134630 491994 219038 434974 304631 84000 203225 121042 138355 -38632 134286
17229 168461 186764 145884 613832 73278 1496 253078 270912 392222 -107544 -278314 129025
17217 234629 549839 -120757 196185 225707 -60115 107338 284042 632840 137192 251367
17207 251367 112735 145867 195685 152598 399199 4914 144639 226002 106809 141239 -9620
17195 -58407 -19912 391402 -72073 224022 -60890 439784 58923 194803 -68402 440720 246555
17184 246555 -13475 367387 545463 371013 3678 98830 431654 152273 14736 261894
17174 261894 377728 369807 213628 128749 304335 340957 598109 313410 246508 253803 54615
17162E13867a12763F21423A84125Q3361m8009q5873J02916Q6656j016o7515N02805
17151G57450B47141L4186O9633n9221O6158a07740D00162A66141J06457k9524
17141B43074a43709B54447p4726J62697J63834k18563M9138I8497J34946A2034
17130E78990A33102J6203K15717J18564j92845m2490A22187K16905K21146I4564
17119D66782L21946C57652j5599F7025K47604j26682K44962m2455R0071j2834
17109D67691B05704J21565J857A48922K08782j54699L05056j70755L8700J74222
17099E50228j36713k3719m187k8941J19823o5132r3820M43049C71075j02472p2671
17088A95932K50221j65731j3620J28615k3332L09762C18757K62564B33209R5000
$$ plain form
17162 513867 -112763 621423 184125 267486 219477 133604 236520 323176 322160 254645 757450
17151 757450 247141 281327 350960 291739 357897 -107740 400162 166141 272598 243074
17141 243074 -143709 254447 179721 342418 506252 287689 336827 98497 233443 12034
17130 578990 133102 149305 365022 483586 290741 248251 122187 339092 560238 94564
17119 466782 788728 357652 342053 67025 314629 187947 432909 390454 480525 467691
17109 467691 205704 327269 329126 148922 357704 203005 508061 337306 376006 550228
17099 550228 413515 389796 385609 356668 476491 411359 317539 760588 371075 268603 195932
17088 195932 446153 280422 266802 395417 372085 681847 318757 581321 233209 328209
17078C28209J83265n7881j90521R5489J51926r2698j43019j0525J8983l0195Q2910
17067C35943K05236k53531M4357J99335R9564j97142H6507M96446o2746K22918
17057G43125A54677N12433C27962K67134J93428k59653q0443Q2665J4579J7211
17047E62883o7597j31427R0446R1025J4339j0630p6852J14639K5992J23891j26761
17036F09948N4437j27498J27207N4843r8901o447j57778K50617j22925q0880J52043
17025F54666j93631J66413P1463k27499M97K35191n2953k85906L42882K41685
17015I52808l85256K56354j74984l16196K49793Q9605J40924j78743L68769l86332
17005F16742N8983j64265J17951j2645L14109l75538P2619K31636m20522L12459
$$ plain form
17078 328209 511474 453593 263072 358561 510487 417789 274770 264245 283228 253033 335943
17067 335943 541179 287648 332005 531340 630904 433762 86507 582953 520207 743125
17057 743125 154677 667110 327962 595096 788524 528871 448428 531093 545672 562883
17047 562883 495286 363859 454305 545330 559669 549039 472187 586826 612818 736709 609948
17036 609948 664385 536887 664094 718937 620036 613589 455811 706428 583503 502623 654666
17025 654666 461035 627448 698911 471412 471909 707100 654147 368241 711123 952808
17015 952808 567552 823906 648922 332726 582519 672124 813048 634305 1003074 616742
17005 616742 675725 511460 629411 616766 930875 555337 627956 859592 439070 751529
16995G51529n4266L46617E13269K38308O4847j26103J00187j19483J99260J04541
16985I74826j63378o8207K56046l63961L02654J01653l73853J46455j76330L06549
16975I42454k16758J20705J83808k99479O516J83933p7689M3057N168M7805M2077
16964I81597n5184J39841L68207n00009l00201N93564j21482o7639o3485J53587
16954A128796K9751m055j70015j58773L87039k26747L90561m14038j35087m848
16944H22584L61923k17035J26012N2144j63250K07114Q0076J5817k79307J32739
16934A138817N8012L03616j08586l09214K28627N3832N8653j53812L13824N3674
16924A637443l92739l8495L51912K12884l92816k56077K00471J53610L52045n89743
$$ plain form
16995 751529 697263 1043880 513269 751577 816424 690321 790508 671025 870285 974826
16985 974826 811448 743241 999287 635326 937980 1039633 665780 812235 635905 942454
16975 942454 725696 846401 1030209 730730 737246 921179 843490 886547 891715 939520 981597
16964 981597 926413 1066254 1434461 934452 634251 1227815 1106333 1038694 975209 1128796
16954 1128796 1158547 1154492 984477 825704 1212743 985996 1376557 962519 827432 822584
16944 822584 1184507 967472 1093484 1145628 982378 1189492 1269568 1285385 1006078 1138817
16934 1138817 1196829 1500445 1391859 1082645 1311272 1365104 1423757 1269945 1583769 1637443
16924 1637443 1244704 1206209 1558121 1771005 1378189 1122112 1322583 1476193 1828238 1238495
16914A238495J76108L15379p7870j4557Q243K03565l49251K22833l03585J24862
16904A544222K4945J8880J2435K12546L62009m24686J70727l24813N82170m63352
16894A715083K86362k85230J13942L2668J89742J1483o9907R2005q2259J30080
16884B133969n8885l43744N57245L059k74872K66246m0769K25642o2591M2503
16874B447803J828l34828J67415K19961k02445j17646J61805K96862l22065K83531
16864B602221J68172j33106N4911L69558l17429Q0095M9729K12833R5230q8006
16854C094208k35811M60671k91560K60046O3076r1165K79990Q8129j62551K54524
16844C719557j99672j76721K40074L36894l89748P03379L004n05922J08381L72646
$$ plain form
16914 1238495 1414603 1729982 1652112 1637555 1645798 1849363 1500112 1722945 1419360 1544222
16904 1544222 1569167 1588047 1600482 1813028 2175037 1750351 1921078 1596265 2178435 1715083
16894 1715083 2001445 1716215 1830157 1862825 2052567 2064050 1994143 2086148 2003889 2133969
16884 2133969 2075084 1731340 2288585 2291644 2016772 2283018 2242249 2467891 2405300 2447803
16874 2447803 2449631 2114803 2282218 2502179 2299734 2182088 2343893 2640755 2318690 2602221
16864 2602221 2770393 2637287 2692198 3061756 2744327 2824422 2874151 3086984 3182214 3094208
16854 3094208 2858397 3319068 3027508 3287554 3350630 3259465 3539455 3627584 3465033 3719557
16844 3719557 3519885 3343164 3583238 3920132 3530384 4233763 4236767 3730845 3839226 4211872
16834D211872J88465Q8312q1839n9413K60893Q467J0224K67541N7777K35884l681
16823E184502J61043j59560J97835J30791R913J70006J93768L35088j63877K87157
16813F346666k65295L69079J1283M74776j82688J17452L52105J67519o5750O04095
16803G929242N6250j06596J23341o5710M79609P20985o5458L68443k54847N05316
16793I690575P4004M23765O166M96256L43139M02374J85396k0009N34146P25668
16783A2861480k6516N03735O3881Q49912k132P22089K26267N13998M39639O21729
16773A6774082P12846N08290M81082N27278O91666Q49052M44628J251420O26174
16764B2866518L54826J397651R18709Q60729J147854Q39676J741375P88361J260292
$$ plain form
16834 4211872 4400337 4488649 4406810 4347397 4608290 4616757 4626981 4894522 4952299 5188183 5184502
16823 5184502 5345545 5185985 5383820 5514611 5524524 5694530 5888298 6223386 6059509 6346666
16813 6346666 6081371 6450450 6461733 6936509 6753821 6871273 7223378 7390897 7325147 7929242
16803 7929242 7985492 7878896 8002237 7936527 8416136 9137121 9071663 9440106 9185259 9690575
16793 9690575 9764579 10188344 10194510 10690766 11033905 11436279 11621675 11601666 12135812 12861480
16783 12861480 12834964 13338699 13402580 14252492 14250360 14972449 15198716 15712714 16152353 16774082
16773 16774082 17486928 17995218 18476300 19003578 19695244 20544296 20988924 22240344 22866518
16764 22866518 23221344 24618995 25537704 26398433 27546287 28385963 30127338 30915699 32175991
16755C2175991J480387J823427J282835J608770J795960J985794J790150K136756
16747D6080070K642343K082946K473421K836137K395838L552043L318153L750902
16739F9131853L347187L745503M230184M429629M372398M728542N081840N157785
16731A04224921M963475N654187N656960N984621N372621N854446N478147N352672
16723A48542050N042030M767938M412598L214802K453014K124819J151432k1473
16715A71687210o60596k102570k791982l227272m238771m881948m866644n793781
16707A43123646n731172n364749n945135n581393n757568n509920n027484n061029
16699I9145196n238007m252056m490941m219635m034050l641488l725317l065805
$$ plain form
16755 32175991 33656378 35479805 36762640 38371410 40167370 42153164 43943314 46080070
16747 46080070 48722413 50805359 53278780 56114917 58510755 62062798 65380951 69131853
16739 69131853 72479040 76224543 80454727 84884356 89256754 93985296 99067136 104224921
16731 104224921 109188396 114842583 120499543 126484164 131856785 137711231 143189378 148542050
16723 148542050 153584080 158352018 162764616 165979418 168432432 170557251 171708683 171687210
16715 171687210 171026614 168924044 166132062 162904790 158666019 153784071 148917427 143123646
16707 143123646 137392474 132027725 126082590 120501197 114743629 109233709 104206225 99145196
16699 99145196 93907189 89655133 85164192 80944557 76910507 73269019 69543702 66477897
16691F6477897l628868k555288l124972k595422k322832k402632k305935j843972
16683D5697976k324348j519948k292018j179904j952718j746915j255516j147121
16675C2279488j454826j185439j112625j030415j171940j041901p13577j231515
16667B3337250o14162m90034j026412j081075n54415o69787q43216l13114l62409
16658A7382626p72672o59311l95997o18799m73853l20532o05351Q919n41302k78827
16648A2724901p19719l17153k91732k60696m03858m17680k35822m07544j31514
16639I539183L5473l41896l87592k74755k46032l35135l82711K82941J07290q09071
16629G187695o8014j41655J8095k53568R3587k16887l44330j78660r3759q2549
$$ plain form
16691 66477897 62849029 60293741 57168769 54573347 52250515 49847883 47541948 45697976
16683 45697976 43373628 41853680 39561662 38381758 36429040 34682125 33426609 32279488
16675 32279488 30824662 29639223 28526598 27496183 26324243 25282342 24568765 23337250
16667 23337250 22723088 22233054 21206642 20125567 19571152 18901365 18058149 17745035 17382626
16658 17382626 16609954 15950643 15554646 14935847 14461994 14141462 13536111 13545030 13003728 12724901
16648 12724901 12005182 11688029 11396297 11135601 10731743 10314063 10078241 9670697 9539183
16639 9539183 9574656 9232760 8845168 8570413 8324381 7989246 7606535 7889476 7996766 7187695
16629 7187695 7119681 6978026 6996121 6742553 6836140 6619253 6274923 6096263 6002504 5919955
16619E919955J09775j92527k9336p02378M68963l64817q3984J03124m61303M0376
16609D807848l59676K07452l0651l01483J1714j3889k71532Q8174n7195J40725
16599D221487m76071L81640m29525j0545J85768m97919K56059j62250L7620l27164
16589C179100r2969J01851J34457k26011k0918K17503l00754j9505m17192K33530
16579B789092M59646l64807m89334K93792K0432k2890j76586j75964K54635k43294
16569B344722O3989J75210p8750k80961J23136k48451L09697l00038p4988k6909
16559B006657m8965J74513J76050l71421R7006k18757N11673n64657O6174J05318
16549A933591j59034K16218k44881l0179R0806J95880k19825k58372n2746J08380
$$ plain form
16619 5919955 6029730 5837203 5807867 5105489 5574452 5209635 5125651 5228775 4767472 4807848
16609 4807848 4448172 4655624 4624973 4323490 4335204 4321315 4049783 4137957 4080762 4221487
16599 4221487 3745416 4127056 3697531 3686986 3872754 3374835 3630894 3468644 3506264 3179100
16589 3179100 3086131 3187982 3322439 3096428 3075510 3293013 2992259 2972754 2555562 2789092
16579 2789092 3248738 2883931 2394597 2688389 2708821 2685931 2509345 2333381 2588016 2344722
16569 2344722 2408711 2583921 2505171 2224210 2347346 2098895 2408592 2108554 2033566 2006657
16559 2006657 1957692 2132205 2308255 1936834 2033840 1815083 2326756 1762099 1828273 1933591
16549 1933591 1774557 1990775 1745894 1715715 1806521 2002401 1782576 1524204 1471458 1579838
16539A579838j03752K49890l57315M64153n58681L48867K57146l52611j45003
16530A382532N1810o451Q3986K02274k90832K25061k66106k85832L98181J82453
16520A677076l83166q0740J08664k49665K20766k60218J51678L98860m93231K33588
16510A323612j47455j04920L22016j86588j01557J75459k25528j41708M07754
16501A321085k32060k47082L35127k46657j0470M8750j47301q2652K28363K49800
16491A216903l57669p4102J74546r9756K63184l95229K03610j0081r9104P0395
16481H92697J42863k4814N9446k38636j9821j32028r2260j87295M48672Q0608
16471I29432k65355j0411L9632N8186J78830Q289k21472K7527l29105O5694j05668
$$ plain form
16539 1579838 1476086 1725976 1368661 1832814 1274133 1623000 1880146 1527535 1382532
16530 1382532 1434342 1427891 1511877 1714151 1423319 1648380 1382274 1096442 1494623 1677076
16520 1677076 1293910 1213170 1321834 1072169 1292935 1032717 1184395 1583255 1090024 1323612
16510 1323612 1176157 1071237 1393253 1206665 1105108 1280567 1055039 913331 1321085
16501 1321085 1089025 841943 1177070 930413 919943 968693 821392 738740 967103 1216903
16491 1216903 859234 785132 959678 859922 1123106 727877 931487 921406 822302 892697
16481 892697 1035560 1010746 1070192 831556 811735 679707 587447 400152 848824 929432
16471 929432 664077 653666 693298 751484 930314 938603 717131 744658 415553 481247 375579
16460C75579M37874r1830Q8996j78116o0013J08869r8821K93675k24236q2754
16450E69223J74783o7462o7628J40818J39812k4813k44271K51683k21660N7082
16440G07567j20153o2946J57017j10485j37857o8993j8018R669M1942N39426l33021
16429F04148j12944k3288J3259Q8197k6733j45271M12160l17397K0407r0620o0317
16418C61601J39298p276m299N9638j2602j54301N9227K27136P753J22759B46309
16406F63759B87466K59848C4046M51310B37010L42149N4778j38163L8767K85820
16396H20361k84673J28066k44285B07917K2680K29216J74759B12843K66219L4903
16386E13965p9298A77741L03241r3322J17529M29701B90099L9266m0420j32880
$$ plain form
16460 375579 813453 721623 810619 632503 572490 681359 582538 876213 651977 569223
16450 569223 744006 676544 608916 749734 889546 864733 620462 872145 650485 707567
16440 707567 587414 524468 681485 571000 433143 364150 346132 355801 397743 937169 604148
16429 604148 491204 467916 481175 569372 542639 397368 809528 492131 512538 421918 361601
16418 361601 500899 493623 489324 548962 536360 382059 441286 668422 676175 798934 246309
16406 663759 287466 547314 34046 485356 237010 579159 633937 495774 534541 820361
16396 820361 535688 663754 419469 207917 230597 459813 634572 212843 479062 513965
16386 513965 434667 177741 480982 387660 505189 934890 290099 329365 288945 156065
16376A56065p4975L58533r3714K06965j44674J49515j01874k0641J0013n2201
16366C93012Q7126j29740J86723B18369J38152L2928A84186N655M9537L29564
16356E68942B64012K84398a2136C97386E2749J84394G2606K40359j01488L93442
16346F04919k90877P7498o2751G7894K86953A75125J29490k3151K79788h764A4054
16334C9248K9698O19986C16547G5715J5391L71217k22243N0114J06905q4494p7260
16323B35345J00922j06392I1360B475J45575F6011K70812b15696F345J51692D6997
16311a77313I7544J72195k8115o0930F0766J82087q973J57558j45698J33528k9490
16300C49778j12757J10575o3903J47214j18442K1402G6917M3991Q1232H5920L15539
$$ plain form
16376 156065 81090 439623 345909 552874 408200 557715 455841 435200 445213 393012
16366 393012 480138 350398 537121 218369 356521 389449 184186 189841 239378 568942
16356 568942 264012 548410 -12136 397386 52749 237143 72606 312965 211477 604919
16346 604919 314042 391540 328789 77894 364847 175125 304615 281464 561252 -8764 14054
16334 39248 68946 688932 316547 75715 91106 462323 240080 290194 397099 312605 235345
16323 235345 336267 229875 91360 2475 148050 66011 336823 -215696 6345 158037 46997
16311 -177313 97544 269739 241624 180694 60766 242853 233880 391438 245740 379268 349778
16300 349778 237021 347596 283693 430907 312465 333867 76917 120908 202140 85920 401459
16289D01459j50589J54779A55433f9334B89575N7078q8877A13185J89204h5972
16278E8372K58272m3136h4307A55670j2690o682F0084J07167J0675J04899l9606
16267B43219J30788B7944K03487b6110C5585J59591J1638A2202a54064B16458
16256E3757M4429L38381j09308G3356J515a82773D2989b26562D8343R8428G0299
16244C28371j05463b00108A28192P2536F709J45902d1486G039R1556Q6143J13102
16233B97840q0154I7318K89139H4885N3575K48854c11133J32589d2842m9247E7893
16221D28697f8929K2126A59413E7669J33687b23751q1671B38516K1772c0223C3138
16209b24729A47600h9158A83807m5080f5197B14898q8436K66176b4430j9414B84292
$$ plain form
16289 401459 250870 405649 155433 -69334 289575 346653 257776 113185 302389 -85972
16278 58372 316644 273508 -84307 155670 142980 136298 60084 167251 177926 282825 243219
16267 243219 374007 27944 231431 -26110 35585 195176 206814 12202 -154064 216458
16256 53757 98186 436567 327259 73356 74871 -182773 42989 -226562 48343 146771 70299
16244 328371 222908 -200108 128192 200728 6709 152611 -41486 7039 98595 184738 297840
16233 297840 217686 97318 386457 84885 138460 387314 -311133 -178544 -42842 -92089 57893
16221 428697 -68929 -46803 159413 57669 191356 -223751 -305422 238516 260288 -30223 33138
16209 -224729 147600 -89158 183807 138727 -65197 214898 126462 392638 -24430 -43844 284292
16197H5364B6123O8753Q1345c3909A02027C3933m715J08996a1887A04472b8646
16185d8480j91487R4473e116C3485J6138k3751b3274A30143A2291a28577C7830
16173F7673M15397E5796i0325B48878A20627D9836K07983A22742N9616o6014N3474
16162A69818J92905B5376K03245C9982L03612a9314A02553a90416M9129n2611
16152a93898C04209D753i8771L2693B06056m0694a27318A09116D8886K47898n1353
16141B45431F9944b06183B57432d9227A54741o1288J00097C5359M6215a23677
16130E8054a06064A83264a36646A09773A0502i4952j9140A46265E4797M3318a8621
16118C22430I2845N9146g6358A6514L4984Q1669l4258a1895A10529b34379E9370
$$ plain form
16197 85364 26123 94876 176221 -33909 102027 33933 29218 138214 -11887 104472 -28646
16185 -48480 -239967 -145494 -5116 33485 49623 25872 -23274 130143 12291 -128577 37830
16173 67673 483070 55796 -90325 248878 120627 49836 257819 122742 182358 116344 169818
16162 169818 362723 25376 228621 39982 343594 -19314 102553 -190416 -141287 -193898
16152 -193898 304209 4753 -98771 -66078 206056 165362 -127318 109116 48886 296784 245431
16141 245431 69944 -206183 257432 -49227 154741 93453 193550 35359 81574 -123677
16130 58054 -106064 183264 -136646 109773 10502 -94952 -114092 146265 54797 98115 -18621
16118 322430 92845 151991 -76358 16514 51498 133167 98909 -11895 110529 -234379 59370
16106B70829j08190f8302j51367A47600h6142H380J43438F8640P9901G2451A6159
16094B76896B6136a35260L9031A32353J16811j16423J11432a9586j56262n5966
16084b31814k9585B56298a92978A93025b40657C19650I1379b464C3141J26517
16074A59658D8192A4911j793J15648g5176E2319K33307b52924C5922J57249l5882
16063A57289a04179j52969h2061C39974A66741B2266a25280A87754H1216A5144
16052G8389K50878A16451m3002J07057h2236b685I6903A6809f1468m2458j733
16041a05659B42155c2969I9851C0997h0907r2966L3429d9192n3113k7719r5551
16030b25575J11034E6023j4347j69a37627N6829I9047a3453j51144N5210H6601
$$ plain form
16106 270829 162639 -68302 -219669 147600 -86142 8380 151818 68640 148541 72451 16159
16094 276896 26136 -135260 -96229 132353 249164 132741 244173 -19586 -175848 -231814
16084 -231814 -261399 256298 -192978 193025 -240657 319650 91379 -2464 33141 159658
16074 159658 48192 14911 13118 128766 -75176 52319 285626 -252924 35922 193171 157289
16063 157289 -104179 -257148 -82061 339974 166741 22266 -125280 187754 81216 15144
16052 78389 329267 116451 73449 180506 -82236 -2685 96903 16809 -61468 -103926 -105659
16041 -105659 242155 -32969 99851 30997 -80907 -173873 -140444 -49192 -102305 -130024 -225575
16030 -225575 -114541 56023 41676 41507 -137627 -80798 99047 -13453 -164597 -109387 86601
16018A95627e3415m5905j19272N0707c0771A4533e9167p6730d3181I0932N5992
16007A46924g7134A1554a60792e483E0129P2365K4806o2786b21673j62791C03727
15995a04514j162M1470B77180c4315F45K52382j2482a3058A0045a33135A25865
15983a43346B97946k2232a50124A42116a603B77507e208A10250l2424J05011p2077
15972A10760i177A18967J79044a37640C0885d3471D3931O1646k1796K20848b23760
15960c54733i1887l8331H8709d01913a1028p5025E9873P7650a79715M9421n2660
15949a82954A76448a8731A27788a07443B29443q6674E3433c975k24665A09220
15938b9522A08921i7886B8234J55178b66940I9390g3472j3344c0641k98014L1590
$$ plain form
16018 195627 -53415 -99320 -218592 -167885 -30771 14533 -59167 -135897 -43181 90932 146924
16007 146924 -77134 11554 -160792 -5483 50129 122494 147300 84514 -221673 -384464 303727
15995 -104514 -105676 -64206 277180 -34315 645 253027 240545 -13058 10045 -133135 125865
15983 -143346 297946 275714 -150124 142116 -1603 277507 -5208 110250 77826 182837 110760
15972 110760 -9177 118967 298011 -137640 30885 -43471 43931 105577 83781 304629 -223760
15960 -354733 -91887 -130218 88709 -401913 -11028 -86053 59873 137523 -179715 -130294 -182954
15949 -182954 176448 -18731 127788 -107443 229443 142769 53433 -3975 -228640 109220
15938 -29522 108921 -97886 28234 183412 -266940 99390 -73472 -86816 -30641 -328655 -297065
15927b97065O5496K4481A62240R9197h5168p4145p8217f16I1858a00870r4279
15916a95149o3012P21M3920j5366a11147D365c58647a77215O6604d4528A85005
15904C81465e3682n9410E1098A1133K6351J73963M4710G0932J58806b72158P2674
15893a99484I8738b62982i3608m8760a6984H6099j1373a96724H7629c7031r4979
15882a32010F2404J29956g7975b7765j39607B49873b94411J05249L9913q1348
15872b30597q077C7753i4532C13292b92590N2372c4040l64298c059A03783C400
15860B63681b37256D8095b52827i2621C09982i1509m5269A27126h5861I5377b59633
15848G60L9847d25424a75164l9081G4040b67722d5762a0356A52169J1645a92119
$$ plain form
15927 -297065 -231569 -207088 162240 261437 -85168 -159313 -237530 -616 91858 -100870 -195149
15916 -195149 -258161 -257440 -213520 -228886 -111147 4365 -358647 -177215 -110611 -44528 185005
15904 381465 -53682 -113092 51098 11133 37484 211447 256157 70932 229738 -272158 -199484
15893 -199484 98738 -262982 -93608 -142368 -16984 86099 74726 -196724 87629 -37031 -132010
15882 -132010 62404 192360 -77975 -27765 -167372 249873 -294411 -189162 -149249 -230597
15872 -230597 -238674 37753 -94532 313292 -292590 -240218 -34040 -398338 -3059 103783 3400
15860 263681 -237256 48095 -252827 -92621 309982 -91509 -136778 127126 -85861 95377 -259633
15848 760 40607 -425424 -175164 -214245 74040 -267722 -45762 -10356 152169 163814 -192119
15836B29563J5417I6314b7762j47009C09981C2841J1114a66435Q2775j73866B02870
15824F917K31544E0347k3792a04755j89249I4413c15417j23135a9725C41678A5042
15812B04524c20079H5450J29952b75048A55083f6348A67572K68449B2889O1151
15802H4040a03177E6895a196l39868R0282A86301l0685O5467a40149J6360A74969
15790a03066m3792E9687a46746B63339e1165l5243H2391a89466N8943e1339A87017
15778b07822O8925B21667A09089a17630A47817b58801J01279A63145J87731j75167
15768A75709a33306l5058A29751a35100E8559J90831a74318A9480b45101Q0538
15758a64563A7694K8742N8784c4293E6464g1774b137q7298A62848a5021j71432
$$ plain form
15836 229563 244980 96314 -27762 -174771 309981 32841 43955 -166435 -83660 -257526 202870
15824 6917 238461 50347 26555 -104755 -294004 94413 -315417 -438552 -19725 341678 15042
15812 204524 -320079 85450 215402 -275048 155083 -66348 167572 436021 22889 84040
15802 84040 -103177 56895 -1196 -341064 -250782 186301 155616 221083 -140149 -123789 174969
15790 -103066 -146858 59687 -146746 263339 -51165 -86408 82391 -189466 -130523 -51339 187017
15778 -207822 -138897 221667 109089 -117630 147817 -258801 -157522 163145 350876 175709
15768 175709 -133306 -168364 129751 -135100 58559 249390 -174318 19480 -245101 -164563
15758 -164563 17694 46436 105220 -34293 56464 -71774 -2137 -89435 162848 -15021 -186453
15747a86453k48031J81673D3956c6969k69872R8168A62012e2785A24508a71194
15736a08959l46735J55304J06677N1092a3042p6390j42750A00618b6000j7941
15726d3941C4048a48630C80263A19521a37990d8648D6295M2820R4516c04464a21090
15714b01575b8843F3351a55516A71729d43k93798J45582J5296c1002A4590a82071
15702b88008a03096r1618B30321f0259j50844C62361j66573H9519J58075n4907
15692A92687a22495e2472B54276j20751a1779k3271n3924L486G6897a03390C90114
15680B91546j02850n0773J41205g1408A73105m8781o1031J20020a39185k9704
15670a68889c9025R852A27594q845e7730j05591A14864c972A62420f7079F5467
$$ plain form
15747 -186453 -434484 -252811 43956 -36969 -306841 -208673 162012 -52785 124508 -171194
15736 -108959 -455694 -300390 -193713 -142621 -13042 -89432 -232182 100618 -26000 -43941
15726 -43941 34048 -148630 380263 119521 -137990 -48648 46295 89115 183631 -304464 -121090
15714 -201575 -28843 63351 -155516 171729 -443 -294241 -148659 -133363 -31002 14590 -182071
15702 -288008 -103096 -194714 230321 -60259 -211103 362361 195788 89519 247594 192687
15692 192687 -122495 -52472 254276 133525 -11779 -35050 -88974 -85488 76897 -103390 390114
15680 291546 188696 137923 279128 -71408 173105 124324 63293 183313 -139185 -168889
15670 -168889 -39025 -29173 127594 118749 -57730 -163321 114864 -3972 162420 -67079 65467
15658e06566f5735F8477b53940j41149e3788j70502l60704B80164A27731b77846
15647h3922A54977c1907B7572N5567b67493e7095k32462A07647a00365E1230a63281
15635A72460Q0646a40263c0754d734k20548d6932A47783b81470A8358a87149A34205
15623A48134f1748j99272a1593j22081j2867C6217a04681I3366d26448A62007
15612b4719k94994a6941j2754B21987i8405A61125d24906A07070k2239a49603
15601e3657k43681A81400p6473C9032a060k30907K7582A31512a87088N0619l08087
15590d44556J19329A84110a85170B6814Q1030m7070n520K16591b65899d2924B06737
15578a75861A6303C062b61225A09766l0759C4848b04758P0924A45713f0797m79716
$$ plain form
15658 -506566 -65735 68477 -253940 -395089 -53788 -224290 -584994 280164 127731 -277846
15647 -83922 154977 -31907 27572 83139 -267493 -57095 -289557 107647 -100365 51230 -163281
15635 172460 253106 -140263 -30754 -4734 -225282 -46932 147783 -281470 18358 -187149 134205
15623 148134 -61748 -261020 -11593 -133674 -146541 36217 -104681 93366 -426448 162007
15612 -24719 -319713 -16941 -29695 221987 -98405 161125 -424906 107070 84831 -149603
15601 -53657 -297338 181400 104927 39032 -1060 -231967 -204385 131512 -187088 -136469 -444556
15590 -444556 -325227 184110 -185170 26814 107844 60774 55254 271845 -265899 -42924 206737
15578 -175861 16303 3062 -261225 109766 79007 34848 -204758 -133834 145713 -60797 -540513
15567e40513b17848L8536g2773r4886g3383b735D3208O5536i4711B20610a73713
15555b20023g2914K1855A09469k7480K02725G5787d8198q9778B95143M575c3754
15543A12135a77884c2177C3687M0173a52813D1338b27224F5869b49076J1853A71503
15531B14922a62241I7654e4963j4465j74536E0155j5854J50012h5622j39419A99350
15519a21912F0973a21162A36029a64553A97410g6841C34338H4612a32727I5473
15508i3458A89750h418A07193C4145a45646A49111b84438a3442B4014R4023b82003
15496b1794C78057A70223b90155A45567g2552K0354j60981h7735B43867b10292
15485a39986A669e4129k00784E0106g0921A08527J22111G0648b31781P7050A39564
$$ plain form
15567 -540513 -217848 -179312 -72773 -167659 -73383 -2735 43208 108744 -94711 220610 -173713
15555 -220023 -72914 -51059 109469 81989 284714 75787 -48198 -137976 295143 299718 -33754
15543 112135 -177884 -32177 33687 73860 -152813 41338 -227224 65869 -249076 -237223 171503
15531 214922 -162241 97654 -54963 -69428 -243964 50155 34301 184313 -85622 -225041 199350
15519 -121912 60973 -121162 136029 -164553 197410 -76841 334338 84612 -132727 95473
15508 -93458 189750 -8418 107193 34145 -145646 149111 -284438 -13442 24014 118037 -282003
15496 -21794 378057 170223 -290155 145567 -72552 -52198 -213179 -87735 243867 -210292
15485 -139986 1669 -54129 -254913 50106 -70921 108527 230638 70648 -231781 -154731 139564
15473d8266C08383h0360l57016g1704I4723a4339F2157a5339E3530K31998k5226
15462B60302a7425j5371B5863b47593e6879j16767B05997f8194r1973l2325N937
15451a86555A15814B904e1438k03825e6666m3261a4944C93127a94430G1787M089
15440G5876K54661G6214b1070k1701A20831J03952c2417B17770B9025Q6805a2961
15428A2110c668j69879H1088b60966C12328n7743a54668A71896N9890c46954k7347
15417c74301H6158e4761n495k122A68978b7851A08853g4060l38342e7286k10191
15406b67477D61911b83243h6175e24j49254d3630A06299g8365A58644e2481m055
15395e6536C46816K3646A36647e3644p8806A54591b55006C0252b4222k32618g068
$$ plain form
15473 -48266 308383 -80360 -437376 -71704 94723 -14339 62157 -15339 53530 285528 260302
15462 260302 -17425 -32796 25863 -247593 -56879 -173646 205997 -68194 -160167 -192492 -186555
15451 -186555 115814 2904 -51438 -255263 -56666 -99927 -14944 393127 -194430 71787 75876
15440 75876 330537 76214 -21070 -42771 120831 224783 -32417 217770 29025 115830 -12961
15428 12110 -3668 -173547 81088 -260966 312328 254585 -154668 171896 231786 -346954 -374301
15417 -374301 86158 -54761 -60256 -62378 168978 -27851 108853 -74060 -412402 -57286 -267477
15406 -267477 461911 -283243 -86175 -524 -149778 -43630 106299 -78365 158644 -52481 -56536
15395 -56536 346816 370462 136647 -53644 -132450 154591 -255006 30252 -24222 -256840 -7068
15383c24899F1688a95270A27497E8762L603b79206G3715h8695k42890e836C0297
15371C18166C9832J0958f4671A70132a14551k89793A26822J00698I2890a11276
15360i718C0911a25256m2959O5465M7912l7396q8373A69078b26811k10096J37747
15349b99160d9068B7218c8632A84059H3955b37319A02700J72J11104r4884a39653
15337c3801k03555A98677L1283A14901B7423a84447l7736C0655a05116A8784K58564
15326B77348p0031H6081b43642A07386k6372N8533b04966B36595I0345a58835
15315a4285m068B09400b0297r6897D1330g5964B80457a84211Q9442k78466J64271
15304b08964F7043j8465b24505G8827c05493D35898F8262K97129b2377B21705
$$ plain form
15383 -324899 61688 -195270 127497 58762 62365 -279206 73715 -88695 -331585 -5836 30297
15371 318166 39832 50790 -64671 170132 -114551 -404344 126822 227520 92890 -111276
15360 -9718 30911 -125256 -168215 -102750 -54838 -92234 -180607 169078 -226811 -436907 -299160
15349 -299160 -49068 27218 -38632 184059 83955 -237319 102700 102872 213976 119092 -139653
15337 -33801 -237356 198677 229960 114901 27423 -184447 -222183 30655 -105116 18784 277348
15326 277348 207317 86081 -243642 107386 81014 139547 -204966 236595 90345 -158835
15315 -14285 -18353 209400 -20297 -117194 41330 -75964 280457 -184211 -94769 -373235 -208964
15304 -208964 67043 48578 -224505 78827 -305493 435898 68262 365391 -22377 221705
15293C14666M9293c05855C98761m2423A10178A7079N86b32789D8199E98J54683
15282A55281a78821A08728a54753A4561a60671j67928A21890F270J20621A9624
15271a18270R139G8920J66614p7859Q209c15048H0218L4602a20919A61796A8830
15259i7804D40372A05202J66346L5410r6919l4459R2752k0398K69402Q3911N06752
15248A107999k31379J75102J1207C51717J61141A56515L0877r2877e043B2555
15237C39341l1189B7953H510J68904i7909A46209a04855D65482a9001B14118b2808
15225B23192b82942e3403j41233D13744a69787C29141A92L24142F2184J67318
15215B29502A12175h4035E8897L60232a03037j41913B27595L3787n1602A1847
$$ plain form
15293 314666 363959 -305855 398761 356338 110178 17079 17665 -232789 48199 598 155281
15282 155281 -178821 108728 -154753 14561 -160671 -328599 121890 6270 126891 19624
15271 -118270 -109131 78920 245534 167675 175884 -315048 80218 114820 -120919 161796 18830
15259 -97804 440372 105202 271548 306958 210039 175580 268332 247934 517336 601247 1107999
15248 1107999 876620 1051722 1062929 351717 512858 156515 187392 94515 -5043 22555
15237 339341 308152 27953 8510 177414 -97909 146209 -104855 465482 -19001 214118 -22808
15225 223192 -282942 -53403 -194636 413744 -169787 329141 192 324334 62184 229502
15215 229502 112175 -84035 58897 419129 -103037 -244950 227595 261382 209780 11847
15204a88210B73881a47587N0706A2749a72848I8079a4207I1177L9783J41212a09800
15192g6145A54570k5780b29906L1427C29572q0648b9712A79128f8675D14577A11962
15180A43645J52803A45292h7804k01737I7911K421c28718D27722A05811a24112
15169B70760j09819o7919J43238M1526d5219C01219H957K76330j02063d8649k33334
15158b81983I1698a24990a2413H520K44016k3447I1017J3508M25304b92598E920
15146B09942b19668P7405D39353a51191I7402k4332f8154G266L22051G9992K68031
15135C48023a76713A25511J15478a18060C7530a114A03001A3287Q4318J2747d96711
15123A82341a80222A85997a93955J9763l7624G6913K13154H7318b6981A41864
$$ plain form
15204 -188210 273881 -147587 -96881 12749 -172848 98079 -14207 91177 130960 272172 -109800
15192 -76145 154570 128790 -229906 -198479 329572 248924 -29712 179128 -68675 414577 111962
15180 143645 296448 145292 -87804 -289541 97911 100332 -328718 427722 105811 -124112
15169 270760 160941 93022 236260 277786 -45219 301219 8957 285287 183224 -48649 -281983
15158 -281983 91698 -124990 -12413 8520 252536 229089 91017 104525 529829 -292598 5920
15146 209942 -219668 -142263 439353 -151191 97402 73070 -68154 7266 329317 79992 348023
15135 348023 -176713 125511 240989 -118060 37530 -1114 103001 13287 97605 110352 -496711
15123 182341 -180222 185997 -193955 -174192 -211816 76913 290067 87318 -26981 141864
15112b10262i921j27459B16110J39334C6371M40397k22019G1967K00305F2866
15101C17127j18248K3279b35919A83006J32475f0028K2611B18311F1069J5852
15091G6921a00659B24504a2122E5950k7721M7438a7887H5101L20669A54554L11319
15080D65873j87331e543E45062A37015J58543j25765a4712E9481O2338J73564
15070B95383k8041B719J17269K12599K6226j49733i7195C26440A16948N4966J15902
15059B87816F4271d335A00267B2761L37873B3727J70838n6635P3794b551C5222
15047C07693P1594A40574J69226r4687J1913a7731C28226q6379a58357c7866B2155
15035C00315p8668P3574L3072L03339H3009N9438L0295R1834A25789M9307J83885
$$ plain form
15112 -210262 -9921 -137380 216110 355444 36371 476768 254749 71967 272272 62866
15101 317127 198879 222158 -235919 183006 315481 -60028 -37417 218311 61069 76921
15091 76921 -100659 224504 -12122 55950 28229 75667 -17887 85101 405770 154554 465873
15080 465873 278542 -5543 545062 137015 295558 169793 -14712 59481 121819 295383
15070 295383 267342 2719 119988 332587 358813 209080 -97195 326440 116948 171914 287816
15059 287816 64271 -4335 100267 22761 360634 23727 194565 137930 211724 -2551 35222
15047 307693 379287 140574 309800 215113 227026 -17731 328226 241847 -158357 -37866 22155
15035 300315 221647 295221 328293 631632 83009 142447 172742 264576 125789 175096 358981
15024C58981n7631J24362g9114A51958J27271H0579M4355J51688c7413B41784
15013I8171j8795O5058K4457D1809N051A1657K40289d7891B55750M04652B18286
15001G5172a18418C46858A64144K20844r5077L0290c0595B07605J00297F2491
14990D40574B7892K95091R5626A56095m1727h5440C31572M4405a17419D85183
14979A89291q3138L65140j97606i2166A15707K85860A34124C1690K41975f8568
14968G6816N1019N3131K48899k14458N4296a31383C4216M72539j27313A58171
14957E8197O4732K46219K632j82371Q8331J00033I8631L05172E2118J33298M6673
14946B32089p886c6782B73507J05341G3553J03865p626J20690K30746k58609K69559
$$ plain form
15024 358981 301350 425712 -79114 151958 279229 80579 124934 276622 -37413 241784
15013 98171 79376 144434 168891 41809 46860 11657 251946 -47891 255750 660402 218286
15001 75172 -118418 346858 164144 384988 289911 320201 -30595 207605 307902 62491
14990 440574 27892 322983 418609 156095 114368 -85440 331572 375977 -117419 485183
14979 189291 106153 471293 273687 -92166 115707 401567 134124 31690 273665 -68568
14968 76816 127835 180966 429865 215407 269703 -131383 34216 506755 379442 158171
14957 58197 122929 369148 371780 189409 277740 377773 98631 403803 52118 185416 232089
14946 232089 224203 -36782 273507 378848 73553 177418 169792 290482 521228 262619 532178
14935E32178j87740j55323a45285H754J05495J71138p2433a24575B93418l2486
14925B60932J40506J63972k39870l5618A33881J52959J63317k01738Q7136J3380
14915C48935j45011J02446j15215M00152k06726n5836F9693j3939L16244O0152
14905D32150j60008r2958M7048K17425j92217F3525J23722J2509I5212J51302
14895B46514J42850G2525J66701j6613J19839D9810K29813J66109K2024j48723
14885C19033j10154J98595A24346a10081A70256L91596j70532l2391A13542K04179
14875C17721K31867j31817r9129j23018L88193q6242K53549b483C96267L3743
14865D30010j80460J38449o0440j36181M03008A9543N50734L00493l80396j71058
$$ plain form
14935 532178 344438 189115 -145285 8754 114249 285387 212954 -124575 293418 260932
14925 260932 401438 565410 325540 289922 133881 286840 450157 248419 335555 348935
14915 348935 203924 306370 191155 591307 384581 328745 69693 55754 371998 432150
14905 432150 272142 179184 226232 443657 251440 63525 187247 199756 95212 246514
14895 246514 389364 72525 239226 222613 342452 49810 279623 445732 467756 319033
14885 319033 208879 407474 124346 -110081 170256 561852 391320 358929 113542 317721
14875 317721 549588 417771 318642 195624 583817 497575 751124 -2483 396267 430010
14865 430010 249550 387999 327559 191378 594386 19543 570277 870770 490374 319316
14855C19316j8070K19258j52392l4143J30999A39797M60396j17114P8941B34946
14844B36938J10520I8424M27995A32336K00353J19647r7364R3546J02809A92824
14833C30352L4408J22603J8982O5955J55319l07090J22315J28908m7100j37150
14823D87502j19928Q2295j03573J52193o3598G0270L59148p82J41262B01360J42913
14812C44273J63427p5181J03661k41745j7807J64763Q1193n4444R0014J94389
14802G52543C24713K51999A66693M38829N9350L4352q3864l4444k23905K19193
14792E76204F8309O79386k81760K78670k23901J36206B83631M27632k05615n8882
14782D46766O6655N44835D51447K04644o8557Q4116m1019m3108J05330j37729
$$ plain form
14855 319316 301246 520504 368112 333969 464968 139797 600193 483079 562020 234946
14844 236938 347458 98424 526419 132336 332689 452336 354972 448518 551327 192824
14833 330352 364760 487363 506345 572300 727619 420529 542844 671752 624652 487502
14823 487502 367574 449869 346296 498489 434891 70270 429418 428636 569898 201360 344273
14812 344273 507700 432519 536180 294435 276628 441391 522584 468140 558154 752543
14802 752543 324713 576712 166693 605522 664872 699224 615360 580916 357011 576204
14792 576204 68309 747695 465935 744605 520704 656910 283631 711263 505648 446766
14782 446766 513421 1058256 451447 656091 587534 671650 630631 587523 692853 555124
14772E55124J30634l37294n3802K22153J63888N3521k08939R3923J2841K17671
14762H49720l76315J41492j40452J55557q63O2836k70348J75361l5289L82872
14752I44571m31922L02223M8908j15161R599l17083K01554K38694J58290n02059
14742E37614j23335K66900K13853D08981K75989j5935j64239L76407k93022Q7418
14732F75599K7912j5744j4862P8299j06340M0040k76450N05353j84361j45179
14722E84267j6631N04870j37100k89459K15026j32843C26098O99111k19771M5701
14712H51139L8926l19462K4046K41453p4925K09761o0985p9148K04253j69496
14702H65562j07089K41328j38885M9927l3384r2111L05405k68569O8143r5622
$$ plain form
14772 555124 685758 348464 294662 516815 680703 734224 525285 619208 632049 849720
14762 849720 473405 614897 474445 630002 629139 691975 421627 596988 561699 944571
14752 944571 512649 814872 863780 748619 758218 441135 642689 881383 1039673 537614
14742 537614 414279 681179 895032 408981 684970 669035 504796 881203 588181 675599
14732 675599 703511 687767 672905 751204 644864 684904 408454 913807 729446 584267
14722 584267 567636 1072506 935406 645947 860973 728130 326098 1025209 805438 851139
14712 851139 890065 570603 594649 836102 761177 970938 909953 830805 1035058 865562
14702 865562 758473 999801 860916 910843 877459 785348 1090753 822184 890327 794705
14692G94705K00854J26586k94305K6211K64735j80206J86151p4298J28034k04731
14682I73736j75227l899M54270m58434J51701q3641L2341J47577o0092J52365
14672A130697l2013Q2952j89185l7421J9264N2795j59261q3519K28702J66642
14662A179653j42942K01317k79031Q4439J98249J63985n08517N78185j83642j76408
14652A115288K75065K7655m59631K43726J10757j18370K00948l53586L8574K09154
14642A289580m2172j4858R2527R5686l54306M17311j47848O1647l66434L2722
14632A063855M4723o3069N71220n99938J85477k716j86383N72884j90108k46430
14622A149515K038O05128o21740M57500k18338j39754K67121K29692m52680M39952
$$ plain form
14692 794705 995559 1122145 827840 854051 1118786 938580 1124731 1050433 1178467 973736
14682 973736 798509 794610 1248880 790446 942147 858506 890847 1038424 978332 1130697
14672 1130697 1098684 1181636 992451 955030 974294 1027089 867828 784309 1013011 1179653
14662 1179653 1036711 1238028 958997 1043436 1241685 1405670 897153 1475338 1291696 1115288
14652 1115288 1390353 1418008 958377 1202103 1312860 1194490 1395438 1041852 1080426 1289580
14642 1289580 1247408 1232550 1325077 1420763 1066457 1483768 1335920 1397567 1031133 1063855
14632 1063855 1108578 1045509 1616729 1016791 1202268 1199552 1013169 1586053 1395945 1149515
14622 1149515 1151553 1756681 1134941 1592441 1374103 1234349 1501470 1731162 1278482 1718434
14612A718434j18411m3553j05415m3781K89905Q2610j01324j31643M8023m5404
14602A549441j13012N05865p9540j26373L8628k14882p7217L63910r4278P7271
14592A829813k50591L95622O4069r7146k25489j12019J83521R277k07751M90957
14582B080263j04975k66333l9506J88599L69416m7665k82625N41901m41509O68827
14572B666393o34256n7855K28788j01273K56699J79064m46103N58108q089j18323
14562B523153L77583J8052K24521K42983j7824J93143M67864Q910L02716k9466
14552D311635P64755P56499J076233J727414L251079N589252J0199635M486660
14544C2163162j4182134H820420k990476j510925p91354J2713n28188k0282l0132
$$ plain form
14612 1718434 1600023 1556470 1451055 1407274 1697179 1779789 1678465 1546822 1594845 1549441
14602 1549441 1436429 1942294 1862754 1736381 1775009 1560127 1482910 1846820 1752542 1829813
14592 1829813 1579222 1974844 2038913 1941767 1716278 1604259 1787780 1797057 1589306 2080263
14582 2080263 1975288 1708955 1669449 1858048 2227464 2179799 1897174 2439075 1997566 2666393
14572 2666393 2032137 1974282 2203070 2101797 2358496 2537560 2091457 2649565 2641476 2523153
14562 2523153 2900736 2918788 3143309 3386292 3368468 3561611 4029475 4038385 4341101 4311635
14552 4311635 5076390 5832889 6909122 8636536 11887615 17476867 27676502 32163162
14544 32163162 17981028 8820420 5829944 4319019 3527665 3540378 3012190 2991908 2961776
14535B961776j06485j59834p3881N7054j05210l02746O14739l74945l1240K82572
14525B761800l5295N7919k93890n8000K61432M47494l76869p0332N048M3648o8092
14514B674863k00124L97134L48737m07493J29813J23866k20795R5096j32391L23036
14504C131742q4870r8079l41328M76818m967P0033p7142K98972j0878O6022q5425
14493C340898j80100L33513l8356K68146P0339l16843J54941k3914L27826m94279
14483C442171J48136J58115J85748m39485M15409J12699m19097K09920L22101
14474D135717q2948J02811P7223j08070L88933J41270k79466K16396l00829L50457
14464D641494J48783k2369k05772J56747j00100R1274K04289K0763k2992M96530
$$ plain form
14535 2961776 2855291 2695457 2621576 2678630 2573420 2270674 2885413 2510468 2479228 2761800
14525 2761800 2726505 2784424 2490534 2432534 2693966 3141460 2764591 2694259 2699307 2742955 2674863
14514 2674863 2474739 2871873 3220610 2813117 2942930 3066796 2846001 2941097 2808706 3131742
14504 3131742 3046872 2948793 2607465 3084283 3079316 3149349 3072207 3371179 3360301 3426323 3340898
14493 3340898 3160798 3494311 3455955 3724101 3794440 3477597 3632538 3608624 3936450 3442171
14483 3442171 3590307 3748422 3934170 3494685 3910094 4022793 3603696 3813616 4135717
14474 4135717 4052769 4155580 4232803 4124733 4513666 4654936 4375470 4591866 4291037 4641494
14464 4641494 4790277 4767908 4562136 4718883 4618783 4710057 4914346 4935109 4912117 5408647
14454E408647m44137L8988N06649r4462N3941L0381J45299q2847L61201n92828
14444E330832M35934J17180L94120j46036j44869J65900K67360l29122M56778
14435F548077L1266j51546R0381O4671L42247L08350j28210m9128K44633k50234
14425G050507M12729J07142k29431K93704j70935L60545N3485K93396K4735L43266
14415H539143R3603J27295P4637P0634J8830K84738J09153m4667J97153J14534
14405I585053M92356j43390J70840P6781K6119K32572N37833Q6972m3807L12196
14395A1333525P7390K23241l15691N38250L85849L34364m3677O54757n4602L81922
14385A3515328P7206O32412j19710K97548N32291m4454M45745K22749K88024K09200
$$ plain form
14454 5408647 4964510 5003498 5510147 5415685 5469626 5500007 5645306 5562459 5923660 5330832
14444 5330832 5766766 5883946 6278066 6132030 5987161 6153061 6420421 6091299 6548077
14435 6548077 6579343 6427797 6518178 6582849 6925096 7233446 7105236 7056108 7300741 7050507
14425 7050507 7463236 7570378 7340947 7634651 7463716 7824261 7877746 8171142 8195877 8539143
14415 8539143 8632746 8760041 8834678 8905312 8924142 9208880 9318033 9273366 9470519 9585053
14405 9585053 10077409 9934019 10104859 10181640 10207759 10440331 10978164 11065136 11021329 11333525
14395 11333525 11410915 11634156 11318465 11856715 12242564 12576928 12533251 13188008 13133406 13515328
14385 13515328 13592534 14224946 14105236 14402784 14935075 14890621 15336366 15559115 15847139 16056339
14375A6056339K94068L35099K01314O24501J59708K22186L96474M92405L89914
14366A9172008M60058K22717N30231N31080O76246K65701M57179O73303M05493
14357B3394016M31619P25274K10748O22928P02256P39165O29334Q95882M56462
14348B8807684R78436P40781N07060Q57618M94423J344454R18179M03484J145569
14339C6197688J091823R66048J324533J071863J267378R86230J582329J124856
14331D5612748J340792J738159J112540J944709J589195J651449J953865J972377
14323E8915834J558722K513592K079722K298483K434629K371491K990564L178081
14315G8341118K823370L157950L435666L546194L907003L918734L977628M349953
$$ plain form
14375 16056339 16350407 16685506 16886820 17511321 17671029 17893215 18289689 18782094 19172008
14366 19172008 19632066 19854783 20385014 20916094 21592340 21858041 22315220 22988523 23394016
14357 23394016 23825635 24550909 24761657 25384585 26086841 26826006 27455340 28351222 28807684
14348 28807684 29786120 30526901 31033961 31891579 32386002 33730456 34648635 35052119 36197688
14339 36197688 37289511 38255559 39580092 40651955 41919333 42905563 44487892 45612748
14331 45612748 46953540 48691699 49804239 51748948 53338143 54989592 56943457 58915834
14323 58915834 60474556 62988148 65067870 67366353 69800982 72172473 75163037 78341118
14315 78341118 81164488 84322438 87758104 91304298 95211301 99130035 103107663 107457616
14307A07457616N007720M881274N309937N737455N657883O298995O451011O979213
14299A53781104P257798P566477Q550625Q149237R446530R718421J0537254J0413023
14291B25420469J1349510J1920929J2358718J2540308J2745859J2217030J1852574
14284C10405397J0903501J0955083J1308383J0538653R868473J0222596J0473700
14277C84675786J0420311J0390238R970299R646163Q215455O198224L920863K186614
14269D45623953m08568n727403o530983j1363645j3330693j3852057j4310012
14262C80100592j3760509j3990601j2945947j3014247j2961818j2910856j1747884
14255B88768730j1345289j0841666j1130829j0134936j0577193j0463650r798223
$$ plain form
14307 107457616 112465336 117346610 122656547 128394002 134051885 140350880 146801891 153781104
14299 153781104 161038902 168605379 177156004 185305241 194751771 204470192 215007446 225420469
14291 225420469 236769979 248690908 261049626 273589934 286335793 298552823 310405397
14284 310405397 321308898 332263981 343572364 354111017 363979490 374202086 384675786
14277 384675786 395096097 405486335 415456634 425102797 433318252 439516476 443437339 445623953
14269 445623953 445215385 439487982 432956999 421593354 408262661 394410604 380100592
14262 380100592 366340083 352349482 339403535 326389288 313427470 300516614 288768730
14255 288768730 277423441 266581775 255450946 245316010 234738817 224275167 214476944
14248B14476944q496891q972945q146896p757748p718738o915141o476479o502755
14240A53489351o751066n811575n724811n463438m969670m830651m733593m399607
14232A10804940m674321l406857l669468m023306l275773l335673l286970l216630
14224H1915942l319755k356195k809583k491908k485663j903875k197382k647254
14216F1704327j769365k110664j545259j984424j433327j788804j579163j482021
14208D8011300j653190p95361j113868j767242j110956r95301j380015j080829
14200C8114538r12576j159286j180275p97303p97385j351945n49143q43687q41577
14191B9681361r07417m14240o73109j186528n46692q08767k81147o43077l04145
$$ plain form
14248 214476944 205980053 197007108 188860212 181102464 173383726 166468585 159992106 153489351
14240 153489351 146738285 140926710 135201899 129738461 124768791 119938140 115204547 110804940
14232 110804940 106130619 102723762 99054294 95030988 91755215 88419542 85132572 81915942
14224 81915942 78596187 76239992 73430409 70938501 68452838 66548963 64351581 61704327
14216 61704327 59934962 57824298 56279039 54294615 52861288 51072484 49493321 48011300
14208 48011300 46358110 45562749 44448881 42681639 41570683 40575382 39195367 38114538
14200 38114538 37201962 36042676 34862401 34065098 33267713 31915768 31366625 30522938 29681361
14191 29681361 28773944 28359704 27686595 26500067 25953375 25144608 24863461 24220384 23916239
14182B3916239p16558p42093o11278k55228n24965l49358j84704p67260o74526
14173A9090269J9611p10926m76495k6923m57952j72279q8650k40843o51578j45932
14163A6138302m93524m28286j45441j45125k98745j49108n88796J59066o99935
14154A3348408k03201j96416K83353q48897J88513l92132j6131k53425m90886
14145A1419186J6889k30299m24461L38028k40554m5259r3258j33712l95128j37382
14135A0074050l25076j70115Q6154J14397j03075o70132j32169r8273q8781k46102
14125H440878K88396m12331k59079j62359N49637m81728j81239n7774M3573l53641
14115G414333m6326K47237n80685M597k67043M4218O2368l34692L35626j41797
$$ plain form
14182 23916239 23199681 22457588 21846310 21591082 21066117 20716759 20532055 19764795 19090269
14173 19090269 19109880 18398954 17922459 17895536 17437584 17265305 17176655 16935812 16284234 16138302
14163 16138302 15644778 15216492 15071051 14925926 14627181 14478073 13889277 14048343 13348408
14154 13348408 13145207 12948791 13232144 12383247 12571760 12179628 12163497 11910072 11419186
14145 11419186 11436075 11205776 10781315 11119343 10878789 10833530 10740272 10606560 10211432 10074050
14135 10074050 9748974 9578859 9665013 9779410 9676335 9006203 8874034 8775761 8686980 8440878
14125 8440878 8729274 8316943 8057864 7895505 8445142 7963414 7782175 7724401 7767974 7414333
14115 7414333 7368007 7615244 7034559 7039156 6772113 6816331 6878699 6544007 6879633 6737836
14105F737836k9439n9656o7810j01685j52934M0609m1429o35393L86194K909j729
14094F077473m92862P961K57623l03687n0125N9837k65278L60889o48548M79599
14084E482882l92805j10772J17019j02775q584l17230K11605R9725j09450k87149
14074D582466J97427n18118O02461k39863j82840j32906j25575O6341j7815N0607
14064D282185l47665K57624k5717j076M3333k65413K11322P9155m47765L45704
14054D131687R7241k65760k08983k94785P9490N2798j17356M90173k51965l3436
14044C679104o49065M36838r7757k93435K97795k88518k36683M10397K3032Q313
14034C290021k25885m2542J87423k61989K53980j50242j06609J85620j12734k84973
$$ plain form
14105 6737836 6708397 6648741 6580931 6479246 6326312 6366921 6325492 5690099 6076293 6079202 6077473
14094 6077473 5584611 5592572 5850195 5546508 5496383 5556220 5290942 5651831 5003283 5482882
14084 5482882 5090077 4979305 5096324 4993549 4984965 4667735 4879340 4979065 4869615 4582466
14074 4582466 4779893 4261775 4864236 4624373 4441533 4308627 4183052 4249393 4231578 4282185
14064 4282185 3934520 4192144 4166427 4165351 4208684 3943271 4154593 4233748 3785983 4131687
14054 4131687 4228928 3963168 3754185 3459400 3538890 3591688 3474332 3964505 3712540 3679104
14044 3679104 3030039 3466877 3369120 3075685 3373480 3084962 2848279 3258676 3281708 3290021
14034 3290021 3064136 3021594 3209017 2947028 3201008 3050766 2944157 3129777 3017043 2732070
14024B732070K88561R6774n59656Q20681p01012K24953m5870k47859r7027N48241
14014C059856k18007k25569J93763o42227M40902k08410N6249l9422R7820j05228
14004B409727K37871k09205j24670N31650k69696l00697N96264J88469j72060
13995B887653q1210L73404J4931M02124L36093P36986J271807K243140M725876
13986A2910804R700517Q956727j0133248q602246m592672j505021j240768m08167
13978E085926n21562l73432n16326K07019l35522J566n97538J34474o26567K95741
13968B753779R5565L3866k46154k81696K63130L7519m26325L19090k82490Q0741
13958B347025J37915J00314n48716J58146j46895l6093L03003k0672k96839j97279
$$ plain form
14024 2732070 3020631 3117405 2557749 3378430 2677418 2902371 2856501 2608642 2511615 3059856
14014 3059856 2841849 2616280 2810043 2167816 2608718 2400308 2456557 2417135 2514955 2409727
14004 2409727 2647598 2438393 2313723 2845373 2575677 2274980 2871244 3059713 2887653
13995 2887653 2806443 3179847 3194778 3596902 3932995 4669981 5941788 8184928 12910804
13986 12910804 22611321 31568048 21434800 12832554 8239882 6734861 5494093 5085926
13978 5085926 4564364 4190932 3674606 3881625 3546103 3547669 2950131 3084605 2458038 2753779
13968 2753779 2849344 2883210 2637056 2355360 2618490 2656009 2229684 2548774 2266284 2347025
13958 2347025 2484940 2585254 2036538 2194684 2047789 2011696 2314699 2294027 1997188 1799909
13948A799909K32443P9871j09211L6112k1929k20379j67242K84480k76773L21840
13938A959121m1271l45000j15577M07904m8567l71319K83180P263k8360R5358
13928A802732L6358l08198J41005k6624m21248K79621J73768k1214J44528n0523
13918A750205r238k37585P1059j25026K2508j3643K17887j67260M1795r4778J9248
13907A475172K1651K33944n98429Q5190N21098k52807k66909j98075L24034J01413
13897A446282q3042K27969j95048R0128j16295q1353M2420R8796J2636K1166l72018
13886A091641M18303j04684M272K95862l07875l49033K59662L14174j45707q9779
13876A386836k89338k1211o7598j22010J34666L31009m50464M61953l02033J63882
$$ plain form
13948 1799909 2032352 2112223 2003012 2039124 2017195 1796816 1629574 1914054 1637281 1959121
13938 1959121 1917850 1572850 1457273 1865177 1816610 1445291 1728471 1735734 1707374 1802732
13928 1802732 1839090 1530892 1671897 1645273 1224025 1503646 1677414 1656200 1800728 1750205
13918 1750205 1740967 1503382 1574441 1449415 1471923 1458280 1676167 1508907 1550702 1455924 1475172
13907 1475172 1496823 1730767 1132338 1217528 1738626 1485819 1218910 1020835 1344869 1446282
13897 1446282 1363240 1591209 1396161 1486289 1369994 1288641 1331061 1429857 1442493 1463659 1091641
13886 1091641 1509944 1405260 1409532 1705394 1397519 1048486 1308148 1622322 1476615 1386836
13876 1386836 1097498 1076287 1008689 886679 1021345 1352354 901890 1363843 1061810 1225692
13866A225692k14025K10148k12936M7579k52061N35687k30252j29970J18782j43707
13856I54937N6344K76060m79147K26212j07318J65441J58511j21980K7087l36059
13846H20088Q39K4964N3578k30553L48666P9340l19205j05015K08654J69811l1624
13835A019543k2534p8011k13630L41287J81687m71382N9990J31357l2135K459
13825I18631j13350J6805K45796l57754K56161K40073k96121k282N2399k02490
13815G57868R1681P5451J01462j24679l66326K84470L76649m91545L12791o3259
13805I54563k01333r9120K04594n1655j66707K95720j86327K52305j59407K42850
13795A085483k80299j40306K03251l22447L97933k43346J70312M23212k17069
$$ plain form
13866 1225692 1011667 1221815 1008879 1056458 804397 1340084 1109832 979862 1098644 954937
13856 954937 1011281 1287341 808194 1034406 927088 1092529 1251040 1129060 1156147 820088
13846 820088 820927 845891 899469 668916 1017582 1096922 777717 672702 881356 1051167 1019543
13835 1019543 997009 918998 705368 1046655 1228342 756960 816950 948307 916172 918631
13825 918631 805281 822086 1067882 710128 966289 1206362 910241 907959 960358 757868
13815 757868 849549 925000 1026462 901783 535457 819927 1196576 705031 1017822 954563
13805 954563 753230 654110 858704 807049 640342 936062 749735 1002040 842633 1085483
13795 1085483 805184 664878 868129 545682 943615 700269 870581 1293793 1076724
13786A076724m57746J75017j53067j15385N04573m31312L47773m1585k84708L36658
13776I56942l31174K64523j87423k05365K55328L8241l43592K69409m9848k63742
13766D03299R4704K13952j71347M50360l96442L57089D48717J89425J41422l5016
13756G44548J88054D50127J94455J61945j0090j05361p9592O5170j22100M552
13746E59106M6889L47310k78266Q500j56029K22966k16488J6790Q5749k7348R6294
13735G05473M6413l45488J61106j14788P9574K38266k42126J63202J28749j71889
13725F48492L0106N2942k15093J55384J4540j9638j01078m9257M6772k17937M25132
13714G70365j87175J77027j9282B89054L61319j7137j74322O082L13871C51817
$$ plain form
13786 1076724 618978 793995 640928 525543 1030116 598804 946577 904992 620284 956942
13776 956942 625768 890291 702868 497503 752831 791072 447480 716889 667041 403299
13766 403299 498003 711955 540608 990968 594526 951615 448717 638142 779564 744548
13756 744548 932602 450127 644582 806527 796437 691076 611484 676654 554554 559106
13746 559106 605995 953305 675039 683539 527510 750476 533988 550778 636527 609179 705473
13735 705473 751886 406398 567504 452716 532290 770556 528430 691632 820381 648492
13725 648492 678598 731540 516447 671831 686371 666733 565655 516398 563170 345233 770365
13714 770365 583190 760217 740935 289054 650373 633236 458914 464996 778867 351817
13703D11300J27988p8148R8891K37413Q3574j78447j85409Q3997A46054M38688
13693E84742p6494j42612q6306R9599N2356p4086Q2327K2080J46210J47258k34332
13682E20742J39330B46630Q8385j25745J49192J20565B12119L19615A97786O32115
13672H29901C98344K8034K7837j04115L38151C28329l2441L18839O4768k81426
13662C98069l3577j08607J61128K80448j51393O5574k91236K27191P758J39345
13652F94700j53273j69568J08040Q24J18438p2295n7990J40019K73985C82567
13641D03175J65813k31700J73173B35843J72653j43290j23369J18119j26300O36996
13631G70652r1310C32704J64391r611m89q0226L8293j38607K15451K03525l02794
$$ plain form
13703 411300 539288 461140 560031 797444 881018 702571 517162 601159 146054 584742
13693 584742 508248 365636 279330 378929 431285 357199 439526 461606 607816 755074 520742
13682 520742 660072 246630 335015 209270 358462 479027 212119 531734 197786 829901
13672 829901 398344 426378 454215 350100 688251 328329 295888 614727 679495 398069
13662 398069 364492 255885 417013 697461 546068 611642 320406 547597 555355 694700
13652 694700 541427 371859 479899 480723 599161 526866 468876 608895 882880 382567
13641 403175 568988 337288 510461 235843 408496 265206 141837 259956 133656 770652
13631 770652 679342 332704 497095 487484 486995 406769 445062 306455 521906 725431 422637
13620D22637D4697L98575A67713K62547j45084K98544j67094J89869p8074A30964
13609D03452r973R1653B19508j5621K09311d4564B84794M0176O9817J5974k01078
13598B09683R9060O3598M7571j55275g356j05334B67126N6216J62421K23458k34696
13587D74525A86611L9970j02621N39314A93371C421L94217J44293k45077J15671
13577D12525J96306A33820L31262p9360a16377C16577d976C54248m06L79697j26945
13566F06594B50867o0894K16677A40841b3874B12088J08818L4307j67320n5072
13556A32821J04077K72692o9530Q6477j03332A89108K27838j92596P464J10476
13546C42290K4646q4441A41146J39530d9987C91609J62411J51401A61508K77554
$$ plain form
13620 422637 44697 443272 167713 430260 285176 583720 416626 606495 528421 130964
13609 403452 393479 485132 219508 203887 413198 -44564 284794 324970 394787 410761 209683
13598 209683 308743 372341 419912 264637 -7356 -112690 267126 323342 485763 709221 474525
13587 474525 186611 226581 123960 663274 193371 3421 397638 541931 296854 412525
13577 412525 608831 133820 465082 385722 -116377 316577 -4976 354248 353842 733539 606594
13566 606594 250867 189973 406650 140841 -23874 212088 320906 355213 187893 132821
13556 132821 236898 509590 440060 526537 423205 189108 416946 224350 231814 342290
13546 342290 366936 282495 141146 280676 -49987 391609 554020 705421 161508 439062
13536D39062j06667J31620N0011o4766p0462J7447j82840H5634K98754J22166
13526E06554A30947K11250M8954J64985L2497A33168R4320J0259k3873L25634
13516E39508C4776M28162B31222L12427B11968K16498A70732K75528A65319L34591
13506D99910A44334j5219R6100K63794A71991K03644E2104N47335A96444L35952
13496E32396A26046J47512J94130e7205F81639C5932M83759f4737B38804K06238
13486D45042A81122n4861a06824F7664K88579J13213P9548B28020k8282L6702
13476B36440A11675J23461M3956F6438J15657J48629A38258M89431k96376J2205
13466C43518A57694J48546J57455A58761n411g9021D93287A62078e9679j08930
$$ plain form
13536 439062 332395 464015 514026 449260 378798 396245 213405 85634 384388 506554
13526 506554 130947 342197 391151 556136 588633 133168 227488 237747 213874 539508
13516 539508 34776 462938 231222 543649 211968 428466 170732 446260 165319 499910
13506 499910 144334 129115 225215 489009 171991 375635 52104 599439 196444 532396
13496 532396 126046 273558 467688 -57205 681639 35932 519691 -64737 238804 445042
13486 445042 181122 126261 -106824 67664 356243 469456 549004 228020 199738 236440
13476 236440 111675 235136 279092 66438 182095 330724 138258 627689 331313 343518
13466 343518 157694 306240 463695 158761 153350 -79021 493287 162078 -59679 -168609
13456a68609G8488K01805P7934n3011N7542K3887I8544K50882N704p2027p1736
13445B11367K29432A04048j9177K79432L9269A23145K51775A35494J76273a06807
13434D09233j69608I7164J42240N0471q8776K45720A82253L72999k74008j4041
13424B67203j7645o4536K1171Q463q5436Q5300K57113H1430b5503A28540P3038
13413B01578B4921J48283a10657C97471j80342K75350k16670G8702J65029I0614
13402e4697D84473j14721J03211r2808j28503P2190j27670J0961I3787a67417
13391f0677B28993N6082N6373g5657D46968j69128I1921K33463I0813L53476j43004
13380C01285D8868K21321I7113J87667a17081B49018J36620A26894g5012C18509
$$ plain form
13456 -168609 78488 280293 358227 305216 362758 386645 98544 349426 355130 283103 211367
13445 211367 440799 104048 84871 364303 403572 123145 374920 135494 311767 -106807
13434 409233 239625 97164 239404 289875 201099 446819 182253 555252 281244 267203
13424 267203 249558 185022 206193 214656 129220 214520 471633 81430 -25503 128540 201578
13413 201578 24921 173204 -110657 397471 217129 492479 275809 78702 243731 90614
13402 -54697 484473 369752 472963 380155 251652 323842 196172 207133 93787 -167417
13391 -60677 228993 285075 341448 -75657 446968 277840 91921 325384 90813 444289 301285
13380 301285 48868 270189 97113 284780 -117081 249018 385638 126894 -75012 318509
13369B98729k4248O8096A43493K99079A10982Q9343K39999j24450A57799O3896
13359B21695k4117M4231K71465a83182C21885I6377C4567L28588d6919A4561N0354
13348F4915J63930j11697j6667K24469m663j7000J19134C4511J80054J47616A64255
13336d0734B30105g2017C13393G1096K04734m3063Q6526J19618k17658c3175B45405
13324D5702h1226K5284C35311j47630K44114A70683J26447D0432a76504B84980
13313C31616j54554F512M69467a5484A32970L24007A95781q3673f3102C09495
13302B78079N7834b18489B83413l9438K44711a17339B49234i6984C65892b70758
13291b4179B63173D3969M3193l2567K92518j72617a7178B16472B1103O2118J06385
$$ plain form
13369 298729 274481 342577 143493 442572 110982 200325 440324 315874 157799 221695
13359 221695 197578 241809 513274 -183182 321885 96377 34567 363155 -46919 14561 64915
13348 64915 228845 117148 100481 324950 320287 303287 422421 34511 214565 362181 164255
13336 -40734 230105 -72017 313393 71096 275830 232767 319293 438911 221253 -33175 245405
13324 45702 -81226 -55942 335311 187681 431795 170683 297130 40432 -176504 284980
13313 331616 177062 6512 475979 -15484 132970 456977 195781 112108 -63102 309495
13302 278079 335913 -218489 283413 243975 488686 -117339 249234 -96984 365892 -270758
13291 -24179 263173 43969 87162 54595 347113 174496 -17178 216472 21103 83221 189606
13280A89606N2379h5306b1022A27992a37589H919J76475d9903j01541g615D9277
13268B30312a87873C78700I4577g9948H7012P6308b12042C90044A26471b0749
13257C9925f7443A27146g5792A18039j2214J4065B8926L06873F0790i1405C21761
13245A1557L16997F762L63789D4353J86004K17095I7042C1832e0905B57589b72625
13233G254L39028j08742B1035K41255F8255J87882B089J30216B2382L35861A18991
13221A54433M5985I7445l0139R7201N0222a12353B78197J3796B835L21707a03866
13209E6352N2916m0721M0736N2060G0632A3424K22676L2441J06258f9529A09893
13197B90617N9649j36301a14834I7487M8925n2296J44681a63907A67995L5877
$$ plain form
13280 189606 241985 -85306 -21022 127992 -137589 8919 185394 -49903 -151444 -7615 49277
13268 230312 -187873 378700 94577 -79948 87012 163320 -212042 390044 126471 -20749
13257 39925 -67443 127146 -75792 118039 105825 119890 28926 335799 60790 -91405 321761
13245 11557 328554 6762 370551 44353 230357 447452 97042 31832 -50905 257589 -272625
13233 7254 346282 237540 21035 262290 68255 256137 2089 132305 22382 358243 118991
13221 154433 200418 97445 67306 164507 214729 -112353 278197 291993 2835 324542 -103866
13209 56352 109268 68547 109283 161343 70632 13424 236100 268541 374799 -69529 109893
13197 290617 350266 213965 -114834 97487 146412 94116 238797 -163907 167995 203872
13187B03872J4303K08082a74685A74465j1470a98894B11718K38855k22133p4983
13177A53457k9543K75356g8440K8965r1406D7404J07410P5248J5983A0037M3959
13166E3996K0880J50728r0623e5516K1419C01254r6842A438K85077g2425B47802
13154A4920L3623a59098j19554F9794J23695a8674B12432l0605J30062g4921A67242
13142a33236O5452C15666K51850B11957J1920A10249e19953C60568j47225a40992
13131B60572K208e2059A23734J68407R6325b16230D5604g6532j2777I2275B3379
13119a70191F5426L6022C2259Q2544k0475M35156e6526r5460e2596A80962b43450
13107B60809q2014b24389A57181J42041b96458O7420n4431I2142J21972K4985
$$ plain form
13187 203872 218175 426257 -174685 174465 162995 -198894 211718 450573 228440 153457
13177 153457 123914 399270 -78440 -49475 -140881 47404 154814 230062 246045 10037 53996
13166 53996 74876 225604 134981 -55516 -34097 301254 204412 1438 286515 -72425 247802
13154 14920 48543 -159098 -278652 69794 193489 -18674 212432 181827 311889 -74921 167242
13142 -133236 -67784 315666 567516 211957 223877 110249 -519953 360568 213343 -140992
13131 260572 262780 -52059 123734 292141 388466 -216230 45604 -76532 -89309 92275 23379
13119 -170191 65426 101448 32259 114803 94328 529484 -56526 -151986 -52596 180962 -243450
13107 260809 178795 -224389 157181 299222 -296458 -229038 -283469 92142 214114 239099
13097B39099o6467L8432a72342A37199g8292A1973J97471J58268A3199R770K213
13086B5182A1601K5725N7484b1482j31442g2997A43700a16529B45554q6478J44872
13075C03948p9528R7447P1285l0053c2054C52761a59496B24957M4784A0677K66566
13064B77243H3203B6567J03567l6195M0384C3185J20454P1892E6301a25403p4832
13053b00235D25919d7882c334A10657J93280k9708A06571K417A3419M20321A16977
13041B01388j4445b16659I2072J26015r7441f1907A16090P0306N5331g8864c1754
13029a57985A38710J08454d8364B94167b13430P9198O0334C240L6115A7297L40271
13018C57568I9017k9094J9188a33937E52187f9151c910A05200J12443m1282k6146
$$ plain form
13097 239099 172632 211064 -172342 137199 -78292 11973 209444 367712 13199 22969 25182
13086 25182 11601 37326 94810 -21482 -152924 -72997 143700 -116529 245554 159076 303948
13075 303948 224420 321867 393152 363099 -32054 352761 -159496 224957 269741 10677 277243
13064 277243 83203 26567 130134 93939 134323 33185 153639 225531 56301 -125403 -200235
13053 -200235 425919 -47882 -3334 110657 303937 274229 106571 108988 13419 433740 116977
13041 201388 186943 -216659 92072 218087 120646 -61907 116090 186396 241727 -78864 -31754
13029 -157985 138710 247164 -48364 294167 -213430 -134232 -73898 3240 39355 17297 357568
13018 357568 99017 69923 89111 -133937 552187 -69151 -3910 105200 217643 176361 150215
13007A50215N8900a07867C91683m9988H9872A1373j318M64029k27902K3516b9817
12995b5963k8392C24441a95404e6685B51663b36311D0776C74J18061f896I7050
12983a46184I1520f3643C76171J30779b6210H7746A8775a17273B13693o881n7369
12972A49443N6439a38883C2179J2998g5068b6642j92638A026K11522a5537C0339
12960I6797d22304J99104B37334O4781d969C90046a09666C2235J32542M9143E587
12948a31151D6887K50014g816A4815K97258j37118g6134o7768e3376B17036d0470
12936D12374d5676j57525A36309J10515F9254j419M133K8559a56767r1278A56172
12924b69820a1910k05582L9824c3661A42520F2397j2750N5687h5588D7512M07810
$$ plain form
13007 150215 209115 -107867 391683 341695 89872 11373 10055 474084 246182 269698 -29817
12995 -25963 -54355 324441 -195404 -56685 251663 -236311 40776 374 118435 -6896 97050
12983 -146184 91520 -63643 376171 506950 -26210 87746 18775 -117273 213693 206812 149443
12972 149443 205882 -138883 32179 45177 -75068 -26642 -219280 1026 212548 -15537 30339
12960 96797 -422304 -223200 237334 302115 -4969 390046 -109666 32235 164777 213920 5587
12948 -131151 46887 296901 -7816 14815 312073 174955 -76134 -143902 -53376 217036 -40470
12936 412374 -45676 -203201 136309 246824 69254 67835 71968 100527 -156767 -248045 156172
12924 -269820 -11910 -217492 -177668 -33661 142520 62397 49647 105334 -85588 47512 455322
12913D55322B06730a23902j26491c0390l4708H8851q915g5059g530A13049a90317
12901B30825a95691A36937k1902O1612b4651B513K35941j08709o3328N521B194
12889A48903P9034a66084I7586i470B80944c7064k39372E590J3914b81513A4852
12877D3792j5761b0369m3361k00229H8347b4468j7179r3188j18588B51292I4218
12865B40989a8749C16548a70571C55897A33139D0111a39515B89249a44763D52240
12854a13630k3393B35449q4285j4343O5690m8700e5101E80e4521F3519f6716G6893
12841a23386D5066O5266b50699D6999a52581G6045H963b02998A05233A35a08348
12829A4489c9978A00387F241g3791L3555k59858B3629i6141A56986l8988m1245
$$ plain form
12913 455322 206730 -123902 -250393 -30390 -65098 88851 79936 -75059 -7530 113049 -190317
12901 230825 -195691 136937 115035 176647 -24651 2513 238454 129745 66417 71938 2194
12889 148903 227937 -166084 97586 -9470 280944 -37064 -276436 5590 19504 -281513 14852
12877 43792 28031 -20369 -63730 -263959 88347 -24468 -41647 -134835 -253423 251292 94218
12865 240989 -18749 316548 -170571 355897 133139 40111 -139515 289249 -144763 452240
12854 -113630 -137023 235449 151164 136821 202511 153811 -55101 580 -54521 63519 -66716 76893
12841 -123386 45066 110332 -250699 46999 -152581 76045 8963 -202998 105233 135 -108348
12829 14489 -39978 100387 6241 -73791 -40236 -300094 23629 -96141 156986 117998 76753
12818G6753f5685a8781B34218e4443F7074a27344A69259d07444a77375i279j12484
12807a21763B11677A9203J34566J65595d6624G561K67118l8124c9607I7095L7894
12796A34989D6908a75915O0498j23204C46053I4949e1209I6225a76946B77011
12785A2622J37988K5184G7636b31764J5482A01386f6333l20496B29993L7562a97558
12773A49879M4721H7325P588c73650E064b88641g3278A2189P7369J24940c7834
12761e8407q8538N3041L2428m7887A53059M4963m8035j7807e2550A7091R1394
12750A08485P8159a19998I3905k4220L81193a26239A47387e2510A0067b31333
12739B5578J08164g5907j7768G3531J87300a8830O810B9766L25991a9366A47757
$$ plain form
12818 76753 -65685 -18781 234218 -54443 67074 -127344 169259 -407444 -177375 -9279 -121763
12807 -121763 211677 19203 153769 319364 -46624 7561 274679 236555 -39607 97095 134989
12796 134989 46908 -175915 -115417 -238621 346053 94949 -51209 96225 -176946 277011
12785 12622 150610 175794 77636 -231764 -216282 101386 -66333 -386829 229993 267555 -197558
12773 149879 194600 87325 94913 -373650 5064 -288641 -73278 12189 89558 214498 -37834
12761 -58407 -146945 -93904 -61476 -109363 153059 198022 149987 132180 -52550 17091 108485
12750 108485 186644 -119998 93905 69685 450878 -126239 147387 -52510 10067 -231333
12739 25578 133742 -75907 -93675 73531 260831 -18830 -12020 29766 355757 -19366 147757
12727a90267B0041i9690C630K66222J19117j01447b84843C17822n9822A2904a88823
12715a8974B41267k3448c7497B54783f7945F4077D506R7983m392k381N5611M5415
12703A96742J97G2122M9524b2276C99821a14322r852B08546a05412K709j20144
12692b22847I9508a18063A70613J040a31582J4331D537J03296L4607k8024J64891
12681B79307L9909A09882L22598B5598Q842j3881L112J67322J59081h5510A56062
12669b7243n7693B79732a20029d7307H0258J9966g3230A51177O2129q7020e4007
12657C099f819A05053Q8088p33M8561c9920n1194A61957j7653e1998H2529Q7497
12645A70026B2376c8103F7953J3243J43709P0033D6923b57600e9648C18049d0254
$$ plain form
12727 -190267 20041 -99690 3630 269852 388969 287522 -284843 317822 258000 12904 -188823
12715 -18974 241267 217819 -37497 254783 -67945 64077 4506 102489 98097 95716 151327 196742
12703 196742 196939 72122 121646 -22276 399821 -114322 -124174 208546 -105412 -102703 -222847
12692 -222847 99508 -118063 170613 171653 -131582 -117251 4537 107833 142440 114416 279307
12681 279307 319216 109882 432480 25598 34440 20559 23671 190993 350074 -85510 156062
12669 -27243 -84936 279732 -120029 -47307 80258 100224 -73230 151177 213306 126286 -54007
12657 3099 -6819 105053 193141 192408 240969 -39920 -91114 161957 144304 -51998 82529 170026
12645 170026 22376 -38103 67953 81196 224905 294938 46923 -257600 -59648 318049 -40254
12633h402k28163a1275D13292A44995F893J20168M7173L9884a40434F3252a38422
12621B74462q2029C8762K21813c7206A66398D7825P4824L28574a60641A68791
12610C74027j15146C8254g8663M274C07250I9995b89953J2643E731a06464c1814
12598A3502O8744c2797j5815A49327b02953b7471j14415d5801F9575p892N4994
12587A16677M3369J99910A40541a930j83147g1666C9967a67178N0391o0280k182
12576a79249A25141n6568L85824k05323A757M07771d498q5454b6415h847k6126
12565c4973j16800B81091d2633B2038Q9066B6351L3654i8993H6664B0252a53871
12553B10234A2905i7041K7827B47948o8304a2687A6329d4104k55538A19830c94122
$$ plain form
12633 -8402 -236565 -11275 413292 144995 6893 127061 174234 214118 -140434 63252 -138422
12621 274462 192433 38762 260575 -37206 166398 47825 122649 451223 -160641 168791
12610 374027 258881 38254 -78663 -74389 307250 99995 -289953 -277310 5731 -106464 -31814
12598 13502 82246 -32797 -48612 149327 -202953 -27471 -141886 -45801 69575 61683 116677
12587 116677 160046 359956 140541 -1930 -185077 -71666 39967 -167178 -116787 -177067 -179249
12576 -179249 125141 68573 454397 249074 1757 409528 -4498 -89952 -26415 -8847 -34973
12565 -34973 -151773 281091 -42633 22038 111104 26351 60005 -98993 86664 20252 -153871
12553 210234 12905 -97041 -69214 247948 179644 -12687 16329 -44104 -299642 119830 -394122
12541C00614j13099D627b6933m97346b0593B79773i4155B03026o2585a54108m289
12530a58397k3613E9333h900O37j16417A99225b43915A08992L889b25395J10677
12519a14718B15586R859a59429q529c4095B7783j992f3173J3108J9602G1471K2957
12507I4428b85298C3823b83994a24946A85267a80567M8302C60122A5144b10585
12496A11934a16000d0207A58731J60151b28027i3075l07390B69553A15305a7961
12485a76399c2322A07094b42348P3890C99038A66506F1408B1798I992g9042c2092
12473a58268G0372K5409c24135i1622B6766e9516j18859H1368J23858a8345A28137
12461B65685F3341J09079J38a12850A4264F999Q6265R288j1178a48534D7669Q862
$$ plain form
12541 300614 187515 4627 -26933 -524279 -20593 279773 -94155 203026 140441 -154108 -158397
12530 -158397 -182010 59333 -8900 -8263 -124680 199225 -243915 108992 112881 -225395 -114718
12519 -114718 215586 225445 -159429 -167958 -34095 27783 25791 -63173 -50065 -30463 71471 94428
12507 94428 -285298 33823 -283994 -124946 185267 -180567 -132265 360122 15144 -210585
12496 111934 -116000 -40207 158731 318882 -228027 -93075 -400465 269553 115305 -17961
12485 -176399 -32322 107094 -242348 -168458 399038 166506 61408 21798 9992 -79042 -32092
12473 -158268 70372 95781 -324135 -91622 26766 -59516 -178375 81368 205226 -18345 128137
12461 265685 63341 172420 172558 -112850 14264 6999 93264 102552 91374 -148534 47669 56531
12449E6531K5537J73859c4868A84J01184c0348j78888A62340a80807B07091q7787
12438A19304B6605K31568r4334J01563G8779c12680D7292d12424a64162o4094
12428b28256O3248j47040A28827c5587A13533d6768j24929I2988a1426A6807J75158
12417A91965c41187a27194B65027F2155R912c5882j36313f1871j75802e5750B1259
12405E1949L47910b6290k46084p4405F0624R0925a29916B65804d2559l9637A04555
12393b2403j25410r8069H6488a27570K4975B3757O6125j2493J46414a57387L8570
12382a18817c2712A21969R7748A08533a68343A27008P3956p3924L1526a77736
12371f4688H9785a14325J5546j1286d4319j29540F5855j7069a93527C4714M5023
$$ plain form
12449 56531 82068 255927 -34868 184 101368 -30348 -209236 162340 -180807 207091 119304
12438 119304 26605 258173 163839 265402 78779 -312680 47292 -412424 -164162 -228256
12428 -228256 -165008 -312048 128827 -35587 113533 -46768 -171697 92988 -11426 16807 191965
12417 191965 -341187 -127194 265027 62155 72067 -35882 -172195 -61871 -237673 -55750 21259
12405 51949 399859 -26290 -272374 -346779 60624 151549 -129916 265804 -42559 -82196 104555
12393 -22403 -147813 -245882 86488 -127570 -102595 23757 89882 77389 223803 -157387 -118817
12382 -118817 -32712 121969 219717 108533 -168343 127008 200964 127040 158566 -177736
12371 -64688 89785 -114325 -98779 -110065 -44319 -173859 65855 48786 -193527 34714 79737
12360G9737J31894K6814E5994a15557A41461D0745R1612K4593B6148b72759a06255
12348A0388J03550a37569B97347C3143p67J27936N6374h8775q3721C72690A18903
12336A64588c97340a1395M853A2358a4559j1788l39441a45800I8620L6139J69757
12325C04516a1101I5216R8134J42333A30397j4742P7370d0651I5850L7899J5831
12314A49580e0719n460m8573l7701B35664e5966a8598j41414k2931A34214O8721
12303B02935J34098c5045o4550C3795K68476j18234o9393B0541J38811C3998i7169
12291a43662K0820d37A46263b08160A84712e6667B57515A15551J94965A32951
12280H3270a07831c0694C58335j40695g7061q5089L8945e8917E6216b4510k41046
$$ plain form
12360 79737 211631 238445 55994 -115557 141461 40745 132357 156950 26148 -272759 -106255
12348 10388 113938 -137569 297347 33143 32376 160312 216686 -88775 -172496 372690 118903
12336 164588 -397340 -11395 -6542 12358 -14559 -26347 -365788 -145800 98620 134759 304516
12325 304516 -11101 95216 193350 335683 130397 115655 193025 -40651 95850 133749 149580
12314 149580 -50719 -56179 -104752 -142453 235664 -55966 -18598 -160012 -182943 134214 202935
12303 202935 337033 -35045 -99595 33795 302271 184037 114644 20541 159352 33998 -97169
12291 -143662 -122842 -437 146263 -208160 184712 -56667 257515 115551 310516 132951
12280 83270 -107831 -30694 358335 217640 -77061 -162150 -123205 -58917 56216 -24510 -265556
12269b65556a28242H803a23576A27330J1810b48510C460J33457e469j71484A70371
12257E7713k1662f6886j04488C23982a40177A81940o8326J64001A09005c6800
12246I6022K26969m5857p7756i5773A81040c5264D906P1071N1836E0932j3357
12235C7575K30982j14356A3240N4553J2287J83120g5269m8898D03190b3676j7867
12224d1543g691G2244A1348c22394A26186K0208N48519a2008k1456B43781Q2121
12213C25902a57955A97325M7238N3024m131j132r7986m8147D6906J22668J85395
12202C54969A65832J74061J6244b4152m5583A12836J61572j03073q1412a1270
12191H9692c08465B2700J0856O8604J70511l2506e4863b2913I7221o820J24977
$$ plain form
12269 -265556 -128242 8803 -123576 127330 139140 -248510 3460 136917 -5469 -176953 170371
12257 57713 36051 -66886 -171374 323982 -140177 181940 113614 277615 109005 -36800
12246 96022 322991 277134 199378 -95773 181040 -35264 4906 75977 127813 50932 37575
12235 37575 268557 154201 13240 67793 80080 263200 -75269 -124167 403190 -23676 -41543
12224 -41543 -7691 72244 11348 -322394 126186 146394 694913 -12008 -33464 243781 325902
12213 325902 -157955 197325 244563 297587 293456 292324 194338 146191 46906 169574 354969
12202 354969 165832 339893 356137 -24152 -69735 112836 274408 171335 89923 -11270
12191 89692 -308465 22700 33556 102160 272671 240165 -54863 -22913 97221 90401 215378
12180B15378a70795B59929A05014a45939D14671A40359M2769a50547A01185M8685
12170A49870d8665b1904r7516C7228J67717H5566e4212B01398d83761A32682a0218
12158b5269B45816J06823A53957c7365B15001e9277B56263a55342P0975B26132
12147B6071M66858B11501a72559c78B28680r2368a10741A71383D5941O7598J31650
12136B45189r7399c05171F2908a17703B2709a87042A17390E6984K2526J98788
12126B78298a43116D2671i6352B07111B0135a04074L3255B14224g2416j17265
12116a89681B4065f1089a6173k10954A26316m5836a5131l38903C26577d33869
12105A11722L25705g7071E5922P013a79548C8371a52867B725b01669A75939C1186
$$ plain form
12180 215378 -170795 259929 105014 -145939 414671 140359 183128 -150547 101185 149870
12170 149870 -48665 -21904 -119420 37228 204945 85566 -54212 201398 -483761 132682 -10218
12158 -25269 245816 352639 153957 -37365 215001 -59277 256263 -155342 -84367 226132
12147 26071 492929 211501 -172559 -378 228680 136312 -110741 171383 45941 113539 245189
12136 245189 147790 -305171 62908 -117703 22709 -187042 117390 56984 79510 278298
12126 278298 -143116 42671 -96352 207111 20135 -104074 -70819 214224 -72416 -189681
12116 -189681 24065 -61089 -16173 -227127 126316 80480 -15131 -354034 326577 -433869
12105 111722 437427 -77071 55922 62935 -179548 38371 -152867 2725 -201669 175939 31186
12093b24847B06379a36192F6606a82170g1567q9123a0325j2429p3223A95717h066
12081A53932c87855E9253H254J77827j1698l9926J37506N50273P83016E34104
12070C04833A50014J05137M2267L3731B4953K28596A3596J05577a45300M3610
12060a01690j4583j14096C27533a07272N3200n1354M7454C4160J93941G6822J35260
12049B12082I0287b33719B39793C7325J73790c75904J05279i3819j42547J12953
12039a23413H3773c5938B21683m5689c2947C5887a89204h0650l3218K8560I3838
12027d4752A87725a32715b6449j39049F1538J32108b8380A92170G7846a39993
12016a8132j58229B51300a0820r1640k26425N0149i2858k2495j71262M0911h7394
$$ plain form
12093 -224847 206379 -136192 66606 -182170 -71567 -160690 -10325 -22754 -95977 195717 -8066
12081 153932 -387855 59253 8254 186081 174383 134457 271963 822236 1605252 534104
12070 304833 150014 255151 297418 331149 24953 253549 13596 119173 -145300 -101690
12060 -101690 -116273 -230369 327533 -107272 -54072 -105426 -57972 34160 228101 76822 212082
12049 212082 90287 -233719 239793 37325 211115 -375904 -270625 -93819 -236366 -123413
12039 -123413 83773 -35938 221683 175994 -32947 35887 -189204 -80650 -113868 -85308 93838
12027 -44752 187725 -132715 -26449 -165498 61538 193646 -28380 192170 77846 -139993
12016 -18132 -176361 251300 -10820 -102460 -328885 -278736 -92858 -115353 -286615 -245704 -87394
12004A86283a16332A16007a12814A87070p0108b15210e9090j92483O876G7176
11993H1305L2520J45714d2218m03445g1307D2648i0956C67402F1134h7802F7561
11981e696o99155A73334Q3260E5872P4697n6259c7314J1339C41567f6044F5595
11969A75034f4696a4031A87963c8753H5146a34489D30447D8995d2624j12345a643
11957a97688D1337P9017j7955a05533p0953n6955i2454M827B25565b04142F5112
11945D8642c3214k7161r7184A54255a18374m405k51258i0176E3203b91675A25095
11933f0541j19892N9283E1733O7859c72723J17145Q6219g4598E1800a71756r298
11922a81054B54221E9178F796J91031O9883b3589C08647q6535a29834c7431j05849
$$ plain form
12004 186283 -116332 116007 -112814 187070 116962 -215210 -59090 -251573 -244697 77176
11993 81305 113825 259539 -42218 -445663 -71307 42648 -90956 367402 61134 -87802 67561
11981 -5696 -704851 173334 256594 55872 130569 74310 -37314 -25975 341567 -66044 65595
11969 175034 -64696 -14031 187963 -38753 85146 -134489 430447 48995 -42624 -154969 -1643
11957 -197688 41337 120354 102399 -105533 -176486 -233441 -92454 -87627 225565 -204142 65112
11945 48642 -33214 -60375 -157559 154255 -118374 -122779 -374037 -90176 53203 -291675 125095
11933 -60541 -180433 -121150 51733 119592 -372723 -255578 -169359 -74598 51800 -171756 -181054
11922 -181054 254221 59178 6796 197827 267710 -23589 308647 222112 -129834 -37431 -143280
11911a43280P846e4579A41635d9380D0509a12367r7233B51794C4193D595i6742
11899B6182K75860i8464A32240D2404O3655D6749Q0066K35307c1696r9012B7165
11887b29242J12353C25782b78286D3431a25373d1144k51078a07339A64987b25190
11876a48979B65031G3021a75635a3084B38828f5156j215B13411a10641a6979F0533
11864A16371a54530k1894A93166b52603B60041b2399j7097a7156A80275d862l925
11853h787B7099J28406B8065I361b01361i0615A49873K12730b66874c6479A56028
11841a61182A8231R4177d6741A23523A3194K72937b88644J03093B4351a03961
11830a08138A34493a75535d3465j72820l39061B67613a68146n3677i2554p4555
$$ plain form
11911 -143280 -135434 -54579 141635 -49380 40509 -112367 -209600 251794 34193 4595 -96742
11899 26182 302042 -98464 132240 42404 106059 46749 126815 362122 -31696 -130708 27165
11887 -229242 -116889 325782 -278286 43431 -125373 -41144 -292222 -107339 164987 -225190
11876 -148979 265031 73021 -175635 -13084 238828 -65156 -66371 213411 -110641 -16979 60533
11864 116371 -154530 -176424 193166 -252603 260041 -22399 -39496 -17156 180275 -4862 -8787
11853 -8787 27099 155505 28065 9361 -201361 -90615 149873 362603 -266874 -36479 156028
11841 -161182 18231 112408 -46741 123523 13194 286131 -288644 -185551 24351 -103961
11830 -108138 134493 -175535 -43465 -216285 -555346 267613 -168146 -221823 -92554 -167109
11820a67109A6308G477J52021a46129B75458b5134n2725D383c12004j0313A58016
11808A38797j932L5177G9033C530J58161F8270e5625k53747A2314g7512k0821
11797i8333j1110j46572l0388a106C1552j3185J59439P5649a37359H9104b18668
11785b49764A1284a29534j00997m008e8905G9018a58570j25720E109J11073b58454
11773a75995H2773L749a78173A08935d9971j80657A92307c663k47294B28482c6268
11761B91852e7123j06135j35969A25234b79485A75669E007d4206j48549e5928
11750i3503G1833a13662b2386E1155k4002b6393j98030P1090B3728a24814B0901
11738I5765g9406F726e2260n0245K7120A56486a15882A99466g9171G2824K35552
$$ plain form
11820 -167109 16308 7477 159498 -146129 275458 -25134 -77859 4383 -312004 -322317 158016
11808 138797 136865 172042 79033 3530 161691 68270 -55625 -309372 12314 -77512 -98333
11797 -98333 -109443 -256015 -286403 -1106 31552 18367 177806 253455 -137359 89104 -218668
11785 -249764 11284 -129534 -230531 -234539 -58905 79018 -158570 -284290 5109 116182 -258454
11773 -175995 82773 86522 -178173 108935 -49971 -230628 192307 -3663 -250957 228482 -36268
11761 291852 -57123 -163258 -299227 125234 -279485 175669 5007 -44206 -192755 -55928
11750 -93503 71833 -113662 -22386 51155 27153 -26393 -224423 -153333 23728 -124814 20901
11738 95765 -79406 6726 -52260 -102505 -75385 156486 -115882 199466 -79171 72824 308376
11727C08376c11619A97069H9623b21559D7453a08223n215C67589A21463l9265
11717H2198n83a11018j50155A70535L79238e8536B9825Q2982N0590D9579K5611
11706G5190Q0526e4895N690m8291A73361a80602B15103I7420D0813h5397A8546
11694A13012a59721B24887b04195A00945L5576K45746A78774B9356J22104a18821
11683f8385j00222A55068B7789d943r013j96698E8628a17724A42307f3260B34810
11671a67051r9211C6472N6260b7414j85463D39436h492G3161J92253j05138J35495
11660B95771f9849J7377A65247A0842c81159C0513J09611o4905a40285O7237B48088
11648B50505c75079i2802j7283k958A19643a56827j40517B3713L6218Q995J36726
$$ plain form
11727 308376 -311619 197069 89623 -221559 47453 -108223 -113438 367589 121463 82198
11717 82198 81615 -111018 -261173 170535 549773 -58536 29825 112807 163397 49579 75190
11706 75190 155716 -54895 -49205 -97496 173361 -180602 215103 97420 40813 -85397 18546
11694 113012 -159721 224887 -204195 100945 136521 382267 178774 29356 151460 -118821
11683 -68385 -168607 155068 27789 -4943 -13956 -210654 58628 -117724 142307 -63260 234810
11671 -167051 -266262 36472 92732 -27414 -212877 439436 -8492 73161 265414 160276 295771
11660 295771 -69849 -52472 165247 10842 -381159 30513 140124 75219 -140285 -73048 248088
11648 250505 -375079 -92802 -110085 -113043 119643 -156827 -297344 23713 59931 68926 205652
11637B05652d98225i1301C02323c5662B1601O5546k5490L125J05052L8119a41253
11625B23613j03306P2280e2279B6960q150b35769J03981N0088n3573e327l18089
11614c23416b9409n0402k1295F6648b94190a35866Q480C2361K14448b0371j64080
11603a84451B64461A04924Q985f2416C1053J49315Q8874a45883b1168l0076q5002
11592a36246A47629L4883L89791i7641B4953M24192B21154N3209A18444O5051
11582A83495a24674k59977b8260D1780J20775a87185A85126K88791a75449B76935
11571a59459C06885j14468J99016I7985J36814o3269a87378D2112a4171A01007
11560c3400C61293e9796A81150N886D550c8297B05154b23153P4944C4572a0255
$$ plain form
11637 205652 -498225 -91301 302323 -35662 21601 87147 61657 64782 169834 207953 -141253
11625 223613 120307 192587 -52279 26960 18810 -235769 -131788 -81700 -135273 -5327 -323416
11614 -323416 -29409 -79811 -101106 66648 -294190 -135866 -127386 32361 246809 -20371 -184451
11603 -184451 264461 104924 113909 -62416 31053 180368 269242 -145883 -21168 -51244 -136246
11592 -136246 147629 182512 572303 -97641 24953 449145 221154 274363 118444 183495
11582 183495 -124674 -384651 -28260 41780 162555 -187185 185126 473917 -175449 276935
11571 -159459 306885 192417 391433 97985 234799 171530 -187378 42112 -14171 101007
11560 -33400 361293 -59796 181150 187036 4550 -38297 205154 -223153 -148209 34572 -10255
11548b59126L4325N0435C29770F7909Q3785O9244K19079b51560A85366M4001N9892
11537B89259a76670A37632d754k8173q7217D503a7211l26303J17764J07901A98286
11525D5137O2212R3894L27417B23448f7568A69750b5464B48562j16792A0852J97112
11514B07964N3529k7414I1826J0986b9444J156B15990j00729K45047G1790L9096
11503A10886J76944d0179A95129D7042j6034k037L2378a51928B24002j05844P4655
11492A92813O0419c4141l0845j47833A25367b5024k73087F4377K65564A62629
11481B2270k554d2856j83099a0456C59388b195A66026Q2665J74008o3563j15994
11470B43142L2027q7147G8970a96129G9406B2357R7671j0895J55750a34770A84339
$$ plain form
11548 -259126 -224801 -174366 329770 67909 151694 220938 440017 -251560 185366 229367 289259
11537 289259 -176670 137632 -4754 -32927 -120144 4503 -17211 -343514 -225750 -117849 198286
11525 45137 107349 201243 528660 223448 -67568 169750 -25464 248562 131770 10852 207964
11514 207964 261493 234079 91826 102812 -29444 -28288 215990 115261 360308 71790 110886
11503 110886 287830 -40179 195129 47042 31008 28971 61349 -151928 224002 118158 192813
11492 192813 253232 -34141 -64986 -212819 125367 -25024 -298111 64377 329941 162629
11481 22270 19716 -42856 -225955 -10456 359388 -2195 166026 248691 422699 359136 243142
11470 243142 275169 188022 78970 -196129 79406 22357 120028 109133 264883 -134770 184339
11458H9086J1698a36199E8944J16511I459J77107J0225B2315h9569C06193b08293
11446i5812F4050B2024a78132k3508C02533g1978k315A82511k2168b13040A012
11434B03327r7454d1716j48525b7785A24927N7567p9751a09176g047n1A52916
11422A66542a08988A24099b5120r6511b5609F674e1235a1727j15464j10070b8411
11410D73819E9871c83286P4399C6871K28433b10373a9043j2130A40039J67661
11400C07700F6503i2737d275j72931J9267E5398a40330O8474j2936D0912c17737
11388A88525M7505E5857O6488P7405D5823J99204c4830j97732D5780g2733b6417
11376A15029a93136A23931Q9258L0720a76680a2905A70520M9797b01912L6893
$$ plain form
11458 89086 100784 -136199 58944 175455 9459 186566 196791 22315 -89569 306193 -208293
11446 -95812 64050 22024 -178132 -201640 302533 -71978 -74293 182511 160343 -213040 1012
11434 203327 105873 -41716 -190241 -27785 124927 182494 102743 -109176 -7047 -7098 152916
11422 166542 -108988 124099 -25120 -121631 -25609 6674 -51235 -11727 -127191 -237261 -28411
11410 473819 59871 -383286 -308887 36871 265304 -210373 -19043 -31173 140039 307700
11400 307700 66503 -92737 -4275 -177206 -157939 55398 -140330 -71856 -84792 40912 -317737
11388 188525 236030 55857 122345 199750 45823 245027 -34830 -232562 45780 -72733 -26417
11376 115029 -193136 123931 213189 243909 -176680 -12905 170520 220317 -201912 -165019
11366a65019E2348K43426M2870j32976a21024J9358J4038F5141J82312a14491
11355b624j29935e2101n1792H1635b55122j13108J20996C2816K65433g10F2088
11343A50447b68200E9329f280k29937A21638K0946A0305b15148A36888l0049d37081
11331A03496i6139d549A92292a66781C6549a37150L5817k0782j03382C74367a69394
11319A70210c3972F4522c5718j28943B91249a0170A61827a4747B13965F7351A6915
11307A90760c1505B007M0251L609K10282c58131a0198k65361B24308I1139c43676
11295f8953E40919B4524J72444J56239b05573r6533C3162b91794J42176l272A28601
11283e6401r1349j08540H9458C714i1665d223p0037j61774o3256F85K46866b4107
$$ plain form
11366 -165019 52348 295774 338644 205668 -121024 -101666 -87628 65141 247453 -114491
11355 -2624 -132559 -52101 -103893 81635 -255122 -368230 -247234 32816 298249 -710 62088
11343 150447 -268200 59329 -6280 -236217 121638 142584 10305 -215148 136888 106839 -437081
11331 103496 -96139 -4549 192292 -166781 36549 -137150 -101333 -122115 -225497 374367 -169394
11319 170210 -33972 64522 -35718 -164661 291249 -10170 161827 -14747 213965 67351 16915
11307 190760 -31505 2007 42258 45867 256149 -358131 -10198 -275559 224308 91139 -343676
11295 -68953 540919 24524 196968 353207 -205573 -302106 33162 -291794 -149618 -152890 128601
11283 -56401 -147750 -256290 89458 3714 -91665 -4223 -74260 -236034 -299290 685 247551 -24107
11270i9989B39060e9949E1989J07323a40460a7153k38340a8864l4192j38421B20244
11258A3703b13923B80565a54392m6114B84849B9620J90922k4990k1643c80612
11247D8649c9122m9425o7169A72259a15876o5257N2932A82595i3878d0548A95852
11235d31041b8423A60928a3410A36057k6184J82847a69237Q3957C2554a92612
11224A5564K8352a27971b0274l45938J56412P3445a1891n9855k57105B29979i501
11212a9987B53229b00319O8368M2603n8709O6853C0973c74318a42464B11418a5698
11200A10879C3168N6940K93971A2700K05634N0054A14815J14587H4574a27494
11189B59003l0983a8282l0933M109l04966J61906g4465C517a19669E4961R5235
$$ plain form
11270 -99989 239060 -59949 51989 159312 -140460 -17153 -255493 -18864 -53056 -191477 220244
11258 13703 -213923 280565 -154392 -200506 284849 29620 220542 195552 173909 -380612
11247 48649 -39122 -88547 -155716 172259 -115876 -181133 -128201 182595 -93878 -40548 195852
11235 -431041 -28423 160928 -13410 136057 109873 292720 -169237 -85280 32554 -192612
11224 15564 43916 -127971 -20274 -366212 -209800 -136355 -11891 -71746 -328851 229979 -9501
11212 -19987 253229 -200319 -131951 -89348 -148057 -81204 30973 -374318 -142464 211418 -15698
11200 110879 33168 90108 384079 12700 218334 268388 114815 229402 84574 -127494
11189 259003 228020 -18282 -49215 -45106 -350072 -188166 -74465 3517 -119669 54961 150196
11178A50196B9233J96241C1879d760j08787N5500k95587a71884L3568H0601c86676
11166f5976k46325a48533G7464D220c993n8081p3757e861I9245o331M1721a75838
11153c62075J65798A57177b8870B68494A18373i4024I0101a84510r0205m4623
11143c19338B42433B9308b89520A61870a24561n9381A18939b08227d372A7868
11132B91961b00585A85774P0909B0338b3218A07302R8805l9501k8471N9549E5003
11120C7257N3599D1580b39660J3093f1345n8604A81997B6778B372M79a77867N0521
11108a27346B35115F8451h6824A47967a721A23821N0830k1808J08179j21936R0263
11097B29349D8002F465J14328J14048J57572o4923r6759o4099J1478k7219a05521
$$ plain form
11178 150196 29233 225474 31879 -4760 -113547 -58047 -353634 -171884 -138316 80601 -386676
11166 -65976 -312301 -148533 77464 4220 -3993 -62074 -135831 -5861 99245 92914 134635 -175838
11153 -362075 -196277 157177 -28870 268494 118373 -94024 90101 -184510 -274715 -319338
11143 -319338 242433 29308 -289520 161870 -124561 -183942 118939 -208227 -4372 17868
11132 291961 -200585 185774 256683 20338 -23218 107302 206107 166606 138135 197684 55003
11120 37257 90856 41580 -239660 -226567 -61345 -119949 181997 26778 2372 2851 -177867 -127346
11108 -127346 235115 68451 -86824 147967 -1721 123821 174651 152843 261022 139086 229349
11097 229349 48002 6465 120793 234841 392413 327490 230731 166632 178110 150891 -105521
11085A98753H2770J19200M3154C4044J91553L00573j06331i0180A91787L00815
11075D92602B41429C578J14370K50842H6213R4828P6411K37518B21555Q3910j17886
11064A87579J93270j35700L2645N9406J64572Q4713q4906K4180j46662L81916
11054G61013C41981J26838K25861j19336p2748K82443j16802j47782J74195l6009
11044F58641j79646J16878K84148D38583R9486K49794J00919q9338k18918k67944
11034C12582K91122K23549j31399o1406m0416n8783J5864K47560l59584j167J69946
11023F07868j90082L24822k65454K2980P5070J1277l7965K4531n8346J82735J96969
11012H94405k26464j2380k44347K33861j09398A25300M63572j9825K16852l80260
$$ plain form
11085 198753 82770 201970 245124 34044 225597 526170 419839 -90180 191787 492602
11075 492602 241429 3578 117948 368790 86213 181041 257452 494970 221555 305465 187579
11064 187579 380849 245149 277794 337200 501772 586485 501579 525759 379097 761013
11054 761013 341981 468819 694680 575344 502596 785039 668237 520455 694650 658641
11044 658641 478995 595873 880021 438583 538069 787863 888782 799444 580526 312582
11034 312582 603704 827253 695854 634448 594032 535249 551113 798673 439089 437922 607868
11023 607868 417786 742608 477154 500134 575204 586481 548516 573047 514701 697436 894405
11012 894405 667941 655561 411214 645075 535677 125300 588872 569047 785899 405639
11002D05639J63847B31926N78521k12390j43347o2555J13108J97644R7003l92547
10992D07363L30553J42149l71658J55104J80482N4294j37187J68090k31054K33107
10982I31243J08737J60143k16062J00876M54715J0248J68475J60997K7480K8972
10972A935824J03851K09904j04516P3532m68097J09493k96372j26867J11306j39005
10962A409053l98544M95313N7575K03589j42652Q9140k52203p5980l08694P2893
10952A149490K7054k43800l21674L67447l38168k43717A95127K18640n8516J32406
10942D87657q9233O6376A06458m325L5654O9632A8778f7879A53458K50432R3520
10931D97410j22560j83199N1456q3909J2853a01452A30647d3690n4499L4435A61103
$$ plain form
11002 405639 569486 231926 810447 598057 454710 392155 505263 702907 799910 407363
10992 407363 737916 880065 508407 663511 843993 898287 761100 929190 698136 931243
10982 931243 1039980 1200123 984061 1084937 1539652 1549900 1718375 1879372 1906852 1935824
10972 1935824 2039675 2249579 2145063 2218595 1750498 1859991 1563619 1436752 1548058 1409053
10962 1409053 1010509 1505822 1563397 1766986 1624334 1713474 1461271 1385291 1076597 1149490
10952 1149490 1176544 932744 611070 978517 640349 396632 195127 413767 355251 487657
10942 487657 398424 464800 106458 102133 137787 207419 18778 -67879 153458 403890 497410
10931 497410 374850 191651 243107 159198 172051 -101452 130647 -43690 -98189 -63754 161103
10919I1862c09368h4827B23800I0379c2249A48127K9187J15947C1471a6354A91528
10907c28906A08993a45581m6206B2290R3326a14340j01159i2024A82006b94369
10896B79713a45004A90044C3801c78496l9446A92639J5072c05564a02163n0845
10886a53008M5483F8780a88495Q4922E9833a56850B325a26155K993A86000C861
10874d1966A71363E1280H715J48286d30359D84039H6151a43842A99790r5061L9013
10863A43742D2349J08163f6394r9209C0182c36973a09810p9627a8759k39775C75968
10851A18181D0727J49281a45732M3024k12567I1550d0338B50338h7168k864a4621
10839A69337a0014B6238J23572B8978h9701E1983J6268a01925B30657a82399N903
$$ plain form
10919 91862 -309368 -84827 223800 90379 -32249 148127 177314 293261 31471 -16354 191528
10907 -328906 108993 -145581 -191787 22290 115616 -114340 -215499 -92024 182006 -294369
10896 279713 -145004 190044 33801 -378496 -417942 192639 207711 -305564 -102163 -153008
10886 -153008 -107525 68780 -188495 -103573 59833 -156850 2325 -126155 -123162 186000 3861
10874 -41966 171363 51280 8715 157001 -430359 484039 86151 -143842 199790 104729 143742
10863 143742 42349 150512 -66394 -165603 30182 -336973 -109810 -189437 -18759 -258534 375968
10851 118181 40727 190008 -145732 -102708 -315275 91550 -40338 250338 -87168 -90032 -14621
10839 169337 -10014 26238 149810 28978 -89701 51983 68251 -101925 230657 -182399 -176496
10828a76496n2531R4588e8925B07693r6346R491N8454a4835p2938a3110L655k0208
10816b9663C41959a6895l60516a85894b4238E8928a58618F7185f0637k3500n5133
10805a39270F439K64105a32581L908O84k4773k50885b4370B6758K19514h9941
10793A22964a67534j62712N1880j69792h6600d316n9747q0794M4389A7762b79647
10781h7255H7344j6670b1788N412j16459m9653G4130f0947A71317f2598b1519
10769A81267f3877B09380i4919k64880B0896a34605k07914B6580J09936a28649
10758b82278Q6821I9932a47562k7576E1083a93811D43490C2310J8982a71235M8397
10747a22838B68684a05678C2794f3657B26880A01838N6157k4238P2358i405A09823
$$ plain form
10828 -176496 -229027 -134439 -58925 207693 111347 120838 179292 -14835 -87773 -13110 -9455 -29663
10816 -29663 341959 -16895 -377411 -185894 -24238 58928 -158618 67185 -60637 -84137 -139270
10805 -139270 6439 270544 -132581 -128673 -127989 -152762 -403647 -24370 26758 246272 -89941
10793 122964 -167534 -330246 -278366 -448158 -86600 -4316 -64063 -144857 -100468 17762 -279647
10781 -87255 87344 70674 -21788 -16376 -132835 -182488 74130 -60947 171317 -62598 -21519
10769 181267 -63877 209380 -94919 -359799 20896 -134605 -342519 26580 136516 -128649
10758 -282278 -195457 99932 -147562 -175138 51083 -193811 443490 32310 51292 -171235 -122838
10747 -122838 268684 -105678 32794 -63657 226880 101838 157995 133757 206115 -9405 109823
10735a54885C0235J12781b21143a00239A5013a0985k61768A30991a94375a2907
10724A7039a12255L2008j57158A83924h0719A5921a45534j37679A8976L95150
10714D14126I3658b00326A32376D5504N6416b15920A20516h9480j2565j50752
10704b52797O4646A04631f7073A16027g7282C5181K98821b4551q1794F7781a12895
10692B2795b22850f3543A57981c10148M9378A8057c1419j35257e6523r4534m9070
10681b00127a9358A57040C2814h3589r3077b981C25223B3414J57286a64830j64195
10670c29025R1660J5015j76683J77899A16466a31773K791p5396n9386C11992G042
10658d6547J808B2095K74918p3142r4599c29890c7756B7846K70390a36177d3835
$$ plain form
10735 -154885 30235 143016 -221143 -100239 15013 -10985 -272753 130991 -194375 -12907
10724 17039 -112255 -80247 -237405 183924 -80719 15921 -145534 -283213 18976 414126
10714 414126 93658 -200326 132376 45504 101920 -215920 120516 -89480 -102045 -252797
10704 -252797 -188151 104631 -67073 116027 -77282 35181 334002 -24551 -106345 67781 -112895
10692 22795 -222850 -63543 157981 -310148 -260770 18057 -31419 -166676 -56523 -151057 -200127
10681 -200127 -19358 157040 32814 -83589 -176666 -2981 325223 23414 180700 -164830 -329025
10670 -329025 -237365 -222350 -399033 -221134 116466 -131773 -128982 -204378 -263764 311992 7042
10658 -46547 -44739 22095 297013 223871 129272 -329890 -37756 27846 298236 -136177 -43835
10646F6280b64894D3040c70256L580Q6515a39217j14727H3480c05655J25319o5349
10635b45685A40274a79260A07729b22367k01139a37252h954A5793L9748c36580
10624A69078H2119J28755H4383B9960a66253j18394b6147G5559h8449B43365b9464
10612g729j63758D1338j1260f32650H1330Q2659b42204j1459E394g2124n7982
10601a30106G3452M2432P1856C990b3751k35153A36118d2642B8604J09289b7595
10589h2439B62662a24688N2722j26398J21H8308L3871J55846H5835b58743o6363
10578c25106A37572c09524a23959A42768a60362c850H5553g3889A63038n634G6161
10566e7440A9046J88306J3357b19724B4444c51821c2837B3708g8379o79o8880
$$ plain form
10646 66280 -264894 43040 -370256 -366676 -280161 -139217 -253944 83480 -305655 -180336 -245685
10635 -245685 140274 -179260 107729 -222367 -423506 -137252 -8954 15793 55541 -336580
10624 169078 82119 210874 84383 29960 -166253 -284647 -26147 75559 -88449 243365 -29464
10612 -7729 -171487 41338 30078 -632650 81330 163989 -242204 -253663 5394 -72124 -130106
10601 -130106 73452 115884 187740 3990 -23751 -258904 136118 -42642 28604 137893 -27595
10589 -82439 262662 -124688 -71966 -198364 -198243 88308 122179 278025 85835 -258743 -325106
10578 -325106 137572 -309524 -123959 142768 -160362 -3850 85553 -73889 163038 157404 76161
10566 -57440 19046 207352 220709 -219724 24444 -351821 -32837 23708 -78379 -79058 -147938
10555a47938A08311b24150F0365g8729B32661c1399C4221c256B63577F3879e1381
10543c64540a28814J742I6401j670i8144k1774m3282a1547C4080h8527M4064j07904
10531a52367e3127C9825a70232j75088B82192F515b54430d9637A26215b03370
10520A5546e6690j24696B7061P189J15943E4519a12637a5735j77353b3767l47836
10509c71603d0112r3323a7093H679b1203A62623e120k71402A48923m0288i3827
10497a24078A46279e33003C32035a32515B70418q8626a31621E3959b2081B60431
10486H4311C580d6515E88L90140r3531K39977A58006p6878J81127E4019f8563
10474D49219B16124F8281k3495a38553B15307G0988M628c9739o6066c3357k4950
$$ plain form
10555 -147938 108311 -224150 60365 -78729 232661 -31399 34221 -3256 263577 63879 -51381
10543 -364540 -128814 -127072 96401 94731 -98144 -119918 -163200 -11547 34080 -88527 -44463 -152367
10531 -152367 -53127 39825 -170232 -345320 282192 6515 -254430 -49637 126215 -203370
10520 15546 -56690 -181386 27061 34250 150193 54519 -112637 -15735 -193088 -23767 -371603
10509 -371603 -40112 -133435 -17093 8679 -21203 162623 -5120 -276522 148923 108635 -93827
10497 -124078 146279 -533003 332035 -132515 270418 181792 -131621 53959 -22081 260431
10486 84311 3580 -46515 588 390728 297197 537174 158006 81128 262255 54019 -68563
10474 449219 216124 68281 44786 -138553 215307 70988 75616 -39739 -105805 -33357 -58307
10463e8307C10391a61025E5151I704J58303a84805P7531e3168C18224F2195Q8616
10452A50811K206c18590a37474a1632B22454p9265M1811g5204l42169a94013b4354
10440c05287e5340B79884j30975C7780b6597B76492b7777A24321l5316o385g022
10428B1642Q8875C5698c54285k1201A23105a37775B02844a33707C57379a22220
10417A13523a82897b4245k62922J28742A64348a52206b9499k34516d1568j37240
10407a78808A85224a33084L8533A8621a55732A02472h439j47339C4238d208C5060
10395i3527k10838G3003L3907q519a33958B05787f2075A05713J73423b51945H3881
10383d022B89730f2319C92331A44792J02815a28356a9936r0453B12001J9508q4669
$$ plain form
10463 -58307 310391 -161025 55151 9704 168007 -184805 -107274 -53168 318224 62195 150811
10452 150811 153017 -318590 -137474 -11632 222454 143189 185000 -75204 -417373 -194013 -24354
10440 -305287 -55340 279884 148909 37780 -26597 276492 -27777 124321 89005 82620 -7022
10428 21642 110517 35698 -354285 -375486 123105 -137775 202844 -133707 357379 -122220
10417 113523 -182897 -24245 -287167 -158425 164348 -152206 -29499 -264015 -41568 -178808
10407 -178808 185224 -133084 -94551 18621 -155732 102472 -8439 -155778 34238 -4208 35060
10395 -93527 -304365 73003 106910 98391 -133958 205787 -62075 105713 279136 -251945 83881
10383 -4022 289730 -62319 392331 144792 247607 -128356 -19936 -110389 212001 231509 146840
10372A46840d4881C66043j54744J74622j16114K26029j64207A16184J64114a3515
10361C81191I4459c7061a1499A93233K2452I0401K43635A44154J53337l791O2882
10350C56582j187K47493D1558L28393K2684E0023K63853A35165L39564q0306L0768
10339D25191r5152A51226F7948J30288a9351k7473j43354A25158k5798c9742B2757
10327h0089A12410M90874e8782B63778F4672g9209F1997f1917B15756m0167K02669
10316C78258I1736J3214d4102l5992A1749c8935m8272C58416a49539o6459A24393
10304I5474a42177e9207G1787c74350B5949i1113R703A23807n6479e945C0381
10292A32262J69294F4428a1490A80438A2651a34447a853k50706g1906g041F4972
$$ plain form
10372 146840 -44881 366043 211299 385921 269807 495836 331629 116184 280298 -13515
10361 381191 94459 -37061 -11499 193233 215685 90401 334036 144154 297491 293700 356582
10350 356582 355395 602888 41558 369951 392635 50023 313876 135165 474729 394423 425191
10339 425191 330039 151226 67948 198236 -19351 -46824 -190178 125158 99360 -39742 22757
10327 -80089 112410 603284 -58782 263778 64672 -79209 61997 -61917 215756 175589 378258
10316 378258 91736 104950 -44102 -80094 11749 -38935 -87207 358416 -149539 -215998 124393
10304 95474 -142177 -59207 71787 -374350 25949 -91113 -81410 123807 67328 -5945 30381
10292 132262 301556 64428 -11490 180438 12651 -134447 -1853 -252559 -71906 -7041 64972
10280C7936O4802n0053J33143A536e7418l54191a00515M7581R833A61816J16482
10269B78298b40063A67447b09883C6209J08721B5179L38502A54766n0727L5952
10259A39991D2376K12317j25069J04737D5446d7058a3903A9013c28847a49167
10248B86166l0758D7210i7481n3077N6627l28314b7670B04817b19303A30501b50720
10236C81595c21843J54173A5665e568k56275A81953a67090K5852c0291H6519R2814
10225A79333q1410a55878a0780j13648j38662A13141c10656f9150A38874F8709
10214a30724a9547l86267a92015B90823f5971A36829i8374c5491I4771O1234C249
10202a82822f6859A32748L289F4788c48051a60278j2544f8262j60492A72465b39486
$$ plain form
10280 37936 102738 52685 185828 1536 -57418 -411609 -100515 -52934 -43101 161816 278298
10269 278298 -240063 167447 -209883 36209 144930 25179 363681 154766 104039 139991
10259 139991 42376 254693 129624 234361 45446 -47058 -13903 19013 -328847 -149167
10248 286166 255408 47210 -97481 -150558 -93931 -422245 -27670 204817 -219303 130501 -250720
10236 381595 -321843 -167670 15665 -5568 -261843 181953 -167090 -141238 -30291 86519 179333
10225 179333 97923 -155878 -10780 -124428 -263090 113141 -310656 -69150 138874 68709
10214 -130724 -19547 -405814 -192015 290823 -65971 136829 -98374 -35491 94771 156005 3249
10202 -182822 -66859 132748 136037 64788 -348051 -160278 -172822 -68262 -228754 172465 -239486
10190A67056n0952f8566G9826a09803p966C2932f0959p219b7333C93344b31109
10178e5594k63885r4693A25571P4841d9126m7574b4849k10545B75282a34280d5963
10166f4509A41095b27479I0522b03474k8518f4245A13015Q6209J36393c85952
10155B55397b14885A0053Q8175b25314A17998a81442m0594j92642b06966e6022
10144A83220h9620L8819B2319a01907k14920l8089a31205A24365N9736p4832c71603
10132c8192B27720G3748b93064H5871J30422p9851E8191d47282f8844q8428j52384
10121c09656b7675A7496P1339K4025b06000Q308h1846k87284J17719a20755B70405
10109B05541C4428L24416d26149J74755R8446e5304r6693j31936P080A7020a6220
$$ plain form
10190 167056 116104 -68566 79826 -109803 -117769 32932 -60959 -68178 -27333 393344 -231109
10178 -55594 -319479 -414172 125571 200412 -49126 -96700 -24849 -235394 275282 -134280 -45963
10166 -64509 141095 -227479 90522 -203474 -231992 -64245 113015 199224 335617 -385952
10155 255397 -214885 10053 98228 -225314 117998 -181442 -222036 -414678 -206966 -56022
10144 183220 -89620 -50801 22319 -101907 -316827 -354916 -131205 124365 184101 109269 -371603
10132 -38192 227720 73748 -293064 85871 216293 136442 58191 -447282 -68844 -157272 -309656
10121 -309656 -27675 17496 88835 112860 -206000 -197692 -81846 -369130 -251411 -120755 270405
10109 205541 34428 358844 -426149 -251394 -152948 -55304 -151997 -283933 -276853 17020 -16220
10097A31396j7041a48336k107K1009I3123l6636c32241g5102B79869c91039B01450
10085E3140b87306a41072L9956n559B4633M2930h8349A30907a05642N0639R225
10074d5778m492o3944N1876j84831N7807k29327A92435a64281Q0954A09009Q853
10063A17862A4186K71106c38472a22454A27127b8817m7672A69616J09059b8270
10052A05704c53120e4126j91350f9696j32992A38648k6194c27277J62314N9408
10042a05555D4977N1506g1357A17143a92158A13706c03316C3448Q1945a70820
10031d2243J7724A7960g1507K654K1656B22797d7632J6503L340B14123b24376
10019a48641j8153k38953a06429k33760J21493L1423L5945G0220j8573a01305
$$ plain form
10097 131396 114355 -148336 -150443 -129434 93123 56487 -332241 -75102 279869 -391039 201450
10085 53140 -287306 -141072 -101116 -106675 24633 67563 -88349 130907 -105642 -55003 -45778
10074 -45778 -50270 -114214 -62338 -247169 -189362 -418689 192435 -164281 -83327 109009 117862
10063 117862 14186 285292 -338472 -122454 127127 -28817 -76489 169616 278675 -28270
10052 105704 -353120 -54126 -245476 -69696 -202688 138648 112454 -327277 -164963 -105555
10042 -105555 44977 96483 -71357 117143 -192158 113706 -303316 33448 115393 -170820
10031 -42243 -24519 17960 -71507 -68853 -47197 222797 -47632 -31129 -27789 214123 -224376
10019 -148641 -166794 -405747 -106429 -340189 -218696 -187273 -151328 70220 51647 -101305
10008b8211l3970b8357l5463e656j95808M3145f4047A9635a23316p7418c0566
9996C12109F7327P9059a57616J3389A02705E161b5698C3452h380q1092B89194
9984g9481K1114k9067P456c1954j60951G8705a13014A11170d0997l5091H2001
9972a32424r2918A99016D187J1729a96959L5867L5272m3676I1655a40313M9093
9961i1220c0054j4001q8084H1727a15868j19077C8092N4047i8454o7381j07192
9950b73027E01309A3085J25421b68775B84160b91903i7728A06120b3538C57723
9939C647b07947A43761k3101a87586D8785d9271j58448A87002G0709b33349d7111
9927B76256b714k15088B23118g9563A53720l0905a21721j25828c1664A68338G7674
$$ plain form
10008 -28211 -62181 -28357 -63820 -5656 -201464 -158319 -64047 19635 -123316 -200734 -30566
9996 312109 67327 146386 -157616 -144227 102705 5161 -25698 33452 -8380 -89472 289194
9984 -79481 -58367 -87434 -79978 -31954 -192905 78705 -113014 111170 -40997 -76088 82001
9972 -132424 -225342 199016 4187 15916 -196959 -161092 -125820 -169496 91655 -140313 -91220
9961 -91220 -30054 -44055 -132139 81727 -115868 -234945 38092 92139 -98454 -165835 -273027
9950 -273027 501309 13085 138506 -268775 284160 -291903 -97728 106120 -23538 357723
9939 3647 -207947 143761 120660 -187586 48785 -49271 -207719 187002 70709 -233349 -47111
9927 276256 -2714 -217802 223118 -79563 153720 122815 -121721 -247549 -31664 168338 77674
9915b15332E2679h6529O296G4487M5057a38106k09099Q9407a19454J0806n9979
9904a68627B2254a85522O4897l03573J74479C33181a61391j21055E7842b42218
9893c9381A32180a66805E4381b52348F5336f0199a4321j88471k98529d7369B96300
9881b24996b6805m4837A11326a26552c7010Q229A3862b82390g3359A24573b85537
9869c4112A29316k0501a12368p3722C49148b6455A30811b87586B7143g9083A315
9857a37669B8878b02578P7146A88205F3162a12743F9351b47892f9908j06245A13644
9845e0492k27841g5636j49701A04585B1296a19286A87345D5472a27805j23327
9835b51132A40172i0947G2354b9399k71626K7690a08260j07910e1223B8255b57543
$$ plain form
9915 -215332 52679 -86529 -80233 74487 119544 -138106 -347205 -257798 -119454 -108648 -168627
9904 -168627 22254 -185522 -120625 -424198 -249719 333181 -161391 -282446 57842 -242218
9893 -39381 132180 -166805 54381 -252348 65336 -60199 -14321 -202792 -501321 -47369 296300
9881 -224996 -26805 -71642 111326 -126552 -37010 -28781 13862 -282390 -73359 124573 -285537
9869 -34112 129316 108815 -112368 -186090 349148 -26455 130811 -287586 27143 -79083 1315
9857 -137669 28878 -202578 -125432 188205 63162 -112743 69351 -247892 -69908 -176153 113644
9845 -50492 -278333 -75636 -225337 104585 21296 -119286 187345 45472 -127805 -251132
9835 -251132 140172 -90947 72354 -29399 -301025 -273335 -108260 -216170 -51223 28255 -257543
9823c5000J1417A3753a24581o5767c3197q248j11300j17367P4639k807c7049k04098
9811b41147A00537M1744h8495j10660Q2761D5701G767a94138e1667n4898M6775
9800e9790b5988j04592E3407K17382h2566B23963b15687B36245J56949f6187B3668
9788c256k29255q3637D2112a18152C5554c00023J28761A7150i8327G6277P6944
9777A53221a38494o3962B9750b02972e3549j47784B3646a99743Q3040k42874a05515
9765A9792a14294I3761m365b99747I1761a09324A71807f1272B58492D228b09492
9753a43982A63438h5418j0366j26047c7447r2933E9646P1693C2779b15968A06444
9741F9972b11737a3800j9626j01029j92277d9537k00409d347j1164B1840J11107
$$ plain form
9823 -35000 -23583 13753 -124581 -190348 -33197 -41445 -152745 -270112 -195473 -198280 -37049 -241147
9811 -241147 100537 142281 -88495 -199155 -116394 45701 7767 -194138 -51667 -106565 -59790
9800 -59790 -25988 -130580 53407 270789 -82566 223963 -215687 236245 393194 -66187 23668
9788 -3256 -232511 -316148 42112 -118152 35554 -300023 -171262 17150 -98327 76277 153221
9777 153221 -138494 -202456 29750 -202972 -53549 -201333 23646 -199743 -116703 -359577 -105515
9765 19792 -114294 93761 89396 -299747 91761 -109324 171807 -61272 258492 4228 -209492
9753 -143982 163438 -85418 -95784 -221831 -37447 -130380 59646 131339 32779 -215968 106444
9741 69972 -211737 -13800 -33426 -134455 -326732 -49537 -249946 -4347 -15511 21840 132947
9730A32947i986l5181k56462g9644B69250b28266L3371g6588j66613j19845c1699
9718a06774D7938c7705H8131a49634k0625k57201c0687j45102e1090D5250J01232
9707A46482c23810b0803r569j36427O8781B73091a79127q618o7456B5874L7034
9696F2908c4925A0835K1241N8365k7556g261l85022c7509k27120p6393a03063
9684a11217r5353B3568K4713a7843p945k4657h161k68699R4112M2267c3003k58002
9672b91005B76723a04465n1304r3526A75025b37898G1632J34667h83j16306b09
9660B66951C2606c4725A28184a62890o554G8902h1778j81276n2488j7638a52634
9648a23571C32414c15579A11708a22549Q682A1503f9179a9156A9771e7392A33129
$$ plain form
9730 132947 -9986 -45167 -301629 -79644 269250 -228266 -194895 -76588 -243201 -363046 -31699
9718 -106774 47938 -37705 88131 -149634 -170259 -427460 -30687 -175789 -51090 45250 146482
9707 146482 -323810 -20803 -30372 -166799 -98018 273091 -179127 -187745 -255201 25874 62908
9696 62908 -34925 10835 32076 90441 62885 -7261 -392283 -37509 -264629 -341022 -103063
9684 -111217 -206570 23568 48281 -17843 -25788 -50445 -8161 -276860 -182748 -140481 -33003 -291005
9672 -291005 276723 -104465 -155769 -249295 175025 -237898 71632 206299 -883 -117189 -209
9660 266951 32606 -34725 128184 -162890 -169444 78902 -81778 -263054 -315542 -333180 -152634
9648 -123571 332414 -315579 111708 -122549 -113867 11503 -69179 -19156 19771 -57392 133129
9636G3044f2832A98629q478h0858a4263B40696k3579i1461j4640e0265j00980
9625a51245d1268A51087B339a30196C35764i5538j36433N5262j00804f9190A65691
9613A15432b32596A2146l259a15104e3341j49461C9919P5061b40894O4908C6879
9601G2155j7887a41331A10432b74147f8769m0605B0168g2489A29889E2871K47891
9590C00762i2133B2684b12177A25769b50997J16782A72581a20869A3409a58771
9579h2964j17920d6906j83715H8814a08273k69563a3581A4452a65068E3588M6735
9568A00323L195h4989g391D0805b62158f1482C11351I0710i928J869C4151b19198
9555i973j11303N4955B42522b26558B40806c6043k30939J1013j52820A68405d5078
$$ plain form
9636 73044 -62832 198629 190151 -80858 -14263 240696 217117 -91461 -106101 -50265 -151245
9625 -151245 -41268 151087 2339 -130196 335764 -95538 -231971 -176709 -277513 -69190 165691
9613 115432 -232596 12146 8887 -115104 -53341 -202802 39919 114980 -240894 -175986 36879
9601 72155 54268 -141331 110432 -274147 -68769 -109374 20168 -72489 129889 52871 300762
9590 300762 -92133 22684 -212177 125769 -250997 -134215 172581 -120869 13409 -158771
9579 -82964 -200884 -46906 -230621 88814 -108273 -377836 -13581 14452 -165068 53588 100323
9568 100323 103518 -84989 -7391 40805 -262158 -61482 311351 90710 -9928 -8059 34151 -219198
9555 -9973 -121276 -66321 242522 -226558 240806 -36043 -266982 -255969 -408789 168405 -45078
9543A83378c43594f2510j84261i4397j04566K3064I2800l8660c42091I2855a67380
9531c28248D4757b13290K0391O9911M1119A63037J38660a6353A6654a66958j46703
9520c13661B03457c0391p553q7310j51449i1784D5585Q233j303B1389J15215a93077
9507G6687a44287k94269B8784b69445a02110j37212O8334K1320B35366m7484a55340
9495a55279k45019A0300J48786a02922J8285E3846g4306k7264A6391c8774m042
9484d2816j62793h7877p624H872e06960a43167A16862d0743j05699j04364a13810
9472C2210a50689B3215H539a33289j2936k2468G2896d15457J87908B07218r7874
9461A09344a88806C70235j78486n34M2950E4919h2018q1258j3650J5895B3788
$$ plain form
9543 183378 -343594 -62510 -246771 -94397 -198963 -175899 92800 54140 -342091 92855 -167380
9531 -328248 44757 -213290 -192899 -122988 -81869 163037 301697 -16353 16654 -166958 -313661
9520 -313661 203457 -30391 -37944 -125254 -276703 -91784 45585 53818 52515 21389 136604 -193077
9507 76687 -144287 -438556 28784 -269445 -102110 -239322 -170988 -149668 235366 187882 -155340
9495 -155279 -400298 10300 159086 -102922 -84637 53846 -74306 -101570 16391 -38774 -42816
9484 -42816 -205609 -87877 -95501 8872 -506960 -143167 116862 -40743 -146442 -250806 -113810
9472 32210 -150689 23215 8539 -133289 -146225 -168693 72896 -415457 -227549 207218 109344
9461 109344 -188806 370235 191749 191215 234165 54919 -82018 -163276 -176926 -161031 23788
9449b74209a16372k9733j70779a33118A03596d2415k52504D3712b69987J24182
9439a45805A41112f8054m0276B3624J10541C8536A0703a86259B10350b54996p5108
9428c30104e8048C53863e0950D7433L2727L3647a87192l2062B80853a10997A51782
9416E2219d27275P9295a71159B7204K45931b76996g5060B2802K46128e3295r6904
9405a50199L6989A12915b34964K0125m5597g2453B1519A345f8534j35515A38230
9393c00817M8418n319I264i0388d5149m34563E2626e6826E6089a71697A07388
9381a19141A02994m7635K99650j33688a78658B10489Q3921B7614a93767d095k77571
9370b81666A30872a1553A25562a09125C34991A14308K40591I6295a19289A6985
$$ plain form
9449 -274209 -116372 -146105 -316884 -133118 103596 -42415 -294919 43712 -269987 -145805
9439 -145805 141112 -68054 -108330 23624 134165 38536 10703 -186259 210350 -254996 -330104
9428 -330104 -58048 353863 -50950 47433 80160 113807 -187192 -219254 280853 -110997 151782
9416 52219 -427275 -347980 -171159 27204 273135 -276996 -75060 22802 268930 -53295 -150199
9405 -150199 -113210 112915 -234964 -214839 -260436 -72453 21519 1345 -68534 -204049 138230
9393 -300817 -252399 -257718 9264 -90388 -45149 -479712 52626 -56826 56089 -171697 107388
9381 -119141 102994 55359 355009 221321 -178658 210489 294410 27614 -193767 -4095 -281666
9370 -281666 130872 -11553 125562 -109125 334991 114308 354899 96295 -119289 16985
9359H0267b47426A79256a08415n1274g6590C9690J63138p6167f1054k7848C2667
9347c10398G3909d6614l58182B84406H8170a95C975d0190F6898M7462j4893a73165
9334D9988d11775A1705b97981N9130J18329l9151j39436e7006o188F9538J758
9323G1296G447O3146B3479J85047a73031a9441j27740j54968a15453N7196r9951
9312a58208f1978k4624o0338o2037Q3547q9068k24133A03899c85202J22443j0928
9301b73687B12660q7886c45337a37459d2799k10236I5325a69556F4255J44258
9291B08513a58070p5200B5210b47662C9331J13759c05898a17862e6141C81851
9280b50260B22812k8984b9779A53192b97558J5665h2560k81842O6019h1375p3777
$$ plain form
9359 80267 -247426 179256 -108415 -159689 -76590 39690 202828 126661 -61054 -88902 32667
9347 -310398 73909 -46614 -404796 284406 88170 -195 3975 -40190 66898 114360 99467 -173165
9334 49988 -411775 11705 -297981 -238851 -120522 -159673 -299109 -57006 -63194 69538 71296
9323 71296 7447 70593 23479 208526 -173031 -19441 -147181 -302149 -115453 -58257 -158208
9312 -158208 -61978 -86602 -146940 -208977 -125430 -214498 -438631 103899 -385202 -262759 -273687
9301 -273687 212660 124774 -345337 -137459 -42799 -253035 95325 -169556 64255 208513
9291 208513 -158070 -233270 25210 -247662 39331 153090 -305898 -117862 -56141 381851
9280 -250260 222812 193828 -29779 153192 -297558 -281893 -82560 -364402 -298383 -81375 -155152
9269a55152N0654F7782b08031b7851l09867j30373a51342B63313a30298A09200
9258I6177Q588m0356l0924j2570d9593a9096C2619d17837B4604N9630i0490B43195
9245B2368c0688j57576O6125m2877A97105b32384i4759m4707K5411j86960C46931
9233a67352A25614a21385o2758Q7851C7840e7437K21k79032Q7445i6658j58042
9222b54700A19238b5016A57299c5137q1536j5431K3758A56208n875j330b59026
9210B35078a61777B787d0206k45959M6512a5893j35605J1357n9088g3374j92043
9199b65417h9412j99787I9478N9732d4489a2601A17017J7961a22808A95942k0201
9188A75741g1453D918J87929a61796I0031a13499L6599L3107C144J34284F7468
$$ plain form
9269 -155152 -104498 67782 -208031 -27851 -337718 -468091 -151342 263313 -130298 109200
9258 96177 104765 64409 33485 20915 -49593 -19096 32619 -417837 24604 84234 -90490 243195
9245 22368 -30688 -188264 -122139 -165016 197105 -232384 -94759 -139466 -114055 -301015 346931
9233 -167352 125614 -121385 -184143 -96292 37840 -57437 -57216 -336248 -248803 -96658 -254700
9222 -254700 119238 -25016 157299 -35137 -116673 -132104 -108346 156208 150333 149003 -259026
9210 235078 -161777 2787 -40206 -286165 -239653 -15893 -151498 -140141 -199229 -73374 -265417
9199 -265417 -89412 -289199 99478 159210 -44489 -12601 117017 134978 -122808 195942 175741
9188 175741 -71453 4918 192847 -161796 90031 -113499 -76900 -43793 3144 137428 67468
9176B61706a52006B164a41417j63915g4673F8788a80871D4930a61819E2563a96295
9164A73533a40926k28083B9351A3673g9161k3697L9141l0314j41662H3177f8693
9152B84094b44311B9724J5831L5585b32746R1004A50966a32313H877O5577j4849
9141E9605a32987o010j55223B14623i0389A54979n5654c57626b5729B3868J6741
9130D0609b61837b8317j44033f731j60079F8865a02169A36363g2745A11237c83227
9118A19272b53075a00153M4318k0778I5110c3857k69137A378P9237f3033j90122
9107b53155I0897A6722a88620h9706E8855c06421g5745l91985a83656F9594A8431
9095A38422a27669k16911F9037a37138C20556A3485a06541r8335c9310n0521K8395
$$ plain form
9176 261706 -152006 2164 -141417 -305332 -74673 68788 -180871 44930 -161819 52563 -196295
9164 173533 -140926 -369009 29351 13673 -79161 -102858 -63717 -94031 -235693 83177 -68693
9152 284094 -244311 29724 45555 81140 -232746 -141742 150966 -132313 8877 74454 59605
9141 59605 -132987 -138997 -294220 214623 -90389 154979 99325 -357626 -25729 23868 40609
9130 40609 -261837 -28317 -172350 -6731 -166810 68865 -102169 136363 -72745 111237 -383227
9118 119272 -253075 -100153 -55835 -76613 95110 -33857 -302994 1378 80615 -63033 -253155
9107 -253155 90897 16722 -188620 -89706 58855 -306421 -75745 -467730 -183656 69594 18431
9095 138422 -127669 -344580 69037 -137138 320556 13485 -106541 -204876 -39310 -89831 -61436
9084f1436o3333C74713H5088a55644L3749A00040b5696A0010L6931a12030B23949
9072f4325D4437g8843j86924E664a97472F1437K55565D53a03105N0219k86599
9061c39485B40793b32856a08003c7369l05752O9768b7128B30009A1897e5553A22855
9049B99417a33618j16624c2727I2931N2714a19665l8746L9267a1446j49558a8420
9037i8490j19851l8717A21930m0388d3428A07806f8252B3815a13587D9754J52361
9026B02115D8083a0981k38243b3204A48852i5478G5232a19155j1922j8351d8807
9014A05364f2604J418k180m5109B66108d6323k30120d725j91564H143d0183E9752
9001A87261c66377b6680k13599j66435c1420B8497c8061c843q253A17792c9272
$$ plain form
9084 -61436 -124769 374713 85088 -155644 -121895 100040 -25696 10010 46941 -112030 223949
9072 -64325 44437 -78843 -265767 5664 -197472 61437 317002 453 -103105 -52886 -339485
9061 -339485 240793 -232856 -108003 -37369 -343121 -273353 -27128 230009 11897 -55553 122855
9049 299417 -133618 -250242 -32727 92931 145645 -119665 -158411 -119144 -11446 -161004 -18420
9037 -98490 -218341 -257058 121930 81542 -43428 107806 -68252 23815 -113587 49754 202115
9026 202115 48083 -10981 -249224 -23204 148852 -95478 75232 -119155 -131077 -149428 -48807
9014 105364 -62604 -61186 -63366 -108475 266108 -46323 -276443 -4725 -196289 8143 -40183 59752
9001 187261 -366377 -26680 -240279 -406714 -31420 28497 -38061 -3843 -12096 117792 -39272
8989b36541D085K6151J01123n4747A5819e895H9382R9043a71377l9319A63858
8977B20405c74523I894L18783b78805L8270A28989A1490b0872j61591f5969k03142
8966b69111a11784l730E256K56317h7373j11183K6270M8539j0803H4212k452f56
8953i5741D520J8102e7844E7636b31403B11587O4185j34209K28627a96331k6854
8942b23185B4927L4a90511A85120a9397B14583A03258C809K35353I03K05611m6786
8930A59728P9931p3163q3046O99504l36526Q19490K43190J064265L786753R74881
8920G335007B838205I48480j09313C33480K47914A47343L04827f1530C26675M5453
8910C72128A38708J45564R1647j27494r8704n8199R9957G7348d0614E0632L62642
$$ plain form
8989 -236541 4085 30236 131359 76612 15819 -5895 89382 188425 -171377 -210696 163858
8977 220405 -374523 9894 328677 -278805 -240535 128989 11490 -20872 -182463 -65969 -269111
8966 -269111 -111784 -115514 5256 261573 -87373 -198556 -172286 -123747 -134550 84212 81760 -656
8953 -95741 4520 22622 -57844 57636 -231403 211587 275772 141563 370190 -196331 -223185
8942 -223185 24927 24961 -190511 185120 -19397 214583 103258 3809 239162 903 206514 159728
8930 159728 239659 166496 83450 782954 446428 1265918 1509108 2573373 6360126 7335007
8920 7335007 2838205 948480 839167 333480 581394 147343 452170 -61530 326675 372128
8910 372128 138708 284272 375919 248425 149721 91522 191479 77348 -40614 50632 413274
8899D13274A33029b28418D33436B3590b0332F9866A5433M0562R7596g7570b1627
8887A30515b21208o858l4768R3114B31096p5397a35022J1040j00712k05587J77275
8876b53006C9603J02339a97236A67241a89798C34595r7672k8547a0276m0343B45822
8864c8589j54380l2879A36858B9119a40958A5712a91337A06746a72987p0652b0355
$$ plain form
8899 413274 133029 -228418 433436 23590 -20332 69866 15433 55995 153591 -77570 -21627
8887 130515 -221208 -228066 -262834 -169720 231096 155699 -135022 -123982 -224694 -430281 -253006
8876 -253006 39603 141942 -197236 167241 -189798 334595 236923 208376 -10276 -50619 245822
8864 -38589 -192969 -225848 136858 29119 -140958 15712 -191337 106746 -172987 -243639 -20355
$$ [...]
##END NTUPLES=NMR SPECTRUM
##END=
