
##TITLE=AC1246_NTBAH12036_6944998_PLavRkJpWO
##JCAMPDX= 6.0         $$ Bruker NMR JCAMP-DX V2.0
##DATA TYPE= NMR SPECTRUM
##DATA CLASS= NTUPLES
##ORIGIN= BRUKER
##OWNER= Administrator
$$ 1.72 TOPSPIN		Version 2.1
$$ 2012-10-18 13:44:36.692 -0700  Administrator@X
$$ Compression mode = diff/dup
##.OBSERVE FREQUENCY= 400.02188249412
##.OBSERVE NUCLEUS= ^1H
##.ACQUISITION MODE= SIMULTANEOUS (DQD)
##.ACQUISITION SCHEME= undefined
##.AVERAGES= 8
##.DIGITISER RES= 22
##SPECTROMETER/DATA SYSTEM= spect
##.PULSE SEQUENCE= zg30
##.SOLVENT NAME= COFFEE_meoh
##.SHIFT REFERENCE= INTERNAL, COFFEE_meoh, 1, 14.98509
##AUDIT TRAIL= $$ (NUMBER, WHEN, WHO, WHERE, PROCESS, VERSION, WHAT)
$$ ##TITLE= Audit trail, TOPSPIN		Version 2.1
$$ ##JCAMPDX= 5.01
$$ ##ORIGIN= Bruker BioSpin GmbH
$$ ##OWNER= Administrator
$$ $$ C:\Bruker\TOPSPIN/data/COFFEE/nmr/AC1246_NTBAH12036_6944998_PLavRkJpWO/10/pdata/1/auditp.txt
$$ ##AUDIT TRAIL=  $$ (NUMBER, WHEN, WHO, WHERE, PROCESS, VERSION, WHAT)
(   1,<2012-10-13 16:53:25.921 -0500>,<Administrator>,<TOPSPIN>,<go>,<TOPSPIN 2.1>,
      <created by zg
	started at 2012-10-13 16:52:19.015 -0500,
	POWCHK enabled, PULCHK disabled,
       configuration hash MD5:
       6B 1B 68 BB D9 2E 58 E2 7F 35 AD 54 07 DF 0E 41
       data hash MD5: 64K
       D5 06 58 E3 62 0A 03 51 A2 B4 0B 26 24 17 CB 94>)
(   2,<2012-10-13 16:53:28.812 -0500>,<Administrator>,<TOPSPIN>,<proc1d>,<TOPSPIN 2.1>,
      <Start of raw data processing
       efp LB = 0 FT_mod = 6 PKNL = 1 PHC0 = 0 PHC1 = 0 SI = 32K 
       data hash MD5: 32K
       9C 64 FF 41 D3 66 AA 57 33 77 1A E6 FF 09 A7 7C>)
(   3,<2012-10-13 16:53:29.218 -0500>,<Administrator>,<TOPSPIN>,<proc1d>,<TOPSPIN 2.1>,
      <pk PHC0 = 182.5269 PHC1 = 0 
       data hash MD5: 32K
       46 F9 6C E3 6F CF 18 01 BA E6 D1 12 D0 BA 4C 26>)
(   4,<2012-10-13 16:53:29.296 -0500>,<Administrator>,<TOPSPIN>,<proc1d>,<TOPSPIN 2.1>,
      <abs ABSG = 1 
       data hash MD5: 32K
       9A 22 0D 05 A6 91 A8 B9 BE 22 11 8C E1 C9 59 35>)
(   5,<2012-10-13 16:53:29.328 -0500>,<Administrator>,<TOPSPIN>,<proc1d>,<TOPSPIN 2.1>,
      <abs ABSG = 2 
       data hash MD5: 32K
       35 6F BB F8 AE 27 B9 EF AC 76 CC E3 52 41 A9 EE>)
(   6,<2012-10-13 16:53:29.359 -0500>,<Administrator>,<TOPSPIN>,<proc1d>,<TOPSPIN 2.1>,
      <abs ABSG = 3 
       data hash MD5: 32K
       EA 04 CA 81 81 9D A5 D7 F6 83 AC 2A 6D EC FA EF>)
(   7,<2012-10-13 16:53:29.390 -0500>,<Administrator>,<TOPSPIN>,<proc1d>,<TOPSPIN 2.1>,
      <abs ABSG = 4 
       data hash MD5: 32K
       91 18 54 7B 9C E3 59 A9 96 CE D1 B3 A2 66 48 36>)
(   8,<2012-10-13 16:53:29.421 -0500>,<Administrator>,<TOPSPIN>,<proc1d>,<TOPSPIN 2.1>,
      <abs ABSG = 5 
       data hash MD5: 32K
       09 DD A7 64 10 A4 F7 D9 D2 3F 24 7F D3 02 6C 0F>)
(   9,<2012-10-13 16:53:33.312 -0500>,<Administrator>,<TOPSPIN>,<audit>,<TOPSPIN 2.1>,
      <user comment:
       ICON-NMR User ID: COFFEE
       data hash MD5: 32K
       09 DD A7 64 10 A4 F7 D9 D2 3F 24 7F D3 02 6C 0F>)
$$ ##END=
$$ [...]
150 150 150 150 150 150 150 150
##$TP07= 0
##$TPNAME0= <>
##$TPNAME1= <>
##$TPNAME2= <>
##$TPNAME3= <>
##$TPNAME4= <>
##$TPNAME5= <>
##$TPNAME6= <>
##$TPNAME7= <>
##$TPOAL= (0..7)
0.5 0.5 0.5 0.5 0.5 0.5 0.5 0.5
##$TPOFFS= (0..7)
0 0 0 0 0 0 0 0
##$TUNHIN= 0
##$TUNHOUT= 0
##$TUNXOUT= 0
##$USERA1= <user>
##$USERA2= <user>
##$USERA3= <user>
##$USERA4= <user>
##$USERA5= <user>
##$V9= 5
##$VALIST= <valist>
##$VCLIST= <CCCCCCCCCCCCCCC>
##$VD= 0
##$VDLIST= <DDDDDDDDDDDDDDD>
##$VPLIST= <PPPPPPPPPPPPPPP>
##$VTLIST= <TTTTTTTTTTTTTTT>
##$WBST= 2048
##$WBSW= 25
##$XGAIN= (0..3)
0 0 0 0
##$XL= 0
##$YL= 0
##$YMAX_a= 494572
##$YMIN_a= -635820
##$ZGOPTNS= <>
##$ZL1= 120
##$ZL2= 120
##$ZL3= 120
##$ZL4= 120
##$ABSF1= 14.98509
##$ABSF2= -5.573092
##$ABSG= 5
##$ABSL= 3
##$ALPHA= 0
##$AQORDER= 0
##$ASSFAC= 0
##$ASSFACI= 0
##$ASSFACX= 0
##$ASSWID= 0
##$AUNMP= <proc_prof1d_extract_pilot.lims>
##$AXLEFT= 0
##$AXNAME= <>
##$AXNUC= <1H>
##$AXRIGHT= 0
##$AXTYPE= 0
##$AXUNIT= <>
##$AZFE= 0.1
##$AZFW= 0.1
##$BCFW= 0
##$BC_mod= 0
##$BYTORDP= 0
##$COROFFS= 0
##$CY= 15
##$DATMOD= 1
##$DC= 0
##$DFILT= <>
##$DTYPP= 0
##$F1P= 0
##$F2P= 0
##$FCOR= 0.5
##$FTSIZE= 32768
##$FT_mod= 6
##$GAMMA= 0
##$GB= 0
##$INTBC= 1
##$INTSCL= 1
##$ISEN= 128
##$LB= 0
##$LEV0= 0
##$LPBIN= 0
##$MAXI= 10000
##$MC2= 0
##$MEAN= 0
##$ME_mod= 0
##$MI= 0
##$NCOEF= 0
##$NC_proc= -8
##$NLEV= 6
##$NOISF1= 0
##$NOISF2= 0
##$NSP= 0
##$NTH_PI= 0
##$NZP= 0
##$OFFSET= 14.98509
##$PC= 1
##$PHC0= 182.5269
##$PHC1= 0
##$PH_mod= 1
##$PKNL= yes
##$PPARMOD= 0
##$PPDIAG= 0
##$PPIPTYP= 0
##$PPMPNUM= 2147483647
##$PPRESOL= 1
##$PSCAL= 4
##$PSIGN= 0
##$PYNMP= <proc.py>
##$REVERSE= no
##$SF= 400.02
##$SI= 32768
##$SIGF1= 0
##$SIGF2= 0
##$SINO= 400
##$SIOLD= 32768
##$SPECTYP= <>
##$SREGLST= <1H.CDCl3>
##$SSB= 0
##$STSI= 32768
##$STSR= 0
##$SW_p= 8223.68421052631
##$SYMM= 0
##$S_DEV= 0
##$TDeff= 65536
##$TDoff= 0
##$TI= <>
##$TILT= no
##$TM1= 0
##$TM2= 0
##$TOPLEV= 0
##$USERP1= <user>
##$USERP2= <user>
##$USERP3= <user>
##$USERP4= <user>
##$USERP5= <user>
##$WDW= 1
##$XDIM= 32768
##$YMAX_p= 445814010
##$YMIN_p= -699570
##$CURPLOT= <Network HP LaserJet P1505>
##$CURPRIN= <$Network HP LaserJet P1505>
##$DFORMAT= <normdp>
##$LAYOUT= <+/1D_H.xwp>
##$LFORMAT= <normlp>
##$PFORMAT= <normpl>
##$SURQMSG= 1
$$ End of Bruker specific parameters
$$ ---------------------------------
##NTUPLES= NMR SPECTRUM
##VAR_NAME=  FREQUENCY,     SPECTRUM/REAL,   SPECTRUM/IMAG
##SYMBOL=    X,             R,               I
##VAR_TYPE=  INDEPENDENT,   DEPENDENT,       DEPENDENT
##VAR_FORM=  AFFN,          ASDF,            ASDF
##VAR_DIM=   32768,         32768,           32768
##UNITS=     HZ,            ARBITRARY UNITS, ARBITRARY UNITS
##FACTOR=    0.250966925370066, 1,           1
##FIRST=     8223.43324360094, -306477,      30011
##LAST=      0,             -124212,         -192039
##MIN=       0,             -699570,         0
##MAX=       8223.43324360094, 445814010,    0
$$ Real data points
##PAGE= N=1
##DATA TABLE= (X++(R..R)), XYDATA
$$ [...]
19544B5670J47878c38046A06726k9901K50421a06331C72001g778B77804b08010
19533a93739L5849f5420C36166b49017K891q3829J37137r3801B7192P8331M081
19522A09604P6143h3852a6462k04512C38948E8313Q0708d43410J99779A40827
19511a33196j15011b0034k07322P4030l3141G5776d6827A59792d3130b200D6213
19499g8768j75230A18455i4618M6335o1819j0125a4995m4026k86639c4273j59403
19488a93676A8859h9019r7224A91358M0303b40005B49936j03384h8252k32274
19478c20526A59041E0874a42308H5835a28748N2193m1734j84098a21296m1145
19468a62441a8102A30412n4358h0251D808b97742j60513H642f695A22253l8128
$$ plain form
19544 25670 173548 -338046 106726 76825 327246 -106331 372001 -7778 277804 -208010
19533 -193739 -157890 -65420 336166 -249017 -246126 -329955 -192818 -286619 27192 105523 109604
19522 109604 185747 -83852 -16462 -220974 338948 58313 139021 -443410 -243631 140827
19511 -133196 -248207 -20034 -227356 -153326 -186467 75776 -46827 159792 -43130 -2200 46213
19499 -78768 -253998 118455 -94618 -48283 -110102 -120227 -14995 -59021 -345660 -34273 -193676
19488 -193676 18859 -89019 -186243 191358 231661 -240005 249936 146552 -88252 -320526
19478 -320526 159041 50874 -142308 85835 -128748 -76555 -118289 -302387 -121296 -162441
19468 -162441 -18102 130412 76054 -80251 4808 -297742 -458255 8642 -6695 122253 84125
19457H4125A6282L5467J83369D9574c14447O2210N7585H7386c17415A60008b38897
19445b73420K9236f3116j65506C2064g0595J823k09191N5809C05507f7396j4809
19434h2205c6454B32619b14950N1460A75883a65544D864M7125a53876O2702J4192
19423g6982H9654a1292B6580i7890k63993J43855A34395a07115j5864o9299h8604
19411C6890a24696K3331j237j60295a04337c6623j57615D093J2567K8507c62484
19399I1364b00966C46616a75254H3857c82951A02407l9919f3581C7641b1760q3573
19388a05333l1184k47876J77257G2044c1332j84119G2441a21454a2640j84392
19378a97032i1148n5795r1893R8603H5006b89607e8897B5556a91267a888k17031
$$ plain form
19457 84125 16282 51749 235118 49574 -314447 -252237 -194652 87386 -317415 160008 -238897
19445 -273420 -244184 -63116 -228622 32064 -70595 -68772 -277963 -222154 305507 -67396 -82205
19434 -82205 -36454 232619 -214950 -163490 175883 -165544 4864 51989 -153876 -91174 -76982
19423 -76982 89654 -11292 26580 -97890 -361883 -218028 134395 -107115 -122979 -192278 -88604
19411 36890 -124696 -101365 -102602 -262897 -104337 -36623 -194238 4093 16660 45167 -362484
19399 91364 -200966 346616 -175254 83857 -382951 102407 62488 -63581 37641 -21760 -105333
19388 -105333 -136517 -384393 -207136 72044 -31332 -215451 72441 -121454 -12640 -197032
19378 -197032 -91148 -146943 -238836 -140233 85006 -289607 -58897 25556 -191267 -1888 -218919
19367b18919A24829a06761j96017H8195a68426J4654O8847A42672i1964C39658
19356B34308a17774K1846j78028a916I5490K2200b51592c1335B49117a20100F0507
19344C20977A5992J4496a50488A18627a62703I5596a03626A12397C2785P5483
19334A08268a81051E4308J98419m729a02874l77571a02561j13068C9891e8399
19323g1792F9587a33608F7758K6165H87a57857C153b41537n7212J33924O9927
19312i4898d1374k9879m3421E9383a78142b1898f252j24022L8695p1151k5598
19301a88328D085c85474c4802B12634G5N5569a06764c3079p8343k76907A21e9663
19288a86110B3251c18808G2976J2697b74979A23215a86203p1397J06416I9412
$$ plain form
19367 -218919 124829 -106761 -302778 88195 -168426 -153772 -84925 142672 -91964 339658
19356 234308 -117774 -95928 -273956 -1916 95490 117690 -251592 -31335 249117 -120100 60507
19344 320977 15992 30488 -150488 118627 -162703 95596 -103626 112397 32785 108268
19334 108268 -181051 54308 252727 247998 -102874 -480445 -102561 -215629 39891 -58399
19323 -71792 69587 -133608 67758 93923 887 -157857 3153 -241537 -298749 -164825 -94898
19312 -94898 -41374 -71253 -114674 59383 -178142 -21898 -6252 -130274 -91579 -162730 -188328
19301 -188328 4085 -385474 -34802 212634 75 55644 -106764 -33079 -111422 -388329 121 -59663
19288 -186110 23251 -318808 72976 85673 -274979 123215 -186203 -257600 -151184 99412
19277F7979k0419e2273K2491K70H2476a60719c2108k14359A54905R4028a23845
19265B03818b68060H4138d3335b728m1774A55094c48999b9404j04893A48385d9701
19253a82717J9147R203F0741B5126b8257l09033J14408a4242A22188l5559b44743
19241b05173B25904a81794j82783a06128o1484c2418j15844O2295c6575H5834
19230b82608A6832A281h5823p22A9620a26414A44474P8982e3206j20633d3994
19218a13386c8711r2515p8777C9626a60784D158L35527a22384A53859c2219j18562
19207a50781K2977K5675o0560j74808B9162r093a79377j39301J39868A09576a97232
19195H0105d01656l2917C9771a66902O9464D7376i7343k2740d0082A19566j4661
$$ plain form
19277 67979 47560 -52273 -29782 -29512 82476 -160719 -32108 -246467 154905 248933 -123845
19265 203818 -268060 84138 -43335 -2728 -44502 155094 -348999 -29404 -134297 148385 -49701
19253 -182717 -163570 -154367 60741 25126 -28257 -337290 -222882 -14242 122188 86629 -244743
19241 -205173 225904 -181794 -364577 -106128 -167612 -32418 -148262 -85967 -36575 85834
19230 -282608 16832 1281 -85823 -86545 19620 -126414 144474 223456 -53206 -173839 -43994
19218 -113386 -38711 -131226 -210003 39626 -160784 4158 339685 -122384 153859 -32219 -150781
19207 -150781 -127804 -102129 -162689 -337497 29162 20069 -179377 -318678 -178810 109576 -197232
19195 80105 -401656 -434573 39771 -166902 -97438 47376 -97343 -120083 -40082 119566 104905
19184A04905J09352O2218b77085I0357i9110P659A57512a33328P226m24268b00542
19172A5138K3514a6825G5155J84005c35600g8669b9521G2431b16919j59806J86502
19161a90223G2371C3190l678f9465b6910r2786J608A35520g4733L5506H8788a90831
19148E2757J5401h694I7638M4983g9418A15524b31164A83995b45559L9397n4966
19137b61128A61442a20400k9505P877l0952g5749A61174e5375F9700b50288P2118
19126a78170A07126a63204j5753A08237P4834n7291g4893I5165a77643I4262a63503
19114A05324a00653C6338d7770j9421A64272B5434A0240j99a06020k4564H5409
19102B04121b3800a0822A57974b38136R5551D3412j9329c55342a08703L0478A04661
$$ plain form
19184 104905 214257 276475 -277085 90357 -99110 -91451 157512 -133328 -126102 -550370 -200542
19172 15138 38652 -16825 75155 259160 -335600 -78669 -29521 72431 -216919 -376725 -190223
19161 -190223 72371 33190 29512 -69465 -26910 -119696 -118088 135520 -74733 -39227 88788 -190831
19148 52757 68158 -8694 97638 142621 -79418 115524 -231164 183995 -245559 -206162 -261128
19137 -261128 161442 -120400 -149905 -142028 -172980 -75749 161174 -55375 69700 -250288 -178170
19126 -178170 107126 -163204 -178957 108237 183071 125780 -74893 95165 -177643 94262 -163503
19114 105324 -100653 36338 -47770 -67191 164272 25434 10240 10041 -106020 -130584 85409
19102 204121 -23800 -10822 157974 -238136 -142585 43412 24083 -355342 -108703 -78225 104661
19090a6058J923j64952k0971O2747M1541k29025A52450G284b39198H5959l5658
19079E0301h5775H3556c0106C23942a04290j23468b7195H5693b25371j3208B09181
19067b56190K2163a15093j05033N4526J3892n1706c453C16610i7465j12099M5080
19056a64484j72252A62010L0530a10813j35381F6456N8172a60778K3599D74K43922
19045B44396d8608l77241J57652B29478a03693m7C5420i475l3520D91433I4187
19033A9412a43616e6014C192L8657J7259e7183j72895d3610j58368A66337a43190
19021A1757K94552A0487J65321b08853l8714A35879b02695A72795a83233A95132
19010a12284j57891B863P8440e9643j00164P4127k01029A41083b71624j3975g6229
$$ plain form
19090 -16058 -14135 -179087 -200058 -137311 -95770 -324795 152450 7284 -239198 85959 50301
19079 50301 -85775 83556 -30106 323942 -104290 -227758 -27195 85693 -225371 -238579 209181
19067 -256190 -234027 -115093 -220126 -165600 -151708 -203414 -3453 316610 -97465 -209564 -164484
19056 -164484 -336736 162010 192540 -110813 -246194 66456 124628 -160778 -137179 474 244396
19045 244396 -48608 -425849 -268197 229478 -103693 -103740 35420 -9475 -42995 491433 94187
19033 19412 -143616 -56014 3192 41849 59108 -57183 -230078 -43610 -201978 166337 -143190
19021 11757 306309 10487 175808 -208853 -247567 135879 -202695 172795 -183233 195132
19010 -112284 -270175 2863 81303 -59643 -159807 -85680 -286709 141083 -271624 -285599 -76229
18998e6814j58566h2329A09694b23795a10933r2195c0524k79110h5120A8162d6943
18986g647j26003J2121B20091a36951P780l2335k8037r5039A83310G3756b0393
18974h9910m4495M4036k03316A85202G819J48593k8038m2762C9730N5190b12366
18962I737K1494K75243a83100D0153b98279A4083K66991g9703B8261e09811F5148
18950b41435A42126c11167a14681B64648a10266C69490G2735a0602D2426J64000
18940B06426a3291H3522a93808O2820d6572j60940P8370K2136A436J2929K45210
18929B59575Q5921D4197b36817a1440A93298j3703a80090A99049b52130d714A74362
18917H0235J67446C6005f1917c362m1051k60731C260a35675j37254R4096l2978
$$ plain form
18998 -56814 -215380 -82329 109694 -223795 -110933 -203128 -30524 -309634 -85120 18162 -46943
18986 -7647 -133650 -121529 220091 -136951 -129171 -161506 -189543 -284582 183310 73756 -20393
18974 -89910 -134405 -90369 -293685 185202 7819 156412 128374 85612 39730 94920 -212366
18962 9737 31231 306474 -183100 40153 -298279 14083 281074 -79703 28261 -509811 65148
18950 -241435 142126 -311167 -114681 264648 -110266 369490 72735 -10602 42426 206426
18940 206426 -13291 83522 -193808 -130988 -46572 -207512 -129142 -107006 1436 14365 259575
18929 259575 345496 44197 -236817 -11440 193298 179595 -180090 199049 -252130 -4714 174362
18917 80235 247681 36005 -61917 -3362 -44413 -305144 3260 -135675 -272929 -178833 -211811
18906b11811R4121a2415j41111b8704j22338B09102i4567H338J5615O2364a21312
18894i3859A14500b15904a04051b3615j78627A99001E721P5524a64276K7221A07329
18882d6631m67005b30921C5810b19748e6791k08084a07496a9028j00467N3418
18872f6077K7601p0700j25839A36795g3649K1756l24736c8162r85j42832e7879
18860e5717E6053g974B67J39279F5834d47887d8662A33780O3972b74050C6285
18848B4788J27602j0674o1b71077g8655A62887P8971a38439j13947a14126C4501
18836A04029B6954J0954L551d8752K197A14583d0723A14227h6254o7370j4679
18825a68303j18181o8738c6770O397j79924Q7982a2782A88207H3372j6572a54023
$$ plain form
18906 -211811 -117690 -12415 -153526 -28704 -151042 209102 -94567 8338 23953 86317 -121312
18894 -93859 114500 -215904 -104051 -23615 -202242 199001 5721 81245 -164276 -137055 107329
18882 -46631 -513636 -230921 35810 -219748 -56791 -264875 -107496 -19028 -119495 -66077
18872 -66077 -38476 -109176 -235015 136795 -73649 -51893 -376629 -38162 -39147 -181979 -57879
18860 -55717 56053 -7974 267 139546 65834 -447887 -48662 133780 197752 -274050 36285
18848 24788 152390 141716 141655 -271077 -78655 162887 241858 -138439 -252386 -114126 34501
18836 104029 26954 37908 41459 -48752 -46555 114583 -40723 114227 -86254 -153624 -168303
18825 -168303 -286484 -355222 -36770 -30373 -210297 -122315 -12782 188207 83372 66800 -154023
18813c45549A57081l746a3289A2521K90202j21951c3239C40224b86843J2221a381
18801A35548n2430J50138h9323A22889d9846A7983L6938J944j4771b07547E2858
18789D6976c71973d0302m64826C76118a13365c7107B9350b85368I7225B3846J79324
18778B03170a40313K9638A57276B8201K67041b608F7510r244a38536A38995A828
18766c44899G0356b78660a21427A72383a00881A32677h6264K472j3758j87072
18756b84622d6767j37439G0609a69667m8461h5532A69271p8589k7337b83569j99458
18745d83027a25675j20875Q095A03852j6006J23886a19680D12618A46901a75132
18734A17631e45074G2968Q5794f5941p4127A27669m1677C659M2172b1123q4569
$$ plain form
18813 -345549 157081 153335 -13289 12521 302723 180772 -33239 340224 -286843 -274622 -1381
18801 135548 83118 233256 -89323 122889 -49846 17983 54921 56865 42094 -207547 52858
18789 46976 -371973 -40302 -505128 376118 -113365 -37107 29350 -285368 97225 23846 203170
18778 203170 -140313 -110675 157276 28201 295242 -2608 67510 58266 -138536 138995 1828
18766 -344899 70356 -278660 -121427 172383 -100881 132677 -86264 -83792 -97550 -284622
18756 -284622 -46767 -184206 70609 -169667 -218128 -85532 169271 90682 63345 -283569 -483027
18745 -483027 -125675 -246550 -238455 103852 87846 211732 -119680 412618 146901 -175132
18734 117631 -545074 72968 158762 -65941 -140068 127669 85992 3659 45831 -21123 -105692
18723a05692F7432b07325e2211j96470O8897N3620k85814J49124B0222J95745
18713B15967a11272j6349k4201e7523j83184g8554B0549b18548E1084K2644l6270
18702C7458Q280K08620b31734h1645j17804e5317q3421k54335a69906G923O8289
18691G6212g1293m189j24502G3442L03617e1280g077A8602c417j90334A91958
18679a04770j0349H562R1418N6400b18231c5411B90637q4692b58684B61471I4236
18667a48001B05467b15779J00934G5487a34459A02347a81694J8522N2865j89788
18657c00095J28529D2375f9887A38081j3710m5949b69870a085j36185D15401a74697
18645b54397g346C74346g1271h79A28616K8485c02611P6359h0323B4108b62408
$$ plain form
18723 -105692 67432 -207325 -52211 -248681 -179784 -126164 -411978 -262854 20222 215967
18713 215967 -111272 -127621 -151822 -57523 -240707 -78554 20549 -218548 51084 73728 37458
18702 37458 45738 254358 -231734 -81645 -199449 -55317 -138738 -393073 -169906 7923 76212
18691 76212 -71293 -75482 -199984 73442 377059 -51280 -7077 18602 -3417 -193751 191958
18679 -104770 -115119 8562 99980 156380 -218231 -35411 290637 205945 -258684 261471 94236
18667 -148001 205467 -215779 -114845 75487 -134459 102347 -181694 -163172 -110307 -300095
18657 -300095 -171566 42375 -69887 138081 124371 78422 -269870 -1085 -137270 415401 -174697
18645 -254397 -7346 374346 -71271 -879 128616 157101 -302611 -226252 -80323 24108 -262408
18633a68832A44959a58487B76264B9983e19365A28558B8517J5633d7145D65699
18622c4006k39065A70169a02581A75981J6536A0011N4546C0719a5521o3394j45464
18611b24379K7442k0526i5105J8995j76541k01154B07873B576h6887J4632B15628
18599f1876k47862d8429j33558C63583F2837a40424C1663b20986E8842b316C196
18587a16139d8860l73385B32767B0218a97830g6841A37222b01173A228h8690B784
18575a37350A2338b65512A73695M6672a96543L4161A43612i6124d4566A24870
18564b83740B66687b46781f3621B55354F8328e1335j93587A1693a858A81877a27369
18552b67782L7356R3200N8273H2460d16242R8495f4182j70984m4581R7039b3484
$$ plain form
18633 -168832 144959 -158487 276264 29983 -519365 128558 28517 44150 -47145 465699
18622 -34006 -273071 170169 -102581 175981 192517 10011 64557 30719 -15521 -78915 -224379
18611 -224379 -196937 -217463 -95105 -76110 -252651 -453805 207873 2576 -86887 -72255 215628
18599 -61876 -309738 -48429 -181987 363583 62837 -140424 31663 -220986 58842 -2316 3196
18587 -116139 -48860 -422245 232767 20218 -197830 -76841 137222 -201173 1228 -88690 2784
18575 -137350 12338 -265512 173695 220367 -196543 -162382 143612 -96124 -44566 124870
18564 -283740 266687 -246781 -63621 255354 68328 -51335 -244922 11693 -1858 181877 -127369
18552 -267782 -230426 -137226 -78953 82460 -416242 -317747 -64182 -235166 -279747 -182708 -23484
18540i8733a6432l4430j5305j81936c1577A98431a26589A2001K74642b41649A48143
18528b1766A86396b43393B4557J47140b2320D26727D8176a51857A08620D6755
18517B1219O474b15961e4865o5190A82335H911M4137a40637n8382A38594C7251
18505d9956q9213C2528e3395o3230m3889m2616f3600j51896A03750b77711Q9251
18494a88460E1617K86976a75592j26367a01569B29940a19066l3407B315J27010
18484A29325d19133a99928D3912A6105J09692a0062j75193H4752a62965B06690
18473a33533C9067A9527M1422A0298P3110C1502i9924J6667K5139k91347k6509
18462c75974k8619a49808G5447a39366d3915A08495a43575G5178a90927H0867
$$ plain form
18540 -98733 -16432 -50862 -66167 -248103 -31577 198431 -126589 12001 286643 -241649 148143
18528 -21766 186396 -243393 24557 171697 -22320 426727 48176 -151857 108620 46755
18517 21219 27693 -215961 -54865 -120055 182335 8911 53048 -140637 -199019 138594 37251
18505 -49956 -139169 32528 -53395 -116625 -160514 -203130 -63600 -215496 103750 -277711 -188460
18494 -188460 51617 338593 -175592 -301959 -101569 229940 -119066 -152473 2315 129325
18484 129325 -419133 -199928 43912 16105 125797 -10062 -185255 84752 -162965 206690
18473 -133533 39067 19527 60949 10298 83408 31502 -99924 -83257 -58118 -349465 -375974
18462 -375974 -404593 -149808 75447 -139366 -43915 108495 -143575 75178 -190927 80867
18451d0996k02498a13933A55321F1360b92858J25670e3934l0260A91032p6546
18441A14486e7054A29009E3129K23886a01958J1789o9456A85873a74273a6302
18430A29480a7356m03721a80341A0727J65567b15170B84790a88141G4914J8323
18420I3237E50K07031E4046m785f9353A0828f128l91964B2124a18749N2672o0448
18408a26525J6475M7677p9205f8571p0527k19907G722d5006k38099J00805B24059
18396A46289b94794J37085P5656j30878D2651i323A07373g1681B44664I0838b57620
18384b22125B82504R9553a33262C8529b01099d763p6550j24627Q3469A10750a68229
18372B7987a75066k00518G988c26249i4176G3101P7779a16630K678A90456a00796
$$ plain form
18451 -40996 -243494 -113933 155321 61360 -292858 -167188 -53934 -84194 191032 114486
18441 114486 -57054 129009 53129 277015 -101958 -90169 -159625 185873 -174273 -16302
18430 129480 -17356 -421077 -180341 10727 176294 -215170 284790 -188141 74914 93237
18420 93237 550 207581 54046 49261 -69353 10828 -6128 -398092 22124 -118749 -66077 -126525
18408 -126525 -110050 -62373 -141578 -68571 -139098 -359005 7722 -45006 -283105 -182300 224059
18396 146289 -294794 -157709 -82053 -212931 42651 -9323 107373 -71681 244664 90838 -257620
18384 -222125 282504 382057 -133262 38529 -201099 -4763 -81313 -205940 -122471 110750 -168229
18372 27987 -175066 -375584 7988 -326249 -94176 73101 150880 -116630 -113952 190456 -100796
18360a87345B4166J23824a07874A06132c7552j80485g1631J9632A09263a99239
18349h7972A34745a48080O4884k09183b8952j49720G6285b80687b4789m617n1711
18338h1117o7923d1982k06822J06606j7793k27235B62824d4078H189c7236E8686
18326B6571a7975B23011j06799K7476P6710a03501k33036R2291A06393N0533a90218
18314A52958b19966e073j7496B25849f70909f1301j24782L6689j64791a32115
18303A77176b08364a4942D39033a80102a7382j11213C00137l0954a99876F9029
18292b11531e6532B6043K9331K64755A21528b28865a9462k2939B9227L6658J28043
18281A93928b69451c1900o8369B031b3955j55776d518k12928E9893a7949j25455
$$ plain form
18360 -187345 24166 147990 -107874 106132 -37552 -218037 -71631 -51999 109263 -199239
18349 -87972 134745 -148080 -83196 -292379 -28952 -178672 76285 -280687 -24789 -29406 -81117
18338 -81117 -149040 -41982 -248804 -142198 -159991 -387226 262824 -44078 8189 -37236 58686
18326 26571 -17975 223011 116212 143688 220398 -103501 -336537 -244246 106393 156926 -190218
18314 152958 -219966 -5073 -22569 225849 -670909 -61301 -186083 -149394 -314185 -132115
18303 177176 -208364 -14942 439033 -180102 -17382 -128595 300137 269183 -199876 69029
18292 -211531 -56532 26043 55374 320129 121528 -228865 -19462 -42401 29227 65885 193928
18281 193928 -269451 -31900 -100269 2031 -23955 -179731 -4518 -217446 59893 -17949 -143404
18270a43404A18967b67783B55899a91454p4351a5826j045j62744c7029A48256
18259a53306o5085j55607Q1744a37980B3212d1483j58936D45200B22008b6916
18248A29159A4139g9321r725j362A15781A4896f181n7786B1458K12250I8890D4327
18235a62586B62090a41031e1184F2889b8718j3727c72n080j62888j60383A59126
18223B2934J00927D0909a96617C2166M7699C2953b92163F2224j1307J09475C6603
18211A59123i0555j0635N314A52840G4622k7684P1927i2828A55855J39699a34414
18199B6994g4580J6935j68341a09083K4487F0778j7182d2551r2634H2410C2278
18187a63147m5991i7541A0303a50647L9842A54500o1800e39642C02382b37018
$$ plain form
18270 -143404 118967 -267783 255899 -191454 -265805 -15826 -16871 -179615 -37029 148256
18259 -153306 -218391 -373998 -292254 -137980 23212 -41483 -200419 445200 222008 -26916
18248 129159 14139 -79321 -89046 -90408 115781 14896 -6181 -63967 21458 233708 98890 44327
18235 -162586 262090 -141031 -51184 62889 -28718 -42445 -372 -5452 -168340 -328723 159126
18223 22934 123861 40909 -196617 32166 79865 32953 -292163 62224 50917 160392 36603
18211 159123 -90555 -101190 -95876 152840 74622 46938 118865 -92828 155855 295554 -134414
18199 26994 -74580 -57645 -225986 -109083 -84596 60778 43596 -42551 -135185 82410 32278
18187 -163147 -209138 -97541 10303 -150647 -110805 154500 92700 -539642 302382 -237018
18176B11845a54294E8230J2094M00124e891n0094G5591K4547b30775m5663F2462
18164h119A77948n1202m9045a06092A06225M9718b1742k0837A09127a85050J4706
18153a70344J7458p1544p858N7572j00492O0923n5098K5047B1060c53746B17929
18141A39346e39757C18002b32391B43338a063j48839j9829A28077K259D767a08183
18129C47180a32156m2397A14761d12499N0686D7603a67684k13071H028a16764
18118a05173A58632g9036A28880C8789a31444j51378J2179B29970c8236B67070
18107A88051G0877a20439N3716L784j28440F1497a39461b6173A52288L6399d7429
18095E4909J14263B5363D187b93764j4814C2860b02598g6682k1132A53233i8994
$$ plain form
18176 211845 -154294 58230 70324 470448 -5891 -55985 75591 100138 -230775 -276438 62462
18164 -8119 177948 126746 77701 -106092 106225 155943 -21742 -42579 109127 -185050 -170344
18153 -170344 -152886 -224430 -232288 -174716 -275208 -214285 -269383 -244336 21060 -353746 217929
18141 139346 -539757 318002 -232391 243338 -1063 -149902 -169731 128077 130336 4767 -108183
18129 347180 -132156 -174553 114761 -412499 -361813 47603 -167684 -380755 8028 -116764
18118 -105173 158632 -79036 128880 38789 -131444 -282822 -270643 229970 -38236 267070
18107 188051 70877 -120439 -66723 -62939 -191379 61497 -139461 -26173 152288 188687 -47429
18095 54909 169172 25363 4187 -293764 -308578 32860 -202598 -76682 -97814 153233 -98994
18083F2269J34711B9146a56253k85969i6606J3400c0894C2709R1729C3288R5955
18072A29243a72003B02116p2005a29422a8964B41697a61574d3414A828d66755
18061b15108f4640A5442N10478i1720H9044e9310E57335F5721a24975C5901b0525
18049H4097h3517k30628c840A67609h5870B9888J89098q1196J71324b89758B65474
18037i6715e657F0513A8092i5757A81307l2231a32878F00O4183E364a53164B71539
18024B40667D6566b06638Q6978D91596a41830r2525A7100a60590N8481m9837N3040
18013i8906K2602H3162J04887a3252j07923A51738k4642a33907B54855d7338j77152
18002b24490B62330H142b34151a00225K805o0780Q855j75988e4515n6428A54102
$$ plain form
18083 62269 196980 29146 -156253 -442222 -96606 -83206 -30894 32709 124438 33288 129243
18072 129243 -172003 202116 130111 -129422 -18964 241697 -161574 -43414 1828 -466755
18061 -215108 -64640 15442 525920 -91720 89044 -59310 557335 65721 -124975 35901 -20525
18049 84097 -83517 -314145 -3840 167609 -85870 29888 218986 137790 309114 -289758 265474
18037 -96715 -5657 60513 18092 -95757 181307 149076 -132878 600 64783 5364 -153164 271539
18024 240667 46566 -206638 -119660 491596 -141830 -234355 17100 -160590 -102109 -151946 -98906
18013 -98906 -76304 83162 188049 -13252 -121175 151738 127096 -133907 254855 -47338 -224490
18002 -224490 262330 8142 -234151 -100225 -97420 -158200 -149345 -325333 -54515 -110943 154102
17990i321n3954k8729A49399b16570k0671A48753b7670d853l7675j2973A74084
17978F4820J5536a03951A26122B9630a71176j33386I7025h0208G4944f3573o3932
17967a27505N3647c1294H123P789a22987I5589D726a41640f4273I8825D7700b4614
17954A27265k0067a02547A1736l727h9245j27219G4109a56683A01828c7944k9315
17943f7259A64052a19289M2311A09469c38090f7164n3643o7878A42045a54896
17932A62813a28689a1713k04043N2582N2762n9764A01640a55425c1994A84905
17921C939J09296K05423e6815A39169g3353Q592B6120f763k19823a4792k43442
17910b58234B25713B4483R731f3067B9920K47092F7883j8003a87982e2776j1969
$$ plain form
17990 -9321 -63275 -92004 149399 -216570 -237241 148753 -27670 -4853 -42528 -55501 174084
17978 64820 80356 -103951 126122 29630 -171176 -304562 97025 -80208 74944 -63573 -127505
17967 -127505 -73858 -31294 8123 15912 -122987 95589 4726 -141640 -64273 98825 47700 -24614
17954 127265 107198 -102547 11736 8009 -89245 -216464 74109 -156683 101828 -37944 -67259
17943 -67259 164052 -119289 -76978 109469 -338090 -67164 -120807 -188685 142045 -154896
17932 162813 -128689 -11713 -215756 -163174 -110412 -170176 101640 -155425 -31994 184905
17921 3939 113235 318658 -56815 139169 -73353 -64761 26120 -6763 -226586 -14792 -258234
17910 -258234 225713 24483 34214 -63067 29920 277012 67883 49880 -187982 -52776 -64745
17899f4745B20956f8161G5621k9046h9666A72589e6232J9114J0487B13656i6491
17887A0668g1953l28k7960A35380c11375J04791F8314M1469a5495B55298a24169
17875a63255k5092Q8812d7819b2257g097l9422j11657b4663A10951M068a19334
17863A60517J40178D7449J86701e7428l1523k3837A6567b63121B38233j02536
17853A35697a76250p1342h9896A36337N0045a78409f8132H6992e813J026A41579
17841b20512i0515b7216C7417a63597R051n3706A11390j1899g010k90844J8266
17830b79588L1356j36558J12396A3958M2597m146F823a77535k28601B6704L7286
17819F3990l485a61576d4343j50578k4089R3172D25634c649A92539J614B9142
$$ plain form
17899 -64745 220956 -68161 75621 46575 -89666 172589 -56232 -37118 -26631 213656 -96491
17887 10668 -71953 -72281 -100241 135380 -311375 -206584 68314 109783 -15495 255298 -124169
17875 -163255 -188347 -99535 -47819 -22257 -7097 -46519 -158176 -24663 110951 115019 -119334
17863 160517 300695 47449 234150 -57428 -88951 -112788 16567 -263121 238233 135697
17853 135697 -176250 -247592 -89896 136337 186382 -178409 -68132 86992 -5813 -4787 141579
17841 -220512 -90515 -27216 37417 -163597 -154546 -208252 111390 99491 -7010 -297854 -279588
17830 -279588 -248232 -384790 -272394 13958 56555 52409 6823 -177535 -406136 26704 63990
17819 63990 60505 -161576 -44343 -194921 -219010 -125838 425634 -3649 192539 194153 29142
17807A12330a1549A88018e6131l11473P8344J08801p1300I9817e716K763B00532
17795a0537A85492J1083a52269B8161c82001a2156A395N1099J27611j9694K586
17784A62997p9966R4063M2300F4487c05449A04910c3409r2857d0701k17682C50862
17772a11638d1317F8031J78247a18578k69617g0803C1952a83715j18580h7934
17761A60004a3924G2708P2102h5767C81328A0368D081R553O82N7457h6034N10
17749h5524k46992D1882I02d4922H6716f8695o7960B1450h6786B48097c9998j26272
17737a66270o9424A88010a36107j5999H9495c97954a71807F3693P9053o4832k7679
17726E0235q400Q3188f1532D3277M7993L17094e1304A27242J43506e4703E5227
$$ plain form
17807 112330 -11549 188018 -56131 -367604 -289260 -180459 -251759 99817 -5716 -2953 200532
17795 -10537 185492 196575 -152269 28161 -382001 -12156 1395 52494 180105 160411 162997
17784 162997 83031 177094 219394 64487 -305449 104910 -33409 -126266 -40701 -258383 350862
17772 -111638 -41317 68031 246278 -118578 -388195 -70803 31952 -183715 -302295 -87934
17761 160004 -13924 72708 144810 -85767 381328 10368 4081 13634 14316 71773 -86034 -85524
17749 -85524 -332516 41882 902 -44922 86716 -68695 -136655 21450 -86786 248097 -39998 -166270
17737 -166270 -235694 188010 -136107 -152106 89495 -397954 -171807 63693 142746 77914 50235
17726 50235 41835 125023 -61532 43277 91270 408364 -51304 127242 270748 -54703 55227
17714D0055i3683G5615R5930a72992B04394r1729d3568n1728k81292A98364J02785
17703C01149r860F189a08593E4098a83238O603Q1363m5375A38494J04129A2244
17691a4891q8631k0768a2575j30641A95411b191D0582j1165J01194J6886C8397
17679A0867b71236a20456A77839i4151j57087A21392a09476C9364a72154p5248
17669b47402k77587a12148o8019A33380L9038P3011J08999G7334b60925R5536
17659a65389B0224b7979C01356a62537A57249p0290e98573A63945J0847p2255
17649A02537M3417i6588A86093f4640j73945B11897k2471c30087c5481l58962
17639c94443C29155E387c16337f321k95098h9398H7343b27972F1924K1700K80720
$$ plain form
17714 40055 -93683 75615 171545 -172992 204394 112665 -43568 -95296 -376588 198364 301149
17703 301149 291289 6189 -108593 54098 -183238 -176635 -95272 -140647 138494 242623 12244
17691 -14891 -103522 -124290 -12575 -143216 195411 -2191 40582 29417 130611 147497 38397
17679 10867 -271236 -120456 177839 -94151 -251238 121392 -109476 39364 -172154 -247402
17669 -247402 -524989 -112148 -180167 133380 172418 245429 354428 77334 -260925 -165389
17659 -165389 20224 -27979 301356 -162537 157249 86959 -598573 163945 174792 102537
17649 102537 145954 -96588 186093 -64640 -238585 211897 189426 -330087 -35481 -394443
17639 -394443 329155 5387 -316337 -6321 -301419 -89398 87343 -227972 61924 83624 364344
17628C64344a47260C87801A80397a49747l7577g5450m7022A34282A1232b9325
17617B53626J87373b04831E11615d1978k1192H3668R9655k308n504f942A01173
17605I0695b3960B7155a75774B14513L3412J5557D2526b9777C19396a09796A74465
17593h3084J4471F7054A7911L410J21485f61B00301j8446i6326G7840i5509E0327
17580A83083G1956M450J80074a56749b8819l8030l2312A15035J87507A09750h5807
17568b05208A85580a3949C49689E3827B1985b44589a1915B40892c66569a29290
17557C6703Q7185A5121b0882E5439J09284b64100C7219M3119J50505H2599c8906
17545A59956g7099j0781A24400f8774H2730a8179r5690j89521I6081e9318I7568
$$ plain form
17628 364344 -147260 387801 180397 -149747 -187324 -75450 -122472 134282 11232 -29325
17617 253626 440999 -204831 511615 -41978 -63170 83668 183323 181015 175511 -6942 101173
17605 90695 -23960 27155 -175774 214513 247925 263482 42526 -29777 319396 -109796 174465
17593 -83084 -68613 67054 17911 21321 142806 -661 200301 181855 -96326 77840 -95509 50327
17580 183083 71956 76406 256480 -156749 -28819 -66849 -99161 115035 302542 109750 -85807
17568 -205208 185580 -13949 349689 53827 21985 -244589 -11915 240892 -366569 -129290
17557 36703 123888 15121 -20882 55439 164723 -264100 37219 80338 230843 82599 -38906
17545 159956 -77099 -87880 124400 -68774 82730 -18179 -113869 -303390 96081 -59318 97568
17533g4816D8478a75757j48378A61975a18258k53110a44165g1577B60309a3994
17522A98545q4585K97318j59988a3517D51081G8281d8146C0508K28896D4972J44213
17511A89185P7631Q20g9171a1646r1728A1663a31096E8973Q7926k747a3155C63907
17498a39731B88022J8786j13275J24377A08335J97659E2804e7650A38619e7339
17487E6458d0950A78574k0472K14197f2314o9700d8794k21362f456A22781C9545
17475A93852K6053A05470K96370i1937C24101a66697B04048a8919C3463K75752
17465C09215C8508f4872A21717a0707A60259J42002l8868A25874J44448j25967
17455A44355l4034L09247n9919j79370N578K47117I3387L7227n2672K84047j11617
$$ plain form
17533 -74816 48478 -175757 -324135 161975 -118258 -371368 -144165 -71577 260309 -13994
17522 198545 113960 411278 251290 -13517 451081 78281 -48146 30508 259404 44972 189185
17511 189185 266816 267636 -79171 -11646 -103374 11663 -131096 58973 146899 144152 -13155 363907
17498 -139731 288022 306808 193533 317910 108335 305994 52804 -57650 138619 -57339
17487 56458 -40950 178574 158102 372299 -62314 -132014 -48794 -270156 -6456 122781 39545
17475 193852 219905 105470 401840 -91937 324101 -166697 204048 -18919 33463 309215
17465 309215 38508 -64872 121717 -10707 160259 302261 263393 125874 270322 144355
17455 144355 110321 419568 359649 180279 185857 432974 93387 130614 77942 361989 250372
17444B50372J2411H8781K39323q616n3224q9782J72422A46428N8478I7545L05399
17433D02944j15019A31744J17170E944K27542H5908K25633P4424j59022D9441
17422A52881a7755B60641A13438J87411A13468N6115H1324j2874J96101q5380
17412A79171O2765A659L00540j9565L06501k11946G7210K9722l6175J79640C3303
17400C12661J03897a2015C0188h0786B73364r5579J24057Q5579J18260A70549
17389i7645C04769b20815N9055G3146J58026k3874N1243j4890N5737L13931f2243
17377B97471l0389j20953M9794o3078J4186a20387B21610A04214k7328K62476
17367C39362A47638C9270Q1449a96032b6193B40202j07264d0057B5208a64742
$$ plain form
17444 250372 262783 88781 328104 319488 266264 176482 348904 146428 204906 97545 402944
17433 402944 287925 131744 248914 5944 233486 85908 311541 385965 226943 49441
17422 152881 -17755 260641 113438 300849 113468 169583 81324 68450 264551 179171
17412 179171 241936 1659 302199 282634 589135 377189 77210 106932 70757 250397 33303
17400 312661 416558 -12015 30188 -80786 273364 177785 301842 387421 505681 170549
17389 -97645 304769 -220815 -161760 73146 231172 207298 258541 243651 299388 613319 -62243
17377 297471 267082 146129 195923 132845 147031 -120387 221610 104214 76886 339362
17367 339362 147638 39270 120719 -196032 -26193 240202 132938 -40057 25208 -164742
17356A17316C4969a48069B88757r1069J83571F3442M8238b00907g5067G0634o258
17345F4376a73899B70625g3921B6322J63131a30119A93759p1268l5409a41661
17334g522C66292G0097J82933n8419O6103C0129N4395g9732D6267K82515h2747
17322I9183J36Q8515a17807B54272A17207B4993J10493l6717L97398a09463A82725
17310B89082q9332n0296b10413C6671K21866q8044c6806r3371C56478H2609f6987
17298c04753B29593R6735A17499O81n1947J80719E0691M73416g2207A99444O0403
17287B59847C1597L6365L74542a92204A17873J4159J51310a33413D34328h2550
17276B83397G8573Q4205p0754R2530B3034J29036b18170h8322C00181c0187C1047
$$ plain form
17356 117316 34969 -148069 288757 197688 381259 63442 111680 -200907 -75067 70634 64376
17345 64376 -173899 270625 -73921 26322 189453 -130119 193759 122491 87082 -141661
17334 -7522 366292 70097 253030 194611 260714 30129 84524 -79732 46267 328782 -82747
17322 99183 99319 187834 -117807 254272 117207 24993 135486 98769 496167 -109463 182725
17310 289082 199750 149454 -210413 36671 258537 170493 -36806 -130177 356478 82609 -66987
17298 -304753 229593 326328 117499 118180 66233 246952 50691 524107 -72207 199444 259847
17287 259847 31597 67962 442504 -192204 117873 132032 283342 -133413 434328 -82550
17276 283397 78573 162778 92024 184554 23034 152070 -218170 -88322 300181 -30187 31047
17264B81680r9906B6513L93529h4620A94379J89586r0787J86801H4809L71419
17254D56228d7338C16706i587B93437H4138K92033L5903f4219C39619q76i503
17242g0893A1564a91194C4687J52640J43443A32593J64341q9139H4330J85200
17232B69530J6651j41712M29003J5306G0604J30695K07689b74564B54261k8897
17222B25364K4067J41838p1054J08618A01643J84590l3349I7794K08001m6896
17212B58899P7379l5135j26269k7883M7838a30426I7044a69794C20626d5581B04548
17200F5780K11148h1638E19743b0532B34787G6656M25315r4940A20061J76039
17190B96100K5008q2188j17282J62359O7939k2168A38637N0312j7166K94778L9755
$$ plain form
17264 281680 181774 26513 420042 -84620 194379 383965 293178 479979 84809 456228
17254 456228 -47338 316706 -9587 293437 84138 376171 412074 -64219 339619 338743 -9503
17242 -70893 11564 -191194 34687 187327 330770 132593 296934 207795 84330 269530
17232 269530 286181 144469 573472 588778 70604 201299 408988 -274564 254261 225364
17222 225364 249431 391269 320215 428833 101643 286233 252884 97794 305795 258899
17212 258899 336278 301143 174874 146991 194829 -130426 97044 -169794 320626 -45581 204548
17200 65780 276928 -81638 519743 -20532 234787 76656 501971 407031 120061 296100
17190 296100 321108 238920 121638 283997 351936 329768 138637 188949 171783 466561 506316
17179E06316H9138h1408A63023K49437J96468k39786A51021J26927l8853L15462
17169E54557B45367K85836B44273M2350j38825K79852R7926A38177K26157C3550
17158B79763n0783o2833P4278L43026A40002d9398B47896K87405A01493Q7297
17148A88790p0252K8348J47738c2048C39791e903B41544A18428O05078C22290
17137F23350B60042J52205J17058j31536K42420n4933A77925J20710J31071A76213
17126E49593k65475K61424A97316l7160M24128F3373L88208n0127B00153L90976
17116E91129A31779M10304K2575A87161N500P6626K70147J53776Q6292C17941
17105C54317A22943L85903k22409M5016K67353J09495C10534K89500N836k64872
$$ plain form
17179 506316 89138 -81408 163023 412460 608928 369142 151021 277948 239095 554557
17169 554557 245367 531203 244273 286623 147798 427650 525576 138177 364334 33550
17158 279763 228980 166147 240425 583451 140002 -49398 247896 535301 101493 188790
17148 188790 118538 146886 294624 -32048 339791 -5903 241544 118428 723506 322290
17137 623350 260042 412247 529305 397769 640189 585256 177925 298635 429706 176213
17126 549593 284118 545542 197316 160156 584284 63373 451581 401454 200153 591129
17116 591129 131779 542083 564658 187161 192661 269287 539434 693210 779502 317941
17105 354317 122943 508846 286437 331453 598806 708301 310534 600034 605870 340998
17095C40998k2889l9733J94694o0170N0881n013Q535J36349B70762R0147K09653
17084E70562A75126K60079m3684J48205o1674A69200N62227j87443A29317L90150
17074E19467n9070j27306L34933N9279k62354K72972J01836m12095F6936L98908
17064D65844K37122j88361j41700p0820O4705M7945J32563K20432l69130O7673
17054D66273J43207M00851l88277R3419j03155j77517M6348N2427K28559m5967
17044G16168Q3243l81327j15886L31032l5329J16181b873C87022j72333L13031
17034E27720J73708j7788j73813J06945Q67k71817K23221r1964Q8895j27154J28134
17023E66954L5580P4739j0316B53144L48951J34357l41618M83985Q2473l60878
$$ plain form
17095 340998 318109 278376 473070 412900 463781 458768 467303 603652 270762 360909 570562
17084 570562 175126 435205 391521 539726 478052 169200 731427 543984 129317 519467
17074 519467 460397 333091 668024 727303 464949 737921 839757 427662 66936 465844
17064 465844 702966 514605 372905 302085 366790 414735 547298 767730 398600 466273
17054 466273 609480 1010331 622054 715473 612318 434801 481149 533576 762135 716168
17044 716168 799411 418084 302198 633230 597901 714082 -2873 387022 214689 527720
17034 527720 701428 683640 509827 616772 617639 345822 569043 477079 565974 438820 566954
17023 566954 602534 677273 666957 253144 602095 736452 394834 878819 961292 600414
17013F00414k4109J56752j32816M97211B93949L16137J49040j16113K44352n953
17003H81412j00581J15737j14808m1060j25050L40480D19688L1040J21117P7130
16993F48975j41996N98731p9457k90286J8399L4558L01973k53311J06362N8094
16983A002042k49347K81830l26297K19694j04382J98951k30510N3068J00523P5163
16973A020735D99041K75197R1982J42434r3873L841L86541m97733M03934m48538
16963G62826J03734J55491L2808J1126K4361k5351L21555j81473L8168J53310
16953A396555j31454m01475L03987j19022Q0734O4891k46695M82447m15135L90558
16943A405391n79730k7059M80212p8837j11893P41648n63249l9913q0707j01933
$$ plain form
17013 600414 576305 733057 600241 1097452 293949 610086 759126 643013 887365 881412
17003 881412 780831 896568 781760 740700 615650 956130 419688 450728 571845 648975
16993 648975 506979 1105710 1026253 735967 754366 788924 1090897 837586 943948 1002042
16983 1002042 752695 1034525 708228 927922 823540 1022491 791981 845049 945572 1020735
16973 1020735 499041 774238 866220 1008654 914781 918622 1305163 807430 1211364 762826
16963 762826 866560 1022051 1054859 1065985 1090346 1064995 1386550 1205077 1243245 1396555
16953 1396555 1265101 863626 1167613 1048591 1129325 1194216 947521 1429968 1014833 1405391
16943 1405391 825661 798602 1278814 1199977 1088084 1829732 1266483 1226570 1145863 1043930
16933A043930L40585P2203J55790k10106k87536J90846K38988l7043k41847L02099
16923A567909k3313r5915N6938K9928J59486j34555k58322L78059O9783j04801
16913A645197n5355p1642L70705k65350L09299R7384j99529l14214J32458j4567
16903A634386J03933J32763k22658K748J06051k09040N75171p4116j59737L59445
16893B248946j91091l03468K40773L21984q4461p5477N3138q613p1742J71656
16883B301645o0551j01218M90492k87581J61038j59719K58000j50754J18406k7653
16873B542105l76528M31997p5603L15445Q0285k62993K12475J97995j42208K4573
16863B947543J59542r3784k72619K78352J39774J82265l44158K76862N0785K80591
$$ plain form
16933 1043930 1384515 1456718 1612508 1402402 1114866 1305712 1544700 1507657 1265810 1567909
16923 1567909 1544596 1448681 1505619 1535547 1695033 1560478 1302156 1680215 1749998 1645197
16913 1645197 1589842 1518200 1888905 1623555 1932854 2030238 1830709 1516495 1648953 1634386
16903 1634386 1738319 1871082 1648424 1651172 1757223 1548183 2123354 2049238 1889501 2248946
16893 2248946 2057855 1754387 1995160 2317144 2232683 2157206 2210344 2201731 2129989 2301645
16883 2301645 2241094 2139876 2630368 2342787 2503825 2344106 2602106 2451352 2569758 2542105
16873 2542105 2165577 2597574 2521971 2837416 2917701 2654708 2867183 3065178 2922970 2947543
16863 2947543 3107085 3013301 2740682 3019034 3158808 3341073 2996915 3273777 3324562 3605153
16853C605153J02878k932O5020r3352M1754R6543j88816r5669M19141j74273J44751
16842C920198m2789O3549K69631J36990m01492N35561J935M7700q8744N09946
16832D952485k92818L47061o2268L74328m51213O7988L63682N7227J54130J80866
16822E691468R7549l3386J98715n9375K43960L17920m26541K63664J05920R3661
16812F493555L33708L75823k72529K40777M30236K74256M03610o4303M06391k62258
16802H359266L11396L65415N9291P1987K36249L38400N95867M2518J68626J65436
16792A0714451L58565L19408M35084L67635O6750M89184M08698K15288N15611
16783A3890674M32557K09667L41161P96396K47034L89406Q55587J28940J006772
$$ plain form
16853 3605153 3708031 3705099 3770119 3676767 3718521 3815064 3626248 3530579 3949720 3775447 3920198
16842 3920198 3877409 3940958 4210589 4347579 3946087 4481648 4483583 4531283 4442539 4952485
16832 4952485 4659667 5006728 4944460 5318788 4867575 4935563 5299245 5356472 5510602 5691468
16822 5691468 5789017 5755631 5954346 5894971 6138931 6456851 6030310 6293974 6399894 6493555
16812 6493555 6827263 7203086 6930557 7171334 7601570 7875826 8279436 8215133 8621524 8359266
16802 8359266 8670662 9036077 9095368 9167355 9403604 9742004 10337871 10380389 10549015 10714451
16792 10714451 11073016 11392424 11827508 12195143 12261893 12751077 13159775 13375063 13890674
16783 13890674 14323231 14532898 14874059 15670455 15917489 16306895 17162482 17291422 18298194
16774A8298194P02611L89346O39955P69362P52854O03715J343116K98616J141633
16765B4939402R05955R16587J137157R48554J157907J193981J680279J068218
16757C3948040J426975J220762J862747J749223J622505K207827K104850K039280
16749D8182209K055669K963213K531716K594171L074340L179909L035681L428215
16741G1045123L525168L833804M444089M227531M360502M569462M948336M917614
16733A05871629N250549N383978N196063N773932N442982N302881N497889M993520
16725A48713423N051468M231730L847923L229764K686351J646388O99365k05154
16717A69901258j063589j931219k731141l538769m257854m577889m772910n568743
$$ plain form
16774 18298194 19000805 19390151 20030106 20799468 21552322 22156037 23499153 23797769 24939402
16765 24939402 25845357 26761944 27899101 28847655 30005562 31199543 32879822 33948040
16757 33948040 35375015 36595777 38458524 40207747 41830252 44038079 46142929 48182209
16749 48182209 50237878 53201091 55732807 58326978 61401318 64581227 67616908 71045123
16741 71045123 74570291 78404095 82848184 87075715 91436217 96005679 100954015 105871629
16733 105871629 111122178 116506156 121702219 127476151 132919133 138222014 143719903 148713423
16725 148713423 153764891 157996621 161844544 165074308 167760659 169407047 170106412 169901258
16717 169901258 168837669 166906450 164175309 160636540 156378686 151800797 147027887 141459144
16709A41459144n628159n732789n826693n777145n420015n530922m715079n438680
16701I7389662m545652m408257m514428m158410l844039l608239l409863l594815
16693F5305959l385323k662364k711362k541141k684197k118357k137922k208266
16685D4857027j897471k012683j670411j667757j694983j491344j415851j408274
16677C1598253j198701j138101r79487j522497o06720r59829j244536m49419j254645
16668B2244318p90263n27238j026117o10350n63663o84318r84504k74725p22539
16659A6060601l00703m03587q53405r7415m01076o36688l80117k02949m83410
16650A2301251n3608l53751m78384k00910m97484j51749n75556j39523l97671
$$ plain form
16709 141459144 135830985 130098196 124271503 118494358 113074343 107543421 102828342 97389662
16701 97389662 92844010 88435753 83921325 79762915 75918876 72310637 68900774 65305959
16693 65305959 61920636 59258272 56546910 54005769 51321572 49203215 47065293 44857027
16685 44857027 42959556 40946873 39276462 37608705 35913722 34422378 33006527 31598253
16677 31598253 30399552 29261451 28281964 26759467 26152747 25192918 23948382 23498963 22244318
16668 22244318 21454055 20926817 19900700 19290350 18726687 18042369 17057865 16783140 16060601
16659 16060601 15759898 15356311 14502906 14405491 14004415 13367727 12987610 12784661 12301251
16650 12301251 12247643 11893892 11415508 11214598 10717114 10565365 9989809 9850286 9452615
16641I452615j54305l46425j29707j04737j89796n15820r9417m17248k99337L06710
16631G502533j99698k01440j38969j23490k76085m56039M08916m01245J58214
16622F272697n42286p9031j36777l8660R7638k91054k9920k34608k8868l07767
16612D681364l7616j1285j37962q5241J16728l97379n0610J92979j02584k31813
16602C936581J35156l91373K99228l22017q946M7240J10045n67153J2507L1011
16592C282279k9441L69733p22301K65409J42562j77866k7088J36458l52443K08089
16582C095391l47656K0141j06482J80944k81997o6395J95185L703j53132L0988
16572B570690q1131j36716j58772J35251Q3376j07806j48127n1631j0098p8880
$$ plain form
16641 9452615 9298310 8951885 8822178 8717441 8527645 8011825 7912408 7495160 7195823 7502533
16631 7502533 7302835 7101395 6962426 6838936 6562851 6106812 6515728 6114483 6272697
16622 6272697 5730411 5651380 5514603 5475943 5573581 5282527 5252607 5017999 4989131 4681364
16612 4681364 4643748 4632463 4494501 4409260 4525988 4128609 4077999 4270978 4168394 3936581
16602 3936581 4071737 3680364 3979592 3657575 3648629 3695869 3805914 3238761 3251268 3282279
16592 3282279 3252838 3622571 2900270 3165679 3308241 3130375 3103287 3239745 2887302 3095391
16582 3095391 2747735 2767876 2661394 2842338 2560341 2493946 2689131 2692834 2539702 2570690
16572 2570690 2489559 2352843 2194071 2329322 2412698 2304892 2156765 2105134 2095036 2016156
16562B016156j21662K47815k34521j1103Q4689l68263K01297K22209r1238k09050
16552A736329K17757J42137j29778j62351n1093j08595k23970J77263J53881n8896
16542A692684j64225M3296J43365j02793O5737j65596L95718j04463l26824J47833
16532A624732j59176O857j90758k77651N97718k04379J6914K07548j20985n5067
16522A445753l17871L61212j65463j51974K01597k74632K40215k56450R792m1014
16512A051165M71944l63577m5587L11663m31398J01917j35749L9590L31030m70462
16502H60536J48130j24312K2936K30098j84385K04922L6697l11013j98439M03549
16492A088719M6429k82501J64241J03171l56289j32223K92898K33139P2279k69439
$$ plain form
16562 2016156 1894494 2142309 1907788 1896685 1981374 1613111 1814408 2036617 1945379 1736329
16552 1736329 1954086 2096223 1966445 1804094 1753001 1644406 1420436 1597699 1751580 1692684
16542 1692684 1528459 1571755 1715120 1612327 1678064 1512468 1908186 1803723 1476899 1624732
16532 1624732 1465556 1472413 1281655 1004004 1601722 1397343 1414257 1621805 1500820 1445753
16522 1445753 1127882 1489094 1323631 1171657 1373254 1098622 1338837 1082387 1092179 1051165
16512 1051165 1523109 1159532 1113945 1425608 994210 1096127 960378 999968 1330998 860536
16502 860536 1008666 884354 907290 1137388 953003 1157925 1194622 883609 685170 1088719
16492 1088719 1135148 852647 1016888 1120059 763770 631547 924445 1157584 1229863 960424
16482I60424j86778J33132j73578j72741k183M36436l29848K64139J9464j81944
16472G66523n104l8040k42998L02820j02330J01002J72569D71885K34198K20012
16462I26095L4162j8326l48685Q2653R7226l20714M03076j98648L18464o0488
16452I14815m31127L41431j46098p4055m3273L41475C70051M68690k8203k23067
16442E87471K5285j02921J83028K01887l49379p1830J38971j63308M46313k59017
16432F36500l8308J82140C10844L32887B87297L46728k46198K64159J72044l71152
16422D52878O6836j1494j78718J53539l196n0357P7933J96974A68088M90800j48579
16411E10309O8254q819q7893N2263P6574j43401k13305M58263j73885j77736l046
$$ plain form
16482 960424 773646 906778 733200 560459 558276 994712 664864 929003 948467 766523
16472 766523 761419 723379 480381 783201 680871 781873 954442 471885 706083 926095
16462 926095 960257 941931 593246 675899 773125 452411 855487 656839 975303 914815
16452 914815 483688 825119 679021 604966 561693 903168 370051 838741 810538 587471
16442 587471 612756 509835 692863 894750 545371 473541 612512 449204 895517 636500
16432 636500 598192 780332 310844 643731 287297 634025 387827 651986 824030 452878
16422 452878 519714 508220 329502 483041 479845 429488 507421 704395 168088 658888 510309
16411 510309 578563 569744 481851 534114 610688 467287 253982 712245 538360 360624 357578
16400C57578k7879J76957A96901K74692j31171P7245K88806C08283F8072L89537
16390D57609L17774k61381j16171J84719j22950m0104m8274J87131k30232j07034
16380B21087K06624o886k576M9072P7028l553j94866R1093O2832J20627k59872
16369C60610j05088J14203j49954K06998f5033B06687P3462P7264A21480J7145
16359A38625F5101J7295L52165j29142K61650k55277p3861K21379A21819J43341
16349B65160B8297K29520P0101j42795L21368k00654L02333B94723A07211B9764
16338B54257Q4475j13066K48678N2114N1331B25368J62002A30808l786N68844
16328F95866C3216J15686P7294J41229e9902B54118J68056A31223K31851p2855
$$ plain form
16400 357578 329699 506656 196901 471593 340422 417667 706473 308283 68072 457609
16390 457609 775383 514002 397831 582550 459600 419496 371222 558353 328121 221087
16380 221087 427711 420825 418249 467321 544349 540796 345930 437023 499855 620482 360610
16369 360610 255522 369725 219771 426769 -65033 206687 280149 357413 121480 138625
16359 138625 65101 82396 434561 305419 567069 311792 237931 459310 121819 265160
16349 265160 28297 257817 327918 185123 506491 305837 608170 294723 107211 29764
16338 254257 338732 225666 474344 526458 577789 225368 387370 130808 127022 695866
16328 695866 33216 148902 226196 367425 -59902 254118 422174 131223 363074 290219
16318B90219c6875B62407K2293A24934K40060M1268A93641B5039L8346K77799
16308C41184A21138i3426D96816D102P2661O2794J37396j0826o7505r155n7720
16297A31747K11944a08343B14600K6738F1739j710M32489A3233h6621B75703P4126
16286C49829k4677K55774k1200B14497C3612b68871A91751J01245I10R9739O3015
16275A63664a13742B45235o6871K66770a6030B45187J87155r6706B7915j1066
16265A6849N45904a5487C14131j23698J67487j76065O1598a0096E5339J01524
16255A56863J67399h7920A54649N4753B8546a40251C48811j67183D9298P2581
16245A21879J9095B699i4052C583P5268d970A60869a49085A49646k6C0817I473
$$ plain form
16318 290219 -36875 262407 284700 124934 364994 406262 193641 25039 63385 341184
16308 341184 121138 -93426 496816 4102 76763 139557 276953 266127 198622 189467 131747
16297 131747 343691 -108343 214600 241338 61739 60029 492518 13233 -86621 275703 349829
16286 349829 325152 580926 559726 214497 33612 -268871 191751 292996 910 100649 163664
16275 163664 -113742 245235 178364 445134 -16030 245187 432342 335636 27915 16849
16265 16849 562753 -15487 314131 190433 357920 181855 243453 -10096 55339 156863
16255 156863 324262 -87920 154649 209402 28546 -140251 348811 181628 49298 121879
16245 121879 140974 2699 -94052 3583 78851 -4970 160869 -149085 149646 149620 30817 9473
16232c07710E1706a72116H4452J046M81711C3776L59088m797q9875A29792i8791
16220H1467e1356B79347I6465a36580B54973f728B33505g4250A36293l0521B729
16208A21675C7009J03460P3564j06116L30857k10440a19632E2284J04081a3332
16197E8574K45232c9735A70397b14385E05754A50782B8807i2363c5327j11412
16187a46739f6798K6042H0044a13354I4275b6347G3977b76542J28597A38609J30758
16176B69367d3157j09831A68202C9971J25353j5154A867J76392d6093j20501M5366
16165a21228b8368G0130L4970J3843R7141C6722a14361B22633b81452G7287a19942
16153A63381i3891R583C055e3256A29327J77000q5194d16927c7555I1830J5915
$$ plain form
16232 -307710 51706 -172116 84452 85498 567209 33776 392864 388067 298192 129792 -98791
16220 81467 -51356 279347 96465 -136580 254973 -6728 233505 -74250 136293 105772 2729
16208 121675 37009 140469 214033 107917 438774 228334 -119632 52284 156365 -13332
16197 58574 303806 -39735 170397 -214385 505754 150782 28807 -92363 -35327 -146739
16187 -146739 -66798 -40756 80044 -113354 94275 -26347 73977 -276542 -147945 138609 269367
16176 269367 -43157 -152988 168202 39971 165324 150170 1867 178259 -46093 -166594 -121228
16165 -121228 -28368 70130 105100 118943 216084 36722 -114361 222633 -281452 77287 -119942
16153 163381 -93891 -84308 3055 -53256 129327 306327 221133 -416927 -37555 91830 107745
16142A07745J58908a14407B88304q0655K12997H8124L1097a7302r3041D75732
16131C4460O1371k003J16788D1580K0682B4005a17059l6067A36756n1941R1660
16120A76475d1279p3928A02135J03101d7128I1092J32489C1343j4083b77499F2093
16108g9537A10021a23896F5896B5434L18300a79448A1835P8634K03748q8966P7381
16097B82632c31110B18658J12961b07367A64465J2806J88108a6705k44197D353
16086C5184K92997e0705I2688K7208K7546l749a05218D56079A56323a23863e7422
16074f0513m9572F734L4793K17867e263l421F1640K396L09311c50888J68110g3032
16061B86632h3386j1546q0600e5278l4432j34376A72855a23288B31204g8666o683
$$ plain form
16142 107745 266653 -114407 288304 207649 420646 88124 119221 -17302 -110343 475732
16131 34460 95831 93828 210616 41580 62262 24005 -117059 -153126 136756 84815 176475
16120 176475 -41279 -115207 102135 205236 -47128 91092 223581 31343 17260 -277499 62093
16108 -79537 110021 -123896 65896 25434 343734 -179448 11835 90469 294217 205251 282632
16097 282632 -331110 218658 331619 -207367 164465 177271 365379 -16705 -260902 4353
16086 35184 328181 -50705 92688 119896 147442 143693 -105218 456079 156323 -123863 -57422
16074 -60513 -110085 6734 41527 259394 -5263 -8684 61640 64036 373347 -350888 -182778 -73032
16061 286632 -83386 -94932 -175532 -55278 -89710 -224086 172855 -123288 231204 -78666 -85349
16050h5349n2129f6331B07778D2935L8366h9185o6392j72961D1131d6282O356
16039c9926j84391e188j95411B05203a26759A7874a86704A0346a16408K1860I661
16027d80367a54869b7445j6756q5947r9407i3831D4842d3721a3543j73258F862
16015g9681A22302C4169b4784A29827C7958J43280H7456N4528b9006m0669a4721
16003B36221j7753l9774a53746q535c658A16748a0988j23711A9185Q99R1312g5099
15990a6447B8984Q4944f92F2396O5611h458A87235J83813A28215K42448a8385
15978A67049a12319D8513a89647C6421b00003L4945j3484a9604A930i6075d7830
15966A71630a27248m0106A58162B550a49161D38109I6307c39825a8104H9088K4111
$$ plain form
16050 -85349 -137478 -66331 207778 42935 81301 -89185 -155577 -328538 41131 -46282 -39926
16039 -39926 -224317 -5188 -200599 205203 -126759 17874 -186704 10346 -116408 -94548 9661
16027 -480367 -154869 -27445 -44201 -130148 -229555 -93831 44842 -43721 -13543 -186801 6862
16015 -79681 122302 34169 -24784 129827 37958 181238 87456 141984 -29006 -69675 -14721
16003 236221 218468 178694 -153746 -162281 -3658 116748 -10988 -134699 19185 20084 111396 -75099
15990 -16447 28984 113928 -692 62396 128007 -8458 187235 371048 128215 370663 -18385
15978 167049 -112319 48513 -189647 36421 -200003 -165058 -178542 -19604 1930 -96075 -47830
15966 171630 -127248 -167354 158162 2550 -149161 438109 96307 -339825 -18104 89088 113199
15955A13199b5756B405a02808A09516B5749a51936O5872J8243L0081k5596A28746
15943a65520A71524M3256h8380b8560A36078F2806K14079a14338E7080C037e0889
15931d8069A08051d3209l03926C0478a95097f6944n9868a0233B0531P3918i201
15919a58697f3295F6688b1144k49047A30359i2899A95145a10536A27074g4557
15908C6832K1180M6335i6632j3914H9830Q1372D0033h0319B7905J0295a08122
15896A27246A2233K6547N2746a70282j00545Q7383P8931b1565k76789e0587H5737
15884A31891a24785K2270b9511p1935d4829C84K65524c86127a60768b9004O723
15873b2281B20673f6764A31077a20880j27089A56311J15394h7755B86314f0456
$$ plain form
15955 113199 -25756 2405 -102808 109516 25749 -151936 -86064 -67821 -37740 -63336 128746
15943 -165520 171524 214780 -88380 -28560 136078 62806 276885 -114338 57080 3037 -50889
15931 -48069 108051 -43209 -347135 30478 -195097 -66944 -126812 -10233 20531 94449 -9201
15919 -158697 -63295 66688 -21144 -270191 130359 -92899 195145 -110536 127074 -74557
15908 36832 58012 104347 -96632 -110546 89830 171202 40033 -80319 27905 38200 -108122
15896 127246 12233 38780 91526 -170282 -270827 -183444 -104513 -21565 -298354 -50587 85737
15884 131891 -124785 -102515 -29511 -101446 -44829 384 265908 -386127 -160768 -29004 -22281
15873 -22281 220673 -66764 131077 -120880 -247969 156311 271705 -87755 286314 -60456
15862a97638B28709I3892f7655a7393A0117K61051b1437k88257I8845m8239b15948
15850f2596j83623p5113B29634b63008A04764K7202A2421b24878B18646b192n0205
15839e2397p7228O3943F3505j8363a30515A17809a37019I2977J3842b30367A9354
15827A28729a67447k9751k4012c0750a1118k2226j77068q3391A71575b23673A94737
15815A9815J05860a13773I9779b40351A4539d8636o4900L1873r5367A6226a24358
15803C97781a60382B44176q8161J12438d9161j34510C27501b72403A70965H555
15792b52124d1823A17883K09283a93218R946g9632k924E8353J64166F2893J328
15781F4221j5361c1104k81355f539k15117G6445a31062A52444b5578A73923N6074
$$ plain form
15862 -197638 228709 93892 -67655 -17393 10117 271168 -21437 -309694 98845 50606 -215948
15850 -62596 -246219 -321332 229634 -263008 104764 131966 12421 -224878 218646 -2192 -52397
15839 -52397 -129625 -65682 63505 45142 -130515 117809 -137019 92977 106819 -230367 19354
15827 128729 -167447 -197198 -221210 -30750 -11118 -33344 -210412 -293803 171575 -223673 194737
15815 19815 125675 -113773 99779 -240351 14539 -48636 -113536 -81663 -177030 16226 -124358
15803 397781 -160382 244176 156015 268453 -49161 -183671 327501 -272403 170965 8555
15792 -252124 -41823 117883 327166 -193218 -183272 -79632 -82556 58353 222519 62893 64221
15781 64221 48860 -31104 -312459 -6539 -221656 76445 -131062 152444 -25578 173923 229997
15770B29997d87577A03608b11240A24558J82926D5008b14405A53134a00844H5330
15759c13625J12043k07205J89206A82976a24052I2737a48143m8400i3031A9333
15748A44006O9081c6480B06807D7436k004i1523K3353n1446a9560j44570j07019
15737b71149G7026a73302c3087j00773r2331B10402F8964b62714B30451E7917
15726G1207a96086l816R4681q0980h2786j43874B7412P6177K02698G6606a31504
15714A28022l0674e39916F8946a55381i599p2039F9598j8727c10724g336B0878
15702c4546A95394o7115m9605j7339a99784A03562J0227k6904a52845c9500B21385
15690a18918C474J42035d6902A61907a21264H3126N9289a33413C17787c3982C2089
$$ plain form
15770 229997 -487577 103608 -211240 124558 307484 45008 -214405 153134 -100844 85330
15759 -313625 -201582 -408787 -219581 182976 -124052 92737 -148143 -196543 -93031 19333
15748 144006 213087 -36480 206807 47436 45432 -91523 -68170 -119616 -19560 -164130 -271149
15737 -271149 77026 -173302 -33087 -133860 -226191 210402 68964 -262714 230451 57917
15726 71207 -196086 -199902 -105221 -186201 -82786 -226660 27412 103589 306287 76606 -131504
15714 128022 97348 -539916 68946 -155381 -9599 -81638 69598 50871 -310724 -7336 20878
15702 -34546 195394 128279 78674 61335 -199784 103562 113789 86885 -152845 -39500 221385
15690 -118918 3474 145509 -46902 161907 -121264 83126 142415 -133413 317787 -33982 32089
15678f9013B74295c7627l11498B38241A9000J77563i4812j65434D8296j1821b40405
15666C1413K44603p1803a0933m2614C73773c58544g5466o1825l148k49411A22284
15654b94702I2787F11c97944H4762l4500e725l48331i0755r9681b1143d076m18002
15642d22078i6269n9011f6775j29308E0430M0396J3144L31257C4762a33408A83716
15630A74110B476a75381G561b76290b6115A77100a09815H4399L02144e7575C07720
15618F2198O5364J60301J27530A21219a37547G1967d05966H6488J40943a62930
15607b04267B55455A5463i018j02464A72435J19035b80037a6639A55998a26931
15596H4868i1307k1890A74701b0364j08811k12728D8953a04076A23689a99499
$$ plain form
15678 -69013 274295 -37627 -349125 238241 19000 196563 -94812 -260246 48296 36475 -240405
15666 31413 276016 204213 -10933 -53547 373773 -358544 -75466 -137291 -140439 -389850 122284
15654 -294702 92787 611 -397944 84762 50262 -5725 -354056 -90755 -190436 -21143 -4076 -422078
15642 -422078 -96269 -155280 -66775 -196083 50430 90826 103970 435227 34762 -133408 183716
15630 174110 2476 -175381 7561 -276290 -26115 177100 -109815 84399 386543 -57575 307720
15618 62198 127562 287863 415393 121219 -137547 71967 -405966 86488 227431 -162930
15607 -204267 255455 15463 -9018 -111482 172435 291470 -280037 -16639 155998 -126931
15596 84868 -91307 -113197 174701 -20364 -129175 -341903 48953 -104076 123689 -199499
15585B8869a01228B1875h2425D4991b8074I6107b31491B2476a06644B24137f7815
15573A54073a76773A26138a51598O2662p1277m2626o1706M7280B99198d1232j53292
15562a94524A54260c15778a00044j20570A28708a4783o9065H825K28451q6610
15552A50666a90914B74764C02Q3031a35489A4822b30934B8911L3550h3634k34126
15541c17760A63868a65971A5389f3491B72644j6492p8578b1073j93367k655B90490
15529a24916m6170g3686o4762F1855a86226A3906K78985c12188R0656c6979n8834
15518i5813B1504L4518b11757D16a38919j72557O4949A37483f7713k6957j29214
15507b23884a3021B2409b02503j15940J49822c3275k4849A5499a87101k2300C02390
$$ plain form
15585 28869 -101228 21875 -82425 44991 -28074 96107 -231491 22476 -106644 224137 -67815
15573 154073 -176773 126138 -151598 -88936 -160213 -202839 -264545 -217265 299198 -41232 -194524
15562 -194524 154260 -315778 -100044 -220614 128708 -14783 -83848 8825 237276 150666
15552 150666 -190914 274764 302 83333 -135489 14822 -230934 28911 62461 -83634 -317760
15541 -317760 163868 -165971 15389 -63491 272644 256152 177574 -21073 -214440 -217095 290490
15529 -124916 -171086 -73686 -138448 61855 -186226 13906 292891 -312188 -221532 -36979 -95813
15518 -95813 21504 56022 -211757 416 -138919 -311476 -246527 137483 -67713 -94670 -223884
15507 -223884 -13021 22409 -202503 -318443 -168621 -33275 -58124 15499 -187101 -209401 302390
15495g9425A14948B6718e5107k22623D141J14273g7336B492a59838M1686q1413
15484a99565B55000a00752F8075J73776m7060G8521g4186j05625B25068c7988
15473e4244k39055a00325b3281A31787K353K516I862a57959B18289o4378c3984
15461b3338n7731A95967b55296A35756b88958A87225J8498H2330j1273N0947E49
15449a67525j55357a6396A51305j5413F5186N2410J32501B13a9576q9668H6994
15437A55080b75383C10291A55027c8661o516A14707d6364o1934A36839e2052a48
15425A79271i3479j07008l64767C10910H3412R3474b212B4307c56852e9916q7543
15414a47459j12111J21445A90193C1760e363l3489k92961G5064c97443B19519
$$ plain form
15495 -79425 114948 26718 -55107 -277730 4141 118414 -77336 2492 -159838 -118152 -199565
15484 -199565 255000 -100752 68075 241851 194791 78521 -74186 -179811 225068 -37988
15473 -54244 -293299 -100325 -23281 131787 134140 136656 9862 -157959 218289 153911 -33984
15461 -23338 -81069 195967 -255296 135756 -288958 187225 205723 82330 71057 122004 549
15449 -167525 -322882 -16396 151305 135892 65186 117596 250097 213 -19576 -109244 86994
15437 155080 -275383 310291 155027 -38661 -45177 114707 -46364 -108298 136839 -52052 -148
15425 179271 -93479 -200487 -565254 310910 83412 176886 -2212 24307 -356852 -59916 -147459
15414 -147459 -259570 -138125 190193 31760 -5363 -38852 -331813 75064 -397443 219519
15403G0279b05180k67891d4382I3778c74610J11974A54111a03366K922A59227
15392I0248b28799R6296J7800I9774e324j14402d2522A19356b02465J7440C10335
15380A18029n3089J86327G9889J96334a80314Q0363F7123j9077J39024i7108L9769
15369e7339m2961d4965k44057A33429M551B7641a33036D1242a13645j09433e4288
15357F8178c22078A49252b91430a19486j5338o8431A2880J36149d6463C3196a31854
15345c775j75999O5330A4347a31943N9539A72813b7252j59901A27772a82016N2541
15334a29475C19405o2936a08510b5624F7500j7743e0697B21093J39420j14872
15324B45641G0500h0670f286k9276A59428f7202b1594D2297A7479K3216h6067
$$ plain form
15403 70279 -205180 -473071 -44382 93778 -374610 -262636 154111 -103366 -100444 159227
15392 90248 -228799 -132503 -114703 99774 -5324 -119726 -42522 119356 -202465 -185025 310335
15380 118029 64940 251267 79889 276223 -180314 -99951 67123 48046 187070 -97108 -57339
15369 -57339 -100300 -44965 -289022 133429 137980 27641 -133036 41242 -113645 -223078 -54288
15357 68178 -322078 149252 -291430 -119486 -134824 -203255 12880 149029 -46463 33196 -131854
15345 -3775 -179774 -114444 14347 -131943 -72404 172813 -27252 -187153 127772 -182016 -129475
15334 -129475 319405 256469 -108510 -25624 67500 49757 -50697 221093 360513 245641
15324 245641 70500 -80670 -6286 -35562 159428 -67202 -21594 42297 17479 40695 -86067
15312C24816d6121k74370A32464a86244p6626d4427G966J80578b30074A8073a21383
15300a39845A58013J02403A3626J71794O7167j01533J5899K03899A75993A3492
15289A17489c968j47824O1879C67432H1995B540c23045G2646a37340J5002A0964
15277A43490J5583D9651N7412c33173A50831d5362F0305a09027i85l5206C80a17860
15264b9345j49994A0372a48164j40655A58180j052J46559o0641C7377J13839J30604
15253B81820A2929a61158B35754J42793J41116L53309j66138M23440k41140m43479
15243D45655B09197q3290C8962L06126g2469r560A66995K35729n2178f48A82835
15231C31948A36426m9732a55185A12308N0830l4451n6159f5088B08349a4617p0448
$$ plain form
15312 324816 -46121 -320491 132464 -186244 -262870 -44427 7966 188544 -230074 18073 -121383
15300 -139845 158013 260416 13626 185420 252587 151054 166953 370852 175993 13492
15289 117489 -3968 -151792 -89913 367432 81995 2540 -323045 72646 -137340 -122338 10964
15277 143490 159073 49651 107063 -333173 150831 -45362 60305 -109027 -985 -36191 380 -117860
15264 -29345 -179339 10372 -148164 -288819 158180 157128 303687 243046 37377 151216 281820
15253 281820 12929 -161158 235754 378547 519663 872972 706834 1130274 889134 445655
15243 445655 209197 125907 38962 345088 -72469 -82029 166995 402724 350546 -648 182835
15231 331948 136426 86694 -155185 112308 163138 128687 72528 -65088 208349 -14617 -85065
15220h5065A10064J76377f419k60283A01559a49056j11821A7615K45146R012p1742
15209B00031k0927a4348A53735l679d3278B12192a07967A11450L246K56179j18941
15198B51934k6852J64970b9214C3550k155L1745O3311G37Q1785Q1822J68220D5696
15185A68062a30122G3870a63805e1404A45372O6055b027n0832B59357b84596F9697
15173i4093G6377R6071e198B39801e5401a4954D0664A6659J57252k502a75080
15161A36571J80836F4217J39624q8325J74883b4023k69185D0554P1869B8357M6965
15150G5322i0376B01441B7198b70929C1175a85111B04323J2380P7840a14595A0212
15138a2229I4664J10555r6119j7666P7813J03013D2980J55554F8589A6965J69501
$$ plain form
15220 -85065 110064 286441 -6419 -266702 101559 -149056 -260877 17615 262761 271773 200031
15209 200031 179104 -14348 153735 150056 -43278 212192 -107967 111450 114696 370875 251934
15198 251934 225082 390052 -29214 33550 31395 63140 126451 737 82522 164344 332564 45696
15185 168062 -130122 73870 -163805 -51404 145372 211427 -2027 -52859 259357 -284596 69697
15173 -94093 76377 172448 -5198 239801 -55401 -14954 40664 16659 173911 171409 -175080
15161 136571 317407 64217 203841 115516 290399 -24023 -293208 40554 112423 28357 75322
15150 75322 -90376 201441 27198 -270929 31175 -185111 204323 216703 294543 -114595 10212
15138 -12229 94664 205219 109100 91434 169247 272260 42980 198534 68589 16965 186466
15127A86466j2003J3643L5852B7481K31409E7741J861R2799a41j0115k00847D0675
15114H2631d6530A35988h5662H564f2653A2598L47682l7558c1242q0874B81610
15102C14211b183B85654e0658A51245Q1251i852A09070J2248L69100a28453G8367
15090a29804G5844N2940J22933J3497A19377h7657A47423J51500A30912K39671
15080C70583E4517K69301A16549B7614O2871a87001A92206M4635P2881a70940
15069A84830j1371a69095B22718D606Q6919e1068A94506L2102H7798M5659M36350
15058E69807A87269J60698A38878f0903C21638a62725C35494A63921n4509D8502
15047C19231A59413G5312h9403I4473a93242A28828K29183q6155g2379A06136
$$ plain form
15127 186466 174463 188106 223958 27481 258890 57741 59602 152401 -141 -10256 -211103 40675
15114 82631 -46530 135988 -85662 8564 -62653 12598 360280 322722 -31242 -112116 281610
15102 314211 -2183 285654 -50658 151245 232496 -9852 109070 121318 490418 -128453 78367
15090 -129804 75844 128784 251717 265214 119377 -87657 147423 298923 130912 370583
15080 370583 54517 323818 116549 27614 90485 -187001 192206 236841 309722 -170940
15069 184830 173459 -169095 222718 4606 91525 -51068 194506 226608 87798 133457 569807
15058 569807 187269 347967 138878 -60903 321638 -162725 335494 163921 109412 48502
15047 319231 159413 75312 -89403 94473 -193242 128828 358011 271856 -72379 106136
15036B59461B4912l510O1873D0301J9483c2339B42219N9540j02520F2193J97707
15025B59900N0735i6758B05223d8625B70124r3945n7201p874k1031R2629b6365
15013A53414F2397L79067j74505J8412b54906C10004q6284N6023f8590D47669
15002D9608J83347K9366b17270h817B47032F7712j6405d1255G6372K51493k4583
14991C03282J55960e9670C39284j7252L6063A59385E8874N5063J42301K82463
14981E38701k62775L3904J45204A3278K70480k1090E0405L1861c6334C89403A63327
14969C08129G0943K18431J28038j36832J69980J19727B62393K02836A73913K0556
14959A94469O399D8066J13523J10989o3842J98992l1912j07403j33465K0451m4073
$$ plain form
15036 259461 24912 21402 83275 40301 59784 -32339 242219 301759 199239 62193 259900
15025 259900 310635 -96758 205223 -48625 270124 176179 118978 111104 90073 182702 -26365
15013 153414 62397 441464 266959 285371 -254906 310004 223720 279743 -68590 447669
15002 49608 232955 262321 -217270 -8817 247032 67712 51307 -41255 76372 327865 303282
14991 303282 459242 -59670 339284 322032 358095 159385 58874 113937 256238 538701
14981 538701 275926 309830 455034 13278 283758 262668 50405 82266 -36334 389403 163327
14969 308129 70943 289374 417412 280580 450560 570287 262393 465229 173913 194469
14959 194469 200868 48066 161589 272578 208736 407728 375816 268413 134948 155399 111326
14948A11326P7605o4371Q1557D1971O7143K7705j3864J10487F3774M76030B01291
14936G610K5668c3585C45830D6111j9403b3798C33262m2646B3770N8520M7225
14925A29515P13305l86452j31445I5230R3762L91226B00672m7367J60792j31014
14915A83083G001L44947o635M5393J72928K42451k84294L04381B01609N2651J84729
14904D38989j6782A89198J65378j44002J60642J27251j05423J40221d248C60511
14893B47416K16509k07173J34912P3387j0220B14260R731K07277k08709J73166
14883C95725J38090j94669B8110N65104B60372L6051K00516j6575k06638j10853
14873A62873J46732I6270L43049l8184j39896k0972M12630B11532L72343j01833
$$ plain form
14948 111326 188931 124560 206117 41971 109114 136819 122955 233442 63774 539804 201291
14936 7610 33278 -33585 345830 46111 26708 -23798 333262 290616 23770 82290 129515
14925 129515 842820 456368 324923 95230 188992 580218 200672 153305 314097 183083
14915 183083 7001 351948 345313 390706 563634 806085 521791 826172 201609 254260 438989
14904 438989 422207 189198 354576 210574 371216 498467 393044 533265 -4248 360511
14893 247416 463925 256752 391664 465051 454831 214260 223991 431268 222559 395725
14883 395725 533815 339146 28110 593214 260372 296423 496939 480364 273726 162873
14873 162873 309605 96270 439319 401135 261239 240267 652897 211532 583875 482042
14863D82042N1203k58380K45741j62830L4129L39587B06800O9846m0629j1957
14853B24060Q8421K6720Q3457J71409k74230O8741J75929B16190K80040K54995
14843G51225C63706j31487J4572L35306A88080L35753k05983J16722j9613J32486
14833E47445O2828j84513r3142L86447k54367p6850j5151M6950J55091n0979j14238
14822D09521K7748J53990p6396r5062J51139k7162j06832m7341Q9486J35597Q7718
14811G02406k68701M04656j44338n3271j91432J7792J37792J68685q1744j63505
14801E28340A40958L67010N5390j81010j47842K62721P2837q9952L36808q1882
14791G35038l2469n6210L87874l03169j61956k74982J51349J07585O7252K12998
$$ plain form
14863 482042 533245 274865 520606 357776 391905 731492 206800 276646 236017 224060
14853 224060 312481 339201 422658 594067 319837 388578 564507 216190 496230 751225
14843 751225 363706 232219 246791 582097 188080 523833 317850 434572 414959 547445
14833 547445 610273 425760 332618 719065 464698 387848 372697 419647 574738 523759 409521
14822 409521 437269 591259 514863 419801 570940 543778 436946 389605 479091 614688 702406
14811 702406 433705 838361 694023 640752 449320 467112 604904 773589 691845 528340
14801 528340 140958 507968 563358 382348 234506 497227 570064 480112 816920 735038
14791 735038 702569 646359 1034233 731064 569108 294126 445475 553060 620312 833310
14781H33310l66382K999j29516L26875L4355k71107n5290J00113N22862m57987
14771E40232j35735L59253r2670O190p8627j30724J72871p2508l1029K04128p3255
14760F68126n1573J93758C59698K31789n7401N2622L67832l19182K566M4021m3753
14749F38192q7524K85093k20003O9591J68688q5082q077l0330j73996J61176P4448
14738G92176l07208K97823J80027l06494l3388l1029J40782k7815L688L44318
14728A052880m47829J79411m4124n576N4433J79626K59426C91003O25726k68946
14718G47783K22204m21242L71026q1327C75726K28415L54951m68521L63892j24109
14708G30354L4732j82943L40208j94942j04988J26994K45126k41695p3940K20386
$$ plain form
14781 833310 466928 469927 340411 667286 701641 430534 375244 475357 998219 540232
14771 540232 404497 763750 671080 677270 598643 467919 640790 568282 537253 741381 668126
14760 668126 616553 810311 359698 591487 534086 586708 954540 635358 637924 681945 638192
14749 638192 550668 835761 615758 685349 854037 768955 760878 730548 556552 717728 792176
14738 792176 484968 782791 962818 656324 622936 591907 732689 704874 708562 1052880
14728 1052880 605051 784462 740338 734762 789195 968821 1228247 391003 1016729 747783
14718 747783 969987 548745 919771 838444 375726 604141 959092 490571 854463 730354
14708 730354 765086 582143 922351 727409 622421 749415 994541 752846 678906 899292
14698H99292l4681r0252m962L23932m3381R238k31504R0319p7748p3597J73817
14687I40473l17300L28493m0566J37965j62799J03839K93652k04579m61k22296
14677H56421L57715k69697Q5421O2736O2835L4015p1774m41267J30034N96947
14667A403386n75989K52694l06382L45609l3563P0448k44037K39585k27195J43560
14657A068116N4424K39658J06051j83345l16531M11049k84709L1997K14729o15132
14647G26307N11713l9503M33582m15814J55019k37855R9785n2344J41970q9125
14637A233735n5470J59230l79475N70691k13663Q7672K03893j77188l11420K98134
14627A416139n252J57608j76076p0563j6580l21626M24348j46639J95247K42547
$$ plain form
14698 899292 864611 774359 769397 1093329 1049948 1059186 827682 918001 840253 766656 940473
14687 940473 623173 951666 911100 1049065 886266 990105 1283757 1079178 1078717 856421
14677 856421 1214136 944439 1029860 1092596 1155431 1189446 1117672 676405 806439 1403386
14667 1403386 827397 1080091 773709 1119318 1085755 1156203 912166 1151751 924556 1068116
14657 1068116 1122540 1362198 1468249 1284904 968373 1379422 1094713 1126710 1341439 726307
14647 726307 1238020 1198517 1632099 1216285 1371304 1133449 1233234 1180890 1322860 1233735
14637 1233735 1178265 1337495 958020 1528711 1315048 1402720 1606613 1429425 1118005 1416139
14627 1416139 1410887 1568495 1392419 1321856 1305276 983650 1407998 1261359 1456606 1699153
14617A699153l88417J29255J18302L6924k54211N06098n61852K9596J04247L34703
14607A753798j13090K23198l36950M3739O5937K70199j83536O9612l98792K97186
14597A691301L4837K00801K63073k31994k94032L5818K50994j02000k31128J23487
14587A741157P5711K90441J06250k32087k20106J81009K37786m78302M69239k03870
14577A967228L71162j52005j15195K50869k85245K04716o7315L42331j22766l4690
14567B359090K05900N4958q1774R7650J01854R1335L41827Q983K10224P7862K58069
14556C725978L21282m6908K84977N08860L16097P65511J232592J337292L165989
14547A1611670O039318J0057143N187885j4119151I342044l448529j341641p97059
$$ plain form
14617 1699153 1310736 1439991 1558293 1595217 1341006 1847104 1285252 1314848 1419095 1753798
14607 1753798 1640708 1863906 1526956 1570695 1636632 1906831 1723295 1792907 1394115 1691301
14597 1691301 1726138 1926939 2190012 1958018 1663986 1699804 1950798 1848798 1617670 1741157
14587 1741157 1816868 2107309 2213559 1981472 1761366 1942375 2180161 1701859 2171098 1967228
14577 1967228 2338390 2186385 2071190 2322059 2036814 2241530 2174215 2516546 2393780 2359090
14567 2359090 2564990 2619948 2538174 2635824 2737678 2829013 3170840 3179823 3390047 3467909 3725978
14556 3725978 4047260 4000352 4285329 4794189 5110286 5875797 7108389 8445681 11611670
14547 11611670 17650988 27708131 32896016 18776865 9342044 5893515 4551874 3754815
14539C754815n02226q0095l62577j80718j02792M6331p267j10320N659l3664J70700
14528B597846j82168M6799L46882k80052K59616j24875M71330n51984J90163o5589
14518B707968k73236L30684M3411m36161M97134M482k33628L70888J31451j48171
14508B994822j64262P25K55211k74735L48102j67275O4148K54371k32340K48373
14498C327140k86724M32125m78947L53892J79041k15856P8160N73024o84650L72105
14488C649310j49480K2524L32649r7246k7152j77137N48653k75738n1675K84293
14478D059001p9117M00115n52932L75908J18826k34440J63701R3924K03992m169
14468D544809j29278K18740J01028k60187p5053N49400j93083j03999K44712K12691
$$ plain form
14539 3754815 3252589 3172494 2809917 2629199 2526407 2572738 2565471 2455151 2460810 2427146 2597846
14528 2597846 2415678 2462477 2809359 2529307 2788923 2664048 3135378 2583394 2773557 2707968
14518 2707968 2434732 2765416 2808827 2372666 2869800 2874282 2640654 3011542 3142993 2994822
14508 2994822 2830560 2831285 3086496 2811761 3159863 2992588 3056736 3311107 3078767 3327140
14498 3327140 3040416 3472541 2993594 3347486 3526527 3310671 3388831 3961855 3277205 3649310
14488 3649310 3499830 3522354 3855003 3757757 3730605 3553468 4102121 3826383 3774708 4059001
14478 4059001 3979884 4379999 3827067 4202975 4321801 4087361 4251062 4344986 4548978 4544809
14468 4544809 4415531 4634271 4735299 4475112 4400059 4949459 4756376 4652377 4897089 5109780
14458E109780n13532J24781q4340J59178P03978k81310J93596K96157l51037L03666
14448E660917k82308L64750J20692j57822J49068j21639L33609j17606M92647
14439F442308m28408N84788l35213K20744j15071M55857M0716M1511J96069L57005
14429G460306j28167o498K1309J92538k0719K0222J28503L04983J67079k14176
14419G925380K54289j07260Q2806K09715L7196K24104L41046J73092l29831N70606
14409I381143l340K97898j08343J75294n5104N70520p2939K32249J57042K36469
14399A0810889J35859Q2376M2403L74422J74096K65871j20074O99560Q3999K19725
14389A2769126k443J44904N10379J93257j26901M36454L84850m21369R46657l9886
$$ plain form
14458 5109780 4596248 4721029 4636689 4795867 5499845 5218535 5412131 5708288 5357251 5660917
14448 5660917 5378609 5743359 5864051 5706229 5855297 5733658 6067267 5949661 6442308
14439 6442308 6013900 6598688 6263475 6484219 6369148 6825005 6865721 6907232 7103301 7460306
14429 7460306 7332139 7325641 7346950 7539488 7518769 7538991 7667494 7972477 8139556 7925380
14419 7925380 8179669 8072409 8155215 8364930 8402126 8626230 8967276 9140368 8810537 9381143
14409 9381143 9377803 9675701 9567358 9742652 9687548 10258068 10185129 10417378 10574420 10810889
14399 10810889 10946748 11029124 11071527 11445949 11620045 11885916 11765842 12465402 12549401 12769126
14389 12769126 12766683 12911587 13421966 13615223 13488322 13924776 14309626 13888257 14834914 14795028
14379A4795028J99962P17417K04941N32754J75559M68524K47359P89303l00620
14370A7830227K03000L43843O55392K88313M20873K54275J024261j64654L84872
14361B1240402R79096K97703O66861N54537L89691M59647K47155Q79867P62470
14352B6477429Q20683O20201O7336J019797O94286Q60026O08453Q18093J104474
14343C3090778Q41453N86744R31039Q44345R55799J241843J082231J156607J389099
14334D2119938J177168J208366J273414J664717J216683J711932J567188J635897
14326E3575303K014670K016321J808678K121315K219803K047463K404438K355767
14318G0563758K622810K783387K678111L503985K677736L536709L753028L966333
$$ plain form
14379 14795028 14994990 15712407 15917348 16450102 16625661 17094185 17341544 18130847 17830227
14370 17830227 18033227 18377070 19032462 19320775 19741648 19995923 21020184 20855530 21240402
14361 21240402 22219498 22517201 23184062 23738599 24128290 24587937 24835092 25714959 26477429
14352 26477429 27298112 27918313 27985649 29005446 29699732 30559758 31168211 31986304 33090778
14343 33090778 33932231 34518975 35450014 36294359 37250158 38492001 39574232 40730839 42119938
14334 42119938 43297106 44505472 45778886 47443603 48660286 50372218 51939406 53575303
14326 53575303 55589973 57606294 59414972 61536287 63756090 65803553 68207991 70563758
14318 70563758 73186568 75969955 78648066 82152051 84829787 88366496 92119524 96085857
14310I6085857L832195L919534M230291M698698M649595N517126N013665N931954
14302A33878915N876784O520060O774192P438086P285147P954568Q467110Q807784
14294A93002646R855343J0279239J0772669J0199282J1052444J0653549J0473466
14287B66288638J0588766J0348465J1132536J0753114J0777211J1129423J0912081
14280C41930234J1147855J1247025J1492498J1149802J0800366R685919J0561601
14273D18015300R675760P777409N437862M338869N68810l330559n117840r598145
14265D27767466j2386449j3594895j3058242j3256416j3825273j3267866j3516013
14258C34862312j2926678j2654753j2217545j0841372j1767535j1410360j1327003
$$ plain form
14310 96085857 99918052 103837586 108067877 112766575 117416170 122933296 127946961 133878915
14302 133878915 139755699 146275759 153049951 160488037 167773184 175727752 184194862 193002646
14294 193002646 202857989 213137228 223909897 234109179 245161623 255815172 266288638
14287 266288638 276877404 287225869 298358405 309111519 319888730 331018153 341930234
14280 341930234 353078089 364325114 375817612 386967414 397767780 407453699 418015300
14273 418015300 427691060 435468469 440906331 445245200 445814010 442483451 437365611 427767466
14265 427767466 415381017 401786122 388727880 375471464 361646191 348378325 334862312
14258 334862312 321935634 309280881 297063336 286221964 274454429 263044069 251717066
14251B51717066j0877686j0591912r033909r378557r465343q837789q219978p161087
14243A78150805p698720p150887o634681o414713o033541n618901n537112n719472
14235A27342778n327472m760559m501206m111678l917680m345505l459603l978792
14227I2940283l588086k924711l530760k787105l391899k514299k720247k584316
14219F8898860k111515k413826k416610j665894k060539j672996k005720j431786
14211E3119974j798796j391702j847896j422701j026740j198274j789316j393504
14203D1251045r06070j559590o17011j188782r34855j069300j419632n24784q05430
14194C2225591p62771q07094j458663m18703o97000n15036q92888n81188l04726
$$ plain form
14251 251717066 240839380 230247468 221213559 211835002 202369659 193531870 185311892 178150805
14243 178150805 170452085 163301198 156666517 150251804 144218263 138599362 133062250 127342778
14235 127342778 122015306 117254747 112753541 108641863 104724183 100378678 96919075 92940283
14227 92940283 89352197 86427486 82896726 80109621 76717722 74203423 71483176 68898860
14219 68898860 66787345 64373519 61956909 60291015 58230476 56557480 54551760 53119974
14211 53119974 51321178 49929476 48081580 46658879 45632139 44433865 42644549 41251045
14203 41251045 40344975 38785385 38168374 36979592 36044737 34975437 33555805 33031021 32225591
14194 32225591 31462820 30655726 29197063 28778360 28081360 27566324 26673436 26092248 25787522
14185B5787522o06944p65028p10179n46512l22892o96101o15025l34031k46096
14176B0944714m19904n69809n90361j03741o03027m15080m37667j60778m62116
14167A7182231n25251l1263J5907p17611j71246n4343n63286l06014j58663m67679
14157A4202782j66456l3915m0370n87907j63608l12125j24712k42741j62110k56058
14147A2112780j82273J13500n64050k74205k16761r4262q4833k51769k11313Q9955
14137A0436769l39583k12040L07724m6883o11370k22772J41726j17918k04524
14128I131129q7043n21274L88812o08290J12576j47622L0951m7183J13206j74178
14118H191084o43175J83923R3187j53202k30015M0482m80564L84649m24900K57908
$$ plain form
14185 25787522 25180578 24415550 23705371 23158859 22835967 22139866 21524841 21190810 20944714
14176 20944714 20524810 19955001 19364640 19260899 18657872 18242792 17805125 17644347 17182231
14167 17182231 16656980 16625717 16641624 15924013 15752767 15698424 15135138 14829124 14670461 14202782
14157 14202782 14036326 14002411 13962041 13374134 13210526 12898401 12773689 12530948 12368838 12112780
14147 12112780 11930507 12044007 11479957 11205752 10988991 10894729 10809896 10558127 10346814 10436769
14137 10436769 10097186 9885146 10192870 10145987 9534617 9311845 9453571 9335653 9131129
14128 9131129 9044086 8522812 8911624 8303334 8415910 8268288 8299239 8252056 8365262 8191084
14118 8191084 7547909 7731832 7825019 7671817 7441802 7482284 7001720 7386369 6961469 7219377
14108G219377l25064J12742k48651Q092K41931n78964m08913L01930j86727j44926
14098E990827K88172J5885n10945O5445J15080j65045j48933k21059K20976q3976
14088E566427k08901r5060K62657Q018p76522L27300p9953j13456J66835p8733
14078D978612Q7467j98667M2164m31207M05035k27915j48087p6548O207j7564
14068D419497J54177j87146J98688k92822k2888k19339P6587n0066K00654L2428
14058D309770J8627j92437K46173k88017j11886o4186j19119k04021l185K39752
14048C831471R5703k99955K00112j92274k12975K48768m16306K18311R5988J35127
14038C703970j66430n97314M78841l60682J70799j88454L0475L17274k68846j65633
$$ plain form
14108 7219377 6894313 7007055 6758404 6766496 7008427 6429463 6020550 6322480 6135753 5990827
14098 5990827 6278999 6294884 5783939 5849384 5964464 5799419 5650486 5429427 5650403 5566427
14088 5566427 5357526 5262466 5525123 5533141 4756619 5083919 5003966 4890510 5057345 4978612
14078 4978612 5066079 4867412 4909576 4478369 4883404 4655489 4507402 4430854 4437061 4419497
14068 4419497 4573674 4386528 4585216 4292394 4269506 4050167 4126754 4076688 4277342 4309770
14058 4309770 4328397 4135960 4382133 4094116 3982230 3918044 3798925 3594904 3591719 3831471
14048 3831471 3927174 3627219 3827331 3635057 3422082 3670850 3254544 3472855 3568843 3703970
14038 3703970 3537540 2940226 3419067 3058385 3229184 3040730 3071205 3388479 3119633 2954000
14028B954000j23109K34917J66840m30689K5332j35970j53114K38993k16725M04131
14018B964606J00016l76510J10278L4586J20842n78012P670K659O4851L42321
14008B793307k48764J52915j5811j26649O1900j175Q8990o6582M1728J77973o7386
13997B790446J66544j84702L36065K96071k1667J81251M95553O60374J050987
13988E770922K424845M603628R991566R822311j0327680r350220m579594k081597
13980F274181q30106q44592k78584k04831k0279l92887j86967k85283Q9561k77461
13970C042752J78982l11972j76770K44697l28541j87629K55091j49592P1311j29722
13960B508607j70415L46382l64087l7815m3922O4980O2653l14039J96554j48017
$$ plain form
14028 2954000 2830891 3065808 3232648 2801959 2827291 2691321 2538207 2777200 2560475 2964606
14018 2964606 3064622 2688112 2798390 2832976 2953818 2375806 2383476 2386135 2450986 2793307
14008 2793307 2544543 2697458 2681647 2554998 2616898 2615723 2704713 2638131 2679859 2857832 2790446
13997 2790446 2956990 2772288 3108353 3404424 3382757 3564008 4059561 4719935 5770922
13988 5770922 8195767 12799395 22790961 32613272 22285592 12935372 8355778 6274181
13980 6274181 5444075 4599483 4320899 4116068 4095789 3702902 3515935 3230652 3320213 3042752
13970 3042752 3221734 2909762 2732992 2977689 2649148 2461519 2716610 2567018 2638329 2508607
13960 2508607 2338192 2684574 2320487 2282672 2238750 2303730 2366383 2052344 2248898 2100881
13950B100881k52520O0613K36576p3771j50408l8376l78974M28847R9596k96761
13940A735703L34398m53066L96888m47111N01942k25770l3371J60003l27267j33533
13930A508816N0614n3647J08151J88161p6810Q1285k0063k37919K04193j93655
13920A559126Q4326k43636M5739K4635K03365k2663j21936J02739J31380J0293
13910A773368n70994J0407J09616K09927k807j08K14658J4478l88597p0320L02536
13899A602164l31580K82120j49910J02134l50961K16586n0557J85356j38596J70152
13889A536908j87889l150j71754K51981j42867Q0555j46163k23283R2014M92481
13879A578833k72441l63924J33503o1170Q9972P0459N2908J37088l06069K08821
$$ plain form
13950 2100881 1848361 1908974 2145550 2071779 1921371 1882995 1504021 1932868 2032464 1735703
13940 1735703 2070101 1617035 2013923 1566812 2068754 1842984 1809613 1969616 1642349 1508816
13930 1508816 1559430 1505783 1613934 1802095 1725285 1806570 1786507 1548588 1752781 1559126
13920 1559126 1643452 1399816 1445555 1470190 1673555 1650892 1528956 1631695 1763075 1773368
13910 1773368 1202374 1212781 1322397 1532324 1529517 1529409 1744067 1758545 1369948 1299628 1602164
13899 1602164 1270584 1552704 1402794 1504928 1153967 1370553 1319996 1505352 1366756 1536908
13889 1536908 1349019 1345869 1174115 1426096 1283229 1363784 1217621 994338 1086352 1578833
13879 1578833 1306392 942468 1075971 1014801 1104773 1175232 1228140 1365228 1059159 1267980
13869A267980j37649J5935J78822j68377O7415j40736J81058j35500m77402N61629
13859A213175j02915K09933k96617P4502J03593O7728k08165K55656n25505M09425
13849A200810R070j54132k26746J78151J56241M6740K3154l50642J86435k69415
13839G99666J69501j80489L36313k04049j1161L8907j1688M37345m02161J33026
13829A105210p3345Q286j36185j04376J27696l5764M6104l20768Q0002K13655
13819I10515j31162K93204m8976J86111k45164k7702k91155L11309j03331J55239
13809A008888J3642k95043L98810q3291k11195j47353K79235q6611j97436K77429
13799I57075l21219P87757n88629j41088l768J21234P9092J31327k87699o5481
$$ plain form
13869 1267980 1130331 1146266 1325088 1156711 1224126 1083390 1264448 1128948 651546 1213175
13859 1213175 1110260 1320193 1023576 1098078 1201671 1269399 1061234 1316890 791385 1200810
13849 1200810 1209880 1055748 829002 1007153 1163394 1210134 1233288 882646 1069081 799666
13839 799666 969167 788678 1124991 920942 909781 948688 937000 1374345 972184 1105210
13829 1105210 1031865 1040151 903966 799590 927286 891522 937626 616858 696860 910515
13819 910515 779353 1072557 1023581 1209692 964528 936826 645671 956980 853649 1008888
13809 1008888 1022530 727487 1126297 1043006 831811 684458 963693 877082 679646 957075
13799 957075 635856 1423613 834984 693896 690128 811362 890454 1021781 734082 668601
13789F68601J68732j25893Q2818j88965K77984J3495k76109J06889Q6735j30287
13779F84000K29245k33231J57268l81624K41134Q1342L51067n34136j08365K18562
13769G05262j37802K22267k50472K93594k24222N9126K26915J20691l16215k1542
13759F77602N1800k97330L08252n1231j16880o256j43370L51169J09566n057C75068
13747G45839k52923K08098j35527j23648M18045l72846R1053K59116J28189r8366
13737H67030k98074j45904M79615l77559k56723J81557L5442L59768C60122J04661
13727D64783P4378j20273j97008M47768l5696m7086j18109L51985l46104J16993
13717E91631J39451M1238k42386B08648L78560k54956J50473n0700K95253J38991
$$ plain form
13789 668601 837333 711440 794258 605293 883277 896772 620663 727552 814287 684000
13779 684000 913245 680014 837282 455658 696792 778134 1129201 595065 486700 705262
13769 705262 567460 789727 539255 832849 608627 667753 894668 1015359 699144 677602
13759 677602 729402 432072 740324 689093 572213 565957 422587 773756 883322 878265 375068
13747 745839 492916 701014 565487 441839 859884 487038 578091 837207 965396 867030
13737 867030 568956 423052 902667 525108 268385 449942 485384 845152 360122 464783
13727 464783 539161 418888 221880 669648 633952 586866 468757 820742 474638 591631
13717 591631 731082 772320 529934 208648 587208 332252 482725 432025 727278 866269
13707H66269k90167q8945P6800j0883j2896j23978J45301l183Q136J45437j26684
13696E85207q1948J29200j09733L4393n0169J44554J86986l58793L56643C77084
13685F73528P2955j31421k13227j90032K68971j21208j0246M17497l40078n3076
13675C73663J37230O8935J35788A90195Q233J22478m3959M41963l08231K12083
13665F22762j21493J01809l9741k16013K8552j32423P3126j15435L49317j37838
13655D12623K5834r0835j57052L38571r2056Q7235M8627K3681E7026O85499B12040
13643E56347B74913a67797E90208O8629q5341J45399j73293B08185K21351K20829
13633F50365L36603m32546O8246B16653J92902g4890D53532J8865K04294C37911
$$ plain form
13707 866269 576102 487157 563957 553074 540178 416200 561501 558318 566454 711891 585207
13696 585207 503259 632459 522726 557119 506950 651504 838490 479697 836340 377084
13685 673528 746483 615062 401835 211803 480774 359566 349320 766817 426739 373663
13675 373663 510893 579828 715616 190195 198428 320906 276947 718910 410679 622762
13665 622762 501269 603078 563337 347324 375876 243453 316579 201144 550461 412623
13655 412623 438457 347622 190570 529141 437085 524320 572947 596628 57026 742525 212040
13643 556347 274913 -167797 590208 658837 573496 718895 545602 208185 429536 650365
13633 650365 986968 554422 622668 216653 409555 -74890 453532 472397 676691 337911
13622C83806K27701j39096A83919b31781E63703j30007j74730K66444B47399o2903
13612A84496M76718k73848l2477j9194m4195j4311M4756J34492q2147j00389P4936
13601C48837A52073J54477K8432J07936n8431j28013J25204k1572J11733K7241
13591D99080N2917d6470B36222L78925J15319B59617J77798p4917K94019B40376
13580B96037A3435N55292k3536B5235M99806A43977N25169B25902K31981K6255
13570D84138Q5397A49418L96896K17504j96170r6352A63737P7990R7386J83072
13560E22185j00642j87599b8187D87415j94898J67001A43435K23228G8698K98107
13550C76805M0534J17801H3384L22067j44510p0482n6078F0125J05489J98775
$$ plain form
13622 383806 611507 472411 183919 -231781 563703 433696 258966 525410 247399 184496
13612 184496 661214 387366 354889 335695 291500 277189 321945 456437 374290 273901 348837
13601 348837 152073 306550 334982 442918 384487 256474 381678 360106 471839 499080
13591 499080 551997 -46470 236222 615147 730466 259617 437415 362498 656517 240376
13580 296037 13435 568727 545191 25235 525041 143977 669146 225902 457883 484138
13570 484138 569535 149418 546314 763818 567648 471296 163737 241727 339113 522185
13560 522185 421543 233944 -28187 487415 292517 459518 143435 366663 78698 376805
13550 376805 417339 535140 83384 405451 260941 190459 134381 60125 165614 364389
13540C64389l289A24855M24625j77009Q2998K2202K8797k35085j7608J58817j2577
13529D00015A75367J78606l0647M8805j04328A16449J61115L31573B04128l7495
13519A66633o2731L28603J94079A70536K00866j8636j667m1335k1624p5929Q5654
13508B97865H5773L97574j57835j5377D7652M6418N41296F391L39803j9986R4769
13497D20977j3417m4406A1723O72745k21523r3125K9471I5971k4946J05502M10468
13486E86995B78041K32043A88506i5541A36744R0057G0238J20377N22507l51057
13476C62065j80678L52831j89688A17237J38691N8954A36386j5451a90827E03391
13465E10199B36481r5009J06414f6752A98460Q1579i2328C56374H6196J05287
$$ plain form
13540 364389 361100 124855 549480 372471 455469 477671 506468 271383 253775 412592 400015
13529 400015 175367 353973 323326 372131 267803 116449 277564 609137 204128 166633
13519 166633 103902 432505 626584 170536 371402 352766 351099 309764 288140 212211 297865
13508 297865 85773 483347 325512 310135 47652 94070 635366 6391 346194 326208 420977
13497 420977 407560 363154 11723 684468 462945 369820 399291 95971 71025 176527 586995
13486 586995 278041 510084 188506 -95541 136744 226801 70238 190615 713122 362065
13476 362065 181387 534218 344530 117237 255928 314882 136386 120935 -190827 503391
13465 510199 236481 141472 247886 -66752 198460 280039 -92328 356374 86196 191483
13455A91483K57001A2052M29141j65629J1643m6455F6406a23316O0404A38164
13444B37463A4113K95390j10241a42369B73591P9395a65446C13998Q07E223L46041
13433C51264A56885J82889o3693a69277G2295L34175l2110C4628J75653K09338
13423D19619j20366J38296H4285C4729Q4542J32923N28872k74483a0347A41354
13412G7972J91872J33425J99l7507j06743K3153B4763L12247E016L69115b35017
13400A15984K9394o8552b772A64827C3688J58665h1620A44632M79329A57561k6673
13389A30888n8336J91475J49695j90673j07813J24460C7279K20671J33633A86402
13378c3524a5176G5381K01277J82771j45229m2363b557B38264b1366C68093a65519
$$ plain form
13455 191483 448484 12052 441193 275564 287207 240752 66406 -123316 -62912 138164
13444 237463 14113 309503 199262 -142369 273591 352986 -165446 313998 314805 5223 351264
13433 351264 156885 339774 276081 -169277 72295 406470 374360 34628 210281 419619
13423 419619 299253 437549 84285 34729 119271 252194 781066 506583 -10347 141354
13412 77972 269844 403269 403468 365961 259218 282371 24763 337010 5016 374131 -235017
13400 115984 145378 76826 -2772 164827 33688 192353 -81620 144632 623961 157561 130888
13389 130888 72552 264027 413722 223049 115236 239696 37279 257950 391583 186402
13378 -33524 -15176 75381 276658 459429 314200 271837 -2557 238264 -21366 368093 -165519
13366A36506J28149n813J12025p5673A12303J46092J03117A34640J21323p5377
13356A80586a04568A96813n2548o5508h4980A37022L21488B06977K67149r1354
13346C82772Q0814j58219Q3408M4961r1405A20612J04479K8208K27518I7822J78314
13335B76136M40476B66651o5434L2533J96211L6478e2305B37067R7214A16821
13324A19039j8226K10799j00387B4615L28860A38155K9317E8423L33878A39324
13313I7307P5926K69158B06843F235K04759m7897F7720M42044B27273n583G4724
13301B60030H3259J80223j09829C3090b27287P4468B35114J30627j23418o9180
13291A73143P3065J37678j04738j1841j01510G4827a32588G9173K82687A58811
$$ plain form
13366 136506 264655 258842 370867 295194 112303 258395 361512 134640 255963 180586
13356 180586 -104568 196813 144265 78757 -84980 137022 458510 206977 474126 382772
13346 382772 463586 305367 388775 433736 342331 120612 225091 253299 480817 97822 276136
13335 276136 716612 266651 201217 233750 429961 466439 -52305 237067 334281 116821
13324 119039 100813 311612 211225 24615 353475 138155 167472 58423 392301 139324
13313 97307 173233 442391 206843 6235 210994 163097 67720 509764 227273 221690 74724
13301 260030 83259 263482 153653 33090 -227287 -152819 235114 365741 242323 173143
13291 173143 246208 383886 279148 267307 165797 74827 -132588 79173 361860 158811
13280D57393a06775I6457I183K54336J58269a03153B94760A09085a73489B94381
13269C97873J64653A03070K50197h9809A50586P8223a34646C36203q7648G6915
13258f7731B90546B1872J62053f4441F8536j8520O26095j53058e9374C17005j06063
13247B10942q12J59154m7040F1889Q124B5852k482K09146r0439L5747O6795C3771
13234B48928R8021B6193K71136j17795f8053p5888B24078J3640A06943K42758
13224C49701o7195N506F2459N8223M1292B0509b8236k71298h7338A58317L56564
13213E14881g845A70251K41151b32320l1035e0095A60101l2143E8209O9752J00667
13202B28628E6083a14894B68856r9714a65665A36313g2393C20067G4780C686L1721
$$ plain form
13280 457393 -106775 96457 9183 263519 421788 -103153 294760 109085 -173489 294381
13269 397873 562526 103070 353267 -89809 150586 228809 -134646 336203 248555 76915
13258 -67731 290546 21872 183925 -64441 68536 50016 676111 523053 -59374 317005 210942
13247 210942 210130 369284 322244 61889 70013 25852 23370 232516 142077 177824 244619 33771
13234 248928 346949 26193 297329 179534 -68053 -143941 224078 237718 106943 349701
13224 349701 282506 288012 62459 120682 161974 20509 -28236 -299534 -87338 158317 514881
13213 514881 -7845 170251 411402 -232320 -263355 -50095 160101 127958 58209 127961 228628
13202 228628 56083 -114894 268856 169142 -165665 136313 -72393 320067 74780 3686 35407
13191C5407L91448d60713d072j17997A25808N6841L6443K1942A14150J90061A31732
13179a12750B06582r6881j9680g3107B49007N4349J8126c7886k47441J08373H5040
13167C8063M8431c5396B94130p9527J74666A19300n2634E742J04928b8809j7905
13156d6714J6802A76626J24434j31171b0628C5384A0312J73561n3920b15181g928
13144f1946m068A12058a52700O342B48940j3545C7937a26156B6898p049J30308
13133A50157K31973j81992K36756A82400b9087A59812o9072a15687D88173a8443
13122A84575d24325F3012K55906F1749k3723b4789I8078J02802m2699J17096D2633
13110a58643g4926I2672J22254b61847A95279A1033M0338J78367a58272A12419
$$ plain form
13191 35407 426855 -460713 -4072 -122069 125808 182649 219092 241034 114150 304211 131732
13179 -112750 206582 109701 90021 -73107 249007 303356 321482 -37886 -285327 -176954 85040
13167 38063 86494 -35396 294130 214603 389269 119300 66666 5742 110670 -28809 -46714
13156 -46714 -29912 176626 301060 169889 -20628 35384 10312 183873 129953 -215181 -7928
13144 -61946 -66014 112058 -152700 -146358 248940 235395 37937 -126156 26898 19849 150157
13133 150157 382130 200138 436894 182400 -29087 159812 90740 -115687 488173 -18443
13122 184575 -424325 63012 318918 61749 38026 -24789 98078 200880 158181 275277 42633
13110 -158643 -74926 92672 214926 -261847 195279 11033 51371 229738 -158272 112419
13099A30637e3429I5300b17949a404C9242K05867a65769F7650J53254d6640J1918
13088c4722C63196q6419c8222D9106a75494A81242k0772J49963j40269K8714A5043
13076b33187D54498A70436m9813b26456A30919a15953C08493a3751E16154Q9073
13066F05227B29515a66205B72085A30819D0647L38665f4701k7427A38795H429
13055A79894J58766a8679j8763I8770J83179F2993a89032A38748F3076J87194
13045B50270e2612m7220d6036G0630a5499A59022e9262B65830B7171b85317A74170
13033B9375f2053G6426J61213e8988A4259J28100B7985a21609D6278J82345a6934
13021A19486J97327c2877A26009Q7777J9055R2998a3645E5158J55486H8224R334
$$ plain form
13099 130637 -53429 95300 -217949 -1404 39242 245109 -165769 67650 220904 -46640 -34722
13088 -34722 363196 276777 -38222 49106 -175494 181242 160470 310433 170164 198878 15043
13076 -233187 454498 170436 120623 -226456 130919 -115953 308493 -13751 516154 605227
13066 605227 229515 -166205 272085 130819 40647 379312 -64701 -92128 138795 8429
13055 179894 338660 -18679 -37442 98770 281949 62993 -189032 138748 63076 250270
13045 250270 -52612 -99832 -46036 70630 -15499 159022 -59262 265830 27171 -285317 174170
13033 29375 -62053 76426 237639 -58988 14259 142359 27985 -121609 46278 228623 -16934
13021 119486 316813 -32877 126009 213786 232841 325839 -13645 55158 210644 88224 97558
13010I7558g6541B22827C9084L5110b05219C1277Q9503J02323l7854E6951K37367
12999B94318J91230A03560J98919R5662f9417B1856N0066K95440A79391J62778
12989C42169A29540g4085H0847f8927b1788E3040J1858c16335B96610b2323p5705
12978i8028a2726N582j70803A88841B9704j399K41399K9775j14959J244p5563
12967A10201a69767F3799J88357A668J79137J7177a93301F7142K00760a23638
12956F1441g4685L6269A33817D8577J54947a64808A66946A4867P0890m0226K45085
12945B90616A04727d33311E8225L60670H4407L82840b67259A37681h1217q073
12935h9290B16649M69F3253a03989C11305b39331A17746K5638D1122i345B60004
$$ plain form
13010 97558 -76541 222827 39084 74194 -205219 31277 120780 223103 185249 56951 294318
12999 294318 485548 103560 302479 398141 -69417 21856 71922 367362 179391 342169
12989 342169 129540 -74085 80847 -68927 -21788 53040 64898 -316335 296610 -22323 -98028
12978 -98028 -12726 -7144 -177947 188841 29704 28305 269704 299479 184520 185764 110201
12967 110201 -169767 63799 252156 1668 180805 197982 -193301 67142 267902 -123638
12956 61441 -74685 -38416 133817 48577 203524 -164808 166946 14867 85757 45531 290616
12945 290616 104727 -433311 58225 418895 84407 467247 -267259 137681 -81217 -89290
12935 -89290 216649 217118 63253 -103989 311305 -239331 117746 143384 41122 -9345 260004
12923e9539F3910L96841A07819K56684a06327F8215O1845J1982a22604f1114A70357
12911a48134n7999R962F6553a49201A42541c5102n1210A00885b10725c0791H7124
12899B35176a39518k41060F323a82071h3089B64797q8953E587N5709J03345a5688
12887B37548J49159D1477J01682J39499j21441g4159B80332a2446C14471j40725
12877A73746c0397k92532Q5817B76672A07455l3552J64909d6373a6019B53017
12866a96595C6024a53059d2276A06507J50289h6282r3052I697O7822e9175r3152
12855a52327A9325J26751b2753B22851g4425A27251h68B45762a21925a6853e401
12843F3367A3362e272j15198A33631J41000Q1698A36634E0649B3554i1824r4657
$$ plain form
12923 -59539 63910 460751 107819 364503 -106327 68215 130060 142042 -122604 -61114 170357
12911 -148134 -206133 -196171 66553 -149201 142541 -35102 -86312 100885 -210725 -30791 87124
12899 235176 -139518 -380578 6323 -182071 -83089 264797 175844 5587 61296 164641 -15688
12887 237548 386707 41477 143159 282658 161217 -74159 280332 -12446 314471 173746
12877 173746 -30397 -322929 -237112 276672 107455 73903 238812 -46373 -16019 253017
12866 -196595 36024 -153059 -42276 106507 256796 -86282 -179334 9697 77519 -59175 -152327
12855 -152327 19325 146076 -22753 222851 -74425 127251 -868 245762 -121925 -16853 -5401
12843 63367 13362 -5272 -120470 133631 274631 356329 136634 50649 23554 -91824 -186481
12832a86481j98140G8559P7320a64615g1591J2756Q53J993R577k16352C1459c2316
12819A4568a14348p253a7752B31984B1397J60984M9087q61b26129A00161B9415
12807a57667p9337A19533J47813a17103k34115F365J72739l8904a07322q9892
12797a97214A99447a23011A05610B4651a26801A85626A5343a4433G8379J64393
12787B42772P0372N2502H0649a83659e480j53331g9020j7515j43422A67500J24606
12776B92106I3590O8544a43424B66467a18376R315A18048b9164j51787A525J03917
12765A05442a05312K1330F1295e3180A05770K4310A1292a00746k50814F3346q034
12754E5312K38193j00239K9608j3556g8046B68037e6249A04604N1005o5880J35432
$$ plain form
12832 -186481 -384621 78559 155879 -164615 -71591 -58835 -57982 -55989 -46412 -262764 31459 -32316
12819 14568 -114348 -121601 -17752 231984 21397 182381 231468 230607 -226129 100161 29415
12807 -157667 -237004 119533 267346 -117103 -351218 6365 179104 140200 -107322 -197214
12797 -197214 199447 -123011 105610 24651 -126801 185626 15343 -14433 78379 242772
12787 242772 313144 365646 80649 -183659 -5480 -158811 -79020 -96535 -239957 167500 292106
12776 292106 93590 162134 -143424 266467 -118376 -109061 118048 -29164 -180951 1525 105442
12765 105442 -105312 -83982 61295 -53180 105770 130080 11292 -100746 -351560 63346 55312
12754 55312 293505 193266 222874 209318 -78046 268037 -56249 104604 155609 89729 225161
12743B25161a83116c7166J0757H1867j3001d8513k10854J3830C65314A9731N3623
12732G3354K5503J39424B6452R5916R4623B533K67332A3326J04506k3025a1091
12720a14659A45445a88468I8715A7258J81474p0652m1574K21555j39622f2935
12709c7821p54C70812e0363C8855A7716J26108h166A24457J33566A5093a54544
12697H2345b30406g7668q0352o4844B45417c5844E14159g6297b9296j32062n4821
12686b16179A90064q808J69531A41298K34589Q5447A53208b63133d3737B12382
12675B5019I344J80389B1973b12330I1068d9337A11203K45894G5215J53816J48963
12664C77994a18351L0476l4777h862D40114i4323A46765J41072H648J00626c5750
$$ plain form
12743 225161 -183116 -37166 -26409 81867 68866 -48513 -259367 -245537 365314 19731 73354
12732 73354 98857 238281 26452 122368 216991 2533 269865 13326 117832 94807 -11091
12720 -114659 145445 -188468 98715 17258 198732 128080 86506 308061 168439 -62935
12709 -37821 -38575 370812 -50363 38855 17716 143824 -8166 124457 258023 15093 -154544
12697 82345 -230406 -77668 -158020 -222864 245417 -35844 514159 -76297 -29296 -161358 -216179
12686 -216179 190064 181256 350787 141298 375887 461334 153208 -263133 -43737 212382
12675 25019 9344 189733 21973 -212330 91068 -49337 111203 357097 75215 229031 377994
12664 377994 -118351 -87875 -122652 -8862 440114 -94323 146765 287837 8648 109274 -35750
12652B07032p1829B3025K37907B8423a03346D682K2860c377l5657B22644I7732
12640A37210J17002j05185F6445d47699D4749f5839A06911f143E890a22927B04573
12628A91187D443O20259k88470k2834n2865j2590j10339c9881L543D47128A52203
12616h4545A49436R9299r9964b25251a07270A35153d1341D7740O0941a21362H8434
12604a4099A92151l6142e7486r445b8389A14889q79D5203R533J2966O2294A7710
12591C619a09565A19694l324m1484L84853c6325B36941a27994I7077b65956a27041
12579a6057j78966g0652A89289Q350e4569n3155p7890D8562g4243I1757i7255
12567G9197K96935H2249J68765c6933I4003K2427D9107b9689C3062M47086k11807
$$ plain form
12652 207032 135203 23025 260932 28423 -103346 4682 27542 -3377 -39034 222644 97732
12640 137210 254212 149027 66445 -447699 44749 -65839 106911 -6143 5890 -122927 204573
12628 191187 4443 624702 336232 313398 260533 247943 137604 -39881 -36338 447128 152203
12616 -84545 149436 248735 148771 -225251 -107270 135153 -41341 47740 108681 -121362 88434
12604 -14099 192151 156009 -57486 -66931 -28389 114889 114010 45203 54736 67702 129996 17710
12591 3619 -109565 119694 116370 74886 459739 -36325 236941 -127994 97077 -265956 -127041
12579 -16057 -195023 -70652 189289 197639 -54569 -107724 -185614 48562 -74243 91757 -97255
12567 79197 376132 82249 251014 -36933 94003 116430 49107 -29689 33062 480148 268341
12556B68341j33389J6189I482a51886A44379n6304K33499I2944m5630c44697A3564
12544a90C25232c0007D0540g5944A30836E6620a41969k9583D8210J27482A7987
12532A30575K1306b02380C35815J60892c1804G3386a57986C32641b18934P8336
12522a40598A08801R779a46696e9283B32119D250J21680J91710a06275c7668k27965
12511b65633A23245a18536B91946A04551E1754I561a68950J3733M6139B49879
12500a49056B7630K13570G5077O4554g8160A13752B1960g3466F4470J11493J42035
12489C17998a5566B93106a0152A21524D9008a61284A65851b00027O151f1386B75133
12477h0093A83505N0837a18769C68135n8271j29058o0510Q064J6199h8943b7643
$$ plain form
12556 268341 134952 151141 9482 -151886 144379 88075 321574 92944 47314 -344697 13564
12544 -190 325232 -30007 40540 -75944 130836 56620 -141969 -171552 48210 175692 17987
12532 130575 151881 -202380 335815 496707 -31804 73386 -157986 332641 -218934 -140598
12522 -140598 108801 118580 -146696 -59283 232119 4250 125930 317640 -106275 -37668 -265633
12511 -265633 123245 -118536 291946 104551 51754 9561 -168950 -155217 -109078 249879
12500 -149056 27630 241200 75077 139631 -78160 113752 21960 -73466 64470 175963 317998
12489 317998 -15566 293106 -10152 121524 49008 -161284 165851 -200027 -193876 -61386 275133
12477 -80093 183505 234342 -118769 368135 309864 180806 120296 128360 144559 -88943 -27643
12465a60899c5806k367j18515B12930i3051B7527a39097G1178a29431f2930K3182
12454c9748B49539o7508k4748b1548F5451A7465b82758a15132L6779A42957o228
12443A36729c772E14993B03428c50533c5694B3159l770b31608C2592a77716e5266
12431b14470A23426f2527A52574I507b64075C70014A24257a33837C11877F4299
12420a29108A15224d7220E0411b09159j466l1745A0153R2829b50408B2881N5190
12409G8071b0624A11492c02013A29602K85797b7406j02188f60o5326A25662c2138
12397C5181h1793A73341i2584B34019B3981a00126k8169a3853k1959k57232N7720
12386b35324J15525j56409b5654A95984a19551l9578K3389J8227d7469C4493b8701
$$ plain form
12465 -160899 -35806 -38173 -156688 212930 -93051 27527 -139097 71178 -129431 -62930 -39748
12454 -39748 249539 182031 157283 -21548 65451 17465 -282758 -115132 -78353 142957 136729
12443 136729 -3772 514993 203428 -350533 -35694 23159 19389 -231608 32592 -177716 -55266
12431 -214470 123426 -62527 152574 9507 -264075 370014 124257 -133837 311877 64299
12420 -129108 115224 -47220 50411 -209159 -210625 -242370 10153 102982 -250408 22881 78071
12409 78071 -20624 111492 -302013 129602 415399 -27406 -129594 -660 -65986 125662 -32138
12397 35181 -81793 173341 -92584 234019 23981 -100126 -128295 -13853 -35812 -293044 -235324
12386 -235324 -119799 -276208 -25654 195984 -119551 -159129 -135740 -117513 -47469 34493 -28701
12374B30542K22801c8539r6241l4422F7267b62248J29513C7210Q021K15271f6896
12362B12225c55048f9712G9662a18395r9326L7133B50429A18616B4336B270L12191
12351C14461a50076c8762k7565j07452E6953C658M958J46756f90A24155K7866
12340A52021c4678A74170A7692L53251f4822j1472n390B5746J3968a98089a213
12328C780M7330a67302a6774j39176B5419A2252J52841A6742J66999i719B90737
12316B05056a23745A29244k2379b80053A06159K85325i2096B23230h6618n1485
12306a38103E8045K05986N5846M0236a02790l22044B1334J305h5816B73303j12148
12295A61155i5820B6493a00414F124P1450C7708R4008e7896C4233R200L34716
$$ plain form
12374 230542 453343 -38539 -134780 -169202 67267 -262248 -132735 37210 45231 260502 -66896
12362 212225 -355048 -69712 79662 -118395 -217721 -180588 250429 118616 24336 2270 314461
12351 314461 -150076 -38762 -66327 -173779 56953 3658 8616 155372 -690 124155 152021
12340 152021 -34678 174170 17692 370943 -64822 -76294 -81684 25746 39714 -198089 -1213
12328 3780 51110 -167302 -16774 -155950 25419 12252 165093 16742 183741 -9719 290737
12316 205056 -123745 129244 106865 -280053 106159 391484 -92096 223230 -86618 -138103
12306 -138103 58045 264031 319877 360113 -102790 -424834 21334 22639 -85816 273303 161155
12295 161155 -95820 26493 -100414 6124 77574 37708 131716 -57896 34233 43433 378149
12284C78149I3440k0166a4900n9600A14667d4662A48410J63207d723F0483h6466
12272A47907m3851i2845C26767A05472e4260H8008R9725c2599r4694A77988B3831
12260a56584D83857a79200g8027A94840o8677a33637B27277I9331b30713D0643
12249A17767n5562O9511o1840B8204M5816N41400B16422C8704J10584K19177E8270
12237A32694N491l7944L8773L10765I0921K02022k2606q9552a05513C35469j01910
12226B33559J32677j48516M7336I2746J76538a8174F8171O98B7887J95918l9972
12215A83833a22892L6038L5226B76810a97703C76370C7073K34839j03622b1708
12204I8411m2572J0157L50123E3897J20809a28042b5224B44422b59487A17344
$$ plain form
12284 378149 93440 73274 -14900 -74500 114667 -44662 148410 311617 -4723 60483 -86466
12272 147907 104056 -92845 326767 105472 -54260 88008 187733 -32599 -127293 177988 23831
12260 -156584 483857 -179200 -78027 194840 126163 -133637 227277 99331 -230713 40643
12249 117767 62205 131716 69876 28204 74020 615420 216422 38704 149288 368465 58270
12237 132694 138185 100241 139014 449779 90921 292943 270337 180785 -105513 335469 233559
12226 233559 366236 217720 265056 92746 269284 -18174 68171 68869 27887 223805 183833
12215 183833 -122892 -86854 -51628 276810 -197703 376370 37073 271912 168290 -21708
12204 98411 55839 65996 416119 53897 174706 -128042 -25224 244422 -259487 117344
12193B91701J23683A93142M6531K1698n3204P9174b2964B58071a49267A96994
12182D26463L1993B23387A0971b73458Q1777d0684j41600N7045B19220a67914
12171D78051A51356a77854a8454A90377J72790D5555J03527l014a54736D9413
12160d7067m313I5686L93335B12783b78012A72779a79107B01830J07776m7708
12150B61898j10938a61876g6390o4806N1181K2299A79008a36016A83373n6513
12140A26860b1588Q996D7034K07486D1510K10525J93888B6420a29512i965E22595
12128C64727c58064B32374l2638G0137j7088j6427O357a73315G8104b75111C8058
12116A32328J14821l6178B6651K64904j01930C8862b8602a3223F5448J19276b72412
$$ plain form
12193 291701 415384 193142 239673 261371 208167 287341 -22964 258071 -149267 196994
12182 426463 458456 223387 10971 -273458 -191681 -40684 -182284 -125239 219220 -167914
12171 478051 151356 -177854 -18454 190377 363167 45555 149082 146068 -154736 49413
12160 -47067 -51380 95686 489021 212783 -278012 172779 -179107 201830 309606 261898
12150 261898 150960 -161876 -76390 -141196 -90015 -67716 179008 -136016 183373 126860
12140 126860 -21588 -12592 47034 254520 41510 252035 445923 26420 -129512 -9965 522595
12128 364727 -358064 232374 199736 70137 53049 36622 42979 -173315 78104 -275111 38058
12116 132328 247149 210971 26651 291555 189625 38862 -28602 -13223 65448 184724 -272412
12104b39745Q1347A89498G6242e7000K7349C10502f5367A73233c2829B5785lN460
12092C1242h2206B25227A01777j4541C7269a25762c3332D2821P5131B8221J07629
12081A35850F7874J02002a34629H547J28531F1635L2993N22611L37215K47626
12071A202080m99793B69389j00945J58963K39500k00653A63671J05284a53837
12061a49370j2318k3719l1650B87798b53360B5382L36459p017c67056A25163l5255
12050H9908b59037D165J89231d7022A63068g1514a9059A9160R5820a47952A11881
12038b87113A48357b11164A47419b62368D9765J00188N9634a35789j97184B47966
12027A99725b55421A38433b395k88180f062F6922j2871a2939j0493A42449i7106
$$ plain form
12104 -239745 -158398 189498 76242 -57000 -29651 310502 -65367 173233 -32829 25785 25782 31242
12092 31242 -82206 225227 101777 87236 37269 -125762 -33332 42821 117952 28221 135850
12081 135850 67874 169876 -134629 8547 137078 61635 94628 617239 954454 1202080
12071 1202080 702287 269389 168444 327407 566907 366254 163671 268955 -153837
12061 -149370 -161688 -185407 -217057 287798 -253360 25382 361841 354824 -367056 125163 89908
12050 89908 -259037 4165 193396 -47022 163068 -71514 -19059 19160 114980 -147952 111881
12038 -287113 148357 -211164 147419 -262368 49765 149953 209587 -135789 -332973 247966
12027 199725 -255421 138433 -2395 -290575 -6062 66922 54051 -12939 -23432 142449 -97106
12015d1183B11952b42266A6785a65522N319H0860e5306A00593b64783A51108a50255
12003A36038K3206C5334f8557j9888D314b52222L3941A49284l7201f638l25558
11992c32196B99920a36716p0729A970c98138A38878a57985P8339j41829f597j82416
11981a89013I2212R7360d3175j08292B70702a03834C61359H6936b1421e844r1785
11970i7629C97394e1885D6572J17856A6942O9270Q7937a28943A62971a99781j25344
11959c25125A01033c5976l1762g716q9213d3202n0837G8650D946N599a16714B10949
11946B48115a06328o8477o2009J06360c4010r6730A74785D375g5468k5757E0166
11934i5464k53333c603k4626j94999E64256b8183j29862B23541k7271b69849C18170
$$ plain form
12015 -41183 211952 -242266 16785 -165522 -160203 80860 -55306 100593 -264783 151108 -150255
12003 136038 159244 35334 -68557 -88445 4314 -252222 -218281 149284 112083 -6638 -332196
11992 -332196 299920 -136716 -207445 1970 -398138 138878 -157985 -79646 -221475 -6597 -189013
11981 -189013 92212 189572 -43175 -151467 270702 -103834 361359 86936 -21421 -5844 -97629
11970 -97629 397394 -51885 46572 164428 16942 86212 174149 -128943 162971 -199781 -325125
11959 -325125 101033 -35976 -67738 -7716 -96929 -43202 -94039 78650 4946 10545 -116714 210949
11946 248115 -106328 -174805 -236814 -130454 -34010 -130740 174785 4375 -75468 -101225 50166
11934 -95464 -348797 -3603 -28229 -223228 564256 -28183 -158045 223541 196270 -269849 318170
11922B47374a51568L543B96950c82952a14644d1821r1164E1844b69340A62374
11911D2553a78045A50261B0575i6886B87750A15929c7048H5907L6452A3491g2213
11899C0763h2277B82235b17197g9563F6753j4429c6494C14202E043L24077A18674
11887b14608i7269j86188a26703A51M12142p6335c9390C5724b15180d0118k92189
11876c32307F8278b84652G0165O7403E2007c04174M6062I2072a58927M4703n8234
11865a72458L1992k5494q6668A33568F2274B4758a06618q5271d3729a9031L142
11854a5889q5865A4620K73579j30958d72373K13282g3058q5525I3199K87021A3335
11842b96021a20397A8504J47485l6534n0380K37246D0609J17413m1376K48524
$$ plain form
11922 247374 -151568 -148025 296950 -382952 -114644 -41821 -132985 51844 -269340 162374
11911 42553 -178045 150261 20575 -96886 287750 115929 -37048 85907 122359 13491 -72213
11899 30763 -82277 282235 -217197 -79563 66753 52324 -36494 314202 5043 329120 118674
11887 -214608 -97269 -283457 -126703 151 412293 335958 -39390 35724 -215180 -40118 -332307
11876 -332307 68278 -284652 70165 137568 52007 -304174 -258112 92072 -158927 -114224 -172458
11865 -172458 -140466 -165960 -252628 133568 62274 24758 -106618 -191889 -43729 -19031 -15889
11854 -15889 -101754 14620 288199 157241 -472373 -259091 -73058 -158583 93199 380220 13335
11842 -296021 -120397 18504 165989 129455 79075 316321 40609 158022 116646 365170
11832C65170b01263A73699J5411h6614D6047a14287F9465c1530j1002j58403P0995
11821a29940F7038b00493m5915B32332a71742F7079A7663J21721a16424E9149
11810A07097e6805A86963N5887A06157a87358F6601M13962a50405j61573a259
11799B7908M3875a20876q787A440i6175B3961J64780e02755B26481D4276O85o874
11787C8087a38727j36717A8256L93575A3181K62675b51261a14757p3670J7400
11777a71027C2712a39388A2296e1370C876L3652a45844C46431a70689o4159f6206
11765a61285e2883j16632e3683p5617A26410i1655B4457b19869a5555A97831b08356
11753A19924b08705A99675g1555B35305M6702C9188a25648C27401F9272K3666
$$ plain form
11832 365170 -201263 173699 189110 -86614 46047 -114287 69465 -31530 -42532 -200935 -129940
11821 -129940 67038 -200493 -246408 232332 -171742 67079 17663 139384 -116424 59149
11810 107097 -56805 186963 242850 106157 -187358 66601 480563 -150405 -311978 -1259
11799 27908 71783 -120876 -129663 1440 -96175 23961 188741 -502755 226481 44276 44961 38087
11787 38087 -138727 -275444 18256 411831 13181 275856 -251261 -114757 -188427 -171027
11777 -171027 32712 -139388 12296 -51370 3876 37528 -145844 346431 -170689 -234848 -66206
11765 -161285 -52883 -169515 -53683 -129300 126410 -91655 24457 -219869 -15555 197831 -208356
11753 119924 -208705 199675 -71555 235305 282007 39188 -125648 327401 69272 92938
11743I2938a47437l6495B83434a07150k87940F4883R6486b1325C81628a62848
11732E301J65088a73644A92961J22761d64630a86291B01623a23463j1646B03776
11721a26545A62909b28886G849a19430C15971j55693G0355a76400K5289j17237
11711b68348E9929O4412J11791a11175q9026b4349A44106a97737G2393J00080
11701A72473d9190p4029d4970J2244B5584c14008A19869J22403c7524j88603m8208
11690b74335A12823J28767q8960l3669E40a49175D1936K39561b98370f6310n0428
11679a16738A8176b1778p9037A43998F5470N4886E9974P0965i4131d5470A44341
11667b35597b5656k760G6779Q5862L01M7447g6172m22574a02154l3628I7940K08045
$$ plain form
11743 92938 -147437 -183932 283434 -107150 -395090 64883 161369 -21325 381628 -162848
11732 5301 170389 -173644 192961 315722 -464630 -186291 201623 -123463 -135109 203776
11721 -126545 162909 -228886 7849 -119430 315971 160278 70355 -176400 -151111 -268348
11711 -268348 59929 124341 236132 -111175 -200201 -24349 144106 -197737 72393 172473
11701 172473 -49190 -123219 -44970 -32726 25584 -314008 119869 242272 -37524 -226127 -274335
11690 -274335 112823 241590 152630 118961 540 -149175 41936 281497 -298370 -66310 -116738
11679 -116738 18176 -21778 -100815 143998 65470 120356 59974 130939 -94131 -45470 144341
11667 -235597 -25656 -28416 76779 162641 162942 210389 -76172 -498746 -102154 -135782 97940 305985
11655C05985d5776A59956g883r8118B68262a35352e3751j25595f2372C9365h4166
11643B60208A2586J5011g3056j0868I8558a41493A73596b16742q0819e9023j32440
11632a91463R0497J0227A56137B4555K48433e4943n5005A10871E0102K2319P0151
11621A42572E4729L42169j90930a27867A41208l5568b0121g909j39194g931B09509
11609e7016A61214F3313J70423n090C6486d7551A95254k560k1529p2735g5114
11597C06163d7272a9447C07104A19498g270K570D3117Q0338J17830J52760F4531
11585A23152Q5388L5668j04115P5781o6019m7197J76682c1755A17872K08966A58063
11573a93952A04124J92561q7708f4040D842K06616J51723j48480b39459D9311
$$ plain form
11655 305985 -45776 159956 -7883 -106001 268262 -135352 -53751 -179346 -62372 39365 -84166
11643 260208 12586 27597 -73056 -83924 98558 -141493 173596 -216742 -297561 -59023 -191463
11632 -191463 -100966 -90739 156137 24555 272988 -54943 -109948 110871 50102 72421 142572
11621 142572 54729 396898 205968 -127867 141208 105640 -20121 -7909 -147103 -7931 209509
11609 -57016 161214 63313 233736 228646 36486 -47551 195254 192694 171165 98430 -75114
11597 306163 -47272 -19447 307104 119498 -7270 -4700 43117 123455 241285 394045 64531
11585 123152 208540 244208 140093 215874 149855 102658 279340 -31755 117872 326838 158063
11573 -193952 104124 296685 208977 -64040 4842 211458 363181 214701 -239459 49311
11562b9488A55950b96909A19464k6831O3809o9097c99124C40392c5410A47512
11551G08M805f8336C47682G729J41945R0085a8733B37874L6878m6844M924B5336
11538A30661b9800D854K36459A17040M390c3788A90847k9918A8001K31800a9163
11526h0294G4103a50354n6284H8241j4844d9024A92576H7148J67560Q092h868
11514B72133a82522B21722B230M8117b47140A42259m08q0K02447A36734o0510
11503G6224b4557B10040N2591j12805J71954g1157C04564P8048h4641p1859A89457
11491a24421B36948A11559D4929J8079J43754C8840P0172l3019J21478F129j540
11480D589P1973A9224J42635P5305m0667m3155p1753O9563J30183m7160f504A96125
$$ plain form
11562 -29488 155950 -296909 119464 92633 156442 87345 -399124 340392 -35410 147512
11551 708 5513 -68336 347682 7729 149674 239759 -18733 237874 274752 227908 232832 25336
11538 130661 -29800 4854 241313 117040 121430 -33788 190847 160929 18001 249801 -19163
11526 -80294 74103 -150354 -206638 88241 73397 -49024 192576 87148 254708 262800 -8868
11514 272133 -182522 221722 2230 50347 -247140 142259 141851 141771 344218 136734 76224
11503 76224 -24557 210040 262631 149826 321780 -71157 304564 382612 -84641 -156500 189457
11491 -124421 236948 111559 44929 63008 206762 38840 109012 75993 197471 6129 4589
11480 4589 76562 19224 161859 237164 196497 153342 81589 151152 281335 234175 -6504 196125
11467C51060A02526J7073L64447A35101e1360C88153A05168h2243B67835A16128
11456F37228A69283c1046j49145G8357c6476m5192j28754K11D4352P6685b10772
11444C27711H9354k4919B9932K4043N6033D814J06566A8315c30145G3403a10929
11432A02576J91692C6050R2717c46255C59514B2974J790O9672J42690C1699J81447
11421B13146J45065I4122c62123B6767o348J50391F2554K15792j17292J0850Q6404
11410B58308A02337m9799K40090L6701I6154A6960c958B92272d7413l12630H1697
11398A28793J30580b61152A80481P2032A20845m3121P3905b03780b713B84979
11387a42405A21364M6088L9178p8711b23007Q9687B12859J0741e1124l07023E5635
$$ plain form
11467 351060 102526 119599 484046 135101 -51360 388153 105168 -82243 267835 116128
11456 637228 169283 -31046 -180191 78357 -36476 -81668 -210422 -210211 44352 121037 -210772
11444 327711 89354 64435 29932 53975 110008 4814 111380 18315 -330145 73403 -110929
11432 102576 294268 36050 128767 -346255 359514 22974 24764 94436 237126 31699 213146
11421 213146 358211 94122 -362123 26767 20419 170810 62554 278346 161054 171904 258308
11410 258308 102337 52538 292628 329329 96154 16960 -3958 292272 -47413 -360043 81697
11398 128793 259373 -261152 180481 252513 120845 77724 151629 -203780 -2713 284979
11387 -142405 121364 167452 206630 127919 -223007 -133320 212859 223600 -51124 -358147 55635
11375b7333A23849a32203A43142a99725Q5483G2463J0210b65990A52355m0754
11365A11601d3630D3538a92239M0846P3930B6164a07752m8966b4587B32087g7642
11353G453a55608O8534c2509j94856R4653C61572A04113K6348P750b02228P4843
11342a27385F9603L06075A38541F6277b05394B44428A08941K36459l7442A37984
11331C87829e9974B49494a76950J5832j0826B12363g8020J3282b7668A2509B246
11319a44325k08804B6082c06134a26392m546F1758a50543A92944a58172B31419
11308a34144f0236K2577E0042k1832g5958A61125h381I1351b25725o1446A14089
11296D5025j164a98971A07149J7736a66625B56918b14309g4521F3983c27755A67983
$$ plain form
11375 -27333 123849 -132203 143142 -199725 -114242 72463 82673 -265990 152355 111601
11365 111601 -43630 43538 -192239 -151393 -77463 26164 -107752 -156718 -24587 232087 -77642
11353 7453 -155608 -87074 -32509 -227365 -132712 361572 104113 130461 138211 -202228 -127385
11342 -127385 69603 375678 138541 66277 -205394 244428 108941 345400 307958 137984
11331 387829 -59974 249494 -176950 -161118 -171944 212363 -78020 -64738 -27668 12509 2246
11319 -144325 -353129 26082 -306134 -126392 -130938 61758 -150543 192944 -158172 231419
11308 -134144 -60236 -37659 50042 28210 -75958 161125 -8381 91351 -225725 -287171 114089
11296 45025 43861 -198971 107149 124885 -166625 256918 -214309 -74521 63983 -327755 167983
11284D6124a01744H5337a79221p9575b4222A03135a0158k99971C95454H7609a70750
11272A49369o3282d0934k65787P4826k1320b0913j96928D5625b19977J5424A96770
11260b0194A19718c50567A1670K13880o3690a24816A45369b24037c7932H0503
11249A34794n8117K93727j7976E6130b88144B09039K15105h991n9137k01136a26502
11237A72774b64776f8198D1519r940f7809A37282C5426P2118b05521B72983b43905
11225b25254I3080d66384c607j18980c9582j5930H1002M14932b19796K3065j51430
11214c48161B56241b35088f370j53273k15166a21478A45901a05841C5700J33171
11204A68871a07503j41323j25292d2175a8802j23530C22186c27397a16657k13904
$$ plain form
11284 46124 -101744 85337 -179221 -258796 -24222 103135 -10158 -310129 395454 87609 -170750
11272 149369 86087 -40934 -306721 -231895 -253215 -20913 -217841 45625 -219977 -204553 196770
11260 -20194 119718 -350567 11670 225550 161860 -124816 145369 -224037 -37932 80503
11249 134794 76677 370404 352428 56130 -288144 209039 424144 -8991 -68128 -269264 -126502
11237 172774 -264776 -68198 41519 31579 -67809 137282 35426 107544 -205521 272983 -243905
11225 -225254 93080 -466384 -3607 -122587 -39582 -55512 81002 495934 -219796 -196731 -348161
11214 -348161 256241 -235088 -6370 -159643 -374809 -121478 145901 -105841 35700 168871
11204 168871 -107503 -248826 -374118 -42175 -18802 -142332 322186 -327397 -116657 -330561
11194c30561A48196a09367L0989E7512j7732a36043H7518d9192l7104a9960e101
11182a69064a3591n3654A99521f4603E029J06703i3373B09784a349C29848j48071
11171A81777d8559A308R272L56559C4283e7494j21959f8048l0558j75266I5803
11159E3259a64407A13418e1059G5600c32038g6296m5900k3845O0226C02648j03727
11148A98921a04514B67926c41273E8399c32373G5185h4813j51156A53151c24479
11137D1724a7954A29499J6421O8298p375E0749d14437A14349L4643a03352C09324
11125B05771L2703a69129d7530B64671C5008K24700O5374m7708a76542I0999f6087
11113G3145b0404D7060a7463r9505C09463a90152E7498R6358a14492B58707A08605
$$ plain form
11194 -330561 148196 -109367 -78378 57512 39780 -136043 87518 -49192 -86296 -19960 -5101
11182 -169064 -13591 -67245 199521 -64603 5029 111732 -93373 209784 -1349 329848 181777
11171 181777 -48559 1308 10580 367139 34283 -57494 -179453 -68048 -98606 -273872 95803
11159 53259 -164407 113418 -51059 75600 -332038 -76296 -122196 -146041 -85815 302648 198921
11148 198921 -104514 267926 -341273 58399 -332373 75185 -84813 -235969 153151 -324479
11137 41724 -17954 129499 145920 214218 206843 50749 -414437 114349 148992 -103352 309324
11125 205771 238474 -169129 -47530 264671 35008 259708 325082 277374 -176542 90999 -66087
11113 73145 -20404 47060 -17463 -116968 309463 -190152 57498 153856 -114492 258707 108605
11101f2291D5905a06317A41307J6670a04187A12920J92141j07401b5109F63N9215
11090E9878L14282A78892M0154f8981b617p2166B34251E2327g5278A37178L37454
11079D74632a08932I3473K29315J37028j96841l3499J70647A63805k9107K53867
11069C88565J4172D5474J09045p6833M4378K38831j73331K67977r8079K62125
11059F19587o3081p4446l2910K16817K30157o353J94123k59090j78672P8084k61911
11048D62305n6154M20668l64974J91285j20176L08877l95746L06329j26220k56134
11038C70060K57255J65054B73494O05881k69542p2818J81300j32067j51160K69747
11028G04835o0856J46334p3837j0686K46160j84758j85849K20623j49900R0453
$$ plain form
11101 -62291 45905 -106317 141307 157977 -104187 112920 305061 197660 -25109 663 59878
11090 59878 374160 178892 219046 -68981 -2617 -74783 234251 52327 -75278 137178 474632
11079 474632 -108932 93473 322788 459816 262975 229476 400123 163805 134698 388565
11069 388565 402737 45474 154519 77686 122064 360895 187564 455541 357462 619587
11059 619587 556506 482060 449150 665967 896124 889771 1083894 824804 646132 724216 462305
11048 462305 406151 826819 461845 653130 532954 841831 446085 752414 626194 370060
11038 370060 627315 792369 273494 879375 609833 537015 718315 586248 435088 704835
11028 704835 643979 790313 716476 705790 951950 767192 581343 801966 652066 742519
11018G42519J76782j74382j95034L1483M1592r2432j32417L78458k1339k92858
11008D62372J8141J83005k0822o8895j41524K80965K09386l06995r5776K29524
10998G49381O3122j68654q1960M19327m61031O5878N50123k85180L3465k70432
10988F14039L58142O2403k6184L4296j34182K53346m2488r1089J54440M24987
10978A607710l47306J79529K63295N12936k55518K05779J02328J60277k33086
10969B195944J91771j12199O7713j92571m96751L6289N8787j41459j90802J56347
10959A573069q3919O033N139L9706p9035K74402j98424k13787p5704k79686k38044
10948G29750Q3007k11439k30888L62752C13232J14271J01716o1103j11134I7242
$$ plain form
11018 742519 919301 744919 549885 581368 622960 530528 398111 776569 755230 462372
11008 462372 480513 663518 642696 573801 432277 713242 922628 615633 519857 749381
10998 749381 812503 643849 561889 981216 520185 586063 1136186 851006 884471 614039
10988 614039 972181 1034584 1008400 1042696 908514 1161860 1119372 1028283 1182723 1607710
10978 1607710 1260404 1439933 1703228 2216164 1960646 2166425 2268753 2429030 2195944
10969 2195944 2387715 2275516 2343229 2150658 1653907 1690196 1748983 1607524 1416722 1573069
10959 1573069 1489150 1495183 1500322 1540028 1460993 1735395 1536971 1323184 1247480 967794 729750
10948 729750 812757 601318 370430 733182 313232 427503 529219 468116 356982 97242
10937A45540J7706O0257J58695H0392J87294j25091J71149F3622b16423B85600
10926C6789L2176J07421g3498F9421J11091b45846c050A18788n8339R2688A2189
10914E3534b38100A27222a36065H8908c01343C40084f5394m62711D88318b04913
10903a59137e2474E857f6833j76234A85697b26622A66370N0649a098j50863N1274
10892a00687A10062B7132a61739F4021c9092A70489B8493i7257c2147D8415K0979
10881F9394O4639l1070K37886b24804A0050R5400R6008a62048O9781I9811i9114
10869A94728f8326I5301f9246k07645B00924l7968a3984A08117h8175B89684a09471
10857f4755B50660A02603a82432A6570K4284D477J25386b94133a35036k90372
$$ plain form
10937 145540 163246 223503 382198 80392 267686 142595 313744 63622 -216423 285600
10926 36789 68965 176386 -73498 69421 180512 -245846 -3050 118788 60449 153137 12189
10914 53534 -238100 127222 -136065 88908 -301343 340084 -65394 -528105 488318 -204913
10903 -159137 -52474 5857 -66833 -243067 185697 -226622 166370 217019 -1098 -151961 -100687
10892 -100687 110062 27132 -161739 64021 -39092 170489 28493 -97257 -32147 48415 69394
10881 69394 134033 102963 340849 -224804 10050 105450 201458 -162048 -92267 99811 -99114
10869 194728 -68326 95301 -69246 -276891 200924 162956 -13984 108117 -88175 289684 -109471
10857 -64755 250660 102603 -182432 16570 40854 4477 129863 -294133 -135036 -425408
10847d25408b12259d4111I5369J28203a5932I6561c54273A4738a99879e1786j19157
10836a70943c2768j21840d0220C05133a41595J7971F412Q4286c41487a59867B40815
10824E3706a64403A12514e33699C4693m347a19091o6769A64296d59144b26858
10813a23208G1198O14b23403g6585E2620b01770A95456a32643N2404A82318B4207
10801A36847d3487G9930g9619A70436K38199h5808C14464f5628A072J34129b20950
10789D3849a45742A91876b51466c5484j4772a6866B40304a34389L5382c393F5623
10777a97054l13690A17623Q1602c24555B08910h3399a4700j07989G4462d39785
10766a19624B62727A0357J00062a75929A41409c48700a26406e9792A94287a82901
$$ plain form
10847 -425408 -212259 -44111 95369 223572 -15932 96561 -354273 14738 -199879 -51786 -170943
10836 -170943 -32768 -154608 -40220 305133 -141595 -123624 6412 90698 -341487 -159867 240815
10824 53706 -164403 112514 -533699 34693 30346 -119091 -185860 164296 -459144 -226858
10813 -123208 71198 71812 -223403 -76585 52620 -201770 195456 -132643 -80239 182318 24207
10801 136847 -43487 79930 -79619 170436 408635 -85808 314464 -65628 1072 135201 -220950
10789 43849 -145742 191876 -251466 -35484 -50256 -16866 240304 -134389 -99007 -3393 65623
10777 -197054 -510744 117623 199225 -324555 208910 -83399 -14700 -122689 74462 -439785
10766 -119624 262727 10357 110419 -175929 141409 -348700 -126406 -59792 194287 -182901
10755c71942a8638j63692A28674J19557c00774c0203j34450C30860R3929b72034
10744A14495a4037F0101a62026j18995J02142b4375A24288a94105L1657o0645
10734b23093A70186D6683h911l60682a41063n6662B8794J43026a10589d3012j05380
10723a48392P2090k59422a12149E0362M5876c24336A57470e7888k40010B28733
10712H4468a45892H5777g8412D7843L9978a41432C777a09627A40383H078h7916
10700a04112A02889a8875j76413O5615j44423r2738D1368A0297J50693m5288J1093
10689A26795a09085j6526K1352M7957B2597J64270c36813A25779d32921D4941
10678c62050E9799a18466l50907g8869I0333K22438a11622j55336J10893j72582
$$ plain form
10755 -371942 -18638 -182330 128674 248231 -300774 -30203 -164653 330860 424789 -272034
10744 114495 -14037 60101 -162026 -281021 -178879 -24375 124288 -194105 -162448 -223093
10734 -223093 170186 46683 -8911 -369593 -141063 -197725 28794 171820 -110589 -43012 -148392
10723 -148392 -76302 -335724 -112149 50362 96238 -324336 157470 -57888 -297898 228733
10712 84468 -145892 85777 -78412 47843 87821 -141432 3777 -109627 140383 8078 -87916
10700 -104112 102889 -18875 -195288 -129673 -274096 -366834 41368 10297 160990 115702 126795
10689 126795 -109085 -125611 -104259 -56302 22597 186867 -336813 125779 -432921 44941
10678 -362050 59799 -118466 -469373 -78869 90333 312771 -111622 -266958 -156065 -328647
10668c28647P5245a17021D41a84550c2837B2571i81n8858j1975j8170K7256q908
10656g1636k8336m7161j39290f6653A33106g3473I3801a34662H5524b79317B05418
10644c05809A82474g8973o8241A75104a34998o5123D4313J5613f2151A8429e8613
10632b6399Q571A84590a98791B22603d4C49936b4098E000K8019b60281H3618a14058
10619A33622a70441p7636n3636A8693g4632j35542l9542a12006E165c6905B3131
10607b1134n6515A57809a28352k91202e8727a2744E252e1125k07677e7768A04963
10595a40563D87436k33493A3439R4474b07089f0317R531j40731A92028c4072j47276
10584a81348K5532c5487j1096D4894b32785H5528b48895b4923k41395P6010C27817
$$ plain form
10668 -328647 -253402 -117021 441 -184550 -32837 22571 -981 -59839 -71814 -89984 -62728 -71636
10656 -71636 -99972 -147133 -286423 -66653 133106 -73473 93801 -134662 85524 -279317 205418
10644 -305809 182474 -78973 -147214 175104 -134998 -200121 44313 59926 -62151 18429 -58613
10632 -26399 -17828 184590 -198791 222603 -44 349936 -24098 5000 33019 -260281 83618 -114058
10619 133622 -170441 -248077 -301713 18693 -74632 -210174 -249716 -112006 5165 -36905 23131
10607 -21134 -77649 157809 -128352 -419554 -58727 -12744 5252 -51125 -258802 -57768 104963
10595 -140563 487436 253943 13439 107913 -207089 -60317 -50786 -191517 192028 -34072 -181348
10584 -181348 -155816 -35487 -46583 44894 -232785 85528 -248895 -24923 -266318 -190308 327817
10572a07432n2216f3158b8445H4848d74236a13049C81886m4140B9674a82356A29945
10560a21471b3290n0653j98969A30341k4229b07238B81517A9714c64466E0535
10549C48707B2246a62696f2632A6166a68569k06942a34847A37757j7965h4241
10538c75896A82437n9164l5219c18723g1045E1415a91521l36624d917B31909H8281
10526E3393a4957k98745B285a72393c460j3997n7635A41935n554Q0695b44673
10514b5807i078A50083f8692F6356b14768A02377l118a50847A99065C0781b67935
10502A1891J36957a87969D10697e3689j63954C41827A23620e3532C2209j2788
10492A9421h8204c7751G7848J43703D760d9400B7082b9911C06212K0876J11619
$$ plain form
10572 -107432 -159648 -63158 -28445 84848 -474236 -113049 381886 337746 29674 -182356 129945
10560 -121471 -23290 -73943 -272912 130341 106112 -207238 281517 19714 -364466 50535
10549 348707 22246 -162696 -62632 16166 -168569 -375511 -134847 137757 119792 -84241
10538 -375896 182437 123273 88054 -318723 -71045 51415 -191521 -528145 -4917 231909 88281
10526 53393 -14957 -313702 2285 -172393 -3460 -17457 -75092 141935 136381 217076 -244673
10514 -25807 -9078 150083 -68692 66356 -214768 102377 99259 -150847 199065 30781 -267935
10502 11891 148848 -187969 410697 -53689 -217643 341827 123620 -53532 32209 19421
10492 19421 -88204 -37751 77848 221551 4760 -49400 27082 -29911 306212 327088 438707
10481D38707B15108L6126M17517A38516P4050H3875J84535r4730j2263Q2250g7918
10469b18031l7861C09246F5434a83353F9956d63576A77616c57624h2711L9517
10459d3194B0233g0921j2593B2959J4505J00477a43969A68678c2446C3297a81169
10447a24182g77A1550c5165A60374F2333i2786A37218b98969q3241c009l85303
10436c88312H942d12832a60594g0253H8414j476j7541a11487A15360J33546D1775
10424a06296A83171c8098G6729K7812a94995e7993B57215j8872B8201N6796N4686
10413A39683B4056h9190d2517l3903l63540i305l82270a57977g5769A3708c35688
10401c09515J17909j7625B06673a47899B38551D4525B0301h1453k0034M6878D80486
$$ plain form
10481 438707 215108 251234 668751 138516 212566 83875 268410 173680 161417 243667 -77918
10469 -218031 -255892 309246 65434 -183353 69956 -463576 177616 -357624 -82711 -43194
10459 -43194 20233 -70921 -83514 22959 37464 137941 -143969 168678 -32446 33297 -181169
10447 -124182 -777 11550 -35165 160374 62333 -92786 137218 -298969 -382210 -3009 -388312
10436 -388312 8942 -412832 -160594 -70253 88414 86938 69397 -111487 115360 248906 41775
10424 -106296 183171 -38098 76729 104541 -194995 -57993 257215 238343 28201 84997 139683
10413 139683 24056 -89190 -42517 -76420 -439960 -9305 -391575 -157977 -75769 13708 -335688
10401 -309515 -191606 -209231 206673 -147899 238551 44525 20301 -81453 -101487 -54609 480486
10389B75070E4665N117a97866h0105B87281j9666E9111A6298J05692E1537J79497
10378B31034H8356b15487B65687D9998b07250A51465J3483K91903A06887J01830
10368B08717K43905J77302B52534j0015Q1031k9563m6087k371Q7787A15611l9151
10357G6460R2704N1716O9098G2454J81584O9323M2622M5672N2096A40424M37933
10346E78357B29779K37767m7293j25962J95992k23274J41113a82285D72578B11678
10335g5494A4160f3491B21668c5168A80386M9105J54523j80552G8382f8408G5595
10323A32822J15743R3903A57484C4973J15653J37788q1711F5528j7984J99658
10313B47202n5183k2468o5039J84024d383A17317A5513N301a61369D26362a1501
$$ plain form
10389 275070 54665 59782 -197866 -80105 287281 267615 59111 16298 121990 51537 231034
10378 231034 88356 -215487 265687 49998 -207250 151465 164948 456851 106887 208717
10368 208717 452622 629924 252534 242519 323550 293987 247900 245529 333316 115611 76460
10357 76460 169164 220880 289978 72454 254038 323361 365983 411655 463751 140424 578357
10346 578357 229779 467546 420253 294291 490283 267009 408122 -182285 472578 211678
10335 -75494 14160 -63491 221668 -35168 180386 229491 384014 203462 78382 -68408 75595
10323 132822 248565 342468 157484 34973 150626 288414 206703 65528 47544 247202
10313 247202 192019 169551 104512 288536 -4383 117317 15513 20814 -161369 426362 -11501
10301A26469J06511A12025a55649N5838A29049e373q48A21327J16656f1679m49682
10290e11361B21213b55610r4033E8960b2530o9680j34927P6267F3868c7270R418
10279b7852k32609c999k8510A90050o4466i4994j8624B4833b27296F1015a06858
10267I3339a05758F1737Q2013J32045a57027D7126h0617A48422o5340J39687H2783
10255B75361B2020i2750B14470A641d6979A58802i240k70728g414k30498P5020
10244a62892L6356o7327k3284A4332e5351o5812A45615b89584A05557R492a18681
10232f86H2279d0369C3149J36192a67057H1947c55857h235C29746i3582G7720
10220A57879E3017d06813J97506j19626c9202E9570L8721g2110Q569R675C08230
$$ plain form
10301 126469 232980 112025 -155649 -99811 129049 -5373 -6221 121327 237983 -61679 -511361
10290 -511361 221213 -255610 -349643 58960 -22530 -92210 -227137 -150870 63868 -37270 -27852
10279 -27852 -260461 -3999 -32509 190050 125584 -94994 -113618 24833 -227296 61015 -106858
10267 93339 -105758 61737 143750 275795 -157027 47126 -80617 148422 83082 222769 82783
10255 275361 22020 -92750 214470 1641 -46979 158802 -9240 -279968 -7414 -237912 -162892
10244 -162892 -126536 -193863 -217147 14332 -55351 -121163 145615 -289584 105557 115049 -118681
10232 -686 82279 -40369 33149 169341 -167057 81947 -355857 -8235 329746 -93582 77720
10220 157879 53017 -406813 -209307 -328933 -39202 59570 98291 -72110 -63541 -53866 308230
10208b53738j7436f0265j60044B41196a10634n8072r3215A18985J9036c18038
10197b08800l648M6867A25069C3303R7459C0081B32a39464O7432q9468P6539K1699
10185f3262A54818b77329G3875p671Q822a36814H7872b27717f4392E0782b77328
10173b16713b5650j34383j36759N1600B54782a56968I923L3908g2514A79537q6670
10162I2867a01199I554d2107A72354e4827n1476a831j31790d6318j75605h189
10150b40228l1885a27636m2906P5374k06404L2640B60325a10169a2568m48163
10140d60731c4360A47367D4368h9105q4946L9003p9343B27500a89494B7312b92151
10128g5805p0707g2426j0928n6968C4425K9843L032a16549k96957B03060a13278
$$ plain form
10208 -253738 -271174 -60265 -220309 241196 -110634 -168706 -261921 118985 138021 -318038
10197 -208800 -212448 -165581 125069 33303 130762 30081 232 -139464 -72032 -161500 -84961 -63262
10185 -63262 154818 -277329 73875 66204 75026 -136814 87872 -227717 -64392 50782 -277328
10173 -216713 -25650 -160033 -296792 -245192 254782 -156968 9923 43831 -72514 179537 92867
10162 92867 -101199 9554 -42107 172354 -54827 -106303 -1831 -133621 -46318 -221923 -8189
10150 -240228 -272113 -127636 -170542 -95168 -301572 -268932 260325 -110169 -12568 -460731
10140 -460731 -34360 147367 44368 -89105 -174051 -135048 -214391 227500 -189494 27312 -292151
10128 -75805 -146512 -72426 -83354 -140322 34425 64268 67300 -116549 -413506 203060 -113278
10116i4825J468p0975I254L5576b71122j64537I6218a01946a6890A02340a49061
10104b0697j20732A7725b89187o2622a28856H6147a7899k16939B21455G6199M8947
10093A25146A9323Q4919n111M9925j2936g1611A80887A3337K35605a08577l9641
10082a48218C6114A0489e9609k63634O3523G6937J07324h3764a097o7545C6203
10070d1573A47746n4899b30595B4539P5270J77766A1042b78729I9468i498k8422
10059c7920R40k16842A73302d9404G0478b06926j98583J99360K5683g3491I0140
10047a85836P7066b5689j4704E054c25526a24291N5578j68255l2249I3565d95300
10035a71507a2727j74536a7226j43357n38987B05932C2541J35619p7302c92667
$$ plain form
10116 -94825 -93357 -164332 9254 44830 -271122 -435659 96218 -101946 -16890 102340 -149061
10104 -20697 -141429 17725 -289187 -351809 -128856 86147 -17899 -234838 221455 76199 125146
10093 125146 19323 104242 99131 149056 136120 -71611 180887 13337 248942 -108577 -148218
10082 -148218 36114 10489 -59609 -323243 -259720 76937 184261 -83764 -1097 -68642 36203
10070 -41573 147746 92847 -230595 24539 99809 277575 11042 -278729 99468 -9498 -37920
10059 -37920 -36980 -253822 173302 -49404 70478 -206926 -405509 -206149 -180466 -73491 90140
10047 -185836 -108770 -25689 -40393 5054 -325526 -124291 -68713 -236968 -269217 93565 -495300
10035 -171507 -12727 -187263 -17226 -160583 -699570 205932 32541 168160 90858 -392667
10024c0635F1415a42807A98662c07487P1859B13487e328m05562H9761M3896b20192
10012B68631b4987C1920b17426O4353M1896L709B32439a16028j2853k73459A31389
10000A42835a95342n3931g2397A69185c04204K906D5307H008a23457G354a72689
9988a00027o3693g6626E6323a97064B40478l4515a80677A22761l0688M0343d3833
9976E2100b63257F9549b9833B1201c3994k30067B23900a32961A20161c35341B54648
9964b50157A44617a23651b1073l6101k6084D1770d20847L6329A99140a75201h2173
9952C4393J79779Q6743n5205c32759E2237a64564O203e7155A69116O2299a00998
9940c1659j48811H675J0621J75307a61669b8613l5077A31786b6758a1432o9009
$$ plain form
10024 -30635 61415 -142807 198662 -307487 -235628 213487 -5328 -410890 89761 133657 -220192
10012 268631 -24987 31920 -217426 -153073 -111177 -107468 232439 -116028 -128881 -402340 131389
10000 142835 -195342 -249273 -72397 169185 -304204 -301298 45307 8008 -123457 7354 -172689
9988 -100027 -163720 -76626 56323 -197064 240478 205963 -180677 122761 92073 132416 -43833
9976 52100 -263257 69549 -29833 21201 -33994 -264061 223900 -132961 120161 -335341 254648
9964 -250157 144617 -123651 -21073 -57174 -83258 41770 -420847 -384518 199140 -175201 -82173
9952 34393 214172 300915 245710 -332759 52237 -164564 -158361 -57155 169116 231415 -100998
9940 -31659 -180470 8675 19296 194603 -161669 -28613 -63690 131786 -26758 -11432 -80441
9929h0441I845b3753k37003Q1179h8205D4596a69460A59558g4717J7939j17872
9918a74650J2282B47719i2688k4485B67763q6793f7407m01036g4368J5394l29248
9907c88222a00954b603k54178D6928c63647A10710b82831C38356A45704J71408
9897C17112C130f2996j43023P75H9853a52014P2311c6533l6821r5728j54355B6717
9884a48653O3717k14800r745f7034l4904H8817a24656j77609A5398a11970E0850
9872a25984C6247K6975b51301E8511f5558A675M0399Q6167i0362D8358B4049J8737
9860D2786i3153J7469k2740p2598A16283B699J96401b18774G310O5023b2321B61726
9847a01684k19110A11305B3570J18571e14654A60926i9872p1363l7032P6039B29014
$$ plain form
9929 -80441 9845 -23753 -260756 -179577 -88205 44596 -169460 159558 -74717 -56778 -174650
9918 -174650 -162368 247719 -92688 -117173 267763 180970 -67407 -468443 -74368 -58974 -388222
9907 -388222 -100954 -2603 -256781 46928 -363647 110710 -282831 338356 145704 317112
9897 317112 3130 -62996 -206019 -205244 89853 -152014 -79703 -36533 -73354 -169082 -323437 26717
9884 -148653 -84936 -299736 -309481 -67034 -101938 88817 -124656 -302265 15398 -111970 50850
9872 -125984 36247 63222 -251301 58511 -65558 1675 42074 128241 -90362 48358 24049 42786
9860 42786 -93153 -75684 -98424 -171022 116283 2699 199100 -218774 7310 72333 -22321 261726
9847 -101684 -320794 111305 23570 142141 -514654 160926 -99872 -171235 -208267 -132228 229014
9835a3606j54191P6541j99944F9343c3008l6337A54885d9557r4675A9484J21589
9824A41073e9588b6081k3743k324m1131G9555P4197c02004h1858m6704j55003
9813b83565M5318O4436D9889a24629j63405A54911a54785c2345k22973A98326
9802b05204h0235E1801J23375c71733C2354a42612d2179j16146P1845r3179L8562
9791a41097L3973p710A40987c76926C1676M6503O0833L2922K7037H8529e56585
9779d7288p3907A00930a313E9289b15324K5795Q3074J3005A11001Q2206A745J48703
9767A50448p2094b37977h9823A23640b12527M5371M723g3535a6151o563A1374
9755A44050i439k04129J5440N9324D3751a9187B25977c63570D1032d26159K02441
$$ plain form
9835 -13606 -167797 -91256 -291200 69343 -33008 -69345 154885 -49557 -144232 19484 141073
9824 141073 -59588 -26081 -49824 -52148 -93279 79555 153752 -302004 -81858 -128562 -283565
9813 -283565 -238247 -173811 49889 -124629 -288034 154911 -154785 -32345 -255318 198326
9802 -205204 -80235 51801 175176 -371733 32354 -142612 -42179 -158325 -86480 -179659 -141097
9791 -141097 -107124 -114834 140987 -376926 31676 78179 139012 171934 198971 88529 -556585
9779 -47288 -121195 100930 -1313 59289 -215324 -189529 -106455 -93450 111001 193207 1745 150448
9767 150448 78354 -237977 -89823 123640 -212527 -167156 -162433 -73535 -16151 -22714 11374
9755 144050 -9439 -213568 -198128 -138804 43751 -19187 225977 -363570 41032 -426159 -223718
9744b23718I55b3494A2404O9347a21313e9851o9062k18662J28729A64113a82766
9732c0788j26500c2915j41112B2022a09647n8502A86943a30493C3234a66085g9688
9720d4722o8986o3460l3396I8150a39191b2318k50880d8128A43326J97558I6090
9708b07027A27734D9815A7338L62597g9500k95195g9608j35286j11161a10756
9697a76779E0858e8766l05927b8918l0559k614E3560h8575n7506e214k8464A26110
9684b22761R6374b5081C58616b09673A08961c05748A17039d97398a25415j06358
9674b31773A69876A1080a70865e5967B7848a33074F9256b31931i5442j69753A5357
9662B7725e1680j77473A93605d4394B7643a55744q6260d4100D174J57050b60603
$$ plain form
9744 -223718 955 -23494 12404 81751 -121313 -59851 -128913 -347575 -218846 164113 -182766
9732 -30788 -157288 -32915 -174027 22022 -109647 -168149 186943 -130493 33234 -166085 -79688
9720 -44722 -113708 -177168 -210564 98150 -139191 -22318 -273198 -48128 143326 340884 96090
9708 -207027 127734 49815 17338 379935 -79500 -374695 -79608 -214894 -326055 -110756
9697 -176779 50858 -58766 -364693 -28918 -59477 -62091 53560 -88575 -146081 -5214 -33678 126110
9684 -222761 -126387 -25081 358616 -209673 108961 -305748 117039 -497398 -125415 -231773
9674 -231773 169876 11080 -170865 -55967 27848 -133074 69256 -231931 -95442 -265195 15357
9662 27725 -51680 -229153 193605 -44394 27643 -155744 -242004 -44100 4174 161224 -260603
9650E7782b76938A00167c36615H1046c97831J08777R1937D4314i9500d7810A26098
9638a83486E9301a10933b3894l73134d8247j1395b9553A45152g7462q0879l3018
9627a91359O5338E1823b06345q4242h9140A00216c67202G9228i1474L5187a0661
9615b47248k718G2691Q5084e3680k44046i6886F6712J33005a89678I2092J51669
9604B43761a91675A89145d0327j31534A9097g5481c3223j88426I0645b00199k2671
9593b22870i6012A32861C9179a69903P3838k17776A54709E7498J88528D5912f0008
9581A70108d7310A32215c33757O0224C7216b08862i2515D3212K85320A42375d1442
9569A6145c49958i1935j142a1718j05506p9699G6517a3342l70566B74967c94209
$$ plain form
9650 57782 -276938 100167 -336615 81046 -397831 -289054 -197117 44314 -99500 -47810 126098
9638 -183486 59301 -110933 -23894 -397028 -48247 -59642 -29553 145152 -77462 -158341 -191359
9627 -191359 -126021 51823 -206345 -290587 -89140 100216 -367202 79228 -91474 -56287 -10661
9615 -247248 -249966 72691 157775 -53680 -297726 -96886 66712 199717 -189678 92092 243761
9604 243761 -191675 189145 -40327 -171861 19097 -75481 -33223 -221649 90645 -200199 -222870
9593 -222870 -96012 132861 39179 -169903 -96065 -313841 154709 57498 246026 45912 -60008
9581 170108 -47310 132215 -333757 -273533 37216 -208862 -92515 43212 328532 142375 -41442
9569 16145 -349958 -91935 -93077 -11718 -117224 -196923 76517 -13342 -383908 274967 -394209
9557C0023b4336o2187k04317o4292h4050q0992k1756H2091f120k3571I420J65261
9545A74681a93008A60709K1955b09224h1624B0420a47559A15717b4100k22254
9535b46354b2584B8065b69197g1209d987k44850A45370b63147g6242A25246c77359
9523c41809k3577h4826k0411l4675j259M9239k22169A82704b92585A29847a67426
9511B40867a81142a3940E1704J47103a2265I6628d61309g3986K4038B84748c9841
9499a00051o1785L5786j06657m603a7008A29619m3048J926d73343J87121A29033
9487c7599I3227L6877b08463k13642E7718a31833j55286a31683m2775G9605J73619
9476B53224b08880G4603d8044k19180d823p17A13105a69474A22706a66448B64525
$$ plain form
9557 30023 -24336 -86523 -290840 -355132 -84050 -165042 -186798 82091 -6120 -29691 9420 174681
9545 174681 -193008 160709 182664 -209224 -81624 20420 -147559 115717 -24100 -246354
9535 -246354 -22584 28065 -269197 -71209 -4987 -249837 145370 -263147 -76242 125246 -377359
9523 -341809 -365386 -84826 -105237 -139912 -141171 -91932 -314101 182704 -292585 129847 -167426
9511 240867 -181142 -13940 51704 198807 -12265 96628 -461309 -73986 -49948 284748 -39841
9499 -100051 -161836 -126050 -232707 -237310 -17008 129619 86571 88497 -473343 -286222 129033
9487 -37599 93227 130104 -208463 -422105 57718 -131833 -287119 -131683 -174458 79605 253224
9476 253224 -208880 74603 -48044 -267224 -4823 -5540 113105 -169474 122706 -166448 264525
9464I2938J1732B1183a62181P8900I0126a37071j97144d1019E2231d23533C3727
9452c3650j26245c6637J5487o0141D3186N6799d8145q994l3021k0499B6144L45954
9440C72098A80997a43318q4955a5802j2672n0564I8043C4377a606A00007d5920
9428A00305a29167B2238a48101p6228A13354a33181B6033a22564a9152m43944
9418d63096B5035b25419d2865k22567R1760D610J27390Q1894K7654c64806J18429
9407b46377A3768J38490b74A60237d4758l19925J02465f1151m7656A50381g1678
9395D0551d7492k6812A32770J51553e3794j61461f4159m5957B63298E5073A2213
9383e8625k9988l2775d0372A34739R0738c09922j29029A04594a73442j27360J19945
$$ plain form
9464 92938 104670 21183 -162181 -83281 90126 -137071 -334215 -41019 52231 -423533 33727
9452 -33650 -159895 -36637 -21150 -81291 43186 99985 -48145 -57139 -90160 -110659 26144 372098
9440 372098 180997 -143318 -228273 -15802 -28474 -79038 98043 34377 -1606 100007 -45920
9428 100305 -129167 22238 -148101 -224329 113354 -133181 26033 -122564 -19152 -463096
9418 -463096 25035 -225419 -42865 -265432 -173672 4610 132000 213894 241548 -364806 -246377
9407 -246377 13768 152258 -274 160237 -44758 -364683 -262218 -61151 -108807 150381 -71678
9395 40551 -47492 -74304 132770 284323 -53794 -215255 -64159 -110116 263298 55073 12213
9383 -58625 -88613 -121388 -40372 134739 225477 -309922 -438951 104594 -173442 -300802 -180857
9372a80857a4740k21555H6586B3406b48402j04090i7420B23003a04691m55840
9362e60531b3427A88068c847l03959A56794j438b04366d3454p6556K6822d552
9350A59309i1223k54134J58228Q7868A77544f9921B27234j07581R1844A00042
9339a18801J2203A75811d87547g2373I9668e1548I5712c12092J19631A03430b32842
9327d199A78725F2692a12293O415A64422b40951f2296n8967c8510B7717L0402
9316E8119Q9573a44368K8932d041A99950b07221B2497h0228A54268i9133L4162
9305f4971K9240q8066n6363o8476C6626Q6916b77851I4378m5878g5288j39448
9294b14736M3911L7776k62228J78400C5434b70465A51760a49119B05671c02656
$$ plain form
9372 -180857 -14740 -236295 86586 23406 -248402 -352492 -97420 223003 -104691 -560531
9362 -560531 -23427 188068 -3847 -307806 156794 155356 -204366 -43454 -120010 -93188 -4552
9350 159309 -91223 -345357 -187129 -99261 177544 -69921 227234 119653 211497 100042
9339 -118801 -106598 175811 -487547 -72373 99668 -51548 95712 -312092 -192461 103430 -232842
9327 -4199 178725 62692 -112293 -105878 164422 -240951 -62296 -121263 -38510 27717 58119
9316 58119 147692 -144368 -115436 -4041 199950 -207221 22497 -80228 154268 -99133 -64971
9305 -64971 -35731 -123797 -180160 -248636 36626 123542 -277851 94378 48500 -75288 -214736
9294 -214736 -170825 -133049 -395277 -216877 35434 -270465 151760 -149119 205671 -302656
9283H0038P5590b00407A98037a70635B09604G7672b78154P2434A86236e0649a4502
9271a07983C8361e0922p3576C00570i1221I1493K4515J43546f0260k10170k7153
9260b97583I7604a36396B1247c83024R7613g5304n0903r9208J2327L2099O9091
9249a11898F3351M2531B9445J0946J69764E6883b11619C26680b49812B34466a28575
9237b11502R5208N0264F4083a85146e0454C55267j61937a1693n4077E56556A07910
9225a72233e8445A27863f1791j43304f4487q5209q8283F7696J30873a91244j40929
9214c32173B6247e9268m1093A15191c32628J60735e1907K3144j6241G3184L4882
9203A08066h0288j11996G9231b881H3590b85345b7363A9583i2749C894a88752
$$ plain form
9283 80038 155628 -200407 198037 -170635 209604 77672 -278154 -205720 186236 -50649 -14502
9271 -107983 38361 -50922 -124498 300570 -91221 91493 116008 259554 -60260 -270430 -297583
9260 -297583 97604 -136396 21247 -383024 -285411 -75304 -126207 -225415 -213088 -180989 -111898
9249 -111898 63351 105882 29445 40391 210155 56883 -211619 326680 -249812 234466 -128575
9237 -211502 -116294 -66030 64083 -185146 -50454 355267 193330 -11693 -65770 556556 107910
9225 -172233 -58445 127863 -61791 -205095 -64487 -149696 -237979 67696 198569 -191244 -332173
9214 -332173 26247 -59268 -100361 115191 -332628 -171893 -51907 -28763 -45004 73184 108066
9203 108066 -80288 -192284 79231 -2881 83590 -285345 -27363 19583 -92749 3894 -188752
9191D5912K2193a02477B00791b11548j77993J89221i9127J8028A01080b2353n5749
9180g8102D00552a83584o790K8960F5773b49150B13292a03056j38341f5352K4266
9169d1086k69456Q6317j95412B97030F7288h3373k5293I8816a39981n3828d5433
9157b44150c4447D504b13780Q8803N3197J8921D6863f9307j06690H6070a22896
9145C5566d36255a67399L2711e4901A91735d0986C8349b16309C6782a22991N6212
9134f6779b7873A22728k1724b14407j703B4149R3921J2567k8931R3703a58229
9122b46369c9358I8666c5164B48950A23251p726J73850A39211B3267a25021c564
9110c10071J4337A49686E1888a63966R497m2403A60927a35767n615c0900l1467
$$ plain form
9191 45912 68105 -102477 200791 -211548 -389541 -200320 -99127 -81099 101080 -22353 -78102
9180 -78102 400552 -183584 -190374 -161414 65773 -249150 213292 -103056 -241397 -65352 -41086
9169 -41086 -310542 -224225 -419637 297030 67288 -83373 -108666 98816 -139981 -193809 -45433
9157 -244150 -34447 4504 -213780 -124977 -71780 -52859 46863 -69307 -175997 86070 -122896
9145 35566 -436255 -167399 -134688 -54901 191735 -40986 38349 -216309 36782 -122991 -66779
9134 -66779 -27873 122728 101004 -214407 -216110 24149 118070 130637 101706 195409 -158229
9122 -246369 -39358 98666 -35164 248950 123251 115525 289375 139211 23267 -125021 -3564
9110 -310071 -295734 149686 51888 -163966 -154469 -196872 160927 -135767 -141382 -30900 -62367
9099f2367j02646F1616B5066b92745L6982j55406B01964b51677A59680g6078J3258
9088f2820A56599C3016L3172d39126a62011N3582i55C7068c43893Q1499g3913
9076A53640d2888C4060c9331o4996j4753A14946a73910A05049J69509H6741B504
9064a39234F8161E175K57330a6410l3855j7497b4896A79765i9507M2626B5801
9052f8944j211J2637o024E9141b14994E9437c18028B01149a17602B96239b21506
9040C1380c83964B60494a73921h2576L1365k99660I6278N3316B1769R1106c9746
9028A03804j5592c385A3246c94814A57564a54315d9387j00524C8183a67136k12453
9017c79589B23770J04896A54087b57227A37828O8543A5809N347a68329m8493O6931
$$ plain form
9099 -62367 -165013 61616 25066 -292745 -255763 -411169 201964 -251677 159680 -76078 -62820
9088 -62820 156599 33016 66188 -439126 -162011 -108429 -955 37068 -343893 -262394 -73913
9076 153640 -42888 34060 -39331 -104327 -119080 114946 -173910 105049 274558 86741 2504
9064 -139234 68161 5175 262505 -16410 -50265 -67762 -24896 179765 -99507 -56881 25801
9052 -68944 -70155 -57518 -63542 59141 -214994 59437 -318028 201149 -117602 296239 -221506
9040 31380 -383964 260494 -173921 -82576 -51211 -350871 96278 149594 21769 112875 -39746
9028 103804 88212 -3385 13246 -394814 157564 -154315 -49387 -149911 38183 -167136 -379589
9017 -379589 223770 328666 154087 -257227 137828 206371 15809 21156 -168329 -216822 -149891
9006a49891d6186k4471E1460b32017l9611i8689j68581A07653K37627B3995b05761
8994a80222n5971E9450a86223B5353b11840C7717h2998o6397A3946a37367q8367
8983b25734o7715P7874C2297K9193c5862k31780a00254k1316c7115B44664a5611
8971B54412b59856J19077d1183l00458D0247c79830C23530B489a5768H3911B6927
8959B39203k8398b6581j96608J08858A59736b47740J11853A5723g7324I5339c32800
8947g6777j6988M3692j64702D97K11579a90997K4315O0692A92215l445H6893K06532
8935B93425A36783K9002L53926i9366C78262e8841C33848m9865l4352K66183N04620
8924A020434L34379J318078K946349K167963C434913A308170n54137k80949L72319
$$ plain form
9006 -149891 -46186 -70657 51460 -232017 -271628 -98689 -267270 107653 345280 23995 -205761
8994 -180222 -236193 59450 -186223 25353 -211840 37717 -82998 -149395 13946 -137367 -225734
8983 -225734 -293449 -215575 32297 61490 -35862 -267642 -100254 -121570 -37115 244664 -15611
8971 254412 -259856 -140779 -41183 -341641 40247 -379830 323530 2489 -15768 83911 26927
8959 239203 210805 -26581 -223189 -114331 159736 -247740 -135887 15723 -77324 95339 -332800
8947 -76777 -93765 -50073 -214775 497 212076 -190997 -166682 -105990 192215 188770 86893 293425
8935 293425 136783 165785 519711 -99366 378262 -58841 333848 283983 249631 515814 1020434
8924 1020434 1354813 2672891 5619240 7787203 3434913 1308170 754033 473084 845403
8915H45403m16700d013B60861J05046m4634p4774J29395q0548A9628K96685F3869
8903b99242A02512J69588j30085i8777m9978j87028e9807B05620a7557A34878
8892G7110a23887H9147k6230R4072K2752b88426e6084B32705a19292j4766b6407
8880A57131e3139j3786A51040J13033e9531j97036A54665o1598a42678j12026
8870b54704A57718p7089b44864J13083a9406j2649j64823j97157C2236J26332
$$ plain form
8915 845403 428703 -4013 260861 365907 321273 246499 375894 295346 19628 316313 63869
8903 -299242 102512 272100 142015 -98777 -148755 -335783 -59807 205620 -17557 134878
8892 77110 -123887 89147 62917 156989 179741 -288426 -56084 232705 -119292 -134058 -26407
8880 157131 -53139 -66925 151040 264073 -59531 -256567 154665 93067 -142678 -254704
8870 -254704 157718 80629 -244864 -131781 -19406 -32055 -196878 -394035 32236 158568
$$ [...]
##END NTUPLES=NMR SPECTRUM
##END=
