
##TITLE=AC1246_NTBAH12036_6944998_PLavRkJpWO
##JCAMPDX= 6.0         $$ Bruker NMR JCAMP-DX V2.0
##DATA TYPE= NMR SPECTRUM
##DATA CLASS= NTUPLES
##ORIGIN= BRUKER
##OWNER= Administrator
$$ 1.72 TOPSPIN		Version 2.1
$$ 2012-10-18 13:44:44.521 -0700  Administrator@X
$$ Compression mode = diff/dup
##.OBSERVE FREQUENCY= 400.02188249412
##.OBSERVE NUCLEUS= ^1H
##.ACQUISITION MODE= SIMULTANEOUS (DQD)
##.ACQUISITION SCHEME= undefined
##.AVERAGES= 64
##.DIGITISER RES= 22
##SPECTROMETER/DATA SYSTEM= spect
##.PULSE SEQUENCE= noesygpps1d.comp
##.SOLVENT NAME= COFFEE_meoh
##.SHIFT REFERENCE= INTERNAL, COFFEE_meoh, 1, 14.96099
##AUDIT TRAIL= $$ (NUMBER, WHEN, WHO, WHERE, PROCESS, VERSION, WHAT)
$$ ##TITLE= Audit trail, TOPSPIN		Version 2.1
$$ ##JCAMPDX= 5.01
$$ ##ORIGIN= Bruker BioSpin GmbH
$$ ##OWNER= Administrator
$$ $$ C:\Bruker\TOPSPIN/data/COFFEE/nmr/AC1246_NTBAH12036_6944998_PLavRkJpWO/12/pdata/1/auditp.txt
$$ ##AUDIT TRAIL=  $$ (NUMBER, WHEN, WHO, WHERE, PROCESS, VERSION, WHAT)
(   1,<2012-10-13 17:06:32.046 -0500>,<Administrator>,<TOPSPIN>,<go>,<TOPSPIN 2.1>,
      <created by zg
	started at 2012-10-13 16:55:01.796 -0500,
	POWCHK enabled, PULCHK disabled,
       configuration hash MD5:
       6B 1B 68 BB D9 2E 58 E2 7F 35 AD 54 07 DF 0E 41
       data hash MD5: 64K
       0D BA 7A 1C 82 55 25 D8 A5 AD 16 A4 8D B2 E6 F1>)
(   2,<2012-10-13 17:06:34.812 -0500>,<Administrator>,<TOPSPIN>,<proc1d>,<TOPSPIN 2.1>,
      <Start of raw data processing
       efp LB = 0.3 FT_mod = 6 PKNL = 1 PHC0 = 0 PHC1 = 0 SI = 128K 
       data hash MD5: 128K
       84 2B 5F 50 EB D5 36 FE C7 11 45 92 C0 41 BA 67>)
(   3,<2012-10-13 17:06:36.031 -0500>,<Administrator>,<TOPSPIN>,<proc1d>,<TOPSPIN 2.1>,
      <pk PHC0 = 4.790039 PHC1 = 0 
       data hash MD5: 128K
       AC EA BF 52 8A 33 28 7C 5A E8 C5 1C B7 8B 76 F0>)
(   4,<2012-10-13 17:06:36.265 -0500>,<Administrator>,<TOPSPIN>,<proc1d>,<TOPSPIN 2.1>,
      <abs ABSG = 1 
       data hash MD5: 128K
       CB A4 21 CF D6 11 29 3A 71 DF BC 20 52 77 F8 10>)
(   5,<2012-10-13 17:06:36.343 -0500>,<Administrator>,<TOPSPIN>,<proc1d>,<TOPSPIN 2.1>,
      <abs ABSG = 2 
       data hash MD5: 128K
       25 97 A0 6D 68 EC 2E D6 E8 BD 73 47 4D 2F 02 FC>)
(   6,<2012-10-13 17:06:36.406 -0500>,<Administrator>,<TOPSPIN>,<proc1d>,<TOPSPIN 2.1>,
      <abs ABSG = 3 
       data hash MD5: 128K
       D2 A6 90 61 FD F3 52 E0 61 F5 9C E5 77 54 AE FA>)
(   7,<2012-10-13 17:06:36.640 -0500>,<Administrator>,<TOPSPIN>,<proc1d>,<TOPSPIN 2.1>,
      <abs ABSG = 4 
       data hash MD5: 128K
       08 C8 28 BE 49 54 8A 5D B4 DF 05 2A FE FC 9F 33>)
(   8,<2012-10-13 17:06:36.718 -0500>,<Administrator>,<TOPSPIN>,<proc1d>,<TOPSPIN 2.1>,
      <abs ABSG = 5 
       data hash MD5: 128K
       78 0B 6B 8B 12 23 7C C6 06 EE 0E 0F AE 07 36 3C>)
(   9,<2012-10-13 17:06:36.937 -0500>,<Administrator>,<TOPSPIN>,<audit>,<TOPSPIN 2.1>,
      <user comment:
       ICON-NMR User ID: COFFEE
       data hash MD5: 128K
$$ [...]
##$TP07= 0
##$TPNAME0= <>
##$TPNAME1= <>
##$TPNAME2= <>
##$TPNAME3= <>
##$TPNAME4= <>
##$TPNAME5= <>
##$TPNAME6= <>
##$TPNAME7= <>
##$TPOAL= (0..7)
0.5 0.5 0.5 0.5 0.5 0.5 0.5 0.5
##$TPOFFS= (0..7)
0 0 0 0 0 0 0 0
##$TUNHIN= 0
##$TUNHOUT= 0
##$TUNXOUT= 0
##$USERA1= <user>
##$USERA2= <user>
##$USERA3= <user>
##$USERA4= <user>
##$USERA5= <user>
##$V9= 5
##$VALIST= <valist>
##$VCLIST= <CCCCCCCCCCCCCCC>
##$VD= 0
##$VDLIST= <DDDDDDDDDDDDDDD>
##$VPLIST= <PPPPPPPPPPPPPPP>
##$VTLIST= <TTTTTTTTTTTTTTT>
##$WBST= 2048
##$WBSW= 25
##$XGAIN= (0..3)
0 0 0 0
##$XL= 0
##$YL= 0
##$YMAX_a= 12853726
##$YMIN_a= -9433359
##$ZGOPTNS= <>
##$ZL1= 120
##$ZL2= 120
##$ZL3= 120
##$ZL4= 120
##$ABSF1= 14.96099
##$ABSF2= -5.597192
##$ABSG= 5
##$ABSL= 3
##$ALPHA= 0
##$AQORDER= 0
##$ASSFAC= 0
##$ASSFACI= 0
##$ASSFACX= 0
##$ASSWID= 0
##$AUNMP= <proc_prof1d_extract.lims>
##$AXLEFT= 0
##$AXNAME= <>
##$AXNUC= <1H>
##$AXRIGHT= 0
##$AXTYPE= 0
##$AXUNIT= <>
##$AZFE= 0.1
##$AZFW= 0.1
##$BCFW= 0
##$BC_mod= 0
##$BYTORDP= 0
##$COROFFS= 0
##$CY= 15
##$DATMOD= 1
##$DC= 0
##$DFILT= <>
##$DTYPP= 0
##$F1P= 0
##$F2P= 0
##$FCOR= 0.5
##$FTSIZE= 131072
##$FT_mod= 6
##$GAMMA= 0
##$GB= 0
##$INTBC= 1
##$INTSCL= 1
##$ISEN= 128
##$LB= 0.3
##$LEV0= 0
##$LPBIN= 0
##$MAXI= 10000
##$MC2= 0
##$MEAN= 0
##$ME_mod= 0
##$MI= 0
##$NCOEF= 0
##$NC_proc= -2
##$NLEV= 6
##$NOISF1= 0
##$NOISF2= 0
##$NSP= 0
##$NTH_PI= 0
##$NZP= 0
##$OFFSET= 14.96099
##$PC= 1
##$PHC0= 4.790039
##$PHC1= 0
##$PH_mod= 1
##$PKNL= yes
##$PPARMOD= 0
##$PPDIAG= 0
##$PPIPTYP= 0
##$PPMPNUM= 2147483647
##$PPRESOL= 1
##$PSCAL= 4
##$PSIGN= 0
##$PYNMP= <proc.py>
##$REVERSE= no
##$SF= 400.020009639675
##$SI= 131072
##$SIGF1= 0
##$SIGF2= 0
##$SINO= 400
##$SIOLD= 131072
##$SPECTYP= <>
##$SREGLST= <1H.CDCl3>
##$SSB= 0
##$STSI= 131072
##$STSR= 0
##$SW_p= 8223.68421052631
##$SYMM= 0
##$S_DEV= 0
##$TDeff= 65536
##$TDoff= 0
##$TI= <>
##$TILT= no
##$TM1= 0
##$TM2= 0
##$TOPLEV= 0
##$USERP1= <user>
##$USERP2= <user>
##$USERP3= <user>
##$USERP4= <user>
##$USERP5= <user>
##$WDW= 1
##$XDIM= 131072
##$YMAX_p= 301869045
##$YMIN_p= -11289
##$CURPLOT= <Network HP LaserJet P1505>
##$CURPRIN= <$Network HP LaserJet P1505>
##$DFORMAT= <normdp>
##$LAYOUT= <+/1D_H.xwp>
##$LFORMAT= <normlp>
##$PFORMAT= <normpl>
##$SURQMSG= 1
$$ End of Bruker specific parameters
$$ ---------------------------------
##NTUPLES= NMR SPECTRUM
##VAR_NAME=  FREQUENCY,     SPECTRUM/REAL,   SPECTRUM/IMAG
##SYMBOL=    X,             R,               I
##VAR_TYPE=  INDEPENDENT,   DEPENDENT,       DEPENDENT
##VAR_FORM=  AFFN,          ASDF,            ASDF
##VAR_DIM=   131072,        131072,          131072
##UNITS=     HZ,            ARBITRARY UNITS, ARBITRARY UNITS
##FACTOR=    0.0627417313425164, 1,          1
##FIRST=     8223.62146879497, 1635,         -61138
##LAST=      0,             3433,            -61424
##MIN=       0,             -11289,          0
##MAX=       8223.62146879497, 301869045,    0
$$ Real data points
##PAGE= N=1
##DATA TABLE= (X++(R..R)), XYDATA
$$ [...]
65114 242474 238730 235098 231066 226277 220809 215092 209603 204610 200098 195921 192033 188531 185366 182128
65100 182128 178402 174279 170250 166547 163047 159901 157795 157216 157737 158395 158593 158312 157656 156689 155668 154961
65084 154961 154586 154126 153265 152200 151378 150995 150887 150837 150807 150880 151061 151240 151404 151841 152993 154984 157337 159190
65066 159190 159868 159340 158314 157808 158358 159544 160436 160551 160154 159592 158823 157887 157448 158252 160111 161960 163038
65049 163038 163632 164491 165814 167056 167473 166623 164506 161524 158349 155668 153936 153251 153308 153490 153195 152241 150875
65032 150875 149311 147437 145117 142651 140665 139544 139132 139023 138997 139133 139652 140706 142179 143618 144537 144936
65016 144936 145367 146232 147122 147189 146207 144957 144354 144503 144917 145451 146542 148424 150570 152156 152877 153078 153268
64999 153268 153819 155031 157099 159828 162588 164683 165755 165780 164919 163534 162234 161644 162041 163271 164989 166850
64983 166850 168551 169927 171120 172452 174038 175609 176832 177611 177952 177726 176816 175420 173939 172606 171384
64968 171384 170128 168586 166417 163557 160527 158005 156166 154892 154475 155334 156888 157593 156660 155112 154470
64953 154470 154906 155437 155497 155360 155166 154542 153317 151884 150685 149967 150011 150852 151639 151236 149747 148584 148596 149013
64935 149013 148873 148616 149336 151062 152792 153879 154347 154029 152557 150341 148610 148096 148365 148727 149138 149781 150408
64918 150408 150647 150629 150795 151295 151966 152727 153600 154512 155409 156456 157805 159258 160467 161414 162374 163462 164589
64901 164589 165865 167767 170713 174622 178926 182916 186176 188956 192116 196311 201119 205298 208155 210354
64887 210354 213051 216550 220224 223489 226258 228413 229519 229339 228182 226446 224202 221572 219078 217065
64873 217065 215028 212105 208265 204487 201739 200160 199311 198775 198360 198017 197759 197418 196466 194414 191464 188431
64857 188431 185910 183838 181937 180084 178053 175439 172256 169223 166989 165340 163642 161814 160322 159385
64843 159385 158783 158466 158762 159742 160835 161338 161102 160509 159968 159627 159440 159329 159299 159495 160073 161049 162340 163926
64825 163926 165806 167755 169377 170570 171819 173735 176222 178312 179120 179007 179482 181692 185165 188425 190812
64810 190812 193161 196515 200700 204679 207972 211059 214383 217622 220206 222040 223230 223412 221907 218724
64796 218724 214967 211951 209986 208265 205956 203117 200410 198188 196273 194574 193446 193225 193665 194161 194436
64781 194436 194788 195626 196900 197987 198217 197659 197373 198584 201462 204953 207969 210457 213089 216227 219617
64766 219617 222949 226267 229830 233857 238382 243090 247338 250615 252961 254729 256134 257365 258980 261648
64752 261648 265404 269574 273524 277062 279991 281780 282028 280966 279157 276886 274136 270963 267492 263597
64738 263597 258942 253443 247500 241693 236404 231808 228065 225316 223474 222199 221216 220640 220813 221793 223169
64723 223169 224461 225520 226389 226976 227182 227322 228035 229621 231733 233871 236013 238499 241341 243953 245694
64708 245694 246504 246805 246797 246133 244388 241616 238159 234125 229461 224552 220229 216990 214573 212497 210583 208674
64692 208674 206337 203394 200526 198738 198312 198728 199495 200480 201431 201839 201558 201192 201620 203328 206242 209920
64676 209920 213790 217509 221273 225554 230481 235658 240548 244811 248307 251106 253472 255483 256718 256666 255392
64661 255392 253359 250662 247056 242777 238679 235391 232934 231335 230842 231089 230842 229332 227437 226774 227858
64646 227858 229744 231311 232256 232929 233835 235403 237812 240871 244293 248017 252072 256331 260758 265672 271363
64631 271363 277527 283541 289171 294504 299245 302563 303769 302783 299947 295789 291036 286428 282292 278493
64617 278493 274730 270641 265780 260001 253922 248549 244389 241344 239368 238537 238350 237739 236201 234360 233004
64602 233004 232094 231242 230665 230920 232006 233441 235083 237210 239838 242631 245482 248472 251161 252671 252888
64587 252888 252959 254088 256207 258363 260078 261733 263712 265834 267745 269403 270953 272408 273706 274913 276188
64572 276188 277564 278839 279656 279662 278690 276807 274192 271051 267724 264651 261922 258892 254656 248988 242599
64557 242599 236398 230851 226145 222524 220081 218483 217280 216304 215465 214434 213010 211653 211078 211316 211758
64542 211758 212205 213221 215116 217144 218242 218290 218056 218011 217733 216602 214668 212649 211284 210868 211220 211847 212188
64525 212188 211840 210708 208981 207039 205404 204631 205039 206425 208154 209695 211048 212479 213858 214619 214516
64510 214516 214086 214023 214354 214773 215635 217892 221844 226533 230817 234634 238721 243430 248382 253209 257966 262689
64494 262689 266949 270150 272077 272989 273275 273151 272574 271409 269724 267924 266518 265776 265712 266316 267546 269077
64478 269077 270298 270750 270494 269975 269576 269313 268808 267568 265453 263035 261333 260950 261482 261963 262001 262235 263555
64461 263555 265985 268684 271076 273557 276799 280608 283978 286232 287644 288732 289499 289780 289998 290962 292978
64446 292978 295675 298778 302548 307140 311965 316173 319724 323563 328662 335153 342563 350600 359375 368938
64432 368938 379050 389677 401458 415292 431408 449201 468114 488473 511239 537108 566129
64421 566129 598173 633575 673218 718043 768450 824009 883647 945975 1009329 1071631 1130660
64410 1130660 1184887 1234014 1278408 1317911 1351291 1376708 1392542 1397842 1392462 1377094 1353038 1321599
64398 1321599 1283482 1238733 1187240 1129386 1066399 1000229 933116 867133 803957 744871 690753
64387 690753 641987 598423 559597 525110 494868 468942 447209 429156 414010 400975 389369
64376 389369 378715 368893 360102 352501 345890 339921 334476 329574 324953 320095 314798 309400 304281 299416
64362 299416 294605 289842 285188 280566 275979 271730 267997 264367 260318 256237 253471 253071 254731 257157
64348 257157 259361 261358 263695 266502 269066 270325 269750 267720 265063 262370 259807 257414 255233 253132
64334 253132 250778 248002 245153 242928 241774 241493 241452 241240 241011 241165 241818 242745 243742 244731 245499 245726 245499
64317 245499 245440 246032 246994 247652 247777 247772 248076 248638 248913 248231 246283 243518 240848 238729 236671 233938 230524
64300 230524 227060 223998 221371 219216 217625 216346 214957 213556 212736 212632 212469 211410 209519 207658 206696
64285 206696 207007 208366 210107 211670 213290 215759 219279 222969 225907 228259 230875 234053 237366 240646
64271 240646 244384 248948 253851 258145 261276 263260 264215 264091 262962 261382 260200 259926 260317 260713 260728 260453
64255 260453 260011 259189 257720 255686 253390 250875 247868 244179 239999 235720 231581 227584 223668 219954 216764
64240 216764 214393 212863 211975 211521 211299 210951 210118 208870 207795 207462 207923 208849 209988 211311 212824 214391
64224 214391 215719 216473 216567 216366 216340 216404 215906 214424 212256 209929 207634 205522 204093 203623 203398 202282 200169
64207 200169 198290 197862 198864 200370 201597 202336 202671 202783 202992 203726 205307 207793 210905 214159 217228 220251
64191 220251 223637 227618 232163 237243 242842 248699 254496 260398 266987 274381 281716 287794 291950 294077
64177 294077 294153 292214 288571 283635 277565 270469 262848 255485 248879 243053 237861 233179 228877 224955 221691
64162 221691 219308 217522 215785 213985 212494 211484 210707 210065 209904 210444 211358 212303 213509 215371 217694 219834
64146 219834 221498 222982 224672 226710 229104 231713 234068 235624 236350 236691 236820 236344 234996 233271 232006
64131 232006 231555 231735 232403 233617 235226 236777 238001 239128 240514 242146 243784 245500 247795 251050 255007
64116 255007 258921 262270 265273 268659 272957 278090 283632 289315 295064 300647 305597 309667 313157 316523
64102 316523 319695 322095 323469 324510 326421 329861 334439 339183 343336 346716 349550 352075 354222 355545
64088 355545 355509 353986 351431 348529 345642 342642 339192 335104 330441 325398 320129 314726 309366 304434 300352
64073 300352 297267 295009 293379 292284 291501 290580 289237 287744 286664 286281 286477 287088 288077 289389 290908 292563
64057 292563 294297 295972 297582 299455 301856 304383 306264 307418 308817 311505 315620 320660 326325 332628
64043 332628 339420 346315 353138 360098 367476 375322 383406 391258 398300 404146 408741 412103 414050 414445
64029 414445 413547 411892 409909 407830 405755 403535 400801 397560 394631 392981 392603 392455 391536 389619 386916
64014 386916 383615 380017 376680 373998 371856 369959 368324 367171 366503 366027 365433 364574 363599 363077 363764 365936
63998 365936 369086 372484 375900 379492 383249 387013 391037 395946 401888 408118 413779 418911 424272 430312
63984 430312 436810 443605 451164 460012 469868 479912 489909 500597 512716 526009 539509 552558 565260
63971 565260 578087 591445 605543 620303 635363 650484 666032 682840 701524 722169 744632
63960 744632 768771 794332 821093 849403 880271 914566 952380 993466 1038108 1087120 1141149
63949 1141149 1200535 1265991 1338922 1420659 1511542 1611067 1718797 1834765 1958942 2090665
63939 2090665 2228776 2371971 2518627 2666386 2812311 2953554 3087597 3211866 3323595
63930 3323595 3420329 3500253 3561726 3602786 3621562 3617139 3589829 3540820 3471894 3385216 3282871
63919 3282871 3166623 3038551 2901839 2760415 2617638 2475676 2336085 2200426 2070126
63910 2070126 1946205 1829421 1720377 1619341 1526317 1441500 1365232 1297355 1237031 1183489
63900 1183489 1136491 1095698 1060081 1028486 1000460 975931 954337 934679 916333 899203 883060
63889 883060 867347 851843 837059 823731 812167 802275 793872 786798 780935 776393 773544 772695 773829
63876 773829 776824 781809 789069 798561 809758 822084 835467 850281 866754 884613 903356 922689
63864 922689 942467 962397 982105 1001398 1020082 1037562 1053063 1066390 1077992 1088036 1095778 1100241
63852 1100241 1101198 1099115 1094375 1086986 1076912 1064245 1049023 1031216 1010881 988068 962733 935075
63840 935075 905925 876394 847074 817863 788614 759601 731272 703874 677463 652094 627806
63829 627806 604585 582484 561699 542413 524549 507763 491731 476553 462789 450865 440412
63818 440412 430519 420781 411724 403900 396943 390019 382909 376070 369766 363788 358060 352831 348060 343204
63804 343204 337908 332470 327322 322494 317871 313568 309671 305960 302315 299094 296685 294925 293402 292077
63790 292077 291046 289854 287754 284697 281475 278713 276227 273677 271313 269590 268348 266897 264905 262736
63776 262736 260903 259484 258189 256750 255176 253774 252990 252991 253327 253210 252287 250970 249897 249273 248944 248861 249121
63759 249121 249640 250118 250385 250493 250450 250125 249528 248923 248516 248219 247852 247455 247232 247289 247545 247922 248543 249733 251671
63740 251671 254017 256028 257316 258300 259588 261059 261994 262140 262124 262710 264108 266156 268602 270951 272532 273217
63724 273217 273720 274825 276685 279193 282469 286350 289854 292007 293039 294022 295400 296616 297162 297200 296976 296369
63708 296369 295318 294143 293094 292050 290881 289692 288452 286915 285214 284019 283701 283783 283662 283521 284006 285309
63692 285309 287100 289203 291747 294695 297742 300701 303568 306102 307812 308564 308897 309479 310422 311297 311706 311613
63676 311613 311202 310629 310014 309550 309517 310128 311373 313009 314661 315989 316862 317418 317869 318171 317942 316802 314777
63659 314777 312351 310203 308898 308585 308701 308162 306214 303192 300220 298115 296808 295886 295311 295364 296058 296969
63643 296969 297710 298422 299660 301823 304734 307853 310819 313685 316575 319409 322134 325018 328383 332162 336075
63628 336075 340176 344834 350114 355603 361064 366922 373794 381711 390121 398590 407302 416869 427809 440182
63614 440182 453622 467614 481767 495954 510407 525744 542629 561060 580082 598478 615693
63603 615693 631768 646446 658834 668076 673946 676618 676281 673365 668841 663803 658724 653322 647078 639673
63589 639673 631030 621268 610644 599362 587371 574535 561067 547611 534799 522776 511315 500419
63577 500419 490672 482838 477085 472723 468768 464730 460882 457979 456735 457322 459196 461626 464575 468798
63563 468798 474801 481954 489080 495752 502562 510185 518704 527877 537542 547616 558189 569815 583256
63550 583256 598670 615439 633104 652160 673508 697222 721989 745601 765831 781150 791032 795637
63538 795637 795207 789963 780651 768893 756656 745400 735707 727441 720025 712741 705058 696680 687318 676546
63524 676546 663931 649193 632248 613340 593183 572713 552605 533152 514537 496949 480544
63513 480544 465664 452922 442529 433549 424547 415165 406439 399306 393501 388305 383632 379676 376005
63500 376005 371877 367329 363220 360175 357974 356025 354034 352113 350515 349334 348332 347157 345811 344753
63486 344753 344415 344860 345986 347715 349828 352014 354319 357144 360527 363848 366552 368690 370374 371291 371310
63471 371310 371065 371260 371807 372247 372551 372710 372030 369887 367004 364884 363927 363096 361602 359915 358817 358378 358432
63454 358432 359339 361604 365091 369127 373110 376732 379964 383171 387064 392261 399045 407588 417967 429763
63440 429763 442062 454279 466796 480616 496521 514725 534944 556484 578313 599229 617960
63429 617960 633263 644340 651338 655285 657476 659062 661095 664459 669616 676711 685961 697630 711660
63416 711660 727781 746000 766307 787666 807895 824949 837991 846990 851885 852653 849804 844218 836685
63403 836685 827992 819107 810668 802358 793300 783032 771615 758861 744138 727217 708917 690495
63391 690495 672530 654679 636517 618347 601043 585205 570764 557519 545776 536015 527996 520768
63379 520768 513866 508079 504533 503202 502933 502952 503757 506167 509939 513962 517751 522179 528441 536743 546444
63364 546444 557216 569431 583378 598743 615106 632391 650436 668658 686784 705496 725552
63353 725552 746286 765752 782456 796329 807858 816926 822845 825018 823198 817616 809319 800043 791154
63340 791154 782697 773749 763618 752422 740618 728251 714731 699323 681951 663527 645318 627933
63328 627933 611167 594858 579508 565921 554568 545495 538568 533533 530086 528009 526922 525705 522633
63315 522633 516519 507546 496731 484919 472678 460714 449688 439628 430075 420891 412469 405060 398378
63302 398378 392088 386363 381620 377791 374184 370192 366088 362920 361438 361160 360754 359336 357178 355108 353657
63287 353657 352947 352864 352873 352047 349970 347499 345963 345546 345085 343658 341784 340676 340741 341342 341837 342283 343067 344305
63269 344305 345795 347323 348834 350475 352638 355737 359720 363869 367389 370212 373003 376335 380175 384189
63255 384189 388236 392328 396447 400726 405501 410833 416285 421604 427344 434209 441953 449711 457452 466272
63241 466272 476979 489106 501744 514734 528469 543043 558272 574314 591607 610184 629525
63230 629525 649048 668474 687813 707298 727215 747498 767576 786871 805344 823323 841021
63219 841021 858465 875662 892537 908982 925208 941693 958293 973714 986391 995701 1001827 1004752
63207 1004752 1004086 999751 992020 980839 965836 947209 925979 903194 879436 855308 831768 809563
63195 809563 788813 769519 752131 737240 725065 715565 708653 703964 700787 698758 698403 700451 704724
63182 704724 710213 716305 723500 732689 743993 756465 768792 780126 790334 799686 808513 817158 825992
63169 825992 835137 844150 852196 858608 863154 865813 866599 865617 862889 857967 849979 838322 823163 805214
63155 805214 785367 764667 744104 724005 703952 683790 664399 646887 631195 616214 601387
63144 601387 587465 575408 565107 555668 546598 538214 531024 525166 520441 516583 513444 511072 509568
63131 509568 508702 507776 506175 504054 502220 501291 501217 501668 502599 504209 506508 509174 511804 514189 516355 518506
63115 518506 520851 523437 526149 528982 532160 535839 539742 543352 546511 549547 552730 555797 558299 560238
63101 560238 562073 564078 566013 567581 568919 570410 572125 573799 575359 577188 579708 582873 586177 589038
63087 589038 591118 592543 594057 596713 601066 606655 612540 618217 623734 629137 634413 640050 647011 655797
63073 655797 665881 676447 687312 698780 710891 723331 735941 748892 762435 776819 792280
63062 792280 808789 826026 844068 863882 886533 911932 938973 967011 996718 1029331 1065573
63051 1065573 1105365 1148042 1192576 1238076 1284437 1332157 1381278 1430818 1479538 1526932 1573237
63040 1573237 1618795 1663674 1707655 1750315 1791365 1831076 1870056 1908420 1945560 1980859 2014118
63029 2014118 2044873 2071780 2093191 2108041 2115736 2115553 2106753 2089097 2062771 2028084 1985874 1937998
63017 1937998 1886610 1832885 1777095 1720049 1663825 1610763 1562208 1518439 1479304 1444518 1413750
63006 1413750 1387026 1365065 1348837 1338658 1333817 1333120 1335685 1341229 1349736 1361021 1374609 1389899
62994 1389899 1406332 1423436 1440824 1458127 1474941 1490952 1506230 1521159 1535793 1549420 1561100
62983 1561100 1570453 1577422 1581456 1581658 1577731 1569936 1557856 1540155 1516167 1487004 1454401 1419049 1380792
62970 1380792 1339944 1297465 1254218 1211006 1169145 1129984 1093766 1059749 1027463 997143 968940
62959 968940 942543 917705 894435 872519 851505 831361 812536 795234 779200 764218 750100
62948 750100 736188 721769 707249 694060 682954 673124 663431 653768 644673 636277 628292 620613 613321
62935 613321 606405 599876 593740 587547 580599 573098 566460 561774 558429 555032 551258 547886 545301 542968
62921 542968 540384 537695 535204 532953 531014 529564 528404 526912 524784 522436 520421 518742 516947 514658
62907 514658 511783 508464 505115 502363 500644 499749 498824 496968 494003 490744 488382 487468 487522 487706 487666 487571 487533
62890 487533 487334 486681 485504 483983 482477 481400 480956 480985 481167 481368 481701 482295 483083 483744 483832 483134 481997 481085
62872 481085 480716 480628 480516 480412 480293 479724 478349 476549 475123 474403 474148 474170 474543 475128 475476 475408 475328 475753 476773
62853 476773 478108 479365 480093 479918 478964 477976 477817 478872 481012 483880 487018 489958 492459 494639 496723
62838 496723 498730 500485 501795 502519 502658 502575 502924 504092 505828 507644 509446 511394 513267 514534 515225 516267
62822 516267 518598 522229 526539 531187 536242 541548 546601 551219 555833 560866 566182 571450 576738 582424
62808 582424 588750 595804 603681 612277 621085 629625 638019 646808 656315 666657 678237 691572 706457
62795 706457 721830 736829 751760 767802 785961 806470 828963 853087 879043 907592 939359
62784 939359 974213 1011706 1052041 1096071 1144246 1196135 1251284 1309971 1372637 1438979 1508060
62773 1508060 1578905 1650414 1720935 1788583 1851943 1910063 1961811 2005657 2040024 2063464 2074714
62762 2074714 2073132 2059207 2034195 1999211 1955039 1902785 1844125 1780676 1713567 1643924 1573370
62751 1573370 1503606 1435659 1369909 1306823 1247283 1192031 1140978 1093314 1048402 1006437 968087
62740 968087 933591 902498 874368 849360 827769 809151 792324 776321 761102 747236 735129
62729 735129 724732 715834 708425 702634 698363 695130 692440 690330 689305 689676 691092 692843 694487 696106
62715 696106 698184 701452 706595 713822 722711 732662 743469 755400 768925 784482 802235 821835 842720
62702 842720 864969 889589 917522 948539 981539 1015794 1051439 1088852 1128203 1169627 1213140
62691 1213140 1257982 1302398 1344487 1383151 1418043 1448757 1474274 1493170 1504291 1507299 1502458 1489825
62679 1489825 1468916 1439597 1403165 1361982 1317915 1271652 1223645 1175057 1127249 1080724 1035242
62668 1035242 990862 948382 908702 872152 838551 807659 779399 753852 731148 711233 693649
62657 693649 677658 662705 648737 635966 624370 613599 603419 594054 585838 578616 571770 564888
62645 564888 558074 551481 544955 538457 532475 527509 523324 519369 515871 513786 513360 513391 512438 510395 508338
62630 508338 507070 506425 505966 505704 505883 506420 506984 507502 508254 509418 510756 511867 512747 513894 515895 518957
62614 518957 522898 527411 532222 537101 541993 547170 553074 559873 567269 574846 582591 591074 601108 613222
62600 613222 627404 643349 660910 680201 701259 723851 747851 773661 801984 833154 866815
62589 866815 902125 937983 973178 1006700 1037965 1066402 1090802 1109534 1121590 1127131 1126825 1121024
62577 1121024 1109821 1093559 1072838 1048177 1020076 989363 957111 924198 891178 858552 826893
62566 826893 796648 768086 741490 717198 695300 675426 656991 639646 623435 608631 595449
62555 595449 583881 573725 564705 556584 549177 542387 536243 530848 526221 522231 518793 516066 514370 513862
62541 513862 514312 515168 515881 516291 516752 517737 519233 520619 521284 521313 521454 522419 524347 526905 529752 532868 536558
62524 536558 541289 547447 555194 564477 575138 587012 600028 614323 630183 647793 667086 687980
62512 687980 710635 735154 761081 787534 814012 840678 867566 893831 918277 940387 960258
62501 960258 977536 991139 1000301 1005332 1006867 1004864 998947 989499 977775 965043 952204 940189 929936
62488 929936 921700 914986 909589 906264 906014 909059 914941 923373 934437 948000 963348 979381 994894
62475 994894 1008617 1019302 1025994 1028240 1026115 1020048 1010413 997119 979736 958164 933028 905327
62463 905327 875873 845252 814043 782833 752171 722775 695554 671115 649365 629894 612582
62452 612582 597500 584395 572773 562481 553777 546743 540960 535903 531424 527706 524976 523383 523035
62439 523035 523977 526043 528708 531191 532943 534053 534891 535342 534813 533188 531210 529504 527617 524576 520024
62424 520024 514248 507450 499811 492075 485164 479125 473260 467443 462493 458951 456178 453140 449521 445602
62410 445602 441570 437520 433835 430968 428976 427592 426694 426405 426787 427626 428472 428865 428722 428564 429116 430623
62394 430623 432806 435430 438511 441848 444852 447069 448569 449692 450798 452417 455075 458669 462473 466109
62380 466109 470155 475387 481774 488623 495378 501908 508313 514967 522545 531456 541295 551237 560953 570827
62366 570827 581372 592762 604957 618024 632243 647991 665491 684770 706013 729768 756382
62355 756382 785276 815314 845988 877605 910068 942132 972204 999206 1022166 1039866 1051797
62344 1051797 1058963 1062738 1063172 1059303 1050913 1038958 1024301 1007032 987237 965582 942798 919291
62332 919291 895635 872824 851618 832060 813959 797441 782697 769558 757661 746677 736065
62321 736065 724910 712463 698797 684661 670743 657211 643852 630478 617228 604546 592825
62310 592825 582150 572424 563578 555456 547710 540187 533348 527862 523825 520696 517960 515461 513189 511238
62296 511238 509956 509532 509455 509060 508747 509815 512679 516030 518382 519840 521603 524225 527270 530464 534175
62281 534175 538626 543380 547879 551909 555290 557676 559068 560212 562055 564975 568811 573518 579459 587008
62267 587008 596055 605938 615965 626107 637220 650407 666141 684212 704491 727313 752870 780628
62255 780628 809803 840239 872364 906350 941790 978114 1014637 1049924 1081737 1108228 1128987
62244 1128987 1144536 1155074 1160284 1160239 1155767 1147690 1136152 1120934 1102088 1080045 1055415 1028963
62232 1028963 1001537 973756 945915 918379 891843 866950 843825 822202 801832 782516 763978
62221 763978 746029 728796 712483 697014 682184 668115 655189 643518 632795 622772 613604 605572
62209 605572 598628 592411 586646 581423 577040 573605 570860 568464 566429 565067 564532 564613 565096 566081 567821
62194 567821 570464 574122 578851 584295 589618 594229 598480 603284 609135 615852 623144 630884 638776 646258
62180 646258 653050 659546 666395 673752 681060 687473 692519 696526 700484 705409 711772 719571 728790 739626
62166 739626 752383 767385 784951 805164 827612 851497 876035 900622 924610 947062 966734
62155 966734 982304 992840 998298 999459 997315 992595 985822 977271 966600 953056 936643 918707 900723
62142 900723 882843 864450 845883 828530 813099 798910 785417 773507 764510 758509 754429 751433
62130 751433 749448 748476 748176 748311 749109 750934 753840 757596 761988 766996 772690 778994 785618 792379 799426
62115 799426 806822 813875 819361 822638 824233 825050 825354 824811 823179 820496 816830 812326 807427 802610 797896
62100 797896 792957 787759 782829 778943 776737 776558 778315 781425 785181 789273 793823 798944 804475 810042
62086 810042 815177 819436 822803 825941 829688 834169 838757 843138 848044 854605 863136 872913 883032 893144
62072 893144 903364 913797 924367 934915 945251 955254 965136 975498 986880 999200 1011901 1024627
62060 1024627 1037458 1050280 1062223 1072048 1079023 1083115 1084444 1082918 1078555 1071870 1063726 1054781 1045025
62047 1045025 1033698 1019756 1002749 983299 962451 940535 917016 891602 865129 839029 814141
62036 814141 790341 767199 744658 723073 702864 684213 667000 651027 636347 623287 612049
62025 612049 602463 594216 587114 580823 574533 567426 559643 552379 546705 542452 538556 534387 530348 527104
62011 527104 524620 522248 519546 516691 514160 512360 511592 512014 513399 515127 516586 517499 517872 517963 518382 519755
61995 519755 521876 523512 523516 521976 519835 517578 514830 511190 506792 502000 497090 492395 488221 484345 480089
61980 480089 475184 470170 465622 461437 457286 453389 450339 448401 447451 447421 448213 449199 449415 448487 447059 446099
61964 446099 445993 446505 447399 448771 450689 452792 454536 455876 457435 459820 462939 466180 469103 471644 473855
61949 473855 475935 478519 482375 487556 493273 498898 504721 511439 519268 527947 537357 547630 558678 570049
61935 570049 581315 592418 603639 615340 627596 639914 651403 661413 669963 677445 684075 689806
61923 689806 694525 698080 700183 700579 699323 696773 693319 689220 684650 679893 675604 672798 672296 674066 677429
61908 677429 681957 687859 695356 704067 713307 722601 731529 739390 745473 749522 751598 751641 749514 745396 739762
61893 739762 732985 725159 716209 706049 694879 683507 673067 664118 656247 648821 641772 635253 628998
61880 628998 622610 616295 610692 606093 602345 599370 597202 595539 593834 591872 589846 587987 586582 586189
61866 586189 587146 588919 590640 592383 595165 599539 604918 610581 616602 623364 630845 638997 648399 659819
61852 659819 673271 688015 703388 719286 735963 753671 772448 791935 811507 830722 849395
61841 849395 866985 882203 893741 901394 906084 908708 909220 906893 901307 892995 883298 873698 865293 858775
61827 858775 854637 853091 853824 856163 859653 864252 869852 875867 881507 886116 888893 888542 883821 874607 862040
61812 862040 847416 831198 813247 793719 773329 752803 732501 712737 694123 677237 662045
61801 662045 648051 635008 623154 612620 602996 593731 584757 576363 568645 561451 554835 549174 544685
61788 544685 541013 537388 533162 528328 523660 520150 517998 516245 513747 510450 507346 505258 504046 503023
61774 503023 501685 499870 497620 495173 492848 490745 488762 486950 485560 484600 483681 482534 481397 480714 480697
61759 480697 481389 482810 484699 486363 487177 487133 486624 485850 484792 483629 482722 482053 481042 479150 476501 473721
61743 473721 471235 468913 466448 463964 462081 461325 461571 462164 462525 462549 462484 462591 462953 463483 464048 464604 465179 465762
61725 465762 466373 467284 468844 470861 472498 473161 473269 473663 474423 474914 474903 474938 475482 476340 477171 477937 478480 478270
61707 478270 477088 475456 473872 472007 469192 465383 461086 456674 452400 448843 446606 445518 444702 443447
61693 443447 441525 438796 435157 431055 427405 424691 422513 420199 417511 414555 411405 408118 404894 401880
61679 401880 398974 396035 393213 390895 389339 388417 387649 386511 384907 383342 382398 382022 381601 380856 380291 380509
61663 380509 381285 381678 381043 379717 378693 378765 379942 381517 382620 382832 382367 381757 381351 381148 381030 381103 381692 382935
61645 382935 384422 385466 385842 386087 386850 388104 389284 390122 390930 391947 392770 392732 391643 389935 388210 386843
61629 386843 385901 385145 384180 382774 381044 379163 377009 374367 371458 368889 366987 365479 364068 363020 362822
61614 362822 363311 363584 362895 361428 360019 359236 358873 358224 356641 353881 350131 345839 341480 337418 333897 331061
61598 331061 328902 327249 325849 324421 322583 319924 316382 312490 309004 306239 303996 302191 301236 301535 302778
61583 302778 304032 304538 304263 303692 303301 303232 303204 302605 300939 298463 296271 295392 295730 296166 295843 295062 294704 295048
61565 295048 295585 295867 295938 295845 295332 294415 293845 294410 295942 297493 298415 298771 298726 298133 296934 295533 294490 294127
61547 294127 294630 296202 298802 301916 304844 307134 308669 309586 310287 311252 312556 313759 314487 314916 315442 316137
61531 316137 316862 317646 318506 319044 318705 317493 316033 314880 314105 313570 313219 312914 312391 311626 311078 311288 312336
61514 312336 313776 314979 315440 314978 313907 312927 312634 313002 313456 313456 312975 312338 311664 310675 309189 307661 306856 306893
61496 306893 306987 306461 305660 305443 305961 306567 306864 307157 307631 307742 306943 305646 304855 305056 305973 307321 309116 311150
61478 311150 312673 313031 312413 311753 311951 313253 315183 316937 318051 318857 320165 322328 324724 326402 327065 327183
61462 327183 327211 327103 326669 326061 325655 325613 325849 326329 327124 328150 329127 329945 330841 332013 333149 333613 333145 332199
61444 332199 331548 331690 332711 334435 336477 338321 339743 341141 343116 345649 348066 350020 352067 354894 358231
61429 358231 361073 362921 364231 365581 366910 367904 368705 369782 371275 372840 374114 375094 376033 377134 378311
61414 378311 379207 379542 379503 379580 379944 380232 380129 379829 379643 379409 378657 377183 375114 372599 369886 367502 365904
61397 365904 364961 364208 363508 362971 362407 361529 360719 360835 361969 363098 363337 363027 363125 364013 365407 366977 368465
61380 368465 369453 369698 369600 369818 370447 371051 371468 372104 373365 375233 377492 380001 382592 384931 386675 387648 387925
61363 387925 387921 388301 389507 391382 393538 396029 399255 403208 407310 411215 415342 420280 425938 431668 437067
61348 437067 442280 447557 452878 458063 462948 467310 470836 473470 475707 478336 481790 485824 489816 493269
61334 493269 495971 497866 498965 499402 499404 499179 498878 498627 498469 498270 497836 497132 496293 495452 494765 494568 495258 496913
61316 496913 499240 501938 504817 507513 509521 510892 512575 515590 519985 525036 530452 536873 544976 554436
61302 554436 564017 572555 579661 585617 590821 595345 598845 600831 601039 599561 596737 593070 589196 585700
61288 585700 582735 579820 576193 571486 566101 560918 556626 553296 550542 547966 545479 543330 541957 541703
61274 541703 542479 543705 544807 545806 547257 549546 552426 555350 558082 560808 563793 567146 570923 575261 580314
61259 580314 586061 592188 598268 604164 610179 616630 623239 629161 633711 636885 639150 640942 642491 643849
61245 643849 644787 644781 643413 640837 637732 634751 632081 629564 627144 625110 623746 622823 621656 619900 617994
61230 617994 616591 615752 615225 615317 616761 619630 623080 626486 630161 634533 639175 643304 646874 650552 654847
61215 654847 659781 665181 670711 675767 679988 683791 687857 692173 696176 699813 703792 708592 713789 718609
61201 718609 722746 726454 730256 734759 740389 747070 754415 762432 771726 782764 795116 807587 818981
61188 818981 828721 836997 844423 851311 857172 861152 862995 863350 863044 862393 861268 859443 856631 852502 847017
61173 847017 840573 833630 826317 818609 810667 802713 794694 786339 777489 768192 758510 748465 738232 728196
61159 728196 718730 710003 702023 694765 688160 682058 676437 671736 668736 667795 668204 668610 668213 667359 666894 667233
61143 667233 668131 668942 668719 666442 661802 655806 650209 646240 644038 643109 642913 643078 643586 644932 647801 652456
61127 652456 658586 665704 673389 681293 689361 698172 708640 721206 735579 751292 768089 785659 803475
61114 803475 821227 839129 857516 876336 895239 913926 932176 949693 966193 981507 995436
61103 995436 1007669 1018042 1026728 1033893 1039205 1041927 1041525 1038111 1032275 1024570 1015250 1004453 992510
61090 992510 979899 966869 953266 938852 923756 908544 893975 880686 868879 858270 848616 840394
61078 840394 834483 830955 828659 826460 824417 823212 822974 823529 825508 829956 836712 844252 851620 859668 869776
61063 869776 881922 894762 907239 919462 932164 945934 961085 977872 996506 1016934 1038679
61052 1038679 1061073 1083892 1107669 1133167 1160574 1189511 1219669 1251029 1283468 1316667 1350601
61041 1350601 1385831 1423194 1463328 1506318 1551435 1597392 1643401 1689913 1737908 1787679 1838961
61030 1838961 1892028 1947729 2006357 2067340 2130241 2195227 2262365 2331395 2402675 2477614 2557726
61019 2557726 2643853 2736497 2836139 2942987 3057348 3180674 3315332 3463130 3625363 3804931
61009 3804931 4007162 4237846 4501948 4805282 5155905 5562353 6032046 6573351 7197934
61000 7197934 7919088 8749312 9700644 10779012 11961565 13169018 14267755 15119692 15649926
60991 15649926 15878437 15894959 15808453 15713572 15679643 15737191 15853411 15924557 15813668 15418750
60981 15418750 14721394 13782430 12699107 11563270 10443210 9383859 8411919 7540652 6774406
60972 6774406 6111609 5545543 5065287 4658477 4313922 4021915 3773329 3559566 3373260
60963 3373260 3208650 3061600 2929461 2810319 2701955 2601915 2508758 2422565 2343808 2272175
60953 2272175 2206738 2146578 2090708 2037854 1986941 1937533 1889468 1842396 1796026 1750547 1706427
60942 1706427 1664038 1623646 1585350 1548753 1513047 1477735 1442901 1408615 1374650 1341147 1308961
60931 1308961 1278746 1250105 1222183 1194750 1168133 1142425 1117483 1093608 1071485 1051356 1032740
60920 1032740 1015081 998259 982336 967085 951998 936751 921625 907423 894725 883237 872191
60909 872191 861504 852026 844306 837619 830740 823388 816294 810065 804636 799769 795355 791116 786600 781742
60895 781742 776968 772485 767825 762358 755962 748985 741822 734791 728187 722114 716324 710421 704164 697500
60881 697500 690467 683227 676008 668805 661283 653242 645066 637425 630612 624415 618618 613233 608216 603378
60867 603378 598795 594893 591771 588734 585022 580880 577371 575057 573341 571284 568627 565789 563251 561265
60853 561265 559833 558575 556840 554344 551499 548735 545762 542005 537678 533814 531123 529358 527909 526509
60839 526509 525054 523181 520492 517009 513066 508884 504553 500349 496705 493755 491110 488215 484956 481869
60825 481869 479743 478957 479155 479509 479319 478406 477044 475605 474176 472475 470180 467400 464691 462529 460890
60810 460890 459468 458101 456820 455622 454432 453249 452116 450973 449612 447702 444868 441105 437216 434435
60796 434435 433184 432513 431164 428945 426570 424485 422472 420258 417807 415006 411778 408623 406376 405182
60782 405182 404281 402950 401180 399198 397012 394766 392978 391960 391364 390718 390090 389814 389937 390304 390926 391853
60766 391853 392935 394044 395329 396884 398395 399466 400099 400536 400883 401250 402000 403424 405256 406879 407965
60751 407965 408631 409069 409323 409387 409319 409300 409631 410445 411313 411457 410554 408936 406803 403794 399776 395512 391835 388483
60733 388483 384634 380383 376824 374516 372713 370454 367712 365083 362851 360923 359347 358364 357942 357662 357084
60718 357084 356092 354880 353717 352753 352031 351726 352205 353574 355206 356113 355955 355433 355469 356263 357378 358455 359442
60701 359442 360195 360336 359715 358766 358167 358211 358639 359092 359602 360632 362652 365673 369140 372292 374662 376287 377506
60684 377506 378680 380077 381816 383766 385595 387167 388793 390842 393104 394905 395941 396663 397634 398873 400102
60669 400102 401231 402138 402285 401173 399092 396832 394684 392377 390003 388195 387132 386057 384303 382298 380974
60654 380974 380584 380641 380740 380852 381005 381245 381894 383242 384930 386126 386412 386175 385983 385901 385569 384675 383153 381103
60636 381103 378651 375935 373183 370837 369431 369169 369648 370197 370494 370722 371179 371911 372706 373284 373455 373253 372911
60619 372911 372672 372646 372878 373415 374199 375082 376010 377008 377838 377980 377236 376166 375570 375688 376236 377043 378190 379590
60601 379590 380977 382354 383995 385840 387314 387985 388061 388049 388279 388944 390211 391846 393062 393305 393095 393595 395240
60584 395240 397250 398642 399307 399790 400401 401034 401813 403380 406241 410083 414063 417754 421551 426096 431486
60569 431486 437285 443235 449666 456974 464842 472388 479237 486078 493723 501721 508411 512503 514193 514506
60555 514506 513991 512495 509929 506615 502957 499352 496540 495480 496468 498674 500963 503141 506125 510886 517410
60540 517410 524772 532114 539427 547374 556532 566962 578355 590157 601468 611283 619199 625578 630712
60527 630712 634188 635545 635180 633952 632088 629268 625695 622214 619175 615991 612200 608284 605036 602671
60513 602671 601073 600389 600784 601990 603658 605991 609543 614532 620718 627838 635875 645079 655976 669134
60499 669134 684689 702362 722114 744410 769507 796905 825900 856242 887649 918926 948239
60488 948239 974173 995994 1012874 1023401 1026098 1020291 1006545 986392 961500 932822 900687 865852
60476 865852 830112 795483 762988 732610 704165 677692 653112 630115 608623 589105 572273
60465 572273 558470 547241 537472 528197 519377 511588 504870 498391 491536 484781 478946 474055 469518 465099
60451 465099 460986 457117 453183 449291 445983 443477 441353 439110 436722 434609 433256 432746 432452 431489 429743
60436 429743 428101 427330 427144 426837 426306 425793 425136 424115 423172 422876 422887 422422 421558 421088 421194 421314 421346 421799 422607
60417 422607 422899 422428 422184 423050 424689 426299 427686 428950 429835 430141 430294 430839 431681 432370 432831 433328 433979
60400 433979 434724 435522 436248 436611 436472 436030 435543 435255 435672 437350 440123 443051 445458 447573 449834 452117
60384 452117 454017 455414 456335 456776 457117 458205 460511 463613 466945 470530 474395 477806 479870 480676 481159
60369 481159 482031 483435 485466 488310 491905 495895 499849 503154 505061 505485 505517 506444 508357 510368 512082
60354 512082 514058 516787 520107 523872 528473 534186 540481 546461 551734 556502 560983 564986 567906 568994
60340 568994 567874 565016 561465 557899 554154 549830 545070 540372 535873 531308 526687 522542 519320 516908
60326 516908 515026 513753 513244 513070 512387 510837 508814 506722 504537 502439 501302 501817 503419 504933 506314
60311 506314 508973 514064 521112 528757 536419 544681 554315 565434 577603 590387 603591 617000 629840
60298 629840 640617 647774 650647 649639 645450 638454 628845 617037 603686 589552 575479 562227 550221
60285 550221 539657 530888 524285 519550 515608 511518 507217 503153 499484 495959 492366 488825 485745 483613
60271 483613 482556 481965 480899 479058 477085 475765 475281 475384 475785 476075 475724 474644 473399 472508 471848 471093
60255 471093 470391 470166 470512 471183 471935 472527 472728 472690 472949 473658 474202 474055 473600 473534 473890 474323 475004 476399 478339
60236 478339 480109 481363 482226 482611 482282 481597 481334 481614 481821 481839 482587 484861 488228 491544 494164 496263 498305
60219 498305 500583 503042 505267 506881 508144 509901 512796 516762 521396 526416 531577 536573 541323 546049
60205 546049 550797 555214 559118 562928 567105 571376 574985 577670 579924 582292 584686 586492 587134 586505 585068
60190 585068 583592 582646 582218 581843 581067 579718 577844 575627 573400 571523 570039 568529 566466 563745 560702
60175 560702 557632 554407 550700 546501 542292 538776 536500 535597 535718 536250 536808 537499 538631 540266 542260
60160 542260 544571 547131 549469 550868 551055 550446 549681 549206 549340 550230 551588 552853 553849 554931 556321 557797
60144 557797 559258 561081 563499 566095 568413 570704 573543 577038 580949 585291 590230 595543 600754 605724
60130 605724 610558 615070 618825 621638 623588 624719 625252 625891 627164 628562 629041 628424 627642 627484 627779 627961
60114 627961 627746 627002 625645 624098 623298 623678 624446 624348 622917 620666 618254 615930 613612 611107 608212 604895
60098 604895 601470 598481 596265 594672 593222 591618 590125 589384 589789 591147 592961 594825 596483 597769 598752
60083 598752 599694 600639 601322 601733 602347 603305 603793 602940 601111 599493 598398 596811 593817 589734 585463 581284
60067 581284 576740 571413 565416 559318 553776 549074 544967 541162 537879 535503 533746 531679 528715 525114
60053 525114 521418 517939 514934 512718 511364 510733 510979 512448 514892 517417 519591 521969 525036 528238 530717
60038 530717 532601 534785 537580 540253 541918 542346 541806 540536 538545 535819 532589 529348 526455 523724 520627
60023 520627 516934 512842 508483 503783 498913 494303 489942 485245 480083 475356 471960 469569 467119 464233
60009 464233 461435 459186 457457 456260 455859 456178 456554 456337 455422 454056 452414 450593 448791 447320 446482 446380
59993 446380 446748 447095 447257 447687 448940 450966 453220 455357 457440 459542 461569 463490 465354 466939 467789
59978 467789 467762 467269 466741 466126 465109 463631 461957 460315 458743 457266 456039 455261 454992 455136 455584 456330 457390
59961 457390 458691 460189 462062 464533 467389 469924 471593 472619 473707 475225 476888 478140 478589 478116 476891
59946 476891 475423 474333 473873 473756 473532 473048 472469 471884 471049 469561 467343 464908 463073 462342 462587 463371 464450
59929 464450 465843 467523 469282 470979 472825 475290 478666 482718 486821 490510 493850 497192 500642 504019
59915 504019 507285 510687 514311 517774 520623 522899 525085 527564 530281 532821 534676 535608 535978 536596 537960
59900 537960 539778 541421 542662 543586 543966 543346 541847 540349 539608 539613 540146 541529 544227 547892 551434 554176
59884 554176 556485 559089 562159 565377 568592 571972 575528 578887 581713 584140 586647 589533 592545 594984
59870 594984 596179 595983 594799 593134 591198 589065 586986 585210 583563 581604 579286 577066 575238 573580
59856 573580 571941 570742 570479 571035 571982 573350 575543 578600 582133 585958 590108 594111 596907 597913 597700
59841 597700 597183 596458 594960 592608 590226 588712 588115 587718 586835 585303 583263 580737 577679 574362 571379
59826 571379 569047 567021 564720 561982 559070 556172 553286 550513 548050 545835 543578 541237 539164 537625
59812 537625 536453 535280 533892 532337 530867 529788 529072 528147 526432 524124 522066 520791 520120 519694 519287
59797 519287 518393 516204 512570 508549 505403 503293 501478 499604 498124 497419 497090 496420 495171 493640 492130
59782 492130 490665 489289 488379 488355 489035 489587 489401 488907 489150 490565 492492 494002 494893 495741 497264 499780 503098
59765 503098 506749 510455 514323 518378 522069 524709 526455 528312 530991 534272 537710 541373 545478 549769
59751 549769 553766 557391 560899 564442 568104 572182 576936 582164 587335 592052 596157 599579 602392 604815
59737 604815 606868 608254 608893 609245 609666 609678 608414 605716 602385 599328 596888 595034 593828 593458 593872 594464
59721 594464 594284 592882 590895 589381 588443 587062 584607 581906 580257 579805 579585 578879 577786 576566 575228
59706 575228 573934 573156 573153 573637 574095 574212 573952 573537 573377 573689 574126 574062 573221 571804 570130 568464 567128 566367
59688 566367 566074 565970 565956 566030 565956 565459 564690 564080 563744 563351 562559 561202 559140 556388 553391 550699 548242 545351
59670 545351 541619 537410 533425 530080 527364 524987 522565 519934 517368 515304 513925 513200 513114 513449 513601
59655 513601 513217 512960 513965 516371 519011 520730 521468 521814 522053 522081 521832 521296 520342 518891 517118 515240 513296
59638 513296 511378 509862 509109 509027 509127 509002 508634 508346 508484 509008 509406 509187 508459 507665 506773 505153 502502 499469
59620 499469 497014 495407 494169 492781 491060 488928 486285 483293 480548 478771 478303 478943 480255 481983 484112
59605 484112 486573 489065 491291 493248 495072 496705 497976 498978 500059 501383 502696 503661 504229 504649 505199
59590 505199 505995 506881 507495 507566 507189 506680 506119 505224 503746 501891 500310 499653 500061 500996 501601 501360 500408 499250
59572 499250 498342 497902 497782 497411 496227 494461 493182 493183 494104 494996 495449 495683 495803 495618 495122 494515 493761 492742
59554 492742 491884 492012 493388 495416 497469 499497 501629 503738 505789 508184 511360 515308 519832 524998 531028
59539 531028 537955 545800 555009 566236 579385 592802 603628 609428 609922 607058 603200 599352 595308
59526 595308 591052 587266 584525 582758 581716 581397 581729 582337 582910 583454 583927 583963 583165 581346 578332 573983
59510 573983 568594 562831 557046 551063 544894 539155 534387 530379 526593 522934 519697 517031 514829 512860
59496 512860 510645 507564 503602 499807 497530 497223 498252 499701 500945 501673 501878 501901 502185 502879 503894 505218
59480 505218 506892 508740 510444 511966 513634 515767 518355 521168 524076 527198 530751 534714 538720 542433
59466 542433 545920 549412 552708 555240 556836 558017 559375 561094 563334 566546 570888 575645 579871 583521
59452 583521 587417 592120 597348 602494 607216 611309 614507 616691 618060 618739 618403 616587 613347 609383 605472
59437 605472 601984 598984 596551 594784 593561 592581 591746 591309 591533 592339 593529 595247 597986 602111 607525
59422 607525 613861 620889 628718 637689 648056 659735 672400 685806 699851 714386 729260 744556
59410 744556 760196 774926 786207 791749 791107 785533 776756 766485 756529 748253 741878 737237 735194
59397 735194 737092 742305 747315 748067 742942 733140 720911 708095 695701 683892 672343 661131 651197
59384 651197 643559 638289 634665 632066 630220 628846 627658 626693 626161 625961 625750 625462 625392 625716 626298 627021 628055
59367 628055 629650 631839 634445 637319 640515 644167 648135 651896 655069 658028 661628 666217 671294 676287
59353 676287 681288 686799 693129 700313 708309 716955 725961 735280 745220 755897 766770 777029 786243
59340 786243 794362 801301 806870 810942 813383 813988 812751 809942 805605 799200 790224 779163 767403 756114
59326 756114 745398 734598 723240 711606 700462 690315 681117 672792 665769 660549 656792 653376 649513
59313 649513 645354 641360 637657 634301 631617 629829 628712 628098 628378 630044 632981 636729 641268 647078 654345
59298 654345 662317 669315 673262 672633 667399 659073 649607 640317 631780 624234 617701 611996 606989 602717
59284 602717 599111 596006 593616 592581 593197 595004 597443 600478 604238 608532 613287 618953 625917 633781
59270 633781 641889 650234 659239 668802 678206 686865 694627 701401 706970 711149 713747 714511 713456 711156
59256 711156 708310 705133 701424 697048 692082 686792 681742 677502 673921 670138 665805 661786 659071 657525
59242 657525 656429 655797 656234 657745 659600 661348 663203 665454 668168 671407 675007 678214 680225 681105 681503
59227 681503 681541 680705 678797 676252 673397 670116 666332 662103 657121 650832 643329 635580 628557 622606 617656
59212 617656 613439 609384 604928 600119 595449 591080 586838 582979 580148 578362 576761 574715 572531 570745
59198 570745 569404 568475 568326 569206 570614 571748 572320 572530 572508 572292 572193 572742 574212 576410 578949 581610 584485
59181 584485 587783 591469 595147 598467 601551 604760 608170 611561 614895 618457 622499 626988 631705 636286
59167 636286 640332 643802 647243 651209 655479 659225 661878 663451 664091 663775 662470 660191 656925 652818 648324
59152 648324 643715 638587 632438 625654 619294 613827 608630 602863 596396 589782 583780 578915 575061 571440
59138 571440 567500 563712 560974 559315 557850 555982 553920 551964 550141 548746 548410 549210 550396 551448 552836
59123 552836 555255 558620 562331 566175 570514 575838 582411 590081 598180 605938 613245 620680 628526 636169
59109 636169 642801 648443 653866 659664 665718 671498 676629 681120 685091 688353 690424 691084 690668 689577 687830
59094 687830 685464 683016 681034 679363 677559 675794 674569 673634 672052 669470 666519 663766 661015 657842
59080 657842 654196 650186 645886 641527 637315 632921 627832 622319 617345 613287 609587 605897 602716 600432
59066 600432 598553 596452 594170 591929 589521 586821 584349 582621 581322 579720 577616 575403 573482 572085
59052 572085 571358 571185 571160 571022 570834 570551 569912 569040 568643 569154 570129 570886 571271 571374 571056 570388 570215 571512 574219
59033 574219 577211 579418 580732 581876 583681 586457 589935 593824 598320 603851 610477 617981 626380 635758
59019 635758 645689 655463 664892 674088 682447 688749 692577 694748 696001 696137 694833 692428 689377 685806
59005 685806 682184 679657 678973 679685 681015 682776 684897 686858 688492 690603 693866 697679 701022 703927 707097
58990 707097 710526 713560 716075 718522 720869 722411 722705 721933 720285 717712 714456 711322 709220 708634 709436
58975 709436 711047 713055 715887 720499 727122 734870 742894 751253 760052 768526 775865 782423 789098 795895
58961 795895 802180 808151 814876 822640 830157 835765 838865 839888 839315 836998 832301 824855 815222 804636
58947 804636 793927 783047 771786 760453 749472 738857 728652 719433 711818 705813 701104 697549
58935 697549 694871 692363 689586 686934 684905 683344 682050 681490 681998 682817 682999 682839 683289 684239 684624 684083
58919 684083 683279 682483 681126 679068 677186 676223 675941 675896 676277 677418 679106 680950 683043 685790 689434 694118
58903 694118 700078 707405 715707 724327 732847 741314 750021 759114 768368 777501 786720 796644 807505 818824
58889 818824 830199 842052 855134 869568 884818 900328 915601 929837 942073 951732 958766 963405
58877 963405 965997 966784 965455 961312 954237 945124 934907 923630 911049 897714 884731 872743 861758
58864 861758 851746 842750 834635 827224 820372 813550 805900 797348 789027 781831 775131 767837 760160 753207
58850 753207 747276 741766 736489 731812 727560 723011 718003 713008 708046 702602 696630 690585 684355 677323
58836 677323 669679 662542 656461 650784 644888 639083 633904 629366 625370 622085 619517 617399 615875 615597
58822 615597 616719 618415 619822 620926 622184 623786 625634 627621 629712 632036 634915 638363 641669 644082
58808 644082 645834 647753 649836 651038 650644 649086 647182 645254 643211 640882 638044 634653 631190 628214
58794 628214 625572 622616 619131 615348 611200 606513 601925 598550 596570 595145 593918 593558 594447 595883 597133
58779 597133 598344 599825 601199 601931 602095 602080 602054 602116 602334 602173 600538 596974 592428 588315 585232 582939 581080
58762 581080 579468 577995 576703 575762 575190 574877 574898 575451 576483 577852 579810 582709 586237 589655 592750 595835
58746 595835 598812 601175 603061 605277 607999 610455 612359 614719 618591 623733 629091 634014 638468 642614
58732 642614 646756 651313 656422 661848 667426 673058 678205 682123 684914 687571 690693 693797 696228 698031
58718 698031 699591 701127 702921 705388 708524 711923 715643 720254 725642 730495 733497 734453 733850 731976 728880
58703 728880 724516 718510 710427 700683 690520 680673 670737 660209 649392 638777 628287 617741 607470
58690 607470 597969 589433 581978 575676 570104 564554 559108 554675 551645 549345 547241 545669 544764 543711
58676 543711 541875 539901 538878 539031 539979 541562 543669 545897 548199 551335 555950 561744 568217 575578 584130
58661 584130 593257 601787 608916 614179 617115 617692 616606 614434 610946 605908 600053 594533 589840 585849
58647 585849 582462 579507 576505 573262 570339 568358 567247 566722 566962 568144 569803 571394 573080 575304 577915
58632 577915 580344 582310 583827 584837 585341 585549 585451 584702 583336 582150 581955 582867 584646 587175 590278 593669
58616 593669 597346 601444 605552 609036 612154 615752 619609 622423 623978 625850 629126 632709 634918 635576
58602 635576 635409 634601 633269 632340 632504 633063 633098 633106 634198 636399 638946 641529 644033 645872 647000 648833 652665
58585 652665 657797 662769 667773 674138 681936 689926 697617 705584 713766 721226 727788 734325 741125 747390
58571 747390 752691 757745 763462 770293 778640 788725 799811 810746 821596 833818 848478 865161
58559 865161 882776 900489 917632 933585 948058 960840 971101 977626 979884 978389 974164 968479
58547 968479 962782 957887 953248 947833 941564 935088 928425 920967 912658 903986 894693 883716 870759 856985
58533 856985 843832 831948 821527 812779 805575 799324 793623 788694 784899 782224 780359 779009 778059 777663
58519 777663 778015 778785 779048 778155 776324 774102 771735 769481 767783 766501 764619 761541 758062 755231 752882
58504 752882 750283 747531 745121 742656 739370 735686 732948 731679 731263 731262 731883 733041 734036 734390 734294 734220 734694
58487 734694 736229 738770 741549 744234 747746 753098 759889 766995 774222 782128 790605 798939 807038 815341
58473 815341 823626 831010 836976 841327 843426 842702 839765 835844 831340 826114 820913 817083 814869 813354
58459 813354 812195 812135 813707 816557 820288 824953 830554 836872 843770 850847 857052 861525 864530 866594 867204
58444 867204 865542 862129 858412 854976 851444 847902 845054 843124 841938 841890 843443 845861 847878 849570 852178
58429 852178 856099 860401 864350 868092 871884 875895 880649 886421 892312 897126 900860 904047 906179 906348
58415 906348 905141 904090 903385 901811 898857 895224 891299 886882 882393 878717 875786 872906 870371 869137
58401 869137 869006 868888 868772 869628 871467 873393 875534 879000 883839 888938 893959 899438 904983 909470 913103
58386 913103 917243 922091 926671 931164 936947 944040 950815 956607 962346 968298 973535 978122 983336 989163
58372 989163 994000 997595 1001887 1008045 1015010 1021894 1029532 1038525 1047871 1056730 1065748 1075670 1086359 1097852
58358 1097852 1110576 1123883 1136402 1148279 1160841 1173544 1183866 1191024 1197211 1204170 1211202 1217724
58346 1217724 1225063 1234114 1243622 1252471 1261575 1271939 1282920 1293907 1305799 1319329 1333829 1348924
58334 1348924 1365510 1383802 1402476 1420953 1440357 1460928 1480795 1498788 1516126 1533812 1550696
58323 1550696 1565790 1580224 1595068 1609382 1622380 1635460 1650092 1665515 1680472 1695536 1711919
58312 1711919 1729598 1748224 1768281 1789874 1812089 1834889 1859766 1887181 1915385 1943106 1971310
58301 1971310 2000995 2031464 2062179 2093963 2126920 2159647 2192080 2226548 2264358 2303855 2343562
58290 2343562 2384508 2427685 2471995 2516775 2563609 2613552 2665268 2718040 2773824 2834124 2897641
58279 2897641 2963347 3033044 3108507 3188944 3273757 3364773 3463055 3566454 3673179 3784944 3903763
58268 3903763 4028528 4157810 4293288 4437254 4589253 4748039 4914096 5087330 5265181
58259 5265181 5446014 5631509 5822891 6018049 6215541 6417967 6627849 6843413 7062022
58250 7062022 7284573 7512945 7746650 7985964 8234976 8497242 8771398 9054806 9348202
58241 9348202 9652812 9966619 10287873 10618914 10962332 11316981 11682005 12060885 12457098
58232 12457098 12869919 13299012 13748699 14222738 14719492 15237457 15780735 16353650 16955010
58223 16955010 17583366 18242567 18936019 19661393 20417931 21213599 22058502 22957588 23917080
58214 23917080 24950971 26072819 27287925 28601699 30027209 31574380 33240479 35023350
58206 35023350 36937343 39006530 41253372 43708675 46424100 49461267 52879707 56752296
58198 56752296 61182560 66291618 72204070 79067864 87070634 96409852 107264587 119826305
58190 119826305 134333633 151035746 170135779 191757821 215758384 241205098 265837767
58183 265837767 286228154 298920461 301869045 295129640 280451484 260319625 237162279
58176 237162279 212970446 189200010 166813549 146393226 128247654 112462336 98934513
58169 98934513 87444896 77736949 69551663 62633845 56751997 51720742 47394360 43647119
58161 43647119 40373178 37495305 34955197 32697167 30671198 28844236 27194371 25697135
58153 25697135 24327665 23071020 21918848 20858983 19877774 18968871 18130025 17354025 16631246
58144 16631246 15958046 15334235 14754845 14211989 13702127 13223989 12771936 12338877 11923779
58135 11923779 11529431 11154685 10795362 10450875 10123384 9811768 9512353 9224350 8949101
58126 8949101 8685299 8430122 8183786 7948128 7722045 7502968 7291294 7088855 6894625
58117 6894625 6706437 6525239 6353139 6188775 6029118 5874465 5727252 5587316 5452519
58108 5452519 5322749 5199088 5080276 4964057 4850884 4742405 4637481 4533590 4431025
58099 4431025 4331881 4235986 4141508 4048554 3958595 3871477 3786459 3704958 3628694 3556311 3485392
58088 3485392 3416514 3351682 3290091 3229270 3169224 3111521 3055281 2998146 2940525 2884919 2831557
58077 2831557 2778487 2725569 2674582 2625617 2577071 2529074 2483342 2439588 2395549 2350725 2306915
58066 2306915 2264831 2223265 2181829 2141602 2102842 2064773 2027728 1992800 1959278 1925054 1889692
58055 1889692 1854604 1820257 1785775 1751326 1718348 1687262 1657302 1628543 1601759 1576352 1550834
58044 1550834 1525306 1501100 1478172 1455234 1432308 1410600 1389939 1368877 1347361 1326826 1307558
58033 1307558 1288384 1269057 1250525 1232700 1214386 1195594 1177595 1160447 1142732 1123931 1104851
58022 1104851 1085616 1065566 1045347 1026698 1009869 993450 976996 961527 947231 933071 919110
58011 919110 906811 896463 886476 875866 865316 855218 844857 834251 824750 816992 810053 803249
57999 803249 796996 791275 785185 778703 773069 768626 764000 758182 751752 745205 737574 727619 715197 700916
57985 700916 685687 671048 658531 648180 638870 630257 622964 616715 610023 602206 594169 586756 579849
57972 579849 573470 568101 563408 558205 552281 546820 542510 538671 534707 530896 527257 523190 518811 515210
57958 515210 512786 510742 508686 507235 506494 505440 503473 501125 498642 495310 490881 486293 482284 478586
57944 478586 475122 472672 471703 471724 472347 473710 475415 476505 477034 478270 480761 483667 486542 490125 494589
57929 494589 498615 501210 503015 504813 506054 505867 504290 501507 497106 491159 484929 479404 474067 468078
57915 468078 461680 455564 449883 444875 441382 439665 438597 437184 436097 436644 438779 441077 442217 441772 440053
57900 440053 437878 436020 434432 432531 430390 428734 427458 425347 421822 417863 414586 411990 409783 408244
57886 408244 407429 406595 405372 404544 404757 405343 405367 404976 404781 404620 403842 402186 399654 396252 392543 389611 387700
57869 387700 385736 382968 380181 378415 377398 376300 375270 375132 376105 377809 380066 382842 385848 388929 392362
57854 392362 396076 399199 401128 402476 404213 406378 408263 409287 409116 407611 405275 403088 401321 399288
57840 399288 396764 394587 393101 391169 387837 384056 381427 379923 378066 374971 371061 367110 363640 361042
57826 361042 359452 358606 358339 358826 359903 360817 361249 361833 363048 364373 365280 366091 366946 366860 364965 361933 359001
57809 359001 356237 352922 348917 344460 339305 333445 328128 324702 322781 320919 318763 317153 316351 315723 315180
57794 315180 315500 316994 319036 321125 323463 326357 329956 334569 340235 345984 350533 353869 357178 361152
57780 361152 365338 369281 373252 377602 382225 387005 391997 396898 401039 404125 406382 407830 408133 407312 405926
57765 405926 404293 402103 399001 395059 390513 385560 380463 375425 370343 365222 360768 357877 356463 355464
57751 355464 354189 353073 352883 353729 355132 356639 358054 359320 360445 361418 362103 362346 362170 361729 361205 360813
57735 360813 360678 360555 360042 359260 358904 359334 360135 360980 362366 364819 367867 370524 372473 373998 374998 374930 373710
57718 373710 371947 370188 368417 366324 363695 360623 357635 355386 353934 352667 351183 349678 348060 345525
57704 345525 341795 338079 335740 334486 332935 330622 328267 326324 324520 322832 321764 321419 321319 321359 322015
57689 322015 323398 324930 326168 327178 327923 328145 328122 328807 330872 334202 338513 343819 350140 357417 365968
57674 365968 376432 389080 403735 420553 440231 463311 489889 520181 554529 592220 630477
57663 630477 664805 690165 702298 699132 681694 653536 618985 581856 545209 511228 480903 454239
57651 454239 430955 410759 393228 378109 365668 356059 348487 341806 335900 331559 328860 326695 324223
57638 324223 321850 320261 319254 318136 316709 315321 314300 313768 313655 313617 313296 312864 312841 313248 313472 313173 312683
57621 312683 312224 311427 310041 308515 307363 306412 305250 304001 303089 302452 301515 299928 298009 296410 295508 295069
57605 295069 294519 293635 292806 292359 291912 290872 289363 288060 287210 286520 285958 285809 285839 285281 283904 282291 280727
57588 280727 278694 275957 273326 271658 270676 269498 267936 266577 265871 265693 265627 265253 264395 263425 262963 262951 262436
57571 262436 260740 258412 256469 255037 253487 251723 250556 250644 251642 252657 253171 253281 253264 253255 253326 253629 254292 255259
57553 255259 256455 258064 260286 262661 264108 264082 263466 263750 265399 267466 268688 268503 267132 265256 263609
57538 263609 262351 260891 258783 256578 255103 254115 252638 250648 249394 249708 250874 251648 251680 251534 251981 253683
57522 253683 256937 261223 265427 268777 271173 272593 273046 273269 274409 276492 278156 278533 278496 279263 280642 281533
57506 281533 281502 280816 279515 277556 275572 274421 274139 274182 274562 275885 278371 281633 285407 289788 294742 300038
57490 300038 305711 312008 318832 325680 332108 337840 342620 346406 349592 352441 354494 355060 354213 352733 351178
57475 351178 349562 347798 345811 343251 339718 335377 330876 326607 322510 318583 315113 312306 310120 308487
57461 308487 307366 306603 306099 306000 306346 306658 306405 305751 305359 305542 306152 307248 309197 311965 314909 317456 319565
57444 319565 321363 322823 324037 325422 327372 329935 332973 336360 339905 343310 346341 348939 351147 353145
57430 353145 355277 357800 360640 363645 366931 370602 374295 377492 380283 383271 386670 389984 392727 394975
57416 394975 396989 398806 400539 402655 405512 408872 412281 415758 419654 423930 428079 431885 435816 440362
57402 440362 445218 449542 452995 456190 459939 464427 469387 474799 480920 487642 494329 500449 506076 511617
57388 511617 517300 523099 528877 534499 539970 545550 551477 557610 563700 569944 576684 583566 589737 595165
57374 595165 600977 607957 615402 622146 628125 634127 640436 646665 652750 659189 666256 673729 681499 689803
57360 689803 698703 707831 716822 725718 734950 745218 757120 770379 783646 795736 806902 818252
57348 818252 830041 841458 852078 862550 873477 884468 894895 904952 915317 926180 937234
57337 937234 948419 960045 972195 984504 996657 1008875 1021703 1035404 1049652 1063901 1077994
57326 1077994 1092298 1107202 1122730 1138765 1155367 1172589 1190169 1207717 1225041 1242036 1258523
57315 1258523 1274631 1291063 1308499 1326850 1345584 1364610 1384264 1404621 1425523 1447235 1470331
57304 1470331 1494894 1520505 1547132 1575178 1604417 1633650 1661962 1689707 1717770 1746350 1775069
57293 1775069 1803887 1833269 1863579 1894831 1927043 1960486 1995545 2032437 2070987 2110634 2150883
57282 2150883 2191861 2234157 2277993 2322884 2368248 2414003 2460308 2507064 2554076 2601573 2650279
57271 2650279 2700985 2754136 2809642 2866970 2925642 2985791 3048023 3112615 3179050 3246451 3314160
57260 3314160 3381777 3448998 3515882 3583127 3651771 3722540 3795511 3870255 3946199 4023036 4100923
57249 4100923 4180174 4260722 4342026 4423516 4504870 4585791 4665867 4744762 4822366 4898633 4973464
57238 4973464 5046852 5118844 5189363 5258346 5326193 5393800 5461959 5530915 5600477 5670215 5739524
57227 5739524 5807910 5875474 5942869 6010751 6079588 6149996 6222684 6297848 6375063 6453951 6534494
57216 6534494 6616433 6698899 6780949 6861946 6941022 7016753 7088023 7154911 7218260 7278808 7337391
57205 7337391 7395607 7455349 7517608 7582337 7649396 7718911 7790490 7862684 7933559 8001546 8065638
57194 8065638 8125230 8180246 8231382 8280019 8327872 8376541 8427133 8480093 8535419 8592931 8652338
57183 8652338 8713283 8775678 8839902 8906365 8974918 9045108 9117180 9192664 9273882 9363094 9462165
57172 9462165 9572680 9695759 9831355 9977577 10130767 10286425 10440393 10589709 10733080
57163 10733080 10871213 11006726 11143103 11283035 11427363 11575270 11724934 11873623 12017492
57154 12017492 12152001 12273224 12379311 12471093 12551210 12621935 12683145 12732179 12765637 12781235
57144 12781235 12778304 12757549 12721266 12673450 12618526 12559215 12495583 12425993 12348614 12262121 12165837
57133 12165837 12059920 11945312 11823071 11693613 11556758 11412518 11261795 11106541 10949468
57124 10949468 10793444 10640691 10492210 10347900 10207263 10069895 9935305 9802450 9669911
57115 9669911 9536893 9404303 9274986 9153041 9042863 8948420 8872661 8816891 8780539 8761937
57105 8761937 8759953 8775393 8811132 8871157 8959703 9081390 9242331 9451572 9722426 10073518
57095 10073518 10529488 11121216 11885004 12859764 14081893 15579439 17368276 19451420 21819803
57086 21819803 24451822 27309432 30329696 33414576 36429302 39221253 41656462 43649359
57078 43649359 45161190 46172266 46661266 46615022 46054669 45045167 43676400 42035263 40191935
57069 40191935 38203228 36121196 33998227 31887623 29840790 27902236 26105311 24471086
57061 24471086 23009230 21718896 20590323 19608626 18758170 18024631 17394755 16855950 16396455
57052 16396455 16005319 15672298 15388419 15146580 14941267 14767970 14623227 14504641 14409874
57043 14409874 14335651 14278220 14234499 14202141 14178732 14161712 14149131 14140031 14134314 14132844 14137484 14150267
57031 14150267 14172331 14204072 14246221 14300151 14366605 14443716 14525523 14602160 14662769 14700214 14714049
57020 14714049 14709098 14691417 14665690 14635309 14603139 14571618 14542824 14518827 14501412 14491188 14487441
57009 14487441 14489150 14495913 14507875 14525300 14548442 14577410 14611833 14650783 14693002 14736901 14780354
56998 14780354 14820933 14856639 14886449 14910325 14929135 14944503 14958370 14972460 14988143 15006470 15027915
56987 15027915 15052218 15078944 15108195 15140455 15175784 15213432 15252035 15289659 15323808 15352078 15373212
56976 15373212 15387460 15395965 15400008 15400656 15398750 15395154 15391022 15387497 15384859 15382357 15379199 15375226 15370149 15362807
56962 15362807 15351984 15337544 15319819 15298337 15272455 15243141 15212593 15181388 15146874 15104980 15053034
56951 15053034 14990591 14918602 14838749 14753304 14664853 14576007 14489297 14406838 14329711 14257968 14191378
56940 14191378 14129913 14073531 14022042 13975363 13933301 13894939 13858778 13823624 13788764 13753127 13715073
56929 13715073 13673164 13626223 13572208 13508154 13432275 13345582 13250672 13149391 13042464 12930761
56919 12930761 12815685 12698430 12579931 12461597 12345161 12231482 12120178 12010622 11902636
56910 11902636 11795943 11689651 11582857 11475437 11367829 11260228 11152398 11044075 10935209
56901 10935209 10825940 10716771 10608828 10503496 10401466 10302242 10204844 10109018 10015569 9925515
56891 9925515 9839175 9756189 9676089 9598552 9523288 9450062 9378706 9308695 9238544 9165944 9088669
56880 9088669 9005301 8915285 8818750 8716478 8609712 8499720 8387585 8274434 8161623 8050562
56870 8050562 7942464 7838290 7738695 7643909 7553793 7468120 7386815 7309994 7237958 7171017 7109135
56859 7109135 7051631 6997052 6942755 6884345 6816242 6734079 6637069 6527967 6410959 6289992 6168556
56848 6168556 6049562 5934599 5823702 5716233 5611714 5509776 5410073 5312815 5219041 5130015
56838 5130015 5046632 4969601 4899705 4837582 4783624 4738118 4700395 4666744 4629457 4579052 4508225
56827 4508225 4414292 4299008 4167103 4024731 3877950 3731592 3589137 3453345 3326529 3210105
56817 3210105 3104218 3008072 2920716 2841607 2770589 2707468 2651761 2602989 2561124 2526416 2498663
56806 2498663 2476678 2458129 2439242 2414694 2378763 2327624 2260923 2181344 2093130 2000963 1909217
56795 1909217 1821100 1738239 1661312 1590892 1527380 1470471 1419321 1373372 1332663 1297343 1267234
56784 1267234 1241954 1221180 1204628 1191901 1182358 1174899 1167619 1157666 1141763 1117441 1084250 1043863
56772 1043863 998861 951419 903105 855345 809334 765527 723865 684644 648608 616015 586267
56761 586267 558827 533989 512198 492939 474879 457019 439321 422239 406002 390428 375278
56750 375278 360648 346909 334195 322179 310558 299563 289626 280702 272373 264444 256851 249131 240782
56737 240782 232195 224435 217899 211931 205987 200313 195166 190189 185120 180352 176192 172179 167726 162933
56723 162933 158217 153736 149683 146494 144086 141542 138327 135276 133549 133012 132480 131133 128892 125779 121882
56708 121882 117813 114332 111602 109383 107641 106259 104542 101964 99169 97249 96169 94944 93339 92306
56694 92306 92505 93407 94213 94808 95362 95746 95838 95958 96464 97259 98010 98593 99077 99475 99692 99581 99031 98206 97611
56675 97611 97634 98070 98454 98759 99374 100443 101666 102787 103872 105125 106745 108968 111940 115503 119379 123370
56659 123370 127107 129895 131358 132080 133036 134437 135652 136223 136375 136461 136428 135991 135024 133676 132351 131512 131248
56642 131248 131154 130880 130572 130428 130177 129529 128860 128835 129468 130175 130641 131023 131353 131371 130997 130465 129940 129448 129071 128760
56622 128760 128046 126434 123987 121069 117771 114152 110708 107859 105184 102014 98671 96213 94953 94166 93331
56607 93331 92738 92638 92700 92720 93093 94057 95014 95102 94123 92640 91482 91242 91836 92444 92344 91839 91864 92698 93718
56588 93718 94489 95348 96652 98130 99348 100261 100961 101325 101311 101207 101320 101660 102142 102790 103623 104596 105687 106782
56570 106782 107568 107950 108433 109588 111219 112646 113743 115129 117364 120556 124709 129758 135208 140355 144911
56555 144911 148857 151838 153443 154011 154404 154982 155547 156126 156864 157268 156639 155317 154377 153972 153203 151837 150835
56538 150835 150673 150424 149201 147417 145851 144516 143301 142777 143355 144324 144744 144742 145014 145498 145406 144388 142931
56521 142931 141781 141386 141686 142090 141983 141453 141012 140494 138998 136268 133274 130916 129002 127130 125744 125427
56505 125427 125829 126168 126323 126573 126695 126166 125045 123959 123405 123578 124529 125879 126712 126384 125245 124175 123690
56488 123690 123848 124533 125374 125852 125987 126497 127860 129690 131444 133086 134575 135376 135178 134549 134231 134277 134458
56471 134458 134922 135748 136450 136689 136937 137641 138277 138157 137725 138084 139519 141379 143151 144762 145995 146489 146296
56454 146296 145762 144894 143460 141670 140210 139681 140339 142134 144594 146972 148927 150743 152576 154022 154847
56439 154847 155450 156074 156244 155733 155355 155934 157043 157706 157836 158013 158281 158244 158053 158292 159044 159936 160881 161934
56421 161934 162720 162849 162701 162905 163319 163416 163310 163415 163332 162239 160326 158810 158476 159094 160219 161618 162910
56404 162910 163764 164581 166148 168536 171057 173313 175445 177362 178591 179016 179019 178804 178310 177810 177834 178411 179053
56387 179053 179522 179931 180181 180088 180046 180743 182109 183382 184288 185344 186797 188068 188595 188644 188959 190045 191927
56370 191927 194177 196038 196954 197081 197021 197164 197635 198680 200572 203202 206161 209048 211446 212973 213833 214877
56354 214877 216658 218872 221198 223915 226960 229222 229856 229681 230099 231209 232222 233163 234618 236190 236887
56339 236887 236972 237774 239532 241101 242116 243838 247260 251770 256374 260937 265449 269176 271513 272920 274251
56324 274251 275792 277580 279975 283198 286783 290050 292775 295062 297026 298926 301146 303738 306357 308814
56310 308814 311252 313710 316085 318571 321574 325113 328907 333049 337884 343232 348466 353462 358697 364295
56296 364295 369760 374814 379771 384948 390350 395999 401940 407971 414092 421029 429407 438572 447362 455929
56282 455929 465525 476364 487125 497010 506948 518062 530089 542137 554110 566572 579833 593924
56270 593924 608974 625023 641833 659333 677847 697639 718751 741443 766168 792841 820811
56259 820811 849864 880703 914141 950430 989683 1032427 1079384 1131078 1187805 1249670 1316693
56248 1316693 1389248 1468121 1553484 1644080 1738126 1834797 1933948 2034708 2135332 2234118 2329261
56237 2329261 2417952 2496991 2564412 2619351 2660339 2685137 2692540 2683095 2657788 2617333 2563122 2497589
56225 2497589 2423082 2341312 2254141 2163716 2071467 1978077 1884789 1793605 1705927 1622129 1542710
56214 1542710 1468501 1399456 1334634 1273919 1218380 1168352 1122457 1079192 1038318 1000148 964743
56203 964743 932469 904073 879373 856944 835778 816254 798904 783420 769519 757542 747387
56192 747387 737919 728302 718996 710765 703622 697322 691974 687538 683606 680165 677661 675968 674343 672667
56178 672667 671559 671036 670381 669649 669816 671083 672582 674208 677055 681483 686437 691268 696431 701775 706122
56163 706122 709550 714130 721185 729578 737916 746706 756935 768258 780088 793041 807719 823424 839463
56150 839463 856488 875266 895478 917051 941210 968810 999049 1031293 1066844 1107424 1153207
56139 1153207 1203766 1259563 1320880 1386479 1454722 1524665 1594580 1660947 1720749 1773645 1820514
56128 1820514 1861454 1896994 1929517 1961046 1990462 2014828 2032496 2043151 2046120 2040988 2029252 2013298
56116 2013298 1994081 1971141 1943903 1911311 1871248 1822293 1765608 1703826 1639116 1573694 1510749
56105 1510749 1452761 1399813 1351270 1308092 1271738 1241990 1217795 1199127 1186028 1176861 1169650 1164296
56093 1164296 1161579 1160992 1161527 1163515 1167591 1172861 1178278 1184830 1194044 1205147 1216026 1226355 1237578
56080 1237578 1250361 1264150 1278659 1293883 1309204 1324213 1339674 1356092 1372447 1388105 1404608
56069 1404608 1423614 1444392 1465523 1487595 1511766 1537097 1561953 1586868 1613295 1640660 1667449
56058 1667449 1694221 1722678 1752629 1782655 1813028 1845183 1879064 1913623 1949138 1986355 2024192
56047 2024192 2061155 2098285 2137968 2180598 2225076 2271693 2321715 2375000 2430871 2490562 2556019
56036 2556019 2627131 2702780 2783485 2870276 2962152 3057573 3157182 3262162 3371518 3484180 3602095
56025 3602095 3727737 3860148 3997067 4139274 4288787 4444389 4603112 4764822 4931195
56016 4931195 5101761 5275526 5455032 5643970 5841745 6044926 6252833 6467076 6687193
56007 6687193 6912007 7144144 7387835 7643169 7907507 8181115 8465851 8759856 9059726
55998 9059726 9366960 9686119 10017663 10358900 10710907 11077790 11460022 11855567 12266951
55989 12266951 12700081 13156494 13633864 14133454 14659580 15212382 15788957 16391090 17023865
55980 17023865 17687510 18379502 19104542 19873890 20695579 21574413 22520587 23547974 24664366
55971 24664366 25873390 27184371 28608325 30145547 31791022 33553249 35456395 37526808
55963 37526808 39793614 42302332 45111482 48276387 51854827 55929467 60607814 66005417
55955 66005417 72255225 79531579 88034738 97950845 109458774 122771896 138126552 155719418
55947 155719418 175664903 197876319 221656625 245135734 265203450 278425857 282508962
55940 282508962 277224325 264171520 245784328 224424736 201978477 179811289 158840666
55933 158840666 139633610 122501825 107554040 94719384 83800318 74553776 66740567
55926 66740567 60129945 54505664 49688429 45540910 41948310 38809126 36045263 33602109
55918 33602109 31431658 29486351 27730492 26143286 24706061 23396724 22198462 21102272
55910 21102272 20097604 19169958 18309803 17514416 16778665 16092673 15450247 14850850 14291388
55901 14291388 13764414 13266230 12798549 12360106 11944419 11547894 11172544 10818456 10480798
55892 10480798 10156688 9848136 9555680 9275482 9005190 8746639 8500276 8262663 8031963
55883 8031963 7810425 7598889 7393899 7192732 6996672 6807068 6622616 6442667 6268947
55874 6268947 6101978 5939761 5781739 5630074 5485461 5345750 5210282 5081439 4960175
55865 4960175 4843942 4730722 4621346 4516197 4413492 4312558 4215118 4121523 4029372 3937707
55855 3937707 3849123 3765773 3686491 3609703 3535995 3465863 3397823 3330664 3264986 3200947 3137169
55844 3137169 3073353 3011280 2951740 2893075 2834136 2776080 2719948 2665074 2611214 2559596 2510524
55833 2510524 2462561 2415334 2370535 2328759 2288086 2247203 2207339 2169592 2132924 2096318 2060396
55822 2060396 2025242 1989099 1951018 1912636 1875605 1839282 1802502 1765618 1729304 1693307 1657868
55811 1657868 1624502 1593939 1565134 1537528 1512318 1490218 1469993 1450576 1432608 1416498 1401025
55800 1401025 1385408 1370798 1358171 1346491 1334430 1322126 1309761 1296216 1280656 1263723 1245810
55789 1245810 1225925 1203786 1181208 1159865 1139327 1118795 1098867 1079813 1059954 1037820 1014503
55778 1014503 991932 970144 948216 926674 906919 889146 872685 857635 844453 832593 821106
55767 821106 809930 799224 788156 775836 762838 750426 738803 727297 715726 704401 693286
55756 693286 682180 671230 660446 649266 637353 625160 613009 600418 587040 573487 560606
55745 560606 548726 538129 529174 521319 513180 504255 495498 487571 479819 471757 464189 457857 452165 446281
55731 446281 440357 434694 428857 422588 416511 410971 405334 399300 393645 388673 383322 376932 370578 365378
55717 365378 360763 355693 350379 345429 340583 335783 332275 330937 330473 328996 326572 324498 322863 320665
55703 320665 317809 315163 312851 310089 306674 303208 299825 295838 290719 284577 277806 270975 264757 259329
55689 259329 254268 249606 246279 244788 244262 243708 243328 243604 243993 243708 243095 242991 243378 243823 244532 245684 246398
55672 246398 245773 244440 243601 242952 241054 237574 233709 230415 227562 224957 223019 222094 221947 222135 222313 222210
55656 222210 221885 221878 222517 223295 223500 223180 222932 223070 223589 224529 225711 226456 226131 224657 222067 218160 213116 207806
55638 207806 202835 197875 192510 187073 182086 177684 174138 171980 170843 169178 166081 162493 159676 157540
55624 157540 155532 154074 153700 153667 152927 151788 151136 150621 149162 146770 144392 142291 139999 137573 135485 133531
55608 133531 131167 128681 126825 125583 124523 123954 124388 125219 125341 124742 124058 122980 120757 118070 116634 116905
55592 116905 117755 118426 119184 119920 119885 119176 118900 119347 119438 118564 117630 117626 118298 118839 118918 118531 117802 117355 117933 119282
55572 119282 120371 121003 122103 124052 125942 127043 127877 129093 130275 130645 130150 129068 127249 124612 121843
55557 121843 119833 118684 117835 116895 115894 114985 114241 113568 112650 111313 109943 109105 108740 108320 107804 107749 108333
55540 108333 109032 109478 109905 110395 110413 109579 108417 107815 108129 109146 110575 112216 113882 115399 116514 116794 115980
55523 115980 114479 113098 112237 111678 111162 110644 110028 109171 108268 107700 107368 106662 105182 103110 100837 98657 96811
55506 96811 95351 93915 92108 90159 88740 88173 88233 88640 89226 89720 89903 89971 90208 90423 90261 89888 89742 89798
55488 89798 89827 90200 91520 93494 95074 95828 96308 96946 97487 97704 97802 97811 97339 96246 94893 93489 91872 90109
55470 90109 88574 87212 85526 83611 82389 82378 82925 83105 82774 82296 81848 81489 81416 81661 81825 81538 80878 80195
55452 80195 79842 80137 81089 82046 82161 81398 80589 80382 80757 81642 83218 85290 87074 87993 88187 88006 87577 87111
55434 87111 86940 86901 86398 85412 84784 85011 85434 85153 84254 83574 83686 84589 85961 87227 87746 87435 86926 86773 86869
55415 86869 86946 87135 87634 88200 88441 88301 87903 87253 86444 85732 85038 83763 81622 79316 77870 77524 77712 77932
55397 77932 78194 78701 79474 80305 80923 81238 81422 81547 81241 80090 78459 77439 77756 79109 80687 81908 82528
55380 82528 82565 82414 82592 83104 83466 83536 83829 84710 85749 86260 86101 85590 84990 84364 83692 82879 81975 81460 81841
55361 81841 82799 83289 82788 81905 81407 81171 80582 79493 78300 77361 76815 76702 76876 77025 77093 77398 78049 78547 78312
55342 78312 77351 76159 75198 74690 74554 74336 73607 72705 72639 73921 75898 77583 78744 79771 80845 81743 82247
55325 82247 82319 82011 81483 80925 80356 79763 79496 80036 81156 81834 81386 80265 79399 79190 79512 80224 81153 81919 82233
55306 82233 82177 81878 81210 80124 78939 77969 77205 76665 76677 77438 78682 80073 81516 82767 83284 82955 82486 82541
55288 82541 82897 82942 82572 82048 81423 80774 80583 81148 81861 81837 81100 80475 80410 80552 80449 80037 79408 78620 77827 77146
55268 77146 76417 75519 74861 75094 76289 77859 79322 80737 82246 83567 84184 83887 83042 82328 82186 82476 82725
55251 82725 82691 82451 81976 81077 79894 78977 78610 78412 77955 77365 76964 76612 75885 74694 73406 72548 72639 73980
55233 73980 76169 78120 78994 78982 78891 79258 80159 81466 82759 83266 82543 81176 80351 80678 81710 82547 82668 82274
55215 82274 82059 82580 83725 84927 85849 86494 86701 86169 85182 84593 84704 84811 84332 83725 83643 83847 83762 83568 83823
55196 83823 84364 84551 84421 84637 85310 85761 85587 85198 85084 85157 85104 84934 84905 85156 85543 85730 85543 85335 85724 86735
55176 86735 87577 87590 86985 86250 85333 84053 82849 82330 82368 82395 82393 82769 83457 83981 84329 84911 85606 85751 85218 84750
55156 84750 84938 85510 85893 85939 85891 86047 86647 87658 88602 88943 88649 88057 87340 86605 86274 86625 87109 86918 86275
55137 86275 86284 87327 88469 88772 88437 88161 88000 87482 86531 85761 85888 87046 88578 89489 89387 88887 88800 89129 89306
55118 89306 89198 89121 88983 88329 87381 87173 88287 90110 91687 92636 92932 92596 92152 92647 94461 96549 97572
55101 97572 97436 97063 96988 96992 96981 97351 98285 99290 99701 99332 98438 97355 96436 96091 96548 97540 98482 99046 99444 100013
55081 100013 100617 100721 100054 98902 97627 96262 94804 93617 93169 93516 94347 95349 96232 96641 96503 96334 96767
55064 96767 97817 98976 99847 100307 100241 99706 99230 99382 100041 100613 100868 100991 100922 100389 99591 99078 98834 98240 97168
55045 97168 96345 96303 96684 96970 97190 97424 97244 96313 95103 94385 94323 94591 95080 95869 96662 96871 96279 95214 94093
55026 94093 93080 92218 91574 91217 91231 91744 92852 94498 96443 98237 99293 99248 98361 97328 96629 96264 96158
55009 96158 96444 97182 98072 98731 99090 99332 99581 99831 100076 100432 101152 102422 103983 105131 105341 104831 104177 103545
54991 103545 102751 101964 101730 102179 102711 102681 102036 101201 100744 101179 102588 104251 105124 104873 104084 103396 102936 102712
54973 102712 102951 103733 104754 105698 106461 106857 106657 106101 105780 105788 105639 105343 105767 107353 109123 109729 109075 108225
54955 108225 108041 108613 109692 110953 111877 112066 111699 111240 110775 110097 109364 109087 109407 109871 110059 110110 110449 111204
54937 111204 112029 112484 112580 112941 114216 116230 117946 118437 117765 116826 116581 117563 119786 122863 126332 130023 133959
54920 133959 137918 141534 144924 148753 153345 158052 161793 163938 164463 163659 161977 159873 157529 154952 152355
54905 152355 149940 147249 143563 139207 135577 133319 131395 128738 126043 124737 124727 124501 123246 121633 120432
54890 120432 119596 119053 119335 120835 123102 125409 127517 129478 131200 132687 134335 136554 139268 142136 145035
54875 145035 148093 151384 154849 158378 161844 165122 168072 170250 170755 168818 164756 159964 155638 151780
54861 151780 147774 143704 140500 138685 137455 135413 132109 128428 125399 123087 120981 119020 117545 116353
54847 116353 114690 112472 110770 110497 111166 111600 111475 111396 111682 111921 111787 111593 111783 112336 112923 113230 113021 112253
54829 112253 111318 110893 111326 112334 113359 113957 113871 113064 111823 110570 109485 108543 107966 108254 109545 111219 112360
54812 112360 112544 112021 111318 110849 110832 111349 112363 113689 115012 116015 116523 116509 116048 115411 115151 115751 117046 118284
54794 118284 118908 119021 118885 118342 117144 115600 114445 114143 114677 115872 117511 119153 120278 120749 120964 121512
54778 121512 122821 124968 127554 129871 131429 132276 132662 132721 132785 133679 136083 139728 143706 147542 151400 155355
54762 155355 159058 162238 164993 167406 169312 170594 171241 171001 169420 166502 162935 159415 156043 152595 149071
54747 149071 145715 142745 140315 138520 137238 136073 134640 132854 130912 129183 128127 128028 128709 129694 130706
54732 130706 131820 133067 134224 135108 135839 136694 137893 139570 141755 144348 147358 151108 155795 160782 164820
54717 164820 167231 168529 169586 170475 170464 168976 166207 162866 159540 156337 153011 149448 146001 143217 141200
54702 141200 139443 137394 134992 132580 130483 128841 127635 126695 125804 125033 124837 125550 126680 127014 125712 123321
54686 123321 121444 121168 121931 122245 121432 120199 119433 119086 118659 118239 118312 118794 118982 118505 117652 116701 115542 114177
54668 114177 113048 112579 112754 113359 114252 115234 116039 116655 117328 118056 118471 118409 118169 118010 117833 117610 117665 118158 118720
54649 118720 119013 119209 119459 119314 118346 117060 116453 116696 116965 116655 116085 115756 115500 114885 114055 113620 113810 114261
54631 114261 114701 115400 116638 118017 118726 118474 117847 117634 118067 118854 119658 120233 120311 119750 118849 118231 118340 119117
54613 119117 120059 120448 119714 117931 115894 114448 113793 113676 114020 114910 116101 117104 117809 118482 119064 119074 118396
54596 118396 117588 117092 116622 115777 114824 114423 114803 115621 116452 117060 117340 117320 117206 117223 117461 117881 118262 118118 117073
54577 117073 115452 114174 113839 114284 115189 116560 118238 119488 119697 119180 118756 118741 118867 118945 118998 118904 118550 118291
54559 118291 118642 119445 119943 119819 119633 120037 121009 122119 123114 123921 124400 124527 124704 125475 126844 128066 128285 127351
54541 127351 125962 124930 124406 124015 123686 123932 125095 126674 127882 128723 129960 131908 133738 134314 133471 132167
54525 132167 131393 131225 131023 130388 129652 129266 128996 128138 126535 124913 123943 123393 122662 121843 121658 122345 123211 123445
54507 123445 122998 122466 122381 122829 123551 124209 124659 125041 125516 125958 126108 125956 125695 125295 124557 123669 123277 123739 124636
54488 124636 125305 125616 125865 126159 126317 126314 126317 126300 126010 125446 125080 125375 126322 127582 128878 130044 130912 131454 131936
54469 131936 132644 133491 134113 134365 134486 134772 135333 136169 137192 138057 138300 137815 136967 136035 134824 133145 131381
54452 131381 130186 129768 129870 130380 131481 133149 134919 136280 137036 137212 136933 136485 136144 135824 135222 134387 133829
54435 133829 133862 134234 134599 134974 135448 135769 135632 135161 134770 134645 134702 134922 135452 136423 137844 139565 141165 142098
54417 142098 142202 141889 141621 141429 141216 141278 142022 143283 144353 144709 144394 143751 143101 142653 142391 142024 141373 140724
54399 140724 140467 140454 140211 139799 139958 141148 142894 144423 145606 146923 148608 150223 151042 150666 149321 147760
54383 147760 146813 146841 147537 148315 148813 148978 148847 148531 148418 149059 150635 152602 154143 154986 155610 156567 157836 159039
54365 159039 160109 161359 162885 164307 165270 165911 166590 167405 168279 169335 170788 172500 174046 175299 176668
54350 176668 178509 180508 181863 182081 181390 180344 179127 177410 174922 171948 169095 166648 164419 162247 160373
54335 160373 159159 158610 158344 157907 157052 155864 154720 153951 153418 152638 151433 150251 149640 149648 149927 150219 150401 150266
54317 150266 149634 148704 147988 147826 148117 148499 148736 149001 149813 151446 153308 154289 153964 153054 152338 151604 150258 148602
54299 148602 147644 147644 147681 146942 145748 144899 144518 144136 143636 143591 144618 146662 148972 150658 151281 150981 150173 149245
54281 149245 148649 148926 150214 151824 152786 152907 152853 153102 153291 152899 152120 151580 151396 151118 150603 150488 151491 153430
54263 153430 155202 155771 155073 153945 153265 153301 153811 154519 155316 156165 157030 157920 158836 159685 160390 160983 161449 161551
54245 161551 160988 159730 158068 156414 155130 154395 154017 153524 152727 152059 152074 152707 153345 153538 153314 152870 152403 152227
54227 152227 152564 153128 153315 152978 152717 153184 154380 155728 156611 156745 156334 156007 156308 157115 157755 157772 157335 156890
54209 156890 156728 156951 157464 157868 157704 156946 155984 155042 154001 152880 152055 151742 151724 151832 152278 153166 154070 154503
54191 154503 154520 154464 154356 153946 153172 152216 151233 150353 149779 149590 149609 149654 149758 149925 149962 149849 149933 150464 151204 151879 152638
54170 152638 153645 154542 154879 154819 154800 154694 153976 152635 151274 150289 149565 148976 148590 148271 147750 147251 147431 148471
54152 148471 149776 150814 151688 152542 153037 152872 152393 152147 152162 152155 152122 152181 152125 151777 151675 152729 155099 157841 159820
54133 159820 160623 160610 160507 161028 162415 164074 165035 165036 164860 165330 166256 166785 166575 166168 166177 166575 166988 167388 168142 169441
54113 169441 170923 171927 172006 171178 169874 168750 168415 169049 170213 171208 171777 172338 173345 174542 175194 175066 174761
54096 174761 174897 175310 175503 175615 176339 177881 179644 181162 182811 185119 187767 189883 191221 192561 194835
54081 194835 198234 202287 206526 210921 215807 221483 227722 233663 238285 240984 241590 240086 236666 232038
54067 232038 227224 222887 219010 215303 211631 208039 204705 202031 200496 200241 200957 202201 203542 204480 204741
54052 204741 204858 205901 208307 211323 214002 216340 218987 222178 225469 228380 230752 232656 234476 236982
54038 236982 240782 245669 250977 256469 262352 268394 273782 278100 281908 286045 290750 295733 300608 304920
54024 304920 308213 310594 312921 315923 319321 322291 324583 326587 328335 329069 328025 325186 321014 315811
54010 315811 309684 302923 296094 289739 284061 278818 273468 267689 261890 257010 253530 250886 248142 245116
53996 245116 242471 240764 239776 238876 237615 235832 233510 230853 228268 226013 223987 222056 220387 219158 218133
53981 218133 216903 215496 214434 214186 214780 215915 217123 217899 218071 218060 218418 219027 219143 218352 217155 216456 216794
53964 216794 218196 220364 222747 224753 226224 227523 228949 230346 231485 232487 233512 234389 235016 235846 237456
53949 237456 239764 242201 244597 247340 250605 253983 257104 260288 264338 269813 276609 284053 291454 298772
53935 298772 306797 316410 327689 339974 352674 365535 378047 389042 397244 402039 403584 402454 399339
53922 399339 394901 389719 384498 380233 377830 377389 378164 379420 381095 383493 386714 390607 394938 399221 402639
53907 402639 404601 405307 405429 405281 404614 403160 401077 398774 396575 394545 392411 389640 385850 381219 376343
53892 376343 371583 366742 361409 355423 348934 342200 335502 329107 323162 317607 312298 307151 302149 297244
53878 297244 292394 287682 283342 279583 276418 273668 271140 268773 266603 264656 262879 261145 259253 256968
53864 256968 254172 250950 247481 243879 240327 237324 235525 235150 235675 236216 236153 235358 234081 232789 231943 231661
53848 231661 231632 231494 231174 230726 230063 229110 228034 226940 225483 223294 220780 218936 218177 217894 217476 217297 218088
53831 218088 219649 220830 220897 220381 220324 221054 222003 222580 222864 223359 224280 225287 225936 226274 226781 227800 229230 230827
53813 230827 232523 234366 236379 238702 241597 245052 248600 251894 255227 259014 262928 266169 268636 271204
53799 271204 274657 278851 283225 287558 291823 295697 298809 301249 303342 305070 306182 306732 307004 306956 306240
53784 306240 304862 303351 302097 300895 299281 297028 294142 290702 286938 283240 279859 276648 273270 269573
53770 269573 265704 261953 258599 255769 253369 251191 249090 246990 244764 242318 239790 237489 235579 233913
53756 233913 232226 230372 228417 226641 225409 224800 224417 223739 222639 221360 220073 218792 217643 216819 216208
53741 216208 215460 214560 213952 213988 214550 215359 216301 217306 218279 219387 221011 223107 224939 225823 225892 225842 226128 226766
53723 226766 227686 228908 230394 231953 233260 233892 233607 232776 232199 232243 232535 232788 233475 235167 237507 239477 240558
53706 240558 241100 241702 242847 245008 248363 252288 255793 258691 261730 265302 268625 270660 271467 272116 273496
53691 273496 275704 278449 281481 284427 286643 287576 287286 286423 285626 285041 284466 283826 283289 282929 282591 282226 282141
53674 282141 282619 283431 284020 284135 284032 284035 284076 283733 282698 281258 280263 280364 281207 281738 281530 281363 282072 283269 283870
53655 283870 283656 283464 283829 284249 284147 283835 284010 284711 285354 285628 285901 286706 288130 289775 291218 292458 293858
53638 293858 295585 297252 298344 298886 299341 299895 300379 300907 302084 304266 307039 309714 312030 314069 315832
53623 315832 317344 318919 320888 323138 325326 327498 330130 333557 337659 342151 346886 351737 356425 360697
53609 360697 364630 368625 372986 377570 381933 385837 389456 392953 396030 398143 399130 399382 399427 399528 399724 399942
53593 399942 400031 399885 399629 399456 399302 398882 398066 396989 395818 394743 394154 394341 394965 395286 395078 394879 395107 395430
53575 395430 395343 394931 394600 394391 394028 393454 392850 392278 391700 391241 391092 391164 391149 390852 390313 389771 389751 390893 393284
53556 393284 396108 398382 399993 401631 403787 406216 408409 410223 411939 413958 416514 419438 422207 424419
53542 424419 426249 428341 431270 435187 439780 444420 448556 452294 456409 461491 467298 473274 479440 486207
53528 486207 493485 500702 507764 515322 523851 533014 542307 551869 562204 573394 585032 596788 608656
53515 608656 620749 633191 646206 660011 674601 689820 705679 722408 740104 758469 776985
53504 776985 795320 813458 831413 848914 865569 881384 896966 912979 929464 945833 961527
53493 961527 976485 990986 1005226 1019166 1032663 1045708 1058595 1071795 1085493 1099269 1112493
53482 1112493 1125092 1137683 1150801 1164159 1176838 1188127 1198067 1207236 1216137 1224732 1232436 1238529
53470 1238529 1242653 1245044 1246377 1247374 1248309 1248693 1247500 1243970 1238214 1230977 1222937 1214508 1206180 1198565 1191833
53455 1191833 1185395 1178386 1170290 1160975 1150422 1138820 1126789 1115097 1104057 1093390 1082655 1071626
53443 1071626 1060361 1049284 1039257 1031191 1025354 1021249 1018330 1016530 1015852 1015833 1015903 1016167 1017265 1019423 1022166
53428 1022166 1025175 1028896 1033922 1040138 1046974 1054222 1062077 1070519 1079226 1088178 1097825 1108569 1120500
53415 1120500 1133775 1148725 1165330 1183049 1201467 1220693 1240794 1261285 1281752 1302669 1324951
53404 1324951 1348797 1373542 1398674 1424462 1451434 1479745 1509295 1540118 1572352 1606023 1641082
53393 1641082 1677456 1714871 1752731 1790419 1827665 1864550 1901237 1937744 1973793 2008722 2041688
53382 2041688 2072194 2100469 2127283 2153377 2179039 2203927 2227102 2247369 2263983 2277182 2287832
53371 2287832 2296480 2302907 2306622 2307411 2305019 2298578 2287020 2270225 2249245 2225149 2198061 2167808 2135091
53358 2135091 2101325 2067409 2033328 1999036 1965090 1932140 1900324 1869425 1839280 1809754 1780760
53347 1780760 1752568 1725646 1699755 1673655 1646249 1617821 1589665 1562713 1536992 1512209 1488293
53336 1488293 1465356 1443634 1423555 1405506 1389509 1375350 1362906 1352056 1342442 1333727 1325853 1318543
53324 1318543 1310726 1301172 1289761 1277562 1265551 1253858 1242382 1231421 1221302 1211869 1202826 1194298
53312 1194298 1186632 1179900 1173962 1168860 1164806 1161911 1160146 1159401 1159399 1159733 1160252 1161263 1163167 1166042 1169871
53297 1169871 1174950 1181746 1190336 1200299 1211163 1222784 1235241 1248540 1262450 1276538 1290398 1303975
53285 1303975 1317591 1331436 1344972 1357070 1366935 1374852 1381877 1388760 1395254 1400469 1403696 1404739 1403665
53272 1403665 1400555 1395567 1388925 1380712 1370854 1359415 1346694 1332919 1318033 1301872 1284371 1265539
53260 1265539 1245613 1225325 1205534 1186286 1166707 1146186 1125245 1104737 1084624 1064270 1043676
53249 1043676 1023641 1004757 986944 969894 953302 936594 919192 901198 883309 865947 849064
53238 849064 832834 817798 804075 791039 778014 764856 751795 739335 728299 719154 711076 702575
53226 702575 693362 684659 677236 670125 662001 652863 643376 633296 621809 609071 596283 584271 572884
53213 572884 561728 550645 539481 528213 517407 507836 499500 491613 483686 475962 468684 461561 454255
53200 454255 446862 439624 432538 425522 418663 412080 405801 399861 394269 388777 383030 377081 371511 366847
53186 366847 363085 359863 356869 353900 350730 347096 342859 338161 333481 329405 326195 323615 321278 318979
53172 318979 316614 314011 311115 308129 305191 302187 299193 296816 295578 295110 294463 293111 291187 288859 286121
53157 286121 283289 281092 280010 279864 280189 280582 280622 279931 278583 277112 275850 274594 273095 271605 270596 270191
53141 270191 270142 270255 270580 271150 271712 271793 271134 270091 269401 269388 269563 269269 268534 267977 268015 268581 269484 270521 271288
53122 271288 271389 270996 270698 270688 270577 270151 269816 270019 270627 271205 271629 272096 272719 273300 273366 272416 270415 268074 266305
53103 266305 265303 264520 263515 262359 261122 259606 257858 256364 255331 254284 252857 251522 250967 251095 251215
53088 251215 251064 251038 251491 252244 252808 252758 252008 251013 250567 251052 251989 252649 252859 252896 252792 252310 251488 250678 250055 249515
53068 249515 249077 248919 248947 248784 248297 247758 247383 247113 246975 247228 247929 248696 249171 249477 249945 250640 251375 251994 252362
53049 252362 252212 251397 250233 249358 249149 249430 249765 249813 249356 248232 246505 244678 243522 243474 244241 245072 245413 245195
53031 245195 244617 243895 243297 243153 243584 244235 244487 243948 242723 241309 240345 240366 241478 243165 244509 244828 244231
53014 244231 243602 243953 245628 248104 250632 252967 255217 257083 257704 256557 254228 251942 250495 249913 249938 250368
52998 250368 250963 251477 251928 252546 253410 254382 255448 256741 258126 259142 259590 259859 260401 261139 261725 262120 262514
52981 262514 262808 262657 262084 261586 261511 261698 261991 262737 264382 266704 268861 270203 270722 270680 270164 269161 267803
52964 267803 266312 264944 264194 264746 266780 269396 271169 271356 270308 268735 267041 265530 264694 264771 265187 264945
52948 264945 263640 261794 260151 258944 257896 256676 255163 253486 252021 251250 251438 252385 253588 254627 255356
52933 255356 255730 255571 254645 253021 251288 250270 250406 251380 252453 253133 253492 253795 253987 253705 252795 251632 250790
52916 250790 250476 250439 250380 250230 250041 249911 250082 250784 251747 252183 251602 250483 249720 249552 249475 249127 248732 248612 248810
52897 248810 249369 250450 251876 253015 253497 253701 254188 254945 255541 255681 255195 253864 251871 250162 249645 249988 249881
52880 249881 248656 247105 246524 247318 248826 250176 251019 251560 252139 252795 253261 253453 253743 254482 255408 256026 256567
52863 256567 257951 260589 263667 266007 267291 268015 268464 268227 266791 264264 261344 258700 256461 254332 252149
52848 252149 250259 249195 249012 249095 248745 247750 246314 244612 242674 240606 238700 237165 235882 234544 233136
52833 233136 232147 232104 232901 233852 234566 235459 237116 239360 241344 242388 242267 240896 238396 235594 233770 233565
52817 233565 234500 235772 236993 237929 238154 237597 237063 237575 239301 241538 243541 244895 245312 244704 243449 242081
52801 242081 240687 238998 237106 235573 234770 234536 234630 235091 235961 236936 237596 237795 237696 237524 237387 237254 237122 237197
52783 237197 237738 238531 238783 237979 236692 236078 236601 237731 238849 239776 240315 240030 238891 237652 237059 237056 237165 237276
52765 237276 237543 237768 237503 236666 235595 234516 233411 232371 231661 231376 231368 231566 232090 233007 234226 235662 237265
52748 237265 238886 240406 241959 243761 245702 247391 248635 249600 250470 251292 252162 253189 254185 254704 254596 254244
52732 254244 254111 254307 254702 255160 255516 255635 255704 256130 256935 257537 257449 256884 256348 255946 255518 255162 255004 254654 253549
52713 253549 251900 250579 249855 248932 247189 245329 244659 245505 246962 248136 248937 249577 249954 249940 249905 250434 251670
52696 251670 253274 254930 256448 257438 257418 256521 255705 255878 256945 258089 258851 259491 260248 260762 260535 259673 258739
52679 258739 258017 257268 256227 254996 253841 252921 252412 252625 253632 254840 255336 254796 253894 253591 254140 254962 255432
52662 255432 255526 255664 256150 256930 257758 258446 259046 259925 261526 263854 266283 268066 268993 269324 269172 268378 267032
52645 267032 265732 265072 265091 265382 265509 265163 264270 263271 263008 263915 265409 266466 266692 266504 266405 266558 267005 267774
52627 267774 268642 269296 269914 271080 272838 274308 274682 274242 273859 273729 273184 271724 269624 267435 265415 263722
52611 263722 262707 262614 263162 263810 264341 264879 265409 265641 265473 265330 265802 267027 268563 269765 270189 269692 268355
52594 268355 266474 264595 263435 263537 264829 266537 267803 268527 269402 270944 272665 273545 273239 272417 271840 271543
52578 271543 271239 271102 271627 272764 273744 273974 273754 273840 274448 275047 275125 274838 274691 274800 274811 274579 274505 274909 275339 274999
52558 274999 273838 272703 272223 272003 271181 269470 267295 265220 263653 262890 262943 263325 263376 262862 262068 261345 260813
52541 260813 260393 259898 259164 258387 258091 258489 259098 259430 259796 260870 262657 264590 266511 268750 271156 272954
52525 272954 273848 274492 275440 276352 276689 276558 276273 275677 274584 273470 273046 273469 274538 276250 278516 280628 281861
52508 281861 282449 283273 284695 286385 288105 289880 291394 292042 291699 290780 289446 287481 285098 283077 281748
52493 281748 280450 278421 275715 272954 270705 269464 269688 271317 273602 275818 277835 279685 281093 281911 282576
52478 282576 283468 284172 284065 283395 283011 283138 283227 283122 283454 284536 285626 285914 285767 286235 287598 289154 290469
52461 290469 292041 294353 296869 298527 299021 299004 299069 299089 298678 297819 296712 295356 293645 291709 289793 287914
52445 287914 285954 283976 282123 280320 278488 277045 276705 277572 278835 279604 279766 279772 279816 279621 279008 278360 278349 279214
52427 279214 280363 280800 280055 278690 277811 278148 279650 281752 283728 284975 285434 285789 286881 288818 291029 293251
52411 293251 295965 299647 304079 308800 313818 319419 325542 331874 338368 345037 351234 355676 357422 356552
52397 356552 353842 350013 345394 340002 333838 327284 321268 316816 314374 313690 314303 315770 317415 318387 318391 318112
52381 318112 318540 319934 321757 323479 325007 326337 327325 328048 329033 330772 333217 336109 339555 343849 348767
52366 348767 353585 357835 361588 364892 367476 369286 370777 372266 373438 374049 374657 375985 377815 379338 380475
52351 380475 382030 384422 387119 389662 392490 396262 400869 405655 410174 414332 418117 421701 425515 429848
52337 429848 434584 439687 445615 452788 460996 469791 479188 489423 500253 511151 522146 533822 546459
52324 546459 559683 573107 586884 601452 617084 633771 651197 668720 685685 701976 718092
52313 718092 734620 751719 769039 785966 802034 817373 832641 848235 863699 878249 891750
52302 891750 904731 917492 929647 940578 949926 957680 964265 970510 976901 982700 986410 987397 986499 984771
52288 984771 982223 978320 973236 967853 962744 957856 953201 949261 946489 944837 944016 943975 944888 946831 949696
52273 949696 953385 957947 963485 970001 977357 985320 993632 1002089 1010691 1019701 1029399 1039695 1050121 1060318
52259 1060318 1070402 1080704 1091286 1101872 1112111 1121742 1130642 1138976 1147122 1155094 1162186 1167536 1170938
52246 1170938 1172714 1172903 1171101 1167121 1161311 1154107 1145767 1136662 1127332 1117997 1108440 1098622 1088983 1079839
52232 1079839 1070856 1061501 1051695 1041813 1032407 1024136 1017454 1011920 1006269 999697 992828 986966 982724 979854
52218 979854 978019 977010 976437 975966 975827 976457 977670 978874 980162 982421 986089 990457 994521 997998 1001047
52203 1001047 1003506 1005053 1006000 1007360 1009984 1013800 1017904 1021362 1024022 1026676 1030311 1035063 1039995 1043978
52189 1043978 1046616 1048280 1049452 1050252 1050478 1049879 1048374 1046112 1043299 1039926 1035763 1030708 1025128 1019743 1015162
52174 1015162 1011458 1008165 1004722 1001058 997705 995280 993930 993387 993463 994176 995403 996744 997908 999041 1000490
52159 1000490 1002365 1004502 1006758 1009203 1011992 1015105 1018224 1020877 1022815 1024259 1025719 1027534 1029658 1031821
52145 1031821 1033834 1035781 1038051 1041119 1045128 1049740 1054491 1059173 1063628 1067402 1070125 1072246 1074918 1078931
52131 1078931 1084130 1090116 1097097 1105702 1116239 1128615 1142793 1158854 1176597 1195517 1215328 1236205
52119 1236205 1258319 1281322 1304470 1327177 1349327 1371035 1392236 1412559 1431633 1449401 1466064
52108 1466064 1481693 1496024 1508701 1519629 1529093 1537553 1545302 1552192 1557756 1561772 1564611 1566730 1567864
52095 1567864 1567114 1563951 1558658 1551549 1542306 1530590 1516992 1502781 1488829 1475301 1462294 1450144
52083 1450144 1439010 1428764 1419524 1411824 1405979 1401672 1398501 1396551 1396094 1397016 1399007 1402133 1406725 1412718
52069 1412718 1419607 1427110 1435483 1445004 1455494 1466608 1478284 1490474 1502562 1513579 1523155 1531902
52057 1531902 1540578 1549160 1557063 1564007 1570140 1575280 1578639 1579533 1577994 1574378 1568735 1561009 1551557 1540932
52043 1540932 1529269 1516419 1502590 1488188 1472999 1456238 1437878 1419339 1402343 1387259 1373037
52032 1373037 1358602 1343871 1329477 1315909 1303017 1290115 1276503 1262069 1247376 1233040 1219134
52021 1219134 1205398 1191898 1179113 1167335 1156289 1145471 1134666 1124007 1113666 1103636 1093785
52010 1093785 1084037 1074428 1064958 1055400 1045427 1034968 1024211 1013114 1001172 987968 973786 959358
51998 959358 945090 930939 917020 903837 891771 880688 870272 860411 850989 841603 831779 821396
51986 821396 810670 799828 788979 778178 767423 756683 746062 735721 725453 714622 702900
51975 702900 690943 679913 670359 661954 654389 648044 643515 640774 639201 638304 638102 638805 640373 642493
51961 642493 644847 647311 649957 652822 655559 657344 657318 655226 651545 646920 641592 635541 629059 622928 617943
51946 617943 614387 612041 610576 609874 610137 611781 615116 619933 625468 630900 635877 640535 645170 649987 654943
51931 654943 659563 663070 665037 665899 666411 666601 665583 662494 657358 650955 644229 637967 632737 628855 626591
51916 626591 626407 628561 632286 635840 637757 637745 636074 632579 626886 619301 610762 602044 593594 586052 580092
51901 580092 575631 571835 568172 564880 562132 559306 555518 550467 544353 537309 529359 520759 512000 503617
51887 503617 496134 489931 484872 480414 476439 473696 473008 474265 476654 479688 483485 488152 493443 499050
51873 499050 504756 510156 514702 518207 521018 523477 525397 526114 524887 521292 515624 509011 502816 497735
51859 497735 493709 490711 489139 489144 490007 490721 491057 491561 492497 493264 493064 491796 489967 487873 485216 481606 477211
51842 477211 472684 468537 464726 460876 456778 452651 449004 446286 444542 443359 442255 441159 440387 440172 440462
51827 440462 441231 442555 444126 445023 444461 442620 440361 438288 436494 435062 434122 433396 432334 430980 430182 430576
51811 430576 431813 433137 434334 435641 436994 437875 437814 436645 434435 431554 428792 426980 426406 426709 427258 427458
51795 427458 426924 425713 424256 422813 421144 419061 417053 415867 415563 415515 415275 414889 414416 413817 413516 414324 416333
51778 416333 418363 419052 418263 417039 416465 417032 418881 422102 426646 432214 438309 444310 449690 454371 458739
51763 458739 463074 467154 470650 473606 476111 477648 477303 474710 470427 465360 460147 455124 450407 445833
51749 445833 441135 436386 432044 428453 425588 423396 422069 421711 422015 422631 423717 425766 428876 432499 436013
51734 436013 439392 443147 447610 452334 456239 458358 458493 457228 455567 454594 455164 457391 460372 462742 463658
51719 463658 463106 461413 458856 455871 453137 451105 449696 448655 447853 446968 445329 442662 439768 437924 437717
51704 437717 438897 441198 444565 448523 452027 454315 455485 455975 455894 455219 454299 453695 453673 454137 454943 455957 456863
51687 456863 457171 456448 454466 451311 447475 443653 440259 437301 434838 433211 432542 432389 432345 432708 434003 435969
51671 435969 437710 438878 440046 441748 443870 446390 450038 455470 462040 468151 472732 475771 477396 477211
51657 477211 474984 471499 468220 466215 465692 466428 468281 471335 475741 481350 487196 491469 492470 489798 484430
51642 484430 477633 470093 462145 454320 447244 441180 436027 431672 428042 424914 422037 419513 417776 417115
51628 417115 417349 417998 418633 419146 419842 421101 422640 423334 422299 420134 418451 418010 417931 417034 415323 413650 412487
51611 412487 411755 411495 411877 412596 413059 413234 413681 414627 415663 416568 417838 420006 422967 426429 430658 436270
51595 436270 443415 451522 459715 467172 473210 477377 479539 479808 478490 476212 473843 472081 471259 471603 473279
51580 473279 475980 478967 482054 486243 492766 501679 511995 523094 535199 548365 561855 575008 588116
51567 588116 601795 615739 628716 639743 648908 657242 666294 677753 692806 711526 733159 757042
51555 757042 782791 809319 834220 854820 869848 879690 885040 885799 881432 871864 857585 839134 816964
51542 816964 791770 764529 736152 707426 679348 653078 629254 607633 587696 569485 553539
51531 553539 540150 529022 519676 511809 505145 499276 493959 489433 486147 484117 482772 481486 480109 478789
51517 478789 477458 475779 473678 471553 469700 467775 465213 462120 459266 457091 455133 452683 449621 446331
51503 446331 443068 439906 437057 434781 432939 431069 428910 426442 423459 419675 415472 412000 410099 409396
51489 409396 408939 408482 408574 409380 409992 409293 407201 404731 402823 401417 399763 397394 394571 391848 389486 387428
51473 387428 385698 384607 384498 385312 386445 387031 386540 385175 383631 382404 381486 380765 380447 380851 381886 383114
51457 383114 384308 385677 387491 389712 392093 394480 396929 399640 402794 406343 410063 413957 418495 424197
51443 424197 431099 438897 447403 456347 464813 471525 475994 478855 480835 481869 481654 480613 479653 479051 477995
51428 477995 475263 470177 463113 455375 448405 442823 438313 434513 431638 429970 429219 428943 429228 430315 431780
51413 431780 432840 433495 434581 436556 438886 440878 442539 444271 446206 448286 450655 453501 456642 459592
51399 459592 461973 463744 465163 466709 468888 471954 475810 480171 484671 489022 493459 499017 506867 517280
51385 517280 529624 543443 558988 576507 595720 616425 639145 664630 693090 724466 759010
51374 759010 796705 836088 874232 908046 935405 955334 967850 973675 973466 967049 953777 933805
51362 933805 908560 879775 848404 814706 779034 742268 705753 671098 639785 612536 589030
51351 589030 568396 549957 533481 518925 506185 495027 485129 476261 468476 461943 456423 451106 445233
51338 445233 438873 432839 427850 423939 420646 417526 414361 411146 408077 405488 403556 402075 400675 399311
51324 399311 398283 397652 396862 395285 393119 391387 390954 391788 393365 395401 397823 400275 402256 403807 405506
51309 405506 407486 408863 408605 406807 404599 402796 401123 399007 396671 394882 393756 392429 390125 387085
51295 387085 384113 381569 379297 377278 375755 374727 373917 373385 373621 374768 376282 377747 379559 382278 385683
51280 385683 389022 392052 395190 398686 402127 404806 406211 406237 405394 404709 404886 405532 405729 405398 405496 406717 408616
51263 408616 410278 411273 411567 411080 409918 408695 407991 407604 406762 405033 402701 400359 398484 397293 396660 396137
51247 396137 395310 394117 392742 391349 390094 389115 388269 387122 385489 383751 382300 380988 379606 378609 378658 379537
51231 379537 380236 380213 379838 379415 378483 376664 374664 373765 374477 376198 378114 379916 381683 383527 385536 387689
51215 387689 389686 391083 391773 392170 392753 393631 394664 395836 397177 398492 399557 400670 402607 405679 409008
51200 409008 411139 411420 410547 409649 409140 408593 407481 405803 404042 402755 402184 402126 402253 402601 403536 405028 406252
51183 406252 406352 405589 405249 406219 407987 409313 409624 409386 409256 409335 409420 409651 410446 411775 412815 412659 411360 410001
51165 410001 409590 410127 410936 411698 412735 414305 416126 417819 419436 421179 422775 423569 423222 422010 420436 418851
51149 418851 417511 416608 415979 415053 413394 411219 409107 407277 405462 403459 401493 399892 398738 398061 398076 398889
51133 398889 400061 400803 400677 399948 399231 399014 399508 400703 402421 404374 406287 407989 409529 411331 413990 417608
51117 417608 421380 424241 426007 427554 429795 432798 436011 438908 441170 442686 443803 445262 447415 449665
51103 449665 451144 451837 452517 453583 454520 454674 454122 453507 453311 453612 454337 455397 456583 457552 458077 458241 458302 458409
51085 458409 458542 458804 459564 460968 462335 462518 461153 459233 458110 458143 458732 459385 460217 461484 463262 465675
51069 465675 468881 472651 476463 480277 484807 490670 497666 505247 513405 522643 533235 544941 557339
51056 557339 569996 582260 593286 602517 610131 617011 624323 633003 643312 654726 666191 676604
51044 676604 685162 691460 695347 696704 695349 691277 684935 677200 669112 661686 655726 651356 647652 643092
51030 643092 636673 628507 619445 610475 602533 596330 591925 588702 586152 584527 584442 586031 588868 592591 597228
51015 597228 602937 609704 617233 624958 632271 639084 646029 653716 661920 669937 677745 686295 696489 708287
51001 708287 720976 733904 746679 758998 770669 781634 791752 800792 808840 816447 823971 830997
50989 830997 836883 841796 846655 851967 857310 862346 867904 875499 885885 898494 912236 926360 940512
50976 940512 954608 969071 984832 1002640 1022542 1044416 1068767 1096461 1127723 1162031 1199129
50965 1199129 1239507 1283562 1330733 1379958 1430665 1482844 1536341 1590554 1644734 1698047 1749278
50954 1749278 1796976 1840123 1878468 1912117 1940950 1964481 1982121 1993589 1999313 2000480 1998448 1994058
50942 1994058 1987693 1979884 1971316 1961992 1950838 1936667 1919446 1900274 1880136 1859094 1836807 1813460
50930 1813460 1789720 1765799 1740965 1714221 1685326 1654868 1623364 1590681 1556490 1520928 1484480
50919 1484480 1447416 1409833 1372205 1335416 1300124 1266506 1234764 1205464 1179044 1155347 1133981
50908 1133981 1114887 1098073 1082992 1068789 1055226 1042904 1032397 1023557 1015847 1009045 1003257 998462
50896 998462 994383 990788 987755 985617 984685 984904 985707 986482 987299 988972 992185 996813 1002388 1008895 1016555
50881 1016555 1024993 1033325 1041290 1049778 1059925 1072051 1085729 1100465 1115888 1131593 1147360 1163515
50869 1163515 1180733 1199484 1219918 1242183 1266472 1292804 1321061 1351306 1383847 1418987 1456916
50858 1456916 1497818 1541931 1589592 1641424 1698314 1760942 1829433 1903740 1984107 2070791 2163484
50847 2163484 2261469 2364231 2471494 2582825 2697729 2815922 2936726 3058117 3177041 3290801
50837 3290801 3397486 3494990 3580567 3651793 3707277 3746130 3767696 3772503 3762750 3740957 3708656
50826 3708656 3667141 3618949 3567517 3515550 3464636 3416273 3372248 3333775 3300890 3272709 3247539
50815 3247539 3222664 3194935 3162100 3123309 3078273 3026423 2967044 2899811 2825038 2743742 2657547
50804 2657547 2568193 2477110 2385703 2295694 2208563 2124787 2044412 1968394 1898566 1836125 1780844
50793 1780844 1731949 1689002 1651671 1619480 1592289 1570325 1553196 1539490 1527901 1518311 1511069 1505655
50781 1505655 1500720 1495213 1488923 1482138 1475303 1468814 1462707 1456567 1450037 1443094 1435583 1426913 1416725 1405451
50767 1405451 1393672 1381272 1367907 1353945 1340117 1326444 1312385 1298107 1284779 1273383 1263969
50756 1263969 1256322 1250617 1246970 1244918 1243919 1244084 1245981 1249954 1256035 1264271 1274686 1287076 1301318 1317888
50742 1317888 1337656 1361044 1387762 1417536 1450784 1488240 1530076 1575750 1624720 1676894 1732228
50731 1732228 1790238 1850245 1911855 1974802 2038458 2101911 2164493 2225784 2285094 2341437 2394039
50720 2394039 2442290 2485047 2520598 2547630 2565605 2573840 2571036 2556555 2531698 2498954 2460449 2418048
50708 2418048 2374481 2332863 2294797 2260031 2228404 2201130 2179518 2163249 2150678 2140250 2130780
50697 2130780 2120750 2108338 2092190 2071536 2045559 2013361 1974834 1931179 1884354 1836242 1788304
50686 1788304 1741530 1696427 1653311 1612943 1576718 1545911 1520775 1500610 1484774 1473396 1466966
50675 1466966 1465472 1468248 1474598 1484224 1496907 1512142 1529373 1548378 1569023 1590734 1612583 1633878
50663 1633878 1654251 1673108 1689566 1703195 1714525 1724479 1733596 1742048 1750145 1758328 1766701 1774871 1782330
50650 1782330 1788870 1794760 1800705 1807548 1815801 1825494 1836622 1849521 1864580 1881775 1900928 1922331
50638 1922331 1946617 1973869 2003227 2033532 2064128 2094818 2125286 2154822 2182540 2207853 2230961
50627 2230961 2252998 2275229 2297463 2317026 2329573 2331327 2320959 2299826 2270858 2237257 2201818
50616 2201818 2166888 2134427 2105870 2081958 2062887 2048593 2038728 2032416 2028406 2025727 2023983 2022725
50604 2022725 2020663 2015802 2006413 1991707 1971668 1946540 1916552 1881875 1842798 1800124 1755384 1710340
50592 1710340 1666153 1623209 1581780 1542510 1506101 1472824 1442526 1414864 1389341 1365466 1343270
50581 1343270 1323347 1305951 1290269 1275170 1260625 1247840 1237944 1231083 1226886 1225157 1225648 1227656 1230465
50568 1230465 1234099 1239194 1246178 1254955 1265413 1277798 1292381 1308907 1326636 1344901 1363621 1383272
50556 1383272 1404439 1427444 1452278 1478677 1506090 1533698 1560778 1587096 1612782 1637781 1661693
50545 1661693 1684219 1705574 1726363 1747237 1768820 1791709 1816313 1842757 1871125 1901741 1935135
50534 1935135 1971815 2012095 2055991 2103214 2153457 2206826 2263762 2324459 2388562 2455499 2524848
50523 2524848 2596215 2669035 2742641 2816154 2888071 2956325 3019169 3075685 3125099 3165949 3196517
50512 3196517 3215884 3223923 3220351 3204521 3176312 3136782 3087736 3031082 2968719 2902719 2835326 2768928
50500 2768928 2705968 2648492 2597726 2554396 2519461 2494015 2478426 2472068 2474119 2484016 2500692 2521782
50488 2521782 2544081 2564623 2580930 2590478 2590472 2578312 2552248 2511852 2458271 2393938 2321682 2243979
50476 2243979 2162977 2080819 1999542 1920715 1845537 1775136 1710416 1651581 1598208 1549904 1506666
50465 1506666 1468553 1435285 1406322 1381134 1359232 1340129 1323463 1309134 1297087 1286990 1278277
50454 1278277 1270601 1264150 1259368 1256360 1254751 1254191 1254833 1257108 1261117 1266507 1272971 1280519 1289155 1298537
50440 1298537 1308151 1317638 1326749 1335181 1342730 1349493 1355642 1361060 1365547 1369409 1373541 1378738 1385032 1391793
50426 1391793 1398322 1404288 1409817 1415392 1421666 1429148 1437978 1448003 1459090 1471304 1484837 1499902 1516872
50413 1516872 1536459 1559536 1586540 1617070 1650160 1684901 1720713 1757086 1793322 1828611 1862245
50402 1862245 1893712 1922730 1949237 1973114 1993722 2009839 2020274 2024439 2022149 2013029 1996507 1972452
50390 1972452 1941557 1904975 1863875 1819498 1773344 1726919 1681434 1638092 1598568 1564618 1536937
50379 1536937 1514782 1497163 1484193 1476843 1475448 1478994 1485972 1495312 1506093 1516685 1524823 1528525 1526620
50366 1526620 1518507 1503988 1483533 1458324 1429630 1398201 1364455 1329142 1293518 1258782 1225452
50355 1225452 1193372 1162340 1132658 1105027 1079979 1057511 1037294 1019075 1002912 989226 978738
50344 978738 972078 969190 969286 971596 975991 982567 990743 999121 1006126 1010398 1010770 1006628 998646 988750 978919
50329 978919 970109 962411 955835 950575 946711 944065 942378 941509 941465 942353 944197 946748 949637 952724 956035
50314 956035 959179 961201 961418 960298 959119 958696 958653 958012 956275 953880 951720 950451 950283 951213 953143 955666
50298 955666 958099 960091 962072 964712 967970 971104 973684 976098 978853 981840 984592 986912 988848 990290
50284 990290 991081 991385 991585 991821 991951 991947 992123 992949 994805 997787 1001598 1005713 1009875 1014275 1019064 1023830 1027858
50267 1027858 1030812 1032887 1034338 1035103 1034989 1034066 1032911 1032486 1033632 1036486 1040507 1045096 1050091 1055599 1061753
50252 1061753 1068881 1077564 1088161 1100441 1114048 1129075 1145789 1163953 1182885 1202042 1221096 1239529
50240 1239529 1256717 1272520 1287381 1301805 1316047 1330201 1343958 1356124 1364945 1369214 1368707 1363382
50228 1363382 1352711 1336302 1314925 1290421 1264679 1238987 1214186 1190925 1169536 1149988 1132170
50217 1132170 1116064 1101282 1086442 1069439 1048846 1025186 1000570 976916 954709 933498 913139
50206 913139 894155 877172 862498 850157 839821 830688 821945 813524 806080 800052 795088 790535 786155
50193 786155 782073 778263 774417 770293 765989 761840 758095 754698 751397 748075 744838 741706 738427 734872
50179 734872 731406 728543 726323 724473 723080 722595 723086 724036 725116 726693 729211 732400 735430 737747 739493
50164 739493 741292 743803 747328 751684 756566 762119 768857 776830 785224 793118 800498 808231 817127 827256
50150 827256 838063 848853 859169 868840 877752 885650 892407 898493 904828 911999 919959 928726 939019
50137 939019 951754 967135 984794 1004790 1027975 1055193 1086360 1120474 1156341 1193181 1230708
50126 1230708 1268711 1306572 1343356 1378579 1412806 1447108 1481813 1516011 1548330 1577822 1603808
50115 1603808 1625174 1640328 1647911 1647287 1638298 1620966 1595685 1563451 1525607 1483534 1438872 1393737
50103 1393737 1350060 1308554 1268845 1230815 1195344 1163435 1135129 1109780 1086960 1066461 1047682
50092 1047682 1029809 1012647 996651 982134 969046 957568 948273 941451 936840 934156 933279 933660 934202
50079 934202 934177 933754 933247 932440 931163 929955 929445 929374 928925 927765 926169 924280 921882 918852 915332 911503
50063 911503 907619 904086 901008 897792 893779 889176 884791 880919 877152 873304 869877 867467 866258 866194 867047
50048 867047 868214 869081 869835 871349 874089 877791 882389 888479 896309 905089 913939 922945 932496 942188 951393
50033 951393 960566 970779 981903 992370 1001085 1008612 1015957 1023027 1029017 1033690 1037442 1040461 1042701
50020 1042701 1044580 1046861 1049724 1052646 1055396 1058554 1062826 1068440 1075578 1084833 1096688 1110799 1126316
50007 1126316 1142716 1159859 1177363 1194495 1210801 1226550 1242481 1259253 1277033 1295256 1312755
49996 1312755 1328326 1341074 1349962 1353318 1349432 1337834 1319591 1296275 1268986 1238372 1205032 1169610
49984 1169610 1132849 1095791 1059622 1025152 992730 962780 935934 912378 891533 872744 855931
49973 855931 841182 828126 816192 805247 795508 787023 779665 773420 768248 763808 759758 756191 753361
49960 753361 751186 749460 748367 748242 748956 750095 751713 754331 758206 763144 769038 775873 783083 789551 794582
49945 794582 798378 801302 803200 803827 803443 802449 800701 797675 793192 787555 781034 773575 765039 755474 745081
49930 745081 734052 722518 710700 699171 688868 680564 674212 669032 664314 659905 655885 652215 649046
49917 649046 647056 646932 648550 651068 653864 657021 660757 664788 668615 672233 676177 680865 686278 692389
49903 692389 699454 707491 715828 723742 731436 739667 748244 755661 760703 763790 766055 767546 767264 764796
49889 764796 760899 756294 750739 743702 735311 726182 716745 707199 697747 688420 678976 669385 660228 652225
49875 652225 645549 639910 635070 630834 626774 622531 618469 615553 614364 614494 615074 615786 617169 619967 624247
49860 624247 629254 634204 639127 644784 651793 660123 669447 679568 690180 700477 709423 716422 721542
49847 721542 725191 727800 729752 731261 732168 731921 729857 725564 719165 711334 702922 694501 686341 678825 672544
49832 672544 667768 664015 660486 656919 653839 651990 651676 652614 654218 656063 658200 661093 665223 670766 677570
49817 677570 685276 693411 701500 709217 716384 722899 728845 734535 740097 745061 748830 751606 754270 756979
49803 756979 758399 756883 752113 745118 736984 728156 718889 709647 700892 692888 685779 679526 673714 667889
49789 667889 662203 657380 653882 651426 649461 647814 646644 646010 645734 645529 645102 644228 642908 641449 640322
49774 640322 639972 640695 642541 645323 648869 653239 658516 664398 670163 675095 678831 681359 682896 683797 684361
49759 684361 684676 684676 684255 683146 680806 676786 671254 664925 658431 651964 645451 638811 632056 625500 619851
49744 619851 615641 612458 609187 605265 601346 598435 596650 595201 593415 591468 590181 590298 591860 594105
49730 594105 596118 597704 599475 601996 605199 608914 613526 619502 626405 633067 638954 644892 652087 660684
49716 660684 669513 677111 682689 686256 688190 688904 688768 688109 687097 685631 683376 680020 675485 669984 663950
49701 663950 657961 652596 648172 644574 641458 638685 636558 635557 635780 636645 637292 637404 637662 639198 642515
49686 642515 647015 651669 656017 660430 665505 671399 677794 684377 691247 698850 707528 717190 727449 737925
49672 737925 748154 757201 763791 767230 768157 768080 768067 768056 767415 765872 763764 761578 759581 757807 756057 753704
49656 753704 749729 743284 734400 724051 713414 703091 693057 683239 673894 665438 658119 651979 646990
49643 646990 643160 640481 638844 637898 637112 636187 635470 635628 636715 637776 637695 636249 634073 631732 629207 626230
49627 626230 622663 618444 613630 608699 604462 601378 599149 597191 595287 593516 591855 590220 588749 587605
49613 587605 586545 585158 583578 582527 582457 583006 583564 584111 585077 586444 587398 587127 585873 584935 585443 587167 588722
49596 588722 589094 588722 588829 589916 591339 592356 593065 594101 595835 598182 600857 603451 605485 606754 607499
49581 607499 607953 608031 607827 608127 609749 612446 615122 617228 619282 621852 624670 627261 629915 633426 638120
49566 638120 643690 649867 656697 664105 671646 678871 685682 692100 697870 702432 705310 706510 706541 705961 704892
49551 704892 703110 700735 698567 697460 697410 697533 697021 695968 695273 695818 697704 700143 702131 703300 704113 705209
49535 705209 706794 708768 711149 714081 717660 722041 727552 734291 741800 749605 758033 767971 779774 792859
49521 792859 806397 819827 832509 843537 852376 859278 864684 868618 871155 873107 875600 879086 883249
49508 883249 887716 892179 895869 897698 897215 894894 891168 885702 878096 868858 859090 849403 839774 830383
49494 830383 821878 814520 807645 800456 793095 786442 781017 776565 772770 769829 768057 767243 766835 766627 766889
49479 766889 767806 769086 770258 771108 771713 772215 772757 773514 774557 775744 776918 778243 780168 782890 785939 788422
49463 788422 789766 790181 790475 791417 793244 795544 797484 798288 797711 796163 794268 792266 789926 787000 783614
49448 783614 780166 777053 774503 772512 770806 769058 767305 766026 765664 766242 767552 769495 772008 774958 778417
49433 778417 782827 788430 794732 801059 807600 815317 824756 835445 846547 857454 867541 876129 883280
49420 883280 890065 897258 903979 908397 909801 909375 908904 909259 910316 911745 913463 915532 918046 921100 924803
49405 924803 929316 934927 941937 950391 960062 970710 982192 994276 1006505 1018418 1029807 1040681
49393 1040681 1050983 1060417 1068599 1075455 1081388 1086791 1091208 1093342 1092322 1088824 1084440 1079891 1074396 1066975
49379 1066975 1057838 1048139 1038795 1030072 1022071 1015008 1008901 1003508 998736 994841 992133 990740 990770 992302
49365 992302 994945 997651 999330 999637 998846 997097 994142 989911 984842 979355 973297 966369 958982 952167 946491
49350 946491 941477 936338 930967 925914 921698 918552 916673 916103 916309 916317 915522 914088 912452 910741 908893 907038
49334 907038 905396 903999 902800 901970 901827 902508 903959 906148 909041 912357 915658 918745 921835 925335 929611
49319 929611 934900 941256 948512 956435 964909 973845 983047 992446 1002440 1013659 1026321 1040082 1054479
49306 1054479 1069064 1082871 1094160 1101190 1103205 1100514 1093830 1083943 1071904 1059026 1046468 1034953
49294 1034953 1024878 1016437 1009536 1003806 998886 994701 991475 989527 988992 989543 990356 990604 990085 989261 988629
49279 988629 988230 987797 987191 986532 986075 986177 987310 989828 993642 998146 1002557 1006431 1010009 1014069 1019262 1025435
49263 1025435 1031671 1037118 1041694 1045859 1049870 1053573 1057047 1061169 1067266 1076053 1087048 1099106 1111488
49250 1111488 1124160 1136900 1148364 1156439 1159634 1157862 1151778 1141815 1128248 1111975 1094628 1077797
49238 1077797 1062433 1049060 1038108 1029812 1024001 1020298 1018465 1018392 1019909 1022809 1026996 1032402 1038829 1046039
49224 1046039 1053973 1062650 1071795 1080799 1089170 1096962 1104628 1112492 1120455 1128138 1135207 1141547 1147209 1152319
49210 1152319 1157055 1161701 1166664 1172391 1179198 1187177 1196310 1206665 1218421 1231740 1246628 1262905 1280118
49197 1280118 1297484 1314147 1329754 1344699 1359481 1373865 1386974 1398357 1408640 1418876 1429489
49186 1429489 1440146 1450447 1460361 1470111 1480133 1491264 1504481 1520146 1537733 1556594 1576794 1598928
49174 1598928 1623350 1650047 1679361 1712375 1750062 1791838 1834821 1874459 1906129 1926852 1936319
49163 1936319 1936748 1931653 1924360 1917174 1911410 1907677 1905960 1905708 1906214 1907075 1908238 1909757 1911749 1914567 1918755
49148 1918755 1924670 1932268 1941276 1951368 1962213 1973640 1985814 1998956 2012831 2026909 2041185 2056298
49136 2056298 2072550 2089337 2106090 2123217 2141281 2159610 2176720 2192169 2207020 2222338 2238113
49125 2238113 2254007 2270146 2286537 2302516 2317666 2332792 2349105 2366713 2384788 2403142 2422841
49114 2422841 2445159 2470568 2498906 2530093 2564564 2603469 2648609 2701756 2763565 2832669 2905284
49103 2905284 2975806 3039371 3095596 3149481 3206394 3264614 3313420 3339839 3337962 3312241 3272886
49092 3272886 3228582 3182251 3131672 3073364 3006669 2935069 2864007 2797746 2738288 2686433 2642656
49081 2642656 2606738 2577486 2553521 2534099 2518857 2507035 2497379 2488725 2480415 2472251 2464321 2456851
49069 2456851 2449958 2443462 2437005 2430355 2423529 2416643 2409693 2402541 2395136 2387774 2381009 2375137 2369821 2364428
49055 2364428 2358775 2353291 2348410 2344052 2339817 2335437 2330889 2326390 2322541 2320212 2319845 2321002 2322970 2325794
49041 2325794 2330265 2336789 2344611 2352216 2358195 2361631 2362159 2360089 2356376 2352133 2348129 2344751 2342213 2340569
49027 2340569 2339663 2339295 2339338 2339567 2339559 2339002 2337993 2336718 2334982 2332438 2329315 2326591 2325190 2325144 2325663 2325972 2326019 2326426
49009 2326426 2327864 2330576 2334518 2339724 2346183 2353387 2360469 2366968 2373071 2378846 2383796 2387701 2391367 2395673
48995 2395673 2400075 2403022 2403975 2403999 2404019 2403429 2401120 2397244 2393122 2389742 2387125 2384945 2382993 2381019 2378751
48980 2378751 2376287 2374048 2372241 2370621 2368852 2366816 2364590 2362374 2360418 2358746 2357021 2354978 2352908 2351390
48966 2351390 2350618 2350393 2350689 2351781 2353783 2356602 2360471 2365966 2373233 2381576 2390149 2398851 2408213 2418647
48952 2418647 2430095 2442320 2455223 2468866 2483355 2498697 2514771 2531426 2548590 2566198 2584088
48941 2584088 2602205 2620941 2641043 2663120 2687403 2713964 2742779 2773491 2805420 2838089 2871522
48930 2871522 2905914 2941273 2977632 3015329 3054705 3095656 3137726 3180486 3223557 3266448 3308892
48919 3308892 3351385 3394943 3440080 3486209 3532122 3576863 3620022 3661536 3701485 3740011 3777154
48908 3777154 3812779 3846858 3879751 3911903 3943137 3972546 3999336 4023638 4046251 4067655 4087635
48897 4087635 4105931 4122917 4139409 4155860 4171879 4186456 4198602 4207870 4214348 4218118 4218871 4216362
48885 4216362 4211185 4204577 4197206 4188572 4177929 4165365 4151478 4136296 4119224 4099950 4078696 4055476
48873 4055476 4029697 4000812 3968916 3934475 3897866 3859461 3819836 3779606 3739244 3699323 3660700
48862 3660700 3624195 3590097 3558066 3527437 3497644 3468637 3440906 3414914 3390535 3367401 3345693
48851 3345693 3326052 3308633 3292852 3278383 3265826 3255962 3248740 3243429 3239493 3236906 3235931 3237013 3240605
48838 3240605 3246631 3254320 3262986 3272722 3283894 3296243 3309064 3322072 3335488 3349305 3363110 3376645
48826 3376645 3389992 3403138 3415898 3428404 3441160 3454357 3467620 3480636 3493686 3507235 3521315
48815 3521315 3535612 3549924 3564189 3578239 3591879 3605268 3618948 3633324 3648183 3662876 3677050
48804 3677050 3691083 3705641 3720927 3736717 3753134 3770787 3789806 3809216 3827785 3845188 3861746
48793 3861746 3877314 3891237 3903364 3914284 3924356 3933250 3940747 3947306 3953326 3958312 3961221 3961270 3958016
48780 3958016 3951096 3940505 3926924 3911196 3893510 3873533 3851221 3827043 3801366 3774055 3744885
48769 3744885 3714121 3682489 3650634 3618656 3586226 3553165 3519808 3486601 3453477 3420081 3386655
48758 3386655 3354165 3323212 3293343 3263957 3235511 3209145 3185282 3163280 3142473 3122867 3104658
48747 3104658 3087742 3072041 3057837 3045321 3034141 3023824 3014466 3006589 3000504 2996143 2993388 2992054
48735 2992054 2991469 2990533 2988534 2985780 2983219 2981513 2980581 2979960 2979389 2978991 2979054 2979803 2981349 2983657 2986411 2988963
48719 2988963 2990631 2991152 2990793 2989882 2988322 2985763 2982241 2978402 2974903 2971773 2968685 2965769 2963763 2963221 2963869
48704 2963869 2964945 2965920 2966623 2966939 2966858 2966731 2967020 2967715 2968363 2968754 2969187 2969990 2971229 2973055 2975785 2979202 2982144
48687 2982144 2983335 2982498 2980364 2977808 2975414 2973610 2972591 2972095 2971666 2971144 2970463 2969098 2966297 2961832 2955948
48672 2955948 2948547 2939182 2928129 2916699 2905984 2895811 2885356 2874165 2862036 2848589 2833877 2819077
48660 2819077 2805470 2792702 2778877 2762388 2742889 2720471 2695063 2667180 2638381 2610170 2582884
48649 2582884 2556298 2530822 2507272 2485726 2465508 2446304 2428502 2412208 2396604 2380657 2364053
48638 2364053 2347077 2329908 2312474 2294896 2277666 2261300 2245993 2231603 2217819 2204278 2190602
48627 2190602 2176469 2161733 2146510 2131170 2116223 2102182 2089353 2077599 2066410 2055504 2045384
48616 2045384 2036932 2030313 2024741 2019668 2015765 2014094 2014490 2015463 2015698 2015002 2013605 2011306 2007815 2003489 1999132
48601 1999132 1995199 1991571 1987981 1984313 1980609 1977111 1974206 1972038 1970178 1967800 1964046 1958162 1949707 1938997
48587 1938997 1927154 1915237 1903442 1891391 1878988 1866548 1854339 1842557 1831688 1822231 1813937 1805891
48575 1805891 1797552 1789336 1782042 1776174 1771947 1769350 1767885 1766730 1765700 1765659 1767487 1770828 1774320 1776801
48561 1776801 1777728 1776620 1772847 1766242 1757453 1747421 1736740 1725699 1714667 1704226 1694946 1687111 1680537
48548 1680537 1674631 1668683 1662098 1654295 1644704 1633270 1620865 1608671 1597062 1585578 1574062 1563256
48536 1563256 1553868 1545587 1537636 1530004 1523460 1518482 1514860 1512487 1511827 1513212 1516164 1519945 1524619 1531176
48522 1531176 1540535 1552530 1565606 1577180 1584447 1585410 1579648 1568305 1553423 1537174 1521288 1506754
48510 1506754 1493928 1483069 1474749 1469628 1467855 1468894 1472042 1476948 1483517 1491427 1500011 1508778 1517935
48497 1517935 1528085 1539104 1549285 1555764 1556043 1549359 1536909 1520976 1503607 1485598 1466545 1446011
48485 1446011 1424630 1403872 1384807 1367572 1352026 1338254 1326087 1314845 1304176 1294759 1287438 1281958
48473 1281958 1277216 1272561 1268050 1263569 1258676 1253520 1249053 1245933 1243835 1242201 1241097 1240835 1241277 1242038 1243077
48458 1243077 1244639 1246800 1249369 1251935 1253743 1253906 1252128 1248954 1245009 1240379 1235078 1229658 1224759 1220323
48444 1220323 1215801 1210932 1205742 1199931 1192923 1184612 1175585 1166451 1157359 1148276 1139423 1131247 1124083 1117960
48430 1117960 1112670 1108038 1104066 1100673 1097315 1093242 1088322 1083268 1078793 1074867 1071034 1067092 1063069 1058881
48416 1058881 1054477 1050079 1045863 1041593 1036989 1032185 1027434 1022666 1017814 1013254 1009367 1005873 1002240 998571
48402 998571 995460 993131 991336 990010 989339 989148 988821 987897 986288 984018 981270 978631 976706 975486 974604
48387 974604 974095 974303 975139 976140 977275 979010 981547 984620 988097 992116 996613 1001366 1006555 1012575 1019261
48372 1019261 1025971 1032525 1039298 1046286 1052972 1059304 1065982 1073503 1081704 1090561 1100580 1111951 1124043
48359 1124043 1136227 1148594 1161451 1174761 1188533 1203199 1219160 1236410 1254864 1274523 1295073
48348 1295073 1316059 1337822 1361496 1387593 1415276 1443533 1472354 1502101 1532232 1561360 1588333
48337 1588333 1612973 1636224 1659942 1686035 1715315 1747420 1781926 1818951 1858629 1900867 1945972
48326 1945972 1994798 2047919 2105317 2167194 2234366 2307630 2387377 2473892 2567233 2666865 2772458
48315 2772458 2885037 3006265 3136920 3277784 3431960 3604434 3799445 4020584 4273719
48306 4273719 4567198 4908840 5305672 5767278 6306035 6933329 7659595 8499178 9470254
48297 9470254 10588632 11866935 13315023 14913895 16559286 18031495 19054662 19424834
48289 19424834 19105564 18217499 16951215 15486269 13959437 12465837 11066487 9796345
48281 9796345 8673281 7702995 6879236 6186332 5605893 5121077 4715817 4374475 4084461
48272 4084461 3837214 3625616 3442483 3282324 3142168 3019294 2909922 2811148 2722309 2643096
48262 2643096 2571766 2506469 2446933 2393415 2344947 2299926 2257684 2218313 2181476 2146501 2113298
48251 2113298 2082288 2053555 2026721 2001511 1978050 1956741 1938012 1921823 1907249 1893014 1878659
48240 1878659 1864839 1852285 1840910 1829936 1818349 1805016 1789022 1770182 1748908 1725531 1700282
48229 1700282 1673899 1647531 1621815 1596624 1571878 1547891 1524759 1502111 1479722 1457681 1435721
48218 1435721 1413190 1390130 1367622 1346462 1326055 1305235 1283699 1261972 1240366 1218610 1196388
48207 1196388 1173738 1150940 1128418 1106653 1085921 1066153 1047186 1029061 1011987 996208 981880
48196 981880 968760 956074 943145 930283 918562 908561 899815 891673 884058 876998 870024 862646 855156
48183 855156 848357 842610 837552 832652 827744 823046 818903 815368 811971 808101 803745 799500 795722 792079
48169 792079 788228 784525 781636 779679 778149 776490 774397 771765 768718 765642 762916 760694 759082 758250
48155 758250 758099 758074 757669 756953 756369 756151 756168 756107 755554 754231 752516 751460 751823 753280 754957 756527 758248
48138 758248 760131 761707 762690 763221 763394 763105 762654 762938 764559 767045 769400 771318 773428 776342 779872 783324
48122 783324 786325 789079 791932 794989 798279 802078 806797 812517 818803 825106 831337 837957 845471 853768
48108 853768 862093 869819 877227 885226 894254 903848 913561 923849 935403 947886 960198 972128 984892
48095 984892 999528 1015352 1030663 1044636 1057881 1071290 1084974 1098359 1110849 1122272 1133030
48084 1133030 1143918 1155492 1167493 1179065 1189602 1199201 1208296 1217128 1225673 1233854 1241633 1248988 1255916
48071 1255916 1262426 1268494 1274087 1279285 1284358 1289672 1295464 1301709 1308116 1314340 1320116 1325214 1329328 1332194
48057 1332194 1333847 1334539 1334338 1332944 1330010 1325490 1319533 1312153 1303181 1292552 1280573 1267977 1255664
48044 1255664 1244135 1232998 1221171 1207728 1192523 1175998 1158604 1140612 1122322 1104140 1086345
48033 1086345 1068858 1051316 1033510 1015860 999333 984572 971112 957758 943834 929700 915947
48022 915947 902545 889090 875514 862123 849196 836968 825821 815966 807013 798289 789600 781323
48010 781323 773791 767044 761228 756731 753622 751231 748604 745321 741772 738726 736655 735407 734431 733317
47996 733317 732020 730541 728650 726241 723812 722218 721860 722371 723088 723532 723431 722626 721184 719376 717390 715198
47980 715198 712807 710451 708360 706430 704284 701676 698799 696192 694285 692933 691476 689476 687289 685676
47966 685676 684869 684308 683395 682204 681263 680878 680936 681312 682188 683875 686410 689431 692487 695425 698368 701398
47950 701398 704467 707638 711133 714963 718850 722860 727764 734297 742146 750302 758350 766783 775888 784992
47936 784992 793244 800634 807759 814930 821996 828813 835297 841132 845880 849413 851853 853096 852762 850718
47922 850718 847357 843290 838905 834275 829310 823953 818294 812400 806051 798947 791415 784532 779088 774641
47908 774641 770129 765288 760852 757407 754762 752632 751198 750579 750359 750145 750170 750836 752053 753608 755811 759039
47892 759039 762837 766296 769358 773018 778041 784119 790557 797121 803833 810472 816869 823403 830589 838238
47878 838238 845486 851679 856923 861754 866504 870999 874623 876694 876972 875786 873578 870471 866462 861835
47864 861835 856939 851606 845164 837186 827974 818242 808578 799320 790616 782368 774249 766065 758115 750960
47850 750960 744844 739510 734686 730610 727778 726140 724885 723351 722009 722082 724057 727026 729723 731835 733954
47835 733954 736603 739860 743698 748055 752564 756674 760243 763605 766995 770324 773622 777301 781776 787096
47821 787096 793103 799573 806048 811921 817034 822028 827854 835009 843367 852512 862141 872317 883475 895996
47807 895996 909677 923818 937845 951632 965239 978686 991989 1004936 1016697 1026170 1032924 1037386
47795 1037386 1039900 1040241 1038362 1034997 1030951 1026244 1020533 1013999 1007122 999877 991853 983155 974535 966655
47781 966655 959667 953505 948091 943311 939143 935678 932648 929191 924657 919473 914584 910185 905686 900815
47767 900815 895904 891026 885712 879879 874335 869981 866939 864707 862668 860226 857095 853784 851281 849903
47753 849903 848927 847723 846689 846618 847696 849656 852492 856349 861007 866121 871796 878348 885646 893297 901446
47738 901446 910785 921683 933771 946511 959777 973726 988307 1003022 1017025 1029570 1040617 1050907
47726 1050907 1061106 1070868 1079131 1085344 1089989 1093740 1096552 1097939 1097858 1096817 1095044 1091928 1086565 1078747
47712 1078747 1069181 1058756 1047909 1036803 1025809 1015386 1005560 995981 986528 977453 968844 960426 952199
47699 952199 944916 939487 936105 934274 933513 933673 934793 937094 940998 946690 953640 960969 968318 976020 984478
47684 984478 993779 1003965 1015178 1027299 1039830 1052321 1064581 1076280 1086844 1096143 1104882 1113691
47672 1113691 1121985 1128372 1132305 1134670 1136455 1137376 1136388 1133218 1128652 1123245 1116462 1107530 1096632 1084724
47658 1084724 1072428 1059733 1046820 1034432 1023149 1012720 1002526 992411 982668 973500 965006 957656
47646 957656 952187 948794 946806 945438 944674 945067 946781 949148 951298 953017 954802 957191 960289 963967 968252
47631 968252 973308 979163 985752 993293 1002379 1013529 1026730 1041532 1057538 1074685 1092950 1111795
47619 1111795 1130004 1146303 1160258 1172314 1182691 1190468 1194200 1193345 1188548 1180410 1168596 1152535
47607 1152535 1132605 1110071 1086026 1060745 1034054 1006049 977441 949388 922898 898202 874824
47596 874824 852363 831041 811417 793882 778586 765426 753730 742360 730715 719446 709667 701669
47584 701669 694971 689392 685185 681965 678417 673601 668047 663004 658901 655018 650526 645404 640390 636327
47570 636327 633571 631701 629738 626831 622858 618376 614048 610149 606563 603124 599897 597085 594664 592264
47556 592264 589577 586765 584273 582260 580486 578722 576970 575226 573374 571495 569995 569121 568509 567562 566280
47541 566280 565391 565535 566435 567115 566940 566323 566313 567561 569813 572314 574400 575725 576330 576785 577890 579775 581499
47524 581499 582008 581360 580528 580075 579707 579210 579106 579972 581542 582967 583708 583866 583865 584215 585328 587136 588952 590039
47506 590039 590327 590360 590653 591327 592223 593073 593614 593848 594117 594654 595115 594877 593827 592539 591564 590868 590137 589392
47488 589392 589015 589250 589953 590868 591902 593005 593950 594574 595210 596529 598752 601272 603332 604853 606202 607357
47472 607357 607953 608191 609005 610962 613478 615613 617286 619214 621864 625019 628264 631370 634140 636303 637773
47457 637773 638740 639478 640204 641116 642304 643676 645252 647528 651149 656161 661866 667575 673278 679516 686849
47442 686849 695563 705557 716335 727336 738498 750319 763188 776876 790899 805165 819841 834637
47430 834637 848607 860881 871425 880836 889413 896563 901196 902703 901478 898508 894444 889151 882122
47417 882122 873209 862894 851898 840740 829678 818959 808904 799741 791435 783715 776165 768334 760011
47404 760011 751568 743827 737287 731577 725982 720442 715691 712390 710532 709775 709863 710436 710876 710881 710956 711873 713709
47387 713709 715833 717788 719799 722409 725968 730492 735683 741082 746431 751902 757621 763098 767469 770338
47373 770338 771985 772772 772831 772322 771389 769666 766436 761659 756289 751089 745589 738837 730863 722643 714720
47358 714720 706601 697746 688470 679503 671082 662949 655032 647635 640934 634667 628547 622779 617852 613827
47344 613827 610075 605954 601606 597897 595534 594459 594081 593858 593534 593120 592818 592827 593017 592975 592558 592193 592373 593090
47326 593090 594100 595561 597875 600852 603559 605290 606374 607761 609995 612811 615517 617485 618439 618579 618457
47311 618457 618487 618558 618294 617647 616999 616667 616576 616540 616636 617106 618060 619483 621490 624289 627884 631981 636267 640662
47293 640662 645293 650403 656289 663065 670294 677086 682890 688140 693878 700736 708493 716616 724895 733397
47279 733397 742022 750423 758386 766157 774282 783018 791877 799863 806395 811943 817532 823606 829629 834867
47265 834867 839233 843252 847546 852594 858698 865706 872735 878433 881562 881344 877531 870476 861059 850223
47251 850223 838573 826553 814773 803773 793538 783735 774457 766370 760019 755361 752115 750072 748843
47238 748843 747733 746333 745018 744475 744856 745846 747393 749838 753213 756899 760314 763656 767628 772587 778330
47223 778330 784625 791488 798778 805924 812420 818357 824060 829313 833502 836540 839031 841220 842379 841800
47209 841800 840027 838362 837259 835923 833529 830146 826297 822268 818267 814696 811800 809405 807433 806310
47195 806310 806397 807316 808384 809497 811160 813798 817531 822362 828010 833781 839271 845182 852690 861961 872024
47180 872024 882284 893366 906066 920144 934696 949246 963803 978235 992242 1005801 1019035
47169 1019035 1031679 1043142 1053150 1061908 1069658 1076425 1082165 1086789 1089994 1091414 1091027 1089098 1085754
47156 1085754 1080955 1074979 1068562 1062385 1056659 1051266 1046019 1040700 1035143 1029529 1024315 1019766 1015768 1012250
47142 1012250 1009427 1007414 1005919 1004674 1003953 1004254 1005659 1007893 1010951 1015161 1020527 1026411 1032133 1037630
47128 1037630 1043219 1048783 1053434 1056113 1056562 1055588 1054271 1052814 1050338 1045904 1039583 1032250 1024476 1015985
47114 1015985 1006282 995489 984300 973335 962722 952280 941932 931923 922616 914066 905855 897517
47102 897517 889093 881008 873424 866087 858897 852212 846333 841061 836182 832099 829437 828079 827085 825667
47088 825667 823921 822551 822258 823444 826049 829399 832515 834879 836780 838928 841988 846517 852769 860191
47074 860191 867426 873301 877615 880743 882851 884056 885046 886750 889220 891465 892603 892789 892772 893018 893603 894595
47058 894595 896118 898130 900482 903151 906194 909575 913264 917465 922487 928362 934704 941001 946985 952787
47044 952787 958802 965351 972435 979874 987603 995598 1003538 1010870 1017463 1023912 1030935 1038628 1046556 1054368
47030 1054368 1062006 1069434 1076593 1083597 1090633 1097651 1104505 1111412 1118836 1126671 1133910 1139439 1142994 1145095
47016 1145095 1146185 1146124 1144516 1141259 1136703 1131425 1125985 1120887 1116627 1113518 1111322 1109189 1106330 1102846
47002 1102846 1099665 1097540 1096392 1095778 1095693 1096453 1097942 1099497 1100755 1102252 1104861 1108859 1113847 1119501 1125951
46987 1125951 1133302 1141102 1148646 1155693 1162637 1170039 1178299 1187781 1198798 1211154 1223970 1236289 1247835
46974 1247835 1258954 1269985 1280975 1291905 1302811 1313666 1324424 1335126 1345627 1355254 1363246 1369704
46962 1369704 1375612 1381620 1387275 1391789 1395183 1398155 1401084 1403775 1406066 1408052 1409635 1410430 1410445 1410463 1411499
46947 1411499 1414063 1418107 1423368 1429483 1435937 1442324 1448671 1455341 1462566 1470140 1477598 1484659 1491569 1498979
46933 1498979 1507346 1516450 1525621 1534478 1543221 1552108 1560920 1569171 1576700 1583689 1590115 1595440 1598973 1600369
46919 1600369 1599639 1596799 1591739 1584531 1575808 1566597 1557625 1548782 1539372 1528896 1517492 1505755 1494428
46906 1494428 1484342 1476258 1470410 1466337 1463483 1461916 1462181 1464535 1468728 1474604 1482513 1492821 1505288
46893 1505288 1519299 1534615 1551535 1570232 1590239 1610751 1631276 1651734 1671996 1691634 1710242
46882 1710242 1727807 1744496 1760123 1774148 1786295 1796987 1806903 1816226 1824534 1831372 1836709 1840915
46870 1840915 1844582 1848428 1853073 1858715 1865163 1872264 1880061 1888482 1897183 1905996 1915348 1925908 1937901
46857 1937901 1950968 1964575 1978216 1991348 2003557 2014879 2025600 2035594 2044098 2050317 2054100 2055930
46845 2055930 2056438 2055978 2054453 2051401 2046508 2040165 2033338 2026749 2020441 2014250 2008355 2003060 1998321 1993968
46831 1993968 1990280 1987917 1987299 1988369 1990962 1995034 2000462 2006977 2014469 2023121 2033058 2043980 2055233 2066156
46817 2066156 2076329 2085637 2094103 2101523 2107327 2111072 2113000 2113808 2113760 2112363 2109055 2103921 2097554 2090447
46803 2090447 2082729 2074242 2064688 2053896 2042206 2030392 2018959 2007671 1996032 1984054 1972247 1961028
46791 1961028 1950540 1941023 1932945 1926662 1922139 1919042 1916849 1914927 1912883 1910989 1909958 1910098 1910891 1911642
46777 1911642 1912296 1913268 1914551 1915436 1915287 1914370 1913602 1913589 1914188 1915052 1916234 1918010 1920353 1923049 1926276 1930555
46761 1930555 1935906 1941527 1946708 1951837 1958076 1966105 1975592 1985803 1996285 2006858 2017381 2027765 2037934
46748 2037934 2047674 2056716 2065144 2073434 2081827 2089876 2096851 2102514 2107234 2111469 2115365 2118811 2121660 2123819
46734 2123819 2125347 2126485 2127472 2128374 2129282 2130634 2133046 2136640 2140719 2144296 2146967 2149167 2151640 2154744 2158221
46719 2158221 2161510 2164240 2166475 2168490 2170346 2171715 2172103 2171072 2168198 2163071 2155711 2146866 2137512 2127881
46705 2127881 2117187 2104491 2089617 2073164 2055913 2038438 2020966 2003241 1984722 1965304 1945662
46694 1945662 1926503 1907661 1888490 1869052 1850302 1832945 1816761 1801255 1786417 1772545 1759834
46683 1759834 1748498 1738755 1730253 1722041 1713606 1705465 1698202 1691499 1684908 1679010 1674748 1671859 1669182 1666600
46669 1666600 1665473 1666736 1669634 1672900 1676316 1680398 1685331 1691149 1698499 1708200 1720083 1733010 1746037
46656 1746037 1758929 1771606 1783818 1795516 1806948 1818033 1828022 1836135 1842339 1847261 1851443 1854887
46644 1854887 1857304 1858677 1859473 1860294 1861365 1862529 1863793 1865634 1868682 1873346 1879941 1888917 1900549 1914439
46630 1914439 1929670 1945486 1961558 1977591 1993047 2007420 2020607 2032768 2043888 2053561 2061195 2066405
46618 2066405 2069198 2069771 2068083 2063677 2055962 2044635 2029893 2012441 1993348 1973637 1953687 1933122
46606 1933122 1911551 1889391 1867758 1847514 1828614 1810427 1792560 1775250 1759012 1744026 1729942
46595 1729942 1716350 1703316 1691262 1680318 1670077 1660075 1650241 1640736 1631613 1622825 1614354 1606102
46583 1606102 1597893 1589787 1582114 1574877 1567491 1559590 1551770 1544956 1539160 1533548 1527654 1521842 1516469 1511399
46569 1511399 1506644 1502849 1500607 1499703 1499509 1499736 1500343 1501011 1501316 1501285 1501289 1501447 1501663 1502203 1503697 1506395 1509782
46552 1509782 1513129 1516179 1519108 1522126 1525410 1529320 1534375 1540888 1548690 1557209 1565777 1573975 1581809 1589612
46538 1589612 1597757 1606454 1615812 1626086 1637745 1651219 1666561 1683377 1701085 1719184 1737339 1755413
46526 1755413 1773559 1792177 1811602 1831794 1852436 1873235 1893986 1914404 1934155 1953104 1971280
46515 1971280 1988476 2004106 2017699 2029417 2039858 2049357 2057657 2064238 2068845 2071650 2073074 2073502 2073140
46502 2073140 2072021 2070073 2067193 2063360 2058811 2054047 2049406 2044600 2038891 2031922 2024190 2016407 2008525 1999774
46488 1999774 1989695 1978742 1967613 1956215 1943710 1929476 1913682 1896831 1879119 1860428 1840735
46477 1840735 1820147 1798714 1776557 1754242 1732668 1712415 1693389 1675203 1657683 1640847 1624675
46466 1624675 1609248 1595008 1582646 1572761 1565779 1561970 1561183 1562650 1565432 1569216 1574355 1581082 1588965
46453 1588965 1597361 1606116 1615531 1625715 1636281 1646733 1657006 1667461 1678300 1688999 1698484 1705979
46441 1705979 1711675 1716466 1721053 1725372 1728821 1730881 1731600 1731696 1732195 1733729 1736102 1738645 1741025 1743523 1746605
46426 1746605 1750551 1755602 1762164 1770617 1781055 1793353 1807407 1823193 1840715 1860088 1881560 1905351
46414 1905351 1931422 1959481 1989154 2020211 2052684 2086726 2122204 2158462 2194679 2230459 2265864
46403 2265864 2300870 2334978 2367372 2397240 2424042 2447793 2469046 2488167 2504559 2517051 2525173
$$ [...]
##END NTUPLES=NMR SPECTRUM
##END=
