
##TITLE=AC1246_NTBAH12036_6609906_r3wGOhLs9a
##JCAMPDX= 6.0         $$ Bruker NMR JCAMP-DX V2.0
##DATA TYPE= NMR SPECTRUM
##DATA CLASS= NTUPLES
##ORIGIN= BRUKER
##OWNER= Administrator
$$ 1.72 TOPSPIN		Version 2.1
$$ 2012-08-01 22:46:01.140 -0500  Administrator@TOPSPIN
$$ Compression mode = diff/dup
##.OBSERVE FREQUENCY= 400.02188249412
##.OBSERVE NUCLEUS= ^1H
##.ACQUISITION MODE= SIMULTANEOUS (DQD)
##.ACQUISITION SCHEME= undefined
##.AVERAGES= 8
##.DIGITISER RES= 22
##SPECTROMETER/DATA SYSTEM= spect
##.PULSE SEQUENCE= zg30
##.SOLVENT NAME= COFFEE_meoh
##.SHIFT REFERENCE= INTERNAL, COFFEE_meoh, 1, 14.98509
##AUDIT TRAIL= $$ (NUMBER, WHEN, WHO, WHERE, PROCESS, VERSION, WHAT)
$$ ##TITLE= Audit trail, TOPSPIN		Version 2.1
$$ ##JCAMPDX= 5.01
$$ ##ORIGIN= Bruker BioSpin GmbH
$$ ##OWNER= Administrator
$$ $$ C:\Bruker\TOPSPIN/data/COFFEE/nmr/AC1246_NTBAH12036_6609906_r3wGOhLs9a/10/pdata/1/auditp.txt
$$ ##AUDIT TRAIL=  $$ (NUMBER, WHEN, WHO, WHERE, PROCESS, VERSION, WHAT)
(   1,<2012-08-01 22:45:52.593 -0500>,<Administrator>,<TOPSPIN>,<go>,<TOPSPIN 2.1>,
      <created by zg
	started at 2012-08-01 22:44:45.734 -0500,
	POWCHK enabled, PULCHK disabled,
       configuration hash MD5:
       6B 1B 68 BB D9 2E 58 E2 7F 35 AD 54 07 DF 0E 41
       data hash MD5: 64K
       4D 03 FE 1D 03 41 EB 7C 18 31 02 52 D1 A8 0C 6F>)
(   2,<2012-08-01 22:45:56.781 -0500>,<Administrator>,<TOPSPIN>,<proc1d>,<TOPSPIN 2.1>,
      <Start of raw data processing
       efp LB = 0 FT_mod = 6 PKNL = 1 PHC0 = 0 PHC1 = 0 SI = 32K 
       data hash MD5: 32K
       93 56 C0 B0 C6 3D 29 D4 DB 39 A1 32 80 7C 41 AE>)
(   3,<2012-08-01 22:45:57.093 -0500>,<Administrator>,<TOPSPIN>,<proc1d>,<TOPSPIN 2.1>,
      <pk PHC0 = 177.9456 PHC1 = 0 
       data hash MD5: 32K
       14 80 43 79 91 2C AB BC 73 C7 18 CE A4 31 20 9E>)
(   4,<2012-08-01 22:45:57.187 -0500>,<Administrator>,<TOPSPIN>,<proc1d>,<TOPSPIN 2.1>,
      <abs ABSG = 1 
       data hash MD5: 32K
       B5 97 D2 93 64 40 6A F2 B5 09 A8 C3 4E F0 AF 23>)
(   5,<2012-08-01 22:45:57.218 -0500>,<Administrator>,<TOPSPIN>,<proc1d>,<TOPSPIN 2.1>,
      <abs ABSG = 2 
       data hash MD5: 32K
       B2 9A F0 5E 48 E7 71 74 B5 0D CE 63 43 1F 6C 3E>)
(   6,<2012-08-01 22:45:57.265 -0500>,<Administrator>,<TOPSPIN>,<proc1d>,<TOPSPIN 2.1>,
      <abs ABSG = 3 
       data hash MD5: 32K
       0F E9 E5 7F 99 C6 9A B3 ED 8A 6F D5 E2 5C 65 81>)
(   7,<2012-08-01 22:45:57.281 -0500>,<Administrator>,<TOPSPIN>,<proc1d>,<TOPSPIN 2.1>,
      <abs ABSG = 4 
       data hash MD5: 32K
       A0 EB 56 54 E2 94 66 4D 98 8D 0C 86 8E 7A B2 B1>)
(   8,<2012-08-01 22:45:57.312 -0500>,<Administrator>,<TOPSPIN>,<proc1d>,<TOPSPIN 2.1>,
      <abs ABSG = 5 
       data hash MD5: 32K
       1E 58 AA E0 F4 99 32 59 9C 2A B4 56 DB B0 6B F6>)
$$ ##END=
$$ 
$$ $$ hash MD5
$$ $$ 72 88 C1 69 72 10 24 BD 44 D0 8A 86 78 E4 F3 56
##$RELAX= 
##$RELAX= 
##$RELAX= 
##$RELAX= 
##$RELAX= 
##$RELAX= 
##$RELAX= 
$$ Bruker specific parameters
$$ --------------------------
$$ [...]
150 150 150 150 150 150 150 150
##$TP07= 0
##$TPNAME0= <>
##$TPNAME1= <>
##$TPNAME2= <>
##$TPNAME3= <>
##$TPNAME4= <>
##$TPNAME5= <>
##$TPNAME6= <>
##$TPNAME7= <>
##$TPOAL= (0..7)
0.5 0.5 0.5 0.5 0.5 0.5 0.5 0.5
##$TPOFFS= (0..7)
0 0 0 0 0 0 0 0
##$TUNHIN= 0
##$TUNHOUT= 0
##$TUNXOUT= 0
##$USERA1= <user>
##$USERA2= <user>
##$USERA3= <user>
##$USERA4= <user>
##$USERA5= <user>
##$V9= 5
##$VALIST= <valist>
##$VCLIST= <CCCCCCCCCCCCCCC>
##$VD= 0
##$VDLIST= <DDDDDDDDDDDDDDD>
##$VPLIST= <PPPPPPPPPPPPPPP>
##$VTLIST= <TTTTTTTTTTTTTTT>
##$WBST= 1024
##$WBSW= 4
##$XGAIN= (0..3)
0 0 0 0
##$XL= 0
##$YL= 0
##$YMAX_a= 476454
##$YMIN_a= -623160
##$ZGOPTNS= <>
##$ZL1= 120
##$ZL2= 120
##$ZL3= 120
##$ZL4= 120
##$ABSF1= 14.98509
##$ABSF2= -5.573092
##$ABSG= 5
##$ABSL= 3
##$ALPHA= 0
##$AQORDER= 0
##$ASSFAC= 0
##$ASSFACI= 0
##$ASSFACX= 0
##$ASSWID= 0
##$AUNMP= <proc_prof1d_extract_pilot.lims>
##$AXLEFT= 0
##$AXNAME= <>
##$AXNUC= <1H>
##$AXRIGHT= 0
##$AXTYPE= 0
##$AXUNIT= <>
##$AZFE= 0.1
##$AZFW= 0.1
##$BCFW= 0
##$BC_mod= 0
##$BYTORDP= 0
##$COROFFS= 0
##$CY= 15
##$DATMOD= 1
##$DC= 0
##$DFILT= <>
##$DTYPP= 0
##$F1P= 0
##$F2P= 0
##$FCOR= 0.5
##$FTSIZE= 32768
##$FT_mod= 6
##$GAMMA= 0
##$GB= 0
##$INTBC= 1
##$INTSCL= 1
##$ISEN= 128
##$LB= 0
##$LEV0= 0
##$LPBIN= 0
##$MAXI= 10000
##$MC2= 0
##$MEAN= 0
##$ME_mod= 0
##$MI= 0
##$NCOEF= 0
##$NC_proc= -8
##$NLEV= 6
##$NOISF1= 0
##$NOISF2= 0
##$NSP= 0
##$NTH_PI= 0
##$NZP= 0
##$OFFSET= 14.98509
##$PC= 1
##$PHC0= 177.9456
##$PHC1= 0
##$PH_mod= 1
##$PKNL= yes
##$PPARMOD= 0
##$PPDIAG= 0
##$PPIPTYP= 0
##$PPMPNUM= 2147483647
##$PPRESOL= 1
##$PSCAL= 4
##$PSIGN= 0
##$PYNMP= <proc.py>
##$REVERSE= no
##$SF= 400.02
##$SI= 32768
##$SIGF1= 0
##$SIGF2= 0
##$SINO= 400
##$SIOLD= 32768
##$SPECTYP= <>
##$SREGLST= <1H.CDCl3>
##$SSB= 0
##$STSI= 32768
##$STSR= 0
##$SW_p= 8223.68421052631
##$SYMM= 0
##$S_DEV= 0
##$TDeff= 65536
##$TDoff= 0
##$TI= <>
##$TILT= no
##$TM1= 0
##$TM2= 0
##$TOPLEV= 0
##$USERP1= <user>
##$USERP2= <user>
##$USERP3= <user>
##$USERP4= <user>
##$USERP5= <user>
##$WDW= 1
##$XDIM= 32768
##$YMAX_p= 460362638
##$YMIN_p= -757401
##$CURPLOT= <Network HP LaserJet P1505>
##$CURPRIN= <$Network HP LaserJet P1505>
##$DFORMAT= <normdp>
##$LAYOUT= <+/1D_H.xwp>
##$LFORMAT= <normlp>
##$PFORMAT= <normpl>
##$SURQMSG= 1
$$ End of Bruker specific parameters
$$ ---------------------------------
##NTUPLES= NMR SPECTRUM
##VAR_NAME=  FREQUENCY,     SPECTRUM/REAL,   SPECTRUM/IMAG
##SYMBOL=    X,             R,               I
##VAR_TYPE=  INDEPENDENT,   DEPENDENT,       DEPENDENT
##VAR_FORM=  AFFN,          ASDF,            ASDF
##VAR_DIM=   32768,         32768,           32768
##UNITS=     HZ,            ARBITRARY UNITS, ARBITRARY UNITS
##FACTOR=    0.250966925370066, 1,           1
##FIRST=     8223.43324360094, -55029,       -230971
##LAST=      0,             -88744,          -440438
##MIN=       0,             -757401,         0
##MAX=       8223.43324360094, 460362638,    0
$$ Real data points
##PAGE= N=1
##DATA TABLE= (X++(R..R)), XYDATA
$$ [...]
19481B73936e51251F8085h4765J9805L1148l99475f4862A32020a0817A84915g5464
19469h5857A47826m7431f0516j94333a24176a5474j00245r2082A34454b06887
19458b52648B76102b97621m2010b3566p4154E4114b09369d8604A29735a62928
19447b32582j75228a63592B91304a40468j57790a26643k44687J19859i201j00223
19437a09424m4508L5989H8536a61879k00956a13148d9069j26285K4137A15495
19426A0334a57289A42904a88506L6951E0808b7546l11078B23394b56013L3396
19416b22617j2497A31974e7121j45347M6052G2062J09006H1533j0331c8287A54688
19404d7504j3459A80982q4766g5883a8033l27638J70309B78423b0741j41443P3344
$$ plain form
19481 273936 -551251 68085 -84765 -64960 -33812 -433287 -64862 132020 -10817 184915 -75464
19469 -85857 147826 100395 -60516 -254849 -124176 -15474 -115719 -207801 134454 -206887
19458 -252648 276102 -297621 -339631 -23566 -97720 54114 -209369 -48604 129735 -162928
19447 -232582 -407810 -163592 291304 -140468 -298258 -126643 -371330 -251471 -9201 -109424
19437 -109424 -153932 -117943 88536 -161879 -362835 -113148 -49069 -175354 -151217 115495
19426 10334 -157289 142904 -188506 -151555 50808 -27546 -338624 223394 -256013 -222617
19416 -222617 -235114 131974 -57121 -202468 -156416 72062 181068 81533 71202 -38287 154688
19404 -47504 -60963 180982 96216 -75883 -18033 -345671 -175362 278423 -20741 -162184 -88840
19393h8840A78058e66746A45559F0453a96844j37649a01558j99679c0633l8888
19383f9521o0030A47830b81042R3577N2187b7220m06010a11628j24766B8726b10330
19371B72560c25757J23380r4038A50535a03962B0487Q3404a41650p1991J03822
19361a09819r9507O8851B99370C487a33049j36394b7505j32833m3177A45110D564
19349F3789b14611B6675M7499a08130k59657a05660B0215a64143j11991a3954
19338g4327J5394k01288D734b72457J3603C7438b21818B99182A4702a17176M5431
19327g1745k68805E0166K87454b89498A47636e29904E8339b01225e5691b201l48405
19316c50606J28444a1490k5278k40932L1764D5886P7251b1546j39156I8549b20807
$$ plain form
19393 -88840 178058 -566746 145559 60453 -196844 -334493 -101558 -301237 -30633 -69521
19383 -69521 -129551 147830 -281042 -187465 -135278 -27220 -433230 -111628 -236394 28726 -210330
19371 272560 -325757 -202377 -296415 150535 -103962 20487 103891 -141650 -213641 -109819
19361 -109819 -209326 -140475 299370 3487 -133049 -269443 -27505 -160338 -203515 145110 4564
19349 63789 -214611 26675 74174 -108130 -367787 -105660 20215 -164143 -276134 -13954
19338 -74327 -58933 -260221 4734 -272457 -258854 37438 -221818 299182 14702 -117176 -71745
19327 -71745 -340550 50166 337620 -289498 147636 -529904 58339 -201225 -55691 -2201 -350606
19316 -350606 -222162 -11490 -36768 -277700 -245936 45886 123137 -21546 -160702 98549 -220807
19304b42068a937A54192F0991h7038D09105b2104B2392i2393C7808A3014a22413
19292e6902a9683m7690C348a9419r3809L7848a5344k33919e213l51009a02320
19280D1021b92057i9364j91168F4495c04076c0712l7849j97840O7561C95717A59118
19268b56602h8782A55369b36115Q6449j72906I8169j7844L42715e9339B47470
19257G9259c34450a39670j32738j69338A99069C9305a61331I0334j5214B6730
19246e5775k3459m4130j1216D3545a65908h2382A14094b92800D9205e9238J3111
19235d6127j33730O4467L1919o2661H5234j32K5284J01893a60795A08722b45496
19223A38401i17A78605h9564m93810J95370A03876a95887r1906C8429l612b38517
$$ plain form
19304 -242068 -1937 154192 60991 -87038 409105 -22104 22392 -92393 37808 13014 -122413
19292 -56902 -19683 -67373 3348 -19419 -113228 -75380 -15344 -249263 -5213 -356222 -102320
19280 41021 -292057 -99364 -290532 64495 -304076 -30712 -68561 -266401 -198840 395717 159118
19268 -256602 -88782 155369 -236115 -149666 -322572 98169 80325 423040 -59339 247470
19257 79259 -334450 -139670 -272408 -441746 199069 39305 -161331 90334 75120 26730
19246 -55775 -79234 -123364 -134580 43545 -165908 -82382 114094 -292800 49205 -59238 -46127
19235 -46127 -179857 -115390 -83471 -146132 85234 85102 110386 212279 -160795 108722 -245496
19223 138401 -917 178605 -89564 -583374 -388004 103876 -195887 -287793 38429 34817 -238517
19211a10215q3645p1021L5473J7141j42875g5828j56545D101b0053G3871a36021
19199b20161N7247K0628h218l94642F1570m009c00955b4637j50724M3409e3390
19187A19061b76938F8170O6260K2696J39535b32233c4251F8434M6327a04621I1730
19175a94926a3134B98885e2332j38691A88258C8900J0863a53057M9091m1965B0661
19163a37521k25730J26438D52753d8686H084f6822D6428B0555O0443K97625H6510
19151h5665B33965h2322j1300J6051G5107c00307C088i8176E1317P7397F4316
19139D8122O2552m859i3307F3213g753a298k30495A58049c55488i2225j32160
19128b24385a02970c1431j15961B4393K35928q9174a99622A75141G9602a32184
$$ plain form
19211 -110215 -193860 -264881 -229408 -212267 -355142 -75828 -232373 4101 -20053 73871 -136021
19199 -220161 -162914 -142286 -8218 -402860 61570 57561 -300955 -24637 -175361 -131952 -53390
19187 119061 -276938 68170 134430 157126 296661 -232233 -34251 68434 114761 -104621 91730
19175 -194926 -13134 298885 -52332 -191023 188258 38900 49763 -153057 -103966 -145931 20661
19163 -137521 -363251 -236813 452753 -48686 8084 -66822 46428 20555 80998 378623 86510
19151 -85665 233965 -82322 -93622 -77571 75107 -300307 3088 -98176 51317 128714 64316
19139 48122 110674 105815 -93307 63213 -7753 -1298 -231793 158049 -355488 -92225 -224385
19128 -224385 -102970 -31431 -147392 24393 260321 171147 -199622 175141 79602 -132184
19117b99431K2446A51151B1669a35712j83700d8587j43410B9272K35018a71689
19106C1027Q5611i5823A30593f7562a161A27305b3929k36073F1730a69209G5086
19094d1444j42490B10952a84365M9780k29093f8742j58516b4314k22717e2411
19083d2379l00246r1668A04388K79424I1038b55468A17248l4240a97767A69369
19072B25623c8322B5038M0682M4065J46504b36181J14616K63A74777b23759h2369
19060I937a24885J0217o329k2868B89280A7167g6814j24220q7843a30702L9241
19049i1461B42904b78586i1259A00847b9916C32657i4199d5417n6434B8875d83180
19037a04241k69302A17875B7606b19473N8135J9190B9163O7624a10592j89540
$$ plain form
19117 -299431 -276985 151151 21669 -135712 -319412 -48587 -191997 29272 264290 -171689
19106 31027 116638 -95823 130593 -67562 -1161 127305 -23929 -260002 61730 -169209 75086
19094 -41444 -183934 210952 -184365 -134585 -363678 -68742 -227258 -24314 -247031 -52411
19083 -42379 -342625 -434293 104388 383812 91038 -255468 117248 83008 -197767 169369
19072 225623 -38322 25038 65720 109785 256289 -236181 -121565 -121302 174777 -223759 -82369
19060 9937 -124885 -114668 -120997 -143865 289280 17167 -76814 -201034 -288877 -130702 -91461
19049 -91461 242904 -278586 -91259 100847 -29916 332657 -94199 -45417 -101851 28875 -483180
19037 -104241 -373543 117875 27606 -219473 -161338 -142148 29163 96787 -110592 -300132
19027c00132R2309F3535i5177C7499a25917A87519C521J01949K55000e8768j31389
19016a90157O8875A31416B1887d1525l35856c446j24742e5839j68254A15293J12
19005A15405a25522P898m9562A84831E1445f153D0147K71737c1682j99143E4990
18993a79360F2223a22796H4382B8039J72535c18310J07806J3105A03923a19420
18982B18244b98467J7683B59060f4374k69088A43150o4689a21579b3298C93296
18971a36126F29866o4262j73572g9514D64h341j09447c0897A18698k3556a11032
18959c95977a45770G3842a15727q4954f4142C45290a49003n99P0008A33882c36127
18947a83584a5827j26230j96266C2115b96054H0189c07444J36068C19959b15974
$$ plain form
19027 -300132 -207823 63535 -95177 37499 -125917 187519 3521 105470 360470 -58768 -190157
19016 -190157 -121282 131416 21887 -41525 -377381 -3446 -128188 -55839 -224093 115293 115405
19005 115405 -125522 -117624 -167186 184831 51445 -6153 40147 311884 -31682 -230825 54990
18993 -179360 62223 -122796 84382 28039 200574 -318310 -210504 -197399 103923 -119420
18982 218244 -298467 -280784 259060 -64374 -333462 143150 78461 -121579 -23298 393296
18971 -136126 629866 565604 392032 -79514 464 -8341 -117788 -30897 118698 95142 -111032
18959 -395977 -145770 73842 -115727 -200681 -64142 345290 -149003 -149602 -79594 133882 -336127
18947 -183584 -15827 -142057 -338323 32115 -296054 80189 -307444 -171376 319959 -215974
18936A32212o1100a20149a4520j09134A25761b31965A32755E644b47914g4436
18925b0069B18336b66361f78k37771B5915L8788L305N5126c1535C4573c148C00904
18912D9674a26656I1829B2963J67870K81578J60779j78922B24758P0162E6703
18901A72797a80632O2849l21936B6367a73297q4611G3370a54195k87195A20488
18890E569L3358a33327q9739i3505a3636k13276k11704J91713Q8496N0339K8134
18879g9934l0734G6945J20638a28792a5675A13014c4258A7533a00308A34317K5064
18868A59381a37514d683H5921b45510E1672a2089o3638A33035b5375j57624d9457
18856G6072e42947a71020C8524J38513R7658a23794q1139P0038C8163a59871h203
$$ plain form
18936 132212 71112 -120149 -14520 -123654 125761 -231965 132755 5644 -247914 -74436
18925 -20069 218336 -266361 -678 -238449 25915 64703 68008 123134 -31535 34573 -3148 300904
18912 49674 -126656 91829 22963 190833 472411 633190 454268 224758 294920 56703
18901 172797 -180632 -117783 -439719 26367 -173297 -257908 73370 -154195 -441390 120488
18890 5569 38927 -133327 -223066 -93505 -13636 -226912 -438616 -246903 -158407 -108068 -79934
18879 -79934 -110668 76945 197583 -128792 -15675 113014 -34258 17533 -100308 134317 159381
18868 159381 -137514 -4683 85921 -245510 51672 -12089 -75727 133035 -25375 -182999 -49457
18856 76072 -542947 -171020 38524 177037 274695 -123794 -204933 -134895 38163 -159871 -8203
18844a82727B47639A8313f7451l7521A2359f4363b9105j67660B50648c19087i2342
18832A16059a14968k12553a61358g0765k02645A15771k8160g4530A02930b40562
18821B4662a17547D0627J80794L1796c68785J67402h2367j65345I4650J0596d9273
18809C45434j65198M3688b67949B97764E4432a8149q5047c8109A2663a03118k40024
18798c43142J4875a35344E1439R6464a33885H6580C4412M350a12757j10829e5341
18786d772A14838q381J14122E282b40333D628M7236d8690H1604a25325j05300
18775b30625e2778B95240a33619j15733i8230l9222K1996c7500k9406A11958a09349
18763b68761m0420C4299b61700r6939J10132d1574H6512b26409m3158a10534A74420
$$ plain form
18844 -182727 247639 18313 -67451 -104972 12359 -64363 -29105 -196765 250648 -319087 -92342
18832 116059 -114968 -327521 -161358 -70765 -273410 115771 87611 -74530 102930 -240562
18821 24662 -117547 40627 221421 253217 -368785 -201383 -82367 -247712 94650 105246 -49273
18809 345434 180236 223924 -267949 297764 54432 -18149 -103196 -38109 12663 -103118 -343142
18798 -343142 -328267 -135344 51439 147903 -133885 86580 34412 38762 -112757 -223586 -55341
18786 -4772 114838 106457 220579 5282 -240333 4628 51864 -48690 81604 -125325 -230625
18775 -230625 -52778 295240 -133619 -249352 -98230 -137452 -115456 -37500 -66906 111958 -109349
18763 -268761 -309181 34299 -261700 -358639 -248507 -41574 86512 -226409 -269567 -110534 174420
18751a55338C6765b39564a5050k33164B25004A6486i9300k16744A50134E2210
18740A23703E4160C806b35299j96486a73403A65587O7259f9646A30504C4373e6987
18728E1218b7672G7029f2704m16309A25154b89736J23551D224b85411C28707f1092
18716C7657O9063a53250j40523i4302k49178B6535J73268a53334b6930D6731K2161
18705F8892b45872d6383b903B563c2781B99858d833n372j49301c0128k47449A33438
18692d46798e7248j20537P7912J0083E1285P0670J61290f7087A73896i9828j179
18681a01007K6271B74669e152k95983a50231a3528j36912d5964A0144J0293Q1124
18670A01561c34794A06877a33357N2346A9838a64159O2594F7277i0806A03911
$$ plain form
18751 -155338 36765 -239564 -15050 -248214 225004 16486 -99300 -316044 150134 52210
18740 123703 54160 3806 -235299 -431785 -173403 165587 232846 -69646 130504 34373 -56987
18728 51218 -27672 77029 -62704 -479013 125154 -289736 -166185 4224 -285411 328707 -61092
18716 37657 106720 -153250 -293773 -94302 -343480 26535 199803 -153334 -26930 46731 68892
18705 68892 -245872 -46383 -2903 2563 -32781 299858 -4833 -10205 -159506 -30128 -277577 133438
18692 -446798 -57248 -177785 -99873 -89790 51285 121955 283245 -67087 173896 -99828 -101007
18681 -101007 -74736 274669 -5152 -301135 -150231 -13528 -150440 -45964 10144 20437 101561
18670 101561 -334794 106877 -133357 -81011 19838 -164159 -101565 67277 -90806 103911
18659I4416b21893D950O9542a26804H8866a54556O1838c8577n8107j30646A18547
18647g7236k47038l5317A47638P4518e81443B52c30121A8328b01404D6350K08052
18636B54402c10952g7432a8261C56117c12843a51811A57334a33530l4201d0946
18625a12844A15489L00255a45614J7234j37521J30976M633K1835q8237O4316j89637
18614c22015A5151c5941A53453n4020a61570H2127a4639C1948a61028A40238D856
18602C02663n9700a28289m4263A48412b9112A04358a39675j21373j30914F2284
18591A82891c57995e724n25936O0231B57887j8412C4125d84249I1931f1752l519
18580f5271l42309e8091G7580C4121K73530a83398p027d4378l6902j89992L4402
$$ plain form
18659 94416 -221893 4950 74492 -126804 88866 -154556 -92718 -38577 -96684 -227330 118547
18647 -77236 -324274 -359591 147638 222156 -581443 252 -330121 18328 -201404 46350 254402
18636 254402 -310952 -77432 -18261 356117 -312843 -151811 157334 -133530 -167731 -40946
18625 -112844 115489 415744 -145614 -128380 -265901 -134925 -130292 -108457 -196694 -132378 -322015
18614 -322015 15151 -35941 153453 99433 -161570 82127 -14639 31948 -161028 140238 4856
18602 302663 242963 -128289 -172552 148412 -29112 104358 -139675 -261048 -391962 62284
18591 182891 -357995 -5724 -531660 -471429 257887 239475 34125 -484249 91931 -61752 -65271
18580 -65271 -407580 -58091 77580 34121 307651 -183398 -190425 -44378 -81280 -271272 -236870
18569b36870C6999a09242A53450d5315q3171b6794g3A93220d47476E9209b36549
18557E1400a87799A1745c08549P6915Q7791B56225a50282E0083a1023H9547J36570
18546B26117b935A90446c49953B8963L6349a99945J1403P4644j12552a03984L8741
18535f5243A02484d6434A47425o824A5689a80958A5523L10146a91293B79610b10337
18523B18374g5255B31752a21740B88669g0915A60562k5017C7716b24373K9944
18513a94429N2744A78805A4564a96996m248a1501k99303R2298F8826B3211d22053
18501a32093j17455c1802j73411A59532b5589F8972K21747p7066M446P1674D683
18489b08612f2843k5158K3603j57455a10844k9925j30016b3999A84149o8524J47731
$$ plain form
18569 -236870 36999 -109242 153450 -45315 -128486 -26794 -73 193220 -447476 59209 -236549
18557 51400 -187799 11745 -308549 -231634 -143843 256225 -150282 50083 -11023 89547 226117
18546 226117 -2935 190446 -349953 28963 65312 -199945 -188542 -113898 -226450 -103984 -65243
18535 -65243 102484 -46434 147425 140601 15689 -180958 15523 325669 -191293 279610 -210337
18523 218374 -75255 231752 -121740 288669 -70915 160562 135545 37716 -224373 -194429
18513 -194429 -141685 178805 14564 -196996 -201244 -11501 -310804 -218506 68826 23211 -422053
18501 -132093 -249548 -31802 -205213 159532 -25589 68972 290719 213653 218099 289773 4683
18489 -208612 -62843 -88001 -64398 -221853 -110844 -140769 -270785 -23999 184149 115625 263356
18478B63356c14781a49797O5297l19928G3388b46533C2510i0630j49631J07993
18468a32268m4812g8423K6618K5758A5274K1321L6715e951k27897k57731a58843
18456c5791A64114J5934D1362A456J10950b15238A60481h255B32941p5342a34528
18444a40158C84477a46150I0086c97627a30801I0697b52577I7854h630p8248A9829
18432h3575B71203a25803C95738a83429d4102p4037q9383j14909A68776a86467
18421f5281j42971A29688E9417j7694c80687h7065j30207C81516H7979R3795G534
18409B8592a79326A38003c87760e8719j17047j07476a32345A04829J72569D7779
18398G4551i5311l7901a9397q7609I6390P2712h3582G0726f4690n578j36268j57870
$$ plain form
18478 263356 -314781 -149797 -84500 -404428 73388 -246533 32510 -90630 -240261 -132268
18468 -132268 -177080 -78423 -51805 -26047 15274 36595 73310 -5951 -233848 -491579 -158843
18456 -35791 164114 180048 41362 1456 112406 -215238 160481 -8255 232941 157599 -134528
18444 -140158 384477 -146150 90086 -397627 -130801 90697 -252577 97854 -8630 -86878 19829
18432 -83575 271203 -125803 395738 -183429 -44102 -118139 -207522 -322431 168776 -186467
18421 -65281 -208252 129688 59417 41723 -380687 -87065 -217272 381516 87979 181774 7534
18409 28592 -179326 138003 -387760 -58719 -175766 -283242 -132345 104829 277398 47779
18398 74551 -95311 -133212 -19397 -107006 96390 169102 -83582 70726 -64690 -70268 -206536 -364406
18386c64406G7709i1425r5803F0923J63446I3367e7246A22459b89236E4211d9403
18374b01916B28899d27747a07736A87174h8472a0071D7624c04303R853A42817
18363b51795j36390H7521d0072I1564c2377r2802E7956k4029a63962A10911a47891
18351e1504J2203A27197J69409e101D00841a53085k96179C8334i1602A67913a40717
18339b29165A3072J79875E750b3935A70136B1267a3176j84543f6108A32884a50068
18327E6739i4246L5192C6352j5477a19939A57488K26239a23371B670J17819e0575
18315B75414J1733a5756k0492D522a5800D0853K2930K01924b4622j14787L1572
18304a07837a0008m4327k309G11K5644b34600D6127a02643j25577N8443F7958
$$ plain form
18386 -364406 77709 -91425 -187228 60923 224369 93367 -57246 122459 -289236 54211 -49403
18374 -201916 228899 -427747 -107736 187174 -88472 -10071 47624 -304303 -294450 142817
18363 -251795 -388185 87521 -40072 91564 -32377 -125179 57956 33927 -163962 110911 -147891
18351 -51504 -39301 127197 296606 -5101 400841 -153085 -449264 38334 -91602 167913 -140717
18339 -229165 13072 192947 5750 -23935 170136 21267 -13176 -197719 -66108 132884 -150068
18327 56739 -94246 -59054 36352 20875 -119939 157488 383727 -123371 2670 120489 -50575
18315 275414 287147 -15756 -36248 4522 -15800 40853 63783 265707 -24622 -139409 -107837
18304 -107837 -10008 -54335 -56644 711 26355 -234600 46127 -102643 -228220 -169777 67958
18292a35679B2923c03484J43308r2970C17014a68684A35554a52795A49630J20360
18282B69990I7847g4594A13205B9883J37934c04966J9225O4151A88523a34221
18271A10943c2308A31094a6219B73758b28326O1317g2043n4120D38839G4655f7424
18259g0173m2158l7758j76322J14466h7909k08056A98987f7906F4656J81608a71749
18247c5915l0122j65452C5863e4517C2935m156R6277a05735j03487H6801b2165
18235C72654C3211h6940j90766m7074A18800n889a80090C26875b00601j86647
18225c87248J83851M2841A01494J80507d8787j41797K568i2343K9067o1749A66945
18213a62690O3348D6846a9249A32783h9274A03075A0913g6842i12j71004B36474
$$ plain form
18292 -135679 22923 -303484 -160176 -253146 317014 -168684 135554 -152795 149630 269990
18282 269990 97847 -74594 113205 29883 167817 -304966 -285741 -221590 188523 -134221
18271 110943 -32308 131094 -16219 273758 -228326 -167009 -72043 -126163 438839 74655 -67424
18259 -70173 -112331 -150089 -326411 -211945 -87909 -295965 198987 -67906 64656 246264 -171749
18247 -35915 -66037 -231489 35863 -54517 32935 28779 125056 -105735 -209222 86801 -22165
18235 372654 33211 -86940 -277706 -324780 118800 112911 -180090 326875 -200601 -387248
18225 -387248 -203397 -160556 101494 282001 -48787 -190584 -188016 -92343 -63276 -125025 166945
18213 -162690 -99342 46846 -19249 132783 -89274 103075 10913 -76842 -912 -171916 236474
18201F0901K8054a55119A24917i5850B03758g5268m5198A32553N5655f0566R393
18190e1173A16633n5004h9073D05960a15474k4730A56717c25554J47277A20995
18179C98620a11194B20999c0726A95678p6662b62823A79954d59596J32692a04061
18168A08132a2483B85312h1381B01718a2107I7655A2999a49514B33357i2845C4528
18156a03529j08520L9943A67003c02091i7350n1374E74320i150A98313F1295J73844
18145B35139a3190j07095A83577a29975Q897d4890A56372J22606n1836G2856J34287
18134B07143b4628B46944d1868D8242k1500e128j50719I9018b74382a21496d1769
18122b11108B7755Q5172a21500D8797K22131a97401B08725h2830k89706h6494
$$ plain form
18201 60901 88955 -155119 124917 -95850 203758 -75268 -120466 132553 188208 -60566 -51173
18190 -51173 116633 61629 -89073 405960 -115474 -140204 156717 -325554 -178277 120995
18179 398620 -111194 220999 -30726 195678 119016 -262823 179954 -459596 -326904 -104061
18168 108132 -12483 285312 -81381 201718 -12107 97655 12999 -149514 233357 -92845 34528
18156 -103529 -212049 -172106 167003 -302091 -97350 -148724 574320 -9150 198313 61295 235139
18145 235139 -13190 -120285 183577 -129975 -121078 -44890 156372 278978 227142 72856 207143
18134 207143 -24628 246944 -41868 48242 26742 -5128 -155847 99018 -274382 -121496 -41769
18122 -211108 27755 112927 -121500 48797 270928 -197401 208725 -82830 -372536 -86494
18111B33201n5809B9365b7101I4551H498H57b35954R4656B9554b53276A91382
18099g8852j72608p3171B10337i717E193O1864j0797J32821b35968Q0302j6021
18088a71687A53749p0651a4882j81947k1585A98136a22658B05847f3288C4632
18077B10213k0750q6401c9075A70227D5896b23943h4900L1418B04454N8832a48746
18065c02017A976c18112O2294J10772C63011H9024k6096a2412r1565A70444c42219
18053E8410a75290A46407D9837K9825N9841n6093b46844N0027l9602A07805J12382
18042B20187e4676j69163c9766o9485b3141G1529a91229A39369D3649L1617a78587
18030A73359E3175b05624j54225A38301b88074J13105M8295n407B50012r2571
$$ plain form
18111 233201 177392 29365 -27101 94551 8498 857 -235954 -141298 29554 -253276 191382
18099 -78852 -251460 -324631 210337 -9717 5193 67057 56260 189081 -235968 -155666 -171687
18088 -171687 153749 83098 -14882 -196829 -218414 198136 -122658 205847 -63288 34632
18077 210213 189463 103062 -39075 170227 45896 -223943 -84900 -53482 204454 263286 -148746
18065 -302017 1976 -318112 -255818 -145046 363011 89024 62928 -12412 -103977 170444 -342219
18053 58410 -175290 146407 49837 79662 139503 83410 -246844 -196817 -236419 107805 220187
18042 220187 -54676 -223839 -39766 -109251 -23141 71529 -191229 139369 43649 75266 -178587
18030 173359 53175 -205624 -359849 138301 -288074 -174969 -126674 -132081 250012 157441
18020A57441a88160K8637d4427j33006C4697a2290k26221G135h2726H7653j2889
18009G4764a74174g518o2189j54349B34945C3898f9115a085o0431J805A16798
17997a11510I6910N3487D4270e1995G3901R2259a5590k41207c9902B9289K17539
17986B46828a1441q4892A6215J91931l3042l1126B1799g2348k16F0337b6594k4927
17974e1521C687c76794D70643F7005a27783A50496a29166c8409B03165a76146
17963A10648b7314k18292d5753l391F2702K191M5144k266h2142m23950B590P7966
17951H0556f660B00349e683I4897N8213m683A5205a71198G0588a18006K6936A62678
17938c5207H5429K0613l2330j7725j6103a377G3818a48025D0959P7948b26504
$$ plain form
18020 157441 -188160 -159523 -44427 -177433 34697 -12290 -238511 7135 -82726 87653 74764
18009 74764 -174174 -7518 -69707 -224056 234945 33898 -69115 -1085 -61516 -59711 116798
17997 -111510 96910 150397 44270 -51995 73901 166160 -15590 -256797 -39902 29289 246828
17986 246828 -11441 -96333 16215 208146 175104 143978 21799 -72348 -72564 60337 -26594 -51521
17974 -51521 3687 -376794 470643 67005 -127783 150496 -129166 -38409 203165 -176146
17963 110648 -27314 -245606 -45753 -49144 62702 64893 110037 107771 -82142 -506092 2590 80556
17951 80556 -6660 200349 -5683 94897 153110 148427 15205 -171198 70588 -118006 -91070 162678
17938 -35207 85429 106042 73712 55987 39884 -1377 73818 -148025 40959 118907 -226504
17926a61434e3463l7219b4203B37886h2725j11413m3433B7081G47K06255e7285
17914A93872b90967B45055a16978n7691B09144a56205B0239Q5809C4402b08234
17903b08613R0794j56214g6666a4260E2470k1767b60842C1683K9566P2262g216
17891a98386d7029C8634c93322B06931b15334A8822L8264h0906C03214A48236
17880B33941a82717M1074B09191l3416P1596d1549H9245a88598B15579L238F9811
17868H6569i0957A3657g2767k03170B81344c4846D49671b53182A01841j4225G566
17856C7356J15083M7055C2885a43839o5236f2436C7763M3247c11948a14629B16201
17844h9302C06760b8104C28201D8055O9580a21246n0614j07095a09339A24748
$$ plain form
17926 -161434 -53463 -90682 -24203 237886 -82725 -194138 -237571 27081 747 207002 -57285
17914 193872 -290967 245055 -116978 -174669 209144 -156205 20239 106048 34402 -208234
17903 -208613 -117819 -274033 -76666 -14260 52470 30703 -260842 31683 61249 133511 -7216
17891 -198386 -47029 38634 -393322 206931 -215334 18822 57086 -80906 303214 148236
17880 233941 -182717 -141643 209191 175775 247371 -41549 89245 -188598 215579 218817 69811
17868 86569 -90957 13657 -72767 -275937 281344 -34846 449671 -253182 101841 87616 7566
17856 37356 152439 199494 32885 -143839 -209075 -62436 37763 81010 -311948 -114629 216201
17844 -89302 306760 -28104 328201 48055 117635 -121246 -171860 -278955 -109339 124748
17833B07701a96043A52083r938f7900j87052B65106H0801B8260J63221i573I1243
17821F4800J37461b23854g9577A4443L82955D0338a07889A03789K30772C165J8494
17810B1659J79105a44555f799B30761m7873a33734k6584b6724k17667h48E703
17798h9065M3178F4220J60379F4601c1803C18892A06852b62994a7475E74206g1248
17786d2196o5952A48836J38845a22632I1096a09211B23467a68899N456f2478j58608
17775b21086i703B7922J45557i6787k68019a4616E24675A27208E1800M12862G081
17763A90159b28145A13946e028F6544J3548J9999K5667J04996A2976a09961D055
17751b52525D8567d8100k02094c9684G5838R8926M18286G1631O5874K14698F3015
$$ plain form
17833 207701 -196043 152083 142145 -67900 -254952 265106 80801 28260 191481 -9573 91243
17821 64800 202261 -223854 -79577 14443 397398 40338 -107889 103789 334561 3165 21659
17810 21659 200764 -144555 -6799 230761 182888 -133734 -160318 -26724 -244391 -848 5703
17798 -89065 -45887 64220 224599 64601 -31803 318892 106852 -262994 -17475 574206 -71248
17786 -42196 -108148 148836 287681 -122632 91096 -109211 223467 -168899 -163443 -62478 -221086
17775 -221086 -9703 27922 173479 -96787 -364806 -14616 524675 127208 51800 464662 7081
17763 190159 -228145 113946 -5028 66544 80092 100091 125758 230754 12976 -109961 4055
17751 -252525 48567 -48100 -250194 -39684 75838 174764 593050 71631 137505 352203 63015
17739f394D09158c5129A01761a00686q2477B97589H7253f494p6920C24307i8395
17727B60715a1238k19896d3576G8932P892b1728A59177d075E8723J18871H0329
17715C84835A84385L3017K7593b68563A4706Q6266J4768Q493K69073G8919L03518
17704C82437h4976A95745l3536Q4428L0568D2785K5651L63923h1867j3796I8527
17692B9031Q8265J20216H3777j3513B1331a61957M4303i61l9818p933j40511E29579
17679a58297A36157K20845j63503K3408C4437L08183F8650L1078K17352a04040
17668B320f2025K1384B9366b00660A40024b30444A84914J76657D7742M9482J377
17657I8601M88227a44365C2283J56827O3040b72795A68012r138G6997I259M7201
$$ plain form
17739 -6394 409158 -35129 101761 -100686 -183163 297589 87253 -6494 -83414 324307 -98395
17727 260715 -11238 -231134 -43576 78932 86824 -21728 159177 -4075 58723 177594 80329
17715 384835 184385 217402 244995 -268563 14706 100972 115740 124233 393306 78919 382437
17704 382437 -84976 195745 162209 246637 277205 42785 68436 432359 -81867 -95663 98527
17692 29031 117296 237512 83777 70264 21331 -161957 -117654 -961 -40779 -48712 -189223 529579
17679 -158297 136157 357002 193499 216907 34437 342620 68650 99728 317080 -104040
17668 2320 -62025 -40641 29366 -200660 140024 -230444 184914 361571 47742 97224 98601
17657 98601 586828 -144365 32283 189110 252150 -272795 168012 158874 76997 9259 56460
17646E6460L6786c04350a01886j47955E8598i0895D33418A64048g2615A4718i01
17634G4556J5409d7574H8639J14172l0176a13876C8849a43621N8931B8710K05877
17623B34587a76279I3832B5891O7249L19916A71053F7455d1008B02744n5039f4417
17611B72462G7517I147L56375F9733h0817A60802J13897k7403m8506o6486a46258
17599b06547a0154B99869i803B21068h5409K610A60153n1081C3590N6230J38259
17588B28079a42137B94232G5501K52980A48422a65806A63859J34697A1045K45794
17578B56839b16814A69056K84n8541K14664p1642B3271K51962o7213f1720A47441
17566a14257a7764F339R8156g074C40729j28519a6600B57747J7388J4611D0206
$$ plain form
17646 56460 93246 -304350 -101886 -249841 58598 -90895 433418 164048 -72615 14718 -901
17634 74556 89965 -47574 88639 202811 172635 -113876 38849 -143621 -84690 28710 234587
17623 234587 -176279 93832 25891 93140 413056 171053 67455 -41008 202744 147705 -64417
17611 272462 77517 9147 365522 69733 -80817 160802 274699 247296 198790 132304 -146258
17599 -206547 -10154 299869 -9803 221068 -85409 -82799 160153 109072 33590 89820 228079
17588 228079 -142137 294232 75501 328481 148422 -165806 163859 298556 11045 256839
17578 256839 -216814 169056 169340 110799 325463 253821 23271 275233 208020 -61720 147441
17566 -114257 -17764 6339 104495 -7074 340729 212210 -16600 257747 275135 289746 40206
17554a2093A27927j4202J0975J6839c1726d401C32688B0474J45970F5125J73091
17543B38216B2303Q9581K23035F1869M48541D555K30867m6892p8425E2688N03155
17532E55843j48875A79532J5748M71202C21208L33928K15734M33218j71537q2177
17522A050374r0266l66355N4820k36610M05574l46968j59568J70629j75000J45532
17512D52162K53609j02596N63610k95648J98337j01265m54973p2750J50910k02737
17502C88659q0165J47450B26559J4432N1717j41719M29369B59948P9438I7902
17491I7300N64755G5295J93023o1661E4386J63077A05453K26107p1647r0418H1495
17479F9453L99852J45426H3305P2165K95378A30501j0791K73724j81038L10528
$$ plain form
17554 -12093 127927 113725 124700 141539 -31726 -4401 332688 20474 166444 65125 238216
17543 238216 22303 111884 334919 61869 510410 4555 235422 188530 110105 52688 555843
17532 555843 406968 179532 195280 666482 321208 655136 870870 1304088 1132551 1050374
17522 1050374 960108 593753 648573 411963 817537 470569 311001 481630 306630 452162
17512 452162 705771 603175 1166785 871137 1069474 968209 513236 440486 591396 388659
17502 388659 308494 455944 226559 240991 292708 150989 580358 259948 339386 97902
17491 97300 662055 75295 268318 206657 54386 217463 105453 331560 259913 169495 81495
17479 69453 469305 614731 83305 155470 450848 130501 119710 393434 212396 522924
17469E22924B21753A07972P9675J60055j21857K00527N3870D6155K05207M4454
17459B95816b4065j33366B44104J24038A03124J42538J03746j65573p294J25406
17449C01947R9183J04338p1868D7567M26998A15838M34140r7581j10900J75021
17439E16518O5121k47487E1482N7302L13463j79710K13186B27173K92697k58986
17429B60884M1041L80669h274B12478J73623j49796I8540K12671A39046N5209
17419A94255L97419k00166Q8866M9955B4747O96M37249j42906q4679M38388k82810
17408C90685F8548L63215A97345J01047L2617N077m954i47H2871L10060A87541
17396E17177A00058J3610m1745C0500L20514A74937J64126N7378A31928L32935
$$ plain form
17469 522924 221753 107972 187647 347702 225845 426372 480242 46155 251362 295816
17459 295816 -24065 -157431 244104 368142 103124 245662 349408 183835 176541 301947
17449 301947 401130 505468 433600 47567 474565 115838 549978 452397 341497 516518
17439 516518 581639 334152 51482 108784 422247 242537 455723 227173 519870 260884
17429 260884 301925 682594 -8274 212478 386101 236305 98540 311211 139046 194255
17419 194255 591674 391508 480374 530329 24747 25443 462692 319786 235107 673495 390685
17408 390685 68548 431763 197345 298392 331009 336086 331132 -947 82871 392931 187541
17396 517177 100058 113668 71923 30500 351014 174937 339063 396441 131928 464863
17386D64863A14927K00051C6570L79147J190I2011D703K68854P1495J96661n8634
17375D83079j67510N0601f3051A93872J78764a3289C31651n9057K0597q9959E9321
17363b21111B81773j1874j27714L70755B03362l7436f8946H3213M76907A80580
17352C19305l0384J40560A29691J10385A3242P5582K61918J8545j65855o3170
17342A40262R5821E8684O24967B41786j573J39057O2151k6249j01991B0803R9306
17331A20109K12265n3398A33219O1659A848N4288K15656k8059Q5302q129A13386
17319B42948Q0804J35558j16738j4415n2886G1732M02904B23791J19874m0948
17309C02717J20366L0456E6418L82207k16335J37620q9151J14565H8330J44801
$$ plain form
17386 464863 114927 314978 36570 415717 416907 92011 4703 273557 345052 541713 483079
17375 483079 315569 366170 -63051 193872 372636 -13289 331651 272594 293191 203232 59321
17363 -221111 281773 269899 142185 512940 203362 165926 -68946 83213 560120 180580
17352 319305 288921 429481 129691 240076 13242 88824 350742 369287 203432 140262
17342 140262 236083 58684 683651 241786 240213 379270 441421 415172 313181 20803 120109
17331 120109 332374 278976 133219 194878 1848 56136 271792 243733 329035 320906 113386
17319 242948 323752 459310 342572 328157 275271 71732 474636 223791 343665 302717
17309 302717 423083 453539 56418 438625 222290 359910 270759 385324 88330 233131
17299B33131K22050k3183A99260J3177L34346k54369E7624L59942q0503j05617
17289B31446e7954B92538K17522a4799C42143J43172A03176j2057J14313J01646
17279C07078L10925k01667j12255F4890J86836K5213A3615J81013M90077k67239
17269D17466D4878L62991L0054p9926J26649K3815k56k7818o205B20002B6127
17257C86444R1789B425M7715J23003K27794K06050B81141G1814K73547Q072l7004
17246C16429P1691j94045I5885M53226A82559P6474P9447K5570j63622K02363
17236D02791N6334j14606L11212j01680A77991F5177R9243M61237k47828J54926
17226E32755B41162K96778J6830A00598J26160N6164J29220A11609L20997j21921
$$ plain form
17299 233131 455181 431998 199260 212437 546783 292414 57624 417566 337063 231446
17289 231446 -57954 292538 510060 -14799 342143 485315 103176 91119 205432 307078
17279 307078 618003 416336 304081 64890 251726 276939 13615 194628 684705 417466
17269 417466 44878 407869 437923 357997 484646 508461 508205 480387 474182 220002 26127
17257 386444 478233 2425 50140 173143 400937 606987 281141 71814 345361 353433 316429
17246 316429 388120 194075 95885 549111 182559 259033 338480 364050 200428 402791
17236 402791 459125 344519 655731 554051 177991 65177 164420 625657 377829 532755
17226 532755 241162 537940 554770 100598 226758 282922 412142 111609 432606 310685
17216C10685A981L08140J94635B34827J16481A59821K47851A85898K08666n3478
17206C41086p0399M64247l15529J34743J16911k80955j29762N33306l87353Q0912
17196D87207q5262q606l3205j8588A57310L01583K6897J74998A51121L05035J47267
17185F03423j50719j54231K87354j51931C7261O19427k37873K16681A16729M81595
17175E98324j48967j41924J57122j65710J65330P4452k2313q6791L3578L11881
17165G74982L8884k02764o4159O8322k31371L46795r4211k16197Q4133L0075J3166
17154E47655K04885k46124D2454L45627Q9286P3550O6593A55208L84976L23706
17144H63890C11942K22373L06285C95306J75397A43189L88802o9834A37753P43385
$$ plain form
17216 310685 1981 310121 504756 234827 351308 159821 407672 185898 394564 341086
17206 341086 270687 734934 419405 554148 671059 390104 260342 793648 406295 487207
17196 487207 401945 393339 360134 341546 157310 458893 485790 660788 151121 456156 603423
17185 603423 452704 298473 585827 433896 37261 656688 418815 635496 116729 598324
17175 598324 449357 307433 464555 298845 464175 538627 516314 429523 463101 774982
17165 774982 813866 611102 546943 615265 383894 730689 636478 420281 504414 534489 547655
17154 547655 752540 506416 42454 388081 477367 550917 617510 155208 540184 863890
17144 863890 311942 534315 840600 395306 570703 143189 531991 462157 137753 881138
17134H81138l91260k14601J97444j35888K37019K6914O7751k80459J04272N3106
17124E45436j20567N24941m23598M0182j76520J73505n0933B16594M19349P7747
17114G13690n670C44533L92154j80551r16j77234P6851J92916m9678L08194q1884
17103H24385j76414L1190j4739J65007J88742l59631o7933J0948N0213j17641
17093E34127l1928k6846P1721r4051J04839M83312k08820j62499J38379J35816
17083I44050K94859n05120K01102k22065J25845j38529J34786l64678J83479j10963
17073E42766J31443j39568J12991K3850L69055J75680k30037D52416M86881L6790
17063I76087j22143O2251j94590J29695K15003J1973j38303j35025k12790J23379
$$ plain form
17134 881138 489878 275277 472721 336833 573852 600766 668517 388058 492330 545436
17124 545436 424869 949810 526212 566394 389874 563379 512446 216594 635943 713690
17114 713690 708020 344533 736687 556136 555220 377986 454837 647753 598075 906269 824385
17103 824385 647971 679161 664422 829429 1018171 658540 590607 601555 651768 534127
17093 534127 502199 475353 547074 453023 557862 1041174 832354 669855 808234 944050
17083 944050 1238909 733789 934891 712826 838671 700142 834928 470250 653729 542766
17073 542766 674209 534641 647632 671482 1040537 1216217 986180 452416 939297 976087
17063 976087 853944 916195 721605 851300 1066303 1078276 939973 804948 592158 715537
17053G15537o2291Q9696J23662j61883o9652J85395L3405k4586M56590l77825
17043I08048L90496l05819k59659Q452j8795J19813K49920k99526O5048J03934
17033I61912J92047l42733p2588J57890l8362L52170m411j54480L6355Q7043O1993
17022A236836m31622N69965l35915K82746l16765r4845k02325N43957J66847k88565
17012A130314k98753K63474J1545k23130M50422j62133r1892r3706L58538k64212
17002A080467K3546P7769Q4483L29365k20659P9451R0912o1945j17616Q9208J87294
16991A642275o99315L32949n3554J9296K44094j81349J89757R9720O0961n74909
16981A079925J09432N57667o58991L66192l49770K31264M69926m32883K4307N9936
$$ plain form
17053 715537 653246 742942 866604 704721 635069 820464 853869 829283 1285873 908048
17043 908048 1298544 992725 733066 741518 722723 842536 1092456 792930 857978 961912
17033 961912 1153959 811226 738638 896528 858166 1210336 1205925 1051445 1087800 1174843 1236836
17022 1236836 805214 1375179 1039264 1322010 1005245 910400 708075 1252032 1418879 1130314
17012 1130314 831561 1095035 1106580 883450 1333872 1171739 1079847 986141 1344679 1080467
17002 1080467 1104013 1181782 1266265 1595630 1374971 1454422 1545334 1483389 1365773 1454981 1642275
16991 1642275 942960 1275909 1222355 1241651 1485745 1304396 1494153 1593873 1654834 1079925
16981 1079925 1189357 1747024 1088033 1454225 1104455 1335719 1805645 1372762 1397069 1457005
16971A457005J27711N7281k89023J87514J57663k07498J37113N4132j4522M73800
16961B141176m98721l9117N6744k25784K49621n202K3764j90003K90502P1261
16951A874241k42573N27961Q0117n13285J79406J35574l48497L77106k4930J22637
16941B167757j28941l72512N89564m22814J74956r4614J70156k36236L41072J34368
16931B322756j36188M8428j50230J23396R6719m7136J28282l21176K05257j259
16921B268849P8907L44946n7159q2330l17433L23149k36748L53219j30631K6451
16911B571220M58791m05317K21548m03905L06800l7289q7799K94123j25015n915
16901B787242O1803K85784j82353j65039L74095r7191j07626K32588j19001K35445
$$ plain form
16971 1457005 1584716 1641997 1352974 1540488 1698151 1490653 1627766 1681898 1667376 2141176
16961 2141176 1642455 1603338 1660082 1434298 1683919 1678717 1702481 1512478 1802980 1874241
16951 1874241 1631668 2159629 2239746 1726461 1905867 2041441 1692944 2070050 2045120 2167757
16941 2167757 2038816 1666304 2255868 1833054 2008010 1913396 2083552 1847316 2188388 2322756
16931 2322756 2186568 2234996 2084766 2208162 2304881 2257745 2386027 2064851 2270108 2268849
16921 2268849 2347756 2692702 2635543 2553213 2235780 2558929 2322181 2675400 2544769 2571220
16911 2571220 3030011 2624694 2846242 2442337 2749137 2711848 2624049 2918172 2793157 2787242
16901 2787242 2849045 3134829 2952476 2787437 3161532 3064341 2956715 3189303 3070302 3305747
16891C305747L56468o93657M17798r3667M70682j78538O632k18571j45589K69774
16881C497079J99959j73469K71701J53551l54928K11309L68561k61797J4953L46832
16871D273751j98047L96433k14685k15086N05763j61047r975N9710l7914L18565
16861D717468J07700l5914j05022M40918k76066o4906L55758P2257L9249R483
16851E260925j27296M22740q1388K4014O15995k13800R8341L35803r0930J55991
16841F400395j85902O24195j78308N7083O4746o8175K13372J53997o433N23577
16831G598547j65254M27673M1750k87384N17073J6655k09122M78196J97202n9252
16821H556084N48910K17918k06523M64177k9082M85398l29580O07493L6427J97616
$$ plain form
16891 3305747 3662215 2968558 3386356 3292689 3763371 3584833 3591465 3372894 3227305 3497079
16881 3497079 3697038 3523569 3795270 3948821 3593893 3805202 4173763 3911966 3926919 4273751
16871 4273751 4075704 4472137 4257452 4042366 4548129 4387082 4377107 4436817 4398903 4717468
16861 4717468 4825168 4789254 4684232 5125150 4849084 4784178 5139936 5212193 5251442 5260925
16851 5260925 5133629 5556369 5474981 5498995 6114990 5901190 5999531 6335334 6244404 6400395
16841 6400395 6214493 6838688 6660380 6717463 6782209 6714034 6927406 7081403 7074970 7598547
16831 7598547 7433293 7860966 7902716 7615332 8132405 8149060 7939938 8418134 8615336 8556084
16821 8556084 9104994 9322912 9116389 9580566 9551484 10036882 9707302 10314795 10351222 10548838
16811A0548838M84393p0388J73409q4639M58784M76638K41301K49444K77609k9087
16801A2726302O24066k99075Q52412K89149K12947M46999M10582R5375O00268
16792A5959025N82040J09395N87313L59950L32962M45535M59803O59424K44281
16783A9739728P89647M33809J41047R17892L05733Q35916J023961K30463Q17907
16774B5236103N76447R29046O13820P25253J106195J081584O66162N75176J314748
16765C2824534J040653P87672J246771J156596J236648J391330J107892J815774
16757D2607870J268250J502387J338469J725964J629950J733422J350361K102515
16749E5259188K107977J932087K150838K017688K153051K197066K247426K634605
$$ plain form
16811 10548838 11033231 10962843 11136252 11051613 11510397 11987035 12228336 12477780 12755389 12726302
16801 12726302 13350368 13051293 13903705 14192854 14405801 14852800 15263382 15358757 15959025
16792 15959025 16541065 16650460 17237773 17597723 17930685 18376220 18836023 19495447 19739728
16783 19739728 20529375 20963184 21104231 22022123 22327856 23163772 24187733 24418196 25236103
16774 25236103 25812550 26741596 27355416 28080669 29186864 30268448 30934610 31509786 32824534
16765 32824534 33865187 34652859 35899630 37056226 38292874 39684204 40792096 42607870
16757 42607870 43876120 45378507 46716976 48442940 50072890 51806312 53156673 55259188
16749 55259188 57367165 59299252 61450090 63467778 65620829 67817895 70065321 72699926
16741G2699926K380542K429635K661394K276219K518558K847937K569276K721145
16733I3104632K371063K310651K594154K175785K315221J864897J852862J598209
16725A10187474J397865R14064J313695M62421N79940o290k91835Q4165q05435
16716A13836064j169704j103118j438470j351595k046779j693978k220583k187903
16708A00623934k498188k813265k789737k289297k808447k644286k701264k186422
16700G9893028k856353k606194k286741k420857k373282k283822k858888j956988
16692F0249903j706676k498622j708178j684293k161894j469650j861356j280479
16684D5878755j841969j424297j350538j461331j340144j137427j273372j589485
$$ plain form
16741 72699926 75080468 77510103 80171497 82447716 84966274 87814211 90383487 93104632
16733 93104632 95475695 97786346 100380500 102556285 104871506 106736403 108589265 110187474
16725 110187474 111585339 112499403 113813098 114275519 114855459 114849169 114557334 114641499 113836064
16716 113836064 112666360 111563242 110124772 108773177 106726398 105032420 102811837 100623934
16708 100623934 98125746 95312481 92522744 90233447 87425000 84780714 82079450 79893028
16700 79893028 77036675 74430481 72143740 69722883 67349601 65065779 62206891 60249903
16692 60249903 58543227 56044605 54336427 52652134 50490240 49020590 47159234 45878755
16684 45878755 44036786 42612489 41261951 39800620 38460476 37323049 36049677 34460192
16676C4460192r17499r06353r75252j028670j344447l42935j017879p91792j022284
16667B6113081m95266r52250q31120o84487k09532n24575j226395l70573q52299
16658A9966584k42836l82789n54682o42140k86560l92772p70138M5489p38714
16649A6001442k86570p16654k57431k75410m47715l49199K08765n70396l69178
16640A2937654l41657j33743j59737j59601n86038k21235k08111M5657m42151
16631A0731038k58814j87673l61046J58755m14297n1496l47784j74353M5053m11949
16621H727434k56316j18932R2566n80417L27291l00427l5663o58790L02121l64860
16611G134007j22315j87089K50518j74467j31257m02430L32856l54881j78790
$$ plain form
16676 34460192 33542693 32636340 31661088 30632418 29287971 28945036 27927157 27135365 26113081
16667 26113081 25617815 24665565 23834445 23149958 22940426 22415851 21189456 20818883 19966584
16658 19966584 19723748 19340959 18786277 18144137 17857577 17464805 16694667 16740156 16001442
16649 16001442 15714872 14998218 14740787 14465377 14017662 13668463 13877228 13306832 12937654
16640 12937654 12595997 12462254 12302517 12142916 11556878 11335643 11127532 11173189 10731038
16631 10731038 10472224 10284551 9923505 10082260 9667963 9616467 9268683 9094330 9139383 8727434
16621 8727434 8471118 8352186 8444752 7864335 8191626 7891199 7855536 7196746 7498867 7134007
16611 7134007 7011692 6824603 7075121 6900654 6769397 6366967 6699823 6344942 6166152
16602F166152L0380m01744j80997L10701q8051l46774K2420L90633m49137o9413
16592E384170m45885L25970k18385l3995L0578k8134l63692j71639Q7519K21296
16582D787803l56565M2291J01040k42089J12640j43197j30398p5271k8725L5577
16572D103106m35605j66117M55303k00882M73522m70204n6146j1135N648l14724
16562C382766K80987l35614O18603p17124p5802J97557j76064Q1425L4257j20705
16552C170286k37413J5638K140J72622r6065j07592j32548K37396j19908p6148
16542B828408j75244K10351k60373J60601j22170O2644n723j91474j69017L85672
16532B723675l35172p8811j45640M4087o918K77065J32131m97043O6448j21354
$$ plain form
16602 6166152 6196532 5794788 5613791 5924492 5836441 5489667 5512087 5902720 5453583 5384170
16592 5384170 4938285 5264255 5045870 5011875 5042453 5014319 4650627 4478988 4566507 4787803
16582 4787803 4431238 4473529 4574569 4332480 4445120 4301923 4171525 4096254 4067529 4103106
16572 4103106 3667501 3501384 3956687 3755805 4229327 3759123 3702977 3691842 3697490 3382766
16562 3382766 3663753 3328139 3946742 3229618 3153816 3351373 3175309 3256734 3290991 3170286
16552 3170286 2932873 2948511 2950651 3123273 3027208 2919616 2787068 3024464 2904556 2828408
16542 2828408 2653164 2863515 2603142 2763743 2641573 2704217 2698494 2507020 2338003 2723675
16532 2723675 2388503 2309692 2164052 2208139 2201221 2478286 2610417 2113374 2179822 2058468
16522B058468k92148L37453K1067M29465m15042l32344M90407n32448J13298Q2079
16512A960255J4552Q3472m221k60158K83754N0621m11376m1530M74656k68579
16502A881446J35068j46244K51067j32091m43798J76535L09800J3641J3995k13451
16492A845968K09175m42311o758j14566j24773l7091N14595m40417J34044k061
16482A535805J29925k52387J94394k69390K00164n2125q7189J72904J3197m08799
16472A176499M06378j19108j54860K04405r3689K44678l45545J48831k29768l2251
16462A205570m0225K47690P68j05258k72729M26087k19950K93047n17947R2891
16452A109944J75988J45093j90261j05403J27662k04349j70719J81168l02120
$$ plain form
16522 2058468 1766320 2103773 2124840 2554305 2139263 1806919 2297326 1764878 1878176 1960255
16512 1960255 1974807 2058279 2054058 1793900 2077654 2128275 1716899 1675369 2150025 1881446
16502 1881446 2016514 1870270 2121337 1989246 1545448 1721983 2031783 2045424 2059419 1845968
16492 1845968 2055143 1612832 1606074 1491508 1366735 1329644 1844239 1403822 1537866 1535805
16482 1535805 1665730 1413343 1607737 1338347 1538511 1486386 1399197 1572101 1585298 1176499
16472 1176499 1582877 1463769 1308909 1513314 1419625 1664303 1318758 1467589 1237821 1205570
16462 1205570 1165345 1413035 1413803 1308545 1035816 1461903 1241953 1535000 1017053 1109944
16452 1109944 1285932 1431025 1240764 1135361 1263023 1058674 887955 1069123 767003
16443G67003M35436l34962J94800j07342n1041J57717j15150J10980k04111K25676
16433A079006j03532L82924j43396j13783k60102J24814K92451o3722k93210P0241
16423I71691r5119k54296K64979M13344k94571j15844L68019j45571j50769p5512
16413H86351K89022j95311k2355k13017j9354K48614j37732J71432m0731j75787
16403G91132n7483J88972m8885J95360l27086j13452L27722l29670O8907N4629
16393G50146K09858Q377l76625L53473k79669J19487K36741l75236j68050N91689
16383A070191k34565m1363n5732k83754N03140j55249l4608l04036L19482l2790
16373G50716j54670J14973R1697Q070o0472r0701R2721j37809k41382K84367Q4519
$$ plain form
16443 767003 1202439 867477 1062277 954935 903894 1061611 946461 1057441 853330 1079006
16433 1079006 975474 1358398 1215002 1101219 841117 965931 1258382 1194660 901450 971691
16423 971691 876572 622276 887255 1300599 1006028 890184 1258203 1112632 961863 886351
16413 886351 1175373 980062 957707 744690 725336 973950 836218 1007650 966919 791132
16403 791132 733649 922621 873736 1069096 742010 628558 956280 626610 695517 750146
16393 750146 960004 968381 591756 945229 665560 785047 1021788 646552 478502 1070191
16383 1070191 835626 794263 738531 454777 957917 802668 768060 464024 783506 750716
16373 750716 596046 711019 802716 810786 750314 659613 752334 614525 373143 657510 742029
16362G42029k31445K72543k2641k14620J33413J0276j57867J68879j36245K68107
16352H32429l68557K61273C59402P3708K5168K08852j80483A92462P16620m22767
16342D86315N25549C31030K58009L25308l71578m7549j59037L08083P8846l27229
16332C95883r5164K34017L2840L39361l36592K25799j95304j93342O9528O3067
16322E40093P4974B93603l6263M96585r6859J99544m00169m6691O8556o3260J99624
16311F14670k74184K69551J22311b4966B90144J64988J54634j40285B08431L03660
16301E12091k13494K20171B58359K95850o3943M2528p0713R4675A39065M16202
16291E55267j89350N6K18400E6292P10694k80836N603m0020J90026m0324B78639
$$ plain form
16362 742029 510584 783127 760486 545866 679279 689555 531688 700567 564322 832429
16352 832429 463872 725145 359402 433110 458278 667130 486647 192462 909082 486315
16342 486315 1011864 331030 589039 914347 542769 495220 336183 644266 723112 395883
16332 395883 300719 534736 567576 906937 570345 796144 600840 407498 477026 540093
16322 540093 615067 293603 257340 753925 657066 856610 456441 409750 478306 415046 614670
16311 614670 340486 610037 732348 -24966 290144 455132 609766 469481 208431 512091
16301 512091 298597 518768 258359 554209 490266 532794 462081 556756 139065 555267
16291 555267 365917 365973 584373 56292 766986 486150 491753 451733 641759 601435 278639
16279E05465k43229j26619L17553L0523B12210K47351R6288A09525K60464K51843
16269F21832k86366J46189j19309r1062L58561k49850j07586K96279n4131m4828
16259D69729q581j78920O0814j70136R9636n4443J80873A02943J41835M6193J33221
16248D24192j38891j4198L11126J58647k25927k06226A45657j0242J34586L9080
16238C09081Q4789m2944j00741q5220l0281B276K35481N10954a28687G3790J15465
16227A89255L74202B50926J60755j56814M2210o4561a30857B41165I2772K94377
16217C87149j55916j14569K14593m0966K62086j82203O1249J5106B17771o8033
16207A49738n7195K51386J68347p6030I3193f0717D99813A01013O20907C29658
$$ plain form
16279 505465 262236 135617 453170 483693 212210 459561 555849 109525 369989 621832
16269 621832 335466 481655 362346 271284 629845 379995 272409 568688 514557 469729
16259 469729 461148 282228 343042 172906 272542 218099 398972 102943 244778 290971 424192
16248 424192 285301 271103 582229 740876 514949 308723 145657 135415 270001 309081
16238 309081 393870 350926 250185 164965 134684 2276 237757 748711 -128687 73790 189255
16227 189255 563457 250926 411681 254867 297077 232516 -130857 241165 92772 387149
16217 387149 231233 116664 331257 290291 552377 370174 431423 446529 217771 149738
16207 149738 92543 343929 512276 436246 93193 -60717 499813 101013 721920 329658
16196f3177B44501A13282a36661C13424c3539C84385J31457k28420c5353B60415
16185a12198D7752L82027B10618J1692K21624H3573J40986A3841P8754M65900
16175E58495j15765j66140p0263Q3353j08841K15340H5880B9701L6205O9235D2187
16163D11341j26490K0599m6457I9275J78464j12377a1191k7623C26624D1177K18689
16152B59866D5741M30253B31033p9567K37493A9098b36323C30913j55665J81522
16142C56770p0730D3905A9797h395m6669C20887A33400D6294p353L19309q3306
16131B74944K6429o3443A07896M05827C0120P383m433J97497N4834G7275b0008
16119A57618P7588k710J42484P0949B14634d5250j75244B4907J09289j8971J76736
$$ plain form
16196 -63177 244501 113282 -136661 313424 -33539 384385 515842 287422 -35353 260415
16185 -112198 47752 429779 210618 222310 443934 83573 224559 13841 92595 558495
16175 558495 442730 276590 206327 289680 180839 396179 85880 29701 65906 135141 42187
16163 411341 284851 305450 258993 99275 277739 165362 -11191 -38814 326624 41177 259866
16152 259866 45741 475994 231033 151466 388959 19098 -236323 330913 175248 356770
16142 356770 286040 43905 19797 -8395 -55064 320887 133400 46294 38941 358250 274944
16131 274944 301373 237930 107896 513723 30120 37503 33070 230567 285401 77275 -20008
16119 157618 235206 232496 374980 445929 214634 -45250 -220494 24907 134196 115225 291961
16108B91961D9022K23488d4191C79033j29217F217K7164K31112n3071o1338c4135
16096B05007L7572p4014e2389A14569J5430o2185K56828A48730n3707f3264G7755
16084A5349f0051l4343A24316K76582i4395l8387C1760K51615E7123L04071A02260
16072A25277l4937b0246C07422D2716h1875B92284J11287E2046K54451j39212
16062A67285a77385C09104O9692j72283N7000b39648B332K79811E0784J48196
16052A98980c08249B42115b95464b0553q6479L1650p1795B56522j14010a37227
16041A25155B9801J9300J16224b87755A94803o9654H260J77980M52361A71506
16030B34624g9513m8323F011K60997G3648L06K37224a5972C61417D6445N1685
$$ plain form
16108 291961 49022 272510 -44191 379033 249816 6217 33381 264493 211422 150084 -34135
16096 205007 242579 168565 -52389 114569 129999 67814 324642 148730 95023 -63264 77755
16084 15349 -60051 -94394 124316 400898 -94395 -132782 31760 283375 57123 361194 102260
16072 125277 90340 -20246 307422 42716 -81875 292284 403571 52046 306497 167285
16062 167285 -177385 309104 378796 206513 263513 -239648 2332 282143 50784 198980
16052 198980 -308249 242115 -295464 -20553 -107032 -75382 -147177 256522 142512 -137227
16041 125155 29801 49101 165325 -287755 194803 125149 8260 186240 638601 171506
16030 234624 -79513 -127836 6011 267008 73648 73954 311178 -15972 361417 46445 98130
16019I8130J16841q3722B7549h5916a5141B12071N7388o8895B1755K75495I1729
16007A70492j5158i4684a4005k87485A7079K10785B3627J43950J13738F8759J87074
15996B55833E9983a06427k44136A77045Q547m7258K44945j22420J85853K40331
15986F87043M48205K52345j91314k09603J0008l08577k87470a07069D2824L4953
15976G7777N283i5821A58912a31636l6633A19776A9478a96327A15173b2200j53236
15965a75436F0588J32138a69937O6004J5056l9161G0671C2502a11697G6268J55302
15954B31570j13325D7245a92165P9902M8777A0525Q4979L3426P2378a70560N2105
15943a18455E5892f9648J6354C7702O0641K3070N8404J22334j29116a13434B07816
$$ plain form
16019 98130 214971 131249 27549 -85916 -15141 212071 269459 200564 21755 297250 91729
16007 170492 155334 -94684 -14005 -301490 17079 227864 23627 167577 281315 68759 255833
15996 255833 59983 -106427 -350563 177045 185592 138334 383279 260859 446712 687043
15986 687043 1135248 1387593 1196279 986676 996684 688107 400637 -107069 42824 77777
15976 77777 83060 -95821 158912 -131636 -168269 119776 19478 -196327 115173 -22200 -175436
15965 -175436 60588 192726 -169937 -103933 -88877 -128038 70671 32502 -111697 76268 231570
15954 231570 118245 47245 -192165 -112263 -63486 10525 95504 128930 201308 -170560 -118455
15943 -118455 55892 -69648 -53294 37702 98343 121413 179817 302151 173035 -113434 207816
15931G4292N1188b94038e4278B92908A00972J2826l607c7174j59665H3774J6848
15920A00622a6196A92314b60053M3062B19414R4621d2361A61911a8853p9098A42992
15908A42074o8719a87153F931a95896A96564e6805K4566j33645f0453B8652M2745
15897G1397A4245N8863C4131e5594I1951J46282F0886A7619K02178k8761a15065
15885f1026A67200J31275c5607A6556M0727b1547m5212p1124F6734J76169r1373
15874A51530c67758B3204d0289A94282a6621k44644L6917c0166m33364J50948
15864c12582M9997A67406E7585a18138l6167L9591p8567p0624c4690B03821a14895
15852a2813A02704d83465C172J85171C942b53422e9717j93054C7758J47855B3709
$$ plain form
15931 74292 125480 -294038 -54278 292908 100972 113798 110191 -37174 -196839 83774 100622
15920 100622 -16196 192314 -260053 -216991 219414 314035 -42361 161911 -18853 -97951 142992
15908 142074 73355 -187153 6931 -195896 196564 -56805 -32239 -165884 -60453 28652 71397
15897 71397 14245 73108 34131 -55594 91951 238233 60886 17619 219797 191036 -115065
15885 -61026 167200 298475 -35607 16556 57283 -21547 -66759 -137883 66734 242903 151530
15874 151530 -367758 23204 -40289 194282 -16621 -261265 -224348 -30166 -463530 -312582
15864 -312582 -262585 167406 57585 -118138 -154305 -114714 -193281 -263905 -34690 203821 -114895
15852 -12813 102704 -483465 3172 188343 3942 -253422 -59717 -252771 37758 185613 23709
15840G4631a86533f8414b7121B11573e0087H185b5304B7466J48139a40717j15716
15829b56433m2973A11259a14954A08212a812l10389A00953O9659m6146R0827n9703
15818A55590G1174L9590d2273A38693J29677E4665j7921c61829A23117j1453Q0672
15807A92336h5197I8862k9535b8175j52726Q1956o6478C06266p1363b53855h0825
15795a02476A9400a41130B14071a55526B04524j2058b06871e3467A31549a19625
15784b73928d7476l7440n2232j19862l812a02061i174F6510a85695J5881A15772
15772H4435b55755H8581a3627A00821E049b47532e9644B92219j9208a58240c3674
15760b64362D0541J4882b08153B31923j2827O446j3091i8423j66428b0653B0373
$$ plain form
15840 74631 -186533 -68414 -27121 211573 -50087 8185 -25304 27466 175605 -140717 -256433
15829 -256433 -299406 111259 -114954 108212 -1812 -312201 100953 170612 124466 215293 155590
15818 155590 71174 110764 -42273 138693 268370 54665 36744 -361829 123117 111664 192336
15807 192336 -85197 98862 69327 -28175 -180901 -98945 -165423 306266 234903 -253855 -80825
15795 -102476 19400 -141130 214071 -155526 204524 192466 -206871 -53467 131549 -119625
15784 -273928 -47476 -84916 -137148 -257010 -260822 -102061 -9174 66510 -185695 -169814 115772
15772 84435 -255755 88581 -13627 100821 5049 -247532 -59644 292219 273011 -158240 -33674
15760 -264362 40541 55423 -208153 231923 219096 225542 212451 -98423 -264851 -20653 20373
15748i9378j90549D8913K16106f6188G4830K41251A09803c5139H2664M4148c30809
15736f3358A80204d8660j08249B06170B3198a54997a9082j54003N5416D64941
15725C42864c35891O9201d1556j45693A78100E6901O3505B6312L1811a60671k8003
15714a88674B31618J27485B598i5909K7474A95890c44670I8704B0887J58703O3556
15703B43146a36129G2464N9184J55579h4623L5486k3930A90228q9776L39919A32776
15691a2957B24993k2090J99585n5880b5232H0091J98023A21388E4022a99858l5814
15680b35672r203j33652B34033c42756C69741A00961J8066m3028g7281I0467P4583
15669A65050F0597a09302J7874B23106A05681a17498A4793b68732I468K5796a14212
$$ plain form
15748 -99378 -289927 48913 265019 -66188 74830 316081 109803 -35139 82664 126812 -330809
15736 -63358 180204 -48660 -156909 206170 23198 -154997 -19082 -173085 -117669 464941
15725 342864 -335891 -266690 -41556 -187249 178100 56901 120406 26312 58123 -160671 -188674
15714 -188674 231618 359103 2598 -95909 -68435 195890 -344670 98704 20887 179590 243146
15703 243146 -136129 72464 131648 287227 -84623 -49137 -73067 190228 100452 440371 132776
15691 -12957 224993 202903 402488 346608 -25232 80091 278114 121388 54022 -199858 -235672
15680 -235672 -244875 -378527 234033 -342756 369741 100961 119027 75999 -77281 90467 165050
15669 165050 60597 -109302 -91428 223106 105681 -117498 14793 -268732 9468 35264 -114212
15657b8692C9593b41804i1706j05422m4182A325a46512j57999H6236a9185k790
15646b1975p7831q0671E5263b50378b7611j73319l9740I9034C6092e9193j47562
15635b06755B18960c46153A23814k4958a98738A73016a11139n449r0370P4017
15625a32941D4885b99488i6066k0547B62898i0268A96380a78895j64546a24476
15614b7293B70352E7822Q3449c55703R1033F5295a98949n5913b7772j89510h1504
15602B79910A06853E0464J34885d0194p807A3285B228J17348b97215a07333A01642
15590a28143N1320p5773a8092B87872c61573a39222c1360A67297p5327c29623
15579a93314d3831j93878h151C79734B7616c5297B65092c43496N5554F9332a55158
$$ plain form
15657 -28692 39593 -241804 -91706 -197128 -241310 1325 -146512 -304511 86236 -19185 -21975
15646 -21975 -99806 -180477 55263 -250378 -27611 -200930 -240670 99034 36092 -59193 -206755
15635 -206755 218960 -346153 123814 98856 -198738 173016 -111139 -116588 -206958 -132941
15625 -132941 44885 -299488 -96066 -116613 262898 -90268 196380 -178895 -343441 -124476
15614 -27293 270352 57822 141271 -355703 -264670 65295 -198949 -254862 -27772 -217282 -81504
15602 279910 106853 50464 185349 -40194 -48001 13285 2228 119576 -297215 -107333 101642
15590 -128143 -76823 -152596 -18092 287872 -361573 -139222 -31360 167297 91970 -329623
15579 -193314 -43831 -237709 -8151 379734 27616 -35297 265092 -343496 -287942 69332 -155158
15567A15924a57208b9079q4108o3207H1456a73868M995M5695J1372K8280m25036
15556e08562G0203d5628j0274k30387P6324D8778f7065l6939m13061A75376J61826
15545C37202b09475B7691a69307e741B40084l1592J8189f355o7932I8425M06874
15534E05299A64194M6111q0774J98027j13582j06464N4958C1224L3503L81791
15524D46518H0944A9982a36087N9802B37509J64596A02142Q3451a03542J4558
15514h8984B43788G4494K31918i531A50210D4791J08647L46091k42325h0764A23822
15502F6970K38943M8561j20419A2147J60037D482c713A07103b29071A1166N89847
15491F01013k99257F0151c07454A20251O6121K0591L39615b17244e1728A13177
$$ plain form
15567 115924 -157208 -29079 -113187 -176394 81456 -173868 -168873 -123178 -111806 -83526 -508562
15556 -508562 70203 -45628 -55902 -286289 -209965 48778 -67065 -104004 -517065 175376 337202
15545 337202 -209475 27691 -169307 -5741 240084 208492 226681 -6355 -74287 98425 505299
15534 505299 164194 210305 129531 327558 213976 107512 162470 31224 64727 446518
15524 446518 80944 19982 -136087 -76285 237509 402105 102142 185593 -103542 -88984
15514 -88984 243788 74494 306412 -9531 150210 44791 153438 499529 257204 -80764 123822
15502 66970 305913 354474 234055 12147 172184 4482 -3713 107103 -229071 11166 601013
15491 601013 301756 60151 -307454 120251 186372 206963 546578 -217244 -51728 113177
15480A23566J11081a38991L2732A78311l8416L57474K13232P4802p377l70995
15470D07031r7966j4958G630h9179B69844b69308F1448a72544r4798P023H2526
15458a5294o1559r1278d3946B4547K39823A3386d2860j73127H9281K20272G0127
15446A98801P1642d9247D82058J7139P7760O95463j11092k97969m00582k15632
15436B47145J22021j31034q2629a07215j76754B21786b68527a29612A20953a13681
15425h564n0049A07081h1887D0684c77305B32660E93b07500B3286J73999I1294
15413a71211Q3041l0544A61482G8272N6941e0317C3102Q7381c0439E37625H3905
15401A74876R8884b59915d9212C65994A33309n1210C8096a28629E23875G3768
$$ plain form
15480 123566 234647 -138991 -106259 178311 139895 497369 710601 785403 778026 407031
15470 407031 309065 294107 7630 -89179 269844 -269308 61448 -172544 -267342 -260319 82526
15458 -15294 -76853 -168131 -43946 24547 264370 13386 -42860 -215987 89281 309553 70127
15446 198801 270443 -49247 482058 499197 576957 1272420 1161328 863359 462777 247145
15436 247145 369166 238132 155503 -107215 -283969 221786 -268527 -129612 120953 -113681
15425 -8564 -58613 107081 -81887 40684 -377305 232660 593 -207500 23286 197285 91294
15413 -171211 -88170 -118714 161482 78272 135213 -50317 33102 120483 -30439 537625 83905
15401 174876 273760 -259915 -49212 365994 133309 82099 38096 -128629 523875 73768
15390E5382b15617C7546b26422h179j55483A73687B5584J2900R468c38663A86596
15378A10493D4073a45729B703b699B47817C7712L30048A78718j7224a34896A87254
15366A7612M121f226B96968H3893J5225L06921A71011L5533H5563L7934Q7190
15355B10687L30710A82121p9539a1497C75686c0392B48208L2439q5375R7604A06850
15343B74668Q902M4869J39683D1776J41917f7761L3781B35784E9062k5375J20908
15332A54595K9680I0492K0043M9051l1858O9300C12a8900C13100M3193j10206
15321B46087J57190j82764A02723C9970M2698K78301A40605b9786A57035l3522
15311A23513Q1050I4480J24568n1789J2843A0719a87109A10191l7612a2984j69589
$$ plain form
15390 55382 -215617 37546 -226422 -8179 -163662 173687 25584 38484 47952 -338663 186596
15378 110493 44073 -145729 2703 -2699 247817 37712 367760 178718 161494 -134896 187254
15366 17612 21733 -6226 296968 83893 99118 406039 171011 206544 85563 123497 210687
15355 210687 541397 182121 102582 -11497 375686 -30392 248208 280647 195272 292876 106850
15343 274668 283570 328439 468122 41776 183693 -67761 -33980 235784 59062 33687 154595
15332 154595 184275 90492 110535 159586 127728 197028 312 -18900 313100 356293 246087
15321 246087 403277 220513 102723 39970 82668 360969 140605 -29786 157035 123513
15311 123513 204563 94480 219048 167259 180102 10719 -187109 110191 72579 -12984 -182573
15300a82573A59900C9453R9514a30002A16503J35751C0294K60901a18424A5140
15289c23741d9637A1131J00438k8023J23982R6799F6917L8067M7627m5592C4191
15277a09342B05167c7032A40119J3114O1083K15685a08998o8957C6086J72888
15267B08974h696j5960d160j56343b504A32369a4487A95121b60180G5258j2298
15256F2960o753Q8814L5081b02002C10251q9889a8064A04270J2262g5274A97813
15244C6391J80830J85002N56006J082122l17885J61881p8115D91285j15403h4250
15233c4900A35559N0830h161j97466L6978Q4116j29927B32669B0410O1942a10947
15221E2668K82284A0708J70881b17270D98779g7278K9658C4041J92725j05153
$$ plain form
15300 -182573 159900 39453 138967 -130002 116503 252254 30294 291195 -118424 15140
15289 -323741 -49637 11131 111569 83546 207528 304327 66917 104984 152611 107019 34191
15277 -109342 205167 -37032 140119 153233 214316 430001 -108998 -177955 36086 208974
15267 208974 -8696 -24656 -4160 -160503 -2504 132369 -14487 195121 -260180 75258 62960
15256 62960 56207 145021 180102 -202002 310251 220362 -18064 104270 116532 -75274 197813
15244 36391 217221 402223 958229 2040351 1722466 1884347 1806232 491285 375882 -84250
15233 -34900 135559 186389 -8161 -205627 -168649 -84533 -214460 232669 20410 82352 -110947
15221 52668 334952 10708 181589 -217270 498779 -77278 -47620 34041 226766 121613
15211A21613B9374J79553j02272J28559e7812l9745o6974g5221j00068C18556
15200a26978E2182d308I8739h1622l3825A28280a08860b3813A42932L12922I3297
15188a53074A4669O2134a11308C7143b63931G8080b28986a0268D3227K13585D7117
15176B215c1204H3974j1261L7017K89723c4347C65717j79898l4030K1690R2799
15165B66278a97443A62259p5662d2787E971L65288e3906A13465e865B42792g7057
15153A22612m5837b9642B9731d0304M609A09215i8076j99895H3042A9610d8574
15141B66974K37772i2721F1442K2325c91319C0529a01719A54472M6730n4612k36
15130A46354f625B88762A06801c95646A47164c4639B17048F2998p453a08932B52876
$$ plain form
15211 121613 29374 208927 106655 235214 -57812 -97557 -164531 -75221 -175289 318556
15200 -126978 52182 -4308 98739 -81622 -115447 128280 -108860 -23813 142932 455854 93297
15188 -153074 14669 76803 -111308 37143 -263931 78080 -228986 -10268 43227 256812 47117
15176 2215 -31204 83974 72713 109730 399453 -34347 365717 185819 151789 173479 266278
15165 266278 -197443 162259 86597 -42787 5971 371259 -53906 113465 -5865 242792 -77057
15153 122612 76775 -29642 29731 -40304 -35695 109215 -98076 -297971 83042 19610 -48574
15141 266974 504746 -92721 61442 83767 -391319 30529 -101719 154472 201202 146590 146354
15130 146354 -6625 288762 106801 -395646 147164 -34639 217048 62998 55545 -108932 252876
15118C47859K21796l3163q710G0363K05228J0985c202A32771O0344m2888D276
15106B79054P405r7108b3222A79099F0856b6797E428K89435A4960J87224K12392
15095D14576e8804e490B85238F4142a46077B03982r7960K33827g7740D67918j81597
15084B86321J4016r2144N4505J87358A5284R47L54526j34856a58863B11741b9617
15072B88770j37319J8016J36090M7055p1591c71457A2535L0850J2354J74180O7974
15061B97893a07270m7156a1442B84030Q265Q3419B4768a1403D76075c8441C61236
15049F48444B83513J38723j71290K8879G6642K5685K08482m4452p8053C7586J58181
15038A95767L31782n4485F563N66199N143L2806j6725k75034K22940K91192L6827
$$ plain form
15118 347859 569655 536492 527782 70363 275591 286576 -3202 132771 193115 150227 4276
15106 279054 286459 189351 -23222 179099 60856 -26797 5428 294863 14960 202184 414576
15095 414576 -58804 -5490 285238 64142 -146077 203982 106022 339849 -77740 467918 286321
15084 286321 300337 208193 262698 450056 15284 16231 370757 235901 -158863 211741 -29617
15072 288770 151451 169467 305557 352612 281021 -371457 12535 43385 55739 229919 297893
15061 297893 -107270 -154426 -11442 284030 292295 375714 24768 -11403 476075 -38441 361236
15049 648444 283513 422236 250946 279825 76642 102327 310809 266357 188304 37586 195767
15038 195767 527549 473064 6563 572762 577905 610711 593986 318952 541892 833084 869911
15027H69911m06268A50519l5161M42129j35582K2197L1646M24119l25397K9364
15017F03834m9828p943P5363n9849B71480J13370P4801j83423K74882j22877n9532
15006C68701J86843J07487k81611j08169K6531o5179K78991B10946L19897R3112
14996F23955k75312K10679k04881A63309M05559B57158K63870O7498k07247J30521
14986E11800r3244B03229P5924L79244J93344Q6051P7796l30897B66701O76269
14976I42970m31049j2765k28879A04105P61375D09331L33524j08839K27975D22670
14965a9646H17858j51696C07962M6839O000J58914A63809L339L08025A39980m1755
14954I8225J09005J05630J62273j06661n91P4346j74441K12483j38281r1450O33819
$$ plain form
15027 869911 463643 150519 115358 557487 421905 444102 475748 899867 574470 603834
15017 603834 554006 546063 621426 561577 271480 384850 459651 276228 551110 428233 368701
15006 368701 555544 663031 381420 273251 299782 234603 513594 210946 530843 623955
14996 623955 348643 559322 354441 163309 568868 257158 521028 588526 381279 511800
14986 511800 418556 203229 279153 658397 851741 937792 1015588 684691 266701 942970
14976 942970 511921 499156 270277 104105 865480 409331 742855 634016 861991 422670
14965 -19646 817858 666162 307962 354801 360801 519715 163809 167148 475173 139980 98225
14954 98225 207230 312860 475133 368472 367881 442227 267786 480269 341988 250538 884357
14943H84357k64500K56639q7277k88491j07901A48148K45380Q7488j41826J79579
14933E18769l8130O5987O25948P4883K77556j86283j81686K03482L76742n2793
14923A684475J10609l54401Q947K50670n6008K73643L94377l7417m629n34244
14913A736022m80835k4634j22826k43239j18703k40112K6426R6238j34586k16492
14903B77259K41428M2472k32079j9426K78454j88365H8081Q0639O9552K01830
14893D40102O0531k8189j13434K48404j80576j76821K59978K35496j91644J84097
14883G37944O7365K64477m92639J66540J67187M5671m34561J19830J9665k10461
14873D51018K34606j66777j91527J63163j76217L0271N49985j69997j5723B69505
$$ plain form
14943 884357 619857 876496 789219 500728 392827 148148 393528 481016 339190 518769
14933 518769 480639 546626 1172574 1247457 1525013 1338730 1157044 1360526 1737268 1684475
14923 1684475 1795084 1440683 1449630 1700300 1644292 1917935 2312312 2274895 2270266 1736022
14913 1736022 1255187 1230553 1107727 864488 745785 505673 532099 628337 493751 277259
14903 277259 518687 561159 329080 309654 588108 399743 88081 168720 238272 440102
14893 440102 500633 472444 359010 607414 426838 250017 509995 745491 553847 737944
14883 737944 805309 1069786 577147 743687 910874 956545 521984 641814 661479 451018
14873 451018 685624 518847 327320 490483 314266 344537 894522 724525 708802 269505
14862D20259l6439r757K99804e6572B51817C5080L63477K26354C06115K83590
14852E89705j89348J76830l9637l7985J17656L5146R8945j7061M1054L62775j1240
14841A126840K49985F24197P18658l19402k54432M6709j36333j65273K27700l4867
14831G06957K6066B67219J24478J91322J07410M4086k22755B25958M87186k52752
14821D60392n0376M13420j08791k76064J32536L15014k97042J47223p2575j30119
14811E33618j29086O7081L44009j64815N3471L37158k60777J94499m5148k13529
14801G16481j79968k4258M1329J40260B06806O84226m05323J92620k82180L89836
14791G85985L7372D02311o3622A57160P37579p1856j47515L04799j99022j79422
$$ plain form
14862 420259 383820 374063 673867 -56572 251817 35080 398557 624911 306115 589705
14852 589705 400357 577187 537550 499565 617221 652367 751312 734251 775305 1138080 1126840
14841 1126840 1376825 624197 1342855 1023453 769021 815730 679397 514124 741824 706957
14831 706957 733023 267219 391697 583019 690429 734515 511760 225958 713144 460392
14821 460392 410016 823436 714645 438581 571117 886131 589089 736312 663737 533618
14811 533618 404532 471613 815622 650807 704278 1041436 780659 975158 930010 716481
14801 716481 536513 512255 553584 693844 206806 891032 485709 678329 396149 785985
14791 785985 823357 402311 338689 157160 894739 822883 675368 980167 781145 601723
14781F01723k23608L46337J81045J51756D95140P22788j53429m12736K26359J31257
14771A009379k67489N5744k71677O6016j6878K43711k27474q2073n0448N3300
14761E12111m1401J48814J86373j6811N3365B73181L99382k4013o6749j03105
14751D78696K61948k11506o2310L51698l73282J75189J46187J5874p8608k80289
14741D23597K17665J59941r2725P7722o3379J79271k79100k8351j28762J30512
14731E96391L69879J54350L02876J25425O5583J49412L99398o19059q6552m96199
14721I61504M8679P4893p1577j04131P8381D65619J44898J09982L37673k39802
14711H18370K68393k79018M8142J21479M0750L17675p0154J77153j02578K65114
$$ plain form
14781 601723 378115 724452 905497 1057253 495140 1217928 1064499 651763 878122 1009379
14771 1009379 741890 797634 525957 591973 575095 818806 591332 509259 458811 512111
14761 512111 470710 619524 805897 789086 842451 273181 672563 648550 581801 478696
14751 478696 740644 529138 466828 818526 445244 620433 766620 782494 703886 423597
14741 423597 641262 801203 708478 786200 722821 902092 622992 594641 465879 596391
14731 596391 966270 1120620 1423496 1548921 1614504 1763916 2163314 1544255 1457703 961504
14721 961504 1010183 1085076 1013499 909368 987749 465619 610517 720499 1058172 818370
14711 818370 1086763 807745 855887 977366 1018116 1335791 1265637 1442790 1340212 1605326
14701A605326L37923N0245J5642m18668k80494J09714k56268k7096j66476j12964
14691H56884R7055l79246m5678M33061m5648K12431m23093K32779L9589q6050
14681H92084K06772l44706O3171j94673J31571L11848o3127k32615K83932j03996
14671I50261K9065k6694M5326l29769N4177L16219k99493K38331o9740J83836
14661A091519k50398n9929N93597k50381l12015K18208o8966J75373J71256k24749
14651A083515J32273K65520o19398M16801q42J22746j0213k38762L45367j67245
14641A329762m76168L56018k19928L07762k79660j22213J02658K01459j23025
14632A076665Q6261K32192j79863k12632j0587J65064L38695j15927k70031L41637
$$ plain form
14701 1605326 1943249 1993494 2009136 1590468 1309974 1419688 1163420 1136324 969848 856884
14691 856884 953939 574693 529015 962076 916428 1128859 705766 938545 978134 892084
14681 892084 1098856 754150 817321 622648 754219 1066067 1002940 770325 1054257 950261
14671 950261 979326 952632 997958 668189 722366 1038585 739092 977423 907683 1091519
14661 1091519 841121 781192 1374789 1124408 812393 1030601 961635 1137008 1308264 1083515
14651 1083515 1215788 1481308 861910 1278711 1277869 1400615 1390402 1151640 1497007 1329762
14641 1329762 853594 1209612 989684 1297446 1017786 895573 998231 1199690 1076665
14632 1076665 1162926 1395118 1215255 1002623 992036 1157100 1495795 1379868 1109837 1451474
14622A451474k4032J86159l06552k0564J11681j7652m0023j6463j30628K69042
14612A462442J38930r902l40917K86379j38055K52093r9101j43798j25715K23850
14602A506206M8938P197L9818k61265K60549Q0863m33030K61586K12373j43624
14592A579611m149K24342J66407j68299o0897L2415j74027k22042O62346j38014
14582A897693J08442k5935j87616J62177O1193o4805M7048m6646J19081j89967
14572A880665J88431J25379O4295m98930L22357Q2002K62769l72618L33063m03923
14562A983490K97335J23801M41186m97q9346J03105P4834M56890l05276P41660
14552C827182K10720N68031J254905J550958L644994P412968J9818966P326248
$$ plain form
14622 1451474 1427442 1613601 1307049 1286485 1398166 1380514 1340491 1324028 1193400 1462442
14612 1462442 1601372 1591470 1250553 1536932 1398877 1650970 1551869 1408071 1282356 1506206
14602 1506206 1555144 1562341 1602159 1340894 1601443 1682306 1249276 1510862 1723235 1579611
14592 1579611 1575462 1799804 1966211 1797912 1737015 1769430 1595403 1373361 2035707 1897693
14582 1897693 2006135 1980200 1792584 1954761 2015954 1951149 1998197 1951551 2070632 1880665
14572 1880665 2069096 2194475 2258770 1759840 2082197 2164199 2426968 2054350 2387413 1983490
14562 1983490 2280825 2404626 2845812 2845315 2755969 2859074 2933908 3390798 3085522 3827182
14552 3827182 4037902 4605933 5860838 7411796 11056790 18469758 38288724 45614972
14544D5614972A9222309F901386C447902j130053J14364K2553M78057K519131
14536E451954r76346j881899l78232k07503J66567R442k02188j97640K23658L98630
14526B406443q0791k01386J30068R5149m3712J60188k37380L40773j14795Q7388
14516B541945p3857L13376N463k11390K36128L7462k85626M42677O6281m70651
14506B601808K22806M2139J97475R3792m75224K30476J00316l7165K72883J4066
14496C263372j40044J62085j21906J21980k3304L4750J21924J48525m22115M84865
14486C630132q6586k9449N31619l43690l4831k14330K68114j76330J20775M09707
14476D075131N23876k66302j02813j71891J25677O5623k4115j69256P34704j12189
$$ plain form
14544 45614972 19222309 6901386 3447902 2317849 2432213 2454766 2932823 5451954
14536 5451954 4475608 2593709 2215477 2007974 2174541 2183983 1981795 1784155 2007813 2406443
14526 2406443 2325652 2124266 2254334 2349483 2305771 2465959 2228579 2569352 2454557 2541945
14516 2541945 2468088 2781464 2786927 2575537 2811665 2849127 2563501 3006178 3072459 2601808
14506 2601808 2824614 2866753 3064228 3158020 2682796 2913272 3013588 2976423 3249306 3263372
14496 3263372 3123328 3285413 3163507 3285487 3262183 3296933 3418857 3567382 3145267 3630132
14486 3630132 3543546 3514097 4045716 3702026 3667195 3452865 3720979 3544649 3665424 4075131
14476 4075131 4599007 4332705 4229892 4058001 4183678 4249301 4225186 4055930 4790634 4678445
14466D678445j42504J58170j11620M03376m04273O6017K06074L89046k72149n0096
14456D920486q5560M8502J09499L50726j67913J85874k89816r2021M84310J22224
14446E586311l99557O46617p9862K7969R2564L92724O4424Q5738J47052L3227
14436F597207j39211Q0613K08951L488O6581R1477J52518J07638j36720L6962
14426G069504P2410K15188O40423j36622n0599L66789J61307M72797o6261j52405
14416H592531J78997j16352J63405O0078J75955K87990J67106J11974P1562J15425
14406I808671L04643J29958N56246P6701m13277J6885K64593K57395K10552j10245
14396A1102122K35989K87631K34631K11703M26754j95949N16332j47254L66189
$$ plain form
14466 4678445 4535941 4694111 4582491 4985867 4581594 4647611 4853685 5242731 4970582 4920486
14456 4920486 4834926 4883428 4992927 5343653 5175740 5361614 5071798 4979777 5464087 5586311
14446 5586311 5186754 5833371 5753509 5781478 5874042 6266766 6331190 6416928 6563980 6597207
14436 6597207 6457996 6538609 6747560 6751048 6817629 6909106 7061624 7169262 7032542 7069504
14426 7069504 7141914 7357102 7997525 7860903 7810304 8177093 8338400 8811197 8744936 8592531
14416 8592531 8771528 8655176 8818581 8878659 9054614 9342604 9509710 9621684 9693246 9808671
14406 9808671 10113314 10243272 10799518 10876219 10462942 10479827 10744420 11001815 11212367 11102122
14396 11102122 11338111 11625742 11860373 12072076 12498830 12302881 12819213 12671959 13038148
14387A3038148O92883k64011L01445K38810L11248K85272M59238J61753L96489
14378A5621275J26467J84148K14020J00906L83804O09437Q2448M07147J61620
14369A7891272Q64499K88150L09368N03370M43226J72834N38277K26960N94403
14360B1832359M61719O17520K11911N28365O52752N35788N45606Q92153M18685
14351B6696858O23381P31715N89625O28403R23925R37848J59710J092096J074519
14342C3458080P16995P16753J117814R98498R04865J629617R83123J077870R93186
14333D2596801J328785J637556J134319J025334J858452J252691J927544J643965
14325E4405447J869718K480279J311171K271689K202524K518549K291216K657897
$$ plain form
14387 13038148 13731031 13467020 13768465 14007275 14318523 14603795 15063033 15224786 15621275
14378 15621275 15747742 15931890 16145910 16246816 16630620 17240057 17322505 17729652 17891272
14369 17891272 18755771 19043921 19353289 19856659 20299885 20472719 21010996 21237956 21832359
14360 21832359 22294078 22911598 23123509 23651874 24304626 24840414 25386020 26278173 26696858
14351 26696858 27320239 28051954 28641579 29269982 30193907 31131755 31291465 32383561 33458080
14342 33458080 34175075 34891828 36009642 37008140 37913005 39542622 40525745 41603615 42596801
14333 42596801 43925586 45563142 46697461 47722795 49581247 50833938 52761482 54405447
14325 54405447 56275165 58755444 60066615 62338304 64540828 67059377 69350593 72008490
14317G2008490K133861K495617L244210L040086L090440L346613L572958M102833
14309I7035108M103581M067279M299109M663687N220169N222783N562443N890461
14301A36064620O356080O580837O921104P360356Q119608Q276053Q765903R208313
14293A97652874J0185617J0077979J0974781J1266254J2186168J2483631J3361442
14286B78188746J3185787J4357216J4318488J4687018J5247611J4650335J5222932
14279C79858133J4076988J4275441J3169425J2571889J0591508P625484M036604
14272D56205472K369472J346120M41574j218804l473433m599201p705324j0721572
14264D32644304j2619825j3732154j4948734j5504093j6133617j6100006j6027840
$$ plain form
14317 72008490 74142351 76637968 79882178 82922264 86012704 89359317 92932275 97035108
14309 97035108 101138689 105205968 109505077 114168764 119388933 124611716 130174159 136064620
14301 136064620 142420700 149001537 155922641 163282997 171402605 179678658 188444561 197652874
14293 197652874 207838491 217916470 228891251 240157505 252343673 264827304 278188746
14286 278188746 291374533 305731749 320050237 334737255 349984866 364635201 379858133
14279 379858133 393935121 408210562 421379987 433951876 444543384 452168868 456205472
14272 456205472 458574944 459921064 460362638 459143834 455670401 451071200 443365876 432644304
14264 432644304 420024479 406292325 391343591 375839498 359705881 343605875 327578035
14257C27578035j5486649j5289397j4543182j4439484j3477220j2848439j2469503
14250B29024161j1973681j1101566j0024476p707082r944420q937928p775868
14243A61559140p642597p356612o865437o532233o066304n323588n126269n525081
14235A11121019m734520m533900m446586l804923k983080l774594l482763l242808
14227H0117845l224336k997065k438302k383361k832712k198018k188082k046627
14219E9809342j683998k059675k401955j433891j978026j139974q55608k103926
14211D6152289j453447j110550j560858q83210m46754j256070j303503j438378
14203C6699519j127491p55128o38261l79088j297042q42135q55731j146496j81614
$$ plain form
14257 327578035 312091386 296801989 282258807 267819323 254342103 241493664 229024161
14250 229024161 217050480 205948914 195924438 188217356 178272936 169335008 161559140
14243 161559140 153916543 146559931 139694494 133162261 127095957 121772369 116646100 111121019
14235 111121019 106386499 101852599 97406013 93601090 90618010 86843416 83360653 80117845
14227 80117845 76893509 73896444 71458142 69074781 66242069 64044051 61855969 59809342
14219 59809342 58125344 56065669 53663714 52229823 50251797 49111823 48256215 46152289
14211 46152289 44698842 43588292 42027434 41144224 40697470 39441400 38137897 36699519
14203 36699519 35572028 34816900 34178639 33799551 32502509 31660374 30804643 29658147 29476533
14194B9476533r21268q15093l37098r25124p41203p98520l76260p48188o32896
14185B3180883p0095l42798j089712j28931o95165n01572l93726Q8409r54811
14176A9092482j21337k13565l94983m70691l55093m85299k9884n75989N4064n22872
14166A5976833l81931l80731k37032j93430l61683l60228k83248j27446j89858
14157A3461246k92465k85017o9186j20621k46499j31279o25564K2544m57627J62226
14147A1417758j04408j39933k34285K08305o15288j10196l96660m9506l8422Q7703
14137A0025068m22660L461j95282k0402l68694R7461l89279J11128r5857m29866
14127H315078L9687m369p6403j70585q5298j81248N6946j76305m86798K81710
$$ plain form
14194 29476533 28555265 27740172 27403074 26477950 25736747 24938227 24561967 23813779 23180883
14185 23180883 23110788 22767990 21678278 21549347 20854182 20352610 19958884 20047293 19092482
14176 19092482 18971145 18757580 18362597 17891906 17536813 17051514 17021630 16445641 16499705 15976833
14166 15976833 15594902 15214171 14977139 14783709 14422026 14061798 13778550 13651104 13461246
14157 13461246 13168781 12883764 12814578 12693957 12447458 12316179 11690615 11713159 11255532 11417758
14147 11417758 11313350 11173417 10939132 11147437 10532149 10421953 10025293 9975787 9937365 10025068
14137 10025068 9602408 9605869 9410587 9390185 9021491 9118952 8729673 8840801 8744944 8315078
14127 8315078 8354765 8350396 8273993 8103408 8018110 7836862 7893808 7717503 7230705 7512415
14117G512415l22452K19446p0904k44857k96479M03386l67639r2739k70794l9223
14107F430160P0538n50544L98981N5040l40202J27679k25240k33247L48123o6991
14097F014297k63511j31755j19991L5833j31932J58897P9452j80932p0013j41439
14087E248906j05866k98010j03927M52035m31993J44038r9758j17774m8440K73025
14077D912236k37220r4191K32478j73895L1511q2215k71413J90891k02972j57282
14067D147928j50504K02188l8549Q8707L14028l02239m9371J96394l51591J3995
14057D070986k15186Q8647l1638P8028l17312R0974p404p4866n46461O12596j36537
14046C611827k03229L39580l11656K1250j67288L85247j88012k39931M50765n22933
$$ plain form
14117 7512415 7189963 7409409 7338505 7093648 6797169 7200555 6832916 6740177 6469383 6430160
14107 6430160 6500698 5950154 6349135 6404175 6063973 6191652 5966412 5733165 6081288 6014297
14097 6014297 5750786 5619031 5499040 5534873 5402941 5561838 5641290 5460358 5390345 5248906
14087 5248906 5143040 4845030 4741103 5193138 4761145 4905183 4805425 4687651 4639211 4912236
14077 4912236 4675016 4580825 4813303 4639408 4670919 4588704 4317291 4508182 4305210 4147928
14067 4147928 3997424 4199612 4161063 4249770 4563798 4261559 4212188 4408582 4056991 4070986
14057 4070986 3855800 3944447 3912809 3990837 3673525 3764499 3757095 3682229 3135768 3748364 3611827
14046 3611827 3408598 3748178 3436522 3457772 3290484 3675731 3487719 3247788 3698553 3175620
14036C175620K24559n34625M02484j77092j92982M93063l85149j01814J43310
14027C047374j11006l7174r9103L53042k71258m93797M46249l58696L97346k77420
14017B595557n5554k39487L532M40076l04645P6030K58807k04782k35599K86254
14007B620189p3263l90484J21636K41585n46619K5526K11460J68237J760j39836
13997B240191j64172J01908r6839J42622R263J09803J85531L17537J340014K056565
13987F242423N882602J6511326K0588894k2439621A2716252n092708k373387r41163
13979D308994l68621o48530J002q3601k45380p0314j72546K5350O2538r5477m45111
13968B268304K96036l80790J3672J82163l60757L11793q7871j99143J59019k26203
$$ plain form
14036 3175620 3400179 2865554 3268038 3090946 2897964 3391027 3005878 2904064 3047374
14027 3047374 2936368 2899194 2800091 3153133 2881875 2388078 2834327 2475631 2872977 2595557
14017 2595557 2540003 2300516 2304048 2744124 2439479 2515509 2774316 2569534 2333935 2620189
14007 2620189 2546926 2156442 2278078 2519663 1973044 1998570 2210030 2378267 2380027 2240191
13997 2240191 2076019 2177927 2081088 2223710 2232973 2342776 2528307 2845844 4185858 6242423
13987 6242423 12125025 28636351 49225245 26785624 12716252 7623544 5250157 4308994
13979 4308994 3940373 3291843 3292845 3209244 2963864 2893550 2721004 2746354 2808892 2713415 2268304
13968 2268304 2564340 2183550 2197222 2379385 2018628 2330421 2242550 2043407 2202426 1976223
13958A976223r0716q2862M9956J15413O2653K37581k92589j70057l3676N4294
13948A826220L05645l46504N20349l71286q646J56311l27731q5316Q787l5832
13938A641997K25034j64816O2991J94548m07857J75031O9648k89721j80172J19628
13928A446311L43835k27916j71936O22904m63936o9136J67307j49534K16362L5470
13918A749731l37986J45247J64786j37168l12140Q6756O668K99041J3625l02185
13908A376375K1524L05964m45197N9569K06257l19187L6609P6528j59148J75394
13898A334688J85495j22015l67713o7783J56669n0282J33989K73436l69124N8592
13888A165952L82388n79816K61441p7976L1173j03843J04894M69253l12442l60376
$$ plain form
13958 1976223 1885507 1802645 1852601 1968014 2030667 2268248 1975659 1805602 1771926 1826220
13948 1826220 2131865 1785361 2305710 1934424 1925778 2082089 1754358 1669042 1677829 1641997
13938 1641997 1867031 1702215 1765206 1959754 1551897 1726928 1796576 1506855 1326683 1446311
13928 1446311 1790146 1562230 1390294 2013198 1549262 1480126 1647433 1497899 1714261 1749731
13918 1749731 1411745 1556992 1721778 1584610 1272470 1359226 1365894 1664935 1678560 1376375
13908 1376375 1397899 1703863 1258666 1318235 1524492 1205305 1241914 1318442 1159294 1334688
13898 1334688 1520183 1398168 1030455 962672 1119341 1069059 1203048 1476484 1107360 1165952
13888 1165952 1548340 968524 1229965 1151989 1183162 1079319 1184213 1653466 1341024 980648
13878I80648j24099K96645j70217J08988j76054L58003L187N0088j38226J41355
13868A330318j74232Q7835l23896K03547P5318l20753R6107M78357m02833J81459
13858A231227N5438k04741R9262j91765K82988l73987N979K12757k85828J01849
13848I33179k05036M48497p5913l6348R7389j32915l22835L61535k05871j55846
13838G05836L59908o3790j6740J45790j23641l7139j68983K3476L59455j70530
13828A013642J34683j81241r4737r24j88663J37655q4933K6897L23431j41563
13818I44247k17740M06571P9099k62064j20358q5375K13794j05117k45949N4709
13808F61817J97177k15555J64048J62117n9212q7277J72727m29886J74981K73211
$$ plain form
13878 980648 856549 1153194 982977 1091965 915911 1273914 1277101 1327189 1188963 1330318
13868 1330318 1156086 1243921 920025 1123572 1198890 878137 974244 1452601 1049768 1231227
13858 1231227 1286665 1081924 1181186 989421 1272409 898422 904401 1117158 831330 933179
13848 933179 728143 1176640 1100727 1064379 1161768 1028853 706018 1067553 861682 705836
13838 705836 1065744 1001954 985214 1131004 1007363 970224 801241 824717 1184172 1013642
13828 1013642 1148325 967084 872347 871423 682760 820415 735482 762379 1085810 944247
13818 944247 726507 1133078 1212177 950113 829755 744380 958174 853057 607108 661817
13808 661817 858994 643439 807487 969604 910392 823115 995842 565956 740937 1014148
13798A014148r0103j62637n299j58682J84439J23758l54182N09615l09448O7930
13788H19539k5047j67753J49149J6823j88252J90070q1086N7273O1437j12305
13778G19848J02466J07852j63836K90677D66479J51768r0206M06706l80275K11865
13768G66337k21706J14996K95444q777l43022M7834l12677M60347j48246l8545
13758F11985K93143j91860j22191J01643j05656j33209K89473j86754K83082j60990
13748F78666K78461k93078J78636m6795N3405B8475O68063Q7650j86452J62759
13738G60495l57375J14656J42934J55407q2443J12603j13947j36458N3515J28029
13728G77416j0255k69532K51024k16726K23499k26977m4787j98744L26528P6556
$$ plain form
13798 1014148 924045 761408 756109 597427 781866 905624 551442 1061057 751609 819539
13788 819539 794492 626739 775888 792711 604459 794529 713443 770716 832153 719848
13778 719848 822314 930166 766330 1057007 466479 618247 528041 934747 554472 766337
13768 766337 544631 659627 955071 946294 603272 651106 338429 798776 650530 611985
13758 611985 905128 713268 591077 692720 587064 453855 743328 556574 839656 678666
13748 678666 957127 664049 842685 795890 849295 28475 696538 784188 597736 760495
13738 760495 403120 517776 660710 816117 733674 846277 732330 595872 649387 777416
13728 777416 767161 497629 748653 531927 755426 528449 483662 284918 611446 688002
13718F88002L0148l2251r5425J22695j88228J11815k19127K59742k09623J61170
13708F28918k05068M8502Q3263J3922j10570L40674l14937J16481q810j81642
13698D10733Q848j07717L16784J0220k13040A76307J56675K90686m5371m414r538
13687E64345j02046K83692j83179P0087M8024k29113L64671l88926J45230o0396
13677E12389q2010A82770M48766B33806K24474l9030K4013N0252m0938p4505J31624
13666E09696j05743j6949L326K01524j76330k00238k5690O12518q6868C28044
13655F38023k35925l3704Q8815k21923K88421q5709j87383L40552k92513A28868
13644E62206n4659J41746k51092R3649r2009K49811k11927M2738J15798p1294
$$ plain form
13718 688002 718150 685899 590474 713169 524941 636756 417629 677371 467748 628918
13708 628918 423850 472352 555615 569537 458967 799641 484704 601185 592375 410733
13698 410733 419581 311864 628648 638868 425828 176307 332982 623668 578297 573883 564345
13687 564345 462299 745991 562812 632899 680923 451810 816481 427555 572785 512389
13677 512389 430379 182770 631536 233806 458280 419250 443263 493515 452577 378072 509696
13666 509696 403953 387004 390330 591854 415524 215286 189596 802114 715246 328044
13655 638023 402098 368394 457209 235286 523707 437998 250615 591167 298654 128868
13644 562206 507547 649293 398201 491850 399841 649652 437725 480463 596261 524967
13634E24967j12485J39031J64427C57110J43110j46240r6961b4643E03438A09907
13623B293O62499C18544a5499C61138O1676M50530L538m12965j71659K88733B57621
13611C95573A61351L57845I5282L74736A48377n6011K34591J05518c5312D11537
13600D26568A29115K87897l6625J39053k27159L30831B86690G5052L21917j92329
13590B04640J03029n9136K79135n4882C4220M01015j62518J76807L6579n2883
13580D33220j79141B2003J03814L90461j8291R0069j41001k08380K9386L99170
13570F67231l25721j69019Q2673J20611J16884A73864L41893I6627L46512j59888
13560B83251K06800k19701K9630J13393P7360r7275q5203K08899j76630J9183
$$ plain form
13634 524967 412482 551513 715940 357110 500220 353980 257019 -24643 503438 109907
13623 2293 664792 318544 -15499 361138 422814 873344 876882 463917 292258 580991 257621
13611 395573 161351 519196 95282 470018 148377 92366 326957 432475 -35312 411537
13600 426568 129115 417012 380387 519440 292281 623112 286690 75052 396969 204640
13590 204640 307669 248533 527668 472786 34220 435235 272717 449524 486103 433220
13580 433220 254079 22003 125817 516278 497987 588056 447055 238675 268061 667231
13570 667231 341510 172491 255164 375775 492659 173864 515757 96627 443139 283251
13560 283251 490051 270350 299980 413373 490733 393458 308255 517154 340524 359707
13550C59707j51180O11220C05912Q6885J029j94930p2294K15943A61557J01692
13540B63249L17191D8199J74719N3649K77570B65885j4557K63785k18247K49041
13530E45907r2307p6426m2347j14431j1349p1667F1072J79497J32433J26690j67423
13519C32269p4749n0714J12410A24856J65430p1166O2788J95372d507B40851P6354
13508C17205j30919m7106J12821N1261K59412I1350J10712K25870M6903A84009
13497A20288K0030l7533J11015r4238N88683B33208K8091p4730q7300L35104C3263
13485C36726a15307C92694K8354A91379K3439J40265i43A68367K67120j44267
13475B91220L3680j06175C8343L2234J73864K30009a43633G0319J4470L49237
$$ plain form
13550 359707 208527 819747 305912 392797 393826 198896 126602 342545 161557 263249
13540 263249 580440 48199 222918 276567 554137 265885 251328 515113 296866 545907
13530 545907 453600 377174 334827 220396 209047 137380 61072 240569 373002 499692 332269
13519 332269 257520 206806 319216 124856 290286 219120 281908 477280 -4507 240851 317205
13508 317205 186286 139180 252001 303262 562674 91350 202062 427932 474835 184009
13497 120288 140318 102785 213800 119562 708245 233208 261299 186569 99269 434373 33263
13485 336726 -115307 392694 421048 191379 214818 355083 -943 168367 435487 291220
13475 291220 324900 218725 38343 70577 244441 474450 -143633 70319 84789 434026
13465D34026A53438J60210J00601j40750p9345q2480c6840C67467k7826p0474
13455B69167j21245A2642a02309F57734E0998J47357J09074h595o7852C16984
13444C00814q6082K85925k30192J99809I8013J36368G1121Q0124O7155D5102J72802
13433B17904Q291A05743M0656A2245g2719A16508J6961L72315B02275O8412A25895
13421b10757A63696A4552J85049g6651D71618G2145J79621K41003I4799J25645
13411B20444M13840B69032M6308D4840K30791A9840b61142B71556L9736H6336
13400B00109J539A215K79341j00126P7135G39L03183R1949g7843B31896M14211
13389F46107B79257D4772K20454J94848A61182o3713I782L22649A29510J99590
$$ plain form
13465 434026 153438 313648 414249 273499 194154 111674 -36840 367467 339641 269167
13455 269167 147922 12642 -102309 657734 50998 198355 307429 -8595 -76447 316984
13444 300814 214732 500657 270465 470274 98013 234381 71121 151245 218400 45102 217904
13433 217904 226195 105743 146399 12245 -72719 116508 133469 505784 202275 270687 125895
13421 -210757 163696 14552 199601 -76651 471618 72145 251766 492769 94799 220444
13411 220444 634284 269032 315340 44840 275631 19840 -261142 271556 311292 86336
13400 200109 201648 1215 280556 180430 257565 739 303922 395871 -77843 231896 646107
13389 646107 279257 44772 265226 460074 161182 97469 9782 332431 129510 329100
13379C29100p5511n3506E6467L91853i9508C50758j46639K08209G4431K81994
13369C56425b66818D33639I6651j8928C3798L21804j72306K5563p2196d3882B23564
13357e7566l53001G9141R6396B9090g1366A35655q607R2963J2865j05990g1325
13345A77721b62755E37977B67406I3930L78653j86378A33035J27234J92802k11326
13335B41745J43179J59627A71465P0967j7145J10315A2205K28308m9628A7012
13324h9848C28503a97614e345B89811k579b66943A80098K40582B05286N7515j18192
13313A44609o4027J35072j02729C8240L56L08560e2730A00971N994J0771b31288
13301A07565J67081q0413a80767b3533l5665E70146B49978h6386A3953J35200
$$ plain form
13379 329100 253589 200083 56467 448320 -99508 350758 204119 412328 74431 356425
13369 356425 -266818 433639 96651 77723 33798 355602 183296 208859 136663 -43882 223564
13357 -57566 -410567 79141 175537 29090 -71366 135655 127048 220011 232876 126886 -71325
13345 177721 -262755 537977 267406 93930 472583 286205 133035 260269 453071 241745
13335 241745 384924 544551 171465 242432 225287 335602 12205 240513 190885 17012
13324 -89848 328503 -197614 -5345 289811 287232 -266943 180098 420680 205286 262801 144609
13313 144609 80582 215654 112925 38240 38596 347156 -52730 100971 106965 117736 -231288
13301 107565 274646 194233 -180767 -23533 -59198 570146 249978 -86386 13953 149153
13291A49153a92810E7533K31811o9933J35044m4471G1292L367R8995l6152a19464
13279D32606k4608B6650J71755a3714A29064j0003K87298F554c04545B4178a17379
13267C26426l1735J0351j14559r3396J39093n4282i4814B57689J61278A25152
13256d34182A15460N6738j2263J45132h1505A50540R381o1348J37976o1222j8159
13245A57168l7381g060A90718A9301K08189C9676J76269p5452l2424K6184K43956
13234C78209F827J06724g9875j47359c2967F8878d6153I7622c0046B74037j04684
13223A69353K71579F2122k7482g8152B12653a70982B32828j03326a42086j15040
13213b57126B85660r1412K36179j66545G3285J08207H6037G535J56956p256Q2878
$$ plain form
13291 149153 -192810 57533 289344 219411 354455 309984 71292 74659 173654 137502 -119464
13279 432606 407998 26650 198405 -13714 129064 119061 406359 6554 -304545 24178 -117379
13267 326426 294691 305042 190483 97087 236180 181898 -94814 257689 418967 125152
13256 -434182 115460 172198 159935 305067 -81505 150540 159921 98573 236549 175327 157168
13245 157168 119787 -7060 190718 19301 227490 39676 215945 140493 108069 134253 378209
13234 378209 6827 113551 -79875 -227234 -32967 68878 -46153 97622 -30046 274037 169353
13223 169353 440932 62122 34640 -78152 212653 -170982 232828 129502 -142086 -257126
13213 -257126 285660 194248 430427 263882 73285 181492 86037 7535 164491 157235 240113
13202B40113j18276a4212B44946j0032G5488a05444I9420a30115I3671L3330L6231
13191A63232a15737N4098C2888a76684L8883A6872J14869N1125h939j46277O9496
13180h5720D6224K13306a8376F9192J73706H1237a23489J1612f415B6482R2306
13169A18788e2526B82247F4264K5072e4816B20077O0017a82504H7772a36702H1027
13157c34167D5121b15346C16293E2732J95574g2580A09428J58936m8942b49417
13146G2902B8336K44900m9054a72078A96690q6019P1618b3637C08231E8717c72831
13134G5578g6339B99834A23511d4320k011a7854j09661m6412B78672C3441K4295
13123E7736a19896j3848J1651a8024A10375J1087Q07R7036d6593B06548b7575
$$ plain form
13202 240113 121837 -14212 244946 234914 75488 -105444 99420 -130115 93671 127001 163232
13191 163232 -115737 -61639 32888 -176684 -137801 16872 131741 182866 -8939 -155216 -85720
13180 -85720 46224 259530 -18376 69192 242898 81237 -123489 -111877 -6415 26482 118788
13169 118788 -52526 282247 64264 89336 -54816 220077 280094 -182504 87772 -136702 81027
13157 -334167 45121 -215346 316293 52732 248306 -72580 109428 268364 219422 -249417
13146 72902 28336 273236 224182 -172078 196690 110671 182289 -23637 308231 58717 -372831
13134 75578 -76339 299834 123511 -44320 -46331 -17854 -127515 -173927 278672 33441 57736
13123 57736 -119896 -133744 -122093 -18024 110375 121462 122269 219305 -46593 206548 -27575
13111a00631j35906i9807B61333c1747o0498C93715p1381a29474e2308j60526
13101b12834m3408N1614J7090c5607C19491j36839L7138a15533Q87A22358B4634
13089a35785B10305b14483H1822A4655R8057L9387G744K23311i0013A89961J535
13078A91496N7199d331A53787D7867a23568F888Q7878J60779A17356a4925B33214
13066c5401D08062j25992c8106H041K67605A12336h77F0806L36213n8806d4835
13054B63115r8052B0846j0287b20653B7282a58810A20743C7900c93275B06478
13043a68171D49696b886j59213E0730c11r1745A7131b32874G0935K81591b45656
13031A98848F4508K16670A28975a61144C61228a16013E9547a4219C77951A69043
$$ plain form
13111 -100631 -236537 -99807 261333 -31747 -92245 393715 322334 -129474 -52308 -212834
13101 -212834 -256242 -204628 -187538 -35607 319491 182652 219790 -115533 -114646 122358 24634
13089 -135785 210305 -214483 81822 14655 112712 152099 7744 231055 -90013 189961 191496
13078 191496 248695 -4331 153787 47867 -123568 6888 94766 255545 117356 -14925 233214
13066 -35401 408062 282070 -38106 8041 275646 112336 -877 60806 397019 338213 -44835
13054 263115 165063 20846 10559 -220653 27282 -158810 120743 37900 -393275 206478
13043 -168171 449696 -2886 -162099 50730 -311 -92056 17131 -232874 70935 352526 -245656
13031 198848 64508 281178 128975 -161144 361228 -116013 59547 -14219 377951 169043
13020e4569l0695C05563k8082J23728j40490E0272R9513c6974A64463C0154a21338
13008C0803J87142a0854A03406Q449j8097b3482A48121N746R0832G4123c2291
12996g2567c2938h629j37453A93297f7109J7695B22456F8635L1360a26703M909
12985a21794A19686C7341K17663a74749h1598K0473q2029A23762a32447o2367
12975a94814E6207A4581a69098A47138c5085B66297h2718A915R8075k1362a4319
12963a71055A96398c51714A05544b87458J30204e9435C07151h5064K289A93774
12952B23230n3111b11520E4576f7499E1106b572l7234E4367J35484o6779J98018
12941C21090j33620b6701l63991I0047K00034o6904K6249g3615K8333G1186e9336
$$ plain form
13020 -54569 -85264 305563 277481 401209 260719 50272 149785 -36974 164463 30154 -121338
13008 30803 217945 -10854 103406 111855 93758 -23482 148121 153867 244699 74123 -32291
12996 -72567 -32938 -8629 -146082 193297 -67109 -49414 222456 68635 99995 -126703 -121794
12985 -121794 119686 37341 255004 -174749 -81598 -61125 -143154 123762 -132447 -194814
12975 -194814 56207 14581 -169098 147138 -35085 266297 -82718 1915 99990 78628 -14319
12963 -171055 196398 -351714 105544 -287458 -157254 -59435 307151 -85064 -82775 193774
12952 223230 170119 -211520 54576 -67499 51106 -2572 -39806 54367 189851 123072 321090
12941 321090 187470 -26701 -390692 90047 290081 223177 249426 -73615 -45282 71186 -59336
12929C03550f6815B06541M9023I0234a31305H4545M5292b12414A18745K85366
12919D04111A79004a61793j68738A08439R2650A691L75904A68250J01643N5094
12909C24987B7541e3169k3397A20396a587F7560K73712b47548D070a63515n7621
12898b21136A64210N2618a30729A18063m8043B7287a5780D12760g7227A79085
12887c70919A69866L4949l1184a75986E6168b871A08518b23756A41084b87133
12876b81273A67877Q888a4959j0189I3923J93932D440J53866d18021K1753C0652
12864E6387K9877J90503B541b85865g9253I3804b51115d4317k24804F6081a80859
12852G9352b98413A27808k6724H12a45858a9317E8966f0597b1429j24659D9322
$$ plain form
12929 303550 -66815 206541 255564 90234 -131305 84545 129837 -212414 118745 404111
12919 404111 179004 -161793 -330531 108439 201089 1691 377595 168250 269893 324987
12909 324987 27541 -53169 -76566 120396 -1587 67560 341272 -247548 4070 -163515 -221136
12898 -221136 164210 216828 -130729 118063 70020 27287 -15780 412760 -77227 179085
12887 -370919 169866 204815 173631 -175986 56168 -2871 108518 -223756 141084 -287133
12876 -281273 167877 176765 -14959 -25148 93923 287855 4440 158306 -418021 -396268 30652
12864 56387 86264 276767 2541 -285865 -79253 93804 -251115 -44317 -269121 66081 -180859
12852 79352 -298413 127808 101084 812 -145858 -19317 58966 -60597 -21429 -146088 49322
12840a25380B16711C9037J80067n2670B1806N8772O7659J55816m0022n4229p6880
12829A32922b2396A11981D0610J49710C2231b03178C45791b16152k41277B18149
12818F9801b09606a5962p4677I7239K1608N2954q5005J45611K5585a55781J4033
12807a41748A48062J08776a43194F9889a09398b3041j54840j41759H3279J56857
12797B40136C1493a35729I5189M0139b83477A86307b40251B27279i9624I7903
12786A82561n6938l5506B7710c8549B15789k9097a1127j20270D5156h4275B63271
12774B6539b58224e8843M592o102C61079D0009J42347p4032N6366K7671e4683
12762A192h0994j20229f4785l0194C0261e0582F4803N7568b9614k6425H2511J05039
$$ plain form
12840 -125380 216711 39037 219104 166434 21806 80578 148237 304053 264031 209802 132922
12829 132922 -22396 111981 40610 190320 32231 -203178 345791 -216152 -457429 218149
12818 69801 -209606 -15962 -90639 97239 118847 171801 86796 232407 257992 -155781 -141748
12807 -141748 148062 256838 -143194 69889 -109398 -23041 -177881 -319640 83279 240136
12797 240136 31493 -135729 95189 135328 -283477 186307 -240251 227279 -99624 97903
12786 182561 125623 90117 27710 -38549 215789 186692 -11127 -131397 45156 -84275 263271
12774 26539 -258224 -58843 -54251 -60353 361079 40009 182356 108324 164690 192361 -54683
12762 1192 -80994 -201223 -64785 -94979 30261 -50582 64803 122371 -29614 -56039 82511 187550
12750A87550H4210A4498a03517j15582I8579k4656a14370C2041a19142B34622
12739A39951G19J70256g3967A16332L73931H4841a23299E7237R3729A6215K968
12728A9183a83903k21775B78854d438l23805b463G7685i0662D66252o4140a59732
12716E1474c4989j00081C40214b27449A00703b73725b5977j6086B95534k8297
12706B67237j33333a99537j57590B49408H3524M5101J7745c94649d6975I2604
12695d7768j06640C08759c28113f6272A0933c0757B0091f1607j00651A65398G3783
12683A38890b3950E0923N7884l3370K78606j35429n7203j0385O1400m4333j4065
12672A54028M3027L7875A00798P6534k5320B7163a43990I9101b22038H584h1276
$$ plain form
12750 187550 84210 14498 -103517 -219099 98579 73923 -114370 32041 -119142 234622
12739 139951 719 170975 -73967 116332 490263 84841 -123299 57237 150966 16215 19183
12728 19183 -183903 -405678 278854 -4438 -328243 -2463 77685 -90662 466252 402112 -159732
12716 51474 -34989 -135070 340214 -227449 100703 -273725 -25977 -42063 295534 267237
12706 267237 133904 -199537 -357127 249408 83524 128625 146370 -394649 -46975 92604
12695 -47768 -154408 308759 -328113 -66272 10933 -30757 20091 -61607 -162258 165398 73783
12683 138890 -23950 50923 108807 75437 354043 218614 161411 151026 212426 168093 154028
12672 154028 197055 234930 100798 177332 152012 27163 -143990 99101 -222038 8584 -81276
12660a09138C29262c886B45352k8204A8743d9864a0641A75591p5073Q6139e4239
12648I5194a29302H0040h6378j12652C484c75652P7797d3311I5259J040c3913
12636b32454F0874M3434k5937a97737A00628K74768A82841J62670A33498J12552
12626B46050d548A43215A9729a78939B2097a1786C0042a69981Q1688M0417G4368
12614b58786i1203j7128B84388q0538b48739A05368M2975b54594B6844J5308O5175
12603A07327a8522D8039a24341D16072C8499b05824I6350a60433K1370k3471E24346
12591e1153C87391b45844P3904A17928L2996j1676K59250b05283B53837a16606
12580B8162J60894b03037C75502b43076a7118a766j48787B12114J55973A66607
$$ plain form
12660 -109138 329262 -3886 245352 217148 18743 -49864 -10641 175591 100518 186657 -54239
12648 95194 -129302 80040 -86378 -199030 3484 -375652 -297855 -43311 95259 96299 -33913
12636 -232454 60874 104308 78371 -197737 100628 375396 182841 345511 133498 246050
12626 246050 -4548 143215 19729 -178939 22097 -11786 30042 -169981 -88293 -47876 74368
12614 -258786 -91203 -108331 284388 203850 -248739 105368 148343 -254594 26844 42152 107327
12603 107327 -18522 48039 -124341 416072 38499 -205824 96350 -160433 -139063 -162534 524346
12591 -51153 387391 -245844 -171940 117928 150924 139248 398498 -205283 253837 -116606
12580 28162 189056 -203037 375502 -243076 -17118 -1766 -150553 212114 368087 166607
12569i94k26566C869a3170N842B12417r1928J10040b79193C74439b09622A13717
12557g9239o8352C11352B0083K4689R8541f1050a9504B20166a9179H1857f1734
12545d8248D7725a14999j79112A23272c6835B5116L02014A53998a11805A15971
12534A15916d21311a63892p0958A8900a17197K0943B32407P175A15926d7523j89251
12523b36774C05395b0200j85507h8613M493A13174a0338j52218f7847o5522B37060
12511G269K27951b36295q0471B46751b54587K295I2968a20922A04445a619A8792
12499a80089A11881j5491a34394A3420i8901A85519J152a88717j90372f7991B90010
12487H1417Q089J41107a26312r4801b9088k09347H8685M3914m1844c5371C61407
$$ plain form
12569 -994 -227560 3869 -13170 -7328 212417 120489 230529 -279193 374439 -209622 113717
12557 -79239 -147591 311352 20083 44772 143313 -61050 -19504 220166 -19179 81857 -61734
12545 -48248 47725 -114999 -294111 123272 -36835 25116 327130 153998 -111805 115971
12534 115916 -421311 -163892 -234850 18900 -117197 -96254 232407 239582 115926 -47523 -236774
12523 -236774 305395 -20200 -205707 -88613 -84120 113174 -10338 -162556 -67847 -133369 237060
12511 7269 235220 -236295 -316766 246751 -254587 -252292 92968 -120922 104445 -1619 18792
12499 -180089 111881 96390 -134394 13420 -98901 185519 186671 -188717 -379089 -67991 290010
12487 81417 89506 230613 -126312 -221113 -29088 -238435 88685 132599 90755 -35371 361407
12475A09736a00400A15210a03898A39955E3957L02521a61077a134H6273P0702
12465A56975b19130A97620L9689c4743l09020a55329K7201b8893l02999A37907
12454B67436m088o0446E0760J7330O5314f3374E1201J42848a81537e2784j13746
12443a66530o1704C4170J93757C4233c4973E4693k6621a63467c06A63082a16929
12431A22386d2539A0965d0769A36984M8995M7259J1520b2536A90436a2859m5183
12420e8042C0880N7443N6392a52867A02499P3084b75852P617A77897b15849g9376
12408e5492A25610R447D4024e2818A90303E6149c31276F2429a4145k43951C56734
12396B38158A16496a883A66851J64608N6269b6421B01140G4549a04946j56723
$$ plain form
12475 109736 -100400 115210 -103898 139955 53957 356478 -161077 -1134 86273 156975
12465 156975 -219130 197620 237309 -34743 -343763 -155329 -128128 -28893 -331892 137907
12454 267436 263348 202902 50760 68090 133404 -63374 51201 194049 -181537 -52784 -166530
12443 -166530 -228234 34170 227927 34233 -34973 54693 28072 -163467 -306 163082 -116929
12431 122386 -42539 10965 -40769 136984 185979 233238 244758 -22536 190436 -12859 -58042
12420 -58042 30880 88323 144715 -152867 102499 175583 -275852 -268235 177897 -215849 -79376
12408 -55492 125610 135057 44024 -52818 190303 56149 -331276 62429 -14145 -258096 356734
12396 238158 116496 -1883 166851 331459 387728 -26421 201140 74549 -104946 -261669
12386b61669B35035c6832B08304i903C21093j43038p2616a97065B77741C1389
12375H8031J13736C2838J90357c8491C52427b69102a07166o770H143b08408R0094
12364a18314k12389B78715b05957D2578M7475J9307B5056a45177K1978l3828k53687
12353d10714D4707o444K28923F8309b0511C54661A64246e4443J8264G095J41686
12342A48781f8330E1395J15858J83649a03462A36862k1141J3452d4985B93643
12331B31928j04133L56165b02374A87071A5968J24690B7132J33792J55659f1940
12320A99678C2705M29017j78148j34713j5957K32112m9141q6030n1519Q243e1829
12308A90355D8343L86903A25133a45602G3422a3242k52191H2959O8405Q1551B470
$$ plain form
12386 -261669 235035 -36832 208304 -9903 321093 178055 105439 -197065 277741 31389
12375 88031 201767 32838 223195 -38491 352427 -269102 -107166 -113936 8143 -208408 -118314
12364 -118314 -330703 278715 -205957 42578 90053 109360 25056 -145177 -123199 -157027 -410714
12353 -410714 44707 38263 267186 68309 -20511 354661 164246 -54443 -36179 7095 148781
12342 148781 -68330 51395 167253 350902 -103462 136862 115721 129173 -44985 293643
12331 231928 127795 483960 -202374 187071 15968 140658 27132 160924 316583 -61940
12320 199678 32705 461722 283574 148861 132904 365016 315875 229845 178326 186569 -51829
12308 190355 48343 435246 125133 -145602 73422 -13242 -265433 82959 151364 232915 2470
12296b59315a01173m6082B05768o6568L1127J22742a00548D45822E3496R9520
12286A53016m4128l0792a47328e7067J2100C50915L752K4133j06925M3017i4722
12274G3040f3270G2145H430g6065D77361B27921k7304o4069l9076L26K69774A80830
12261A67377J13488a35355A14007K5664k0212f7043A5540K37103b2663I0754h5529
12249a71620a4890C297R1822K03727I4272i6000j10367A22018b17422A83296j0994
12238A72302b3361F69978B44543J0054a91220g9920Q555L3654A7592f1434K7375
12227c4059A17155J64729C3489L8508o822K94143o601q7536k7709r9605Q5592
12216B23459P5461P0219o8771J8909A23230e6183D9951c22894B03878J18916e0762
$$ plain form
12296 -259315 -101173 -147255 205768 139200 170327 293069 -100548 445822 53496 153016
12286 153016 108888 78096 -147328 -57067 -44967 350915 354667 378800 271875 314892 -94722
12274 73040 -63270 72145 8430 -76065 477361 227921 200617 136548 97472 97798 367572 180830
12261 167377 280865 -135355 114007 139671 119459 -67043 15540 252643 -22663 90754 -85529
12249 -171620 -14890 3297 95119 298846 94272 -96000 -206367 122018 -217422 183296 172302
12238 172302 -23361 669978 244543 254597 -191220 -79920 -71365 -37711 17592 -61434 -34059
12227 -34059 117155 281884 33489 71997 65175 359318 352717 265181 237472 137867 223459
12216 223459 298920 369139 300368 319277 123230 -56183 49951 -322894 203878 322794 -50762
12204G3252L6669c0726O079m6814E88141k84648J0749C8408J89884L45362j36130
12193D37524A66492P8218J12437N7073A45093m4711Q7478b1142C27030L3998j33218
12182B27810J14483b71740D54736k05747R2699D7033J24822b9595F8348L61784
12172D30132F5388j2435L14287C4454a10354D92925A50593J0527J57327J64910
12162D83357A53648N7701P8352Q1994b6600B0943K24360b4990E2873L6383K25833
12151C15089B5732Q2792b91433E44978A63616l7855a37487A37961J12743J49327
12141D00031E6047M7603B9638J24963E1475J23463J54154j8442n2213a26149D9654
12129I595J69662i854A51910o9209J74288f8693G4126L10962j13427i8817I1508
$$ plain form
12204 73252 109921 -30726 -24647 -71461 588141 303493 314242 38408 228292 573654 437524
12193 437524 166492 244710 357147 414220 145093 100382 187860 -21142 327030 361028 227810
12182 227810 342293 -271740 454736 248989 341688 47033 171855 -29595 68348 430132
12172 430132 65388 52953 367240 34454 -110354 492925 150593 161120 318447 483357
12162 483357 153648 211349 289701 371695 -26600 20943 245303 -24990 52873 89256 315089
12151 315089 25732 108524 -291433 544978 163616 125761 -137487 137961 250704 400031
12141 400031 56047 103650 29638 154601 51475 174938 329092 310650 258437 -126149 49654
12129 9595 179257 -9854 151910 82701 256989 -68693 74126 385088 271661 -98817 91508
12117D58569a99691A31708k3958n0868R8134m6677K81410m1669j110j27143d7208
12105a63746A62865o7400K46458F2957A5147a5147j3723C07277a22941j91307
12095c14248J9872g2299K8987A82457p9677K7843m7753K65495A52016b92672A0024
12083A14332j1344K22056j34296J32507j40059L9651J08287j00469M20974c4986
12072A80182F4032M1542A1817a7644B93654d9844A46189J0720e6944A10523g4178
12060A22166B4861b04067A72243K6824c9824l236H4464M24303A08623b0862r2441
12049a13303N2590C4888a37689A22098j2039E3369J44257O2573f9436C6643a18951
12037C18382G3617c15362H6193a74599O9788b6246H9402K31588J86155A52206
$$ plain form
12117 458569 -199691 131708 107750 56882 155016 108339 389749 348080 346970 219827 -47208
12105 -163746 162865 95465 341923 62957 15147 -15147 -28870 307277 -122941 -314248
12095 -314248 -294376 -72299 -43312 182457 102780 130623 82870 348365 152016 -292672 10024
12083 114332 102988 325044 190748 323255 183196 222847 331134 230665 651639 -34986
12072 180182 64032 105574 11817 -17644 293654 -49844 146189 156909 -56944 110523 -74178
12060 122166 24861 -204067 172243 199067 -39824 -43060 84464 508767 108623 -20862 -113303
12049 -113303 -60713 34888 -137689 122098 110059 53369 197626 260199 -69436 36643 -118951
12037 318382 73617 -315362 86193 -174599 -104811 -26246 89402 320990 507145 152206
12026C29646j05685q7244a69954Q250A2694i1764B45616I6277L1842Q5272n9878
12015A53513b6497l1510E7276f1306A72926D0496a26085C92146H5839j371M7695
12004A32163g5339A4075a01268k81042a31011A9347J94778a82301B32913o8148
11994A64765A8727L21912a50607K7990d7628o6214j81358h6528r9832A06383K20842
11983C27225a136B1594J23159h7334l0093A52189a53956b3856m2567B52497J33164
11972C85661A16594B905b22911L0489B19927c6601k30338e6166l7277C2671K84507
11961C17178A38433i3407A09154a61840c2343A45047a89987a0320H1784b90705
11950a41846J7989A61602n4211c7524j5404l5661A72836J06815a1090p2295K0260
$$ plain form
12026 329646 223961 136717 -169954 -161704 12694 -91764 245616 96277 128119 213391 153513
12015 153513 -26497 -58007 57276 -61306 172926 40496 -126085 392146 85839 84468 132163
12004 132163 -75339 14075 -101268 -382310 -131011 19347 214125 -182301 232913 164765
11994 164765 18727 340639 -150607 -122617 -47628 -113842 -295200 -86528 -186360 106383 327225
11983 327225 -1136 21594 144753 -87334 -117427 152189 -153956 -23856 -66423 252497 385661
11972 385661 116594 2905 -222911 -192422 219927 -36601 -266939 -56166 -93443 32671 317178
11961 317178 138433 -93407 109154 -161840 -32343 145047 -189987 -10320 81784 -290705
11950 -141846 -123857 161602 107391 -37524 -52928 -88589 172836 279651 -11090 -83385 -63125
11939f3125G9979N9981k8637a2279B94618j18209J49190e9420D1887P4948b23992
11927A60067F9997K90364a19667r718A50955f4479j22203j55199G8861J14472
11917A93333a6837A74318I883a79277g7789C54123c48660a12616I8471R1231b3021
11905C6805b29250h734k13406A39207a51149a1079A32799a63609E0580K16373
11895B66953a38659H5124Q8137D1118c6014C10343q0770D1917J89520a70069c2569
11883a45896C04678B0147P6560C7948a49670O0976G5815a3333A4206M0766k0736
11872C4236f6311a4921A08864a61354C6345b95718a0555B83108d0206m1856g614
11860B51476f9512p3509j9853E6366h6357j16052E315b36399l96148e3503o7616
$$ plain form
11939 -63125 79979 139960 111323 -12279 294618 176409 325599 -59420 41887 116835 -223992
11927 160067 69997 360361 -119667 -129385 150955 -64479 -186682 -341881 78861 193333
11917 193333 -16837 174318 9883 -179277 -77789 354123 -348660 -112616 98471 189702 -23021
11905 36805 -229250 -8734 -222140 139207 -151149 -11079 132799 -163609 50580 266953
11895 266953 -138659 85124 173261 41118 -36014 310343 229573 41917 231437 -170069 -32569
11883 -145896 304678 20147 96707 37948 -149670 -88694 75815 -13333 14206 54972 34236
11872 34236 -66311 -14921 108864 -161354 36345 -295718 -10555 283108 -40206 -82062 -7614
11860 251476 -69512 -143021 -162874 56366 -86357 -202409 5315 -236399 -632547 -53503 -121119
11849a21119L1227j75049B56102b60844L7122E4616h7627B70385A01712c9616
11838b9229A19250n0652H174b9612j40867A33783J8693a91980h1086j14843i7891
11826a24952j9828G2757L8829K6001B9078a64815B38020c14395C03437I0241M296
11815I4537J1243B7659d45810h5029q2775c283B1080a9647j37641o8562A94956
11803B62538b72406H3007a79540q3786m8248G1589a67377e5267Q441C11380d5693
11791E2660f9586C16637b8046k44030C1868J21722c87574J41394A7946J90448
11781B08394b25321k3721B14624d9649B12296j04268O9675d29227K06596e293
11770A76464f4651G6754h450C951a95821H1936l08A5142c55770A13978c4035k35756
$$ plain form
11849 -121119 -89892 -264941 256102 -260844 -223722 54616 -87627 270385 101712 -39616
11838 -29229 119250 68598 8174 -29612 -170479 133783 152476 -191980 -81086 -195929 -97891
11826 -124952 -144780 72757 111586 137587 29078 -164815 238020 -314395 303437 90241 94537
11815 94537 105780 27659 -445810 -85029 -167804 -3283 21080 -19647 -157288 -225850 194956
11803 262538 -272406 83007 -179540 -263326 -311574 71589 -167377 -55267 -46826 311380 -45693
11791 52660 -69586 316637 -28046 -272076 31868 153590 -387574 -246180 17946 208394
11781 208394 -225321 -249042 214624 -49649 212296 108028 177703 -429227 -222631 -5293
11770 176464 -64651 76754 -8450 3951 -195821 81936 81628 15142 -355770 113978 -34035 -269791
11758b69791j51579a31844B17968K58488a24654p8900D7898d7810E9677B7113
11747b24932M8119L3854A334h1495B76901b7358j15987E21630F8053a96079M8976
11736a47103k24698C85914a5101k30577B87572d7414A5764a44570c3564d126G5207
11724a61381A97304F7608K09625D1628I393a75861Q6876A15361K36791A22481
11713H19b5357A53846j7512J94144Q7196g1861B5733R3793a99392R8090J9920
11702h1382d0527n7594B67959E871J25995K77065h3792A32100K88563B02768a91361
11690a01377B48728a55396B53470a84510C24242A45242J13261I1614J56680h3051
11679i5906o7439b1760A7985J62152m6559i5650q8766B22494g8042n0500d2972
$$ plain form
11758 -269791 -421370 -131844 217968 476456 -124654 -203554 47898 -47810 59677 27113
11747 -224932 -176813 -142959 1334 -81495 276901 -27358 -143345 521630 68053 -196079 -147103
11736 -147103 -371801 385914 -15101 -245678 287572 -47414 15764 -144570 -33564 -4126 75207
11724 -161381 197304 67608 277233 41628 9393 -175861 -88985 115361 352152 122481
11713 819 -25357 153846 136334 330478 417674 -71861 25733 119526 -199392 -101302 -81382
11702 -81382 -40527 -98121 267959 5871 131866 408931 -83792 132100 420663 202768 -191361
11690 -101377 248728 -155396 253470 -184510 324242 145242 258503 91614 248294 -83051
11679 -95906 -163345 -21760 17985 180137 133578 -95650 -184416 222494 -78042 -128542 -42972
11667b02863N0780B51920K8585f6113D1366J75357a86772o6713A12032b5531A27049
11655C6505Q0522i9249o5342I2816e65070B54587f0923B41022a41934B00582a05034
11643c4378D49811k10017p7337m0458P9300n7990b09821A9994J86312a99307e1853
11631B33926d78580K24412c6396k7960j48795A29668a17250K6291F4863b58770
11620B14809b71606D6985B801R1043a30967N2776j18123D7105J74377D4697a43614
11608A84956a88437R3281A78243N5201c0550j59631A34035b73838A3249h3043
11597B9205L8123a50526C62620A7239g6626A68141d9515A00030N5936l3610N9049
11586A81405N3172a23281B21489n795M4688j7765b39712D3461j632J2244b28813
$$ plain form
11667 -202863 -152083 251920 280505 -66113 41366 216723 -186772 -253485 112032 -25531 127049
11655 36505 117027 -99249 -164591 92816 -565070 254587 -60923 241022 -141934 200582 -105034
11643 -34378 449811 239794 162457 121999 201299 143309 -209821 19994 206306 -199307 -51853
11631 233926 -478580 -254168 -36396 -64356 -213151 129668 -117250 -90959 64863 -258770
11620 214809 -271606 46985 2801 93844 -130967 -78191 -196314 47105 221482 44697 -143614
11608 184956 -188437 -95156 178243 233444 -30550 -190181 134035 -273838 13249 -83043
11597 29205 67328 -150526 362620 17239 -76626 168141 -49515 100030 155966 122356 181405
11586 181405 234577 -123281 221489 215694 260382 242617 -239712 43461 41829 54073 -228813
11574C3163P286a12028B5632J07184A8302b57327R4388C01911a91112B61470n1024
11563B10446p5465J58088c9470A66389l2272K57748A03097K35874E0646P3P5952
11552A26671A5422J28748m2735a04852A23259q40B5420K59262p8479J70153c5780
11540B4405K35110p8466J36148A04890l749D7670J40730r1587K7789B037a07961
11528D22221j01702p1583A8659K06092D9113J55788K26961A19900Q3487h4632
11517B81522c7353n7300r9213A29422J21888b93072J29266d9617r9341A13682
11506f5986D6456N4643l9736k6352K28430j21064Q5673A4408R3396b02095D4738
11494B2728J8211M3582c0509A86591F6624a53363O5715B91126e6728j22932A77313
$$ plain form
11574 33163 40449 -112028 25632 132816 18302 -257327 -162939 301911 -191112 261470 210446
11563 210446 134981 293069 -39470 166389 134117 391865 103097 338971 50646 50719 126671
11552 126671 15422 144170 101435 -104852 123259 122419 25420 284682 206203 376356 -35780
11540 24405 259515 181049 317197 104890 101141 47670 188400 96813 124602 2037 -107961
11528 422221 320519 248936 18659 224751 49113 204901 431862 119900 203387 -84632
11517 281522 -37353 -94653 -193866 129422 251310 -293072 -163806 -49617 -148958 113682
11506 -65986 46456 101099 61363 35011 263441 142377 228050 14408 107804 -202095 44738
11494 22728 40939 84521 -30509 186591 66624 -153363 -87648 291126 -56728 -179660 177313
11482a97216F1494a47480C36321f0018A25806J37155J38570h4686B85936d8658
11471F0956J09799L2724j1100K28142a79761A73715e4941D65927a65397G6979
11460i0674B38405O1520k4174F8606R0439K03440G7017M1291i2404A81128f9285
11448d5803d561A56614J49754j02196e5463B23555B4080e7508o9723E5579J69617
11437B25196a7234m9793j47114A21578K47383g4301a3615B52120n1801d1113A2346
11425B56720A3078J06790h1963k7907G4661b4885B57511o8763k469e8724p5926
11414a34650f0990B2148e4072L923j0356k44083i5110A63778a93268r8902R0148
11403b02022b5514B09665E1244e4474C16421a68000C39302b17774P5864d5494
$$ plain form
11482 -197216 61494 -147480 336321 -60018 125806 262961 401531 -84686 285936 -48658
11471 60956 170755 203479 192379 420521 -179761 173715 -54941 465927 -165397 76979
11460 -90674 238405 299925 275751 68606 159045 362485 77017 118308 -92404 181128 -69285
11448 -45803 -4561 156614 306368 204172 -55463 223555 24080 -57508 -127231 55579 225196
11437 225196 -17234 -67027 -214141 121578 368961 -74301 -13615 252120 200319 -41113 12346
11425 256720 13078 119868 -81963 -109870 74661 -24885 257511 188748 186279 -58724 -134650
11414 -134650 -60990 22148 -54072 -50149 -60505 -304588 -95110 163778 -193268 -292170 -202022
11403 -202022 -25514 209665 51244 -54474 316421 -168000 339302 -217774 -141910 -45494
11392f7399D2853b83546A1697J26234a60563A44742G2314R815Q0402m1963b02748
11380G9353J20577H515K46115a4512I6258b29249B91684Q3941o9970I632c49072
11368E59a09805A07981i9135n6201A2602a5154I5225P388L20968c5011j74890
11357b09901A67780l3509l0095a46578A92970a89039B283g0664n6679a3493A98760
11345b34648H5973k5194K6666a70893m4617B40874A11447m7406P1710F3860i7458
11333b23870K8353j40352G2677a16439k5757N6867b2803j12013j62917c3874I0210
11321a09068h381j9119B32260E3567a14883A20054i5534A50629F4393a5057L147
11310a1910C25568a71284A788b03560h4972B4555f0713A52973J98266d03916h8477
$$ plain form
11392 -67399 42853 -283546 11697 137931 -160563 144742 72314 82129 162531 120568 -202748
11380 79353 199930 8515 254630 -14512 96258 -229249 291684 375625 305655 9632 -349072
11368 559 -109805 107981 -99135 -155336 12602 -15154 95225 102613 423581 -35011 -209901
11357 -209901 167780 134271 104176 -146578 192970 -189039 2283 -70664 -127343 -13493 198760
11345 -234648 85973 60779 87445 -170893 -215510 240874 111447 64041 135751 63860 -97458
11333 -223870 -195517 -335869 72677 -116439 -142196 -85329 -22803 -134816 -297733 -33874 90210
11321 -109068 -8381 -27500 232260 53567 -114883 120054 -95534 150629 64393 -15057 -11910
11310 -11910 325568 -171284 1788 -203560 -84972 24555 -60713 152973 351239 -403916 -88477
11298H2606a40867d9282H86J4126a04346k5725d5973l52598a597n9168C38440
11286b87960l9964b7572o7160B160h8259d3079A01987b48385F5652J9747c9374
11274G5506J46302b58642G0103N0519B1136J60196I406d1519A01893e6014k48825
11263c04839H6276c14501b4116A30146A1304K13279i9701j47280D32002d82800
11252b8903p231k4070H9321c30111G9783f4551l0706b7868a2109m6854K5468B7190
11239d91661f1099j35298H818a09331d1020j05795d1416j43923D4243A0175a66154
11227i7173A98963i4653n4388p2111p2175a26367n923A54703B2569P2996a70791
11215a15635G1769c1290J2837E1632a80614P8532j85372B7928i7451B84243a65737
$$ plain form
11298 82606 -140867 -49282 886 15012 -104346 -130071 -45973 -398571 -1597 -60765 338440
11286 -287960 -327924 -27572 -94732 2160 -88259 -43079 101987 -248385 65652 85399 -39374
11274 75506 221808 -258642 70103 120622 21136 181332 9406 -41519 101893 -56014 -304839
11263 -304839 86276 -314501 -24116 130146 11304 224583 -99701 -246981 432002 -482800
11252 -28903 -36134 -60204 89321 -330111 79783 -64551 -95257 -27868 -12109 -58963 -33495 27190
11239 -491661 -61099 -196397 8818 -109331 -41020 -146815 -41416 -185339 44243 10175 -166154
11227 -97173 198963 -94653 -149041 -221152 -293327 -126367 -132290 154703 22569 95565 -170791
11215 -115635 71769 -31290 -18453 51632 -180614 -102082 -287454 27928 -97451 284243 -165737
11203i8278q5832d9420k5060K7670o5044A78319c9631q9496j8230A4629a30594
11191B35637a14198B30261a3374k98529D9500J6859M4125B1368J88341r2006A4114
11179B2735a97041a3695k89934C60929A8430m765L25558n7013a05798o646A45440
11167A59220b3012A3766b805j18726a9213o9527l4553D2247a70602O9845B40425
11155C70631A8425b1301I5555l2281a58638g6911n6021B86513d19508f0277C22556
11143a55224d2557j67257j6131E2451a35655A65679k7979g2667A24620a72620
11132C7446d0344p1770A05190B1342R1239f5319c2542C02333a71636f2807A26097
11120I5794b03762F2449j3963b2609F6570c3696j72865O6648G6935b72926A37722
$$ plain form
11203 -98278 -184110 -49420 -74480 -46810 -111854 178319 -39631 -129127 -147357 14629 -130594
11191 235637 -114198 230261 -13374 -311903 49500 66359 110484 21368 209709 117703 14114
11179 22735 -197041 -13695 -303629 360929 18430 13665 339223 282210 -105798 -112444 145440
11167 159220 -23012 13766 -2805 -121531 -19213 -88740 -123293 42247 -170602 -100757 240425
11155 370631 18425 -21301 95555 63274 -158638 -76911 -132932 286513 -419508 -60277 322556
11143 -155224 -42557 -209814 -225945 52451 -135655 165679 137700 -72667 124620 -172620
11132 37446 -40344 -112114 105190 21342 112581 -65319 -32542 302333 -171636 -62807 126097
11120 95794 -203762 62449 48486 -22609 66570 -33696 -206561 -139913 76935 -272926 137722
11108A62225a03101i400p2168j31211B92962J11096A03578a0430A16968J133J20260
11097B38361D6738L59491A22987J60822m9127a59100c8019A95013q5373J61410
11087B71050c2317B84329E9004J32164L52398k64653L34215k41592N0012e9824
11076B44074J7086B48J93427J19925a04552B24666K96356L195j16977Q8901k05116
11065B91025K67023J28585l24371j13931N52936l12575O3706J79550k58502L362
11055D76808K77210j16225l02989L37268J25125r1536j45728L86482C23832L91535
11045G15367q2948B48635M78992L8207J31930n8095j99398p7430J63935m4059
11035F82717k18372K75227k97367N11678K10782l22975k90109J1261J7693n5809
$$ plain form
11108 162225 -103101 -9400 -81568 -212779 292962 404058 103578 -10430 116968 118101 238361
11097 238361 46738 406229 122987 283809 234682 -159100 -38019 195013 109640 271050
11087 271050 -32317 284329 59004 191168 543566 278913 613128 371536 421548 -59824
11076 244074 261160 248 193675 313600 -104552 224666 521022 524217 407240 496141 291025
11065 291025 558048 686633 362262 248331 801267 488692 552398 731948 473446 476808
11055 476808 754018 637793 334804 672072 797197 705661 559933 946415 323832 715367
11045 715367 632419 248635 727627 765834 897764 839669 640271 562841 726776 682717
11035 682717 464345 739572 442205 953883 1164665 841690 551581 562842 580535 524726
11025E24726N522N09985D20412M44807D27593j30870K27894O7687j49057J90879
11015F34126k09891L56664j55691P1038k60014K08739J0851J20334k54707o1148
11005D60301K49016J1698l27672M31971j81451J41301C38549J65444J61225k61977
10995D03241J94620M23382k80141K41484k14887N7111j52052j70240k7064K06504
10985F81958M4715K10835l75377L01512K92084J06186l38869l2574J07814R4236
10975A092520L9766N03610J60444K58827J36471J84429k7199L5205N25489l49999
10965B559563J4489k01814k6241o2379m84625k17960q850K12495k78387r7877
10955A408414J77458R9043q2137m9053J73299k27817j36916j07588k61018m27180
$$ plain form
11025 524726 530248 1040233 420412 865219 427593 296723 524617 592304 443247 634126
11015 634126 424235 780899 625208 696246 436232 644971 655822 776156 521449 460301
11005 460301 709317 721015 393343 825314 643863 785164 338549 503993 665218 403241
10995 403241 597861 1021243 741102 982586 767699 824810 672758 502518 475454 681958
10985 681958 726673 937508 562131 863643 1155727 1261913 923044 890470 998284 1092520
10975 1092520 1132286 1635896 1796340 2055167 2191638 2376067 2348868 2384073 2909562 2559563
10965 2559563 2574052 2372238 2345997 2283618 1798993 1581033 1572183 1784678 1506291 1408414
10955 1408414 1585872 1684915 1602778 1553725 1727024 1499207 1362291 1254703 993685 566505
10945E66505j23471M0003j09920j76526N8506k743i410C09331p064n1728b65459
10933A24243a25286k0737A72169K81879c1822A37749i570B38388j5684c65214
10922E2297i0002B80164j28329C2360c2346q0141B04558f8507H3391j313a30131
10910E0464J84815b89061J7193h8684A1522R315K54002E638a31016A14387b2152
10898D27600a14080B16369e6719l2935C1101a60495g3818k26502g4932j66986
10888b41918m029L8386A05295J0868a10269e1190H9877e05260A57637J1934C8454
10876C99221b2290L950C33898b26641C16845G488J23150f3680B68516F3048K51750
10865C14798B4673a65j65374j88635B03239e7897C3726a28641K5484B7249P3308
$$ plain form
10945 566505 443034 483037 373117 196591 255097 252354 -9410 309331 302267 250539 -265459
10933 124243 -125286 -146023 172169 454048 -31822 137749 -9570 238388 222704 -365214
10922 52297 -90002 280164 151835 32360 -32346 -112487 204558 -68507 83391 82078 -130131
10910 50464 235279 -289061 -271868 -88684 11522 20837 274839 5638 -131016 114387 -22152
10898 427600 -114080 216369 -56719 -89654 31101 -160495 -73818 -300320 -74932 -241918
10888 -241918 -245947 -207561 105295 116163 -110269 -51190 89877 -505260 157637 169571 38454
10876 399221 -22290 -18340 333898 -226641 316845 7488 130638 -63680 268516 63048 314798
10865 314798 24673 -165 -165539 -354174 203239 -57897 33726 -128641 -103157 27249 100557
10854A00557o532b66481K7607o9472M0511b2023k90505B35503d3975j08793A51221
10842A35680a34875E5876b37626C5370K70360o197a44052m5867C19599A00267
10831a61128c3334o839H8770R1357n3214F2100c07731n7152J50024I8135a06504
10819c6540P97H5851a04995C1819J38765D4424a29623k6035f8868H851a21430
10807c05819i4335B37050b32571R2094B9649f4009q1437G9158f6325j0527k17493
10796b94345R74A95353l5079b5809B11289d8512q329E9218J79917M5752d3502
10784H460K17159j12117c14085B05818a14744p3617f2882G6350a79544O7384q2812
10773a94972j41158D27745a63144e5659A38777b7774m0902k05778A22706D4646
$$ plain form
10854 100557 94025 -266481 -238874 -308346 -267835 -22023 -312528 235503 -43975 -152768 151221
10842 135680 -134875 55876 -237626 35370 305730 299533 -144052 -189919 319599 100267
10831 -161128 -33334 -40173 88770 180127 126913 62100 -307731 -364883 -214859 98135 -106504
10819 -36540 -35743 85851 -104995 31819 170584 44424 -129623 -155658 -68868 8851 -121430
10807 -305819 -94335 237050 -232571 -140477 29649 -64009 -145446 79158 -66325 -76852 -294345
10796 -294345 -293371 195353 160274 -25809 211289 -48512 -56841 59218 239135 284887 -43502
10784 8460 225619 113502 -314085 205818 -114744 -188361 -62882 76350 -179544 -112160 -194972
10773 -194972 -336130 427745 -163144 -55659 138777 -27774 -68676 -274454 122706 44646
10762a7969K714p5258j41275A61965b97260b7559j31115K8342k8661B38153A14821
10750b00745a1268G8668b0877A32395n2636a46903a2119A96976A6657J26445C2503
10738a76034B97510a82967M0377A00095a89987k56060K00201R6757B327J17740
10728A20067K6530J79547a53860j8000d2232q7164H4993b34482a02748k6560L0118
10717i9190k4546E04115I5304i9929a8417m51277H1730d2940k0520k23976C33373
10705c08438A51202f9869c4744e409D9244a26289b5793j36865Q1287F2645M6946
10694A09591D979P7202Q9869c96681M0655J64813D6120K14334a26920k71677B35834
10682a8967l19280h4267m3995A86481a84394B64696a58588j11084J10626B41869
$$ plain form
10762 -17969 -15255 -90513 -231788 161965 -297260 -27559 -158674 -130332 -158993 238153 114821
10750 -200745 -11268 78668 -20877 132395 79759 -146903 -12119 196976 16657 143102 32503
10738 -176034 297510 -182967 -142590 100095 -189987 -446047 -245846 -149089 2327 120067
10728 120067 146597 326144 -153860 -171860 -42232 -129396 84993 -234482 -102748 -129308 -99190
10717 -99190 -123736 504115 95304 -99929 -18417 -469694 81730 -42940 -63460 -287436 333373
10705 -308438 151202 -69869 -34744 -5409 49244 -126289 -25793 -162658 -81371 62645 109591
10694 109591 4979 82181 172050 -396681 -356026 -191213 46120 260454 -126920 -398597 235834
10682 -18967 -338247 -84267 -128262 186481 -184394 264696 -158588 -269672 -159046 241869
10671B16487e194l33601L789J28628I1836a51308N2865B17797g7575J9670j64693
10660b22598M548A9696J06293K3496b05458N1238c3089j27059k23408a18607k6422
10649a45029A49526A9145L4690b58517N5598C34089c6579A13750a14693d980p4731
10638g9711c6452A41762b05736k883B99793F38a29514m1425D5656N5504c3944
10626d7959j86598K4277Q3843o8737k161B2674g5948j20242O3125n0355B04302
10614B05791a0485A34161J32460a70814A63177b45472e7254E19174f2830j0923
10604g3753j0804j70550D1834d24561a32541o2608j93827a38243N5073j48007
10594b31177a01697j05087A91779a65249J3642e1601j00336k27317i815k01132
$$ plain form
10671 216487 -5194 -338795 -335006 -206378 91836 -151308 -98443 217797 -77575 -57905 -222598
10660 -222598 -218050 19696 125989 149485 -205458 -154220 -33089 -160148 -383556 -118607 -145029
10649 -145029 149526 19145 53835 -258517 -202919 334089 -36579 113750 -114693 -4980 -79711
10638 -79711 -36452 141762 -205736 -208619 299793 638 -129514 -170939 45656 101160 -33944
10626 -47959 -234557 -210280 -126437 -195174 -197335 22674 -75948 -196190 -133065 -183420 204302
10614 205791 -10485 134161 266621 -170814 163177 -245472 -57254 519174 -62830 -73753
10604 -73753 -84557 -255107 41834 -424561 -132541 -195149 -388976 -138243 -83170 -231177
10594 -231177 -101697 -206784 191779 -165249 -151607 -51601 -151937 -379254 -9815 -210947
10584b10947G947J46839E0642c13581C1001a14196E6490c01327P5821g2982k22896
10573b95878g1140c0167j44924O4013j67216G9558K52958a9824A8735d4517C14108
10561c8054p2683L639J1106B23999c0273A04593f5231k01054g1350j16768B31468
10549E2088a14383j02024a1922B67142c11801j02972h6033m2004B87447E4111
10538A86014H9591a28790B0776P0152L8a07461n5942j52790H755K5149d9862k39445
10526b89307c3101i314j13961N0860A74787D3042e09502a3976A60245b09691i0097
10514D8240b4999j96601A88273O9376j17845A9892m315c96806E7124a39012j05273
10503b44285B01327d57706b24182L9500R417H5864e8194B32860a25664F0604K66539
$$ plain form
10584 -210947 7947 154786 50642 -313581 31001 -114196 56490 -301327 -225506 -72982 -295878
10573 -295878 -71140 -30167 -175091 -111078 -278294 79558 332516 -19824 18735 -44517 314108
10561 -38054 -110737 -107098 -95992 223999 -30273 104593 -65231 -266285 -71350 -188118 231468
10549 52088 -114383 -216407 -11922 267142 -311801 -414773 -86033 -128037 287447 54111
10538 186014 89591 -128790 20776 90928 90966 -107461 -163403 -316193 8755 33904 -49862 -289307
10526 -289307 -33101 -9314 -123275 -72415 174787 43042 -509502 -13976 160245 -209691 -90097
10514 48240 -24999 -221600 188273 257649 139804 19892 15577 -396806 57124 -139012 -244285
10503 -244285 201327 -457706 -224182 -184682 -175265 85864 -58194 232860 -125664 60604 327143
10492C27143j33840N3909b62588h2448m9695H8239c48073J09401F7696K00767
10482B68463a13548j4285C85039m7042a520B10420J96238K94722B59174M96357
10472G55531k52736A93434a16223A84095L07535B05683C9118O669K7551a01488
10461B14049b50768g7979k12351B73626b7930j62038A44317c87434i5147k43608
10451c38755a59462D1080b14984C3867e372j49576J2031p8195k9280N7655e3730
10439A99989j9670c09181B3397b6542j46916B89781a69131A20288b22994L6189
10429a86805O7808I8275b38865A67852a29403A0979J66643b75217A58706a16266
10418e3588I2783d65349a93323m7337M852f9474c3141j16293e4605k65420A58416
$$ plain form
10492 327143 193303 247212 -262588 -82448 -132143 88239 -348073 -238672 67696 268463
10482 268463 -113548 -127833 385039 337997 -1520 210420 406658 701380 259174 755531
10472 755531 502795 193434 -116223 184095 491630 205683 39118 45787 73338 -101488
10461 214049 -250768 -77979 -290330 273626 -27930 -189968 144317 -387434 -95147 -338755
10451 -338755 -159462 41080 -214984 33867 -5372 -154948 -142917 -221112 -250392 -192737 -53730
10439 199989 180319 -309181 23397 -26542 -173458 289781 -169131 120288 -222994 -186805
10429 -186805 -118997 98275 -238865 167852 -129403 10979 177622 -275217 158706 -116266
10418 -53588 92783 -465349 -193323 -240660 -235808 -69474 -33141 -149434 -54605 -320025 158416
10406a00550B9313b23887m0282a13028j7248e2411K553k95472C3738d5636A23426
10394A166h10B42667a5375m92520C24185m8512c6303A26207m5951M0928r915f764
10381B64253E8383J7614O2628J49324N9812m1211J47891b9721q2806B01990K7602
10370B29592C6815J32668J75687A44497K08165A08133L17457P5226A52974G5332
10359D09850J72296B61465d6885K377G3536c6413C28569l0583l1647K33047j7135
10348D82251n2870J81888B32044K3027O7264A56138K91756J03773j31102A99447
10337H9269J06846J87417J33128b57663a24068l6977g2825A21867J63960a03475
10326C24835k5586A15234H61M7145j257J02894a17818B66135l8098b23758A83658
$$ plain form
10406 -100550 29313 -223887 -264169 -113028 -130276 -52411 -49858 -345330 33738 -45636 123426
10394 1166 -810 242667 -15375 -507895 324185 275673 -36303 126207 80256 121184 111269 -6764
10381 264253 58383 75997 138625 287949 347761 306550 454441 -29721 -112527 201990 229592
10370 229592 36815 169483 345170 144497 352662 108133 425590 500816 152974 75332
10359 409850 582146 261465 -46885 -44508 73536 -36413 328569 297986 266339 499386 482251
10348 482251 429381 611269 232044 255071 322335 156138 447894 551667 420565 199447
10337 89269 196115 383532 516660 -257663 -124068 -161045 -72825 121867 285827 -103475
10326 324835 299249 115234 861 48006 46749 149643 -117818 266135 228037 -223758 183658
10314G4566K93368j46171O1822D2627f2347k7954J2783F2859K0010R6006L81947
10303E60822k70982b04507G3434b02461B03635F7161a03092C0408b12869j52105
10293c64974A18525a22763I4934b9336C45169A15796e7202A51271b2679A6022
10282E3396a76835A10686J02951d5627A11255b53917J23013D5220a36773K5385
10272a11388j65506B0611a55871A3707a7462F7221b46753G9039E347g7005p2524
10261a49529j00175K5782A66985b00804E9616f3376q0055B851K65668N4693G6606
10249d9421A80821j1242B3179a81989C8288a48123O8747B38261B5394P713J5129
10238D8236a834k8187k5804i835j38762o6308i5406j04426A25994b69609Q5455
$$ plain form
10314 74566 367934 221763 283585 42627 -62347 -90301 -77518 62859 82869 178875 560822
10303 560822 289840 -204507 73434 -202461 203635 67161 -103092 30408 -212869 -364974
10293 -364974 118525 -122763 94934 -29336 345169 115796 -57202 151271 -22679 16022
10282 53396 -176835 110686 213637 -45627 111255 -253917 -130904 45220 -136773 -111388
10272 -111388 -276894 20611 -155871 13707 -17462 67221 -246753 79039 5347 -77005 -149529
10261 -149529 -249704 -223922 166985 -200804 59616 -63376 -143431 2851 268519 323212 76606
10249 -49421 180821 169579 23179 -181989 38288 -148123 -79376 238261 25394 33107 48236
10238 48236 -1834 -30021 -55825 -9835 -148597 -214905 -95406 -199832 125994 -269609 -184154
10227a84154a3381B37900a6290j07507r2603B3835g7937C6109f2323m061j01204
10216a67588c5331m435B58701a33636q9815n1431N4342c6257k37911K2549G6519
10204C3260d9229P279k58207R3819A70316d09881b9364A2036e4930k27362J23128
10193a59164q619N6992A44132P3296a41982A16814a50938j3657C428c44999D4056
10181b05180j90187a29894k59756A25995d04561I294c56203B0988E980a15797
10170a49102D2105a44857H2214a61489I7182i8519k8716j2562m0261q3449c5079
10158f3722o2695k17484a26935j17526N7148B63151f3609j62309E9511d05699
10147b1016j20711H6242J05826b3407G3336Q3017c05954a26381a2650l69070B45635
$$ plain form
10227 -184154 -13381 237900 -16290 -123797 -216400 23835 -77937 36109 -62323 -66384 -167588
10216 -167588 -35331 -39766 258701 -133636 -223451 -274882 -220540 -36257 -274168 -251619 76519
10204 33260 -49229 -41950 -300157 -206338 170316 -409881 -29364 12036 -54930 -282292 -159164
10193 -159164 -167783 -110791 144132 217428 -141982 116814 -150938 -164595 3428 -344999 44056
10181 -205180 -395367 -129894 -389650 125995 -404561 9294 -356203 20988 5980 -115797
10170 -149102 42105 -144857 82214 -161489 97182 -98519 -127235 -139797 -180058 -263507 -35079
10158 -63722 -126417 -343901 -126935 -244461 -187313 263151 -63609 -225918 59511 -405699
10147 -21016 -141727 86242 192068 -23407 73336 156353 -305954 -126381 -12650 -381720 245635
10135D30442A38771b02098J00843b5348k51678C1894M2552J75385b30243h4033
10124c22895A14898a0441j29918A84882a29795j00928f1950B86779H5303a13540
10113a77769B22245A5003a69331A49642g2425F0414M982J050O0266a2209I0012
10101a479A41223Q1580a3378D6141K4843f9781j09438b1820L526B76492a12789
10089b47600K9695A96299F9819a42481j8961A19534f7292m8014c2709n072p5161
10078a12942H0948J96761a67373j24505L2002f1800j21817A74785f2854a668A42511
10066e2566J9279A633c46101A74321a27432J2497N4646C1547a93402I5966c33456
10054i0900j41650P0124j10250C2045Q90J96472i4457p4964C23827d7502A06077
$$ plain form
10135 430442 138771 -202098 -101255 -25348 -277026 31894 74446 249831 -230243 -84033
10124 -322895 114898 -10441 -140359 184882 -129795 -230723 -61950 286779 85303 -113540
10113 -177769 222245 15003 -169331 149642 -72425 60414 65396 66446 126712 -12209 90012
10101 -1479 141223 222803 -13378 46141 70984 -69781 -179219 -21820 -18294 276492 -112789
10089 -247600 -217905 196299 69819 -142481 -161442 119534 -67292 -115306 -32709 -37781 -112942
10078 -112942 80948 277709 -167373 -291878 -259876 -61800 -183617 174785 -62854 -1668 142511
10066 -52566 -33287 1633 -346101 174321 -127432 -114935 -60289 31547 -193402 95966 -333456
10054 -90900 -232550 -162426 -272676 32045 32935 229407 -94457 -169421 323827 -47502 106077
10042A74457e6A47910a17729L1180L3914A7071d38647a60768K9931E4215A4155
10030b19628f5392C5280e0144H0148b2623k26386j22218f8251K028H4169B713
10018a27242m16262B18856a25653j52496I2435a45623k10156a72739G0639c76003
10007i4040E9231b11936b5706a160k60379A67326N6890C7550l989a1717G0580
9995b02866F0994d47674M6497A08776i8772B2288J6462b51184B39643B1056J07154
9984A28210E981b12656N2995I4659b4065j09553A20981K7023a3449k8474I7857
9972d73568j07615a89076A50773R9467d7073q5181j8041E3018j7524c78485d9974
9960c23252f0931j46647P8581F9357c01475D2247J73920a99654k0849E9548a51949
$$ plain form
10042 174457 -56 147910 -117729 -86549 -52635 17071 -438647 -160768 -130837 54215 14155
10030 -219628 -65392 35280 -50144 80148 -22623 -249009 -371227 -68251 -66223 84169 2713
10018 -127242 -543504 218856 -125653 -278149 92435 -145623 -355779 -172739 70639 -376003
10007 -94040 59231 -211936 -25706 -1160 -261539 167326 224216 37550 33561 -11717 70580
9995 -202866 60994 -447674 -401177 108776 -98772 22288 38750 -251184 239643 21056 128210
9984 128210 5981 -212656 -159661 94659 -24065 -133618 120981 148004 -13449 -41923 97857
9972 -473568 -581183 -189076 150773 250240 -47073 -132254 -150295 53018 35494 -378485 -49974
9960 -323252 -60931 -207578 -128997 69357 -301475 42247 216167 -199654 -220503 59548 -151949
9948c91093A35233J7721a64675J5803H3262f3192F6649g2349A62796A0691K4138
9937C4829c28155a25941A45320B9885c08220A0761J29805b5111k16022f1572c801
9925a94986d9869j37078B6682h1456c1885k04475L7026l7918k8911e8759A92344
9913A3126d24497a07715A08966c6967A57911I938c5094j58286A16128b20615A48200
9901c8744A08635N7251a29824a6674j25705D26552a9615H8779a98415j39982B33139
9889B16064A749b63460J15846q2483E8606a53530e4980C6758e40000E3311i8532
9877b04266L080D2645J66678a22632H9946b22148A22508e19509h051l60993f8318
9865A51436b27723A57271i9100A34261a1752l81867h3822c9211n2375A8948a09517
$$ plain form
9948 -391093 135233 152954 -164675 -148872 83262 -63192 66649 -72349 162796 10691 34829
9937 34829 -328155 -125941 145320 29885 -308220 10761 140566 -25111 -241133 -61572 -3801
9925 -194986 -49869 -186947 26682 -81456 -31885 -236360 -199334 -237252 -266163 -58759 192344
9913 13126 -424497 -107715 108966 -36967 157911 9938 -35094 -193380 116128 -220615 148200
9901 -38744 108635 165886 -129824 -16674 -142379 426552 -19615 88779 -198415 -338397 233139
9889 216064 1749 -263460 -147614 -230097 58606 -153530 -54980 36758 -540000 53311 -98532
9877 -204266 -201186 42645 209323 -122632 89946 -222148 122508 -519509 -8051 -369044 -68318
9865 151436 -227723 157271 -99100 134261 -11752 -393619 -83822 -39211 -91586 18948 -109517
9853a03623l32564b11577n9021J1821A11815j7289b04265B40853A0661b4268I8715
9841B34921E1363K1257a00462l801C23520a92928F586f7532k59248D9921c20186
9829a08180K6190j86762a08125A13558b96438f2662j5306O621A55362c5029C7722
9817c8257k00367F3183a188A2911i8166L1177D6347Q1998B8008a05158r175L9294
9805g5039o8051O215f4081h989A9977b20963i1649d4149D4838h0924q9855A408
9792G2334a36145B54183a71684g3593A23316b191A19172J08287b9787j78052B95410
9780B6154b00993A69153a64418h0839D6581R2728a23191B3417b62933m1227B2683
9768a53996o6092k99877J75493H9385R8826c960j18949H766i4364j52200p9017
$$ plain form
9853 -103623 -436187 -211577 -270598 -258777 111815 94526 -204265 240853 10661 -24268 98715
9841 234921 51363 72620 -100462 -104263 323520 -192928 6586 -67532 -326780 49921 -320186
9829 -108180 -81990 -268752 -108125 113558 -296438 -62662 -77968 -71347 155362 -35029 37722
9817 -38257 -238624 63183 -1188 12911 -98166 -66989 46347 128345 28008 -105158 -114333 -75039
9805 -75039 -143090 -136875 -64081 -8989 19977 -220963 -91649 -44149 44838 -80924 -170779 1408
9792 72334 -136145 254183 -171684 -73593 123316 -2191 119172 227459 -29787 -207839 295410
9780 26154 -200993 169153 -164418 -80839 46581 139309 -123191 23417 -262933 -304160 22683
9768 -153996 -220088 -519965 -344472 89385 188211 -3960 -122909 8766 -94364 -246564 -325581
9757c25581D6174P0257J02441I6601k0566a40044q1293j33015L5694A2003c35446
9745I2188J37798c79896F840J59115a57682A34367c27004a32341m3635E4946J7245
9734G2191Q1287a74206K4552e9905o0682C08245i3118a990l07038H0756c12236
9722c97240P8761B9955K31905H5285k9854a81573e5524k0146j2295G0207d6391
9710B3718h777j86660D5458e0444A05242a78352J309K26C8736b02395i7586d3113
9697b86053E5346c31214a7406j36120K3822B83512j32H5593c2185n0730A43787
9685e3314l23694J66596D2311b25355A58173K05510A08536j4253b89829a28585
9674A10751j9043k5272R065a3848A49827a49789A33400b38459g4575A25152h1625
$$ plain form
9757 -325581 46174 116431 218872 96601 76035 -140044 -221337 -354352 -318658 12003 -335446
9745 92188 229986 -379896 6840 165955 -157682 134367 -327004 -132341 -175976 54946 72191
9734 72191 153478 -174206 -149654 -59905 -120587 308245 -93118 -1990 -309028 80756 -312236
9722 -397240 -318479 29955 261860 85285 55431 -181573 -55524 -75670 -87965 70207 -46391
9710 23718 -8777 -195437 45458 -50444 105242 -178352 -177043 -176817 38736 -202395 -97586 -43113
9697 -286053 55346 -331214 -17406 -153526 -129704 283512 283380 85593 -32185 -82915 143787
9685 -53314 -377008 -210412 42311 -225355 158173 363683 108536 94283 -289829 -128585
9674 110751 91708 66436 75501 -13848 149827 -149789 133400 -238459 -74575 125152 -81625
9662b14726A15567b78077J3958L9810B4525c35746j00034F9621c049A45175h5035
9650a08112D6388d9653r9869F0673b9957k80849A66628a48805B31104B6002a65646
9638b74767A28336h2365m9401j85987a37530H834a57995g0726J9543j06782A96129
9626f9693k57719A17111a87825A2746a12209q8869h4702a4288A19243c43567J67078
9615a76489K9254g000j89915k37212a10084j43745n4571A14870D2345P308R2911
9604A42564c55266a40813K8404A34271o1796a94738K0943a6087l52602A77597
9593a13075j34728B2276B727O338J52881b33235R8518j89950B00949F3441j143
9582F2298b39073E849a41144l90211a07170j60093h204A05789a28359e9484j3446
$$ plain form
9662 -214726 115567 -278077 -264119 -224309 24525 -335746 -435780 69621 -3049 145175 -85035
9650 -108112 46388 -49653 -149522 60673 -29957 -310806 166628 -148805 231104 26002 -165646
9638 -274767 128336 -82365 -131766 -317753 -137530 8834 -157995 -70726 -51183 -157965 196129
9626 -69693 -327412 117111 -187825 12746 -112209 -201078 -84702 -14288 119243 -343567 -176489
9615 -176489 -147235 -7000 -196915 -434127 -110084 -253829 -308400 114870 42345 49653 142564
9604 142564 -355266 -140813 -112409 134271 72475 -194738 -173795 -16087 -368689 177597
9593 -113075 -247803 22276 2727 9065 161946 -233235 -134717 -324667 200949 63441 62298
9582 62298 -239073 5849 -141144 -531355 -107170 -267263 -8204 105789 -128359 -59484 -72930
9571g2930B03258p1943a73664j36559J44243G1634b28516A90777I1859b23443
9560b90119C1551a64260n268B36761b4062A08993N6652f0322A70639G6706h2416
9548d35138g8238F777J3193b2670B3922P4149g8185A566e7825f137q4351j85149
9536b75637K7689Q4314j65700L5967a106j0178B71235b46966B82433a30272j24140
9525b54412j1440r5410E7186N6333a68421A93339b6543C66484A8547a59585o3768
9514b23353J7508c131j89620k761j60016J32453A50947K5759e1150r7332j04823
9503b53305p7499B21305e1930B4355b90979I522J22163n8022e3826A06695g3652
9491a63565n3234j09995A01817J20558a37595A18692J03217j5111h5705B4819
$$ plain form
9571 -72930 203258 131315 -173664 -310223 -165980 71634 -228516 190777 91859 -223443
9560 -290119 31551 -164260 -169528 236761 -24062 108993 165645 -60322 170639 76706 -82416
9548 -435138 -78238 6777 19970 -22670 23922 98071 -78185 1566 -57825 -6137 -90488 -275637
9536 -275637 -247948 -163634 -329334 -293367 -1106 -11284 271235 -246966 282433 -130272 -254412
9525 -254412 -265852 -361262 57186 113519 -168421 193339 -26543 366484 18547 -159585 -223353
9514 -223353 -205845 -3131 -192751 -195512 -355528 -223075 150947 176706 -51150 -148482 -253305
9503 -253305 -330804 221305 -51930 24355 -290979 9522 131685 73663 -53826 106695 -73652
9491 -163565 -216799 -326794 101817 222375 -137595 118692 221909 206798 -85705 24819
9480a01993k04171A76963b01539j00701H668Q9492c64404h8026c0958j14238A00688
9468b44819B19846a88052e3135j23317B7603b39269B59374a29152M3579p4192
9458a59765b9132A51467b22612A43670b07506a3666E2568e0184j07108d0268k32415
9447b72683A07585a08109o7665C0763L0097e901E4033b53744A66865e4639B21604
9435C38131a39816l5729g5339r7190e3167A81586j6118b88412A64119b83076a12316
9423C8307J96388K03514a2703j35601E4138c53614a71846j40718g8079b5043A66277
9411A04350c03260k9493c8171m390l1178j01711k9910E1333d8620l16555c7342
9399a23631k05127j55370A78215a66048A13063a47847j72068h4168L9078o9908
$$ plain form
9480 -101993 -306164 176963 -201539 -302240 8668 98160 -364404 -88026 -30958 -145196 100688
9468 -244819 219846 -188052 -53135 -176452 27603 -239269 259374 -129152 -85573 -159765
9458 -159765 -29132 151467 -222612 143670 -207506 -13666 52568 -50184 -157292 -40268 -272683
9447 -272683 107585 -108109 -175774 30763 60860 -5901 54033 -253744 166865 -54639 221604
9435 338131 -139816 -175545 -75339 -172529 -53167 181586 165468 -288412 164119 -283076 -112316
9423 38307 234695 438209 -12703 -148304 54138 -353614 -171846 -312564 -78079 -25043 166277
9411 104350 -303260 -332753 -38171 -42561 -73739 -175450 -205360 51333 -48620 -365175 -37342
9399 -123631 -328758 -484128 178215 -166048 113063 -147847 -319915 -84168 -45090 -114998
9389a14998b4864j66621O0681A8818K20630g1779p0255N8064k54681c7555l4831
9378g2386k17210h3515n5599A17609a15511H9044c01538j58377A56074a66059
9367G0448e3559p212b7206k01538C7717m83b39835A85935h9286A41124E3541c53233
9354b2524l90061J43169g1900k16428E0868e2176k89448L0738A4098b51377d1551
9342B3005c9251J1983A33118K532b18592M7060I4834K06178a20316d4857j12156
9331a57013B19727E2546J62163I338a62N3o1116A38517a46853j94894E0825A3818
9318a82054m3852M2364K6367e3242a0014l59853a39115p5129b8314m6368E5070
9306a58429B13423E1615a08492j91927a24744e2057F0653b9494k88099a37921
$$ plain form
9389 -114998 -24864 -191485 -130804 18818 239448 -71779 -142034 -83970 -338651 -37555 -72386
9378 -72386 -289596 -83515 -139114 117609 -115511 89044 -301538 -459915 156074 -166059
9367 70448 -53559 -60771 -27206 -228744 37717 37234 -239835 185935 -89286 141124 53541 -353233
9354 -22524 -412585 -269416 -71900 -288328 50868 -52176 -341624 -310886 14098 -251377 -41551
9342 23005 -39251 -27268 133118 135650 -218592 -171532 94834 301012 -120316 -44857 -157013
9331 -157013 219727 52546 214709 9338 -162 -109 -61225 138517 -146853 -341747 50825 13818
9318 -182054 -225906 -183542 -157175 -53242 -10014 -369867 -139115 -214244 -28314 -74682 55070
9306 -158429 213423 51615 -108492 -300419 -124744 -52057 60653 -29494 -317593 -137921
9295a77815D6548d2827A0468J27155a25885m6569J3446G9357j8029a74664B1851
9283E6840l26k2017b06977C76816c52587A07064g8659m7771I425J12873c0688
9271b80862J27396k6196e0066j0826A74594b8362q6029P451H0166b36904j5407
9260b52311J21077j9821B17552c73477O9454J36033H3468d7629C4451F98b8445
9248a81478j6500A97350j130m9117a10499j18960j9235B0725P9292b93632I2358
9236i5278A29169b3251f419B08062h1185j34692A56774N6956B4547a57600f7869
9224F8964M0991M9477a4175E9630J87423c20963h2704k0930G7305e1640j50631
9213b02271j20414F4284b3356A22491K9745I048a7901j55472j07350a13738j171
$$ plain form
9295 -177815 46548 -42827 10468 137623 -125885 -172454 -159008 79357 61328 -174664 21851
9283 56840 56514 34497 -206977 376816 -352587 107064 -78659 -126430 9425 122298 -30688
9271 -280862 -153466 -179662 -50066 -60892 174594 -28362 -114391 -106940 80166 -236904 -252311
9260 -252311 -131234 -151055 217552 -373477 -304023 -167990 83468 -47629 34451 698 -28445
9248 -181478 -197978 197350 196220 147103 -110499 -229459 -248694 20725 100017 -293632 92358
9236 -95278 129169 -23251 -6419 208062 -81185 -215877 156774 213730 24547 -157600 -67869
9224 68964 109955 159432 -14175 59630 247053 -320963 -82704 -103634 77305 -51640 -202271
9213 -202271 -322685 64284 -23356 122491 152236 9048 -17901 -173373 -280723 -113738 -114909
9202a14909o7193k84979G4534a31931A33488I915a82399c7662j88510f1995k77665
9191c39660B6171b92342A47505b42324Q6105B6671a07422l53367A06876k7447
9181G9429b07361e4586j50297B10125h0620r3095O2124n8346B826c9780p5542
9170a15322A32654j3993C2266J21710a52647m8714A40056A3835a22162E8567k2937
9159C5630b22127d2824F1988b11904F3744b08490A575f6763D0535J9545a42396
9147I9947L0239J30981j18138B8673a14347L6809G360J18701L3387D8939b3569
9135A85997k0512b23847B34872a60601p1588a0044A79578a48493A98270a67397
9124a82770A98121K745h2252c2993E445J30177a93226E0008h6398A5542m295J23345
$$ plain form
9202 -114909 -182102 -467081 74534 -131931 133488 9915 -182399 -37662 -226172 -61995 -339660
9191 -339660 26171 -292342 147505 -242324 -156219 26671 -107422 -460789 106876 79429
9181 79429 -207361 -54586 -204883 210125 -80620 -173715 -111591 -169937 2826 -39780 -115322
9170 -115322 132654 118661 32266 153976 -152647 -201361 140056 13835 -122162 58567 35630
9159 35630 -222127 -42824 61988 -211904 63744 -208490 1575 -66763 40535 60080 -142396
9147 99947 130186 261167 143029 28673 -114347 -77538 7360 126061 159448 48939 -23569
9135 185997 165485 -223847 234872 -160601 -232189 -10044 179578 -148493 198270 -167397
9124 -182770 198121 200866 -82252 -32993 5445 135622 -193226 50008 -86398 15542 11247 134592
9112A34592c9386B3961L6366b86475g6174j12277C7947K8858a72674M5357H4167
9100g2341F368f5205f736H5179b41742I4164R0657c22785o1264j4685b5576k5135
9088e0711k30967g6773G5488a96425F3246J16493j8971J24065a3116A3793Q104
9077B1897i8672q2100O9517K1133j7956B83804d54908I0395L0424h6164J819j2130
9065i6475j65446N0888g5963o8319k0421n9118J11449B20685a21791R084d4041
9053c1247k20830E5433d43346a67719P6753l7307j19447f6609j88990A84999D7610
9041A59681K888K8515a80504A85269n1322a13394G5212c72216C04257a49174d1276
9029F3011f3349e104j29657A02620c7309j15108O7561k86911J05193a05099j61309
$$ plain form
9112 134592 -39386 23961 60327 -286475 -76174 -188451 37947 66805 -172674 -127317 84167
9100 -72341 6368 -65205 -6736 85179 -241742 94164 184821 -322785 -384049 -398734 -25576 -50711
9088 -50711 -281678 -76773 75488 -196425 63246 179739 160768 284833 -13116 13793 21897
9077 21897 -98672 -180772 -111255 -90122 -108078 283804 -454908 90395 120819 -86164 -84345 -96475
9065 -96475 -261921 -211033 -75963 -144282 -164703 -223821 -112372 220685 -121791 -112707 -44041
9053 -31247 -252077 55433 -443346 -167719 -90966 -128273 -247720 -66609 -255599 184999 47610
9041 159681 162569 191084 -180504 185269 133947 -113394 75212 -372216 304257 -149174 -41276
9029 63011 -63349 -5104 -134761 102620 -37309 -152417 -84856 -371767 -266574 -105099 -266408
9018b66408d5853B37304H252R3563a39220j93956b1803m9593j31649a7430F406
9006a11310K6555n32441a74297C1987a01551j18686q3214J22899A98579c08009
8995a7622l45546a62391Q0373j25126D3711j5821a14142N6742k67677D6579e2867
8983c5072j56573o4948o1839a12205j25371h478c688B12718R7195h3355L7733
8972d5622A27047A4765l150i7197b6069j52964k90150b3178H519b40723Q3566
8961a57157c107j61924j37850a41394e1895k25452M6745C8519a34719c6095r0933
8950a27028A35882a22459j85496j06669A42421L37904a72897E7727M3571C7542
8939b7275B35614a94619m4982a13555c976j33030a1764D18354A86092N4654b22849
$$ plain form
9018 -266408 -45853 237304 8252 101815 -139220 -333176 -21803 -71396 -203045 -17430 6406
9006 -111310 -84755 -617196 -174297 31987 -101551 -220237 -303451 -180552 198579 -308009
8995 -17622 -363168 -162391 -82018 -207144 43711 27890 -114142 -57400 -325077 46579 -52867
8983 -35072 -191645 -256593 -318432 -112205 -237576 -8478 -3688 212718 309913 -83355 -45622
8972 -45622 127047 14765 11615 -97197 -26069 -179033 -469183 -23178 8519 -240723 -157157
8961 -157157 -3107 -165031 -302881 -141394 -51895 -277347 -230602 38519 -134719 -36095 -127028
8950 -127028 135882 -122459 -307955 -414624 142421 480325 -172897 57727 101298 37542
8939 -27275 235614 -194619 -239601 -113555 -3976 -137006 -11764 418354 186092 240746 -222849
8927A21202K8612m4118g5986A87553L88503o003Q20287K662756J0178753D948908
8916A108713D01971l1760H3965J50340h5837E4355J25212n4024M1304a66661A15937
8904f5677A45908c39963J05725j22159C0901J34936G9441g7043B6001M4201a8861
8892b04072I6911f3350G2855f3733K0048o9905q1708B9514b4633n4461A50821
8880A4536L8200J19670a43669O8634j2826q4956M6912c3615A07583i2068r0135
8869a82203G7633a61928A03522j0599K9869a76558O6367B19243f2681j5350A89072
$$ plain form
8927 121202 149814 105696 -75986 187553 576056 570053 1390340 4053096 14231849 4948908
8916 1108713 401971 370211 83965 234305 -85837 54355 179567 125543 166847 -166661 115937
8904 -65677 145908 -339963 -234238 -356397 30901 165837 79441 -77043 26001 70202 -18861
8892 -204072 96911 -63350 72855 -63733 -43685 -113590 -195298 29514 -24633 -79094 150821
8880 14536 52736 172406 -143669 -75035 -87861 -172817 -125905 -33615 107583 -92068 -182203
8869 -182203 77633 -161928 103522 92923 122792 -176558 -110191 219243 -62681 -78031 189072
$$ [...]
##END NTUPLES=NMR SPECTRUM
##END=
