
##TITLE=AC1246_NTBAH12036_6609906_r3wGOhLs9a
##JCAMPDX= 6.0         $$ Bruker NMR JCAMP-DX V2.0
##DATA TYPE= NMR SPECTRUM
##DATA CLASS= NTUPLES
##ORIGIN= BRUKER
##OWNER= Administrator
$$ 1.72 TOPSPIN		Version 2.1
$$ 2012-08-01 22:59:27.890 -0500  Administrator@TOPSPIN
$$ Compression mode = diff/dup
##.OBSERVE FREQUENCY= 400.02188249412
##.OBSERVE NUCLEUS= ^1H
##.ACQUISITION MODE= SIMULTANEOUS (DQD)
##.ACQUISITION SCHEME= undefined
##.AVERAGES= 64
##.DIGITISER RES= 22
##SPECTROMETER/DATA SYSTEM= spect
##.PULSE SEQUENCE= noesygpps1d.comp
##.SOLVENT NAME= COFFEE_meoh
##.SHIFT REFERENCE= INTERNAL, COFFEE_meoh, 1, 14.96244
##AUDIT TRAIL= $$ (NUMBER, WHEN, WHO, WHERE, PROCESS, VERSION, WHAT)
$$ ##TITLE= Audit trail, TOPSPIN		Version 2.1
$$ ##JCAMPDX= 5.01
$$ ##ORIGIN= Bruker BioSpin GmbH
$$ ##OWNER= Administrator
$$ $$ C:\Bruker\TOPSPIN/data/COFFEE/nmr/AC1246_NTBAH12036_6609906_r3wGOhLs9a/12/pdata/1/auditp.txt
$$ ##AUDIT TRAIL=  $$ (NUMBER, WHEN, WHO, WHERE, PROCESS, VERSION, WHAT)
(   1,<2012-08-01 22:59:22.343 -0500>,<Administrator>,<TOPSPIN>,<go>,<TOPSPIN 2.1>,
      <created by zg
	started at 2012-08-01 22:47:52.093 -0500,
	POWCHK enabled, PULCHK disabled,
       configuration hash MD5:
       6B 1B 68 BB D9 2E 58 E2 7F 35 AD 54 07 DF 0E 41
       data hash MD5: 64K
       48 76 8A 79 44 1C 29 23 1E 6D 8A F3 02 33 38 0C>)
(   2,<2012-08-01 22:59:25.234 -0500>,<Administrator>,<TOPSPIN>,<proc1d>,<TOPSPIN 2.1>,
      <Start of raw data processing
       efp LB = 0.3 FT_mod = 6 PKNL = 1 PHC0 = 0 PHC1 = 0 SI = 128K 
       data hash MD5: 128K
       51 7A 15 22 8B 39 62 80 74 95 02 7E F9 3B 1A D7>)
(   3,<2012-08-01 22:59:26.453 -0500>,<Administrator>,<TOPSPIN>,<proc1d>,<TOPSPIN 2.1>,
      <pk PHC0 = 0.1098633 PHC1 = 0 
       data hash MD5: 128K
       F2 8C B1 C5 EB DA FA 2E 40 FD B3 CF A9 45 8A 59>)
(   4,<2012-08-01 22:59:27.546 -0500>,<Administrator>,<TOPSPIN>,<proc1d>,<TOPSPIN 2.1>,
      <abs ABSG = 1 
       data hash MD5: 128K
       E1 E1 6B 18 95 C9 7E 2A 96 BA AB B9 ED 0F F5 9D>)
(   5,<2012-08-01 22:59:27.625 -0500>,<Administrator>,<TOPSPIN>,<proc1d>,<TOPSPIN 2.1>,
      <abs ABSG = 2 
       data hash MD5: 128K
       10 74 19 D8 F7 EE CC FD 5A 9B EA D3 7F 0A 60 8F>)
(   6,<2012-08-01 22:59:27.687 -0500>,<Administrator>,<TOPSPIN>,<proc1d>,<TOPSPIN 2.1>,
      <abs ABSG = 3 
       data hash MD5: 128K
       86 DA E9 B6 6E C3 82 ED E1 F2 5C 2B D3 B6 1C E4>)
(   7,<2012-08-01 22:59:27.750 -0500>,<Administrator>,<TOPSPIN>,<proc1d>,<TOPSPIN 2.1>,
      <abs ABSG = 4 
       data hash MD5: 128K
       17 37 8C 54 8C 0F 28 84 D2 CB A6 0C 34 23 C3 09>)
(   8,<2012-08-01 22:59:27.796 -0500>,<Administrator>,<TOPSPIN>,<proc1d>,<TOPSPIN 2.1>,
      <abs ABSG = 5 
       data hash MD5: 128K
       F8 1A 93 02 21 AE 8E 3E 34 66 A7 3B F8 44 7F 65>)
$$ ##END=
$$ 
$$ $$ hash MD5
$$ $$ 5D F2 D0 A7 9E 2D B4 7D 68 50 0E 26 35 A0 71 A9
##$RELAX= 
##$RELAX= 
##$RELAX= 
##$RELAX= 
##$RELAX= 
##$RELAX= 
##$RELAX= 
##$RELAX= 
$$ Bruker specific parameters
$$ [...]
##$TP07= 0
##$TPNAME0= <>
##$TPNAME1= <>
##$TPNAME2= <>
##$TPNAME3= <>
##$TPNAME4= <>
##$TPNAME5= <>
##$TPNAME6= <>
##$TPNAME7= <>
##$TPOAL= (0..7)
0.5 0.5 0.5 0.5 0.5 0.5 0.5 0.5
##$TPOFFS= (0..7)
0 0 0 0 0 0 0 0
##$TUNHIN= 0
##$TUNHOUT= 0
##$TUNXOUT= 0
##$USERA1= <user>
##$USERA2= <user>
##$USERA3= <user>
##$USERA4= <user>
##$USERA5= <user>
##$V9= 5
##$VALIST= <valist>
##$VCLIST= <CCCCCCCCCCCCCCC>
##$VD= 0
##$VDLIST= <DDDDDDDDDDDDDDD>
##$VPLIST= <PPPPPPPPPPPPPPP>
##$VTLIST= <TTTTTTTTTTTTTTT>
##$WBST= 1024
##$WBSW= 4
##$XGAIN= (0..3)
0 0 0 0
##$XL= 0
##$YL= 0
##$YMAX_a= 17332669
##$YMIN_a= -10370771
##$ZGOPTNS= <>
##$ZL1= 120
##$ZL2= 120
##$ZL3= 120
##$ZL4= 120
##$ABSF1= 14.96244
##$ABSF2= -5.595742
##$ABSG= 5
##$ABSL= 3
##$ALPHA= 0
##$AQORDER= 0
##$ASSFAC= 0
##$ASSFACI= 0
##$ASSFACX= 0
##$ASSWID= 0
##$AUNMP= <proc_prof1d_extract.lims>
##$AXLEFT= 0
##$AXNAME= <>
##$AXNUC= <1H>
##$AXRIGHT= 0
##$AXTYPE= 0
##$AXUNIT= <>
##$AZFE= 0.1
##$AZFW= 0.1
##$BCFW= 0
##$BC_mod= 0
##$BYTORDP= 0
##$COROFFS= 0
##$CY= 15
##$DATMOD= 1
##$DC= 0
##$DFILT= <>
##$DTYPP= 0
##$F1P= 0
##$F2P= 0
##$FCOR= 0.5
##$FTSIZE= 131072
##$FT_mod= 6
##$GAMMA= 0
##$GB= 0
##$INTBC= 1
##$INTSCL= 1
##$ISEN= 128
##$LB= 0.3
##$LEV0= 0
##$LPBIN= 0
##$MAXI= 10000
##$MC2= 0
##$MEAN= 0
##$ME_mod= 0
##$MI= 0
##$NCOEF= 0
##$NC_proc= -2
##$NLEV= 6
##$NOISF1= 0
##$NOISF2= 0
##$NSP= 0
##$NTH_PI= 0
##$NZP= 0
##$OFFSET= 14.96244
##$PC= 1
##$PHC0= 0.1098633
##$PHC1= 0
##$PH_mod= 1
##$PKNL= yes
##$PPARMOD= 0
##$PPDIAG= 0
##$PPIPTYP= 0
##$PPMPNUM= 2147483647
##$PPRESOL= 1
##$PSCAL= 4
##$PSIGN= 0
##$PYNMP= <proc.py>
##$REVERSE= no
##$SF= 400.020009060294
##$SI= 131072
##$SIGF1= 0
##$SIGF2= 0
##$SINO= 400
##$SIOLD= 131072
##$SPECTYP= <>
##$SREGLST= <1H.CDCl3>
##$SSB= 0
##$STSI= 131072
##$STSR= 0
##$SW_p= 8223.68421052631
##$SYMM= 0
##$S_DEV= 0
##$TDeff= 65536
##$TDoff= 0
##$TI= <>
##$TILT= no
##$TM1= 0
##$TM2= 0
##$TOPLEV= 0
##$USERP1= <user>
##$USERP2= <user>
##$USERP3= <user>
##$USERP4= <user>
##$USERP5= <user>
##$WDW= 1
##$XDIM= 131072
##$YMAX_p= 427232194
##$YMIN_p= -11970
##$CURPLOT= <Network HP LaserJet P1505>
##$CURPRIN= <$Network HP LaserJet P1505>
##$DFORMAT= <normdp>
##$LAYOUT= <+/1D_H.xwp>
##$LFORMAT= <normlp>
##$PFORMAT= <normpl>
##$SURQMSG= 1
$$ End of Bruker specific parameters
$$ ---------------------------------
##NTUPLES= NMR SPECTRUM
##VAR_NAME=  FREQUENCY,     SPECTRUM/REAL,   SPECTRUM/IMAG
##SYMBOL=    X,             R,               I
##VAR_TYPE=  INDEPENDENT,   DEPENDENT,       DEPENDENT
##VAR_FORM=  AFFN,          ASDF,            ASDF
##VAR_DIM=   131072,        131072,          131072
##UNITS=     HZ,            ARBITRARY UNITS, ARBITRARY UNITS
##FACTOR=    0.0627417313425164, 1,          1
##FIRST=     8223.62146879497, -1234,        -65362
##LAST=      0,             1400,            -65739
##MIN=       0,             -11970,          0
##MAX=       8223.62146879497, 427232194,    0
$$ Real data points
##PAGE= N=1
##DATA TABLE= (X++(R..R)), XYDATA
$$ [...]
$$ plain form
63202 1151339 1128057 1098816 1064076 1025433 984960 944339 904931 868007 834277 803578 775687
63191 775687 751174 730839 714633 701904 692564 687175 685780 687441 691190 696855 704694 714761 726902
63178 726902 740878 756116 771764 787440 803636 820949 839073 856983 874034 890498 906948
63167 906948 923376 939107 953471 966371 978022 988168 995796 999820 999889 996241 988897 977407 961453
63154 961453 941460 918508 893885 868708 843631 818783 794126 769944 746780 725000 704741
63143 704741 686310 670179 656375 644197 632824 622049 612285 604063 597695 593141 589989 587695 586023
63130 586023 585157 585298 586270 587613 588890 589883 590697 591764 593515 595953 598728 601671 604997 608965 613588
63115 613588 618748 624199 629408 633854 637722 641899 646980 652618 658176 663615 669323 675351 681286 686741
$$ packed form
63202A151339k3282k9241l4740l8643m0473m0621l9408l6924l3730l0699k7891
63191G75687k4513k0335j6206j2729r340n389j395J661L749N665P839J0067J2141
63178G26902J3976J5238J5648J5676J6196J7313J8124J7910J7051J6464J6450
63167I06948J6428J5731J4364J2900J1651J0146P628M024O9l648p344j1490j5954
63154I61453j9993k2952k4623k5177k5077k4848k4657k4182k3164k1780k0259
63143G04741j8431j6131j3804j2178j1373j0775r764q222o368m554l152k294j672
63130E86023q66J41R72J343J277R93Q14J067J751K438K775K943L326L968M623
63115F13588N160N451N209M446L868M177N081N638N558N439N708O028N935N455
$$ plain form
63101 686741 691546 695642 699220 702754 706387 709370 710737 710542 709897 709620 709443 708858 708177 708170 708906 709618 709825
63084 709825 710071 711306 713788 716937 720109 723219 726660 730959 736614 743897 752545 761856 771348 781191
63070 781191 791764 802989 814532 826543 839761 854811 871766 890441 910706 932429 955575
63059 955575 980524 1007890 1037765 1069570 1103004 1138812 1178176 1221514 1268214 1317368 1368463
63048 1368463 1421491 1476739 1534387 1594051 1654793 1715745 1776505 1836645 1895178 1951028 2003989
63037 2003989 2054770 2104115 2152288 2199471 2246208 2293161 2340609 2388225 2435125 2479967 2521122
63026 2521122 2556840 2585217 2604108 2611397 2605582 2586096 2553096 2507067 2448736 2379385 2301262 2217587
63014 2217587 2131851 2046885 1964610 1886571 1814280 1748704 1689738 1636773 1589834 1549877 1517934
$$ packed form
63101F86741M805M096L578L534L633K983J367j95o45k77j77n85o81pP36P12K07
63084G09825K46J235K482L149L172L110L441M299N655P283Q648R311R492R843
63070G81191J0573J1225J1543J2011J3218J5050J6955J8675K0265K1723K3146
63059I55575K4949K7366K9875L1805L3434L5808L9364M3338M6700M9154N1095
63048A368463N3028N5248N7648N9664O0742O0952O0760O0140N8533N5850N2961
63037B003989N0781M9345M8173M7183M6737M6953M7448M7616M6900M4842M1155
63026B521122L5718K8377J8891P289n815j9486l3000m6029n8331o9351p8123q3675
63014B217587q5736q4966q2275p8039p2291o5576n8966n2965m6939l9957l1943
$$ plain form
63003 1517934 1494290 1478549 1470056 1468096 1471927 1480963 1494780 1512798 1534064 1557514 1582401 1608319
62991 1608319 1634923 1661860 1688948 1716104 1742917 1768471 1791887 1813028 1832385 1850155 1865608
62980 1865608 1877466 1884644 1886358 1881743 1869848 1850072 1822343 1786877 1744132 1695092 1641247 1584086
62968 1584086 1524751 1464227 1403555 1343786 1285985 1231322 1180797 1134696 1092639 1054301 1019716
62957 1019716 988736 960695 934972 911591 890865 872795 857184 844040 833369 824635 816825 809000
62945 809000 800583 791389 781728 772311 763630 755541 747628 739709 731672 723204 714257 705508 697777 691058
62931 691058 684595 677864 670969 664262 658083 652816 648615 645058 641547 637977 634525 630961 626907 622718
62917 622718 619221 616445 613454 609791 606290 603877 602223 600273 597703 595110 593000 591265 589611 587967
$$ packed form
63003A517934k3644j5741q493j960L831R036J3817J8018K1266K3450K4887K5918
62991A608319K6604K6937K7088K7156K6813K5554K3416K1141J9357J7770J5453
62980A865608J1858P178J714m615j1895j9776k7729l5466m2745m9040n3845n7161
62968A584086n9335o0524o0672n9769n7801n4663n0525m6101m2057l8338l4585
62957A019716l0980k8041k5723k3381k0726j8070j5611j3144j0671q734p810p825
62945H09000q417r194r661r417q681q089p913p919q037q468q947q749p731o719
62931F91058o463o731o895o707o179n267m201l557l511l570l452l564m054m189
62917F22718l497k776k991l663l501k413j654j950k570k593k110j735j654j644
$$ plain form
62903 587967 586367 584826 583430 582328 581601 581324 581629 582426 583107 582881 581532 579627 577843 576211 574169 571222
62887 571222 567379 562949 558198 553368 548893 545282 542771 541281 540704 540897 541337 541241 540344 539200 538396 537798
62871 537798 536974 536109 535913 536726 538152 539519 540333 540459 540389 541126 543191 545780 547482 547789 547277 546442 545134
62854 545134 543253 541090 538708 535837 532743 530442 529493 529207 528654 527800 527068 526339 525213 523894 523025 522774
62838 522774 522734 522547 522078 521141 519726 518372 517702 517580 517338 516774 516395 516603 517212 517857 518355 518587 518479 518244
62820 518244 518187 518116 517422 515962 514437 513593 513373 513212 513000 513364 515016 518010 521651 525070 527965 530866 534658
62803 534658 539813 546131 553125 560475 568114 576137 584788 594463 605516 618012 631680 646146 661217
62790 661217 676970 693595 711339 730737 752694 777922 806174 836490 868518 903384 942927
$$ packed form
62903E87967j600j541j396j102p27k77L05P97O81k26j349j905j784j632k042k947
62887E71222l843m430m751m830m475l611k511j490n77J93M40r6q97j144q04n98
62871E37798q24q65j96Q13J426J367Q14J26p0P37K065K589J702L07n12q35j308
62854E45134j881k163k382k871l094k301r49k86n53q54p32p29j126j319q69k51
62838E22774m0j87m69r37j415j354o70j22k42n64l79K08O09O45M98K32j08k35
62820E18244n7p1o94j460j525q44k20j61k12L64J652K994L641L419K895K901L792
62803E34658N155O318O994P350P639Q023Q651R675J1053J2496J3668J4466J5071
62790F61217J5753J6625J7744J9398K1957K5228K8252L0316L2028L4866L9543
$$ plain form
62779 942927 988196 1038954 1094528 1154803 1220434 1292304 1370739 1455060 1544015 1636820 1733473
62768 1733473 1833707 1935772 2036659 2133364 2223410 2304300 2373184 2427412 2465063 2484862 2486095
62757 2486095 2468967 2434695 2384973 2321516 2246260 2161523 2069534 1972021 1870631 1767632 1665828
62746 1665828 1567684 1474604 1386886 1304137 1225954 1152469 1084272 1021709 964464 912031 864375
62735 864375 821738 783931 750216 719873 692568 668125 646316 626975 610020 595138 581685
62724 581685 569070 557149 546151 536340 527830 520503 514035 508233 503442 500467 499864 501443 504528 508478
62710 508478 512851 517535 523065 530554 540745 553205 566943 581753 598429 617631 639194 662855
62698 662855 689059 718545 751477 787478 826349 868225 913169 961147 1012456 1067646 1126752
$$ packed form
62779I42927M5269N0758N5574O0275O5631P1870P8435Q4321Q8955R2805R6653
62768A733473J00234J02065J00887R6705R0046Q0890O8884N4228L7651J9799J233
62757B486095j7128l4272m9722o3457p5256q4737r1989r7513j01390j02999j01804
62746A665828r8144r3080q7718q2749p8183p3485o8197o2563n7245n2433m7656
62735H64375m2637l7807l3715l0343k7305k4443k1809j9341j6955j4882j3453
62724E81685j2615j1921j0998r811q510p327o468n802m791k975o03J579L085L950
62710E08478M373M684N530P489J0191J2460J3738J4810J6676J9202K1563K3661
62698F62855K6204K9486L2932L6001L8871M1876M4944M7978N1309N5190N9106
$$ plain form
62687 1126752 1188779 1252024 1314639 1374744 1430295 1479199 1519726 1550752 1571585 1581542 1579844 1566118
62675 1566118 1541064 1506341 1463660 1414204 1359047 1299765 1238166 1175660 1113306 1052348 994070
62664 994070 939040 886972 837514 790851 747467 707755 672005 640385 612605 587866 565385
62653 565385 544862 526391 510156 496208 484178 473081 461832 450217 439042 429103 420350 412208
62641 412208 404294 396433 388423 380346 372921 367002 362697 359305 356048 352496 348415 343725 338785 334413
62627 334413 331378 329867 329422 329284 328874 328083 327173 326410 325944 326009 326878 328493 330422 332429 334778 337733 341107
62610 341107 344694 348871 354220 360737 367915 375547 383918 393168 403058 413508 424929 437777 452104
62597 452104 467817 485128 504526 526484 551352 579339 610481 644777 682499 724163 769935
$$ packed form
62687A126752O2027O3245O2615O0105N5551M8904M0527L1026K0833R957j698j3726
62675A566118k5054l4723m2681m9456n5157n9282o1599o2506o2354o0958n8278
62664I94070n5030n2068m9458m6663m3384l9712l5750l1620k7780k4739k2481
62653E65385k0523j8471j6235j3948j2030j1097j1249j1615j1175r939q753q142
62641D12208p914p861q010q077p425n919m305l392l257l552m081m690m940m372
62627C34413l035j511m45j38m10p91r10p63m66O5Q69J615J929K007K349K955L374
62610C41107L587M177N349O517P178P632Q371R250R890J0450J1421J2848J4327
62597D52104J5713J7311J9398K1958K4868K7987L1142L4296L7722M1664M5772
$$ plain form
62586 769935 819181 870770 923774 977616 1031468 1083700 1132097 1174581 1209657 1236264 1253571
62575 1253571 1261218 1259536 1249107 1230119 1202653 1167760 1127773 1085176 1041378 996846 952011 907486
62563 907486 863650 820699 779245 740490 705573 674843 647653 622665 598599 575161 553251
62552 553251 533895 516972 501296 485878 470695 456302 443212 431720 421783 412795 403902 394857
62540 394857 386269 378783 372320 366395 360906 356228 352622 349904 347777 346320 346019 347266 349872 353157
62526 353157 356589 360158 364094 368495 373454 379221 385832 392907 400389 409270 420840 435183 451121
62513 451121 467766 485414 504703 525712 548380 573179 600679 630835 663202 697438 733031
62502 733031 768823 803425 835975 865951 892376 913728 928628 936322 936712 930343 918181 901029
$$ packed form
62586G69935M9246N1589N3004N3842N3852N2232M8397M2484L5076K6607J7307
62575A253571P647j682j0429j8988k7466l4893l9987m2597m3798m4532m4835m4525
62563I07486m3836m2951m1454l8755l4917l0730k7190k4988k4066k3438k1910
62552E53251j9356j6923j5676j5418j5183j4393j3090j1492r937q988q893r045
62540C94857q588p486o463n925n489m678l606k718k127j457l01J247K606L285
62526C53157L432L569L936M401M959N767O611P075P482Q881J1570J4343J5938
62513D51121J6645J7648J9289K1009K2668K4799K7500L0156L2367L4236L5593
62502G33031L5792L4602L2550K9976K6425K1352J4900P694L90o369j2162j7152
$$ plain form
62490 901029 879270 853485 824933 794876 763756 731750 699900 669833 642387 617289 594259
62479 594259 573580 555344 538987 524054 510818 499716 490659 483359 477837 474121 471867 470742 470833
62466 470833 472155 474140 476178 478379 481197 484588 488151 491979 496634 502292 508564 515222 522492 530451
62452 530451 538703 546893 555105 563540 572206 581120 590330 599410 607338 613256 617064 618939 618513 614952
62438 614952 607695 596884 583249 567853 551735 535449 519053 502727 487233 473443 461600 451327
62426 451327 442175 433890 426396 419973 415206 412309 410650 409451 408843 409631 412079 415572 419582 424259 429906
62411 429906 436487 443982 452598 462223 472154 481863 491615 501832 512201 521916 530530 537991 544069 548355
62397 548355 550815 551826 551662 550315 547766 544036 539077 533093 526889 521297 516191 510692 504578 498994
$$ packed form
62490I01029k1759k5785k8552l0057l1120l2006l1850l0067k7446k5098k3030
62479E94259k0679j8236j6357j4933j3236j1102r057p300n522l716k254j125R1
62466D70833J322J985K038K201K818L391L563L828M655N658O272O658P270P959
62452E30451Q252Q190Q212Q435Q666Q914R210R080P928N918L808J875m26l561
62438F14952p257j0811j3635j5396j6118j6286j6396j6326j5494j3790j1843j0273
62426D51327r152q285p494o423m767k897j659j199o08P88K448L493M010M677N647
62411D29906O581P495Q616R625R931R709R752J0217J0369R715Q614P461O078M286
62397E48355K460J011j64j347k549l730m959n984o204n592n106n499o114n584
$$ plain form
62383 498994 495380 494081 494390 495700 498198 502535 509184 518145 529055 541521 555500 571465 590176
62370 590176 612204 637610 666044 697307 731878 770710 814248 861811 912238 965039 1020438
62359 1020438 1078205 1136939 1194775 1250371 1302771 1350495 1391265 1422771 1443517 1453059 1451842 1440998
62347 1440998 1422061 1396632 1366180 1332084 1295572 1257432 1217803 1176483 1133599 1089996 1047001
62336 1047001 1005857 967343 931737 898955 868724 840818 815181 791763 770237 750032 730673
62325 730673 712031 694312 678040 663976 652645 643796 636617 630653 626158 623270 621278 619203 616856
62312 616856 614752 613104 611438 609182 606061 601863 596419 589984 583142 576120 568667 560834 553336 546747
62298 546747 540779 534905 529395 525111 522379 520639 519300 518471 518626 519868 521801 524101 527012 531214 537157
$$ packed form
62383D98994l614j299L09J310K498M337O649Q961J0910J2466J3979J5965J8711
62370E90176K2028K5406K8434L1263L4571L8832M3538M7563N0427N2801N5399
62359A020438N7767N8734N7836N5596N2400M7724M0770L1506K0746R542j217j0844
62347A440998j8937k5429l0452l4096l6512l8140l9629m1320m2884m3603m2995
62336A047001m1144l8514l5606l2782l0231k7906k5637k3418k1526k0205j9359
62325G30673j8642j7719j6272j4064j1331q849p179n964m495k888j992k075k347
62312F16856k104j648j666k256l121m198n444o435o842p022p453p833p498o589
62298E46747n968n874n510m284k732j740j339q29J55J242J933K300K911M202N943
$$ plain form
62283 537157 544539 552576 560800 569361 578483 587915 597327 607072 618139 631198 645978 661675 677744
62270 677744 694223 711468 729805 749291 769732 791081 813997 839810 869613 903391 940372
62259 940372 980278 1023873 1071971 1124103 1178441 1232846 1285460 1334249 1376562 1409722 1432043
62248 1432043 1443122 1443410 1433860 1415856 1390971 1360561 1325646 1287101 1245641 1201680 1155597 1108394
62236 1108394 1061828 1017684 976957 939853 906381 876711 851012 829170 810774 795362 782639
62225 782639 772406 764262 757483 751354 745627 740522 736318 733025 730394 728033 725542 722774 720028 717781
62211 717781 716189 715051 714334 714437 715697 717836 720231 722709 725862 730465 736764 744376 752794 761811 771545
62196 771545 782275 794417 808496 824839 843282 863433 885299 909414 936132 964974 994714
$$ packed form
62283E37157P382Q037Q224Q561R122R432R412R745J1067J3059J4780J5697J6069
62270F77744J6479J7245J8337J9486K0441K1349K2916K5813K9803L3778L6981
62259I40372L9906M3595M8098N2132N4338N4405N2614M8789M2313L3160K2321
62248A432043J1079K88r550j8004k4885l0410l4915l8545m1460m3961m6083m7203
62236A108394m6566m4144m0727l7104l3472k9670k5699k1842j8396j5412j2723
62225G82639j0233q144o779o129n727n105m204l293k631k361k491k768k746k247
62211G17781j592j138p17J03J260K139K395K478L153M603O299P612Q418R017R734
62196G71545J0730J2142J4079J6343J8443K0151K1866K4115K6718K8842K9740
$$ plain form
62185 994714 1023858 1050880 1074453 1093972 1109828 1122852 1133631 1142573 1150345 1157670 1164866 1172215
62173 1172215 1180862 1192655 1208821 1229187 1252969 1279900 1310298 1344256 1381027 1418966 1455926
62162 1455926 1489908 1519505 1543701 1561493 1572328 1576965 1577271 1574793 1569919 1562570 1553069 1541764 1528347
62149 1528347 1512390 1494431 1475933 1458165 1441654 1426736 1414078 1404319 1397492 1393020 1390172 1388367
62137 1388367 1387154 1386095 1384854 1383511 1382720 1383293 1385469 1388763 1392635 1397228 1403313 1411687 1422679 1436033
62123 1436033 1451083 1467168 1483987 1501486 1519523 1538021 1557484 1578799 1602206 1626872 1651851
62112 1651851 1677102 1703142 1730147 1757963 1786762 1816876 1848012 1879290 1910241 1941264 1972965
62101 1972965 2005549 2039026 2073541 2109128 2145530 2182648 2220963 2261114 2303287 2347437 2394033
$$ packed form
62185I94714K9144K7022K3573J9519J5856J3024J0779Q942P772P325P196P349
62173A172215Q647J1793J6166K0366K3782K6931L0398L3958L6771L7939L6960
62162A455926L3982K9597K4196J7792J0835M637L06k478m874p349r501j1305j3417
62149A528347j5957j7959j8498j7768j6511j4918j2658r759o827m472k848j805
62137A388367j213j059j241j343p91N73K176L294L872M593O085Q374J0992J3354
62123A436033J5050J6085J6819J7499J8037J8498J9463K1315K3407K4666K4979
62112A651851K5251K6040K7005K7816K8799L0114L1136L1278L0951L1023L1701
62101A972965L2584L3477L4515L5587L6402L7118L8315M0151M2173M4150M6596
$$ plain form
62090 2394033 2443952 2497228 2552131 2605933 2656756 2704634 2750947 2797232 2844767 2894833 2948580
62079 2948580 3006124 3065839 3124767 3179857 3229149 3272249 3310140 3344653 3377986 3412350 3449492
62068 3449492 3490139 3534035 3580783 3630396 3682574 3735671 3787182 3835382 3879860 3920302 3955554
62057 3955554 3984474 4007176 4024820 4038503 4048840 4056182 4060521 4061313 4057956 4050380 4038837 4023542
62045 4023542 4005158 3985354 3965932 3947258 3928238 3908033 3887214 3866998 3847948 3829797 3812219
62034 3812219 3795320 3779463 3764774 3750816 3736821 3722478 3708367 3695301 3683331 3671842 3660642
62023 3660642 3650347 3641498 3633832 3626810 3620521 3615558 3612179 3610028 3608696 3608219 3608885 3610741 3613485 3616854
62009 3616854 3620951 3626066 3632149 3638664 3645051 3651219 3657462 3664119 3671484 3679788 3688794 3697338 3703560 3705687
$$ packed form
62090B394033M9919N3276N4903N3802N0823M7878M6313M6285M7535N0066N3747
62079B948580N7544N9715N8928N5090M9292M3100L7891L4513L3333L4364L7142
62068C449492M0647M3896M6748M9613N2178N3097N1511M8200M4478M0442L5252
62057C955554K8920K2702J7644J3683J0337P342M339P92l357p576j1543j5295
62045D023542j8384j9804j9422j8674j9020k0205k0819k0216j9050j8151j7578
62034C812219j6899j5857j4689j3958j3995j4343j4111j3066j1970j1489j1200
62023C660642j0295q849p666p022o289m963l379k151j332m77O66J856K744L369
62009C616854M097N115O083O515O387O168O243O657P365Q304R006Q544O222K127
$$ plain form
61995 3705687 3702575 3693675 3678760 3657716 3630389 3596767 3557542 3514328 3468858 3421959 3373655 3324269
61983 3324269 3274910 3226755 3180230 3135171 3091496 3049480 3009510 2971768 2935994 2901513 2867670
61972 2867670 2834414 2802285 2771786 2742901 2715279 2688644 2662893 2637982 2613922 2590775 2568587
61961 2568587 2547392 2527346 2508669 2491376 2475187 2459804 2445142 2431219 2417928 2405045 2392463
61950 2392463 2380405 2369430 2360167 2352900 2347448 2343491 2340919 2339725 2339755 2340827 2343050 2346725 2351924 2358428
61936 2358428 2366125 2375241 2386111 2398956 2413954 2431335 2451282 2473881 2499258 2527790 2560190 2597398
61924 2597398 2640157 2688558 2742254 2801496 2867951 2944205 3032507 3134265 3250675 3383499 3535157
61913 3535157 3708408 3906085 4130936 4385680 4673387 4997797 5363099 5773537 6233570
$$ packed form
61995C705687l112q900j4915k1044k7327l3622l9225m3214m5470m6899m8304m9386
61983C324269m9359m8155m6525m5059m3675m2016l9970l7742l5774l4481l3843
61972B867670l3256l2129l0499k8885k7622k6635k5751k4911k4060k3147k2188
61961B568587k1195k0046j8677j7293j6189j5383j4662j3923j3291j2883j2582
61950B392463j2058j0975r263p267n452l957k572j194L0J072K223L675N199O504
61936B358428P697R116J0870J2845J4998J7381J9947K2599K5377K8532L2400L7208
61924B597398M2759M8401N3696N9242O6455P6254Q8302J01758J16410J32824J51658
61913C535157J73251J97677K24851K54744K87707L24410L65302M10438M60033
$$ plain form
61904 6233570 6748211 7322380 7959009 8656942 9409300 10201869 11011108 11802608 12531562
61895 12531562 13146698 13597925 13845885 13869778 13670431 13268489 12699620 12008098 11239518
61886 11239518 10434454 9625410 8837135 8087904 7389949 6749654 6168659 5645547 5177220
61877 5177220 4759852 4389504 4062151 3773235 3517729 3290999 3089448 2910197 2750508
61868 2750508 2607884 2480453 2366820 2265553 2175062 2093893 2020948 1955521 1897328 1846430
61858 1846430 1802849 1766156 1735403 1709441 1687415 1669149 1655001 1645102 1638660 1634182 1630438 1627071
61846 1627071 1624319 1622424 1621271 1620353 1619043 1617122 1614953 1612824 1610375 1607205 1603975 1602207 1602794 1605332
61832 1605332 1609116 1614131 1620600 1628108 1635836 1643410 1651007 1658715 1666199 1672938 1678542 1682913 1686285 1688999
$$ packed form
61904F233570N14641N74169O36629O97933P52358P92569Q09239P91500P28954
61895A2531562O15136M51227K47960K3893j99347m01942n68869o91522p68580
61886A1239518q05064q09044p88275p49231o97955o40295n80995n23112m68327
61877E177220m17368l70348l27353k88916k55506k26730k01551j79251j59689
61868B750508j42624j27431j13633j01267r0491q1169p2945o5427n8193n0898
61858A846430m3581l6693l0753k5962k2026j8266j4148r899o442m478l744l367
61846A627071k752j895j153r18j310j921k169k129k449l170l230j768N87K538
61832A605332L784N015O469P508P728P574P597P708P484O739N604M371L372K714
$$ plain form
61818 1688999 1691246 1693335 1696308 1701745 1710591 1722509 1736788 1753597 1773879 1798313 1826896 1859474
61806 1859474 1896210 1937482 1983648 2034941 2091372 2152744 2219002 2290516 2367947 2452008 2543541
61795 2543541 2643618 2753150 2872469 3001725 3141814 3294780 3463214 3649419 3855263
61786 3855263 4082813 4334956 4615279 4927462 5275214 5663033 6096651 6582317 7126002
61777 7126002 7734005 8414172 9175623 10027006 10975511 12027194 13186171 14451115 15810636
61768 15810636 17239591 18696071 20118880 21428459 22534602 23350141 23805886 23862559 23517573
61759 23517573 22804981 21787787 20544808 19157279 17699428 16233651 14808589 13458730
61751 13458730 12205345 11058828 10021875 9092242 8264308 7529920 6879613 6304123 5795047
$$ packed form
61818A688999K247K089K973N437Q846J1918J4279J6809K0282K4434K8583L2578
61806A859474L6736M1272M6166N1293N6431O1372O6258P1514P7431Q4061R1533
61795B543541J00077J09532J19319J29256J40089J52966J68434J86205K05844
61786C855263K27550K52143K80323L12183L47752L87819M33618M85666N43685
61777G126002O08003O80167P61451Q51383R48505J051683J158977J264944J359521
61768A5810636J428955J456480J422809J309579J106143Q15539M55745N6673l44986
61759B3517573p12592j017194j242979j387529j457851j465777j425062j349859
61751A3458730j253385j146517j036953r29633q27934p34388o50307n75490n09076
$$ plain form
61742 5795047 5344495 4944944 4589899 4274272 3993731 3743962 3520891 3321238 3142385
61733 3142385 2981931 2837671 2707760 2590560 2484650 2389175 2303709 2227314 2158125 2094282
61723 2094282 2034808 1979169 1926572 1876438 1829045 1784853 1743467 1704030 1666381 1630954 1597747
61712 1597747 1566279 1536467 1508689 1482955 1458861 1436384 1415861 1397075 1379190 1361712 1344677
61701 1344677 1327726 1309990 1291318 1272775 1255369 1238993 1223083 1207633 1192876 1178515 1164116
61690 1164116 1150009 1137099 1125760 1115434 1105386 1095511 1086308 1078233 1071130 1064336 1057373 1050441 1044056
61677 1044056 1038350 1033087 1028176 1023660 1019205 1014232 1008710 1003306 998557 994351 990397 986579 982587 977800
61663 977800 972016 965834 959877 953963 947520 940512 933525 927207 921966 917941 914816 911927 908958 906373
$$ packed form
61742E795047m50552l99551l55045l15627k80541k49769k23071j99653j78853
61733C142385j60454j44260j29911j17200j05910r5475q5466p6395o9189o3843
61723B094282n9474n5639n2597n0134m7393m4192m1386l9437l7649l5427l3207
61712A597747l1468k9812k7778k5734k4094k2477k0523j8786j7885j7478j7035
61701A344677j6951j7736j8672j8543j7406j6376j5910j5450j4757j4361j4399
61690A164116j4107j2910j1339j0326j0048r875r203q075p103o794o963o932o385
61677A044056n706n263m911m516m455m973n522n404m749m206l954l818l992m787
61663I77800n784o182n957n914o443p008o987o318n241m025l125k889k969k585
$$ plain form
61649 906373 904799 904213 904157 904461 905286 906638 908355 910486 913179 916197 919035 921559 924164 927254 930932
61634 930932 935182 939984 945239 950898 957230 964568 972700 980920 988800 996478 1003903 1010144 1013901 1014603
61620 1014603 1012652 1008654 1002810 995217 986438 977445 968948 960921 952835 944266 935248 926098 917018 907880
61606 907880 898426 888647 878871 869441 860401 851695 843617 836796 831554 827502 823994 820847 818406 816981
61592 816981 816537 816907 818004 819777 822190 825363 829593 835126 841968 849910 858689 868206 878705 890628
61578 890628 904171 919107 935234 952791 972125 993163 1015634 1039677 1065641 1093303 1121827
61567 1121827 1150686 1180103 1210375 1241312 1272653 1304450 1336531 1367925 1397406 1424458 1449304
61556 1449304 1472252 1493514 1513486 1532505 1550301 1566247 1580358 1593502 1606271 1617906 1626724
$$ packed form
61649I06373j574n86n6L04Q25J352J717K131K693L018K838K524K605L090L678
61634I30932M250M802N255N659O332P338Q132Q220P880P678P425O241L757P02
61620A014603j951l998n844p593q779q993q497q027q086q569r018r150r080r138
61606I07880r454r779r776r430r040q706q078o821n242m052l508l147k441j425
61592H16981m44L70J097J773K413L173M230N533O842P942Q779R517J0499J1923
61578H90628J3543J4936J6127J7557J9334K1038K2471K4043K5964K7662K8524
61567A121827K8859K9417L0272L0937L1341L1797L2081L1394K9481K7052K4846
61556A449304K2948K1262J9972J9019J7796J5946J4111J3144J2769J1635Q818
$$ plain form
61545 1626724 1631526 1632337 1629826 1624309 1615506 1603229 1588102 1571399 1554160 1536703 1519115 1501947
61533 1501947 1486020 1471685 1458734 1447157 1437565 1430514 1425807 1422937 1422162 1424626 1431329 1442373 1457484
61520 1457484 1476938 1501569 1532023 1568366 1610424 1658280 1712461 1773993 1844309 1924737 2015953
61509 2015953 2118163 2231969 2358714 2499843 2656308 2828994 3019436 3229462 3459881
61500 3459881 3709592 3975697 4253824 4537875 4819377 5087260 5328664 5530831 5683313
61491 5683313 5779397 5816412 5795570 5721822 5603117 5448756 5267853 5068989 4860416 4649612
61481 4649612 4442500 4243562 4056572 3884499 3728660 3588767 3464287 3355397 3262404 3184944
61471 3184944 3122327 3074277 3040684 3020766 3012986 3015810 3028189 3049401 3078870 3116137 3160588 3210928
$$ packed form
61545A626724M802Q11k511n517q803j2277j5127j6703j7239j7457j7588j7168
61533A501947j5927j4335j2951j1577r592p051m707k870p75K464O703J1044J5111
61520A457484J9454K4631L0454L6343M2058M7856N4181O1532P0316Q0428R1216
61509B015953J02210J13806J26745J41129J56465J72686J90442K10026K30419
61500C459881K49711K66105K78127K84051K81502K67883K41404K02167J52482
61491E683313R6084L7015k0842p3748j18705j54361j80903j98864k08573k10804
61481D649612k07112j98938j86990j72073j55839j39893j24480j08890r2993p7460
61471C184944o2617m8050l3593j9918p780K824J2379K1212K9469L7267M4451N0340
$$ plain form
61459 3210928 3265104 3320930 3376823 3431974 3485904 3537911 3586998 3632476 3674694 3714973 3754632
61448 3754632 3794191 3833681 3873567 3915084 3959600 4007833 4059593 4113992 4169806 4225825 4281079
61437 4281079 4334693 4385498 4432005 4472895 4507371 4534729 4553635 4562293 4559571 4545768 4522016 4489248
61425 4489248 4448158 4400038 4347037 4291388 4234809 4178864 4125335 4075747 4030750 3990497 3955509
61414 3955509 3926764 3904914 3889814 3880841 3877358 3878813 3884583 3893769 3904971 3916318 3925967 3932578 3935234
61401 3935234 3933106 3925614 3912938 3896193 3877181 3858123 3841397 3829116 3822940 3824512 3835850 3858922
61389 3858922 3894960 3944738 4009545 4091504 4192926 4315633 4460809 4628979 4819998 5033461
61379 5033461 5269078 5526206 5802841 6095219 6398019 6704052 7003443 7283744 7531615
$$ packed form
61459C210928N4176N5826N5893N5151N3930N2007M9087M5478M2218M0279L9659
61448C754632L9559L9490L9886M1517M4516M8233N1760N4399N5814N6019N5254
61437D281079N3614N0805M6507M0890L4476K7358J8906Q658k722j3803k3752l2768
61425D489248m1090m8120n3001n5649n6579n5945n3529m9588m4997m0253l4988
61414C955509k8745k1850j5100q973l483J455N770R186J1202J1347R649O611K656
61401C935234k128p492j2676j6745j9012j9058j6726j2281o176J572J1338K3072
61389C858922L6038M9778O4807Q1959J01422J22707J45176J68170J91019K13463
61379E033461K35617K57128K76635K92378L02800L06033K99391K80301K47871
$$ plain form
61370 7531615 7734963 7884503 7974843 8005141 7978686 7901372 7780076 7621579 7431792 7215380
61360 7215380 6976326 6719063 6448867 6171288 5891615 5614685 5344423 5083350 4833100
61351 4833100 4595511 4372566 4165185 3973044 3795973 3634791 3490281 3362099 3249286
61342 3249286 3151166 3067088 2995921 2936717 2889504 2854655 2831728 2819600 2817425 2824687 2840555 2863995
61330 2863995 2894435 2931593 2974642 3022225 3073242 3126853 3181647 3235590 3287202 3336273 3383087
61319 3383087 3427356 3468289 3505415 3538928 3569304 3596936 3622217 3645792 3668471 3690704 3712115
61308 3712115 3731595 3747793 3759381 3765050 3763770 3755328 3740260 3719041 3691569 3657731 3618100 3573676
61296 3573676 3525066 3472217 3414928 3353492 3289054 3223469 3158495 3094935 3032937 2973352 2918335
$$ packed form
61370G531615K03348J49540R0340L0298k6455p7314j21296j58497j89787k16412
61360G215380k39054k57263k70196k77579k79673k76930k70262k61073k50250
61351D833100k37589k22945k07381j92141j77071j61182j44510j28182j12813
61342C249286r8120q4078p1167n9204m7213l4849k2927j2128k175P262J5868K3440
61330B863995L0440L7158M3049M7583N1017N3611N4794N3943N1612M9071M6814
61319C383087M4269M0933L7126L3513L0376K7632K5281K3575K2679K2233K1411
61308C712115J9480J6198J1588N669j280q442j5068k1219k7472l3838l9631m4424
61296C573676m8610n2849n7289o1436o4438o5585o4974o3560o1998n9585n5017
$$ plain form
61285 2918335 2870056 2829075 2794443 2765187 2741203 2722816 2710004 2702064 2697730 2695540 2694291 2693080
61273 2693080 2690859 2686339 2678682 2668105 2655562 2642055 2628431 2615330 2602917 2591081 2580303 2571897
61261 2571897 2566838 2564835 2565362 2569304 2578823 2595845 2621570 2657411 2705317 2766749 2841939 2930394
61249 2930394 3031601 3144997 3269629 3404044 3545940 3691466 3834914 3969029 4085533
61240 4085533 4175817 4232251 4249617 4225645 4160740 4057978 3923331 3765000 3591748 3411551
61230 3411551 3231119 3055564 2888045 2730229 2583463 2449231 2328446 2220920 2125886 2042539
61220 2042539 1969690 1905407 1847707 1795656 1749416 1709227 1674573 1644390 1617927 1595296 1577129
61209 1577129 1563708 1554629 1549377 1547952 1550642 1557483 1568334 1583145 1601565 1622403 1644170 1666079
$$ packed form
61285B918335m8279m0981l4632k9256k3984j8387j2812p940m334k190j249j211
61273B693080k221m520p657j0577j2543j3507j3624j3101j2413j1836j0778q406
61261B571897n059k003N27L942R519J7022K5725L5841M7906O1432P5190Q8455
61249B930394J01207J13396J24632J34415J41896J45526J43448J34115J16504
61240D085533R0284N6434J7366k3972o4905j02762j34647j58331j73252j80197
61230C411551j80432j75555j67519j57816j46766j34232j20785j07526r5034q3347
61220B042539p2849o4283n7700n2051m6240m0189l4654l0183k6463k2631j8167
61209A577129j3421r079n252j425K690O841J0851J4811J8420K0838K1767K1909
$$ plain form
61197 1666079 1687714 1707652 1723344 1732974 1736858 1736582 1733314 1727473 1719543 1710228 1699811 1687911 1673990
61184 1673990 1657785 1639262 1618507 1595781 1571502 1546126 1520161 1494230 1468881 1444249 1420016
61173 1420016 1395728 1371216 1346775 1322946 1300001 1277586 1254947 1231465 1206900 1181280 1154881
61162 1154881 1128336 1102394 1077384 1053136 1029544 1007074 986546 968543 952960 938884 924862
61151 924862 909624 892762 874570 855252 834675 813092 791607 771437 752847 735305 718700
61140 718700 703980 692359 684132 678542 674650 672030 670590 670191 670833 672998 677240 683293 690027 696562
61126 696562 703082 710240 718232 726996 736991 748947 762734 777153 791122 804626 818291 832437
61114 832437 846883 861294 875356 888802 901644 914250 926857 938981 949499 957285 961693 962562
$$ packed form
61197A666079K1635J9938J5692R630L884k76l268n841p930r315j0417j1900j3921
61184A673990j6205j8523k0755k2726k4279k5376k5965k5931k5349k4632k4233
61173A420016k4288k4512k4441k3829k2945k2415k2639k3482k4565k5620k6399
61162A154881k6545k5942k5010k4248k3592k2470k0528j8003j5583j4076j4022
61151I24862j5238j6862j8192j9318k0577k1583k1485k0170j8590j7542j6605
61140G18700j4720j1621q227n590l892k620j440l99O42K165M242O053O734O535
61126F96562O520P158P992Q764R995J1956J3787J4419J3969J3504J3665J4146
61114H32437J4446J4411J4062J3446J2842J2606J2607J2124J0518P786M408Q69
$$ plain form
61102 962562 960057 954576 946682 936969 925945 914049 901712 889358 877246 865331 853350 841074
61090 841074 828425 815404 802186 789317 777508 766957 757049 747013 736754 726841 717797 709675
61078 709675 702221 695164 688402 682127 676796 672795 670219 669075 669446 671160 673475 675489 676894 678119
61064 678119 679768 682078 684743 687047 688357 688795 689265 690515 692329 693888 694684 694761 694344 693730 693368 693594
61048 693594 694351 695597 697780 701467 706713 713273 721180 730428 740304 749859 759151 769283 781057 794182
61034 794182 807972 822106 836438 850666 864690 878894 893642 908650 923116 936315 948041
61023 948041 958727 969242 980324 992119 1004381 1017023 1030239 1044267 1059409 1076123 1094627
61012 1094627 1114541 1135403 1157505 1181730 1208688 1238472 1271150 1306910 1345880 1388488 1435942
$$ packed form
61102I62562k505n481p894r713j1024j1896j2337j2354j2112j1915j1981j2276
61090H41074j2649j3021j3218j2869j1809j0551r908j0036j0259r913r044q122
61078G09675p454p057o762o275n331m001k576j144L71J714K315K014J405J225
61064F78119J649K310K665K304J310M38M70J250J814J559P96P7m17o14l62K26
61048F93594P57J246K183L687N246O560P907R248R876R555R292J0132J1774J3125
61034G94182J3790J4134J4332J4228J4024J4204J4748J5008J4466J3199J1726
61023I48041J0686J0515J1082J1795J2262J2642J3216J4028J5142J6714J8504
61012A094627J9914K0862K2102K4225K6958K9784L2678L5760L8970M2608M7454
$$ plain form
61001 1435942 1489615 1549717 1615090 1684344 1756742 1832158 1911044 1994791 2085737 2186714 2300750
60990 2300750 2430644 2578027 2742912 2924795 3124181 3342987 3584617 3854872 4162216
60981 4162216 4516135 4926081 5403380 5963356 6624810 7410267 8350203 9485667 10865167
60972 10865167 12545521 14601474 17113024 20088023 23345187 26473214 28962941 30455576
60964 30455576 30919093 30621592 29961663 29319566 29000083 29193117 29882443 30770924 31354701
60955 31354701 31156986 29961859 27877095 25213354 22310681 19434124 16754302 14363492
60947 14363492 12293810 10536790 9064820 7844818 6841403 6018208 5342307 4787004
60939 4787004 4329870 3950305 3630210 3355293 3114527 2899431 2704528 2527125 2365425
$$ packed form
61001A435942N3673O0102O5373O9254P2398P5416P8886Q3747R0946J00977J14036
60990B300750J29894J47383J64885J81883J99386K18806K41630K70255L07344
60981D162216L53919M09946M77299N59976O61454P85457R39936J135464J379500
60972A0865167J680354K055953K511550K974999L257164L128027K489727J492635
60964C0455576M63517k97501o59929o42097l19483J93034O89326Q88481N83777
60955C1354701j97715j195127k084764k663741k902673k876557k679822k390810
60947A4363492k069682j757020j471970j220002j003415q23195o75901n55303
60939D787004m57134l79565l20095k74917k40766k15096j94903j77403j61700
$$ plain form
60930 2365425 2217287 2081056 1956485 1843988 1743555 1654695 1576637 1507757 1445175 1385553
60920 1385553 1326488 1267370 1209345 1154389 1103892 1057896 1015754 977169 942183 910629 882323
60909 882323 857503 836253 817670 800383 783816 768272 753999 741015 729643 720228 712336 705120
60897 705120 698531 693306 689751 687425 686053 685829 686666 688103 690157 693332 697524 701781 705534 709277 713578
60882 713578 718073 721856 724385 725672 726021 725731 724649 721924 716734 709318 700805 692092 683529 675494 668337
60867 668337 661688 654774 647649 641273 636186 631994 628417 625931 624956 625218 626318 628244 630927 634032 637571
60852 637571 642083 647930 655050 663564 673765 685290 697342 710092 724823 742117 760896 779875
60840 779875 798932 818296 837329 854983 870638 883695 893330 899766 904945 910677 916693 921730 925911
$$ packed form
60930B365425j48138j36231j24571j12497j00433q8860p8058o8880o2582n9622
60920A385553n9065n9118n8025n4956n0497m5996m2142l8585l4986l1554k8306
60909H82323k4820k1250j8583j7287j6567j5544j4273j2984j1372r415p892p216
60897G05120o589n225l555k326j372k24Q37J437K054L175M192M257L753L743M301
60882G13578M495L783K529J287L49k90j082k725n190p416q513q713q563q035p157
60867F68337o649o914p125o376n087m192l577k486r75K62J100J926K683L105L539
60852F37571M512N847P120Q514J0201J1525J2052J2750J4731J7294J8779J8979
60840G79875J9057J9364J9033J7654J5655J3057R635O436N179N732O016N037M181
$$ plain form
60827 925911 930502 935561 939413 940730 939976 938466 936966 935517 933734 930831 926018 919322 911635 903802
60813 903802 896080 888477 880961 873099 864118 853671 842195 830330 818344 806309 794461 783139
60801 783139 772676 763524 756177 750639 746217 742094 738098 734760 732704 732129 732927 735139 739070 744804
60787 744804 751843 759595 768146 778028 789157 800638 811980 823905 837325 851971 866670 880680
60775 880680 893962 906252 916866 925658 933495 941327 949182 956415 962675 968263 973662 978974 983814
60762 983814 987695 990551 992894 995336 997990 1000389 1001905 1002083 1000792 998366 995569 993115 991180 989570
60748 989570 988270 987535 987470 987846 988394 988953 989232 988678 986763 983324 978602 973128 967511 962104 956750 951021
60732 951021 944765 938248 931746 925245 918703 912448 907110 903188 900731 899361 898538 897893 897481 897673 898674
$$ packed form
60827I25911M591N059L852J317p54j510j500j449j783k903m813o696p687p833
60813I03802p722p603p516p862q981j0447j1476j1865j1986j2035j1848j1322
60801G83139j0463r152p347n538m422m123l996l338k056n75P98K212L931N734
60787G44804P039P752Q551R882J1129J1481J1342J1925J3420J4646J4699J4010
60775H80680J3282J2290J0614Q792P837P832P855P233O260N588N399N312M840
60762I83814L881K856K343K442K654K399J516J78j291k426k797k454j935j610
60748I89570j300p35o5L76N48N59K79n54j915l439m722n474n617n407n354n729
60732I51021o256o517o502o501o542o255n338l922k457j370q23o45m12J92J001
$$ plain form
60717 898674 900062 900935 900621 899198 897117 894328 890050 883658 875615 867225 859523 852694 846499 840886 836034
60702 836034 832183 829662 828774 829376 830728 831927 832397 831898 830423 828292 826075 824030 821701 818236 812988
60687 812988 805726 796588 786126 775079 763782 751967 739446 726747 714663 703431 692871 683191
60675 683191 675086 668965 664540 661303 659028 657656 657100 657369 658660 661102 664525 668578 672953 677480 682166
60660 682166 687093 692049 696308 699123 700526 701369 702494 704116 706049 708183 710583 713460 717290 722632
60646 722632 729555 737317 744878 751600 757379 762404 767052 771709 776349 780524 784228 788559 794933 803608
60632 803608 813516 823659 834109 845406 857580 870280 883481 897436 912042 926823 941473 955915
60620 955915 969734 982016 991926 999132 1003621 1005448 1004802 1001963 997098 990412 982579 974560 966842 959338
$$ packed form
60717H98674J388Q73l14j423k081k789m278o392q043q390p702o829o195n613m852
60702H36034l851k521q88O02J352J199M70m99j475k131k217k045k329l465n248
60687H12988p262r138j0462j1047j1297j1815j2521j2699j2084j1232j0560r680
60675F83191q105o121m425l237k275j372n56K69J291K442L423M053M375M527M686
60660F82166M927M956M259K815J403Q43J125J622J933K134K400K877L830N342
60646G22632O923P762P561O722N779N025M648M657M640M175L704M331O374Q675
60632H03608R908J0143J0450J1297J2174J2700J3201J3955J4606J4781J4650J4442
60620I55915J3819J2282R910P206M489J827o46k839m865o686p833q019p718p504
$$ plain form
60606 959338 952236 946391 942521 940537 940124 941289 943641 945640 945586 943203 939342 934218 927034 917581 907195
60591 907195 897553 889197 881756 875073 869459 865185 862327 860937 860920 861848 863200 864640 865842 866315 865775
60576 865775 864542 863268 862417 862172 862572 863460 864603 866187 868934 873305 878749 884047 888280 891170 892731
60561 892731 893081 892444 890855 887903 883252 877441 871709 866853 862610 858329 853986 850380 848506 848909 851506
60546 851506 855902 861861 869517 879130 890795 904569 920774 939980 962728 989517 1021060 1058305
60534 1058305 1101986 1152036 1207131 1264395 1319543 1367748 1404898 1428443 1437387 1431890 1413024 1382790
60522 1382790 1344208 1301234 1258250 1219098 1186159 1160264 1141523 1130123 1126210 1129193 1137582 1149714
60510 1149714 1164453 1180991 1198169 1214485 1228954 1241773 1253966 1266570 1280370 1296294 1315735
$$ packed form
60606I59338p102n845l870j984m13J165K352J999n4k383l861n124p184r453j0386
60591I07195r642q356p441o683n614m274k858j390j7R28J352J440J202M73n40
60576H65775j233j274q51k45M00Q88J143J584K747M371N444N298M233K890J561
60561H92731L50o37j589k952m651n811n732m856m243m281m343l606j874M03K597
60546H51506M396N959P656R613J1665J3774J6205J9206K2748K6789L1543L7245
60534A058305M3681N0050N5095N7264N5148M8205L7150K3545Q944n497j8866l0234
60522A382790l8582m2974m2984l9152l2939k5895j8741j1400l913K983Q389J2132
60510A149714J4739J6538J7178J6316J4469J2819J2193J2604J3800J5924J9441
$$ plain form
60499 1315735 1340431 1372093 1412077 1461252 1520227 1589837 1671421 1766522 1876308 2001272 2141284
60488 2141284 2295969 2465463 2651281 2856450 3084815 3340623 3629178 3957350 4331970
60479 4331970 4755931 5223631 5717738 6208796 6658847 7028258 7282599 7396940 7358305 7168261
60469 7168261 6844442 6417746 5925207 5402710 4880775 4382635 3923102 3508981 3141708
60460 3141708 2820287 2542293 2303622 2098992 1923277 1772185 1642047 1529671 1432503 1348516
60450 1348516 1275809 1212473 1156734 1107143 1062800 1023457 989003 958635 930977 905282 881946
60439 881946 861364 842737 824695 806766 789592 773826 759501 746449 734720 724427 715541 707935
60427 707935 701412 695708 690724 686597 683282 680185 676613 672523 668645 665941 665119 666323 668922 671769
$$ packed form
60499A315735K4696L1662L9984M9175N8975O9610Q1584R5101J09786J24964J40012
60488B141284J54685J69494J85818K05169K28365K55808K88555L28172L74620
60479D331970M23961M67700M94107M91058M50051L69411K54341J14341l8635j90044
60469G168261l23819m26696m92539n22497n21935m98140m59533m14121l67273
60460C141708l21421k77994k38671k04630j75715j51092j30138j12376r7168q3987
60450A348516p2707o3336n5739m9591m4343l9343l4454l0368k7658k5695k3336
60439H81946k0582j8627j8042j7929j7174j5766j4325j3052j1729j0293q886p606
60427G07935o523n704m984m127l315l097l572m090l878k704q22J204K599K847
$$ plain form
60413 671769 674043 675758 677271 678659 679956 681585 683959 686838 689654 692332 695254 698500 701724 704803
60399 704803 708036 711674 715691 720142 725298 731300 737991 745115 752383 759314 765353 770182 773722 775955
60385 775955 777056 777543 777843 777804 776986 775301 772908 769640 765247 760291 756109 753607 752490 751906 751400 750985
60369 750985 750678 750423 750263 750227 750122 749664 748885 748308 748697 750545 753728 757634 761699 765797 770111 774814 779981
60352 779981 785588 791448 797338 803377 810055 817701 826154 835181 844855 855190 865712 875821 885331
60339 885331 894186 901897 907795 911695 913813 914155 912669 909942 907142 905129 904014 903694 904337 906266 909742
60324 909742 914874 921330 928104 933941 938100 940437 940859 939165 935450 930175 923810 916732 909443 902430
60310 902430 895818 889635 884396 880821 878896 877775 876808 876203 876405 877275 878184 878753 879352 880988 884588 890055
$$ packed form
60413F71769K274J715J513J388J297J629K374K879K816K678K922L246L224L079
60399G04803L233L638M017M451N156O002O691P124P268O931O039M829L540K233
60385G75955J101M87L00l9q18j685k393l268m393m956m182k502j117n84n06m15
60369G50985l07k55j60l6j05m58p79n77L89J848L183L906M065M098M314M703N167
60352G79981N607N860N890O039O678P646Q453R027R674J0335J0522J0109R510
60339H85331Q855P711N898L900K118L42j486k727k800k013j115l20O43J929L476
60324I09742N132O456O774N837M159K337M22j694l715n275o365p078p289p013
60310I02430o612o183n239l575j925j121r67o05K02Q70R09N69N99J636L600N467
$$ plain form
60294 890055 896195 901945 907416 913190 918903 923536 927042 930554 934606 938219 940362 941431 942390 943208 943266
60279 943266 942963 943668 945951 948849 951321 953732 957336 962663 969035 975700 982935 991760 1002752 1015495
60265 1015495 1029213 1043649 1059156 1076211 1095181 1116450 1140367 1167017 1196297 1228306 1263445
60254 1263445 1302158 1344780 1391597 1442764 1498230 1558148 1623433 1695595 1775879 1864771 1962311
60243 1962311 2068453 2182925 2304959 2433362 2566683 2703142 2840461 2975797 3105897
60234 3105897 3227619 3338682 3437845 3524088 3595888 3651700 3690994 3714156 3721423 3712731 3688896
60223 3688896 3652322 3606011 3552272 3492912 3430442 3368466 3310700 3259834 3217386 3184473 3162401
60212 3162401 3152427 3155161 3170659 3199302 3242180 3300277 3373483 3460795 3561209 3673888 3797562
$$ packed form
60294H90055O140N750N471N774N713M633L506L512M052L613K143J069R59Q18N8
60279I43266l03P05K283K898K472K411L604N327O372O665P235Q825J0992J2743
60265A015495J3718J4436J5507J7055J8970K1269K3917K6650K9280L2009L5139
60254A263445L8713M2622M6817N1167N5466N9918O5285P2162Q0284Q8892R7540
60243A962311J06142J14472J22034J28403J33321J36459J37319J35336J30100
60234C105897J21722J11063R9163Q6243P1800N5812L9294K3162P267q692k3835
60223C688896l6574m6311n3739n9360o2470o1976n7766n0866m2448l2913k2072
60212C162401r974K734J5498K8643M2878N8097P3206Q7312J00414J12679J23674
$$ plain form
60201 3797562 3930225 4069289 4211468 4352539 4487912 4613640 4726607 4823922 4902790 4961104
60191 4961104 4997660 5011694 5002808 4971430 4918877 4846917 4757880 4655306 4543715 4427387 4309827
60180 4309827 4194546 4085513 3986323 3899354 3826199 3768442 3727590 3704659 3700255 3714667 3747437
60169 3747437 3797152 3862086 3940774 4031562 4131789 4237697 4344877 4448615 4544301 4628180
60159 4628180 4697731 4751218 4787255 4805200 4805714 4790498 4761572 4721196 4672402 4619248 4566323 4517997
60147 4517997 4477923 4449108 4434348 4436309 4456852 4496404 4554500 4631076 4726934 4843099 4980354
60136 4980354 5139586 5322018 5528788 5760721 6018737 6303968 6617009 6957179 7322427
60127 7322427 7709251 8112346 8524904 8939875 9350697 9750556 10131456 10484774 10802720
$$ packed form
60201C797562J32663J39064J42179J41071J35373J25728J12967R7315P8868N8314
60191D961104L6556J4034q886l1378n2553p1960q9037j02574j11591j16328j17560
60180D309827j15281j09033r9190q6969p3155n7757m0852k2931m404J4412L2770
60169C747437M9715O4934P8688R0788J00227J05908J07180J03738R5686Q3879
60159D628180O9551N3487L6037J7945N14j5216k8926m0376m8794n3154n2925m8326
60147D517997m0074k8815j4760J961K0543L9552N8096P6576R5858J16165J37255
60136D980354J59232J82432K06770K31933K58016K85231L13041L40170L65248
60127G322427L86824M03095M12558M14971M10822L99859L80900L53318L17946
$$ plain form
60118 10802720 11079090 11308933 11488081 11613055 11681247 11691189 11642688 11536581 11374457 11159019
60108 11159019 10894847 10588506 10247949 9882263 9501916 9118306 8742263 8382832 8047343
60099 8047343 7741839 7471017 7238079 7044995 6892722 6781238 6710005 6678688 6686895 6732857
60089 6732857 6812783 6921605 7053799 7203219 7362931 7525772 7684643 7831959 7959611 8060356
60079 8060356 8129223 8163589 8162720 8127806 8061709 7967672 7848338 7706208 7544369 7366066 7174072
60068 7174072 6971266 6761508 6549146 6337691 6129559 5926940 5732455 5549100 5379984
60059 5379984 5227841 5094379 4980291 4886230 4813334 4762494 4733711 4726830 4742347 4780637 4840723
60048 4840723 4920647 5018908 5134712 5266626 5411439 5564199 5718838 5868894 6008324 6132045
$$ packed form
60118A0802720K76370K29843J79148J24974O8192R942m8501j06107j62124k15438
60108A1159019k64172l06341l40557l65686l80347l83610l76043l59431l35489
60099H047343l05504k70822k32938j93084j52273j11484p1233l1317Q207M5962
60089F732857P9926J08822J32194J49420J59712J62841J58871J47316J27652J00745
60079H060356O8867L4366q69l4914o6097r4037j19334j42130j61839j78303j91994
60068G174072k02806k09758k12362k11455k08132k02619j94485j83355j69116
60059E379984j52143j33462j14088r4061p2896n0840k8783o881J5517L8290O0086
60048D840723P9924R8261J15804J31914J44813J52760J54639J50056J39430J23721
$$ plain form
60038 6132045 6235860 6316300 6370826 6397778 6395781 6363593 6301017 6209636 6092424 5953159 5796641
60027 5796641 5628662 5454841 5279654 5106985 4940938 4785372 4643073 4516118 4406475
60018 4406475 4315388 4242644 4187535 4150328 4132057 4133326 4154323 4195678 4258202 4341967 4446668
60007 4446668 4572675 4720551 4889461 5076899 5279648 5493752 5713550 5932086 6142695
59998 6142695 6339227 6514983 6663242 6779702 6863324 6914180 6931458 6914205 6862937 6779618
59988 6779618 6666873 6528249 6368841 6194880 6012786 5828929 5649501 5479728 5323248
59979 5323248 5182724 5060808 4960123 4882602 4829236 4800205 4794888 4812103 4850690 4909573 4986967
59968 4986967 5079926 5185131 5299827 5421534 5547216 5673399 5797026 5915631 6026622 6126983
$$ packed form
60038F132045J03815Q0440N4526K6952j997l2188o2576r1381j17212j39265j56518
60027E796641j67979j73821j75187j72669j66047j55566j42299j26955j09643
60018D406475r1087p2744n5109l7207j8271J269K0997M1355O2524Q3765J04701
60007D446668J26007J47876J68910J87438K02749K14104K19798K18536K10609
59998F142695J96532J75756J48259J16460Q3622N0856J7278j7253n1268q3319
59988F779618j12745j38624j59408j73961j82094j83857j79428j69773j56480
59979E323248j40524j21916j00685p7521n3366k9031n317J7215L8587N8883P7394
59968D986967R2959J05205J14696J21707J25682J26183J23627J18605J10991J00361
$$ plain form
59958 6126983 6214033 6286329 6343562 6385617 6412062 6422804 6419260 6404651 6382984 6357889 6332549
59947 6332549 6310468 6295860 6293278 6307165 6341767 6401139 6489086 6609140 6764512 6957886 7191262
59936 7191262 7466060 7783157 8142576 8543183 8982611 9456728 9958399 10476612 10997006
59927 10997006 11502924 11975630 12394328 12737711 12987067 13129018 13156666 13069710 12874280 12582388
59917 12582388 12210765 11779177 11308263 10817286 10322641 9837640 9372853 8936315 8533966
59908 8533966 8170597 7850239 7575286 7345707 7159856 7016056 6913146 6850118 6826079 6840345
59898 6840345 6891829 6978435 7097735 7247964 7427313 7632125 7856345 8092430 8331711 8563745
59888 8563745 8776393 8957203 9094522 9177771 9198293 9151150 9036240 8857633 8622235 8338976
$$ packed form
59958F126983Q7050P2296N7233M2055K6445J0742l544j4609k1667k5095k5340
59947F332549k2081j4608k582J3887L4602N9372Q7947J20054J55372J93374K33376
59936G191262K74798L17097L59419M00607M39428M74117N01671N18213N20394
59927A0997006N05918M72706M18698L43383K49356J41951K7648q6956j95430k91892
59917A2582388l71623m31588m70914m90977m94645m85001m64787m36538m02349
59908H533966l63369l20358k74953k29579j85851j43800j02910o3028k4039J4266
59898F840345N1484Q6606J19300J50229J79349K04812K24220K36085K39281K32034
59888H563745K12648J80810J37319Q3249K0522m7143j14910j78607k35398k83259
$$ plain form
59878 8338976 8018293 7671531 7310369 6946054 6588111 6243551 5917628 5614949 5338928
59869 5338928 5090407 4868136 4671044 4499147 4352033 4227498 4122266 4033235 3957374 3891116
59859 3891116 3830696 3772892 3715241 3656110 3595108 3533137 3471746 3412707 3358140 3310229 3270355
59848 3270355 3238924 3216186 3202484 3197286 3198565 3203503 3209189 3212217 3208510 3194521 3168715 3131707
59836 3131707 3085487 3032871 2977050 2920763 2865808 2813538 2765573 2723698 2689265 2662914 2644625
59825 2644625 2633952 2630655 2635396 2649519 2673874 2708098 2751018 2801213 2857059 2916859 2979477 3044624
59813 3044624 3112401 3182885 3256177 3332185 3409816 3486528 3558701 3622171 3672764 3707457 3725767
59802 3725767 3729823 3722920 3708309 3689189 3668969 3650980 3638197 3633221 3637972 3653389 3680171 3719935
$$ packed form
59878H338976l20683l46762l61162l64315l57943l44560l25923l02679k76021
59869E338928k48521k22271j97092j71897j47114j24535j05232q9031p5861o6258
59859C891116o0420n7804n7651n9131o1002o1971o1391n9039n4567m7911l9874
59848C270355l1431k2738j3702n198J279M938N686L028l707j3989k5806l7008
59836C131707m6220n2616n5821n6287n4955n2270m7965m1875l4433k6351j8289
59825B644625j0673l297M741J4123K4355L4224M2920N0195N5846N9800O2618O5147
59813C044624O7777P0484P3292P6008P7631P6712P2173O3470N0593L4693J8310
59802C725767M056o903j4611j9120k0220j7989j2783m976M751J5417K6782L9764
$$ plain form
59790 3719935 3774934 3846656 3935725 4043495 4172796 4326753 4507874 4718852 4963343 5245245
59780 5245245 5567831 5933795 6344551 6797411 7282316 7780052 8261792 8690307 9025291
59771 9025291 9233225 9296801 9218261 9016347 8720419 8364104 7979096 7590705 7216786 6869088
59761 6869088 6554634 6276610 6035549 5830543 5659616 5519867 5408259 5322430 5260517 5220677
59751 5220677 5201312 5201321 5219600 5254778 5306056 5373928 5459377 5562729 5683859 5823067 5981018
59740 5981018 6158245 6355497 6574350 6816848 7084897 7380606 7706741 8066009 8460294
59731 8460294 8891357 9361848 9874522 10430519 11029017 11668052 12344261 13051312 13778947
59722 13778947 14513479 15238908 15938568 16597821 17206640 17760478 18259915 18710919 19125365
$$ packed form
59790C719935N4999P1722Q9069J07770J29301J53957J81121K10978K44491K81902
59780E245245L22586L65964M10756M52860M84905M97736M81740M28515L34984
59771I025291K07934O3576p8540k01914k95928l56315l85008l88391l73919l47698
59761F869088l14454k78024k41061k05006j70927j39749j11608q5829o1913l9840
59751E220677j9365RJ8279L5178N1278O7872Q5449J03352J21130J39208J57951
59740E981018J77227J97252K18853K42498K68049K95709L26135L59268L94285
59731H460294M31063M70491N12674N55997N98498O39035O76209P07051P27635
59722A3778947P34532P25429O99660O59253O08819N53838M99437M51004M14446
$$ plain form
59713 19125365 19519809 19912505 20320843 20760153 21242760 21776706 22364827 23004355 23686405
59704 23686405 24395746 25111868 25810915 26467092 27053823 27546080 27923701 28173790 28291487
59695 28291487 28280127 28151233 27923555 27621007 27270332 26898927 26532684 26194446 25903871
59686 25903871 25677923 25530680 25472826 25512129 25654731 25905849 26269810 26750448 27351513 28075754
59676 28075754 28922833 29887652 30959427 32120266 33342975 34589314 35809545 36943375
59668 36943375 37923184 38680673 39155911 39305810 39109924 38573204 37725379 36616481 35309620
59659 35309620 33873455 32375750 30877908 29430770 28072569 26828693 25711482 24719101
59651 24719101 23834461 23025928 22251409 21466484 20634963 19737322 18773032 17757000 16713460
$$ packed form
59713A9125365L94444L92696M08338M39310M82607N33946N88121O39528O82050
59704B3686405P09341P16122O99047O56177N86731M92257L77621K50089J17697
59695B8291487j1360j28894k27678l02548l50675l71405l66243l38238k90575
59686B5903871k25948j47243n7854L9303J42602K51118L63961M80638O01065P24241
59676B8075754Q47079R64819J071775J160839J222709J246339J220231J133830
59668C6943375R79809P57489M75238J49899j95886n36720q47825j108898j306861
59659C5309620j436165j497705j497842j447138j358201j243876j117211r92381
59651B4719101q84640q08533p74519p84925q31521q97641r64290j016032j043540
$$ plain form
59642 16713460 15669882 14651694 13678810 12764796 11917699 11140755 10433160 9791978 9214172
59633 9214172 8696613 8234625 7821881 7452225 7120981 6824510 6559528 6323314 6113710
59624 6113710 5928376 5764627 5620418 5494794 5386929 5295268 5217991 5153646 5100598 5056262
59614 5056262 5017372 4980780 4943639 4903222 4857073 4803160 4739665 4665191 4579765 4485341 4384768
59603 4384768 4280296 4173370 4065559 3959095 3856462 3759820 3670748 3590137 3518181 3454769
59593 3454769 3400027 3354360 3317870 3289895 3269386 3255772 3249324 3250474 3258831 3273067 3291790 3314191
59581 3314191 3339743 3367586 3396574 3425727 3454367 3481937 3508079 3532926 3557171 3581938 3608646
59570 3608646 3638845 3673966 3715318 3764276 3822107 3889527 3966786 4054323 4152889 4262958 4384776
$$ packed form
59642A6713460j043578j018188r72884r14014q47097p76944p07595o41182n77806
59633I214172n17559m61988m12744l69656l31244k96471k64982k36214k09604
59624F113710j85334j63749j44209j25624j07865r1661p7277o4345n3048m4336
59614E056262l8890l6592l7141m0417m6149n3913o3495p4474q5426r4424j00573
59603D384768j04472j06926j07811j06464j02633r6642q9072q0611p1956o3412
59593C454769n4742m5667l6490k7975k0509j3614o448J150Q357J4236J8723K2401
59581C314191K5552K7843K8988K9153K8640K7570K6142K4847K4245K4767K6708
59570C608646L0199L5121M1352M8958N7831O7420P7259Q7537R8566J10069J21818
$$ plain form
59559 4384776 4519337 4668584 4834075 5016178 5215276 5433017 5671269 5930208 6208404
59550 6208404 6504390 6816947 7143949 7481990 7827200 8175423 8521617 8860257 9186691
59541 9186691 9497429 9789253 10059492 10307705 10535854 10745610 10935693 11102441 11242853
59532 11242853 11357162 11449461 11526743 11597076 11667852 11745098 11833715 11937305 12057028 12190508
59522 12190508 12331580 12470573 12594958 12690796 12744662 12744940 12682308 12550403 12346827 12073418
59512 12073418 11735490 11340990 10900102 10424636 9927001 9419441 8913559 8419496 7945004
59503 7945004 7495478 7074692 6685029 6327321 6001467 5707575 5445874 5215451 5013964
59494 5013964 4838966 4688840 4562128 4456690 4370157 4300853 4247940 4211108 4190445 4186106 4197707
$$ packed form
59559D384776J34561J49247J65491J82103J99098K17741K38252K58939K78196
59550F208404K95986L12557L27002L38041L45210L48223L46194L38640L26434
59541I186691L10738K91824K70239K48213K28149K09756J90083J66748J40412
59532A1242853J14309R2299P7282P0333P0776P7246Q8617J03590J19723J33480
59522A2190508J41072J38993J24385R5838N3866K78o2632j31905k03576k73409
59512A2073418l37928l94500m40888m75466m97635n07560n05882m94063m74492
59503G945004m49526m20786l89663l57708l25854k93892k61701k30423k01487
59494E013964j74998j50126j26712j05438q6533o9304n2913l6832k0663m339J1601
$$ plain form
59483 4197707 4224429 4266022 4323324 4397521 4489324 4599091 4727207 4873957 5039445 5224091
59473 5224091 5428827 5654313 5900080 6164576 6445601 6740072 7043287 7348405 7646483
59464 7646483 7927046 8179141 8392310 8556885 8664102 8707158 8682810 8591959 8438828 8230022
59454 8230022 7974128 7681078 7361077 7024001 6679397 6335985 6000581 5677874 5371391
59445 5371391 5084055 4817581 4572115 4347143 4142452 3957877 3792542 3644866 3513124
59436 3513124 3395760 3291486 3199424 3118990 3049504 2990135 2940256 2899408 2866845 2841559 2822875
59425 2822875 2810589 2804398 2803721 2808156 2817522 2831211 2848112 2867514 2889617 2914854 2943256 2974890
59413 2974890 3010595 3051720 3098880 3150537 3202456 3249194 3287510 3319008 3349085 3383243 3424851
$$ packed form
59483D197707K6722M1593N7302P4197R1803J09767J28116J46750J65488J84646
59473E224091K04736K25486K45767K64496K81025K94471L03215L05118K98078
59464G646483K80563K52095K13169J64575J07217M3056k4348r0851j53131k08806
59454H230022k55894k93050l20001l37076l44604l43412l35404l22707l06483
59445E371391k87336k66474k45466k24972k04691j84575j65335j47676j31742
59436C513124j17364j04274r2062q0434o9486n9369m9879m0848l2563k5286j8684
59425B822875j2286o191o77M435R366J3689J6901J9402K2103K5237K8402L1634
59413B974890L5705M1125M7160N1657N1919M6738L8316L1498L0077L4158M1608
$$ plain form
59402 3424851 3476073 3539523 3618316 3715104 3831174 3965369 4113526 4270413 4433767 4606564
59392 4606564 4795216 5006227 5244845 5515526 5822185 6167993 6555709 6988006 7466856
59383 7466856 7992534 8563261 9174953 9820384 10488625 11165637 11835489 12481616 13088764
59374 13088764 13645379 14144646 14583433 14961199 15280289 15545984 15764610 15941247 16079192
59365 16079192 16180375 16244863 16270097 16251597 16184560 16064486 15887239 15650326 15355092 15007817
59355 15007817 14619099 14202671 13773982 13347923 12936218 12545961 12179659 11835795 11509444
59346 11509444 11193339 10879339 10559885 10229228 9884297 9524702 9151999 8769333 8381774
59337 8381774 7996079 7619204 7256867 6913417 6592194 6295287 6023339 5776289 5554163
$$ packed form
59402C424851N1222O3450P8793R6788J16070J34195J48157J56887J63354J72797
59392D606564J88652K11011K38618K70681L06659L45808L87716M32297M78850
59383G466856N25678N70727O11692O45431O68241O77012O69852O46127O07148
59374A3088764N56615M99267M38787L77766L19090K65695K18626J76637J37945
59365A6079192J01183O4488K5234j8500o7037j20074j77247k36913k95234l47275
59355A5007817l88718m16428m28689m26059m11705l90257l66302l43864l26351
59346A1509444l16105l14000l19454l30657l44931l59595l72703l82666l87559
59337H381774l85695l76875l62337l43450l21223k96907k71948k47050k22126
$$ plain form
59328 5554163 5356805 5183290 5032184 4902123 4791644 4698848 4621909 4559777 4511864 4477133
59318 4477133 4453932 4440674 4436530 4441742 4457404 4484348 4521854 4567881 4620838 4680437 4746285 4816355
59306 4816355 4887485 4956817 5022047 5080932 5131550 5172756 5203639 5222951 5229979 5225692 5212257 5191694
59294 5191694 5165820 5137103 5108486 5082484 5061298 5047688 5044634 5053971 5076187 5111719 5161776 5227820
59282 5227820 5310894 5411569 5529790 5664526 5814033 5976451 6149658 6330495 6514723 6697671
59272 6697671 6874376 7039219 7186380 7311115 7410155 7480713 7519618 7523836 7491929 7425372 7329200
59261 7329200 7211502 7081629 6947990 6816832 6692192 6576309 6470163 6374108 6288032 6210808
59251 6210808 6140183 6073933 6011032 5951168 5893479 5836740 5780958 5728083 5680885 5641668 5612343
$$ packed form
59328E554163j97358j73515j51106j30061j10479r2796p6939o2132m7913l4731
59318D477133k3201j3258m144N212J5662K6944L7506M6027N2957N9599O5848P0070
59306D816355P1130O9332O5230N8885N0618M1206L0883J9312P028m287j3435k0563
59294E191694k5874k8717k8617k6002k1186j3610l054R337K2216L5532N0057O6044
59282E227820Q3074J00675J18221J34736J49507J62418J73207J80837J84228J82948
59272F697671J76705J64843J47161J24735R9040P0558L8905M218l1907o6557r6172
59261G329200j17698j29873j33639j31158j24640j15883j06146r6055q6076p7224
59251F210808p0625o6250o2901n9864n7689n6739n5782n2875m7198l9217k9325
$$ plain form
59240 5612343 5595211 5593197 5609378 5646558 5707318 5794432 5911083 6060409 6244807 6466019 6725923
59229 6725923 7026533 7368456 7749250 8163235 8602116 9055029 9508072 9944399 10345132
59220 10345132 10690784 10963203 11147610 11233470 11214107 11086860 10854616 10526730 10117622 9644459
59210 9644459 9126039 8582089 8031268 7488896 6966602 6473330 6015427 5595865 5214728
59201 5214728 4871009 4563592 4290823 4050178 3838713 3653297 3490472 3346882 3220173
59192 3220173 3108973 3011882 2926904 2851767 2784363 2723006 2666839 2616005 2570896 2531257 2496416
59181 2496416 2466055 2440188 2418719 2401728 2389902 2383764 2382587 2384888 2389969 2398238 2410276 2426549
59169 2426549 2447791 2474436 2505487 2539102 2574751 2613858 2657991 2707302 2761225 2819681 2882902
$$ packed form
59240E612343j7132k014J6181L7180O0760Q7114J16651J49326J84398K21212K59904
59229F725923L00610L41923L80794M13985M38881M52913M53043M36327M00733
59220A0345132L45652K72419J84407Q5860j9363j27247k32244l27886m09108m73163
59210I644459n18420n43950n50821n42372n22294m93272m57903m19562l81137
59201E214728l43719l07417k72769k40645k11465j85416j62825j43590j26709
59192C220173j11200r7091q4978p5137o7404o1357n6167n0834m5109l9639l4841
59181B496416l0361k5867k1469j6991j1826o138j177K301N081Q269J2038J6273
59169B426549K1242K6645L1051L3615L5649L9107M4133M9311N3923N8456O3221
$$ plain form
59158 2882902 2950674 3022558 3098556 3178956 3263674 3352107 3443404 3536501 3629962 3721930 3810207
59147 3810207 3892472 3966803 4032010 4087156 4130813 4161214 4177217 4178892 4167317 4144226 4111811
59136 4111811 4072362 4028023 3981145 3934615 3891267 3853063 3821332 3797663 3783913 3781444 3791068 3813742
59124 3813742 3850647 3902428 3969018 4050430 4147269 4260251 4389589 4535019 4696191 4873148
59114 4873148 5066621 5277636 5506447 5752060 6013059 6288258 6575702 6871276 7168863
59105 7168863 7461212 7739543 7992699 8208258 8375243 8485660 8534348 8519182 8442108 8309012
59095 8309012 8127967 7907810 7657812 7386943 7102344 6808870 6510318 6210421 5912526
59086 5912526 5619232 5332813 5055424 4788627 4533468 4291311 4063874 3852059 3655351
$$ packed form
59158B882902O7772P1884P5998Q0400Q4718Q8433R1297R3097R3461R1968Q8277
59147C810207Q2265P4331O5207N5146M3657L0401J6003J675j1575k3091l2415
59136D111811l9449m4339m6878m6530m3348l8204l1731k3669j3750k469R624K2674
59124C813742L6905N1781O6590Q1412R6839J12982J29338J45430J61172J76957
59114D873148J93473K11015K28811K45613K60999K75199K87444K95574K97587
59105G168863K92349K78331K53156K15559J66985J10417M8688j5166p7074j33096
59095H309012j81045k20157k49998k70869k84599k93474k98552k99897k97895
59086E912526k93294k86419k77389k66797k55159k42157k27437k11815j96708
$$ plain form
59077 3655351 3472669 3303197 3146185 3000728 2866253 2742704 2629910 2527152 2433555 2348385
59067 2348385 2270871 2200372 2136844 2080454 2030590 1985975 1945934 1910821 1880961 1856016 1835639
59056 1835639 1819774 1807736 1797737 1787893 1777151 1764742 1749416 1729904 1705784 1677479 1645731 1611487
59044 1611487 1575944 1540379 1506101 1474530 1446764 1422929 1402446 1385019 1370825 1359788 1351503
59033 1351503 1346046 1344043 1345709 1350623 1358701 1370477 1385936 1403824 1422566 1441121 1458500 1473283
59021 1473283 1484345 1491624 1495700 1497150 1496644 1495022 1492763 1489985 1487392 1486513 1488358 1492500 1498201 1505903
59007 1505903 1516786 1531121 1547751 1565085 1582030 1598042 1612687 1625289 1634923 1640991 1643749 1643976
58995 1643976 1642175 1638606 1634032 1629713 1626470 1624357 1623398 1623943 1626102 1629580 1634344 1640729 1648615 1657278
$$ packed form
59077C655351j82682j69472j57012j45457j34475j23549j12794j02758r3597q5170
59067B348385p7514p0499o3528n6390m9864m4615m0041l5113k9860k4945k0377
59056A835639j5865j2038r999r844j0742j2409j5326j9512k4120k8305l1748l4244
59044A611487l5543l5565l4278l1571k7766k3835k0483j7427j4194j1037q285
59033A351503n457k003J666M914Q078J1776J5459J7888J8742J8555J7379J4783
59021A473283J1062P279M076J450n06j622k259k778k593q79J845M142N701P702
59007A505903J0883J4335J6630J7334J6945J6012J4645J2602R634O068K758K27
58995A643976j801l569m574m319l243k113r59N45K159L478M764O385P886Q663
$$ plain form
58981 1657278 1666418 1676600 1688290 1701180 1714909 1729715 1745925 1763522 1782705 1804212 1828550
58970 1828550 1855527 1885030 1917626 1953838 1993437 2035888 2080841 2127618 2174978 2222051 2268965
58959 2268965 2315910 2362133 2406537 2448807 2489310 2528440 2566785 2605634 2646584 2690750 2738769
58948 2738769 2791253 2848840 2912126 2981906 3059125 3144291 3237311 3338242 3447831 3567026 3696451
58937 3696451 3836636 3988312 4152267 4329431 4521344 4729955 4956780 5202940 5470250
58928 5470250 5761470 6079254 6425684 6803080 7214285 7661714 8147091 8672680 9241711
58919 9241711 9856879 10519254 11229128 11986519 12789404 13631763 14503863 15393173 16283444
58910 16283444 17153097 17975609 18721729 19361621 19866961 20213854 20385642 20374254 20180677
$$ packed form
58981A657278R140J0182J1690J2890J3729J4806J6210J7597J9183K1507K4338
58970A828550K6977K9503L2596L6212L9599M2451M4953M6777M7360M7073M6914
58959B268965M6945M6223M4404M2270M0503L9130L8345L8849M0950M4166M8019
58948B738769N2484N7587O3286O9780P7219Q5166R3020J00931J09589J19195J29425
58937C696451J40185J51676J63955J77164J91913K08611K26825K46160K67310
58928E470250K91220L17784L46430L77396M11205M47429M85377N25589N69031
58919I241711O15168O62375P09874P57391Q02885Q42359Q72100Q89310Q90271
58910A6283444Q69653Q22512P46120O39892N05340L46893J71788j1388j93577
$$ plain form
58901 20180677 19815327 19297216 18651155 17904737 17086679 16225181 15345192 14466588 13605077
58892 13605077 12773879 11983511 11240725 10549136 9910853 9326785 8795902 8315404 7881587
58883 7881587 7489936 7134993 6811352 6514842 6242113 5989473 5753062 5530010 5318714
58874 5318714 5118288 4928463 4749680 4582419 4426585 4282109 4149549 4029212 3920026
58865 3920026 3820224 3728909 3646142 3571831 3505441 3446538 3394733 3349270 3309539 3275867 3248990
58854 3248990 3228889 3214867 3206622 3204465 3208630 3219075 3235840 3258981 3288391 3324290 3367511 3418508
58842 3418508 3476374 3539689 3608286 3683476 3766763 3858960 3960391 4071225 4191761 4322890
58832 4322890 4466110 4622576 4792583 4976536 5175974 5392975 5629067 5885584 6164686
$$ packed form
58901B0180677l65350n18111o46061p46418q18058q61498q79989q78604q61511
58892A3605077q31198p90368p42786o91589o38283n84068n30883m80498m33817
58883G881587l91651l54943l23641k96510k72729k52640k36411k23052k11296
58874E318714k00426j89825j78783j67261j55834j44476j32560j20337j09186
58865C920026r9802r1315q2767p4311o6390n8903n1805m5463l9731l3672k6877
58854C248990k0101j4022q245k157M165J0445J6765K3141K9410L5899M3221N0997
58842C418508N7866O3315O8597P5190Q3287R2197J01431J10834J20536J31129
58832D322890J43220J56466J70007J83953J99438K17001K36092K56517K79102
$$ plain form
58823 6164686 6469112 6801226 7163261 7558295 7990110 8462058 8976700 9536358 10143209
58814 10143209 10798678 11502834 12253773 13046764 13873885 14724239 15583316 16431350 17243126
58805 17243126 17990471 18644822 19177831 19562389 19776680 19808835 19658071 19332844 18849447
58796 18849447 18231234 17506147 16702963 15849074 14969917 14087857 13220588 12381101 11579039
58787 11579039 10821096 10110507 9447702 8832063 8262590 7737363 7253750 6809425 6402416
58778 6402416 6030245 5689961 5378983 5095018 4835235 4596402 4375807 4171198 3980078
58769 3980078 3800110 3630238 3470506 3320878 3181079 3051325 2932093 2823136 2723623 2633071
58759 2633071 2551216 2477172 2409812 2348861 2294558 2246346 2202986 2163844 2128959 2097827 2069321
$$ packed form
58823F164686L04426L32114L62035L95034M31815M71948N14642N59658O06851
58814A0143209O55469P04156P50939P92991Q27121Q50354Q59077Q48034Q11776
58805A7243126P47345O54351N33009L84558K14291L2155j50764l25227m83397
58796A8849447o18213p25087q03184q53889q79157q82060q67269q39487q02062
58787A1579039p57943p10589o62805o15639n69473n25227m83613m44325m07009
58778F402416l72171l40284l10978k83965k59783k38833k20595k04609j91120
58769C980078j79968j69872j59732j49628j39799j29754j19232j08957r9513r0552
58759B633071q1855p4044o7360o0951n4303m8212m3360l9142l4885l1132k8506
$$ plain form
58748 2069321 2042848 2018590 1996541 1976286 1957671 1940595 1924257 1907738 1891333 1876017 1861539
58737 1861539 1846284 1829263 1811044 1792476 1773670 1754552 1735277 1715595 1694764 1672538 1649480
58726 1649480 1625882 1601125 1574433 1545610 1514838 1482383 1448720 1414446 1379998 1345956 1313365
58715 1313365 1283018 1254624 1227478 1201753 1178242 1157060 1137594 1119527 1102841 1086970 1071137
58704 1071137 1055575 1041420 1029388 1019473 1011682 1005852 1000834 995204 988924 983188 978606 974710 971235
58691 971235 968499 966339 963927 960882 957379 952913 946251 937025 926316 915321 904448 894023 884745
58678 884745 877015 870671 865735 862603 861292 861352 862633 865236 868545 871243 872432 872063 870523 868846 869067
58663 869067 872922 880034 888370 896428 903756 909605 912771 913111 911889 910343 908997 908431 909379 911924 915910
$$ packed form
58748B069321k6473k4258k2049k0255j8615j7076j6338j6519j6405j5316j4478
58737A861539j5255j7021j8219j8568j8806j9118j9275j9682k0831k2226k3058
58726A649480k3598k4757k6692k8823l0772l2455l3663l4274l4448l4042l2591
58715A313365l0347k8394k7146k5725k3511k1182j9466j8067j6686j5871j5833
58704A071137j5562j4155j2032r915p791n830n018n630o280n736m582l896l475
58691I71235k736k160k412l045l503m466o662r226j0709j0995j0873j0425r278
58678H84745p730o344m936l132j311O0J281K603L309K698J189l69j540j677K21
58663H69067L855P112Q336Q058P328N849L166L40j222j546j346n66R48K545L986
$$ plain form
58648 915910 922217 932175 945548 960540 975996 992190 1009350 1027115 1045796 1066537 1089814 1115278
58636 1115278 1143414 1175641 1212301 1252208 1294819 1341286 1392842 1449829 1512939 1583622 1662441
58625 1662441 1748773 1843116 1948168 2066594 2199210 2346391 2509816 2691502 2892197 3111656
58615 3111656 3349312 3603571 3871273 4148338 4429393 4705609 4964065 5190464 5372025
58606 5372025 5498028 5560219 5555055 5485179 5357813 5182369 4969919 4732934 4483211 4229875
58596 4229875 3979650 3737943 3508740 3294308 3095860 2913927 2747815 2596041 2458048
58587 2458048 2334449 2225137 2128546 2043447 1969938 1907728 1854930 1809521 1770623 1737374 1708062
58576 1708062 1681503 1657725 1635995 1613665 1588415 1560322 1530290 1497946 1462996 1427452 1394444
$$ packed form
58648I15910O307R958J3373J4992J5456J6194J7160J7765J8681K0741K3277K5464
58636A115278K8136L2227L6660L9907M2611M6467N1556N6987O3110P0683P8819
58625A662441Q6332R4343J05052J18426J32616J47181J63425J81686K00695K19459
58615C111656K37656K54259K67702K77065K81055K76216K58456K26399J81561
58606E372025J26003O2191n164o9876j27366j75444k12450k36985k49723k53336
58596D229875k50225k41707k29203k14432j98448j81933j66112j51774j37993
58587B458048j23599j09312r6591q5099p3509o2210n2798m5409l8898l3249k9312
58576A708062k6559k3778k1730k2330k5250k8093l0032l2344l4950l5544l3008
$$ plain form
58565 1394444 1365316 1339460 1316271 1295520 1276266 1257099 1237383 1217178 1196341 1174899 1153900
58554 1153900 1134718 1117831 1103078 1090565 1080359 1071880 1064623 1058940 1055218 1052865 1050922 1048990 1046746
58541 1046746 1043371 1038457 1032655 1026448 1019033 1009425 997925 985522 972626 959448 946813 935369
58529 935369 924566 913437 901824 889923 877361 863767 849647 835768 822278 809241 797276
58518 797276 786751 777056 767614 758880 751524 745424 740315 736603 734568 733523 732645 731894 731410 730937 730625
58503 730625 731307 733076 734685 735328 735965 737871 740944 744488 748542 753266 757989 762054 765739 769398 772696
58488 772696 775640 779193 783837 788693 793115 797870 803614 809553 814853 820056 825729 831132 835626 839982
58474 839982 844670 848203 848899 847088 843887 839095 832191 824206 816475 808440 798751 787805 777257 767651
$$ packed form
58565A394444k9128k5856k3189k0751j9254j9167j9716k0205k0837k1442k0999
58554A153900j9182j6887j4753j2513j0206q479p257n683l722k353j943j932k244
58541A046746l375m914n802o207p415r608j1500j2403j2896j3178j2635j1444
58529I35369j0803j1129j1613j1901j2562j3594j4120j3879j3490j3037j1965
58518G97276j0525r695r442q734p356o100n109l712k035j045q78p51m84m73l12
58503G30625O82J769J609O43O37J906L073L544M054M724M723M065L685L659L298
58488G72696K944L553M644M856M422M755N744N939N300N203N673N403M494M356
58474H39982M688L533O96j811l201m792o904p985p731q035r689j0946j0548r606
$$ plain form
58460 767651 758404 749525 741542 734276 727350 721382 717047 713544 709543 705070 701034 697644 694777 693115
58446 693115 693289 694592 696033 697855 700603 703704 706619 710374 716123 723134 729983 736820 744531 752528
58432 752528 759358 764784 769378 772815 774513 775305 776625 778630 780884 784048 789017 795167 801435 808319
58418 808319 816755 825775 833450 839573 845362 851066 855982 860322 865054 870210 875174 880020 884827 888460
58404 888460 889975 890455 891388 892046 890615 887136 883088 878806 873693 868443 864605 862260 860321 858753 858385
58389 858385 859005 859796 861224 864307 868457 872185 875471 879447 884221 889086 894208 900008 905576 909920 914095
58374 914095 919884 927098 934421 942051 951075 961048 970749 980515 991199 1001569 1009519 1015263 1020733 1026496
58360 1026496 1031992 1037977 1045695 1054123 1061089 1066718 1072944 1080077 1086780 1092987 1099810 1106875 1112738 1117659
$$ packed form
58460G67651r247q879p983p266o926n968m335l503m001m473m036l390k867j662
58446F93115J74J303J441J822K748L101K915L755N749P011O849O837P711P997
58432G52528O830N426M594L437J698P92J320K005K254L164M969O150O268O884
58418H08319Q436R020P675O123N789N704M916M340M732N156M964M846M807L633
58404H88460J515M80R33O58j431l479m048m282n113n250l838k345j939j568l68
58389H58385O20P91J428L083M150L728L286L976M774M865N122N800N568M344M175
58374I14095N789P214P323P630R024R973R701R766J0684J0370P950N744N470N763
58360A026496N496N985P718Q428O966N629O226P133O703O207O823P065N863M921
$$ plain form
58346 1117659 1123047 1128479 1132214 1134367 1136700 1139711 1142850 1146973 1153441 1161284 1168525 1175799 1185368 1197077
58332 1197077 1208799 1220418 1233756 1248810 1263760 1278507 1294514 1311242 1326464 1340128 1354279
58321 1354279 1369200 1383308 1396797 1411586 1427598 1442910 1457667 1474081 1492364 1510390 1527388
58310 1527388 1544230 1560229 1573692 1585605 1598687 1612861 1625852 1638069 1652280 1668455 1683785
58299 1683785 1698119 1714551 1734098 1754664 1775802 1799469 1825256 1849898 1872630 1896300 1922097
58288 1922097 1947964 1973256 2000118 2029052 2057950 2086707 2117953 2151994 2185887 2218919 2254238
58277 2254238 2293756 2336077 2380507 2428212 2478355 2528068 2577290 2628576 2681319 2731701 2779328
58266 2779328 2828130 2879613 2931213 2982598 3037282 3096323 3156691 3217671 3282676 3352849 3425103
$$ packed form
58346A117659N388N432L735K153K333L011L139M123O468P843P241P274R569J1709
58332A197077J1722J1619J3338J5054J4950J4747J6007J6728J5222J3664J4151
58321A354279J4921J4108J3489J4789J6012J5312J4757J6414J8283J8026J6998
58310A527388J6842J5999J3463J1913J3082J4174J2991J2217J4211J6175J5330
58299A683785J4334J6432J9547K0566K1138K3667K5787K4642K2732K3670K5797
58288A922097K5867K5292K6862K8934K8898K8757L1246L4041L3893L3032L5319
58277B254238L9518M2321M4430M7705N0143M9713M9222N1286N2743N0382M7627
58266B779328M8802N1483N1600N1385N4684N9041O0368O0980O5005P0173P2254
$$ plain form
58255 3425103 3498380 3575537 3657217 3740435 3825114 3915210 4011379 4109531 4208670 4312952 4423948
58244 4423948 4538399 4655845 4780678 4914257 5053073 5197067 5351252 5516462 5687520
58235 5687520 5863563 6050921 6252613 6464641 6686236 6923602 7179443 7449106 7731500
58226 7731500 8033346 8358048 8701417 9063306 9452094 9872456 10320692 10797901 11315456
58217 11315456 11881381 12494052 13155621 13878333 14671460 15536811 16484313 17536914 18713349
58208 18713349 20023495 21489107 23151559 25052100 27226682 29731023 32647952 36057424
58200 36057424 40022198 44615047 49935880 56095909 63226688 71533062 81319509 92970184
58192 92970184 106960676 123905576 144544407 169702185 200351153 237505430 281289557
$$ packed form
58255C425103P3277P7157Q1680Q3218Q4679R0096R6169R8152R9139J04282J10996
58244D423948J14451J17446J24833J33579J38816J43994J54185J65210J71058
58235E687520J76043J87358K01692K12028K21595K37366K55841K69663K82394
58226G731500L01846L24702L43369L61889L88788M20362M48236M77209N17555
58217A1315456N65925O12671O61569P22712P93127Q65351R47502J052601J176435
58208A8713349J310146J465612J662452J900541K174582K504341K916929L409472
58200C6057424L964774M592849N320833O160029P130779Q306374R786447J1650675
58192I2970184J3990492J6944900K0638831K5157778L0648968L7154277M3784127
$$ plain form
58185 281289557 329194558 374998041 410118858 427232194 423633846 401879701 367682778
58178 367682778 327143070 285114201 244871059 208329597 176345082 149047833 126171167
58171 126171167 107251821 91721022 78996278 68572884 60040862 53049766 47304701
58164 47304701 42587677 38740776 35625377 33121975 31158450 29703014 28731129 28229236
58156 28229236 28225566 28782089 29962302 31854476 34614328 38358245 42867543 47368309 50711618
58147 50711618 51924625 50707662 47485693 43047682 38136777 33268634 28753059 24755261
58139 24755261 21327251 18442526 16044408 14071997 12456894 11125466 10017413 9093171
58131 9093171 8321111 7669887 7116290 6647524 6249569 5902437 5590837 5309810 5054972
$$ packed form
58185B81289557M7905001M5803483L5120817J7113336l598348k1754145l4196923
58178C67682778m0539708m2028869m0243142l6541462l1984515k7297249k2876666
58171A26171167j8919346j5530799j2724744j0423394q532022o991096n745065
58164D7304701m717024l846901l115399k503402j963525j455436r71885n01893
58156B8229236l670N56523J180213J892174K759852L743917M509298M500766L343309
58147E0711618J213007j216963l221969m438011m910905m868143m515575l997798
58139B4755261l428010k884725k398118j972411j615103j331428j108053r24242
58131I093171p72060o51224n53597m68766l97955l47132l11600k81027k54838
$$ plain form
58122 5054972 4816018 4584780 4361662 4149046 3945543 3751308 3571628 3409897 3262971
58113 3262971 3128051 3008071 2905683 2817564 2739050 2668716 2603853 2537126 2463187 2384426 2305809
58102 2305809 2228282 2151360 2077568 2009508 1946130 1886177 1831851 1785107 1743581 1703899 1665936
58091 1665936 1630521 1596285 1562156 1529729 1499948 1470603 1440109 1410383 1382972 1355844 1327273
58080 1327273 1299450 1274743 1251569 1227447 1203226 1180931 1160249 1140423 1122952 1109064 1096956
58069 1096956 1084529 1072430 1061717 1051226 1040052 1029802 1021429 1012694 1001885 991291 983775 978420
58057 978420 972727 966525 960398 952760 942113 930222 919733 910423 900790 891347 883282 875820 868025
58044 868025 861349 857394 854963 852309 850451 851190 853597 855585 857261 859732 862275 863903 866151 870979
$$ packed form
58122E054972k38954k31238k23118k12616k03503j94235j79680j61731j46926
58113C262971j34920j19980j02388q8119p8514p0334o4863o6727p3939p8761p8617
58102B305809p7527p6922p3792o8060o3378n9953n4326m6744m1526l9682l7963
58091A665936l5415l4236l4129l2427k9781k9345l0494k9726k7411k7128k8571
58080A327273k7823k4707k3174k4122k4221k2295k0682j9826j7471j3888j2108
58069A096956j2427j2099j0713j0491j1174j0250q373q735j0809j0594p516n355
58057I78420n693o202o127p638j0647j1891j0489r310r633r443q065p462p795
58044H68025o676l955k431k654j858P39K407J988J676K471K543J628K248M828
$$ plain form
58030 870979 877162 881850 884524 886435 887367 886220 883858 882292 881655 880701 879463 878763 877871 875330 871454
58015 871454 867570 863547 858498 853046 848378 843875 838166 831736 826028 820731 814613 808382 804041 801704
58001 801704 799532 796579 793476 790486 787026 782995 778674 773552 767004 759762 753046 746712 739965 733360
57987 733360 728406 725743 725283 727384 732145 738229 744102 749780 755815 761569 766311 770998 776856 782909
57973 782909 787028 788850 789712 790217 789830 788392 786192 782974 778603 774156 770703 767690 764182 760884 759068
57958 759068 758274 757089 755494 754439 753732 752446 750856 749933 749386 748228 746873 746642 747594 748815 750423 753185
57942 753185 756465 758649 759481 760067 760715 760631 759545 757815 755124 750888 745751 740856 735876 729587 722093
57927 722093 714557 707004 698362 688662 679375 671650 665900 662794 662714 664485 666602 669564 674929 682325 689650
$$ packed form
58030H70979O183M688K674J911R32j147k362j566o37r54j238p00q92k541l876
58015H71454l884m023n049n452m668m503n709o430n708n297o118o231m341k337
58001H01704k172k953l103k990l460m031m321n122o548p242o716o334o747o605
57987G33360m954k663m60K101M761O084N873N678O035N754M742M687N858O053
57973G82909M119J822Q62N05l87j438k200l218m371m447l453l013l508l298j816
57958G59068p94j185j595j055p07j286j590r23n47j158j355k31R52J221J608K762
57942G53185L280K184Q32N86O48q4j086j730k691m236n137m895m980o289p494
57927G22093p536p553q642r700r287p725n750l106q0J771K117K962N365P396P325
$$ plain form
57912 689650 696247 703519 712149 721013 729397 738137 747798 757594 766846 775848 784605 792195 798050 802500
57898 802500 805644 807069 807054 806560 805618 803162 798888 793848 788818 783496 777767 772243 767009 761254 754805
57883 754805 748702 743715 739464 735574 732505 730636 729585 729012 729158 730223 732142 735234 740018 746137 752580
57868 752580 759161 766665 775274 784055 792255 799927 807011 813068 818218 823084 827422 830095 830844 830816 830867
57853 830867 830594 829541 828068 826369 823794 820016 815874 812336 809407 806659 803992 801319 798348 795280
57839 795280 792999 791928 791375 790453 789005 787212 785040 782538 780046 777635 774816 771112 766440 760770 754043
57824 754043 746553 738842 731112 723329 715823 709087 703142 697887 693801 691219 689117 686009 682103 679236
57810 679236 678439 678910 679697 680907 682649 684252 685496 687546 691622 697467 703979 710734 718133 726556 736190
$$ packed form
57912F89650O597P272Q630Q864Q384Q740R661R796R252R002Q757P590N855M450
57898H02500L144J425j5m94r42k456m274n040n030n322n729n524n234n755o449
57883G54805o103m987m251l890l069j869j051n73J46J065J919L092M784O119O443
57868G52580O581P504Q609Q781Q200P672P084O057N150M866M338K673P49k8N1
57853H30867k73j053j473j699k575l778m142l538k929k748k667k673k971l068
57839G95280k281j071n53r22j448j793k172k502k492k411k819l704m672n670o727
57824G54043p490p711p730p783p506o736n945n255m086k582k102l108l906k867
57810F79236p97M71P87J210J742J603J244K050M076N845O512O755P399Q423R634
$$ plain form
57795 736190 747332 760293 775097 791443 808534 824797 838359 848154 854356 857762 859347 860257 861347
57782 861347 862410 862466 860958 858110 854210 849376 844074 839021 834396 829876 825474 821582 818216 815118 812613
57767 812613 811409 811505 812293 813755 816459 820254 824207 828155 833128 839764 847314 854735 861837 868867 875795
57752 875795 882538 889172 895571 901472 907177 913443 920506 927899 935256 942466 949099 954762 960054 966037
57738 966037 972672 978961 984706 990790 997646 1004888 1012655 1021616 1031233 1039819 1047070 1054907 1064903 1076472
57724 1076472 1088651 1102025 1117492 1134488 1152043 1170537 1190816 1212349 1233886 1255448 1278196
57713 1278196 1302590 1327938 1353691 1380208 1408344 1439000 1472829 1509700 1548848 1590169 1634972
57702 1634972 1684826 1740206 1800970 1867643 1941464 2023578 2114858 2216115 2327980 2451126 2587179
$$ packed form
57795G36190J1142J2961J4804J6346J7091J6263J3562R795O202L406J585R10J090
57782H61347J063N6j508k848l900m834n302n053m625m520m402l892l366l098k505
57767H12613j204R6P88J462K704L795L953L948M973O636P550P421P102P030O928
57752H75795O743O634O399N901N705O266P063P393P357P210O633N663N292N983
57738I66037O635O289N745O084O856P242P767Q961R617Q586P251P837R996J1569
57724A076472J2179J3374J5467J6996J7555J8494K0279K1533K1537K1562K2748
57713A278196K4394K5348K5753K6517K8136L0656L3829L6871L9148M1321M4803
57702A634972M9854N5380O0764O6673P3821Q2114R1280J01257J11865J23146J36053
$$ plain form
57691 2587179 2738737 2907847 3095044 3300390 3524533 3767800 4028688 4303709 4587519
57682 4587519 4871831 5144758 5392533 5602201 5762927 5866655 5909919 5895652 5832746 5733944
57672 5733944 5614166 5489314 5374497 5282173 5220446 5189629 5177254 5157218 5098306 4978271
57662 4978271 4793192 4556318 4289875 4016486 3753811 3512842 3298988 3114108 2957724
57653 2957724 2827577 2720568 2633838 2564881 2511057 2469839 2439572 2419473 2408907 2407099 2413422
57642 2413422 2427456 2448843 2477466 2513631 2557772 2610288 2671997 2744216 2827816 2922688 3028825
57631 3028825 3147663 3281604 3432399 3600400 3784916 3984530 4197269 4420959 4652739
57622 4652739 4887158 5114879 5324034 5502840 5640713 5728180 5757990 5727450 5639447 5501161
$$ packed form
57691B587179J51558J69110J87197K05346K24143K43267K60888K75021K83810
57682D587519K84312K72927K47775K09668J60726J03728M3264j4267o2906r8802
57672E733944j19778j24852j14817r2324o1727l0817j2375k0036n8912j20035
57662D978271j85079k36874k66443k73389k62675k40969k13854j84880j56384
57653B957724j30147j07009q6730o8957n3824m1218l0267k0099j0566j808O323
57642B413422J4034K1387K8623L6165M4141N2516O1709P2219Q3600R4872J06137
57631C028825J18838J33941J50795J68001J84516J99614K12739K23690K31780
57622D652739K34419K27721K09155J78806J37873Q7467K9810l0540q8003j38286
$$ plain form
57612 5501161 5322152 5113063 4884574 4646473 4407346 4174534 3953538 3747435 3557371
57603 3557371 3383658 3226109 3083822 2955593 2840605 2738219 2647248 2566095 2493542 2428837
57593 2428837 2371163 2319696 2274064 2234056 2198923 2167610 2139568 2114726 2092776 2073210 2055985
57582 2055985 2041407 2029317 2019124 2010609 2003944 1998834 1994434 1990381 1987247 1985667 1985518 1986222 1987453 1989374
57568 1989374 1992496 1997446 2004536 2013515 2023962 2035855 2049424 2064678 2081485 2099957 2120206 2141848
57556 2141848 2164297 2187479 2211775 2237415 2264532 2293692 2325714 2360857 2398857 2439784 2484358
57545 2484358 2533335 2587144 2646184 2711027 2782255 2860549 2946944 3042452 3147451 3261934 3386416
57534 3386416 3522064 3669858 3830019 4002161 4185250 4377030 4573666 4769718 4957831
$$ packed form
57612E501161j79009k09089k28489k38101k39127k32812k20996k06103j90064
57603C557371j73713j57549j42287j28229j14988j02386r0971q1153p2553o4705
57593B428837n7674n1467m5632m0008l5133l1313k8042k4842k1950j9566j7225
57582B055985j4578j2090j0193q515o665n110m400m053l134j580j49P04J231J921
57568A989374L122M950P090Q979J0447J1893J3569J5254J6807J8472K0249K1642
57556B141848K2449K3182K4296K5640K7117K9160L2022L5143L8000M0927M4574
57545B484358M8977N3809N9040O4843P1228P8294Q6395R5508J04999J14483J24482
57534C386416J35648J47794J60161J72142J83089J91780J96636J96052J88113
$$ plain form
57525 4957831 5128464 5270880 5375388 5435274 5447481 5412547 5334328 5219307 5075559 4911917
57515 4911917 4737298 4559790 4385827 4220038 4065483 3923668 3794745 3678495 3575206
57506 3575206 3485269 3408107 3342139 3285745 3237828 3197619 3164575 3138460 3119037 3105706 3097883
57495 3097883 3095416 3098052 3104790 3114630 3127807 3145346 3167343 3192626 3220308 3250859 3285425 3324905
57483 3324905 3369988 3421311 3479107 3543270 3614290 3693636 3782886 3882812 3993602 4115595 4249496
57472 4249496 4396045 4555526 4727214 4909113 5098337 5291252 5482517 5664047 5825803
57463 5825803 5957897 6051830 6100636 6099906 6049782 5955415 5824883 5666953 5490623 5305134 5118834
57452 5118834 4937900 4766405 4607067 4461357 4329496 4211224 4106563 4015450 3936962 3869474
$$ packed form
57525D957831J70633J42416J04508N9886J2207l4934p8219j15021j43748j63642
57515D911917j74619j77508j73963j65789j54555j41815j28923j16250j03289
57506C575206q9937p7162o5968n6394m7917m0209l3044k6115j9423j3331p823
57495C097883k467K636O738R840J3177J7539K1997K5283K7682L0551L4566L9480
57483C324905M5083N1323N7796O4163P1020P9346Q9250R9926J10790J21993J33901
57472D249496J46549J59481J71688J81899J89224J92915J91265J81530J61756
57463E825803J32094R3933M8806p30n0124r4367j30532j57930j76330j85489j86300
57452E118834j80934j71495j59338j45710j31861j18272j04661r1113p8488o7488
$$ plain form
57442 3869474 3811463 3761777 3719363 3683161 3652277 3626009 3603872 3585706 3571477 3560732 3552610
57431 3552610 3546589 3542846 3541590 3542445 3544810 3548494 3553634 3560286 3568437 3578079 3588913 3600283 3611845
57418 3611845 3624030 3637453 3652152 3667867 3684700 3702906 3722140 3741604 3760980 3780696 3801094
57407 3801094 3821832 3842406 3862953 3884152 3906397 3929367 3952481 3975592 3999023 4022998 4047276
57396 4047276 4071454 4095421 4119280 4142974 4166304 4189337 4212557 4236506 4261375 4286871 4312406
57385 4312406 4337515 4362257 4387057 4412048 4436846 4461195 4485431 4509886 4534201 4557927 4581569
57374 4581569 4606223 4632188 4658721 4685320 4712420 4740446 4768876 4796860 4824315 4851873 4879960
57363 4879960 4908440 4937025 4965641 4994296 5022864 5051155 5079248 5107691 5137174 5167837 5199130
$$ packed form
57442C869474n8011m9686m2414l6202l0884k6268k2137j8166j4229j0745q122
57431C552610o021l743j256Q55K365L684N140O652Q151R642J0834J1370J1562
57418C611845J2185J3423J4699J5715J6833J8206J9234J9464J9376J9716K0398
57407C801094K0738K0574K0547K1199K2245K2970K3114K3111K3431K3975K4278
57396D047276K4178K3967K3859K3694K3330K3033K3220K3949K4869K5496K5535
57385D312406K5109K4742K4800K4991K4798K4349K4236K4455K4315K3726K3642
57374D581569K4654K5965K6533K6599K7100K8026K8430K7984K7455K7558K8087
57363D879960K8480K8585K8616K8655K8568K8291K8093K8443K9483L0663L1293
$$ plain form
57352 5199130 5230582 5262410 5294997 5328073 5361033 5393895 5427288 5461479 5496090 5530811 5565710
57341 5565710 5600688 5635285 5669311 5703170 5737294 5771725 5806382 5841219 5875879 5909750 5942673
57330 5942673 5975211 6008061 6041603 6076072 6111475 6147173 6182217 6216468 6250819 6285994 6321770
57319 6321770 6357729 6394195 6431787 6470416 6509237 6547476 6584980 6622204 6659790 6697994 6736480
57308 6736480 6774974 6813936 6853940 6894553 6934717 6974376 7014729 7056594 7099469 7142604 7186021
57297 7186021 7229894 7273916 7318093 7363315 7410282 7458489 7507144 7556409 7606820 7658019 7709172
57286 7709172 7760316 7812311 7865604 7919821 7974352 8028541 8081395 8131816 8179001 8222050 8259579
57275 8259579 8290445 8314672 8332951 8345483 8352119 8353395 8350641 8345105 8337746 8329729 8322320 8316220 8311627
$$ packed form
57352E199130L1452L1828L2587L3076L2960L2862L3393L4191L4611L4721L4899
57341E565710L4978L4597L4026L3859L4124L4431L4657L4837L4660L3871L2923
57330E942673L2538L2850L3542L4469L5403L5698L5044L4251L4351L5175L5776
57319F321770L5959L6466L7592L8629L8821L8239L7504L7224L7586L8204L8486
57308F736480L8494L8962M0004M0613M0164L9659M0353M1865M2875M3135M3417
57297G186021M3873M4022M4177M5222M6967M8207M8655M9265N0411N1199N1153
57286G709172N1144N1995N3293N4217N4531N4189N2854N0421M7185M3049L7529
57275H259579L0866K4227J8279J2532O636J276k754n536p359q017p409o100m593
$$ plain form
57262 8311627 8308861 8308180 8309095 8310670 8312646 8315631 8320177 8326291 8333832 8342656 8352276 8362116 8372293 8383539
57248 8383539 8396170 8409729 8423840 8438841 8455284 8473302 8492746 8513543 8535654 8558919 8583089
57237 8583089 8607812 8632527 8656673 8680099 8703083 8726015 8749238 8772977 8796967 8820243 8841681
57226 8841681 8860793 8877743 8892838 8906348 8918625 8929878 8939909 8948475 8955693 8961703 8966232 8969153
57214 8969153 8971201 8973366 8975599 8976807 8976134 8973583 8969383 8963559 8956273 8947916 8938566 8927939 8916071 8903516
57200 8903516 8890626 8877203 8863171 8849129 8835803 8823297 8811223 8799425 8788303 8778490 8770297 8763325
57188 8763325 8756634 8749452 8741705 8733787 8726066 8718834 8712383 8706673 8701183 8695616 8690559 8686847 8684430 8682515
57174 8682515 8680757 8679594 8679299 8679421 8679371 8679072 8678775 8678621 8678473 8677878 8676204 8673146 8668995 8663958 8657377 8648188
$$ packed form
57262H311627k766o81R15J575J976K985M546O114P541Q824R620R840J0177J1246
57248H383539J2631J3559J4111J5001J6443J8018J9444K0797K2111K3265K4170
57237H583089K4723K4715K4146K3426K2984K2932K3223K3739K3990K3276K1438
57226H841681J9112J6950J5095J3510J2277J1253J0031Q566P218O010M529K921
57214H969153K048K165K233J208o73k551m200n824p286q357r350j0627j1868j2555
57200H903516j2890j3423j4032j4042j3326j2506j2074j1798j1122r813q193o972
57188H763325o691p182p747p918p721p232o451n710n490n567n057l712k417j915
57174H682515j758j163k95J22n0k99k97j54j48n95j674l058m151n037o581r189
$$ plain form
57158 8648188 8635937 8620634 8601639 8577614 8547794 8512668 8473131 8429520 8381718 8329742 8274044
57147 8274044 8215644 8156108 8097029 8039502 7984406 7932924 7886198 7844641 7808246 7777316 7751996
57136 7751996 7731279 7713539 7698022 7684616 7671911 7656716 7636027 7608538 7573868 7531566 7481774
57125 7481774 7426040 7366689 7306064 7247043 7193381 7148302 7112913 7086574 7068330 7057201 7051443
57114 7051443 7048471 7045719 7041553 7036057 7031906 7034569 7051235 7089223 7154796 7252334 7384096 7551726
57102 7551726 7759331 8015758 8334373 8731375 9224302 9830703 10566971 11448660 12492742
57093 12492742 13719927 15155269 16827163 18764786 20993057 23526211 26363231 29485474
57085 29485474 32852912 36398970 40030917 43639492 47108780 50314259 53112888 55345206
$$ packed form
57158H648188j2251j5303j8995k4025k9820l5126l9537m3611m7802n1976n5698
57147H274044n8400n9536n9079n7527n5096n1482m6726m1557l6395l0930k5320
57136G751996k0717j7740j5517j3406j2705j5195k0689k7489l4670m2302m9792
57125G481774n5734n9351o0625n9021n3662m5079l5389k6339j8244j1129n758
57114G051443k972k752m166n496m151K663J6666L7988O5573R7538J31762J67630
57102G551726K07605K56427L18615L97002M92927O06401P36268Q81689J044082
57093A2492742J227185J435342J671894J937623K228271K533154K837020L122243
57085B9485474L367438L546058L631947L608575L469288L205479K798629K232318
$$ plain form
57077 55345206 56862725 57569009 57447016 56554514 54993144 52873031 50292531 47337521
57069 47337521 44090714 40639218 37075783 33495593 29990747 26642927 23516266 20653782
57061 20653782 18078404 15796025 13798525 12067277 10577659 9302884 8215770 7289583
57053 7289583 6499512 5824166 5245577 4748142 4318138 3944196 3617439 3330703 3077658
57044 3077658 2852753 2651696 2471498 2309762 2163908 2031236 1909618 1797858 1695263
57035 1695263 1601118 1514701 1435490 1362971 1296452 1235375 1179649 1129255 1083612 1041697 1002760
57024 1002760 966573 933041 902023 873575 847942 825165 805019 787434 772618 760600 750973
57013 750973 743264 737325 733234 731128 731310 734285 740482 750237 764323 784139 811138 846550 892274
$$ packed form
57077E5345206J517519P06284j21993q92502j561370k120113k580500k955010
57069D7337521l246807l451496l563435l580190l504846l347820l126661k862484
57061B0653782k575378k282379j997500j731248j489618j274775j087114r26187
57053G289583p90071o75346n78589m97435m30004l73942l26757k86736k53045
57044C077658k24905k01057j80198j61736j45854j32672j21618j11760j02595
57035A695263r4145q6417p9211p2519o6519o1077n5726n0394m5643m1915l8937
57024A002760l6187l3532l1018k8448k5633k2777k0146j7585j4816j2018r627
57013G50973p709n939m091k106J82K975O197R755J4086J9816K6999L5412M5724
$$ plain form
57000 892274 951588 1028259 1125803 1249544 1408579 1609995 1844347 2075406 2249597 2322886
56990 2322886 2283646 2153110 1967362 1759508 1553127 1363225 1197648 1058188 943016 848769
56980 848769 770641 702470 638949 577904 519841 465943 417389 375763 342459 317406 299114
56969 299114 285950 276829 271008 268029 267885 270726 276555 285653 298834 316597 338411 363582 392389
56956 392389 425094 459603 490868 513031 522170 517710 502230 480029 455011 429406 404385 381335
56944 381335 361794 346428 334891 326759 321992 320534 322100 326537 334033 345003 360096 380146 405708
56931 405708 436748 472706 511846 549649 578721 592009 586849 565765 533950 496722 458567 422606
56919 422606 390116 361200 336086 315228 298363 284532 273204 264424 257728 251924 246306 241276
$$ packed form
57000H92274N9314P6671R7544J23741J59035K01416K34352K31059J74191P3289
56990B322886l9240j30536j85748k07854k06381j89902j65577j39460j15172r4247
56980H48769p8128o8171o3521o1045n8063n3898m8554m1626l3304k5053j8292
56969B99114j3164r121n821k979j44K841N829R098J3181J7763K1814K5171K8807
56956C92389L2705L4509L1265K2163R139m460j5480k2201k5018k5605k5021k3050
56944C81335j9541j5366j1537q132m767j458J566M437P496J0970J5093K0050K5562
56931D05708L1040L5958L9140L7803K9072J3288n160k1084l1815l7228l8155l5961
56919D22606l2490k8916k5114k0858j6865j3831j1328q780o696n804n618n030
$$ plain form
56907 241276 237424 234721 232912 231961 231758 232003 232674 234084 236326 239210 242772 247253 252585 258653 265987
56892 265987 275316 286487 298837 312704 329527 350300 374958 403143 433883 463857 487558 500487
56880 500487 501734 493143 477283 457018 435684 415980 398926 384695 373851 366988 363909 364226 368311
56867 368311 376777 389665 407236 431100 463379 505011 556000 616960 688618 768627 849046 917464
56855 917464 961355 973178 953451 909911 853213 792470 733670 680545 635458 599474 572630
56844 572630 554717 545716 545677 554636 572729 600232 637722 686506 748740 827001 923709 1039946
56832 1039946 1172199 1308237 1427023 1505777 1530070 1499221 1424010 1320408 1204124 1087518
56822 1087518 978615 881771 799092 731212 677365 635965 605801 586536 578061 579995 592191
$$ packed form
56907B41276l852k703j809r51k03K45O71J410K242K884L562M481N332O068P334
56892B65987R329J1171J2350J3867J6823K0773K4658K8185L0740K9974K3701J2929
56880E00487J247q591j5860k0265k1334j9704j7054j4231j0844o863l079L17M085
56867C68311Q466J2888J7571K3864L2279M1632N0989O0960P1658Q0009Q0419O8418
56855I17464M3891J1823j9727m3540n6698o0743n8800n3125m5087l5984k6844
56844E72630j7913r001l9Q959J8093K7503L7490M8784O2234P8261R6708J16237
56832A039946J32253J36038J18786P8754K4293l0849p5211j03602j16284j16606
56822A087518j08903r6844q2679o7880n3847m1400l0164j9265q475J934J2196
$$ plain form
56811 592191 615331 650658 699338 762330 840094 930742 1027041 1115113 1177685 1201118 1181530
56800 1181530 1125387 1044827 952173 857277 767262 686660 617509 560102 514007 478397 451943
56789 451943 433183 421200 415763 416952 425007 440439 463891 495843 536336 584247 635894 684297
56777 684297 720625 737409 731277 703681 659783 606497 550457 496535 447390 403925 366157 333961
56765 333961 307238 285598 268156 253930 242289 232737 224499 216917 210152 204855 201076 198108 195454
56752 195454 193241 191499 189834 188099 186633 185421 183828 181638 179585 178304 177464 176525 175575 174673 173164
56737 173164 170629 167906 166072 164863 163101 160371 157241 154133 151127 148729 147632 147514 147089 145645 143753
56722 143753 142243 141263 140629 140324 140245 140028 139627 139738 141225 144227 148012 151582 154382 156536 158382 159760
$$ packed form
56811E92191K3140L5327M8680O2992P7764R0648R6299Q8072O2572K3433j9588
56800A181530n6143q0560r2654r4896r0015q0602o9151n7407m6095l5610k6454
56789D51943j8760j1983n437J189Q055J5432K3452L1952M0493M7911N1647M8403
56777F84297L6328J6784o132k7596m3898n3286n6040n3922m9145m3465l7768l2196
56765C33961k6723k1640j7442j4226j1641r552q238p582o765n297l779k968k654
56752A95454k213j742j665j735j466j212j593k190k053j281q40r39r50r02j509
56737A73164k535k723j834j209j762k730l130l108l006k398j097j18m25j444j892
56722A43753j510r80o34l05p9k17m01J11J487L002L785L570K800K154J846J378
$$ plain form
56706 159760 160001 158803 156804 155008 153884 153274 152814 152064 150662 148827 147391 146843 146731 146508 146487 147277 148689
56689 148689 150014 151122 152389 153716 154523 154760 155015 155523 155843 155766 155806 156409 157198 157415 156903 156347 156620 157915
56671 157915 159558 160698 161180 161444 161644 161495 161066 160931 161100 160712 159409 158197 158057 158424 158059 156799 155301
56654 155301 153679 151728 150117 149807 150287 149824 147698 144964 142797 141286 140207 139800 140242 141147 142069 142783
56638 142783 142914 142098 140761 139920 139920 140158 140270 140666 141572 142467 142948 143340 143945 144394 144281 143884 143790 144278 145420
56619 145420 147201 149173 150534 150948 150866 150819 150870 150976 151315 151957 152658 153265 153894 154593 155261 156004 156983 157850 157939
56600 157939 157099 155778 154247 152510 150995 150485 151112 152185 153231 154402 155670 156540 156990 157780 159304 160853
56584 160853 161556 161519 161550 162251 163747 165796 167809 169298 170574 172430 174886 176957 177985 178582 179800 181930
$$ packed form
56706A59760K41j198j999j796j124o10m60p50j402j835j436n48j12k23k1P90J412
56689A48689J325J108J267J327Q07K37K55N08L20p7M0O03P89K17n12n56K73J295
56671A57915J643J140M82K64K00j49m29j35J69l88j303j212j40L67l65j260j498
56654A55301j622j951j611l10M80m63k126k734k167j511j079m07M42R05R22P14
56638A42783J31q16j337q41%K38J12L96R06Q95M81L92O05M49j13l97r4M88J142
56619A45420J781J972J361M14q2m7N1J06L39O42P01O07O29O99O68P43R79Q67Q9
56600A57939q40j321j531j737j515n10O27J073J046J171J268Q70M50P90J524J549
56584A60853P03l7L1P01J496K049K013J489J276J856K456K071J028N97J218K130
$$ plain form
56568 181930 184542 187211 189836 192674 196270 200905 205993 210612 214706 219097 224258 229936 236017 242710
56554 242710 249504 255094 258892 261693 264265 266169 266675 265981 264731 263020 260681 258001 255326 252408 248829
56539 248829 244779 240846 237327 234141 231027 227493 223085 218092 213483 209862 207071 204995 203944 203822
56525 203822 203828 203547 203548 204279 205093 205057 204085 202640 201016 199518 198584 198043 196985 195108 193454 192928 192811 191706
56507 191706 189391 186749 184417 182599 181811 182572 184398 186043 186893 187390 188122 189086 189898 190231 190047 189768 190069
56490 190069 191202 192713 194051 195143 196128 197003 197831 198840 200001 201083 202409 204826 208431 212087 214830
56475 214830 217083 219787 222974 226040 228872 231804 234797 237500 239914 242357 244990 247914 251439 255710
56461 255710 260376 265053 269705 274160 277801 280304 282155 283835 285022 285183 284439 283255 281795 280229 279109
$$ packed form
56568A81930K612K669K625K838L596M635N088M619M094M391N161N678O081O693
56554B42710O794N590L798K801K572J904N06o94j250j711k339k680k675k918l579
56539B48829m050l933l519l186l114l534m408m993m609l621k791k076j051j22
56525B03822Ok81JP31Q14l6r72j445j624j498r34n41j058j877j654n26j17j105
56507A91706k315k642k332j818p88P61J826J645Q50M97P32R64Q12L33j84k79L01
56490A90069J133J511J338J092R85Q75Q28J009J161J082J326K417L605L656K743
56475B14830K253K704L187L066K832K932K993K703K414K443K633K924L525M271
56461B55710M666M677M652M455L641K503J851J680J187J61p44j184j460j566j120
$$ plain form
56446 279109 278793 279028 279721 281426 284248 286941 288088 287758 287114 286731 286172 284935 282921 280175 276922 273675
56430 273675 270751 267837 264512 260803 256807 252363 247645 243461 240339 237839 235449 233434 232089 230808
56416 230808 228843 226437 224393 223049 222413 222654 223595 224395 224685 225317 227021 229082 230494 231692 233732 236256
56400 236256 237768 237674 236749 235736 234741 233921 233584 233537 233365 233303 233901 234914 235543 235696 236074 237053 238349 239716
56382 239716 241160 242590 244054 246136 249331 253276 257288 261224 264985 267765 268960 269438 270730 273188
56368 273188 276067 279050 282375 285585 287632 288400 288947 290002 291228 292164 292948 293802 294566 294988 295026 294855 294989
56351 294989 296065 297956 299631 300599 301878 304647 308491 312146 315417 319085 323270 327290 330999 334999
56337 334999 339527 344296 349357 355039 361109 367072 373235 380333 388268 396305 404393 413100 422343 431339
$$ packed form
56446B79109l16K35O93J705K822K693J147l30o44l83n59j237k014k746l253l247
56430B73675k924k914l325l709l996m444m718m184l122k500k390k015j345j281
56416B30808j965k406k044j344o36K41R41Q00K90O32J704K061J412J198K040K524
56400B36256J512r4r25j013r95q20l37m7j72o2N98J013O29J53L78R79J296J367
56382B39716J444J430J464K082L195L945M012L936L761K780J195M78J292K458
56368B73188K879K983L325L210K047P68N47J055J226R36P84Q54P64M22L8j71J34
56351B94989J076J891J675R68J279K769L844L655L271L668M185M020L709M000
56337C34999M528M769N061N682O070N963O163P098P935Q037Q088Q707R243Q996
$$ plain form
56323 431339 439826 448171 456353 463938 471033 478100 484816 490235 494087 496911 498913 499809 499738 499280 498597
56308 498597 497516 496328 495480 494722 493668 492943 493558 495373 497456 499797 503297 508181 513781 519830 526595
56293 526595 533805 540824 547963 556290 566110 576915 588743 602161 616930 632172 647960 665288
56281 665288 684385 704593 726051 749987 777000 806557 838500 873672 912628 955081 1001091
56270 1001091 1051664 1107805 1170010 1238946 1315576 1400491 1494127 1597603 1712199 1838164 1975356
56259 1975356 2124782 2287819 2463822 2650146 2844660 3046466 3253777 3462708 3668601
56250 3668601 3867019 4052917 4220380 4363990 4479600 4563746 4613928 4630131 4615014 4572215
56240 4572215 4505451 4419187 4318566 4208019 4090794 3969820 3847767 3726210 3605941 3488034
$$ packed form
56323D31339Q487Q345Q182P585P095P067O716N419L852K824K002Q96p1m58o83
56308D98597j081j188q48p58j054p25O15J815K083K341L500M884N600O049O765
56293E26595P210P019P139Q327R820J0805J1828J3418J4769J5242J5788J7328
56281F65288J9097K0208K1458K3936K7013K9557L1943L5172L8956M2453M6010
56270A001091N0573N6141O2205O8936P6630Q4915R3636J03476J14596J25965J37192
56259A975356J49426J63037J76003J86324J94514K01806K07311K08931K05893
56250C668601J98418J85898J67463J43610J15610Q4146N0182J6203j5117m2799
56240D572215o6764q6264j00621j10547j17225j20974j22053j21557j20269j17907
$$ plain form
56230 3488034 3373251 3260601 3148099 3034988 2921750 2808158 2693128 2576518 2459290
56221 2459290 2341940 2224609 2108735 1996557 1888811 1784833 1685008 1591014 1503509 1421800
56211 1421800 1346024 1277277 1215134 1157512 1103704 1055262 1013088 975888 942384 912807 887198
56200 887198 864308 843267 824480 807965 792738 778662 766873 757441 748704 739929 732576 727804
56188 727804 724778 722611 721934 723191 725243 727135 729699 734178 740682 748994 759287 771114 783281 795564
56174 795564 808835 822820 835692 846691 857001 867126 875642 881731 886704 891674 895816 898288 899875
56161 899875 901293 901845 901212 900753 901643 903553 906434 911636 919841 929802 940592 953271 969064 987859
56147 987859 1009851 1036607 1069016 1106220 1148102 1196958 1255257 1323751 1403289 1496348 1604980
$$ packed form
56230C488034j14783j12650j12502j13111j13238j13592j15030j16610j17228
56221B459290j17350j17331j15874j12178j07746j03978r9825r3994q7505q1709
56211A421800p5776o8747o2143n7622n3808m8442m2174l7200l3504k9577k5609
56200H87198k2890k1041j8787j6515j5227j4076j1789r432q737q775p353m772
56188G27804l026k167o77J257K052J892K564M479O504Q312J0293J1827J2167J2283
56174G95564J3271J3985J2872J0999J0310J0125Q516O089M973M970M142K472J587
56161H99875J418N52o33m59Q90J910K881N202Q205R961J0790J2679J5793J8795
56147I87859K1992K6756L2409L7204M1882M8856N8299O8494P9538R3059J08632
$$ plain form
56136 1604980 1728873 1866654 2016736 2175019 2333637 2483939 2619663 2736896 2834072 2914074
56126 2914074 2983975 3050147 3114313 3174594 3227568 3268024 3290161 3292053 3277483 3251880 3218473
56115 3218473 3179209 3135662 3086082 3024058 2943205 2842066 2723297 2590948 2450813 2310629
56105 2310629 2176784 2052112 1938426 1838605 1754004 1682345 1620605 1567773 1522809 1482787 1445697
56094 1445697 1412552 1384319 1359381 1336460 1317064 1302215 1289637 1277232 1266540 1259560 1254958 1250764
56082 1250764 1248160 1248957 1251747 1254255 1257320 1262888 1270102 1276992 1284138 1293166 1303424 1313481 1324054
56069 1324054 1336220 1348681 1360008 1371629 1385418 1400407 1415023 1430339 1447889 1466530 1484657
56058 1484657 1503179 1523105 1542791 1560941 1579632 1600930 1623274 1644748 1666881 1691428 1716525
$$ packed form
56136A604980J23893J37781J50082J58283J58618J50302J35724J17233R7176Q0002
56126B914074O9901O6172O4166O0281N2974M0456K2137J892j4570k5603l3407
56115C218473l9264m3547m9580o2024q0853j01139j18769j32349j40135j40184
56105B310629j33845j24672j13686r9821q4601p1659o1740n2832m4964m0022l7090
56094A445697l3145k8233k4938k2921j9396j4849j2578j2405j0692o980m602m194
56082A250764k604P97K790K508L065N568P214O890P146R028J0258J0057J0573
56069A324054J2166J2461J1327J1621J3789J4989J4616J5316J7550J8641J8127
56058A484657J8522J9926J9686J8150J8691K1298K2344K1474K2133K4547K5097
$$ plain form
56047 1716525 1740203 1764628 1792533 1822362 1851343 1880476 1912007 1944932 1977584 2011761 2049598
56036 2049598 2089376 2129126 2171230 2218406 2268369 2317611 2367232 2419659 2472998 2524420 2575997
56025 2575997 2631234 2688885 2746091 2804485 2867063 2932175 2996935 3063352 3134533 3208028 3279716
56014 3279716 3351184 3426440 3504554 3582656 3663003 3749733 3841724 3936015 4034942 4142307 4255971
56003 4255971 4372138 4493321 4623945 4761881 4903042 5050460 5209687 5379052 5554002
55994 5554002 5737240 5934671 6145038 6363781 6593353 6839185 7099443 7369679 7653604
55985 7653604 7957970 8281173 8618815 8975917 9361302 9775003 10214550 10688439 11209177
55976 11209177 11778358 12393544 13064178 13804928 14619857 15510699 16494588 17595558 18826083
$$ packed form
56047A716525K3678K4425K7905K9829K8981K9133L1531L2925L2652L4177L7837
56036B049598L9778L9750M2104M7176M9963M9242M9621N2427N3339N1422N1577
56025B575997N5237N7651N7206N8394O2578O5112O4760O6417P1181P3495P1688
56014C279716P1468P5256P8114P8102Q0347Q6730R1991R4291R8927J07365J13664
56003D255971J16167J21183J30624J37936J41161J47418J59227J69365J74950
55994E554002J83238J97431K10367K18743K29572K45832K60258K70236K83925
55985G653604L04366L23203L37642L57102L85385M13701M39547M73889N20738
55976A1209177N69181O15186O70634P40750Q14929Q90842R83889J100970J230525
$$ plain form
55967 18826083 20197642 21742838 23506707 25526028 27842427 30527395 33667518 37333167
55959 37333167 41589411 46528047 52262277 58911692 66639808 75705634 86457287 99313282
55951 99313282 114802415 133592530 156448866 184255444 218077782 258692414 305092487
55944 305092487 352798487 393941726 420082383 426110091 412297136 383238405 345092903
55937 345092903 303345264 261968820 223471240 189165177 159488380 134351072 113390643
55930 113390643 96091434 81872012 70187063 60576568 52646167 46055374 40538834
55923 40538834 35903312 31988625 28650886 25781161 23307209 21166016 19294066 17645632
55915 17645632 16195725 14918318 13779982 12757571 11842644 11024142 10283393 9608868 8999175
$$ packed form
55967A8826083J371559J545196J763869K019321K316399K684968L140123L665649
55959C7333167M256244M938636N734230O649415P728116R065826J0751653J2855995
55951I9313282J5489133J8790115K2856336K7806578L3822338M0614632M6400073
55944C05092487M7706000M1143239K6140657O027708j3812955k9058731l8145502
55937C45092903m1747639m1376444l8497580l4306063k9676797k5137308k0960429
55930A13390643j7299209j4219422j1684949r610495p930401o590793n516540
55923D0538834m635522l914687l337739k869725k473952k141193j871950j648434
55915A7645632j449907j277407j138336j022411r14927q18502p40749o74525o09693
$$ plain form
55906 8999175 8448127 7941863 7473380 7045422 6656299 6296419 5961212 5654228 5374768
55897 5374768 5114652 4869702 4642919 4434102 4237300 4050579 3877707 3718287 3566339
55888 3566339 3420365 3284976 3160936 3043136 2929888 2824779 2727873 2634333 2543285 2459013
55878 2459013 2381789 2306371 2231268 2160851 2096472 2033930 1971723 1913730 1861616 1812281 1764798
55867 1764798 1722285 1684750 1647304 1607775 1569371 1533888 1498984 1464141 1432821 1406681 1383766
55856 1383766 1364173 1351407 1346427 1346308 1350190 1360100 1373871 1383390 1382355 1370765 1350455 1322103 1288576
55843 1288576 1255419 1225317 1196474 1167892 1141286 1116541 1090663 1062989 1036273 1011033 984062
55832 984062 954365 925375 899345 874524 849916 827856 809632 793195 777345 763696 752436
$$ packed form
55906H999175n51048n06264m68483m27958l89123l59880l35207l06984k79460
55897E374768k60116k44950k26783k08817j96802j86721j72872j59420j51948
55888C566339j45974j35389j24040j17800j13248j05109r6906r3540r1048q4272
55878B459013p7224p5418p5103p0417o4379o2542o2207n7993n2114m9335m7483
55867A764798m2513l7535l7446l9529l8404l5483l4904l4843l1320k6140k2915
55856A383766j9593j2766m980j19L882R910J3771R519j035j1590k0310k8352l3527
55843A288576l3157l0102k8843k8582k6606k4745k5878k7674k6716k5240k6971
55832I84062k9697k8990k6030k4821k4608k2060j8224j6437j5850j3649j1260
$$ plain form
55821 752436 740596 726701 712846 700152 686644 671802 658767 649573 642346 635663 631587 631610 633419
55808 633419 634544 635908 639039 642873 645902 648646 651493 652703 650898 647232 643144 638212 631756 624160
55794 624160 615178 603479 589243 574681 560851 546686 532189 519515 509512 500229 490305 480953
55782 480953 473197 466132 459527 455232 454293 455079 455586 455026 452126 444930 433711 421303 409260 396575
55768 396575 383253 371774 363373 356203 349038 343661 341432 340369 337880 333884 329198 323362 316196 309223
55754 309223 303424 297612 290737 283574 276483 268000 257647 247936 241427 237669 234824 232334 230159 227377
55740 227377 223563 219951 217548 215643 213592 212292 212479 213365 214337 216114 218858 221058 221708 221661 221471 219926
55724 219926 216142 211184 206100 200380 193831 188025 184232 181712 179521 178162 178041 178203 178091 178670 180387
$$ packed form
55821G52436j1840j3895j3855j2694j3508j4842j3035r194p227o683m076K3J809
55808F33419J125J364L131L834L029K744K847J210j805l666m088m932o456p596
55794F24160q982j1699j4236j4562j3830j4165j4497j2674j0003r283r924r352
55782D80953p756p065o605m295r39P86N07n60k900p196j1219j2408j2043j2685
55768C96575j3322j1479q401p170p165n377k229j063k489l996m686n836p166o973
55754C09223n799n812o875p163p091q483j0353r711o509l758k845k490k175k782
55740B27377l814l612k403j905k051j300J87Q86R72J777K744K200O50m7j90j545
55724B19926l784m958n084n720o549n806l793k520k191j359j21J62j12N79J717
$$ plain form
55709 180387 182085 183400 186153 191628 198461 204981 211726 219802 228510 236450 243385 249333 253462 255597
55695 255597 257213 259230 260426 259668 258062 257111 256226 253844 249659 244220 237772 231040 225713 222579 220495
55680 220495 218503 217441 218215 220249 223057 227439 233453 238977 242156 243665 244948 245894 246013 246184 247257
55665 247257 248384 248584 248535 249082 249516 249094 248753 249465 250447 250824 251436 253019 254269 253840 252780 252680 252726 250873
55647 250873 246749 241242 234413 226094 217453 209632 201763 192526 182698 173976 166204 158105 149961 143222
55633 143222 138006 133207 128573 124601 120835 116343 111549 107699 104903 102449 100529 99796 99679 98922 97372
55618 97372 95615 93460 90549 87818 86459 85936 84868 83341 82467 82218 81691 81083 81379 82336 82785 82753 83285
55601 83285 84206 84010 82146 79722 77855 76818 76805 77897 79138 79159 77924 76568 75565 74388 72936 71860
$$ packed form
55709A80387J698J315K753N475O833O520O745Q076Q708P940O935N948M129K135
55695B55597J616K017J196p58j606r51q85k382m185n439o448o732n327l134k084
55680B20495j992j062P74K034K808M382O014N524L179J509J283R46J19J71J073
55665B47257J127K00m9N47M34m22l41P12R82L77O12J583J250m29j060j00M6j853
55647B50873m124n507o829q319q641p821p869r237r828q722p772q099q144o739
55633A43222n216m799m634l972l766m492m794l850k796k454j920p33j17p57j550
55618I7372j757k155k911k731j359n23j068j527q74k49n27o08K96R57M49l2N32
55601H3285R21j96j864k424j867j037j3J092J241K1j235j356j003j177j452j076
$$ plain form
55585 71860 71311 70678 69697 68723 67917 67243 67168 68177 69684 70493 70350 69995 69864 69836 70129 71303 73319 75550
55567 75550 77714 80022 82547 85210 88074 90917 92954 93799 94188 94878 95394 94878 93585 92455 91673 90731
55551 90731 89498 88161 86571 84645 82951 81887 80849 79245 77717 77288 77903 78930 80432 82756 85466
55536 85466 87943 90436 93356 96184 98395 100751 104255 108382 111763 114078 115854 116921 116588 114955 112663
55521 112663 109701 105903 102115 99389 97302 94522 90720 86606 82504 78310 74427 71257 68136 64299
55507 64299 60422 57684 55751 53404 50815 49322 49071 48684 47330 45485 43535 41239 38769 36815 35435
55492 35435 34040 32553 31286 29719 26869 22922 19173 16261 13806 11805 10967 11491 12801 14627 17172
55477 17172 20104 22572 24260 25388 25822 25370 24751 24908 25541 25641 25307 25561 26493 27134 27122 26969 26681 25790
$$ packed form
55585G1860n49o33r81r74q06o74p5J009J507Q09j43l55j31k8K93J174K016K231
55567G5550K164K308K525K663K864K843K037Q45L89O90N16n16j293j130p82r42
55551I0731j233j337j590j926j694j064j038j604j528m29O15J027J502K324K710
55536H5466K477K493K920K828K211K356L504M127L381K315J776J067l33j633k292
55521A12663k962l798l788k726k087k780l802m114m102m194l883l170l121l837
55507F4299l877k738j933k347k589j493k51l87j354j845j950k296k470j954j380
55492C5435j395j487j267j567k850l947l749k912k455k001q38N24J310J826K545
55477A7172K932K468J688J128M34m52o19J57O33J00l34K54R32O41j2j53k88q91
$$ plain form
55459 25790 24804 24927 26111 26973 26907 26696 26738 26359 25352 24598 24543 24491 24051 23923 24548 25269 25481 25500 25576 25179
55439 25179 24073 23129 23246 24078 24496 23848 22401 21009 20500 20927 21400 21238 21041 21900 23853 26115 28469
55422 28469 31211 33831 35147 34865 33824 32634 31198 29628 28396 27448 26302 25090 24405 24123 23596 22998
55406 22998 23267 24689 26751 29218 31958 33920 33958 32682 31746 31269 29885 27564 26246 26986 28380 28737
55390 28737 28127 27357 26527 25712 25662 26626 27594 27667 27151 26540 25642 24528 24011 24157 23567 21354 18693 17174
55372 17174 16537 15404 13555 12101 11804 12398 13402 14670 16242 18227 20661 23062 24546 24811 24566 24590
55356 24590 24842 24882 24662 24498 24707 25504 26758 27715 27612 26684 25831 25242 24269 22814 21730 21510 21594 21480 21544
55337 21544 22215 23207 24112 24940 25600 25688 25299 25197 25616 25718 24777 23176 21706 20588 19684 18993 18512 18216
$$ packed form
55459B5790r86J23J184Q62o6k11M2l79j007p54n5n2m40j28O25P21K12J9P6l97
55439B5179j106r44J17Q32M18o48j447j392n09M27M73j62j97Q59J953K262K354
55422B8469K742K620J316k82j041j190j436j570j232r48j146j212o85k82n27n98
55406B2998K69J422K062K467K740J962L8j276r36m77j384k321j318P40J394L57
55390B8737o10p70q30q15n0R64R68P3n16o11q98j114n17J46n90k213k661j519
55372A7174o37j133j849j454k97N94J004J268J572J985K434K401J484K65k45K4
55356B4590K52M0k20j64K09P97J254R57j03r28q53n89r73j455j084k20Q4j14O4
55337B1544O71R92R05Q28O60Q8l89j02M19J02r41j601j470j118r04o91m81k96
$$ plain form
55319 18216 18441 19527 20959 21777 22043 22813 24330 25464 25410 24756 24263 23791 23136 22790 22993 23014 22277 21343
55301 21343 20899 20641 20049 19502 19661 20400 21197 22040 23092 24041 24557 24918 25462 25862 25656 25043 24578 24395 24250
55282 24250 23932 23235 21991 20431 19022 17798 16519 15562 15723 16821 17530 17032 15951 15195 14885 14896 15376
55265 15376 16107 16382 16212 16630 18055 19374 19484 18827 18478 18641 18999 19760 21254 23040 24325 24874 24910 24677
55247 24677 24639 25354 26522 26978 26237 25212 24727 24296 23224 21938 21279 21244 21362 21581 21898 21856 21365 21228 21965
55228 21965 22859 23091 23001 23208 23359 22912 22381 22539 23038 23068 22845 23225 24301 25584 27069 28865 30234 30366
55210 30366 29926 30420 32070 33504 33658 32929 32334 32423 33243 34673 36531 38649 40809 42382 42543 41262 39607
55193 39607 38561 38051 37615 37318 37291 37052 36123 34787 33553 32477 31694 31765 32613 32903 31583 29314 27326
$$ packed form
55319A8216K25J086J432Q18K66P70J517J134n4o54m93m72o55l46K03K1p37r34
55301B1343m44k58n92n47J59P39P97Q43J052R49N16L61N44M00k06o13m65j83j45
55282B4250l18o97j244j560j409j224j279r57J61J098P09m98j081p56l10J1M80
55265A5376P31K75j70M18J425J319J10o57l49J63L58P61J494J786J285N49L6k33
55247B4677l8P15J168M56p41j025m85m31j072j286o59l5J18K19L17m2m91j37P37
55228B1965Q94K32r0K07J51m47n31J58M99L0k23L80J076J283J485J796J369J32
55210C0366m40M94J650J434J54p29n95Q9Q20J430J858K118K160J573J61j281j655
55193C9607j046n10m36k97k7k39r29j336j234j076p83P1Q48K90j320k269j988
$$ plain form
55176 27326 25640 23688 21977 21576 22367 23305 24185 25673 27658 29020 29226 28992 29120 29676 30440 31277 31915
55159 31915 32151 32321 32835 33326 33054 32045 31101 30751 30851 31039 30903 30039 28724 28126 28935 30140 30139 28762
55141 28762 27171 26110 25430 25117 25496 26389 27168 27756 28618 29742 30582 31024 31497 32149 32793 33572 34715 35790
55123 35790 36241 36602 37954 40153 41777 42029 41557 41239 41264 41707 42828 44329 45275 45303 45104 45318 45729 45924
55105 45924 45954 45924 45659 45255 45317 46190 47446 48492 49201 49733 50264 51126 52613 54358 55490 55741 55824 56421 57288
55086 57288 57804 57944 58243 59059 60271 61631 63096 64745 66436 67622 67752 66929 65881 65088 64271 63037
55070 63037 61592 60440 59798 59796 60735 62520 64217 64919 64785 64575 64485 64138 63408 62503 61519 60664 60554 61391 62170
55051 62170 61728 60388 59547 59732 60132 60010 59497 58844 57949 56919 56207 55886 55559 55196 55293 55872 56106 55321 53850
$$ packed form
55176B7326j686j952j711m01P91R38Q80J488J985J362K06k34J28N56P64Q37O38
55159C1915K36J70N14M91k72j009r44l50J00J88j36q64j315n98Q09J205jj377
55141B8762j591j061o80l13L79Q93P79N88Q62J124Q40M42M73O52O44P79J143J075
55123C5790M51L61J352K199J624K52m72l18K5M43J121J501R46K8j99K14M11J95
55105D5924L0l0k65m04O2Q73J256J046P09N32N31Q62J487J745J132K51Q3N97Q67
55086E7288N16J40K99Q16J212J360J465J649J691J186J30q23j048p93q17j234
55070F3037j445j152o42kR39J785J697P02j34k10r0l47p30r05r84q55j10Q37P79
55051F2170m42j340q41J85M00j22n13o53q95j030p12l21l27l63R7N79K34p85j471
$$ plain form
55032 53850 52616 52233 52637 53232 53373 53114 53335 54672 56582 58092 59094 60125 61153 61594 61405 61163 61046
55015 61046 60711 60250 60264 60886 61645 62405 63496 64696 65066 64156 62590 61189 60185 59499 59017 58465 57676 57090
54997 57090 57243 57765 57774 57234 56955 57194 57352 57262 57552 58343 58748 58233 57507 57435 57921 58474 59089 59954 60976 62137
54977 62137 63702 65598 67304 68781 70756 73575 76550 79052 81431 84145 86723 88480 89725 91415
54963 91415 93958 97148 100970 105645 111044 116794 123006 130318 139187 149574 161342 174578 189383
54950 189383 205491 222161 238377 253089 265272 273773 277470 275884 269582 259701 247184 232671
54938 232671 216814 200266 183582 167551 153294 141424 131382 122247 113998 107326 102434 98830
54926 98830 96165 94423 93362 92583 92133 92305 92889 93486 94401 96347 99395 103237 108277 115236 123658 132232
$$ packed form
55032E3850j234l83M04N95J41k59K21J337J910J510J002J031J028M41j89k42j17
55015F1046l35m61J4O22P59P60J091J200L70r10j566j401j004o86m82n52p89n86
54997E7090J53N22Rn40k79K39J58r0K90P91M05n15p26p2M86N53O15Q65J022J161
54977F2137J565J896J706J477J975K819K975K502K379K714K578J757J245J690
54963I1415K543L190L822M675N399N750O212P312Q869J0387J1768J3236J4805
54950A89383J6108J6670J6216J4712J2183Q501L697j586o302r881j2517j4513
54938B32671j5857j6548j6684j6031j4257j1870j0042r135q249o672m892l604
54926I8830k665j742j061p79m50J72N84N97R15J946L048L842N040O959Q422Q574
$$ plain form
54910 132232 140890 151248 164402 179461 194815 209755 224119 237256 248047 255284 257646 254190
54898 254190 245452 233275 219123 203320 186299 169474 154240 140977 129654 120445 113056 106382
54886 106382 99723 93659 88965 85412 82389 79918 78196 76778 75109 73381 72074 71140 70318 69726 69437
54871 69437 68989 68008 66810 65710 64331 62322 60216 58778 57984 57412 57088 57128 57020 56263 55382 55364 56204 56801
54853 56801 56287 54793 53027 51656 51018 50913 50739 50184 49581 49265 48987 48371 47608 47214 47378 47973 48911 50065
54835 50065 51132 51946 52638 53233 53453 53258 53169 53752 55139 57208 59709 62060 63675 64702 65791 67053
54819 67053 68101 69235 71298 73994 75691 75674 75323 76112 77716 79284 81406 85208 90267 95110 99358
54804 99358 103932 109402 115582 122655 131410 142280 155132 169853 186119 202825 218812 234030 248766
$$ packed form
54910A32232Q658J0358J3154J5059J5354J4940J4364J3137J0791P237K362l456
54898B54190q738j2177j4152j5803j7021j6825j5234j3263j1323r209p389o674
54886A06382o659o064m694l553l023k471j722j418j669j728j307r34q22n92k89
54871F9437m48r81j198j100j379k009k106j438p94n72l24M0j08p57q81j8Q40N97
54853E6801n14j494j766j371o38j05j74n55o03l16k78o16p63l94J64N95R38J154
54835E0065J067Q14O92N95K20j95q9N83J387K069K501K351J615J027J089J262
54819F7053J048J134K063K696J697j7l51P89J604J568K122L802N059M843M248
54804I9358M574N470O180P073Q755J0870J2852J4721J6266J6706J5987J5218J4736
$$ plain form
54791 248766 261903 271205 275419 274931 270320 261650 249532 235710 221864 208596 195969 184266 173723
54778 173723 164191 155638 148523 143223 139392 136267 133426 131096 129838 129996 131285 133118 135442 138895
54764 138895 143736 149131 154162 159199 165471 173519 182919 193464 205698 220221 237204 256736 278854
54751 278854 302996 327970 352599 375815 396045 411236 419893 421716 417122 406660 391145 371910
54739 371910 350517 328205 305618 282905 260201 238217 218187 200964 186400 173855 162920
54728 162920 153258 144257 135608 127903 121893 117366 113512 110218 108056 106999 106079 104517 102465 100418
54714 100418 98570 97019 95982 95504 95408 95719 96652 97980 98902 98816 97838 96454 95010 93769 93010 92811 92946
54697 92946 93183 93546 94180 95089 95993 96397 95987 95086 94439 94358 94407 94200 94087 94598 95652 96839 98043 99173
$$ packed form
54791B48766J3137R302M214m88m611q670j2118j3822j3846j3268j2627j1703j0543
54778A73723r532q553p115n300l831l125k841k330j258J58J289J833K324L453
54764A38895M841N395N031N037O272Q048R400J0545J2234J4523J6983J9532K2118
54751B78854K4142K4974K4629K3216K0230J5191Q657J823m594j0462j5515j9235
54739C71910k1393k2312k2587k2713k2704k1984k0030j7223j4564j2545j0935
54728A62920r662r001q649p705o010m527l854l294k162j057r20j562k052k047
54714A00418j848j551j037m78r6L11R33J328R22q6r78j384j444j241p59j99J35
54697I2946K37L63O34R09R04M04m10r01o47q1M9k07j13N11J054J187J204J130
$$ plain form
54679 99173 99780 99720 99808 100913 102674 104125 105399 107679 111373 115483 119090 122508 126502 131124 135868 140390
54663 140390 144615 148549 152353 156310 160452 164556 168595 172821 177293 181761 186082 190375 194803 199671
54649 199671 205729 213674 223286 233668 244498 256395 269946 285113 301923 320999 342804 366721
54637 366721 391213 414529 434851 450196 458801 459740 453090 439649 420652 397574 372005 345596
54625 345596 319806 295425 272564 251411 232697 216878 203203 190415 178405 168422 161465 157091
54613 157091 154002 151172 148222 145279 142827 141285 140426 139556 138389 137360 136937 137030 137196 137064 136410 135232
54597 135232 133830 132413 130614 127877 124321 120701 117476 114512 111746 109429 107442 105051 101745 97884
54583 97884 94262 91430 89633 88831 88466 87698 86211 84440 82863 81485 80220 79193 78364 77417 76366 75783
$$ packed form
54679I9173O07o0Q8J105J761J451J274K280L694M110L607L418L994M622M744M522
54663A40390M225L934L804L957M142M104M039M226M472M468M321M293M428M868
54649A99671O058P945R612J0382J0830J1897J3551J5167J6810J9076K1805K3917
54637C66721K4492K3316K0322J5345Q605R39o650j3441j8997k3078k5569k6409
54625C45596k5790k4381k2861k1153j8714j5819j3675j2788j2010r983o957m374
54613A57091l089k830k950k943k452j542q59q70j167j029m23R3J66j32o54j178
54597A35232j402j417j799k737l556l620l225k964k766k317j987k391l306l861
54583I7884l622k832j797q02l65p68j487j771j577j378j265j027q29r47j051n83
$$ plain form
54567 75783 75991 76451 76388 75721 74999 74696 74910 75492 76125 76480 76567 76750 77312 78263 79621 81439 83419 85026
54549 85026 86276 87978 90810 94494 98145 101128 103317 104980 106748 109369 113134 117777 123121 129390
54535 129390 136637 144381 152326 160997 171092 182365 193652 203898 212757 220345 226822 232102 235520
54522 235520 235895 232381 225353 216139 205865 194875 183326 171865 161326 151897 143047 134428 126523
54509 126523 120104 115164 110898 106714 102819 99572 96821 94305 92237 90881 89910 88826 87787 87263 87058
54494 87058 86527 85730 85504 86235 87391 88542 89975 91933 93974 95649 97198 99006 100806 101999 102418 102344
54478 102344 102065 101843 101975 102477 102922 102997 102957 103243 103859 104461 104778 104642 103896 102596 101129 99817 98643 97538
54460 97538 96604 95759 94605 93073 91885 91829 92705 93433 93173 91990 90473 89082 87932 86964 86198 85785 85758
$$ packed form
54567G5783K08M60o3o67p22l03K14N82O33L55Q7J83N62R51J358J818J980J607
54549H5026J250J702K832L684L651K983K189J663J768K621L765M643N344O269
54535A29390P247P744P945Q671J0095J1273J1287J0246Q859P588O477N280L418
54522B35520L75l514p028r214j0274j0990j1549j1461j0539r429q850q619p905
54509A26523o419m940m266m184l895l247k751k516k068j356r71j084j039n24k05
54494H7058n31p97k26P31J156J151J433J958K041J675J549J808J800J193M19p4
54478A02344k79k22J32N02M45P5m0K86O16O02L17j36p46j300j467j312j174j105
54460I7538r34q45j154j532j188n6Q76P28k60j183j517j391j150r68p66m13k7
$$ plain form
54443 85758 85792 85469 84825 84354 84311 84292 83701 82434 80876 79456 78402 77825 77793 78331 79370 80632 81688 82329
54425 82329 82783 83293 83608 83266 82306 81217 80284 79570 79517 80793 83268 85875 87902 89787 92170 94798 97027
54408 97027 98917 101008 103282 105184 106709 108655 111498 114591 116927 118420 119959 122269 125174 128150
54394 128150 131179 134561 137978 140416 141294 141176 140919 140541 139493 137715 135750 133904 132014 129975 127830
54379 127830 125352 122279 119001 116283 114180 112003 109541 107510 106435 105836 105047 104158 103573 103150 102370 101099
54363 101099 99658 98314 97046 95611 93732 91541 89915 89820 91122 92590 93374 93882 94885 96397 97982
54348 97982 99553 101227 102817 104132 105576 107816 110950 114392 117564 120400 123300 126741 130724 134468
54334 134468 136940 137824 137638 136843 135356 133112 130454 127691 124811 121955 119572 117671 115456 112128 107709
$$ packed form
54443H5758L4l23o44m71m3j9n91j267j558j420j054n77l2N38J039J262J056O41
54425H2329M54N10L15l42r60j089r33p14n3J276K475K607K027J885K383K628K229
54408I7027J890K091K274J902J525J946K843L093K336J493J539K310K905K976
54394A28150L029L382L417K438Q78j18k57l78j048j778j965j846j890k039k145
54379A27830k478l073l278k718k103k177k462k031j075n99p89q89n85m23p80j271
54363A01099j441j344j268j435j879k191j626r5J302J468P84N08J003J512J585
54348I7982J571J674J590J315J444K240L134L442L172K836K900L441L983L744
54334A34468K472Q84j86p95j487k244k658k763k880k856k383j901k215l328m419
$$ plain form
54319 107709 102764 97880 93669 90609 88437 86288 83861 81800 80496 79302 77568 75673 74258 73156
54305 73156 71973 71101 71147 71779 72122 71977 71738 71456 70932 70453 70440 70516 69939 68857 68218 68424 68950 69305 69498
54286 69498 69518 69242 68940 69009 69083 68322 66760 65480 65097 64961 64365 63709 63800 64564 65252 65635 66164 66957 67344 66795
54266 66795 65921 66084 67944 70695 72926 74036 74484 74870 75295 75700 76180 76599 76386 75202 73531 72185 71463
54249 71463 71157 71105 71309 71739 72371 73236 74116 74566 74584 74840 75755 76741 76980 76626 76521 76951 77371 77297 76806 76121
54229 76121 75348 74666 74292 74144 73930 73571 73194 72730 71931 70782 69618 68848 68749 69359 70308 70969 71072 70960 71009
54210 71009 71136 71194 71416 72007 72655 72903 72693 72103 71007 69493 68182 67528 67161 66585 66102 66331 67199 68143
54192 68143 68909 69424 69268 68205 66883 66092 65642 64983 64588 65440 67261 68580 68773 68852 69878 71632 73268
$$ packed form
54319A07709m945m884m211l060k172k149k427k061j304j194j734j895j415j102
54305G3156j183q72M6O32L43j45k39k82n24m79j3P6n77j082o39K06N26L55J93
54286F9498K0k76l02O9P4p61j562j280l83j36n96o56R1P64O88L83N29P93L87n49
54266F6795q74J63J860K751K231J110M48L86M25M05M80M19k13j184j671j346p22
54249G1463l06n2K04M30O32Q65Q80M50J8K56R15R86K39l54j05M30M20p4m91o85
54229G6121p73o82l74j48k14l59l77m64p99j149j164p70r9O10R49O61J03j12M9
54210G1009J27N8K22N91O48K48k10n90j096j514j311o54l67n76m83K29Q68R44
54192F8143P66N15j56j063j322p91m50o59l95Q52J821J319J93P9J026J754J636
$$ plain form
54175 73268 74285 74384 73260 71211 69368 68721 69200 69936 70091 69325 67994 67015 67016 67542 67625 67124 66838 67317 68357
54156 68357 69682 71245 72691 73441 73643 74196 75477 76790 77455 77622 77675 77653 77730 78373 79451 79920 79120 77780
54138 77780 77021 76921 76708 75934 74724 73249 71661 70315 69464 68902 68407 68234 68612 68989 68434 66790 64990
54121 64990 64164 64647 65773 66452 66100 65209 64829 65347 66054 66087 65463 64898 64927 65502 66181 66440 65955 64849 63508
54102 63508 62093 60557 59214 58762 59413 60381 60712 60322 59826 59563 59255 58551 57521 56613 56257 56483 56844 56878
54084 56878 56661 56658 56970 57100 56683 56097 56046 56791 58016 59250 60199 60832 61356 61977 62536 62668 62458 62640 63818
54065 63818 65658 67151 67616 67233 66672 66431 66616 67224 68439 70421 72810 74802 75995 76873 78125 79731
54049 79731 81148 82194 83106 83840 84048 83912 84338 86007 88616 91303 93484 95165 96834 99188 102578 106589
$$ packed form
54175G3268J017R9j124k049j843o47M79P36J55p66j331r79JN26Q3n01k86M79J040
54156F8357J325J563J446P50K02N53J281J313O65J67N3k2P7O43J078M69q00j340
54138G7780p59j00k13p74j210j475j588j346q51n62m95j73L78L77n55j644j800
54121F4990q26M83J126O79l52q91l80N18P07L3o24n65K9N75O79K59m85j106j341
54102F3508j415j536j343m52O51R68L31l90m96k63l08p04j030r08l56K26L61L4
54084E6878k17lL12J30m17n86n1P45J225J234R49O33N24O21N59J32k10J82J178
54065F3818J840J493M65l83n61k41J85O08J215J982K389J992J193Q78J252J606
54049G9731J417J046R12P34K08j36M26J669K609K687K181J681J669K354L390M011
$$ plain form
54033 106589 110495 114201 118324 123316 128996 135010 141138 147044 152331 157167 162364 168496 175322 182228
54019 182228 188683 194055 197616 199222 199635 199811 200182 200867 202103 204039 206392 208547 209756 209178 206336
54004 206336 201923 197634 194708 192900 191218 189192 186976 184573 181646 178072 174231 170650 167539 164712
53990 164712 161872 158994 156337 154036 151917 149946 148488 147616 146579 144685 142470 141022 140234 138861 136473
53975 136473 134191 133000 132448 131661 130693 130042 129710 129656 130520 132800 135688 137696 138293 138181 138152 138453 139095 140069
53957 140069 141192 142201 142984 143432 143394 143133 143455 144857 146881 148774 150423 152073 153576 154663 155725 157522
53941 157522 160204 163317 166722 170803 175667 180776 185539 189859 193850 197312 199660 200363 199482 197731 195838
53926 195838 193864 191532 189214 187990 188472 190075 191802 193240 194519 195928 198024 201487 206267 211445
$$ packed form
54033A06589L906L706M123M992N680O014O128N906N287M836N197O132O826O906
54019A82228O455N372L561J606M13J76L71O85J236J936K353K155J209n78k842
54004B06336m413m289k926j808j682k026k216k403k927l574l841l581l111k827
53990A64712k840k878k657k301k119j971j458q72j037j894k215j448p88j373k388
53975A36473k282j191n52p87r68o51l32n4Q64K280K888K008N97j12k9L01O42R74
53957A40069J123J009P83M48l8k61L22J402K024J893J649J650J503J087J062J797
53941A57522K682L113L405M081M864N109M763M320L991L462K348P03q81j751j893
53926A95838j974k332k318j224M82J603J727J438J279J409K096L463M780N178
$$ plain form
53912 211445 216453 221796 227935 234224 239903 245571 252556 261158 270435 279425 287468 293688 297506 299771
53898 299771 302178 305185 307482 307844 306611 304913 303218 301226 298578 295168 291131 286948 283199 279839
53884 279839 276044 271086 265127 258827 252455 245712 238346 230614 223069 216004 209283 202789 196843 191795
53870 191795 187270 182411 177135 172469 169163 166521 163299 159343 155519 152339 149542 146917 144588 142358
53856 142358 139597 136097 132405 129110 126322 123999 122203 120758 119169 117195 115161 113533 112411 111550
53842 111550 110560 109090 107212 105674 105305 106106 107259 108028 108194 107692 106438 104720 103285 102771 103317 104664
53826 104664 106204 106964 106175 104082 101764 100069 99133 98926 99570 100886 102253 103297 104323 105775 107632
53811 107632 109543 111156 112144 112392 112441 113254 115196 117651 119942 122203 124907 128025 131220 134597 138637
$$ packed form
53912B11445N008N343O139O289N679N668O985Q602R277Q990Q043O220L818K265
53898B99771K407L007K297L62j233j698j695j992k648l410m037m183l749l360
53884B79839l795m958n959o300o372o743p366p732p545p065o721o494n946n048
53870A91795m525m859n276m666l306k642l222l956l824l180k797k625k329k230
53856A42358k761l500l692l295k788k323j796j445j589j974k034j628j122q61
53842A11550r90j470j878j538l69Q01J153P69J66n02j254j718j435n14N46J347
53826A04664J540P60p89k093k318j695r36k07O44J316J367J044J026J452J857
53811A07632J911J613R88K48M9Q13J942K455K291K261K704L118L195L377M040
$$ plain form
53796 138637 143441 148542 153575 158722 164385 170565 176671 181901 185891 189067 192204 195571 198693 201086
53782 201086 202959 204944 207278 209531 211072 211546 210992 209777 208462 207457 206613 205316 203134 200279 197264
53767 197264 194215 190839 187119 183685 181164 179407 177698 175660 173516 171539 169669 167826 166136 164637
53753 164637 163123 161483 159851 158288 156744 155480 154948 154873 154052 151655 148336 145451 143513 142049 140621
53738 140621 139228 137820 136240 134678 133597 133142 133131 133581 134653 136054 137080 137399 137361 137446 137837 138525 139395
53721 139395 140187 140792 141489 142495 143400 143625 143290 142939 142560 141731 140746 140597 141505 142381 142267 141589 141370 141812
53703 141812 142391 142979 144100 146165 148958 151875 154327 156059 157428 159256 162086 165619 169090 172131 174980
53688 174980 177934 180915 183690 186344 189285 192699 196125 198869 200879 202905 205539 208364 210422 211340
$$ packed form
53796A38637M804N101N033N147N663O180O106N230L990L176L137L367L122K393
53782B01086J873J985K334K253J541M74n54j215j315j005q44j297k182k855l015
53767A97264l049l376l720l434k521j757j709k038k144j977j870j843j690j499
53753A64637j514j640j632j563j544j264n32p5q21k397l319k885j938j464j428
53738A40621j393j408j580j562j081m55j1M50J072J401J026L19l8Q5L91O88Q70
53721A39395P92O05O97J006R05K25l35l51l79q29r85j49R08Q76j14o78k19M42
53703A41812N79N88J121K065K793K917K452J732J369J828K830L533L471L041K849
53688A74980K954K981K775K654K941L414L426K744K010K026K634K825K058R18
$$ plain form
53674 211340 211566 211612 211597 211551 211670 212126 212939 214071 215322 216109 215806 214401 212554 210921 209736 209028 208819 209006
53656 209006 209343 209639 209747 209425 208590 207618 206996 206673 206207 205508 204948 204748 204760 204881 205097 205102 204491 203543 203165 203828
53636 203828 205055 206196 207139 207989 208603 208888 209130 209653 210478 211581 213126 215142 217296 219260 220977 222370
53620 222370 223244 223807 224797 226701 229152 231533 233810 236362 239241 242092 244681 247096 249489 251966 254753
53605 254753 258191 262491 267551 272980 278340 283474 288563 293676 298346 301982 304695 307425 311096 315954
53591 315954 321634 327518 332955 337595 341683 345737 349849 353644 356892 359731 362253 364334 365992 367464
53577 367464 368847 370115 371471 373091 374565 375294 375571 376487 378490 380817 382638 383902 384631 384324 382850
53562 382850 381248 380694 381074 381363 381104 380699 380488 380389 380432 380890 381742 382537 382955 383182 383718 385047 387406 390530
$$ packed form
53674B11340K26M6j5m6J19M56Q13J132J251P87l03j405j847j633j185p08k09J87
53656B09006L37K96J08l22q35r72o22l23m66o99n60k00J2J21K16No11r48l78O63
53636B03828J227J141R43Q50O14K85K42N23Q25J103J545K016K154J964J717J393
53620B22370Q74N63R90J904K451K381K277K552K879K851K589K415K393K477K787
53605B54753L438M300N060N429N360N134N089N113M670L636K713K730L671M858
53591C15954N680N884N437M640M088M054M112L795L248K839K522K081J658J472
53577C67464J383J268J356J620J474P29K77R16K003K327J821J264P29l07j474
53562C82850j602n54L80K89k59m05k11r9M3M58Q52P95M18K27N36J329K359L124
$$ plain form
53544 390530 393720 396433 398714 400823 402637 403817 404465 405231 406744 409110 411910 414580 416908 419258 422147
53529 422147 425482 428606 431276 434221 438402 443968 450318 456986 464135 472257 481606 491868 502310 512391
53515 512391 522175 531944 541654 551312 561745 574066 588210 602877 617347 632458 649130 666755
53503 666755 683974 700559 717640 736361 757105 779728 803616 827646 851027 874218 898350
53492 898350 923699 949403 974699 999668 1024622 1049420 1073744 1097541 1120927 1143992 1166916
53481 1166916 1189986 1213212 1236176 1258431 1279993 1301296 1322737 1344308 1365656 1386564 1407297
53470 1407297 1428280 1449404 1469984 1489451 1507723 1524755 1540258 1554247 1567344 1580014 1591755
53459 1591755 1601548 1608891 1613969 1617050 1618267 1617787 1615673 1611655 1605418 1596978 1586443 1573698 1558862
$$ packed form
53544C90530L190K713K281K109J814J180O48P66J513K366K800K670K328K350K889
53529D22147L335L124K670K945M181N566O350O668P149Q122R349J0262J0442J0081
53515E12391R784R769R710R658J0433J2321J4144J4667J4470J5111J6672J7625
53503F66755J7219J6585J7081J8721K0744K2623K3888K4030K3381K3191K4132
53492H98350K5349K5704K5296K4969K4954K4798K4324K3797K3386K3065K2924
53481A166916K3070K3226K2964K2255K1562K1303K1441K1571K1348K0908K0733
53470A407297K0983K1124K0580J9467J8272J7032J5503J3989J3097J2670J1741
53459A591755R793P343N078L081J217m80k114m018o237q440j0535j2745j4836
$$ plain form
53446 1558862 1542752 1526293 1509594 1492196 1473994 1455214 1435552 1414252 1391260 1367599 1344258
53435 1344258 1321235 1298028 1274640 1251634 1229454 1208062 1187262 1167113 1147999 1130339 1114298
53424 1114298 1099838 1086995 1075877 1066328 1057861 1050103 1043099 1037043 1032034 1028378 1026680 1027245 1029617
53411 1029617 1033117 1037563 1043096 1049626 1056994 1065460 1075433 1086901 1099703 1114199 1130997 1150009 1170407
53398 1170407 1191593 1213703 1237165 1262325 1289583 1319219 1350859 1383661 1417327 1452534 1490046
53387 1490046 1529787 1571111 1613720 1657951 1704233 1752494 1802165 1852666 1903902 1956171 2009609
53376 2009609 2063916 2118729 2173918 2229138 2283346 2335337 2384838 2432638 2479501 2525263 2569020
53365 2569020 2609900 2647447 2681475 2711752 2737818 2759171 2775686 2787750 2795816 2799926 2799805 2795236
$$ packed form
53446A558862j6110j6459j6699j7398j8202j8780j9662k1300k2992k3661k3341
53435A344258k3023k3207k3388k3006k2180k1392k0800k0149j9114j7660j6041
53424A114298j4460j2843j1118r549q467p758p004o056n009l656j698N65K372
53411A029617L500M446N533O530P368Q466R973J1468J2802J4496J6798J9012K0398
53398A170407K1186K2110K3462K5160K7258K9636L1640L2802L3666L5207L7512
53387A490046L9741M1324M2609M4231M6282M8261M9671N0501N1236N2269N3438
53376B009609N4307N4813N5189N5220N4208N1991M9501M7800M6863M5762M3757
53365B569020M0880L7547L4028L0277K6066K1353J6515J2064Q066M110j21m569
$$ plain form
53353 2795236 2786179 2772607 2754561 2732271 2706131 2676682 2644684 2610878 2575363 2537430 2496299
53342 2496299 2451877 2404612 2355025 2303841 2252295 2201774 2153150 2106649 2062083 2018871 1976119
53331 1976119 1933257 1890540 1848630 1807840 1768159 1729708 1692706 1657148 1622985 1590438 1559764
53320 1559764 1530959 1504150 1479962 1458841 1440213 1422972 1406725 1391893 1378547 1365766 1352334
53309 1352334 1337674 1322095 1306470 1291704 1278163 1265662 1254168 1244185 1236090 1229490 1223762 1218946
53297 1218946 1215491 1213398 1212294 1212130 1213101 1215080 1217833 1221668 1227072 1233843 1241340 1249583 1259325 1271039
53283 1271039 1284606 1300000 1317476 1336980 1358106 1380745 1405019 1430468 1456061 1481185 1505911
53272 1505911 1530106 1553026 1574005 1592973 1610206 1626164 1641519 1656586 1670641 1682586 1692274
$$ packed form
53353B795236r057j3572j8046k2290k6140k9449l1998l3806l5515l7933m1131
53342B496299m4422m7265m9587n1184n1546n0521m8624m6501m4566m3212m2752
53331A976119m2862m2717m1910m0790l9681l8451l7002l5558l4163l2547l0674
53320A559764k8805k6809k4188k1121j8628j7241j6247j4832j3346j2781j3432
53309A352334j4660j5579j5625j4766j3541j2501j1494r983q095o600n728m816
53297A218946l455k093j104j64R71J979K753L835N404O771P497Q243R742J1714
53283A271039J3567J5394J7476J9504K1126K2639K4274K5449K5593K5124K4726
53272A505911K4195K2920K0979J8968J7233J5958J5355J5067J4055J1945R688
$$ plain form
53261 1692274 1700264 1706332 1709421 1709365 1707359 1704204 1699145 1691284 1681135 1669789 1657240 1642552 1625349
53248 1625349 1606304 1586352 1566049 1545486 1524212 1501377 1476445 1449846 1422773 1396432 1371469
53237 1371469 1347672 1324115 1300058 1275831 1252395 1230047 1208199 1186469 1165127 1144234 1123267
53226 1123267 1102083 1081442 1062061 1043846 1026530 1010255 994897 979642 964055 948953 935381
53215 935381 923252 911797 900878 890930 881942 873333 864648 855650 846001 835533 824585 813300 800843
53202 800843 786133 769343 751958 735355 719893 705300 691338 677959 665243 653259 641776
53191 641776 630305 618711 607461 596844 586280 574916 562612 549736 536253 521754 506376
53180 506376 491034 476598 463240 450626 438429 426641 415602 405640 396515 387485 378126 368752
$$ packed form
53261A692274P990O068L089n6k006l155n059p861j0149j1346j2549j4688j7203
53248A625349j9045j9952k0303k0563k1274k2835k4932k6599k7073k6341k4963
53237A371469k3797k3557k4057k4227k3436k2348k1848k1730k1342k0893k0967
53226A123267k1184k0641j9381j8215j7316j6275j5358j5255j5587j5102j3572
53215I35381j2129j1455j0919r948q988q609q685q998r649j0468j0948j1285j2457
53202H00843j4710j6790j7385j6603j5462j4593j3962j3379j2716j1984j1483
53191F41776j1471j1594j1250j0617j0564j1364j2304j2876j3483j4499j5378
53180E06376j5342j4436j3358j2614j2197j1788j1039r962r125r030r359r374
$$ plain form
53168 368752 359797 351279 343260 336220 330382 325144 319934 315180 311575 308628 304960 299969 294406 289208
53154 289208 284516 279943 275166 270120 265117 260803 257500 254694 251738 248969 247353 247029 246986 246339 245162
53139 245162 243855 242464 241011 239871 239374 239382 239595 239892 240163 240249 240286 240707 241638 242737 243858 245430 247819
53122 247819 250674 253230 254947 255617 255284 254446 253940 254124 254410 253975 252686 250943 248901 246447 243742 241114
53106 241114 238393 234954 230649 226106 221771 217119 211416 205048 199422 195471 192749 190219 187445 184639
53092 184639 181908 179076 176209 173686 171616 169625 167496 165606 164408 163766 163181 162495 161911 161431 160723 159649
53076 159649 158513 157547 156394 154461 151764 149172 147624 147254 147435 147566 147497 147193 146460 145258 143967 142874
53060 142874 141723 140228 138799 138078 137914 137560 136931 136763 137261 137470 136555 135071 134247 134469 135101 135488 135498 135288
$$ packed form
53168C68752q955q518q019p040n838n238n210m754l605k947l668m991n563n198
53154B89208m692m573m777n046n003m314l303k806k956k769j616l24m3o47j177
53139B45162j307j391j453j140m97QK13K97K71Q6L7M21R31J099J121J572K389
53122B47819K855K556J717O70l33q38n06J84K86m35j289j743k042k454k705k628
53106B41114k721l439m305m543m335m652n703o368n626l951k722k530k774k806
53092A84639k731k832k867k523k070j991k129j890j198o42n85o86n84m80p08j074
53076A59649j136r66j153j933k697k592j548l70J81J31o9l04p33j202j291j093
53060A42874j151j495j429p21j64l54o29j68M98K09r15j484q24K22O32L87J0k10
$$ plain form
53042 135288 135055 134870 134368 132880 130321 127605 125692 124566 123714 123155 123267 123861 124321 124551 124958 125526 125741
53025 125741 125499 125273 125174 124690 123676 122826 122675 122756 122294 121302 120434 120088 120186 120610 121286 121966 122438 122931 123832
53006 123832 124963 125611 125437 124997 125067 125723 126458 127065 127927 129332 130927 132155 132927 133482 133807 133732 133520 133754
52988 133754 134498 135141 135342 135635 136716 138592 140869 143505 146707 150300 153785 156959 160026 163110 166083
52973 166083 168830 171295 173275 174553 175298 176048 177199 178716 180278 181462 181852 181293 180028 178365 176319
52958 176319 173847 171382 169641 168789 168104 166663 164245 161492 159318 158246 158129 158368 158372 157910 157178 156618 156568
52941 156568 156838 156723 155704 154150 153022 152891 153609 154843 156356 157655 158063 157497 156659 156157 155969 156087 156955
52924 156955 158674 160363 161142 161339 161959 163225 164368 164701 164179 163080 161832 161075 161238 162070 163090 164307
$$ packed form
53042A35288k33j85n02j488k559k716j913j126q52n59J12N94M60K30M07N68K15
53025A25741k42k26r9m84j014q50j51Q1m62r92q68l46R8M24O76O80M72M93R01
53006A23832J131O48j74m40P0O56P35O07Q62J405J595J228P72N55L25p5k12K34
52988A33754P44O43K01K93J081J876K277K636L202L593L485L174L067L084K973
52973A66083K747K465J980J278P45P50J151J517J562J184L90n59j265j663k046
52958A76319k472k465j741q52o85j441k418k753k174j072j17K39Mm62p32n60n0
52941A56568K70j15j019j554j128j31P18J234J513J299M08n66q38n02j88J18Q68
52924A56955J719J689P79J97O20J266J143L33n22j099j248p57J63Q32J020J217
$$ plain form
52908 164307 165916 167491 168267 168173 167840 167619 167290 166798 166560 166837 167403 168051 168921 170210 171938 174067 176455
52891 176455 178684 180329 181362 181933 181983 181555 181246 181680 182690 183717 184820 186543 188844 191009 192648 193953
52875 193953 194948 195387 195528 196092 197200 198160 198607 199034 199872 200856 201724 202751 204093 205281 206003 206780 208310
52858 208310 210522 212845 215054 217418 220269 223693 227412 230761 233194 234934 236708 238768 240783 242713
52844 242713 244986 247549 249616 250737 251326 251656 251193 249561 247382 245337 243089 240024 236524 233535 231227
52829 231227 229029 226749 224655 222520 219583 215690 211756 208771 206788 205087 202948 200125 196883 193773
52815 193773 191184 189023 186922 184741 182755 181383 180787 180623 180203 179130 177765 176789 176283 175622 174301 172428
52799 172428 170308 168129 166216 164922 163952 162472 160335 158498 157691 157306 156407 155218 154693 154941 155130 154839
$$ packed form
52908A64307J609J575P76r4l33k21l29m92k38K77N66O48Q70J289J728K129K388
52891A76455K229J645J033N71N0m28l09M34J010J027J103J723K301K165J639J305
52875A93953R95M39J41N64J108R60M47M27Q38R84Q68J027J342J188P22P77J530
52858B08310K212K323K209K364K851L424L719L349K433J740J774K060K015J930
52844B42713K273K563K067J121N89L30m63j632k179k045k248l065l500k989k308
52829B31227k198k280k094k135k937l893l934k985j983j701k139k823l242l110
52815A93773k589k161k101k181j986j372n96j64m20j073j365r76n06o61j321j873
52799A72428k120k179j913j294r70j480k137j837q07l85q99j189n25K48J89k91
$$ plain form
52783 154839 154516 154497 154399 153760 152612 151196 149622 148076 146877 146092 145423 144665 143977 143554 143308 142994 142391 141297
52765 141297 139624 137587 135490 133269 130582 127532 124963 123803 124136 125058 125377 124401 122228 119471 116792
52750 116792 114650 113311 112840 112973 113143 112846 111931 110546 108930 107340 106020 105044 104268 103471 102537 101510
52734 101510 100595 100037 99786 99393 98547 97638 97322 97551 97657 97499 97888 99444 101561 103048 103407 102980 102159 101080
52716 101080 100006 99420 99582 100342 101457 102925 104925 107499 110262 112475 113653 114098 114489 114979 115193 115198 115740
52699 115740 117123 118498 118874 118363 117797 117445 116844 115701 114323 113162 112404 111943 111382 110199 108324 106307
52683 106307 104558 102717 100304 97643 95474 93869 92282 90566 89166 88273 87512 86590 85623 84626 83346
52668 83346 81829 80651 80219 80246 80183 79837 79245 78281 76754 74828 73152 72519 73293 74997 76546 77154 76997
$$ packed form
52783A54839l23j9r8o39j148j416j574j546j199p85o69p58o88m23k46l14o03j094
52765A41297j673k037k097k221k687l050k569j160L33R22L19r76k173k757k679
52750A16792k142j339m71J33J70k97r15j385j616j590j320r76p76p97r34j027
52734A01510r15n58k51l93q46r09l16K29J06j58L89J556K117J487L59m27q21j079
52716A01080j074n86J62P60J115J468K000K574K763K213J178M45L91M90K14NN42
52699A15740J383J375L76n11n66l52o01j143j378j161p58m61n61j183j875k017
52683A06307j749j841k413k661k169j605j587j716j400q93p61r22r67r97j280
52668H3346j517j178m32K7o3l46n92r64j527j926j676o33P74J704J549O08j57
$$ plain form
52651 76997 76777 76777 76704 76324 75783 75256 74762 74451 74677 75538 76648 77546 78153 78652 79175 79771 80584 81845 83626
52632 83626 85605 87169 87907 88046 88175 88458 88424 87692 86551 85475 84403 82926 80945 78726 76499 74512
52616 74512 73301 73316 74238 75112 75271 74826 74357 74497 75679 77775 79958 81321 81736 81787 81953 82169 82162 81837 81383
52597 81383 81289 82051 83521 84796 85231 85322 85976 87220 88346 89124 89963 90912 91494 91722 92318 93597 94945 95853
52579 95853 96658 97712 98543 98557 98121 98259 99514 101674 104314 107091 109681 111928 114002 116057 117858 118997
52563 118997 119389 119334 119225 119374 119932 120818 121898 123295 125226 127483 129448 130834 131976 133241 134571 135863
52547 135863 137283 138809 139952 140385 140470 140692 140942 140873 140631 140663 140999 141311 141531 141848 142230 142516 142902 143757 144946
52528 144946 145926 146590 147482 149022 150909 152524 153528 153887 153640 152887 151836 150695 149693 149231 149651 150715
$$ packed form
52651G6997k20%p3l80n41n27m94l11K26Q61J110Q98O07M99N23N96Q13J261J781
52632H3626J979J564P38J39J29K83l4p32j141j076j072j477j981k219k227j987
52616G4512j211J5R22Q74J59m45m69J40J182K096K183J363M15N1J66K16pl25m54
52597H1383r4P62J470J275M35R1O54J244J126P78Q39R49N82K28N96J279J348R08
52579I5853Q05J054Q31J4m36J38J255K160K640K777K590K247K074K055J801J139
52563A18997L92n5j09J49N58Q86J080J397J931K257J965J386J142J265J330J292
52547A35863J420J526J143M33Q5K22K50o9k42L2L36L12K20L17L82K86L86Q55J189
52528A44946R80O64Q92J540J887J615J004L59k47p53j051j141j002m62M20J064
$$ plain form
52512 150715 151588 151657 151148 150672 150324 149610 148238 146656 145643 145571 146169 146807 146874 146081 144692 143484 143164 143715
52494 143715 144486 144999 145437 146206 147320 148471 149465 150253 150721 150914 151299 152264 153388 153810 153493 153449 154418 155898
52476 155898 156980 157660 158624 160090 161585 162827 164072 165395 166280 166260 165578 164865 164473 164418 164747 165503 166439
52459 166439 167202 167893 169051 170840 172554 173257 172883 172333 172418 173076 173777 174392 175213 176239 176967 177086 177040 177635
52441 177635 179181 181228 183025 184101 184447 184317 183930 183330 182555 181845 181516 181593 181735 181601 181115 180346 179344
52424 179344 178316 177667 177574 177588 177000 175671 174254 173484 173435 173552 173265 172427 171270 170160 169341 168732 167914 166514
52406 166514 164702 163175 162476 162454 162563 162588 162714 162966 163034 162885 163100 164208 165908 167376 168247 168839 169446 169943
52388 169943 170233 170671 171728 173462 175558 177727 179802 181634 183162 184581 186184 188025 189861 191469 192896
$$ packed form
52512A50715Q73O9n09m76l48p14j372j582j013p2N98O38O7p93j389j208l20N51
52494A43715P71N13M38P69J114J151R94P88M68J93L85R65J124M22l17m4R69J480
52476A55898J082O80R64J466J495J242J245J323Q85k0o82p13l92n5L29P56R36
52459A66439P63O91J158J789J714P03l74n50Q5O58P01O15Q21J026P28J19m6N95
52441A77635J546K047J797J076L46j30l87o00p75p10l29P7J42j34m86p69j002
52424A79344j028o49r3J4n88j329j417p70m9J17k87q38j157j110q19o09q18j400
52406A66514j812j527o99k2J09K5J26K52O8j49K15J108J700J468Q71N92O07M97
52388A69943K90M38J057J734K096K169K075J832J528J419J603J841J836J608J427
$$ plain form
52373 192896 194357 195948 197501 198764 199711 200646 201976 203873 206181 208628 211044 213415 215767 218075 220264
52358 220264 222340 224522 227168 230496 234396 238493 242259 245126 246791 247619 248525 250181 252374 254377 255818
52343 255818 256936 258092 259423 261053 263288 266310 269804 273092 275707 277823 280013 282514 284766 285917
52329 285917 285840 285418 285600 286494 287692 289191 291430 294455 297641 300483 303268 306649 310742 314981 318800
52314 318800 322225 325726 329646 333937 338424 343132 348178 353502 359030 365068 372123 380229 388841 397568
52300 397568 406564 415999 425661 435541 446277 458317 471018 483368 495463 508532 523485 540147
52288 540147 557906 576374 595266 614270 633347 652643 671952 690817 709299 728050 747322
52277 747322 766453 784702 802136 819353 836673 853882 870393 885362 898082 908646 917942 926701
$$ packed form
52373A92896J461J591J553J263R47R35J330J897K308K447K416K371K352K308K189
52358B20264K076K182K646L328L900M097L766K867J665Q28R06J656K193K003J441
52343B55818J118J156J331J630K235L022L494L288K615K116K190K501K252J151
52329B85917p7m22J82Q94J198J499K239L025L186K842K785L381M093M239L819
52314C18800L425L501L920M291M487M708N046N324N528O038P055Q106Q612Q727
52300C97568Q996R435R662R880J0736J2040J2701J2350J2095J3069J4953J6662
52288E40147J7759J8468J8892J9004J9077J9296J9309J8865J8482J8751J9272
52277G47322J9131J8249J7434J7217J7320J7209J6511J4969J2720J0564R296Q759
$$ plain form
52265 926701 934814 941760 947316 951532 954434 956116 956813 956540 954965 952056 948572 945405 942618 939508 935524
52250 935524 930718 925433 919955 914580 909690 905595 902353 899875 898279 898103 899989 903931 909037 914407
52236 914407 920165 927234 936154 946589 958041 970431 983768 997764 1012091 1026603 1041002 1054608
52224 1054608 1066819 1077612 1087423 1096762 1105958 1114869 1122761 1128920 1133509 1137284 1140347 1141769 1140726
52211 1140726 1137439 1132675 1126920 1120415 1113406 1105801 1096976 1086314 1073627 1058911 1042424 1025322 1009327
52198 1009327 995038 981233 966586 951403 936907 923490 910799 899070 889089 880910 873649 866653
52186 866653 859980 853721 847743 842226 837565 833513 829190 824252 819437 815653 812993 810843 808530 805756
52172 805756 802873 800759 799900 799498 798031 794849 790729 786788 783435 780507 777762 774895 771577 767902 764451
$$ packed form
52265I26701Q113O946N556M216K902J682O97k73j575k909l484l167k787l110l984
52250I35524m806n285n478n375m890m095l242k478j596j76J886L942N106N370
52236I14407N758P069Q920J0435J1452J2390J3337J3996J4327J4512J4399J3606
52224A054608J2211J0793R811R339R196Q911P892O159M589L775L063J422j043
52211A140726l287m764n755o505p009p605q825j0662j2687j4716j6487j7102j5995
52198A009327j4289j3805j4647j5183j4496j3417j2691j1729r981q179p261o996
52186H66653o673o259n978n517m661m052m323m938m815l784k660k150k313k774
52172H05756k883k114q59m02j467l182m120l941l353k928k745k867l318l675l451
$$ plain form
52157 764451 761603 759109 756536 753765 750824 747626 744287 741373 739374 738025 736495 734231 731384 728430
52143 728430 725495 722184 718104 713500 709209 705825 703069 700188 696816 693129 689303 685244 680858 676237
52129 676237 671493 666763 662499 659433 657965 657616 657233 655839 653362 650579 648214 646156 643833 641340 639614
$$ packed form
52157G64451k848k494k573k771k941l198l339k914j999j349j530k264k847k954
52143G28430k935l311m080m604m291l384k756k881l372l687l826m059m386m621
52129F76237m744m730m264l066j468l49l83j394k477k783k365k058k323k493j726
$$ [...]
##END NTUPLES=NMR SPECTRUM
##END=
