
##TITLE=AC1247__6945447_2EnzlCZ7cf
##JCAMPDX= 6.0         $$ Bruker NMR JCAMP-DX V2.0
##DATA TYPE= NMR SPECTRUM
##DATA CLASS= NTUPLES
##ORIGIN= BRUKER
##OWNER= Administrator
$$ 1.72 TOPSPIN		Version 2.1
$$ 2012-10-18 13:45:10.396 -0700  Administrator@X
$$ Compression mode = diff/dup
##.OBSERVE FREQUENCY= 400.02188249412
##.OBSERVE NUCLEUS= ^1H
##.ACQUISITION MODE= SIMULTANEOUS (DQD)
##.ACQUISITION SCHEME= undefined
##.AVERAGES= 8
##.DIGITISER RES= 22
##SPECTROMETER/DATA SYSTEM= spect
##.PULSE SEQUENCE= zg30
##.SOLVENT NAME= COFFEE_meoh
##.SHIFT REFERENCE= INTERNAL, COFFEE_meoh, 1, 14.98509
##AUDIT TRAIL= $$ (NUMBER, WHEN, WHO, WHERE, PROCESS, VERSION, WHAT)
$$ ##TITLE= Audit trail, TOPSPIN		Version 2.1
$$ ##JCAMPDX= 5.01
$$ ##ORIGIN= Bruker BioSpin GmbH
$$ ##OWNER= Administrator
$$ $$ C:\Bruker\TOPSPIN/data/COFFEE/nmr/AC1247__6945447_2EnzlCZ7cf/10/pdata/1/auditp.txt
$$ ##AUDIT TRAIL=  $$ (NUMBER, WHEN, WHO, WHERE, PROCESS, VERSION, WHAT)
(   1,<2012-10-13 20:27:09.656 -0500>,<Administrator>,<TOPSPIN>,<go>,<TOPSPIN 2.1>,
      <created by zg
	started at 2012-10-13 20:26:03.093 -0500,
	POWCHK enabled, PULCHK disabled,
       configuration hash MD5:
       6B 1B 68 BB D9 2E 58 E2 7F 35 AD 54 07 DF 0E 41
       data hash MD5: 64K
       4D 4D 89 2B 23 3F 96 03 D6 B3 D7 A3 D6 7E 43 FE>)
(   2,<2012-10-13 20:27:12.218 -0500>,<Administrator>,<TOPSPIN>,<proc1d>,<TOPSPIN 2.1>,
      <Start of raw data processing
       efp LB = 0 FT_mod = 6 PKNL = 1 PHC0 = 0 PHC1 = 0 SI = 32K 
       data hash MD5: 32K
       4B 82 8C 37 FF F4 92 41 9E 71 89 74 A5 02 3E 37>)
(   3,<2012-10-13 20:27:12.593 -0500>,<Administrator>,<TOPSPIN>,<proc1d>,<TOPSPIN 2.1>,
      <pk PHC0 = 180.368 PHC1 = 0 
       data hash MD5: 32K
       70 B1 2E 90 0D B0 B7 8A 1F 02 D5 DE 68 2B 5E A1>)
(   4,<2012-10-13 20:27:12.718 -0500>,<Administrator>,<TOPSPIN>,<proc1d>,<TOPSPIN 2.1>,
      <abs ABSG = 1 
       data hash MD5: 32K
       F3 00 04 9D 72 82 D1 55 C3 EC 1F F3 8D 37 B0 6C>)
(   5,<2012-10-13 20:27:12.750 -0500>,<Administrator>,<TOPSPIN>,<proc1d>,<TOPSPIN 2.1>,
      <abs ABSG = 2 
       data hash MD5: 32K
       9B 07 45 9A 78 42 58 5F A1 71 47 05 B4 96 E2 8C>)
(   6,<2012-10-13 20:27:12.781 -0500>,<Administrator>,<TOPSPIN>,<proc1d>,<TOPSPIN 2.1>,
      <abs ABSG = 3 
       data hash MD5: 32K
       10 56 7C 36 AF 4C 30 09 EA 36 DA 88 01 42 66 3A>)
(   7,<2012-10-13 20:27:12.812 -0500>,<Administrator>,<TOPSPIN>,<proc1d>,<TOPSPIN 2.1>,
      <abs ABSG = 4 
       data hash MD5: 32K
       21 22 6A BD 84 24 B1 3A F3 5B D2 75 42 66 BA 00>)
(   8,<2012-10-13 20:27:12.843 -0500>,<Administrator>,<TOPSPIN>,<proc1d>,<TOPSPIN 2.1>,
      <abs ABSG = 5 
       data hash MD5: 32K
       FB C2 2D A4 6D AE 96 F1 94 CE 38 5F C8 27 C8 92>)
(   9,<2012-10-13 20:27:16.718 -0500>,<Administrator>,<TOPSPIN>,<audit>,<TOPSPIN 2.1>,
      <user comment:
       ICON-NMR User ID: COFFEE
       data hash MD5: 32K
       FB C2 2D A4 6D AE 96 F1 94 CE 38 5F C8 27 C8 92>)
$$ ##END=
$$ 
$$ $$ hash MD5
$$ [...]
150 150 150 150 150 150 150 150
##$TP07= 0
##$TPNAME0= <>
##$TPNAME1= <>
##$TPNAME2= <>
##$TPNAME3= <>
##$TPNAME4= <>
##$TPNAME5= <>
##$TPNAME6= <>
##$TPNAME7= <>
##$TPOAL= (0..7)
0.5 0.5 0.5 0.5 0.5 0.5 0.5 0.5
##$TPOFFS= (0..7)
0 0 0 0 0 0 0 0
##$TUNHIN= 0
##$TUNHOUT= 0
##$TUNXOUT= 0
##$USERA1= <user>
##$USERA2= <user>
##$USERA3= <user>
##$USERA4= <user>
##$USERA5= <user>
##$V9= 5
##$VALIST= <valist>
##$VCLIST= <CCCCCCCCCCCCCCC>
##$VD= 0
##$VDLIST= <DDDDDDDDDDDDDDD>
##$VPLIST= <PPPPPPPPPPPPPPP>
##$VTLIST= <TTTTTTTTTTTTTTT>
##$WBST= 2048
##$WBSW= 25
##$XGAIN= (0..3)
0 0 0 0
##$XL= 0
##$YL= 0
##$YMAX_a= 492866
##$YMIN_a= -634042
##$ZGOPTNS= <>
##$ZL1= 120
##$ZL2= 120
##$ZL3= 120
##$ZL4= 120
##$ABSF1= 14.98509
##$ABSF2= -5.573092
##$ABSG= 5
##$ABSL= 3
##$ALPHA= 0
##$AQORDER= 0
##$ASSFAC= 0
##$ASSFACI= 0
##$ASSFACX= 0
##$ASSWID= 0
##$AUNMP= <proc_prof1d_extract_pilot.lims>
##$AXLEFT= 0
##$AXNAME= <>
##$AXNUC= <1H>
##$AXRIGHT= 0
##$AXTYPE= 0
##$AXUNIT= <>
##$AZFE= 0.1
##$AZFW= 0.1
##$BCFW= 0
##$BC_mod= 0
##$BYTORDP= 0
##$COROFFS= 0
##$CY= 15
##$DATMOD= 1
##$DC= 0
##$DFILT= <>
##$DTYPP= 0
##$F1P= 0
##$F2P= 0
##$FCOR= 0.5
##$FTSIZE= 32768
##$FT_mod= 6
##$GAMMA= 0
##$GB= 0
##$INTBC= 1
##$INTSCL= 1
##$ISEN= 128
##$LB= 0
##$LEV0= 0
##$LPBIN= 0
##$MAXI= 10000
##$MC2= 0
##$MEAN= 0
##$ME_mod= 0
##$MI= 0
##$NCOEF= 0
##$NC_proc= -8
##$NLEV= 6
##$NOISF1= 0
##$NOISF2= 0
##$NSP= 0
##$NTH_PI= 0
##$NZP= 0
##$OFFSET= 14.98509
##$PC= 1
##$PHC0= 180.368
##$PHC1= 0
##$PH_mod= 1
##$PKNL= yes
##$PPARMOD= 0
##$PPDIAG= 0
##$PPIPTYP= 0
##$PPMPNUM= 2147483647
##$PPRESOL= 1
##$PSCAL= 4
##$PSIGN= 0
##$PYNMP= <proc.py>
##$REVERSE= no
##$SF= 400.02
##$SI= 32768
##$SIGF1= 0
##$SIGF2= 0
##$SINO= 400
##$SIOLD= 32768
##$SPECTYP= <>
##$SREGLST= <1H.CDCl3>
##$SSB= 0
##$STSI= 32768
##$STSR= 0
##$SW_p= 8223.68421052631
##$SYMM= 0
##$S_DEV= 0
##$TDeff= 65536
##$TDoff= 0
##$TI= <>
##$TILT= no
##$TM1= 0
##$TM2= 0
##$TOPLEV= 0
##$USERP1= <user>
##$USERP2= <user>
##$USERP3= <user>
##$USERP4= <user>
##$USERP5= <user>
##$WDW= 1
##$XDIM= 32768
##$YMAX_p= 449987231
##$YMIN_p= -629162
##$CURPLOT= <Network HP LaserJet P1505>
##$CURPRIN= <$Network HP LaserJet P1505>
##$DFORMAT= <normdp>
##$LAYOUT= <+/1D_H.xwp>
##$LFORMAT= <normlp>
##$PFORMAT= <normpl>
##$SURQMSG= 1
$$ End of Bruker specific parameters
$$ ---------------------------------
##NTUPLES= NMR SPECTRUM
##VAR_NAME=  FREQUENCY,     SPECTRUM/REAL,   SPECTRUM/IMAG
##SYMBOL=    X,             R,               I
##VAR_TYPE=  INDEPENDENT,   DEPENDENT,       DEPENDENT
##VAR_FORM=  AFFN,          ASDF,            ASDF
##VAR_DIM=   32768,         32768,           32768
##UNITS=     HZ,            ARBITRARY UNITS, ARBITRARY UNITS
##FACTOR=    0.250966925370066, 1,           1
##FIRST=     8223.43324360094, -208860,      -151002
##LAST=      0,             139485,          -77653
##MIN=       0,             -629162,         0
##MAX=       8223.43324360094, 449987231,    0
$$ Real data points
##PAGE= N=1
##DATA TABLE= (X++(R..R)), XYDATA
$$ [...]
23865 57327 187088 -332894 162283 155110 23572 118769 -27436 16307 -200252 168381 51635
23853 69676 10769 -80170 53097 22139 -41657 107056 -138408 -67871 -73780 -144439 -281044
23842 -281044 147214 242090 163434 -66181 29903 205164 327329 96325 34761 21084 -177769
23830 -300346 102957 -256924 33890 368445 -342704 57823 70710 37513 -480473 306367
23819 -53782 99587 195181 66739 76697 -137526 -199661 -70615 88319 304525 -1459 -186690
23808 -186690 -136926 -151961 213528 11836 290893 -117217 183283 267810 -20631 464543
23797 -91423 454981 -901 -29614 -7566 -148217 -178468 -221961 127580 236665 34234 -156821
23785 138766 101847 -266819 98030 -23497 215469 -240903 -345289 50740 -93392 -9446 -265259
23774 -265259 -127387 -246890 -31045 -68767 161461 -24816 134477 139286 -17027 -39240 -150189
23763 -150189 -135083 -24307 267467 74603 11626 -224660 91061 131194 -145335 -166724 -152662
23752 -152662 -155426 -70261 -232579 -133365 -181323 -12113 -183850 71006 9192 -222613 -185207
23741 -185207 178948 79876 279649 168148 50971 -145129 -114006 33608 220955 52020
23730 -116466 -150530 127181 -60246 -28622 69550 -33150 34904 46536 -190873 98955 237025
23719 237025 87865 153651 -94754 139910 101245 -3371 -35414 184345 -36695 53758 -214414
23707 -29528 153625 75224 420254 -412603 63771 243836 -223527 22079 -12861 -421071
23697 -421071 -259500 -84996 7074 49754 -88435 47087 126003 196694 -347166 -297112 -137348
23685 162961 -55029 -256941 174246 -144855 -71721 -181596 17063 -41728 52750 -125581
23674 -128909 29893 -216927 -280360 137501 34194 -43832 27215 454570 114326 -9908 -121959
23663 -121959 36962 -38807 412728 -105515 246744 -349099 -297739 85433 -163533 -14245
23652 -60369 100121 -102224 176266 80263 174653 -66190 -226564 139722 -270220 -113389
23641 152011 -196014 -47828 -172944 5883 -226747 120493 -46743 31387 11427 -284038 -61463
23629 -32370 276683 104695 -17795 -145592 -35463 -255257 216764 51008 120327 -149262
23618 -426107 -126854 -142501 -206770 -62992 19865 -60420 -85211 -21019 -53942 32816 127129
23607 127129 29186 -197165 141339 -28842 311412 -107296 257134 -161039 424689 93108
23596 -241744 -19614 192330 -64365 -159638 -211286 -189066 -14168 -42863 -51669 301364 -104023
23584 184737 -21366 -177488 69757 16108 18589 -221787 36181 119262 342802 -204264 39814
23572 208224 30335 167343 189790 196805 -54660 7882 -92185 50728 -106625 71168 -8731 -5248
23560 -5248 -129799 459394 21843 -102210 -42796 46321 -138084 -238954 -402403 221607
23549 307237 53525 311632 -393234 -306729 -22631 107634 49060 -277178 -165833 248652
23538 133626 143061 116915 -110170 233555 -111384 55833 -52126 421173 -2002 89351 -73727
23526 119278 -53079 -261106 -1381 -188546 21992 -404339 -37359 69848 -280171 -299359 15194
23514 96919 140966 -211411 -257891 -268450 137514 -192946 -151794 104862 -297645 307164
23503 -38813 -66285 -120076 -81618 146328 -4262 -326300 -3036 -358277 25903 -179163 -88936
23491 -167084 181801 -86401 -34578 -31373 -5617 -358263 -81415 408845 -334531 -115429 -120506
23480 -120506 -68771 -26957 26017 36011 194668 -266849 -62964 -119921 -191690 294564 26301
23468 20085 -44140 144479 3733 185504 172212 -63299 89971 58449 -166522 -39107 69730
23456 -296221 41938 -98277 291209 -169801 226335 69300 182225 180321 123195 -420637 -134458
23444 -221638 349220 94058 81482 72348 -236880 305963 16071 60302 -90498 -43150 -85674
23433 -85674 -245943 153461 10487 -145242 90134 -253629 60660 -26692 -90142 133128 -257642
23421 97673 -159634 37754 -73760 368181 -167215 320331 146470 65757 -67402 1424 33382
23410 33382 278085 -324602 96299 -46149 -94589 -95153 -81673 257063 -246923 272525 79893
23398 169764 193989 39352 77832 -167553 -272988 284628 43913 97177 -42821 -71714 -124720
23387 -124720 -64939 -62103 160139 85983 68695 -78058 93599 73848 -122971 -194679 -60223
23375 171055 -71491 -304524 28432 -185381 58142 -253148 63972 209409 296462 -113845
23364 -244138 198371 -56978 -54212 227792 263033 150369 -64546 -85309 235171 73623 30794
23352 -137704 64225 210029 -98479 -135616 -202562 18170 74438 306855 -53444 300807 -186979
23340 52041 -103304 -70369 -73529 123117 -51141 -447985 -248252 236042 -7900 -92224 -171269
23329 -171269 -210777 29307 -497167 131763 -85392 150334 -280302 150181 -46417 -176021
23319 -176021 -31803 -59942 66373 116632 120514 109912 211658 -131097 -70521 -357673 -53683
23307 139979 41236 107525 12044 -26805 -249048 -60696 -136655 -202861 302141 -98779 65173
23295 -29091 123700 2549 73132 -188721 -14019 428718 158415 -191560 255992 106326
23284 -169562 398717 -43812 -170884 7452 -180184 52795 138307 -243213 47805 70079 37109
23273 37109 -153264 258185 96575 16093 -78356 -318664 -204981 268687 -165575 -182006
23263 -182006 103241 -49020 53510 278850 -77137 -285429 -14345 -230277 -163467 -288339
23253 -288339 -91872 127054 -364569 -380746 5430 180325 91898 -18443 -292345 216722 -153562
23241 -227234 -187329 -70898 -92018 -17935 -47495 63581 -147146 -273311 -87116 -62008 100678
23229 13737 45170 184763 82253 -163741 214192 -109513 369395 -210742 175061 6752
23218 -280232 16938 -76536 -141156 -133748 181821 -97177 237620 101073 -102074 140377 -114730
23206 -51780 -28117 204082 97689 -40451 -126144 -170827 130618 152688 319485 -5039 -133497
23195 -133497 -68620 191429 272659 -422775 250693 -356694 -196303 -17961 -17117 -169266 -3062
23183 -115123 168547 30846 108212 320856 21639 -43456 -71945 -169768 141770 -461270 17156
23171 359136 -95587 -53907 -147730 -126873 188071 383826 -164898 -121712 -82297 181375 296277
23160 296277 -228257 81062 -75753 -262111 -111690 -166898 -27625 -141313 -39660 21496 -20470
23148 -141388 132105 -119903 -98150 11995 -225362 -15247 -238090 -222648 90647 163267 -196030
23136 22344 156764 32446 -206916 269881 -89074 133794 25322 163488 21043 86654 -61530
23124 79563 40666 55450 198677 10288 36465 -187109 333741 -332529 -235257 -32422 208471
23112 -63856 -124818 37074 117122 102771 -16097 15373 -139434 -72324 54907 -185969 -21153
23100 -138089 -225020 -236685 139345 -46949 5854 -76697 -145885 15645 -18905 -491840 182316
23088 14303 13290 303762 -228319 204808 -161278 46366 -6164 79474 7099 -280982 273250
23076 90114 113793 -122558 151797 153529 83447 -19525 -15414 -245703 -30069 323073 -301811
23064 -237998 -374906 -144164 59897 -78609 162967 -26061 -129190 -58996 -221056 61064
23053 156808 389251 -18617 -111386 103042 -63847 210718 -82107 -40466 146089 32776 -266513
23041 251280 9819 -42283 293915 181582 -121910 100021 99065 -72909 -279466 12364 -76307
23029 5471 -128280 -148250 -87485 -170578 155627 -38272 -17875 -437005 -114595 165597 -264371
23017 114110 -30667 399265 69959 96222 -436018 145824 -398940 -66229 -67354 -12492 286376
23005 -240602 -76116 189224 -17629 -47496 123441 152270 -159607 158820 -33080 70578 -121553
22993 -60247 185387 79887 8722 -64008 -159454 -82667 -51625 112417 290691 -51386 332623
22981 -164011 37361 342 274293 -14376 86786 21036 125462 -165443 162127 -9486 92141
22969 -260105 -172 -12905 -169742 199421 -182148 94699 38128 -241969 202222 16386 -38674
22957 316254 -193790 -3961 -194382 -44679 46792 -37235 -326379 8375 -16045 -217730 67890
22945 -305479 -14320 -109808 -164035 -253626 -137659 129548 -112925 10591 109069 -2085 89382
22933 -61224 -92063 -239089 -149811 -70564 48395 -210722 3342 -106460 -163930 -150108 -251000
22922 -251000 272268 -104793 166564 40915 -61600 233678 -160205 -3378 -99653 -127225 239709
22910 248353 12846 249877 -7310 120016 143508 -57505 -76712 118638 193554 -62784 -26986
22898 -146365 58934 -35290 29390 -17004 66363 55401 35845 -110846 -25536 -138951 54335
22886 53738 -216736 203839 121285 -125888 -174009 146909 175195 47695 31292 -19517 149579
22874 75949 -67117 -206294 93405 109995 23116 -152762 -87849 -123381 -164951 -208471 121876
22862 -204304 -17948 -19673 -312950 -277070 -59638 -43214 -178542 -216464 -269648 54934 -151185
22850 -157115 -51304 -175618 142440 -26651 122899 -133207 -253676 110686 -27556 82876
22839 211421 -26294 -297007 15344 -312704 -140677 -56200 73368 -42074 -495783 -68068 17336
22827 -180153 -212722 -407035 -42077 -107048 272711 -203976 7939 71484 62866 -216746 -111412
22816 -111412 -13333 -141430 317713 -248144 -251300 213466 -70034 -23608 -3800 131410 -230522
22804 -91900 -69786 -76664 -294158 -482780 233323 -232129 -35710 -242567 -5832 193206 -42620
22792 -152089 145255 60563 -252889 17668 -79865 -65979 -343154 -25432 31543 -67538 57552
22780 61973 47137 -341021 104763 161000 -38863 14196 527603 139485 127666 -203495 -72095
22768 183669 219305 24178 -320197 249113 -249318 259293 -173564 -3160 12874 316710
22758 316710 -108981 -46715 195839 -29416 4024 -392807 69767 72629 182155 -98381 -110319
22747 -110319 -470376 114077 27852 -76272 -127069 75854 7576 65868 -111198 -104550 2229
22735 166205 132331 -77018 -43163 443021 97287 187542 -43946 -78702 200295 -325993 -135004
22723 -22008 239434 14365 -156972 -141997 21270 -116099 281861 -170995 56533 -20184 -9004
22711 44809 -271181 -129685 75670 32437 -99382 236924 -79336 -107237 -36031 126222 76100
22700 76100 38988 -69209 77582 -339047 25581 -196694 77127 7596 -255966 79043 -391471
22688 192785 104787 36774 -281161 -110143 -128658 127867 2184 150299 -43392 119289 -23612
22676 -27410 7863 391536 -56781 82557 89163 -8133 33154 372805 18421 348620 -395593
22664 111255 20037 44660 -158054 -274608 -234528 210116 -93148 62973 197065 -159670
22653 -33449 -109068 104571 -49199 -154286 150797 189705 -196067 -82419 13505 -4479 79687
22641 -40754 37661 -340815 -13575 -166902 -191952 275206 -848 -288012 141053 -226506 -47674
22629 -190327 8828 -340533 -48236 -4776 -369141 -158974 -50943 -26564 -153601 143145 -38636
22617 165003 -40196 -92043 -37236 -337794 -58620 -62631 -143171 354519 -28068 -241052 -244848
22606 -244848 -95366 -158687 -74861 -140618 62049 -369593 135606 69009 -155128 -33463 147070
22594 -412267 -202116 -200228 -20591 -116116 -184258 -23167 -171675 133960 -130711 -222656 103590
22582 -89251 182791 -220191 -124537 -87980 -54698 126391 84248 57870 -389902 -31360 49716
22570 -101040 -211583 65061 -41445 -12535 54290 -81654 77471 -201379 7171 -93142 47943
22558 82286 -90694 142618 -22379 8983 51860 -345787 -268959 5096 -345885 7549 -221685
22546 44687 291062 20579 -180746 194349 -21136 60785 212751 51885 132154 -194433 46121
22534 -43939 344853 69324 97079 -323077 -288347 -205042 -320599 -215889 30294 -98688 46580
22522 -128256 130646 -91136 153824 -189321 115358 -77329 -167948 -161185 -85128 -106544 131247
22510 157730 5878 -204982 89205 120545 -176728 -280441 77358 15454 -413843 303139 -276886
22498 213367 -223525 109697 263669 8861 -891 -5491 -84383 101856 43720 -13267 -459544
22487 -459544 -34705 52134 240711 34985 -306857 59613 25476 -111555 -53327 -40651 73768
22475 -142307 -247718 39751 180203 152501 116314 -133187 -182763 -164827 29923 121283 -67184
22463 -298608 165982 -46662 -12239 89729 216662 -110279 -144185 318706 275626 -62416 -72186
22452 -72186 142601 -178464 -113735 -291905 207149 219998 -221910 -164817 120342 62354
22442 62354 -49696 -56815 172983 -98228 -133671 -116347 -133873 25965 -342338 212405 -262271
22430 -10080 -3467 223543 -44945 -83576 276557 64023 121458 88024 -12718 -62208 38709
22418 -211433 158100 -38004 -44295 -421851 -170419 -165791 234447 -166492 -594752 -212492
22407 -162304 -21190 -72845 91803 -181967 119549 -366800 -22544 -142534 -189946 332294
22396 255434 -140412 56113 166490 -142222 -36867 -19498 -382609 -320770 -139994 -195630
22386 -195630 82391 94794 -372 -13657 2811 -57363 -82452 44960 230311 20266 -148896 -72514
22373 20692 -304430 -87793 108227 -34490 83374 -141200 -64956 -147041 -149146 -255687 -151855
22362 -151855 -8280 -334817 -195196 -140436 -71511 -369100 -136785 -24316 -64056 173215 119638
22351 119638 101123 -41016 -367261 -86605 58806 -35949 195555 69075 12559 234362 -104032
22339 53531 166422 160949 105356 12935 -140558 158900 346741 -269262 -169763 -192565 -27185
22327 -195794 198818 42474 -328411 -169556 -154537 100485 -175979 265813 54425 61085
22317 61085 -36182 131008 -61881 80836 -161015 -17091 18231 122728 -188150 -90861 142676
22305 55564 -58345 34411 -22906 -172227 -93013 67136 -144743 107328 -131204 -43352 -139717
22294 -139717 -202898 -41088 432701 67101 347085 15056 -70010 60558 -4515 209545 -753
22282 -339170 71493 81147 -177205 -8910 143026 -160210 279399 100313 -58562 -175171 53032
22270 71225 164532 63816 125184 -100613 173589 231945 -17191 -259665 -379170 -337071 -92252
22258 -211824 -116415 256305 -110673 -68263 16086 -69369 40043 65708 -117051 -413900 -12141
22246 -74856 158722 -32959 -117526 -89244 34013 271345 -103737 71432 73404 -63975 -193485
22235 -193485 -173479 49926 -41500 24588 -132516 -175079 184123 -235354 -65508 30856 271409
22224 271409 -11325 -124016 227231 105303 -92668 -224790 -150397 -214324 206845 -252132
22213 -73084 -74168 -75373 7287 78604 51454 -50 129113 65084 -231938 -71553 -106522 -99003 556367
22199 188232 -118142 -409748 -158859 -78617 -20169 23868 -236249 159763 -89726 216983
22188 91924 -206929 -59951 -296632 -80263 -78845 18096 -459560 -132387 -373444 4010 222007
22177 222007 -382501 -149862 55249 -91456 -416018 -45493 -97297 -204537 -16605 -174688
22167 -174688 -220403 34438 160053 -149097 34754 -95537 -103531 -439822 -159453 352232 179048
22156 179048 -172402 4076 132684 -31500 62857 -11830 1234 142230 -90571 -93547 56152
22144 199586 201966 105110 -78524 -151985 30884 -573 -190348 -130305 76660 -247768 25255 -355078
22131 150187 -197478 16828 134651 -300003 -156945 282533 236947 33352 -52356 132784
22120 -317031 -252312 70572 -290978 -2452 -231052 43770 -162157 149861 200157 56427 -150115
22108 -121807 -163103 -161711 -36365 186470 -145964 233342 137791 -344981 -8611 -214638 -8152
22096 -129330 -274737 -20635 -152329 -278526 -264056 232785 82856 157579 81528 47593 -21320
22084 342079 -70254 -164634 -159288 125477 52975 -170073 -90206 -126044 34376 -194876 -198488
22073 -198488 -37328 -612253 -142743 -232122 265926 -190981 -134381 196876 -59752 65025
22062 31644 122536 -18339 -78563 -340949 32284 -309965 -2479 -198390 -82279 53605 -164974
22050 97463 -46753 15260 -51299 -120453 -34900 -153978 -11368 -131953 146010 -234787 -187836
22039 -187836 -317410 -45126 -107262 -227397 25412 -110951 -111718 -90745 -129714 -161990 171757
22027 -66625 135158 143365 36793 223422 -218085 -51307 33525 -214513 -153571 38685 26960
22016 26960 -113143 -39738 111602 -34300 92893 216443 -430416 -188394 -143491 113877
22005 -9563 -200315 133162 -58614 -225056 144161 2484 103810 -158350 133357 -91708 -284198
21994 -284198 -248822 -192349 370862 -135035 -25792 -178981 13057 148880 -188456 -70217
21983 99857 -145105 -210993 -188061 -192377 -41993 134634 -104813 -125229 -133802 34499 -5242 -62065
21971 -62065 -178133 -128750 -13581 3294 212722 -135389 -209422 225616 -256410 -12444 9163
21959 -66669 255508 271214 -295350 34338 258870 -89171 175524 -330087 61397 87509 -207566
21947 145561 -89757 30193 26460 143744 -94933 -68196 49365 -176326 107058 -39387 -82865
21936 -82865 -111261 152432 -94872 91803 -167782 -254997 17747 60732 -300363 162368 8760
21924 -21897 -164995 -68210 -180555 24570 302054 -416409 183813 -210060 152508 -377844
21913 62763 51838 60059 -178152 -168792 -79870 -43690 -220109 15560 -187418 -92008 -124060
21902 -124060 -220889 -270561 75698 -22036 -358047 71838 26018 -322158 -210914 -9895 -25787
21891 -25787 -263063 -350888 -278874 217239 251400 -248032 -70577 44672 -41081 -217031 -87126
21879 -84879 -33128 -35437 -305920 -351088 -122536 -203855 262323 -275154 -359160 -334961 15960
21867 -55904 228148 -209526 -44495 130619 -160438 174139 -3964 -261602 212550 96610
21856 31479 -248276 -53277 -48466 -6310 50329 -93053 48727 -254867 11116 -205495 155061
21844 164937 -45360 -320603 -183141 -272961 -249692 125480 -82726 2354 -150582 -73081 34620
21832 -13499 -3894 -35669 -126442 -231323 -40594 55699 -132055 164894 24342 54881 -415618
21820 194462 -82361 -77192 60350 -257381 116814 -45301 103862 -177250 29743 -66648 -258388
21809 -258388 -59639 -178652 270319 56348 339317 -48348 -161251 -345369 207238 160374
21799 160374 -8555 -177493 -391290 -253508 -239288 -229259 6166 121996 84367 -221147 1509
21787 -44027 68737 56683 -4819 10385 241655 -140972 31574 144153 -245646 -210638 -29803
21775 -124048 62989 -38169 156362 -40079 -320280 273225 89105 -167845 -73164 -310007
21765 -310007 -103048 -182049 27868 -356327 247594 -156498 118270 -196274 -206796 104399
21754 281249 -89640 -129138 339097 -103644 138199 22880 -152687 -65158 -215766 -471814
21744 -471814 -278841 -151456 -81062 -466854 219652 -187254 -51113 94229 1532 104953
21734 104953 252081 -349913 -97932 -124403 -282795 -288338 111558 -83615 -106116 153389 -42909
21722 39424 92368 -127045 -147025 -50786 25394 -226553 -203606 -589167 110503 34412 203535
21711 203535 270506 22413 -11741 21904 272955 -169570 60387 -98894 84995 -45058 -116331
21700 -116331 37968 -308598 133340 128303 262754 80683 -275929 -4622 -120096 8274 -57450
21688 -275503 -26896 -303115 -181874 -18204 1741 -333676 69459 -10382 -141337 -107833 20413
21676 117075 -75900 25282 190715 142941 -1002 -44909 -212718 -277452 -83837 -223414 -230012
21665 -230012 -116161 48995 121347 -329359 -49924 -196376 -381432 -238232 8008 27987 -186672
21653 -135697 263113 31093 6918 6370 81285 -165509 -117341 176582 -78788 -154358 149735
21641 109392 211825 112659 48202 -20026 73806 -4930 210314 -151841 -358893 -83926 73138
21629 87701 -107059 2712 -44583 211620 282675 -63164 195473 62899 -149928 -78359 7868
21617 7682 94733 -173685 67744 -169173 -19526 99915 -432419 -274948 -203639 118639 -266549
21605 -111337 -178284 -240192 -112015 -273850 -112691 -155670 96692 -13903 43469 -214249 -150725
21594 -150725 -113894 -36852 234577 98127 61682 -263297 176375 -74119 -96385 -45900 120763
21582 89338 145358 -109086 -18624 -86890 112144 -122766 -87559 -135383 56756 160896 236146
21571 236146 -51421 -113982 220083 190495 -30416 85399 106948 -145390 58920 -49883 144704
21559 175826 -289511 231318 240196 -98519 -333 -237217 68093 -92978 -167319 -176731 -155979 37718
21546 179869 -138023 -336698 59649 418984 -253378 66345 -194426 -10797 -247356 233181
21535 -267114 -174222 -199218 101256 218945 265544 -80924 -66533 -92465 44002 -179711 -161811
21524 -161811 -14977 -66437 -68797 -53219 -225703 -279714 78870 123484 -512 87012 -126502 -110822
21512 -110822 170847 -248529 116890 -9712 -107237 -409192 -306500 -62463 -59099 -111522 1766
21500 128043 164023 189400 -191844 106650 -79528 -241769 137160 -126927 -161930 -314862
21490 -314862 222223 215897 -244033 -272626 105944 56646 -218255 42643 -214288 -27842 -232533
21479 -232533 -67643 367097 102011 -381541 -83225 -47069 -47311 5626 -167563 32258 117056
21468 117056 -261054 29737 -78029 -137299 -29305 88130 -19864 -79411 -29615 -344935 129982
21456 179703 -203066 -369906 126417 138739 -142102 -254785 -32714 -50287 -53198 246728
21445 -129763 -169676 53419 287409 -2425 240843 71999 217353 -66477 226943 151570 509926
21434 509926 -62844 132879 -108514 -313399 -157093 -226870 -148812 1633 97588 18362 -220004
21422 -168490 4025 -33407 -193440 155445 246218 -304681 102948 128346 100857 -37479 207110
21410 -21428 -53846 -1178 146726 87663 94341 -83794 -511086 -37873 161367 -57867 -345696
21399 -345696 -605345 267658 -133199 -253585 -57170 -531545 -32218 -185638 -40223 -165382
21389 -165382 -156663 -322735 43261 -118718 34909 -121577 273123 -49832 18844 64940 -248137
21377 84070 -65481 -84904 -38155 -4924 216705 266655 -252012 21793 -189368 167184 21246
21365 -151162 57506 8457 -66503 -22406 -172049 -71666 277373 34404 7749 59292 -40951
21353 -61497 -284468 170543 -175081 -210613 95222 -39510 -268425 -27061 286063 -217251
21342 -298720 89055 85661 100702 62952 240659 -220982 -17308 -14545 427950 54379 -195790
21330 -31658 -112747 -316412 72053 -156116 -152194 -3448 -333267 156812 67674 50802 -164036
21318 -145896 58479 23189 -23857 121487 43588 78807 319855 247950 29271 -9332 -43992
21307 -43992 -67723 -230465 -19007 -187309 74916 303745 -55488 -286930 -304689 -40702 101889
21295 9568 140307 53239 -5314 114073 -93404 68324 -236020 342116 -151383 132131 -243006
21283 -195930 -281018 40328 -252575 39602 29837 46925 -256816 -378376 109515 80018 -40563
21271 -139524 -16749 -209504 -193343 -115170 -333529 -113532 -263507 41202 80324 -221996
21260 -90909 -53966 -530351 -190891 -69863 93005 168017 76215 -10402 -191966 91754 -268840
21248 173110 -207947 -346029 -31502 -301816 -46091 -177968 -255557 -28550 -275101 -14273
21237 104126 -113423 120459 -186486 -164695 334601 -149200 -263420 27695 196617 -267636
21226 -121747 -122802 -269767 -107903 -120087 -11218 -24968 -175242 -14084 164807 -215779 217074
21214 186108 119732 165195 -327978 -58735 -46500 32312 257379 -240726 -168373 -61432 -61173
21203 -61173 163834 228380 48499 -45352 -168556 -176857 88591 -71245 -198672 -7149 203756
21191 29076 57610 -146803 -89406 -104323 -120460 37579 -177788 -117553 83194 50268 -284609
21179 151515 -153701 -329417 -171377 -68831 66668 -60873 -46022 63130 181726 -214872
21168 209442 -123549 -128556 242145 -70912 -24470 137388 -5759 101626 49331 -11706 -448072
21157 -448072 147217 91054 -175490 112386 -73263 139634 -275163 -120411 -373542 -98503
21146 291522 -439751 204657 -145319 80138 -38790 -92581 -29541 102866 -97902 -301180
21136 -301180 22044 -346183 -255757 -221393 -100838 116886 48795 -61511 -98585 -18178 65559
21124 52600 -51325 -96837 93012 14667 211669 138379 -111782 44265 235165 -168318 -204574
21113 -204574 -80384 -87621 32664 285768 -105057 -110 -106092 187175 32095 19870 184651
21102 184651 48696 -62884 -428286 -60525 142318 70628 -15210 -398121 -211682 -18143 -73685
21091 -73685 -53479 -234805 36225 -84080 -270006 -72537 -161593 -95326 -201073 -221435 -249125
21080 -249125 122917 -85191 -170840 -328722 -51214 85746 -51532 -560775 47812 117139 166200
21069 166200 122245 229146 -198699 -28289 179193 -154008 203987 134662 45767 161736
21059 161736 -194391 -153325 40783 -468627 -77127 -214499 -180505 28873 -19432 -3671 -41540
21048 -41540 146895 64815 23569 -15902 -66261 -57972 -27742 43220 58918 1455 -145595 14173
21035 284267 72294 292817 89357 -61620 7544 -223234 6348 -89413 -362424 416 -256215
21023 -79837 118266 37080 -140130 290363 -153046 -47048 -154882 298072 -214300 -81384
21012 63701 187016 228508 -86134 -14950 -238274 -48208 -237598 -5591 -25905 178381 267237
21001 267237 -217014 89995 -107917 51039 -180922 38114 58676 -3733 -253153 -84437 -18530
20989 -338287 -68050 116334 -24683 -48571 -101940 -11262 122719 -93861 63434 143932 50354
20977 160558 -511810 -91773 -268540 -228003 148788 -160324 -178841 70745 -237065 64500
20966 96506 608603 189639 109312 147231 -9898 -86035 -16027 26709 -7319 -11044 -175455 92030
20953 -84691 -386049 -18518 -126927 74160 -304439 72229 30985 236899 -49103 -14672 -49659
20942 -49659 13714 -108790 -14200 -145219 -64460 -186678 -157095 217821 -20307 -46636 45256
20930 -111393 -33354 -92322 281804 132817 411952 -729 67084 -170246 -26060 -194898 -401451
20919 -401451 205792 -55250 -37981 -222200 -117428 -7781 83104 -11129 -161785 -87255 -192866
20908 -192866 -197522 -112308 18623 -92776 -353441 -159934 -426587 111623 -76839 -240697 -172650
20897 -172650 -156671 -165939 -159638 70374 333337 61149 -109182 -92990 168300 -207449 -193200
20886 -193200 -20400 65318 -200580 -22862 73642 65737 -95216 253670 -43617 1736 -18531
20874 -214493 30861 122162 -261960 -99885 -303280 -93242 -155144 -181632 17847 49738 402897
20863 402897 263698 50579 -274431 -245223 90572 -4887 -134320 114248 10545 252622 -88790
20851 -214379 377592 -19649 105199 -209997 69755 -268629 169314 90505 -261851 22256
20840 -159019 -237935 -31606 66902 255490 98203 136645 278272 295079 -91343 -150883 -215881
20829 -215881 84272 19206 -116635 -313124 35356 -122343 95431 31598 331689 -111424
20818 -147586 95004 -75128 -13880 -228215 17521 -306008 -316358 49569 214585 -206286 242080
20806 -211280 -240784 49267 4778 -69486 391 -427073 -55323 -148561 48857 -38225 -167332 -42608
20793 42909 301907 -100232 -231266 -3120 103307 -37559 -197996 132507 -142957 -203269
20783 -203269 -52162 -104941 97565 -352839 2816 -196316 -153903 -43073 91059 58728 124406
20772 124406 148849 -33070 -51208 -91642 -107630 -88037 -90032 104995 -36062 -191413 236522
20760 -212599 93197 -158875 55093 85184 -126976 -228322 2289 20444 -81352 -263110 -206540
20749 -206540 180769 -23392 173394 -153069 40675 -153950 -152977 62232 -105409 -183917 93503
20737 59737 -77041 124269 -137392 -3254 -177413 -46817 -300186 -52984 80624 -156401 250229
20725 -216559 -195096 -155182 202484 -141210 -85597 -58502 -100252 -110984 -108256 -122222 45862
20713 -35030 208659 -42457 -87556 274649 -190769 -136167 -217240 -202223 74824 98026 -143485
20701 187825 -19191 138458 10006 -140365 -41563 -43456 -63584 59802 110736 44187 230704
20690 230704 -25735 125662 -41569 116317 241507 -243170 170396 -44860 -5471 92071 -112859
20678 395666 -273225 -157217 -3180 -158930 -62090 -270643 15911 -143656 35063 -206909
20667 -110040 -271179 136906 -91587 -31207 -83932 -177711 -202618 -251294 281200 -128854 18885
20655 331217 233299 -161453 -171866 220844 5730 -348222 444936 -413166 -1773 260 -216484
20643 -21052 -77437 -41167 -23650 -10048 145428 -84594 87404 118325 49781 189946 112353
20632 112353 -83094 -75752 -11939 -53128 -147324 -7187 -281435 -316495 -281575 -52905 -76433 130669
20619 -9067 -41526 -86631 154746 -233412 73649 -58141 -42644 -474532 227607 -88537 -493429
20608 -493429 82614 -94221 59317 -28115 -81231 -26470 -132152 -100648 -77349 -23382 55004
20596 -65336 -36442 -96146 79709 -45882 101884 -31821 208708 -342842 -231043 -110266 -68242
20585 -68242 57068 74249 -208516 -97364 -138591 29078 39828 219804 45564 94940 57139
20574 57139 140720 107075 311276 -234138 -173574 37563 -334261 -194706 51893 196954 -170623
20562 -119827 5850 76712 -6968 120393 -372826 -284361 -113001 319082 245424 373224 -252623
20550 107613 127079 -216164 236385 -45058 -103028 -171340 -64853 -149965 -110247 -226971 -279336
20539 -279336 -160033 236320 169019 721 261575 222839 -16437 -112136 -130850 -73903 -309412
20528 -309412 -114926 -95927 -261234 -82984 44772 -44218 -74472 -140183 -11678 153188 26658
20516 -27530 -269014 318481 -76934 -28155 -227533 17661 -239948 35146 83910 -65631 -236844
20505 -236844 -313000 157938 -111464 -99929 -206781 87063 -187591 -156371 -479661 -5192 199519
20493 -225189 -95922 35900 16638 60189 -194259 59235 23411 -276070 23289 -366363 -85311
20481 -253739 42124 14810 -181627 -471887 -169382 -180451 -88330 -109308 196141 110651 255660
20470 255660 66383 7386 51114 193338 33030 17665 141245 23705 -87876 29277 -149934
20458 30074 -101370 109330 -251240 143083 -275587 95288 382804 -164897 -208229 -154766
20448 -154766 243889 388460 -79397 -179658 182963 60088 -299614 204324 -56565 -233202
20438 -233202 -48149 -286250 -69403 -225024 51408 -177750 -139471 -450623 -255612 27088
20427 -171103 -3732 291109 160816 -238885 150459 -165723 -398149 22842 -58906 174498
20416 31674 -173531 -174481 401606 -166615 -6216 131260 -62873 32108 -150530 303521 75139
20404 -255806 4956 46210 -212146 -285188 -92208 60386 87531 48933 67218 -90652 -244793
20393 -244793 383185 -327662 -196258 -104168 -222180 -218083 -127490 -26029 204196 327869
20383 327869 -162867 146680 -225115 -5064 206590 -108741 -48742 25213 -84257 -57249 -178717
20372 -178717 105980 28500 -142170 -339301 -71889 129048 -255221 -61863 95470 54519
20362 54519 -172525 -38288 -37708 102999 212348 50445 -51166 -345721 67168 -110635 -67083
20351 -67083 -312248 -22432 175502 109779 -198305 -256420 -178602 265677 216905 -165566 296955
20339 -61614 78214 -118827 -116917 -143920 -67321 -62539 -187892 262939 24164 82439 23638
20327 -723 11302 56357 -36334 -146093 -197549 143045 -182860 303087 289577 -198546 13772
20315 -271436 -17752 68596 170936 -145962 -143624 -429738 45104 97590 -216235 -184336 -114943
20304 -114943 -147474 53177 59929 -61623 -237761 -177854 54915 -210383 -2184 204423 -261810
20292 -150901 -249223 7711 42111 123284 11154 331388 -120626 -85752 -307821 -121499 105010
20280 218297 -336849 25018 31370 -204788 -34125 -418203 -317658 101580 182477 -1696 136687
20268 354271 -220649 -107907 -242448 -403708 -245148 48689 24933 -31640 -132376 62185
20257 -194454 -345629 -39218 61923 -63427 264508 -69361 -180849 -103066 -104692 -163121 -331319
20246 -331319 129620 -29100 -431703 -278772 10424 -97762 229597 -126068 -270487 153646
20235 147895 -260508 -16831 42693 -216892 -92546 18009 -321693 36654 53583 -198757 -169281
20224 -169281 -170389 73463 371880 -124566 18404 -90508 -106566 -113705 -189414 -123918 -263378
20213 -263378 -117399 129544 -57117 242033 -467653 121273 -37983 -10700 -164210 -211675
20203 -211675 -157078 -45950 -334176 -88168 114836 -227522 -87805 -123148 -244572 50786 -241224
20191 -99015 89658 308896 -295124 -213425 53634 -454560 -166252 -185177 -112647 -86578 -146786
20180 -146786 106252 -9728 -110181 102065 -154056 -81278 -44094 -69460 1933 -265987 321778
20168 44386 -97121 -245247 -233353 99210 128949 -285647 174268 34257 -72439 -128110 175919
20156 46987 -126498 -194111 -152029 -117185 -223391 -87258 4483 -18173 17276 -6376 -48408 -78304
20144 -78304 -162571 64810 -36766 -44766 244823 258472 -79382 -23561 -6096 203629 -150338
20132 -17369 314890 67768 -106482 70571 -402448 -77894 -215748 109175 -256123 58079
20121 170987 147109 -72196 -50226 -154363 -37504 -27809 225568 252432 -181147 -433951 -77896
20109 -289984 -182458 121305 -167851 -103852 20449 169317 -69370 135860 129185 -180154
20098 150309 308195 -63852 -335613 187772 -173132 27914 160767 -66763 -243257 80744
20087 -267719 102425 -215157 19691 24733 -2714 -81098 428044 214187 160032 -259157 223432
20075 -255952 51158 -467160 159229 95048 166210 -262135 38733 -297387 -27704 -119603 -119688
20064 -119688 -264667 -305933 -14672 499453 75003 -137715 -203003 -73145 -21940 -19627 8013
20052 -76066 -195040 183075 -180012 29530 -68282 -267574 -143053 -425793 -121532 -27198
20041 -157173 -78889 289738 -321295 -69816 -8557 -75982 89682 -297719 67373 16273 -85422
20029 -106047 -336844 29914 8662 -107015 25372 -190096 84771 -31382 140046 13321 -114710
20017 332646 -50695 -105363 134412 237810 -42448 199133 -139798 78926 -135169 -156467
20007 -156467 -373072 -7164 -155284 -118619 -258004 -69515 -42994 -56876 -157622 -167988 -72064
19995 -22905 -17630 -299274 -212043 -92952 200751 -189837 -63562 -234322 -214002 123388 80342
19984 80342 80113 -95582 -89177 -116349 -4443 -1548 11567 136871 -86295 -296380 -29783 56108
19971 4495 11329 13125 42981 247370 12789 -103893 -14488 -129132 101079 59942 -188057
19959 21764 -12031 191506 -101844 270143 -108435 226092 -31312 140000 -4428 229757
19948 238415 -23929 107365 -315528 187707 75242 -260743 -74830 -228538 -151665 -44786
19937 -175687 97397 -340575 -221683 35227 205125 296204 161978 -181503 -54868 110692
19926 130892 -43534 35727 -7849 -7902 336862 -99328 -161459 -65990 -112050 -329210 -54859 -307921
19914 -307921 9434 -336974 15409 404608 -147703 -128199 -249590 -11049 -211050 -197456 101609
19902 -150086 -43387 72750 -150556 -28612 -151833 -201454 -256056 -222229 58370 -168077 -9422
19890 -351585 -285544 -50826 229823 109146 -474582 -203197 -271506 -141570 193068 241516
19880 241516 -266966 -18010 148903 -75490 71392 -365759 42432 54071 -132670 -135655 -235886
19869 -235886 -238667 -36992 -145842 102929 118186 96397 -157847 141382 -142527 292762
19858 -213385 -84335 5370 -55614 -242493 39630 -222971 -512807 -365731 -117411 -121596 106330
19846 -84502 337572 -120581 -421455 -151488 62568 -289408 -108969 -63916 -290606 -328779
19836 -328779 6732 69598 -136599 -1451 -397523 97088 112401 -325533 -65135 160676 -52003
19824 -278172 185197 231237 -22906 -45219 233425 -106005 -269460 -220731 -122362 51975 -81289
19812 -63653 41502 -221641 30652 22562 -172618 -102149 83259 -1940 -52244 -44550 -52861 -58996
19800 -58996 -52637 -194174 -104728 108656 -220417 -29005 -183831 -14009 -271510 9717 -37499
19788 33342 215088 208248 -183238 -217458 55823 280020 7147 -20610 189967 55450 -288115
19776 -174866 10097 -277110 188241 -242481 313424 -259706 -57636 -70331 -304107 37846
19765 279280 164611 -289939 -335708 74780 -42017 107299 -213607 -196946 -161365 90754 -7645
19753 -41037 -209546 -1194 -50397 25189 47550 -118935 -243418 189198 346235 -124910 -60250
19741 -335692 -126675 78872 41543 -64913 -6112 292000 -376685 -24709 43471 -302391 -423251
19730 -423251 164340 -58122 296479 -191038 -22417 -131592 -33002 -100081 -25969 -193412
19720 -193412 -243555 -47945 -114922 -134636 32898 -408065 -136296 -535518 175362 224347 -427638
19708 -64960 -170734 -173113 140 134248 13446 30419 -185796 76197 -303369 217508 89798
19696 -101072 -76032 727 -169409 18619 -213562 300222 88259 -176488 -69885 -180810 103481
19684 -272131 -138488 -118398 16219 -17391 -226737 143153 180431 -105195 96035 -76654 174281
19672 -132663 35832 -296981 -26029 213614 -48820 -493109 -176730 179491 -137891 -244435
19662 -244435 366086 -37368 -189853 -233776 38187 -277218 -128791 -155898 -206328 140066
19651 -135943 94998 -209716 205952 220529 -159803 178737 31194 -294240 317357 -304985
19640 326626 96360 152343 -142466 88330 -203322 140631 125734 -69779 -15490 -91976 -17528
19628 -25381 7098 -237655 -231689 107663 262307 94163 54601 108115 -192513 72816 80240
19617 80240 -197703 96245 30908 146925 8496 40029 -129058 -2884 -225585 129952 42680
19605 -207192 130339 -126173 -160277 -171428 165996 -59117 -258078 -308213 313241 235966
19595 235966 -62643 -389527 161489 -24158 -81292 -143004 113580 -83301 -371382 -50159 -274890
19584 -274890 -256008 -264666 -102056 -210970 -92558 -537 118515 -118265 -255070 -223082 -145601
19573 -145601 -209492 -233874 -165000 -335603 124946 -271071 4504 -251294 49535 -160538 -366066
19562 -366066 -250828 72592 -166508 -378375 -5862 93375 147359 -273480 129767 -94559 -185054
19551 -185054 -17548 -104737 -191047 137987 -157185 -90096 -80294 133995 -243560 -193060 -3192
19539 -50436 -70235 195333 37226 -171283 258738 73611 -123684 -114176 139003 12656 218244
19528 218244 101654 80408 23920 279868 -275256 106200 -64507 29936 -158890 -70258
19517 199742 57035 74315 26219 -28170 -482704 -105988 -107233 -130649 133496 324016 9894
19505 -108547 79768 -8498 -72989 -339691 -193105 -272308 15423 -284539 309946 -87447 -57153
19494 -57153 -29813 147756 -27706 78650 -203543 111697 -136971 -168251 2624 47383 -140023
19482 -218862 -144055 -62416 36848 -182970 -128807 -116338 -191326 -301245 -254660 327217 -116103
19470 160183 -141103 -395098 -202216 -21776 27598 11999 -244644 310664 230759 131956
19460 131956 149927 -124032 -98813 118906 -41064 50603 -136497 202289 159538 -50953 71067
19448 123615 -168695 -185357 -279807 -67542 -122896 66189 -241323 -206826 -74094 112462 -139400
19436 154430 86563 40348 -78596 -153301 -85835 205045 -154621 -85005 -4439 -219628 -109924
19425 -109924 -166325 -66402 152031 -220205 9342 144341 -252100 -278524 -111774 -124052 -412943
19414 -412943 -338280 1424 95794 -83069 170446 13308 -344640 174906 134086 -122995 -168929
19403 -168929 -195186 -266374 -299721 -283959 -45721 -96577 -40067 54784 84494 -341481 15933
19391 -222266 36158 -393084 -186516 -149584 53515 66769 45152 -85855 -244618 -109469 -50823
19379 56766 235540 351593 -142458 -117548 -226214 67112 -79432 -127980 -225956 144596 -330710
19367 -545656 43839 87748 41126 -264240 73670 -127354 9254 -69958 -270378 -282627 -119680
19355 -71553 -79771 -6541 76367 -106489 -284379 11300 41950 -25800 76887 370936 15558
19343 146378 -295541 -240814 -42456 -148736 -21607 90993 -36934 -203163 -234334 -73976 45102
19331 -172439 119466 106146 58069 -36164 -120684 -11385 194490 101917 -65259 -70565 13912
19319 -387236 -320658 81235 168169 -121791 -193822 -315361 205409 -239270 -170891 204241
19308 -94338 40030 199251 -444106 45037 122645 -153500 -140124 49608 -36362 89525 -94640
19296 295076 -57347 415876 35135 83396 2874 -236992 -39024 -204858 165763 -183726 31728
19284 22427 48631 -248081 -457263 -143983 -96183 -226646 -180435 -111919 -172539 -362512 108673
19272 -212188 190277 -45825 -72156 72824 178974 67906 92214 -116439 -20210 -434458 -165710
19260 247135 44464 -204577 -108986 50757 -202744 -83680 -8012 29428 -124916 -70530 34913
19248 317537 131428 2542 -25499 151582 100504 -394125 -100140 217340 -491 -265470 299777
19236 -486375 -21927 96391 -386291 99835 -353153 73620 6015 -480288 -77577 -238679 -213890
19225 -213890 -146062 -251706 -159324 -313589 -54852 -141648 -232434 64935 -130736 27870 -91462
19213 27137 -7145 153352 -412204 183447 29227 36999 -31654 -194139 -240775 -71549 -269205
19202 -269205 72469 -59686 -134766 90512 -35608 -159268 221335 234345 -36606 -169394 -12690
19190 3621 325035 -10990 -87214 -9534 -152603 -297683 26030 -276455 -152345 36954 -244241
19178 -55964 -211531 183789 97559 -350243 -248607 -177674 -57092 52452 63099 117701 56279
19166 20243 41939 64332 -49749 52748 93046 -71812 38455 196200 23642 -229777 -58765
19154 -207118 80519 -83536 291707 -102498 -216916 -13456 270204 -15872 -117579 18747
19143 -234960 -48121 121270 97131 -163595 -183210 -20488 -150329 -192584 -71040 -140945 -94179
19132 -94179 -129114 -464542 324886 -263641 159616 30686 12878 -129658 -109796 -171053 -7847
19120 -279373 342919 -290435 -66221 -52339 -58593 247635 -77122 231564 -329585 115010
19109 98143 23224 -257269 -98903 144043 -207276 -280905 -110934 136957 -448612 -53639
19098 -160221 -67354 -88921 -111112 -160089 -20933 -197247 42098 -56714 4950 -53362 11311
19086 -266717 122223 61106 -89143 65713 46768 -255361 134919 -473215 -326954 -277719
19076 -277719 288261 52718 194417 -76394 -145028 -500739 -20256 63397 -71434 -161704 -90288
19065 -90288 399227 51546 26164 -221052 -508029 -183473 -122967 -76721 -106260 320325 -6884
19053 -221530 -75944 -174247 288529 -244946 -8779 7216 359900 -102694 56711 379900 23241
19041 -104775 207954 -26043 -59068 83902 -289751 -53749 -20448 -122938 -10738 105863 -417847
19029 305592 168946 -230639 -133873 -55439 311010 78105 109990 -162632 -40033 252906
19018 -124859 -85514 19874 -298747 285611 -391274 -84533 -316581 -191404 -124167 -52087
19007 -225758 -19535 -55381 -49092 92320 -120766 51441 -153692 -219924 -436482 223916 -8408
18995 -45274 99826 76040 -236133 80313 -339266 -81109 15699 -260072 17594 164988 -262240
18983 -77924 197287 191561 50475 -73001 331 -25393 -72261 227704 24108 -88026 98887 -159548
18970 -12252 -191133 186288 -21329 -135039 45105 48117 51904 -76915 -134666 330586 -22902
18958 81229 155501 -114509 -81733 -164800 -417583 93448 -211373 -62289 -131526 108066 124704
18947 124704 -260157 313453 -20723 24429 227387 52265 207671 194097 9286 -18679 -29501
18936 -29501 -80747 -213044 60140 -85327 -346059 -296362 105146 -68030 -248557 39971 122043
18925 122043 -312748 -299450 -108316 -82628 -184728 -373617 97143 104917 299499 -363299
18914 -8914 -589890 -14143 -185523 -95807 -452791 229649 -131189 211236 -329034 12120
18903 168717 -237122 26084 -318704 84873 65492 -263993 22176 -335685 154463 157683 67113
18891 175003 -172042 -191827 -82325 120768 -151828 -136723 177247 30786 -188966 -15199
18880 64192 -168362 -293570 138015 332177 -228310 -67806 55001 35369 -64707 -95823 114851
18868 32643 -42725 147521 -380221 -57282 189326 116239 -166322 -211308 -94699 -89710 260790
18856 22080 -130318 71030 72133 57124 223821 201558 -212389 27305 -76456 118408 110170
18845 110170 30355 208913 -38695 120614 -146948 -140156 -155103 -16057 -57335 210360 -128587
18833 124747 70550 -127494 135312 449838 -7515 146139 272877 -4310 -180896 133810
18822 -110887 -155975 189752 69511 -186826 12211 10030 -152747 257033 -184944 105917
18811 -42991 193174 25799 296375 115344 110804 140603 -42173 35631 86809 154703 -248478
18799 -29361 -190264 81984 174479 -325025 -494399 -140321 -451359 -104316 -87422 -336754
18789 -336754 -129602 -145236 130368 -89976 59332 -23867 -205821 -250413 86858 -85171 -146239
18778 -146239 -142531 -210371 -150505 200432 -173758 83712 -67569 -155437 -17540 -125018 2687
18766 159870 -169143 -295302 15783 -8144 -294843 -141659 -156881 207794 -145256 -6359 -41627
18755 -41627 131459 121003 -131876 -97183 165310 14120 41784 -449910 -406538 303327 -115538
18743 -384 95570 114304 168145 -100109 78619 -401361 -145185 -12888 -377953 310709 -197756
18731 -74170 -211651 79809 -179420 225819 276497 -154881 -95762 -91255 -19551 -55124 -148462
18720 -148462 -132716 -84254 138014 315334 -48539 -43111 58957 -61162 -49975 -201572 125906
18708 76209 -335249 -236254 -302008 -316790 -269437 -19258 -53108 -65129 315666 82566 35794
18696 -214418 -121269 -127348 -81059 306333 109109 14605 251722 -88496 121386 -145333 -47799
18684 -243757 -187982 -153232 -205581 -181677 -291143 -25446 348816 -211703 -161920 -13077 -208887
18673 -208887 -64914 7864 -124115 -75465 -370409 22960 -103536 -5640 -77975 78946 16741
18661 292936 -110112 234100 150841 -244263 114086 -296679 83212 47177 -10249 -4111 85108
18649 147335 -255193 -58899 138402 448949 246486 -166071 -274596 -174394 -90306 -142235
18639 -142235 87759 51587 -53919 -95939 -192995 -312497 71652 263018 -290957 159480 -71734
18627 74589 213667 115232 -199384 -186243 64225 109895 -49866 80886 -320284 212071 -337556
18615 239911 74238 1858 100820 -196430 26979 -134742 188653 -14678 -65121 345725 -227899
18603 43067 60228 107218 -145703 -504995 322632 40052 104882 -177579 -409486 -98025 201048
18591 10343 -180084 -138030 -103423 -122005 -260893 -256260 116441 -218588 -219395 -64081 -119045
18580 -119045 -4271 -10723 -123538 -171477 -232422 -21236 -181719 42664 -209266 -1218 -133975
18569 -133975 -38763 278660 -17759 -16126 129681 -166418 -193043 -156069 -172271 -246259 -77804
18557 -232301 120813 14655 30924 -308159 173365 -151689 22165 -80544 -119160 -112874 55682
18545 -58389 182153 -120498 -36584 -197682 -9437 80781 1445 -116130 81887 -47850 83374
18533 159740 103446 59125 -366131 -110468 -306639 -26359 -106692 279712 -164990 -253638
18523 -253638 -36628 -117552 35846 -194658 26524 -105867 17991 -178778 -37684 -199426 -76818
18511 42480 -328559 -425016 -181724 78132 -39395 115856 -228176 97404 -266560 -234933 241058
18499 -46232 216754 -55432 -174742 -148934 247995 -177011 64658 -248269 -144070 88088
18488 -14372 199434 -65196 -82339 -167266 -95147 -74423 68311 158345 96466 81278 4261 -287491
18475 -18692 146206 174321 307418 -163630 67283 -56117 167513 35785 272470 3837 91087
18464 91087 -212869 -285328 354573 -60681 -41909 -75069 -67781 155537 47923 239741 -188643
18452 22970 1193 -85224 -118995 232894 257115 -23663 424960 -283842 -203961 -79740 -87718
18441 -87718 -184150 12702 107008 220514 398467 -92844 64676 167376 -103747 178456 1060
18429 -108245 -19161 -244694 116161 263307 129373 -229536 -76137 -7146 -99421 -311591
18419 -311591 42409 213251 220895 -52073 -144157 -241191 -74363 144688 -99396 -48763 156375
18407 145268 24202 12790 114116 191720 122348 82604 -10245 -286958 -45317 -299705 116394
18395 -40834 188432 -162004 -106911 69295 -78516 -35634 129294 -241195 58773 -281569 101055
18383 45274 -126869 -121574 -47293 76463 -132386 -235199 -137064 92883 138457 -68997 -55802
18372 -55802 159352 -143341 -402315 -72244 51324 -203043 -87150 13890 113068 -17154 -203734
18361 -203734 39320 -105303 -47535 -48983 -147524 13282 -125863 -256832 -134617 188325 -225726
18349 -126423 75185 -106577 59687 84751 64699 -126932 69044 31576 -141810 76659 -138710
18337 -160585 -156090 -14681 -214590 -141472 -25186 151721 -3158 348954 -391018 -152985 -332000
18326 -332000 -229047 37832 -297119 -136540 23673 -135190 -117568 -228397 -208635 -216951 -139865
18315 -139865 -149885 -37326 106174 105446 75144 208076 146898 161599 -123552 -83803 -224917
18304 -224917 -175628 -122039 -58187 160374 105293 -48966 82409 -137461 21101 -198617 -70675
18292 315624 101042 -161862 38974 -89445 -277641 141913 4803 -260042 -80342 -93166 -6046
18280 -124509 156406 -84193 252577 272532 152309 166869 -160800 210934 -330747 -252838
18270 -252838 -245899 -406260 5436 368321 -146318 -89608 -32235 150508 -31277 -134947 -39181
18258 -193819 -237502 -232989 -244427 42196 -81987 -107744 128953 167241 64279 -11244 -79423
18247 -79423 -39691 -134945 -185857 -60944 -340293 -38875 71500 49854 124703 -52364 116368
18235 112044 18566 -144252 70255 -97003 115132 -496 11229 -14608 -190289 -264876 -267700
18224 -267700 13746 270290 -377452 -166461 -205769 -98160 -65466 2638 29150 63632 -259943
18212 -133101 -365472 -47806 162984 283603 -114890 221108 -122891 8770 579 -240575 -82761
18200 231794 -340340 -23739 -104763 60171 270384 16313 -20074 231632 427852 -303112
18189 -344521 55844 -63711 -187163 -78354 -32827 206962 148943 -7137 -85154 108404 18523
18177 -63095 -222957 -112054 -69778 248754 -21478 -174202 -64240 142149 -1463 -80149 155884
18165 -230239 155888 -142429 -144101 -286733 -74709 -89620 165507 -142217 162913 -240267
18154 223697 -134871 233014 -105378 332181 -232067 -163888 -31877 113177 -90097 -296083
18144 -296083 -6178 204741 331619 -103405 -39973 70280 -129326 150381 195772 -212372
18133 -9039 158379 -23535 -180849 150905 50944 -171935 266796 360725 -8425 139341 -113332
18121 188897 -53845 352559 -8893 -57083 41853 -297794 324509 -153366 -53317 180556 -300007
18109 4939 -306910 -104404 -217698 -38094 33388 -73785 243380 -194013 305799 -81295 -322045
18098 -322045 -4431 -69029 -115265 29481 9602 -178349 -20193 -211248 173237 5179 236332
18087 236332 47965 -29443 -263152 22677 8680 51219 -110932 -227481 -38078 -292772 -99161
18075 97281 206150 -146994 -68446 -233921 -204416 -190315 123596 225914 -52803 -259832
18065 -259832 43663 -68030 125911 50558 74230 -41085 -26395 -128397 103575 210595 9150
18053 -268 -367738 -299446 34963 -210025 -100892 -73348 -244204 -72987 -13489 34008 -131400
18041 -136250 -155690 11555 105959 132902 -11017 39404 -41682 60600 -59300 321409 10141
18029 201950 -268386 23490 -147775 205867 264891 26918 160448 20429 -26455 -135112
18019 -135112 116329 -305070 191632 -177013 -250959 146748 -305943 222347 2920 30502
18009 30502 -148474 242076 -330014 24212 -211803 -8262 195434 20979 96984 -117649 113627
17997 -124959 109439 24964 -117334 -247173 -194280 -106585 -11213 -217891 256277 -58499
17986 -40478 332005 -122468 -317358 -26520 162189 -74575 -306400 -76725 71793 -200617
17975 24021 -101306 15019 17013 -10845 116152 -186024 -232909 -67247 -105940 -65953 30406
17963 -240399 -112025 15195 34901 372324 151926 51404 74028 -403128 -219700 50804
17952 40891 192462 -251730 81735 -84514 -194573 143435 -37413 -71537 -58756 -186732 -236304
17941 -236304 8235 -73622 241926 -255926 -207094 -34078 63145 -7028 39607 -58369 71947
17929 158967 -145301 70775 77382 -288615 261253 -168643 -33798 312315 72185 169065 83277
17917 -32777 262652 237287 169018 -54197 40372 142949 -287267 96327 -39741 -117619 -240004
17906 -240004 42592 -28609 3626 -175037 -195335 151161 -102239 177663 -72978 -100517 29829
17894 -28015 173410 -255974 -282257 280536 13923 -272145 71180 -60485 -24489 -128447 -192879
17883 -192879 25077 -157403 -84967 279373 -66229 -225796 -85955 -46111 47683 130359 97237
17872 97237 165091 -20345 -2562 15955 -63914 4941 429024 95447 -151482 -258 -507048 -87653
17859 -15451 170591 132935 78129 169289 242321 203682 -159813 136251 22449 -144961 50618
17847 120307 102423 75941 218011 -39543 -134336 103216 -84058 -20351 13309 73798 45501
17836 45501 -149346 6757 95666 -50549 -40950 -181896 -321415 258786 101500 -75811 172744
17824 217409 -139387 112505 153056 27679 67620 326711 -42530 -105727 -37474 174341 139521
17813 139521 -87734 55541 213589 150200 283306 -92849 -12958 -3853 -78307 -248803 132484
17801 239697 -26946 12912 -171516 -69775 114616 83539 343997 12385 -253289 37473 -434366
17789 -39466 57522 -16613 47771 39384 13477 -89499 -96188 -91792 -84579 33037 -1519 135532
17776 27719 323745 227559 -73167 -183901 128577 -113994 -115881 98876 -180354 27478 -150149
17764 14455 -30472 42199 235379 21475 -112482 -89367 -129979 153460 -84298 350211 166630
17752 -98215 249486 20594 268160 63072 279397 74062 196809 211934 37661 110316 -266318
17740 -67704 422247 -244503 -117663 9895 -93101 157346 -441 50890 -310826 -71596 7882
17728 -154845 -6532 122260 -253113 -119723 -200564 184856 70415 -343234 13689 5710 15609
17717 15609 -216253 8287 -15470 75651 -20454 47938 -170834 72700 -256898 -20147 -73857
17706 -73857 -35723 26172 93060 100795 -173018 227636 -49120 245844 -81592 95157 71270
17695 71270 -92729 -80400 -115033 -42145 -91669 121693 -50207 156997 -32633 103300 -231369
17683 187930 -234234 43183 -483341 84357 -106289 -70423 119705 242882 -137072 -119181
17673 -119181 -208538 -113765 69007 -27896 27856 -424043 -132136 252416 183297 170336 76584
17661 -325168 2099 -112904 110716 31470 -107764 359680 20230 -1211 7377 123969 301184
17650 301184 -1500 13980 215841 -85691 28447 -4433 128237 46139 37596 169995 -80173
17638 17302 345987 111497 -305070 72172 -182989 106004 158554 238436 352396 -28155
17627 -79216 71355 349505 -332546 -171101 -82140 -139244 -47161 190734 36167 45401 -117940
17615 -55603 -186917 -4586 -61363 24152 -92293 344146 259243 328978 20334 -259908 120684
17603 196614 -23255 -120854 180628 21805 163918 -96019 191470 -41773 58336 1986 60395
17592 60395 27226 409148 116543 -34295 4014 299207 -149649 -157889 42483 -190529 -140901
17581 -140901 241901 -75440 184713 244120 12265 145096 -98483 442494 -128546 -295732
17571 -295732 90899 14927 -36043 150910 -48248 19086 -165119 -326390 348788 52579 174875
17560 174875 23489 174548 20464 -206262 77047 33839 104385 91598 -149273 143046 63605
17548 86056 154581 340051 -2472 98570 228368 266188 -90979 187263 84039 128033 64079
17537 64079 -234564 36174 80901 323052 44411 147425 261102 167518 114501 387167 144665
17525 -37681 -3942 46707 354007 76397 164980 -192120 -140133 -118697 224210 319350 -32437
17513 170880 3401 142261 82906 36397 81941 133059 251307 35134 448401 25835 -27575
17501 15882 16435 -170004 118873 -138520 343028 66479 101984 -93002 -351529 75275 -3816
17489 -168269 147219 60604 122255 329364 -81571 75765 -229022 -93790 -49208 183485 -2605
17477 425586 361418 50167 308196 397426 106561 3715 152211 182857 153811 92459 193333
17466 193333 100273 501122 367223 -216602 -61988 -70598 -1261 -60892 103127 107976 101707
17455 101707 17352 209558 515011 -138473 369062 259378 297753 471074 340794 317079
17445 317079 -34939 284397 -36973 101955 255736 -114611 -10142 103967 -5748 256183
17434 346199 -13943 -6672 361592 63279 332696 363369 243486 -103998 75118 227017 480074
17423 480074 380784 677253 415038 22435 323517 353981 359991 -57595 86955 478620 293264
17412 293264 279558 163123 56774 253663 185248 -207130 -36996 177758 -184147 -213433
17402 -213433 220562 36375 209524 224616 400007 114534 180143 -99085 12469 449357
17392 449357 61552 284020 -204187 427728 305990 204270 23642 444609 215524 140143
17382 140143 150780 211525 41870 169070 -38572 35646 78076 30682 300568 64128 88249
17371 88249 542687 -5159 192273 -29617 277426 77631 -50784 577088 -130454 -196338 389694
17359 -370242 156335 161441 140050 195099 97054 377124 136225 18063 144271 206881 153436
17348 153436 63865 109058 -137303 195400 -217262 212794 -167952 259391 -248385 135876
17337 235448 187111 -217833 -77967 323580 274050 105271 518194 240890 56907 -36530
17326 -87649 -67360 114740 242311 -43905 287260 261488 -124018 269732 1122 -196825 358270
17314 143801 281540 106823 240319 119258 181355 -21574 259520 566354 258019 -289090
17303 139028 281465 79484 28928 17 158464 28886 34905 97223 182663 360263 326529 226704
17291 226704 320458 61999 261770 -134256 82182 5908 -108380 235596 122465 292642
17281 292642 150504 524232 -175885 125175 118610 -37521 112191 474262 143573 -338612
17270 290068 -155178 441063 467469 427535 84567 43891 169435 593094 455673 303316
17260 303316 -125164 -81286 304873 489359 25813 98647 104086 301840 380308 -35922 232116
17248 131562 351132 489671 338688 332872 164692 424122 487230 -80965 82331 180996 183257
17237 183257 120020 64887 461355 238937 99491 -137720 -226292 184424 327284 97109
17226 224189 -61997 70114 229647 398268 145930 -71410 -66221 175078 18624 269084 133667
17214 -11746 282279 342481 365707 142640 17056 79980 -72778 367153 409254 233836 434407
17203 434407 147698 195973 206342 200703 226388 12212 68156 145705 309443 419233 305139
17192 305139 202276 251325 257559 517359 267030 388840 129762 -15036 308193 129896
17181 360564 223726 312595 275637 183276 388004 247276 364422 102286 145133 81661
17171 81661 346155 465577 345699 369805 532650 321909 300399 242624 338782 385425 228781
17160 228781 367354 125541 346420 318329 270718 519253 386866 413409 277936 275978
17150 275978 401132 65978 315589 290873 261427 156456 277524 554610 406448 535864
17140 535864 271599 326627 251082 378636 522142 78576 580267 240552 371203 210174
17130 210174 -77005 706394 248349 -82731 180618 334297 224458 540393 472258 313275
17120 313275 489838 123491 315224 508938 126335 314435 269509 331443 236538 437930
17110 437930 275332 243925 370234 561753 512277 585534 438714 304865 495101 281007
17100 281007 352811 339631 708550 393747 528341 590706 358519 174461 398234 290688
17090 290688 520414 114756 373992 490482 591178 465512 310442 487951 635519 346914
17080 346914 313492 233920 189431 472590 392887 456350 164531 231889 490511 600813 263506
17068 378529 513373 609013 720336 280675 666176 614171 646597 475067 250938 210023
17058 210023 264312 484673 382370 708103 710869 438108 237948 769221 543601 361775
17048 361775 721084 603959 720308 376760 475737 791347 564302 208832 661475 324527
17037 487679 664900 479781 806923 771753 499187 674271 748025 667847 597029 827950
17027 827950 424730 588175 783941 1037107 794751 687943 636820 942387 661170 414899
17017 414899 578071 831749 697469 760054 715626 612859 731632 636072 587298 1041429
17007 1041429 809012 1018942 633553 717904 550994 762697 393486 733845 889463 753420
16997 753420 509357 720394 925087 736525 860761 740287 438466 898552 879310 893482
16987 893482 648641 761005 253851 744832 1126118 722916 819662 729565 610282 903006
16977 903006 902056 949740 329528 988721 849213 811660 652072 862804 1127016 876583
16967 876583 944330 1033383 576411 885659 1033999 847543 1186845 1084375 969241 829781
16957 829781 1048273 1036912 750951 1108033 1083793 971340 1092132 841922 1217535 1033221
16947 1033221 1169869 1205022 1029725 1251717 972864 1013571 1326867 1165286 1357558 1523911
16937 1523911 1348730 1246113 1579325 1283348 898133 1502690 1640241 1306690 1276901 1219988
16927 1219988 1053854 1116974 1273956 1546204 1498687 1561232 1473488 1375957 1629710 1647666
16917 1647666 1621284 1426039 1524929 1520918 1761780 1559616 1529841 1673969 1810504 1698897
16907 1698897 1644827 1611758 1460827 1704851 1989795 1688706 1682277 1698928 1700540 1682977 1509333
16896 1509333 2026066 1739385 1988047 1958967 1911801 2030263 1972087 2046082 2246058 2012909
16886 2012909 2335508 2220779 1955281 2252779 2228485 2172308 2196710 2079118 2054033 2344653
16876 2344653 2489449 2490626 2235056 2568758 2422007 2587216 2468686 2508301 2533181 2547481
16866 2547481 2558464 2654592 2580702 2672609 2612904 3126756 2914831 2970288 2769915 2833702 3427713
16855 3427713 2891391 3331084 3170557 3248175 2945878 3371406 3375221 3406057 3432514 3536659
16845 3536659 3606157 3635525 3957957 3902859 3791283 3946361 4081862 4062224 3953601 4273788
16835 4273788 4188988 4359607 4264054 4475780 4574798 4745546 4850173 4781681 4866895 5210993
16825 5210993 5044014 4903593 5672639 5457691 5254439 5544387 5697455 5812834 6043183
16816 6043183 6036590 5899792 6390522 6319175 6603600 6759508 6602406 6984944 6840861 7027529
16806 7027529 7351366 7670447 7831221 7583542 8077348 8247107 8602055 8770443 8553330
16797 8553330 8977093 9213310 9385633 9680217 10165132 10229820 10264279 10549722 10646388 11005244
16787 11005244 12037940 11723578 12155044 12674967 12596343 13283583 13617120 13934288 14447667
16778 14447667 14856447 15091959 15689566 16445317 16755014 17523384 17685690 18896403 19342504
16769 19342504 20098603 20575438 21360092 21766004 22563894 23545974 24403437 25439733 26391966
16760 26391966 27558870 28769674 29503889 31268175 32183673 33820890 35212685 36568374
16752 36568374 38263388 40073289 42059089 43908136 46360322 48741542 51082728 53561086
16744 53561086 56269229 59160196 62011125 65428836 68835078 72777806 76594196 80318626
16736 80318626 84983292 89439200 94347292 99598045 104726046 109712909 115398691 121045400
16728 121045400 126847517 132413337 138092330 143642540 148959689 154118865 158469729 162723533
16720 162723533 165851731 168523250 170429317 171710526 171722644 170736328 169233391 166235426
16712 166235426 163010923 159035872 154756112 149827354 144387580 139200389 133420032 127815394
16704 127815394 122328099 116628673 111206269 106034920 101007826 96347239 91748107 87026132
16696 87026132 83129753 79176227 75459801 71852667 68244208 65294251 61786210 59099810
16688 59099810 56309864 53817788 51426149 49145349 47173935 44819320 43172847 41473198
16680 41473198 39450510 37826818 36326284 34794575 33691534 32223024 30665674 29866688
16672 29866688 28599631 27557456 26421781 25227004 24581145 23521122 22813566 21705997
16664 21705997 21012387 20826420 19670338 19357262 18602165 17955923 17362645 16875825 16098535
16655 16098535 15812925 15152751 14630869 14369886 13825613 13319259 13187272 12622336 12372341
16646 12372341 11855724 11740992 11315061 10763848 10654460 10384443 10034908 9670062 9667640 9254579
16636 9254579 9151876 8842319 8840348 8453513 8141962 7739109 8048460 7668729 7491999 7086494
16626 7086494 7055021 6922243 6579375 6653672 6519184 6480832 6253620 6106738 5978359 5816986
16616 5816986 5642800 5463711 5727743 5306859 5121386 5104689 5027472 5008858 4850157 4842342
16606 4842342 4521305 4401923 4497396 4326965 4516539 4162581 4203492 4105855 4002461 3817481
16596 3817481 3835497 3669179 3901106 3393036 4008869 3274670 3402208 3465103 3300835 3175597
16586 3175597 3424512 3111500 3047939 3002070 3517592 2957949 3192817 2743968 2968144 3044882
16576 3044882 2996487 2859585 2598326 2809194 2932804 2294305 2409745 2666718 2570842 2396535
16566 2396535 2508330 2483888 2243942 2133571 2280548 2709485 2231739 2147105 1994303 2152289
16556 2152289 2074015 1776145 2110520 1750761 1763193 1842170 2093416 1716782 2179146 1835737
16546 1835737 1917803 1690931 1990518 1662524 1983206 1195227 1924036 1824076 2032786 1742662
16536 1742662 1784810 1636956 1391438 1477717 1632501 1338301 1580312 1740550 1603564 1509720
16526 1509720 1410108 1438977 1428545 1136338 1279002 1191656 1122260 1476825 1382989 1054461
16516 1054461 1233894 1845060 1304592 1462417 1213873 1377527 1232207 1249767 1208606 1300119
16506 1300119 1377050 1217173 1371850 1426340 1085208 722682 856896 1295625 1142584 920654
16496 920654 1171562 1103388 1055561 954604 1045012 900273 1043659 1210747 1115713 881086
16486 881086 730142 1143890 1052662 816190 1139939 852960 1093493 1113051 602878 697635
16476 697635 1194292 607882 832263 863846 1065815 935810 900467 631792 648160 627672
16466 627672 737323 541885 761039 830305 604040 605709 440709 591646 971494 642116
16456 642116 818641 556475 877754 411526 629223 738779 589901 513120 535984 554469
16446 554469 574312 482849 731887 606716 834062 578673 518014 604910 482795 829552
16436 829552 406878 831759 413286 508881 139356 592918 636023 461310 849906 383643
16425 546705 283328 643882 362330 691924 812808 413265 303691 567505 328899 697549
16415 697549 156930 553338 290860 437797 457060 390442 717252 666082 441509 616680
16405 616680 534140 630684 431872 224735 571948 361072 379474 513976 434173 181030
16394 539232 528494 442053 466076 541777 294300 384431 553682 394055 735561 708429 432657
16383 432657 367829 393761 373429 380809 392364 457777 376264 102517 308202 457933 262054
16372 262054 237066 156366 473315 394743 625678 486366 566655 290782 129512 293492
16362 293492 520922 312960 466611 483436 211027 233101 55747 465944 453743 553485
16352 553485 236744 212320 243508 365079 491316 265225 324168 489842 453803 231184
16342 231184 292636 636005 239756 50902 253868 350530 551071 -14877 148268 371223
16332 371223 -96528 317286 227164 570103 421346 209597 215589 612470 238071 256911
16322 256911 -81325 182011 170889 174613 120476 -50405 246133 279392 449612 318803 -195236
16310 507293 -33434 106567 337203 155390 387246 309677 -19639 178674 352648 396865
16300 396865 -6273 269218 108786 439715 383475 456391 274676 141337 -5003 139161 430900
16289 430900 390715 136359 424370 203815 483694 127381 49559 -161458 33504 -272049
16278 417190 107514 138902 128177 307472 93080 216234 -284854 422173 202858 27049
16267 125247 19159 316204 186716 139805 -11780 258634 294473 375817 654059 -127011
16256 134086 208392 81989 35415 46811 190054 -37036 -118892 518573 41358 364370 351496
16245 351496 145677 649965 83276 346089 -118535 467314 365227 -13823 341194 97862
16234 -161811 235472 170780 249467 216270 157850 126485 -16557 298517 16385 91111 246925
16223 246925 641785 -7396 79332 33144 139726 -28247 -67768 -101820 129494 117742 37989
16211 102730 -45564 -135568 227075 231942 -2477 -74630 148229 59428 -47736 311102 -131473
16199 492170 -49045 136771 286503 90187 349074 207059 187457 105943 -235096 -88657
16188 51700 -146320 -205218 63657 -9801 128879 -147084 162742 69803 -74887 -132375 133456
16176 88767 -136126 -84321 517480 -62576 101723 -40757 -105355 224 382518 337661 31812
16164 183477 -66438 -3192 217595 -2179 519589 173282 99207 97249 86697 516 -17304 211080
16151 -68030 -56774 33917 -36724 176818 308577 241523 106811 54745 46065 -110253 -92162
16140 -92162 -107336 93423 1544 -343102 -42313 -28557 41580 -182266 107401 -32569 64139
16128 28499 1308 -121109 313237 305591 44790 329674 128488 30982 -107351 32164 93653
16117 93653 -156860 66753 -264872 -94490 111972 164674 191501 -629162 280877 249789 -27038
16105 266699 252290 96551 85709 321020 392266 174759 203632 262428 101431 -69151 -255510
16094 -255510 -4028 -135265 -48994 324589 99976 -111968 -74892 142426 -22726 81889 2803
16082 169458 -81136 246 228412 87806 147756 -134372 69152 62688 17536 580605 142996
16070 62960 -178543 18708 41628 9286 -22385 -322715 -14794 326121 75047 -160455 167041
16058 436406 -161493 92430 6032 -74457 169465 -428138 63503 3048 210491 -116832 -106911
16047 -106911 -99015 -166288 24744 -217577 -423770 -158543 73107 -155363 -6952 202406 -317789
16035 77331 70774 147872 126556 -38428 130406 40539 -36319 12991 -197696 1870 -25973 -102466
16023 -102466 137678 152965 -224402 145033 251454 67215 -19745 -12046 -97187 -66493 -314308
16012 -314308 21281 101231 -102032 538390 64359 -300341 -168404 -181378 105826 259709
16002 259709 -4217 -95379 -326076 -254577 83462 -172379 191349 25099 -250983 252596 -222353
15990 -75163 -166928 92562 53658 333849 -39469 321372 97115 112302 363305 223150 640810
15979 640810 158578 152222 25752 245523 -13229 -3977 -57029 -68297 247593 16791 -23757
15967 -277787 241164 242535 -26349 108652 -64167 31087 -147039 151026 -80889 192090 -14298
15955 94246 -11574 -305023 101250 120755 72597 -169545 -86735 -105466 -139356 139222 105825
15944 105825 158015 -197153 -5954 -483151 76868 264246 -267218 17625 -100863 -58553 110118
15932 120856 -190583 129914 46915 -116842 -115261 100407 -45052 100175 121199 -134039
15921 295235 -102298 -10230 -244241 3140 -47838 -42989 -211527 -305499 227727 66727 -48676
15909 129798 42126 98871 31150 33275 238170 221732 4121 -78694 -263724 -92838 -32255
15897 -411550 -334066 -132029 116970 -165282 -276863 25459 29564 -259861 -81326 138853
15886 -46198 10146 -138861 -152210 -227071 -249577 8413 -124870 -201832 -41742 -100109 188156
15874 76126 -320319 -97387 -93207 216710 113028 -75008 -483867 -93207 -26126 -99472 123251
15862 157138 -92812 104957 -200696 -257146 -345127 160973 -120610 21958 41354 -82694 -12123
15850 -352148 -399032 -233285 13483 -97602 217430 101221 64600 -142614 332266 3229 -164468
15838 -11584 459757 181387 -234103 54670 -137756 304507 30608 -23913 27877 -169064
15827 133329 -46001 -34211 -132587 177731 -72969 -173759 210384 15925 -58359 -178330 -276729
15816 -276729 -31326 144777 15143 -204239 159944 -111830 -218234 -47721 -187756 54945
15805 -112692 -170854 -43626 -265784 -44297 232927 157755 23914 223445 122362 133615 -87763
15793 20964 -70159 -93421 -54611 59466 -85215 -182979 211306 -4586 385033 -252068 169393
15781 62362 -9685 88731 210245 50420 -130888 -49932 227639 82448 -132777 -245113 -167076
15770 -167076 -19066 -43798 -58416 -169845 -115739 -258542 212439 71026 -54495 -198001 347320
15758 -154848 -106056 150329 58448 259525 -122724 -338962 11063 63682 -61169 -124836 108847
15746 -193430 -138689 273682 264246 -14464 -90926 -180395 -528731 -136228 106565 -67725 -58607
15735 -58607 40924 227775 183186 -167059 190844 267726 -131891 23154 -152216 -83659 80470
15723 151751 161055 -203560 80435 -111869 -201854 193021 58083 127365 179946 -132812 56267
15711 -171707 -93413 -290292 -344482 -105652 -419383 -18115 -49613 -263442 108981 107460 -376708
15699 196525 7618 -169852 -156142 -62088 -67977 -189031 148170 -136767 34049 -136784 130457
15687 44281 277422 36824 -285237 25455 -276546 5060 -182806 -79237 -190183 -108295 25626
15675 -44169 13689 38025 72113 94966 161423 81620 364192 193356 114332 -333566 141
15663 44477 -103534 100695 -170731 -33376 -191255 -7022 -169028 -326623 206575 -198531
15652 -72085 -126888 52572 -342858 -154068 44534 -40035 -97158 135022 -133280 -47688 -120302
15641 -120302 223889 85568 152751 121376 -214923 -175459 213408 -204545 43097 -375940
15630 85520 -41555 -218011 32298 -51228 -51509 -299396 146903 -98952 174834 148540 199732
15619 199732 -152746 -157111 152432 -124646 -156905 151868 -146580 -12024 -331146 6509 -18658
15607 -75640 -285591 72764 -254745 -105827 153782 -318487 130866 283612 -141242 45723
15596 -231812 -357964 145231 -486747 240511 -44819 -47540 -56949 -215121 413197 8150 -325334
15584 -218879 183156 187187 62016 -86688 86800 -31453 145970 70132 85282 151865 -67371
15572 -108312 -101849 -95765 157667 -113132 62967 287647 -261253 -227452 242589 -129764 -60139
15560 308494 -108999 -134150 -76543 -204840 110942 -261278 83974 13064 -82091 131057
15549 -73282 21377 -29971 95496 76428 90569 -66300 -232864 29888 -20042 38579 346872
15538 346872 38274 -19672 -4387 -132100 266726 -40632 -836 27201 79999 106525 -58163 -94205
15526 -94205 182097 -823 92543 -20999 -96380 -105048 169935 -121438 -18779 122232 -57111
15514 182623 -204672 135006 10598 98081 -197969 106405 93591 -177947 -137698 -28851
15503 111366 32732 -88229 150733 -174379 -108257 168207 -151844 -107936 61803 2678 -43608
15491 -282893 349909 -439680 128583 -388667 422486 -81235 -60922 -149936 268149 -111364
15480 98442 287138 149236 8109 -21938 -189789 -263541 -25225 242166 -131404 -174599 119314
15468 146490 -377742 58786 6128 -21893 -29064 5205 -298439 22035 217869 -22520 283464
15456 49325 125999 84827 -151217 77430 -60178 -248841 -131485 -75097 60557 -65349 -224656
15445 -224656 -131607 -18920 -190995 -157062 -208058 -39397 -231598 -87410 -156441 23364 -14016
15433 99222 -116266 -277567 9705 46008 383922 -348646 -137111 -275765 -59957 107808
15422 -46796 83089 322031 138532 50914 -95752 -94764 16420 -72697 7577 272255 -126445
15410 -5260 -26031 259013 115820 10398 65064 157711 -102562 2710 52883 -239863 -6478
15398 34785 -91372 -62865 -198446 242982 116998 125590 -39515 210611 11657 -204813 -100738
15386 27530 -52210 301807 52771 -240498 -59540 -18891 -11622 -93303 -87946 -67285 -40443 -48488
15374 -48488 98028 28150 -31914 182793 181546 -238493 91185 -277449 232378 145306 -84361
15362 65656 -53648 114843 36524 28283 -189074 169614 144922 163737 -15890 -347801 -266837
15351 -266837 -135612 -8345 116915 -336731 117340 165643 240863 -111690 113972 -81829
15340 -200161 91493 -63850 60619 35504 -79987 185053 -69392 -77648 8004 107328 -149833
15328 -142592 -321766 11408 -2136 -106905 264877 -259603 50235 -101495 50729 -248420
15317 172536 -336185 73751 -125706 162616 358402 148479 -38210 -61074 156213 -108792
15306 -3686 383889 -123145 -77274 -14254 99150 139347 -46083 -247307 -105744 149107 -61079
15294 112111 -190661 -209644 119841 149987 -29567 -65536 249295 101661 -66117 -89960 -112667
15283 -112667 -267856 -94338 -188037 68311 136472 -281101 -275096 365920 160395 125433 123285
15272 123285 107399 119467 -69081 -342625 -45199 71455 466465 -58268 297561 144225 86367
15261 86367 122066 370044 -4136 -129143 -60917 418059 260667 -110941 -9081 474532 -85949
15249 490098 1030605 669329 526590 834484 604323 200223 297085 196253 -112706 242601
15238 237504 -87565 222156 42847 -297762 78496 -3915 4164 181179 139903 -138330 212461
15226 -138211 40014 96972 103397 50464 221126 193429 213964 -103398 -177983 240326 -66990
15214 -262807 -179267 82282 364284 18956 134353 157683 346142 -172844 141949 120782
15204 120782 165986 -42846 -74501 -141224 131907 253720 -1362 53351 78581 -47451 254932
15192 17776 -740 37437 -169993 -65173 -199836 51825 111120 42652 -104746 162760 -227599
15180 283530 99703 -176290 -193686 49373 200931 47303 -150961 -118175 -38395 258230 180485
15169 180485 448104 97862 -157676 27209 106557 43215 -65476 92006 179037 -100583 469917
15157 230102 307546 43930 152645 -137692 -221830 363585 241894 279338 302240 27824 29759
15146 29759 -243074 -29710 133586 155074 -34853 115283 -76699 -72103 153382 -53614 137540
15134 149551 69236 165005 167982 95759 126971 -55310 294467 140531 87976 -181 -191255
15123 -191255 126189 27850 227842 184853 -141146 100828 65873 132213 146743 638307
15113 638307 29875 -209657 117103 171516 258835 361709 179038 -344310 271153 64143
15102 33515 -119609 162685 -90391 124739 759 72002 330014 27707 341469 284979 219432
15091 219432 444313 -267976 75673 -142569 81656 -126436 242299 291620 -9197 146236
15080 240296 246139 -61151 108585 205192 334655 -290011 450900 215100 -106520 388171
15069 204127 135017 298113 -14904 160328 228830 221429 97093 145271 89504 94220 147216
15058 147216 215917 48272 -323745 201788 141280 203218 -214221 -130611 -57108 182052 21848
15046 108319 -23453 368251 106705 387967 66090 218759 4302 390383 84190 196331
15036 196331 262591 91619 163776 95925 -123757 25960 -56026 297234 265332 196391 428750
15025 428750 -44828 -211832 59517 270703 121048 5922 143746 -33518 179859 301030
15015 301030 308186 495806 -79055 82950 -30897 440721 337215 -8847 234767 -148635 174490
15003 344009 491979 342727 97600 246190 -2475 96760 45523 129088 391484 219194 97997
14991 524726 351982 240536 21952 499125 226564 465726 195048 -104591 298509 207182
14981 207182 273115 478022 342676 223547 179406 -100131 -95442 201362 102201 297930
14971 297930 316270 581772 428309 66592 -234258 505975 105415 -7582 480433 -158 282024
14959 80883 597595 345673 39386 -204565 142182 -36063 287787 255058 -309744 348175
14948 377788 146041 285437 452150 170593 28052 -211183 440263 614772 312811 403521
14938 403521 115351 193118 -33522 60013 83731 -187116 270154 217253 326551 320428 201935
14927 201935 164947 390465 408392 106241 178407 270174 504198 74893 435968 537590
14917 537590 452905 318889 18397 361219 284552 296310 417706 355534 318406 73434 191214
14906 191214 275281 192858 565551 537572 316922 298567 386017 347034 39938 224866 133134
14895 133134 463293 418478 577613 163788 503053 678632 25591 367977 429162 223453
14885 223453 265680 141131 -19173 202689 317518 274363 411782 365737 265603 408074
14875 408074 439625 353353 372701 99277 330686 525020 434075 383914 327561 317545 -79775
14863 307632 176326 608418 299949 520767 78270 271395 562630 648750 596365 529652
14853 529652 571530 177211 353580 625101 549851 486510 -2193 621945 365791 443283 372634
14842 372634 470893 936661 35567 400925 389066 413306 716895 432569 345494 507556
14832 507556 534752 529208 311249 366575 572995 339108 625423 243023 374267 581055
14822 581055 685744 607243 639804 398909 317269 270348 587683 481546 414379 172895
14811 596054 334053 386352 355277 611183 322912 677052 640848 282279 385040 672599
14801 672599 897464 488134 719280 793676 615916 527815 230603 483046 509191 663562
14791 663562 607838 657355 669985 751836 453092 836390 562421 633246 305679 669831
14781 669831 551356 545320 389756 142629 496241 335793 565687 755151 556350 911464
14771 911464 463538 464851 347296 609094 716691 548753 650494 768459 161419 415994
14761 415994 427325 516003 726757 876321 411833 810705 647210 504850 278459 570697
14751 570697 795464 730752 696365 523648 600266 401351 832292 1070590 312672 918263
14741 918263 859581 702312 678362 457854 822702 535027 477820 695115 293434 567811
14731 567811 919009 1055809 961419 624080 632606 614751 658998 789075 906617 484727
14721 484727 861001 747106 849008 579255 776493 680766 1032215 657656 899435 874302
14711 874302 902873 777010 430586 963696 922576 1060642 566777 885064 1047362 847800
14701 847800 1035434 939530 746361 1034651 834821 1112732 606586 1010412 1058699 913566
14691 913566 921223 860239 756092 985303 895926 988829 1092705 1065850 889590 998659 1196343
14680 1196343 822708 824000 1039841 1251860 821292 1070338 1057045 1360779 1158996 736841
14670 736841 548219 977649 1146911 929242 722952 997807 1028819 929785 1014150 1251208
14660 1251208 1184782 1110066 1243764 1055716 628493 1184604 1137683 833359 1119622 846144
14650 846144 1025775 1375870 1395772 1193169 1227169 1101972 1359711 1176887 1257423 1419939
14640 1419939 1709161 1340262 1171341 1372041 1162630 1103327 1191582 1083397 1321559 1475896
14630 1475896 1393458 858907 1362792 1243503 1258223 1248168 1152155 1448027 1564735 1472552
14620 1472552 1570836 1715235 1365177 1788631 1694017 1592777 1324599 1213869 1238631 1369585
14610 1369585 1806465 1655848 1768497 1545629 1571503 1188017 1351574 1806737 1664298 1422919
14600 1422919 1970709 1716951 1735058 1484449 1331546 1701414 1939117 1853087 1826588 1914361
14590 1914361 1604555 1963970 1757018 1704858 1829662 1794737 1749923 1873854 1821950 1900716
14580 1900716 1990772 1885586 1906357 1923938 1936717 2080643 2199104 2310084 2071694 2225567
14570 2225567 1886092 2337832 2404467 2348987 2385957 2403681 2654357 2877481 2254012 2771426
14560 2771426 3164894 2738099 3183307 3590996 4040489 3907689 4191963 4701427 5234814
14551 5234814 6062350 6835727 8407076 11756143 18666112 29377485 33395109 17442805
14543 17442805 10191744 6265149 4630545 3832876 3567524 2941016 3060533 2706948 2405367
14534 2405367 2958183 2390584 2526443 2625831 2624824 2478866 2773706 2773300 3080500 2513687
14524 2513687 2340448 2724133 2334573 2890474 2545216 3068239 2924019 2538140 2817577
14515 2817577 2655316 2672058 2430918 2761843 3110922 2741839 2701513 3175902 2801119 2816407
14505 2816407 3017413 3278916 3196474 2969158 3004194 3045052 3414082 3171726 3329253 3259353
14495 3259353 3136634 3351719 3329041 3323271 3664041 3525472 3451151 3293046 3496879 3262096
14485 3262096 3708704 3519765 3525506 3844150 3666555 3960042 3909296 3965726 4168010 4011680
14475 4011680 4109972 4199265 4317240 4269410 4420844 4584427 4300678 4324160 4409215 4502003
14465 4502003 4529206 4356564 4640381 4615274 4613920 4898914 4457408 4863276 4736390 4971918
14455 4971918 4943008 5378623 5124351 5284955 5227204 5287775 5465895 5390124 5508322 5404054
14445 5404054 5766674 5946817 5460039 5567573 5986396 6128607 5797945 6367218 6081781
14436 6081781 6482341 6107266 6415670 6093917 6509849 6553319 6872539 6805886 7288354 7125291
14426 7125291 7250476 7555245 7665039 7717081 7379305 7868332 7650952 8283430 8027099 8200313
14416 8200313 8496267 8402339 8544273 8633515 8551407 8726575 8983674 9253421 9015991 9446930
14406 9446930 9670366 9343292 10005300 10338136 10201408 10510702 10159022 10674370 10866672
14397 10866672 11301420 11039520 11544519 11719441 11820589 12037990 12207912 12478383 12462663
14388 12462663 13085393 12885691 13373722 13365582 13632579 13870178 14231230 14538053 14614082 15035977
14378 15035977 15468621 15417605 16119473 16227204 16766083 16655309 17111152 17928978 17973337 18306546
14368 18306546 18348762 19172987 19081195 19983793 19987931 20859859 20797220 21775467 21807906 22650078
14358 22650078 23088528 23271805 24065610 24882160 25181373 25750965 26182156 27067178 28037023
14349 28037023 28322142 28897316 29672154 30455922 31175010 32298292 32744960 33751542 34722566
14340 34722566 35848262 36727672 37698581 38852334 39884041 40782851 42717817 43314110 45105096
14331 45105096 46362991 47762483 49145891 50825120 52622923 54133527 55899923 57746774
14323 57746774 60031178 62188068 63937710 66177391 68231812 71380719 73628869 76514037
14315 76514037 79875257 83089834 86060253 89746181 93111119 97420566 101380247 105543842
14307 105543842 110286461 115312824 120260082 126062279 131980706 138568603 144817325 152072689
14299 152072689 159539635 167325342 175603566 184071166 193768063 203345710 213600485 224986232
14291 224986232 236306134 248188959 261166991 274315514 287761204 300377685 313313122
14284 313313122 325317811 336838131 348238002 359254868 370422971 380903558 390988342
14277 390988342 401329594 411998044 421471831 430519014 438886643 445781000 449066429 449987231
14269 449987231 448427216 441878962 434818454 428706676 416810540 402520314 388219286
14262 388219286 374286581 360513747 346609706 334461297 321062714 308871054 296863215
14255 296863215 285019806 273090829 262132586 251312617 240584574 229953819 220468122
14248 220468122 210700257 202121032 193789172 186012701 178653926 170865086 163620574 156848514
14240 156848514 150338439 144272743 138517615 133449579 128183646 122816934 118273082 113639655
14232 113639655 109470175 105811653 101671980 97762412 94193646 90572279 87104937 84149278
14224 84149278 81035242 78462071 75626989 72674637 70516399 67889038 65812439 63358716
14216 63358716 61499229 59395790 57536764 56424663 53899590 52423685 50811996 49540801
14208 49540801 47893257 46934904 45421736 43947119 42602360 41379977 40390244 39012615
14200 39012615 38352181 36915824 36059214 34678576 34138975 33136367 32107550 31493267 30735821
14191 30735821 29827497 29192398 28114898 27715208 26742164 25979459 25327660 25103670 24144713
14182 24144713 23610647 23566160 22692894 22136180 21732021 21002752 20614710 20321641 19822221
14173 19822221 19541225 18978276 18599823 18209041 17643989 17572617 17117914 16942857 16317882
14164 16317882 16436475 15747860 15719212 15395268 15032037 14478853 14607913 14225308 13903424
14155 13903424 13933533 13563945 13597750 13138718 12944199 12786883 12469207 12395898 11968906 11655493
14145 11655493 11663651 11382168 11219490 11055976 10789596 10571430 10660364 10421450 10677695 10509900
14135 10509900 10007235 9853980 9729783 9626966 9433929 9217712 9185807 9076405 8642226
14126 8642226 8908506 8609524 8550760 8849254 8195151 8065128 8013050 8290493 7876559 7815010
14116 7815010 7916426 7789894 7114178 7426877 7598639 7280085 7172450 7213974 6699691 7148312
14106 7148312 6725570 7053587 6638142 6479980 6366638 6268313 6262671 6271173 6256765 5825057
14096 5825057 6068185 5922011 5813118 6112006 5802844 5521532 5766490 5307256 5248632 5619132
14086 5619132 5388506 5292536 5184057 5122575 5167324 5393580 4945101 5115370 5016005 4718534
14076 4718534 5157907 4729275 4406821 4500036 4949255 4883844 4759152 4236316 4375263 4510715
14066 4510715 4319755 4487193 4337498 4182414 4141554 4281420 4011455 4269677 4239382 4165987
14056 4165987 3965702 4099662 3645739 4066448 3629813 3679038 3638064 3813459 3802610 3568305
14046 3568305 3691942 3527632 3183475 3530643 3201252 3524663 3265974 3282494 3493782 3216938
14036 3216938 3127979 3312520 2978766 3340987 3222932 3135691 3156488 3223397 3180988 2841714
14026 2841714 3064612 2744487 2724812 2405782 2853052 2856388 2766710 2704202 2618672 3013271
14016 3013271 2558788 2467728 2637632 2431724 2728301 2752998 2727392 2147972 2620729 2351768
14006 2351768 2495554 2285237 2606610 2317504 2493627 2451696 2440095 2338850 2675061 2624186
13996 2624186 2596121 2804905 2864724 3107521 3352286 3824068 4136642 5278009 7167945
13987 7167945 13277679 23603907 33863597 21899058 13910357 9218831 7075200 5321531
13979 5321531 5071333 4305190 4284083 3898784 3665442 3670600 3292378 3225741 2831855 2987667
13969 2987667 3108204 2826639 2712984 2695506 2734093 2190156 2413997 2125749 2303734 2419243
13959 2419243 2464157 2422974 2183862 2142933 2221688 2351593 2384372 2422492 1755924 2208571
13949 2208571 2058026 2019971 1854017 2129305 1806791 1893044 2071141 2015963 1416679 1864102
13939 1864102 1839496 1575403 1794552 1982093 2082768 2012172 1979023 1781583 1661027 1828336
13929 1828336 1698280 1607263 1675792 1364680 1558603 1856102 1974159 1623374 1653797 1936407
13919 1936407 1599745 1484169 1873631 1527069 1354056 1437418 1544263 1439835 1334385 1569983
13909 1569983 1547238 1751791 1075159 1193650 1693301 1690243 1477570 1500668 1471444 1299195
13899 1299195 969163 1164643 1161844 1400407 1308310 1507636 1153590 875301 1201546 1074505
13889 1074505 1218113 1321396 1065210 1270186 1346369 1206258 1234679 1261168 1141552 889976
13879 889976 1316923 1342829 1136944 1325419 1183857 1391098 1136502 1145138 1162901 666757
13869 666757 1009999 1202978 858324 1148795 1055100 1394081 1094358 1095052 1120672 1218539 1145425
13858 1145425 905884 1019307 1141170 937759 846921 864993 869702 1014023 1211721 1011628
13848 1011628 946648 1243104 820436 1007055 956302 1022423 1144584 1032665 978681 1099648
13838 1099648 653594 839858 1024808 796070 1104836 827566 1161999 1169150 968207 1123661
13828 1123661 913778 912959 824406 848142 816803 995331 715681 1121522 544073 591972 825726
13817 825726 927573 964163 658285 908039 862959 1027828 1029180 720642 776714 990930
13807 990930 1103181 622551 556362 1082610 975566 975695 599841 775306 848749 726041
13797 726041 782077 927588 895071 889525 735113 672530 434843 947005 492819 1020143
13787 1020143 807953 695587 1029272 853052 712945 814286 695306 770394 1180116 612389
13777 612389 821394 680105 444239 484540 780640 544734 685481 670544 940081 958670
13767 958670 849610 739045 671167 960391 685116 782183 872664 729689 692807 1164926
13757 1164926 650888 761332 744815 469803 570411 522299 1010793 792675 965194 493690
13747 493690 581864 717736 753648 461113 470214 443740 773230 680306 354669 578307 461141
13736 461141 703755 647556 894789 724364 472947 541095 478119 716817 640749 896935
13726 896935 441207 548886 631423 393908 373800 409939 529638 817407 897613 540791
13716 540791 423882 337380 734460 859462 364495 633205 483915 748261 172348 518872
13706 518872 698602 681255 760320 432319 420175 508918 461193 202740 513882 389893
13696 389893 417379 111747 408373 647213 531292 468579 561351 625003 190012 553076
13686 553076 500837 570215 581224 475421 556270 460440 877690 554302 457408 62968 595085
13675 595085 628491 325472 441138 244899 553934 528319 428881 463918 278575 139259
13664 450966 570544 241108 360602 176959 517338 640372 476406 614196 330837 302514
13654 302514 380437 517797 306028 654491 436715 225413 492309 361367 475784 591826
13644 591826 65065 443212 548410 548838 725748 724526 190346 310036 323963 301579 294251
13633 294251 564064 442119 499007 598749 486123 295452 232592 522022 348967 653724
13623 653724 216761 164084 578535 555345 642096 648164 489716 490451 443036 354358 71672
13611 292708 459493 653767 201318 289343 531393 273287 602902 440623 288806 538703
13601 538703 223240 321387 384755 223601 373997 349132 169487 341728 156400 239443
13591 239443 351087 66555 279545 252991 554244 168068 102294 352229 296467 -35909
13580 273418 214271 417622 258648 548195 157220 195531 427399 446473 590760 334930
13570 334930 278342 469543 413944 352198 617109 436695 342445 283099 383931 348126 26857
13558 92991 359940 630622 358957 324452 379151 180421 320626 414021 366110 334651 499615
13547 499615 464796 528353 431594 271465 224163 56844 513565 92057 192151 426373 326747
13536 326747 560180 80084 493110 351326 456957 539481 590374 182015 482538 -90935
13525 489158 460048 291288 204939 322185 288383 130270 194782 328117 161542 155620 386944
13514 386944 310100 521000 313188 67161 263939 321432 295432 583547 -42067 408689
13503 155395 145438 147892 305056 271184 1071 206426 580969 497003 238778 90726 494255
13492 494255 231622 284778 26369 363459 99611 -108742 148455 143538 168139 286426 572913
13481 572913 142862 523635 351102 92308 49638 126485 281773 211455 204825 129523 367892
13470 367892 206174 313320 118284 351147 236128 -30312 161068 20413 -172952 174863
13459 132899 -72376 425534 441217 390867 347199 227524 227630 251041 598883 42778 271025
13448 271025 424022 242475 43664 150912 491146 429473 201635 137077 305115 27890
13437 -58750 290814 307276 -26321 453852 205025 409782 179696 13513 172283 307385
13427 307385 124326 -342923 408824 -93159 248304 -36955 83042 191983 411991 65472
13416 123851 72878 86073 301859 210821 -60293 155978 197398 112303 298464 108549 358090
13405 358090 -91280 235341 -140900 130488 445859 409847 269825 235924 236419 360216 737388
13394 737388 508207 134630 185252 210204 148405 231608 292951 203734 112513 213917 217038
13383 217038 292268 344126 -28298 200824 45519 -190274 94148 283915 217965 351545 457377
13372 457377 -125930 35086 481792 94290 743662 361148 239795 278435 87580 52088
13362 52088 404845 211769 311889 76373 526206 131138 217055 293089 75168 -29632 189488
13350 213263 408329 214923 93049 254426 359219 42354 435612 -23303 229932 329636
13340 329636 206915 349976 99705 327360 189302 157695 76048 243400 364832 47574
13329 139203 -40356 161351 295130 185340 281385 -21463 -90258 135311 361949 116921
13318 70850 -195835 390937 -15522 271963 249807 200049 304567 125884 160676 -70621 276634
13306 2012 234231 139053 105649 344474 154617 136840 581034 374145 135890 -89819 41320
13294 -44183 202135 136498 254813 184795 -90161 151955 204060 193231 49765 -61210 231663
13282 165969 231538 253456 126878 274762 -145259 101592 223706 409099 11613 25196
13272 25196 21334 152025 68263 -264172 271855 34543 99789 -28933 -64062 140521 -277479
13260 362631 -20074 95865 226621 -6943 133876 18696 -129496 173336 204470 36358 321505
13249 321505 87681 22176 42373 144890 -65841 351929 -28850 47132 296788 309481 248122
13238 248122 186026 -161095 92852 -51194 440039 116434 294160 255589 110997 147911
13228 147911 167374 207714 21404 311929 389924 50379 137755 170566 65221 440017 80726
13216 -106215 211900 121576 -107392 114033 207760 151152 268838 -115995 62580 120750
13206 120750 -180364 144713 -18104 87438 -359019 139493 -14365 157223 104064 222658
13196 222658 129431 -54875 62480 49264 253925 69633 -83251 130362 134202 161173 154086
13185 154086 161229 -202920 287930 213568 -121809 190210 42660 -83196 229014 151027 -1861
13173 258513 201814 407252 147357 -135391 201290 222986 308026 75499 -86001 21841 7347
13161 364583 -101515 60760 317893 -231000 40189 -222986 219466 134852 41697 -165030
13150 90087 28267 146030 123440 42395 82459 353577 -42222 -50679 83963 126861 -23496
13138 193147 416339 108996 71771 122058 50111 87958 1801 -20779 182138 -20974 -156891
13127 -156891 109882 101762 264586 396321 233251 401156 -12977 147772 325658 -85603
13116 274565 -607771 -112786 396845 44877 10136 301580 -264595 3356 -41710 320191
13105 32156 212516 -159034 2022 237321 -182327 -91267 174614 179171 -110186 73660 144673
13094 144673 223209 -27726 -17334 -276756 84106 162756 -141716 226770 -150649 144147
13083 166783 -118912 -251101 510478 175376 -41263 -139620 -17187 100305 334279 421116
13073 421116 -216144 178971 -77970 169140 -22095 -22568 225557 33612 162221 48142 -273803
13061 337919 -147047 -175108 257163 265630 38020 237185 70225 -89926 162002 -123221 450981
13049 118590 291595 235453 203161 -181426 -38131 129068 62879 213674 28592 18433 235819
13038 235819 71255 474881 51077 274598 77958 164602 90547 163641 448199 142509 359008
13027 359008 204813 214449 91288 -288471 -25369 59294 -1132 216860 -135662 78545 280243
13016 280243 285780 -43371 -92049 50462 318750 417816 77900 -25974 4678 78032 28094 -246143
13003 66372 314076 -233959 126157 22691 -20924 324618 165609 -95121 58364 -90287 -270253
12992 -270253 301974 930 208959 128126 45860 306247 161231 30599 -291590 -138977 213490
12980 455888 70436 -118945 251428 354098 -86718 152458 -296514 -18037 139974 -118924
12969 302815 225847 22316 -62840 -5608 -119132 -200226 -107957 -11376 155753 381156 148799
12957 252925 -116067 -185539 109231 -172826 77410 -152706 -23523 108953 -385075 429451
12946 277390 -284638 168134 46426 240341 318862 244391 -217501 197597 202828 162295 -72718
12934 134763 373026 -47533 57701 239130 6540 282232 90388 302959 254004 81135 208349
12923 208349 137158 52851 -112741 -41908 90132 -90655 -93702 95376 127991 46335 246430
12912 246430 -77690 -94457 162209 -3606 -241175 -53590 241409 -250907 116918 243827
12902 243827 130995 165352 -52038 41586 65680 305292 61238 241606 294063 209415 439519
12891 439519 190514 -80901 56688 -114125 24408 -118436 421135 -80653 -127166 59101 -21417
12879 -141064 314968 393503 176689 -258138 192794 78707 -213939 59666 -20564 -20904 -38747
12868 -38747 -47789 51367 8332 76425 46870 84084 -33670 84303 29121 44673 328734 -52971
12855 -145743 -251604 -52134 -305284 -91862 139182 177412 31827 94796 -131984 131728
12844 270112 -57665 -230590 84507 454659 -37111 381871 39929 -89310 398956 -22324 205350
12832 253556 -171521 -5895 273634 33845 88414 -116973 66935 -8762 -128769 254480 196440
12821 196440 -138195 115138 40020 84202 167793 219027 96059 133613 -72314 -182822 -90644
12809 48451 -85543 5032 -195486 253867 144706 -128245 -209222 -350658 -43384 -200760 170764
12797 9920 137433 83198 -275948 68067 -217749 11459 61431 -167846 81108 292644 344291
12786 344291 -32424 -245039 242809 299996 147308 -224632 -97458 41387 40157 -50419 -158066
12775 -158066 207501 377857 119644 44661 -171529 -119353 97506 26284 -259797 78009
12764 -193149 -218012 -160834 166656 -161530 166535 -137364 -11801 79775 -32642 -8406 148026
12752 -49940 167228 -217326 -84351 39942 -324199 222995 117118 -216238 74606 -113352
12741 98789 -27181 -334 394261 -112034 -44969 311776 -261891 142704 208318 65210 208745
12730 208745 -789 89475 -29531 233934 116254 -76039 -154831 -82450 -89172 -41067 -107801 -103445
12718 -103445 269989 -78559 -23841 -167910 35600 -8350 25224 -67070 38204 428804 -17083
12706 282754 -2067 247095 90828 113486 91314 90614 97162 343607 77775 274627 -218668
12694 203528 -123666 134131 -47655 63833 -125638 264636 158295 -130389 25730 347971
12684 347971 101762 -145029 40033 81014 199562 -60816 213942 50794 45317 65611 345901
12673 345901 -107718 429132 93815 39679 -147057 53289 -107663 181538 279314 99801
12662 -118538 -168512 213115 139722 -76676 -56582 85619 34513 258921 4200 -307265 122853
12650 78057 -136819 104082 141435 18062 -211366 262611 -85908 46020 211460 240767 141156
12639 141156 -6386 -161510 22242 11387 -23456 -111193 134553 334430 -114636 -35713 103205
12627 -44837 96561 -126441 325749 240165 382732 330672 88572 51345 54709 -332127 -144460
12615 55692 173101 160932 -8613 -21142 27539 119552 -142839 53454 13745 96724 -201724
12603 -113317 102933 -43898 -137996 34768 -170285 230480 246610 163402 58139 113274 213280
12592 213280 25932 -63422 204719 150905 187071 286192 -62871 -66559 288717 206420 124556
12581 124556 -41307 210658 24899 218399 178681 244905 303870 72844 -96617 -193302 -23048
12569 178209 -268239 -17133 -223524 3542 -164189 75891 -75434 105248 243345 166840 -181
12557 259500 -464848 -124626 26802 49211 260593 151521 -159669 -230302 10904 54958
12547 54958 -78135 -246651 128390 90607 268736 268052 -111968 136651 -72512 -20245 -13760
12536 -13760 -195967 -85643 103926 -47381 373714 239584 -23297 -1947 129934 -8838 204103
12524 218235 -85574 131861 67934 11554 30777 159786 112375 11135 -125697 -353932 -16927
12512 -186044 -242220 127436 206517 28793 8955 -54728 -26603 69999 191327 -137802 -107892
12501 -107892 -36233 57302 -120211 -42070 -17818 -74965 61868 26855 318079 242811 45548
12489 -64339 200124 155834 -159099 -27080 89347 -233924 411002 -157943 -27729 -10558 -15765
12478 -15765 237030 -381661 -240407 -424 315981 33880 -94771 178647 63004 -214350 130310
12466 -124311 242969 46142 -15295 46824 -232684 49963 136009 80606 76671 141013 -41842
12454 137936 153303 -293880 -118596 24439 111624 -125605 209854 168927 -162850 33022
12443 -231290 114446 -6549 309554 -170658 13536 -192538 254941 180792 103844 184540 229804
12432 229804 -9053 -69039 -273557 -108372 59955 342936 -102497 9787 -268035 41617 -145883
12420 240378 -185263 -359876 -318378 -178988 204374 131882 -222503 -151450 215401 -132907
12409 -30599 43678 120844 -184171 12176 -95283 -158597 -77870 -95978 -185597 -150445 -345455
12398 -345455 195092 -78086 119070 -10427 -483260 -95855 50676 -407384 9028 155030 255646
12387 255646 34216 57950 245921 -70046 -53808 108546 73156 -125656 49355 123849 -43229
12375 -55908 -180887 -317221 27503 -53768 -110203 -8819 -74508 126254 253776 -139168 85875
12363 -168105 50467 154951 -7781 -201081 86138 100476 52318 232656 164373 -208158 -38393
12351 167797 -207724 -61784 132554 99404 -263749 -10050 -84767 -270551 44245 -226534
12340 162847 -222168 17239 21036 111591 18369 193636 -34915 54378 -114537 168216 -32947
12328 -279795 -118593 -46598 -132422 135265 -212397 -164595 -30044 141908 -62318 156056
12317 -49948 154591 8711 -10472 229435 253954 -98725 192116 -66901 -119538 178073 -218592
12305 109716 179976 -16780 102019 68096 35878 -120680 -321240 115875 12184 118125
12295 118125 -35882 158364 125182 -103845 -57873 70929 125020 -105895 138406 269753
12285 269753 6312 142650 -234763 225228 64774 -9318 359129 -35699 65214 -37674 383349
12273 134592 72017 -208843 277595 269789 81286 34663 -136827 -39585 137466 259661 -69755
12261 -42406 376094 79691 248349 -139859 53508 282519 288528 256955 109190 -16258 -156053
12250 -156053 134593 80703 141028 213319 -426714 171606 24062 260502 150612 9488 -257803
12238 333947 101816 257847 -164885 5584 97345 -44047 -89358 17166 134993 189929 294002
12227 294002 -68010 54432 128713 253991 90068 128197 243716 305679 -205214 442155 -22130
12215 308076 69756 358197 -28029 -1760 -17570 174029 247886 76755 143478 62161 483800
12204 483800 222763 -4426 216450 18974 93645 54795 49859 -12713 109419 189889 316932
12193 316932 184313 -143362 326850 -20735 179929 211759 87084 -311500 253054 146813
12183 146813 -137547 338363 286554 97359 67593 177475 94654 -60067 -119528 -127122 91900
12171 596 197172 -171251 -28881 82201 277914 -60408 116365 -59979 -81717 233954 64214
12159 403245 -176586 164269 234084 202517 197634 82158 145883 -85813 150249 -168154 -82763
12147 25063 366027 77730 -69394 327758 -72038 213659 18187 -40268 166941 236657 -36557
12135 95519 114231 107767 -1116 -52608 209229 -38333 135817 160779 -122070 173587 174932
12124 174932 -151481 -101461 81321 14769 51346 37031 -15596 -59835 161617 16722 82108
12113 82108 22474 349712 -68455 -227712 -37959 321942 33837 -180506 -288136 268376
12102 131279 -68079 372056 -317655 57212 -102690 -59139 19713 219030 -50023 -41778 -107916
12091 -107916 -146429 37644 -162660 187147 85661 99865 -121335 240272 -56144 -73851 26030
12079 98210 -6924 369460 535712 1075765 1172533 248488 258245 188571 -75088 125329 60275
12067 -208687 36488 -243933 57806 137287 191964 77960 301998 74334 47635 -64560 -137428
12056 -137428 256862 158541 -172238 -109073 -15708 116935 -129563 -293717 10331 8871 76481
12045 76481 24916 272778 -273185 283649 -38751 -39554 104647 21078 -42983 3723 322997
12034 322997 41118 44349 -394021 10528 -58348 117534 -222271 -14085 192661 -111036 -72913
12023 -72913 -144882 73718 8901 117075 -69621 119473 13321 308287 -223625 292347 198874
12012 198874 167760 307767 -49635 -6334 100322 -116102 -37331 275867 -43830 -178404 240841
12000 138038 149066 -490953 117339 76766 180383 20301 102332 307144 62714 -252728
11989 -7294 -335305 -103563 -279647 64333 -157572 -69496 -230942 -287875 146814 6135 21666
11978 21666 -11881 123149 -81649 72793 -193123 -161191 102456 -134200 -38643 -107073 -56451
11967 -56451 -375454 -209970 -213902 6021 -187600 277967 -8695 -56652 37817 -90461 -254594
11956 -254594 68490 -167280 -135831 55478 -138602 -99747 -283814 208672 -268746 59279
11945 230916 -280045 -30865 58848 -274447 11174 -32166 -110920 -62339 -90091 42984 59322
11934 59322 329236 -41608 23270 66336 8395 -176790 -189910 -197744 -11851 -114664 147021
11922 210254 81075 152335 -107736 8262 58906 268259 226242 173694 -456223 115164 -54576
11910 19650 109804 -205584 20247 302683 -77717 -109080 -62771 -227371 187006 -214571 185796
11898 -281372 -141785 -156118 -185981 25430 212812 -74069 -392523 -183769 -99057 -291975
11888 -291975 -58275 -110619 31707 -119487 130590 27083 -279230 121541 336932 -138946
11877 -12374 -177879 25914 -101583 68331 -183236 -4818 108022 222229 -99851 -48032 98096
11865 14973 -151543 93973 372630 -80911 -282704 64366 118458 167555 -295822 -198401 52979
11853 173246 41282 -42751 -2827 380884 25955 -83479 -131970 -26118 -357891 126277 22712
11841 -90249 112222 9692 -42358 76216 -209839 -21494 147501 -87883 -80628 150039 59523
11829 -11108 -170827 109455 -312339 -167662 260535 -4363 130915 177723 -188496 34387
11818 -144773 -1475 -30062 -244949 162298 -81039 -92568 198724 49167 56794 120442 77581
11807 77581 -305643 -24295 -296928 142030 -50590 -83872 -302234 -188141 -118316 5641 -361620
11795 -18958 136650 -163108 20997 64393 266787 -109531 -169151 -17504 -22791 125173 157800
11784 157800 -17011 252603 -166381 -152355 184877 158441 142321 239521 95026 -26374 121043
11772 494787 -292511 -174674 173182 -85032 71383 200142 47551 -115518 -52611 -209887
11762 -209887 -147159 3811 -13136 12491 89053 36119 -52208 53896 120425 -313297 294646
11750 29520 -217566 -404310 -127741 -175154 127923 199893 112632 -231039 178386 70851
11739 101471 121816 -239396 17195 277456 58990 -215063 9634 185633 -190762 -241478 -92502
11727 435022 -153121 -152416 15090 -173131 -129918 -73912 336989 131988 -400558 -32009 136787
11715 -63092 74668 -298615 -176871 72179 -11830 -88055 106703 -142806 -35629 -71775 44091
11703 37738 154998 142309 114719 -275986 97539 95256 -142756 -28596 -118043 83667 153902
11692 153902 220687 -189369 -239278 127347 13545 165720 -169532 247346 209485 210820 372657
11681 372657 -90509 -148303 79181 230625 346018 -121558 98894 -70148 -216169 -386 129939
11669 111157 148545 -46503 152330 69331 -330189 156026 99479 -31236 153184 -350757
11658 -37370 -248136 65905 -52498 -44357 -112216 179159 -176532 -38240 -27877 117687 45452
11646 43404 181674 318602 -40345 81067 38373 143004 3239 -46501 151858 -163480 -74857
11634 138383 42607 59175 197323 51136 -127984 -58030 -76195 -43975 447221 41412 -233975
11622 257800 127583 92725 -43505 -115494 126541 48540 51862 -16709 9120 158798 -73685
11610 56775 -10516 121094 459264 384751 -171921 -44359 -1699 155162 -191771 -49612 -23203
11598 123480 484228 -50261 190445 -54304 203348 -204531 -145324 68182 87741 129823 -76198
11586 85189 151527 -73764 76985 -29644 279407 63034 214480 49363 161374 200407 -357776
11574 -92883 -7348 163944 354858 -59356 295650 126511 50441 31931 236188 -256067 -263938
11563 -263938 222701 -185671 -256194 -20816 281718 193628 336927 283452 -27498 -55224 -229781
11552 -229781 -218116 204116 134506 -172867 151899 194406 14655 -142440 107100 74346
11542 74346 36623 468235 30239 90838 -99076 -137576 218599 -101765 66482 136158 -75336
11530 -80483 171601 -95421 83099 171513 213601 -162021 -71797 -212924 244377 113770 -185849
11518 199718 65370 47326 42764 194168 -130278 -79408 72189 201048 155997 119405 343775
11507 343775 355511 41695 203376 218068 -101232 -13149 -111948 78446 -113210 180196 369157
11496 369157 326460 229256 -11793 559461 -40757 -73299 266175 69869 70639 -29107 64169
11484 -133729 236567 -99697 116114 182609 160784 310563 77952 237433 29845 43856 144340
11473 144340 290465 120513 561435 62380 51868 181752 115395 32764 186837 177147 45592
11461 238108 20427 212777 -22901 241368 216970 229892 304607 -22249 -9003 367462 211662
11450 211662 -22539 362683 15558 221507 -240104 118187 -54294 -39413 -204314 -174141
11440 -174141 166312 -195018 -145419 39856 -164680 -123044 11295 40379 114904 6046 354807
11429 354807 111720 67075 46173 110091 327962 272398 -90652 24917 49098 15828 -82344
11417 58429 -248970 174511 163030 294382 31046 -128068 165183 312884 -107728 257759
11406 54138 -172363 -131291 256750 15193 285464 -151205 475585 225717 -209271 168540
11395 133339 -5856 -456583 160999 -26500 118369 -60114 89863 68497 27367 129854 -55260
11383 96284 8779 -49949 133158 -130755 -44210 -151665 -53173 122547 -71446 -91859 -66634
11372 -66634 62329 306957 63450 52482 32013 199036 -26957 -217353 21313 76344 -94967
11360 -231507 -51432 34124 -232866 6473 -85427 -26844 121420 297830 -122837 -79077 -19697
11348 106820 -56470 303203 -54980 88085 251548 93143 -125875 -29155 96532 -93354 -157145
11337 -157145 -123329 -137649 -438600 -13145 76874 -173207 -98714 -25027 65387 -80753 24157
11325 148045 -421655 74160 141611 -425655 273483 -167283 -259598 286611 242153 259382
11315 259382 -9050 344214 229497 -5317 202973 -168078 -75203 -319346 55672 -57357 -209976
11304 -209976 113645 -89179 -116044 -13819 9671 -438821 -59745 -13489 125815 -309836 -158529
11293 -158529 104912 -255302 -158672 -15523 -111485 -229476 238458 125962 -60667 103293
11282 -518533 -101628 -222505 3852 -454187 -5053 190378 -104009 -97016 178664 159778 213653
11271 213653 -117178 154266 304841 -64278 -189984 -32464 -174 -56606 -321190 -214271 -10518
11259 199093 2373 -262149 -240530 -95536 -16044 -88187 157178 96651 250188 -72532 -196819
11248 -196819 288778 95651 -42276 200692 93469 -156220 -299375 46510 -250705 403574
11237 -6822 18669 -30924 185706 -9935 -303684 53065 -203828 -151179 151305 -357184 31988
11225 51266 61402 14336 -90620 -152747 -130411 177335 -45626 204615 162397 -159457 45975
11213 5335 -63252 139981 -105326 -220257 -72911 31570 -47426 -19195 -91306 -56412 -34746
11202 -34746 -14100 239279 -60537 94875 -327667 -240959 -61064 144189 132598 -121846 314778
11190 -263428 99518 -154255 -272143 211277 62537 -81092 -219912 -294761 43128 -22487 -80144
11179 -80144 -397948 -107467 -115912 -59687 -249756 39721 -190804 -34935 -24722 -164652 -236285
11168 -236285 203217 61383 -519091 47357 -55245 -68897 -126855 26634 -8967 -90662 119023
11156 -162616 -78063 -95282 -130 -200178 14489 -132197 46975 -280489 63497 -209264 272990
11144 -42079 -182431 23475 280425 -30642 -210524 222433 -65282 10888 -137572 48251 -229939
11132 42076 67407 39391 143487 229290 139757 150809 -27262 154483 50693 30626 -350203
11120 165843 39468 -49406 140177 158798 9936 223380 399182 -251357 306011 -20304 98760
11108 -177342 137753 416243 520660 113540 132145 108610 -44260 403805 8617 33557 2814
11096 444433 141932 96010 406773 104714 145092 293199 45017 77991 171870 337250
11086 337250 148597 257648 388494 240148 340669 -172589 -219976 110176 107965 -60254
11075 -63039 339571 476059 217924 485879 264657 235728 404096 66981 129275 258622
11065 258622 667759 264921 640503 436480 511198 202546 712488 478681 581028 709068
11055 709068 760767 632100 430886 455446 357322 595097 683351 413354 804110 516300
11045 516300 955743 758591 426555 763400 593039 898115 475559 401071 351158 891335
11035 891335 441089 788654 598806 557287 358123 334842 753385 418501 543565 351327
11025 351327 537110 589492 566943 610667 538563 351510 698199 853678 472603 422602
11015 422602 505321 714700 462445 567518 385175 438189 414161 435726 387082 806924
11005 806924 356014 511185 594128 490785 815956 694638 435418 774142 912263 634600
10995 634600 649707 736029 539998 650415 506149 397678 791531 890842 816918 862822
10985 862822 1261219 1188527 1391929 818884 1192631 946065 1566050 1287376 1691341 1688980
10975 1688980 2192772 2182253 2055466 2496310 2319626 2391089 2210966 1791090 1934230 2158816
10965 2158816 1744915 1755588 1646951 1688230 1617775 1182539 1626536 1398350 1992190 1469677
10955 1469677 1789622 1400694 1550893 1044320 1084277 716278 455033 940809 349045 585118
10945 585118 562099 320674 486006 88129 290945 259959 357409 107074 607181 509561
10935 509561 -108395 230001 79162 409301 331933 245226 -88172 108168 74025 282766
10925 282766 51371 -67435 94905 124628 20981 166922 207662 206086 20256 -60657 176427
10913 126299 -165229 171821 -223601 222690 192214 -444642 186500 202797 8986 14526 -260490
10901 -281171 40102 100399 63163 -36356 14108 -14958 -48281 -112784 -116701 85542 -117260
10889 -109756 -168383 -63182 -469095 -178054 86106 -167765 -93402 -449165 -126212 -10823
10878 -120948 -59979 101412 169359 32283 -294524 -15934 -37383 61914 -113695 -80931 86622
10866 -72328 24830 -152566 135534 294286 -83801 -152162 -189921 17858 -206901 272530 281110
10855 281110 -91337 -94840 15673 -360025 275781 -22036 58204 273288 74939 -197123 -58338
10843 -93924 -64904 70745 257349 4303 183665 166444 171259 -51620 -79288 -94422 15065 -99787
10830 368666 189070 -247414 53409 129896 413044 -236012 -124999 -122791 134589 -67760
10819 -95805 -184631 233574 39379 53381 -76459 -264307 -308379 2862 218438 -150951 -128682
10808 -128682 -76571 241897 -390893 98267 -276566 278098 -123655 -76361 29163 -119912
10797 -63183 -394580 -73956 -362869 -245365 308321 -107528 -29391 12869 -78142 -29528 183001
10785 -357814 91120 -174896 183208 -31483 -457828 -54698 23380 275347 15838 -33641 -150917
10774 -150917 -48453 220851 -131698 -223390 76119 138318 68821 -62404 -203150 113333 141080
10763 141080 -135610 -189429 -258419 -80388 -95432 31666 -197441 27902 119424 -179605 198949
10751 7400 -369467 -218541 -253706 -43490 -130789 -14350 -408388 -94443 -286944 -119126 -223650
10740 -223650 5563 86343 14335 -79202 139646 -81083 -245533 167083 34965 -282711 46568
10728 -101673 129684 -22934 201443 -298425 -74258 -276377 -260275 -76242 -9008 252285 -125707
10716 -311817 228783 293210 56173 72548 -23327 121325 192758 -160371 -94468 -80167 16537
10704 -35889 84812 100667 -17164 -203973 175284 -237329 -21446 -46826 61558 138670 202171
10693 202171 -163413 -186299 205472 16470 -71260 -156271 106093 -39554 368148 -314736
10682 -18003 -205244 230232 -171298 87857 200564 -178689 260422 -138267 -103782 152692
10671 23384 20731 310441 -49203 31018 -144165 -124396 -519652 -231242 165195 -94304 -19231
10659 -2531 -364236 -67695 -357044 198235 3359 -233168 61054 -288585 -47028 -189295 33368
10647 42806 -283484 -63182 -159077 -85114 118167 160143 -469717 -163796 4011 98411 -299775
10635 -92956 -183994 11422 180472 -60590 -18487 -436689 -134065 78779 -81689 -44477 179311
10623 -216133 -59666 57854 381595 -82275 -52373 64233 -5363 -203674 265139 -110996 20810
10611 -104781 -94016 141597 -121625 127473 -335444 235449 -24119 -58365 66082 1007 156864
10600 156864 -288336 -147359 62247 57720 134139 -32106 140041 90984 3454 141646 -104206
10588 30584 -251100 28602 60769 -25886 -118532 19067 -325736 125454 -37397 269826 176225
10577 176225 -98608 104962 -222158 5597 -313568 -113561 -312018 -204087 -249320 87359
10566 -222524 -145657 -396293 164892 -104339 126842 -2759 -288576 -92790 -255278 175312
10555 -172565 -111289 -36680 -24542 217379 69035 22491 -64263 -374186 -132482 -347570 234016
10543 155077 -188054 -49416 175010 329999 -42001 -60651 188943 -376550 -369551 6812 -91069
10531 -334373 -46345 220523 123919 167981 272328 184018 -259921 33764 -238147 41725 87388
10520 87388 143298 -55126 -177564 -259851 -145118 79772 -32895 -51391 -193634 42443 -94021
10508 -179087 66462 101969 -87213 271873 -106279 -175018 3712 73396 -27578 -131745 -408765
10497 -408765 39875 -76735 154857 -138431 72113 91877 157731 20413 -27755 308347 52299
10485 68315 106566 200374 198429 304913 226059 327387 136726 169904 -133926 200578 185008
10474 185008 97657 13780 -151002 -80723 -92886 183910 -134854 29600 85054 58066 -157487
10462 -86249 107135 -126167 309121 234966 -107587 -180504 -202690 -174348 -96509 -130493 72868
10450 -150948 307093 81015 -43779 283462 55373 117400 241896 -16837 -26209 -49141 52406
10438 -61291 128815 -231807 -108549 -297401 110949 -99409 -51265 -133651 95699 96611 337784
10427 337784 -38620 91662 154574 -254101 -25447 -94565 139797 -32565 -32675 298525 13813
10415 215545 11363 -186965 130375 -97648 213671 -70788 -145677 43544 -3897 319436 223247
10404 223247 95387 -38291 87220 236824 -238575 86919 -208318 167075 97399 9346 37490
10393 37490 21854 -26439 -11025 246328 218621 -66890 -145519 -72158 30930 269272 132902
10381 21701 -32033 295902 114170 -159801 362502 376327 98368 74223 -759 280928 5942
10369 213017 14592 85875 194251 235362 188903 273428 192424 218611 387156 495832 226925
10357 247693 369141 350417 241867 148414 532803 385284 561175 508328 180174 519532
10347 519532 522831 592263 566351 134703 378788 195789 68336 423416 12943 9414 119460
10336 119460 44629 79346 77513 -164315 323623 -7306 -236838 235268 142037 -156565 -73975
10324 -61884 -40246 -279005 249633 -68588 157835 158222 385705 214945 94 314946 417316
10313 417316 187901 132806 21192 -61799 99732 398262 -29569 -253789 -173301 41608 -85489
10301 120897 293186 -82551 60081 -69288 -143196 92002 222928 -149133 -48105 76869 204340
10290 204340 -51716 76100 -14390 -19449 152095 -373346 -318908 8352 -138885 -183776 -93912
10279 -93912 -74123 -308107 235208 -50864 -53012 -17076 -98518 77344 -109608 93787 -130162
10267 -364425 21877 390784 -119178 52460 69266 -60304 -79674 281092 56883 238696 248564
10256 248564 617069 138276 -87233 141982 -120071 65077 240188 207589 -13875 89448
10245 -481685 47159 239437 -333373 -227362 -32684 -105271 44313 124083 -77166 26171 -197499
10233 -56304 -168504 -72665 7712 -235832 55408 419108 -174516 2626 -222275 -378156 -212877
10222 -212877 7582 -46066 -20694 -49809 113939 1216 224371 136926 -12097 -347403 205150
10210 -102733 25759 200740 -162470 324281 22332 404609 -120641 -39633 -55958 168659
10199 -220267 -115995 55727 -8520 87896 -257710 56008 -91066 51910 -152933 61060 -196688
10187 293196 -67305 -245036 -152304 315361 1820 -37824 88663 135591 66149 39880 -260263
10175 -5856 -33077 8856 -141634 -59085 -59524 -84755 120391 -150310 -60927 -289421 -42396 -100588
10163 -100588 138398 -232904 -42752 -34984 74101 86789 -94416 26633 14377 -293800 -15437
10151 234832 108397 159525 4488 -47500 -215837 -90981 37270 -181778 -252091 -151184 70637
10139 -94451 -234135 -150291 130729 -379283 58693 -180325 246310 -68496 22400 -47855 63261
10127 -187534 59548 -348401 156537 -131734 -150495 -333623 1104 -124474 -111592 97999 -58887
10115 -222398 -199364 -227620 -25876 34176 137706 -34335 292742 -15260 73229 -213935 -238124
10104 -238124 -256924 -159275 71795 -66897 -160967 -316974 -172559 -137376 -176419 -360157 -170970
10092 4665 -176514 -134278 12056 -28663 -147635 91629 -169041 -15606 42627 -56581 -71295
10081 -71295 -246839 -77500 -125304 -42978 -68799 -65884 -154305 134178 -187732 79104 -123018
10069 29334 151738 31185 -165411 166003 -72186 -363832 60133 -110969 4061 227383 -105294
10057 -118172 -251339 300760 -357271 -132720 66264 -47779 -308981 -149956 -220077 63583
10046 38280 -90001 -277745 -270538 7260 -186428 -172872 -203189 49747 432864 -195461 -73569
10034 69011 155269 143926 -153179 -169041 190055 -153740 -98233 205473 -370471 -208557
10024 -208557 53209 -140258 58459 -376945 -87350 -5452 -84507 -395765 40432 254995 -87370
10012 -333287 162147 -207215 -49358 -172215 243802 208995 -281124 -233489 -147577 -296764
10002 -296764 -136302 38581 -129790 97730 -11999 10214 79546 -162522 -303512 -173872
9992 -173872 -135147 -45179 67063 -77444 179294 18244 136528 274043 -79146 -55713 -294388
9981 -294388 -169657 -502736 -173928 90468 -77685 -168790 22787 204148 -258586 -264073 86409
9969 -104867 73898 -248979 -76966 -33971 -67493 3616 -306533 33924 -20005 -214297 -64933
9957 1283 272856 158137 -133074 122815 -161089 -22706 -152766 -133287 -112786 -64624 18498
9945 -330478 1637 102444 -31468 29623 76729 -154173 -32811 32993 53923 -154143 -104548
9934 -104548 -209008 -126924 -69914 -103081 105913 21847 66808 -243740 -59328 -247772 -191522
9923 -191522 -51263 -168555 -111113 -97390 20303 -91570 -191615 -275695 -161481 -166918 -91365
9912 -91365 -242406 -86812 12847 -54924 -18375 -222596 -80842 -71665 -120659 -380065 150924
9900 56609 -49892 -123426 -347411 1948 -182096 14686 -325389 -95708 208643 141042 324505
9889 324505 -21667 -210335 -273000 -377693 -158844 -94504 22746 -164127 -62101 88095 149116
9878 149116 48910 31567 -57057 -52363 196057 110084 70562 -61740 -96635 260964 -187520
9866 -160485 -129992 83574 -60252 -563 165144 -495138 -179225 -224321 -196567 -301349 -23883
9854 183200 23666 -174333 -5773 -19956 37227 183982 -268273 -58421 -117195 -90021 -177755
9843 -177755 -208191 7238 -119746 32463 110376 -228326 3313 -54197 43711 140191 -79840 440252
9830 -318378 159339 -202530 -459876 21256 -306718 220259 74569 -77094 -185771 -290295
9820 -290295 88398 -170834 -193970 -79836 103355 10275 -37083 -407206 -189172 -131500 -203137
9809 -203137 -106728 63156 85963 108358 242837 -240091 -398488 280049 -342924 88087 67145
9798 67145 -318966 102155 90720 167327 -7797 27121 -304950 180809 7935 137639 -181308
9786 -8701 -214622 -333770 -70824 53886 228864 -232220 88438 49776 -177872 -208243 -123924
9775 -123924 -247027 -220066 -28186 -10879 -132055 26877 -235622 20677 -12807 46006 75087
9764 75087 -162134 -75319 -429515 39997 160513 -67843 -127087 10208 -103489 -158801 35318
9752 -332640 -75487 -160891 -234171 386845 241583 166184 -98294 33724 -47195 382421 -54540
9740 54321 -177297 -254519 -33606 -52987 -100211 6331 -31060 -70587 91218 -355817 178888
9728 72598 -29735 -387018 -5140 2485 126483 -259898 -126864 -88153 153288 44790 -97294
9716 -190040 -42648 -333520 -297813 -167295 258592 -116991 -52021 61781 -227671 -11860 -50129
9705 -50129 -239858 -268555 -209654 -70153 60091 21792 -238033 119197 31324 226844 -174871
9693 -139174 -321275 -48106 119026 90720 -261837 -212901 -175476 163373 112934 -126182 -95259
9682 -95259 78084 -44464 -182586 -356588 -172559 195899 -330040 6494 257574 125184 8462
9670 198451 55904 -89268 -30814 -362017 -22243 -170766 -75815 -12359 -156392 11418 -151118
9658 42463 231111 -204589 -260372 -49911 -112743 31995 -6919 78444 -117198 58228 -28031
9646 -45937 73845 6292 48117 -267826 -18262 56662 90429 -263228 -322579 -92388 122802
9634 282977 -127769 -388908 -75313 15823 -231462 -116445 40302 220880 -379699 -260237
9624 -260237 16023 -13591 -313059 -284805 6840 -28141 -253658 -213143 -175934 -69996 -68523 -3278
9611 61125 88897 -23732 -75503 13177 -138708 -342855 241174 6344 -161976 127328 -123466
9599 113376 245036 -161044 -122820 -153168 -113335 -162867 -486470 -319466 -112267 232514
9588 -258411 25332 -113834 224482 -69957 -191285 -24570 305068 -10286 -68987 -88201 -436133
9577 -436133 -8626 -326102 109415 48736 159463 -258723 -154569 285436 -149162 138959
9566 -109630 -412239 178088 -244316 244751 -3931 -130604 -107854 -298829 127104 -95618
9555 -290282 -144849 16421 191377 6800 -177477 65553 -49040 -68295 -174422 99850 -14715
9543 227244 -263635 -89719 -317330 -221005 -128654 -446487 -257587 -47254 -77300 -303149 -228894
9532 -228894 -432303 -49116 78719 -6878 -460231 120265 -307342 161600 -310483 -42517 24769
9520 23478 -194639 -239994 -31939 21357 -255418 -36275 -334358 82789 159844 104569 -157849
9508 -143570 -35941 -92183 -236021 260312 457732 -306121 -220818 117302 106710 -49121 -329151
9497 -329151 56963 -168007 211893 -90703 100165 188277 -125567 -281961 -17569 207160
9486 9335 -137929 42684 96832 89038 152421 -102656 320735 -172747 -130466 -86138 -57759
9475 -57759 -357027 252646 -288687 -10055 106557 4124 -365553 -443961 -57921 35281 -6949
9463 57544 156729 -86214 -61202 -316989 -193172 -136169 -185603 -19475 -221644 -256667 -194383
9452 -194383 -240369 -289221 -213972 -307221 -23074 270847 23521 -3189 92801 -103554 -388773
9441 -388773 344122 -85629 49115 157830 -224751 -193257 -167 -128301 79619 12453 -127098
9429 -118579 -217518 147532 -103354 -93425 -18465 -6510 -335676 152903 -212628 -87228 -61647
9418 -61647 149365 349111 46255 -4038 136298 -148574 -133616 -259357 121868 -84513 -96441
9407 -96441 -218930 -70615 -254070 -8165 -110402 -237863 63257 104241 84145 -17592 -115235
9396 -115235 110900 -524970 99544 131334 -319799 -255139 -351787 -145418 -30069 -349736 48349
9384 -79571 248826 97114 56934 6006 152149 -234899 -168573 -227398 73337 101099 248071
9373 248071 189623 134307 26932 -344393 53839 -88376 -434427 81495 5961 17099 264585
9362 264585 -230638 -342914 -30263 171530 -70917 -87991 -53572 -45162 -94504 -121795 107224
9350 -203935 -23802 -15793 -38960 -157462 122744 117890 -61591 -233872 -24018 -91921 -159834
9339 -159834 -67339 210709 -72962 105666 165903 15683 -176770 224547 -140995 170382
9328 10165 -136005 -5682 -38981 -424509 -83429 -318484 -21409 414770 -305651 -174028 178034
9316 -118907 175889 -47166 -109615 186981 17327 55656 151005 -197878 -89975 146520 38379
9304 67982 148018 -163043 89447 -148382 -211251 102307 75674 137283 94574 -278781 -420675
9293 -420675 -76121 205728 -130740 154249 -291444 -237941 134955 193371 -171201 -197087
9283 -197087 267018 -203707 363463 -162219 -172 17482 236131 -93020 -117100 167341 -216141
9271 -3853 -122852 96725 -185813 -134359 40221 -125920 -197135 48183 34864 -57742 29274
9259 -4073 92171 -131729 -247026 -158808 -67769 -58719 -9314 129080 -69308 -153660 -131538 25648
9246 -288356 -182243 -226286 80742 -159128 84185 -304093 241527 -24476 274747 -47128 195548
9234 -71081 141270 -47720 78669 122879 21159 -160162 93061 -273901 68305 249499 75985
9222 -12605 -316881 -108567 222007 59732 53635 -43122 152810 -194511 -285307 -108003 -231939
9211 -231939 248754 36758 -45099 23187 -31830 -176716 -66649 -126324 90935 35018 -59805
9199 85353 -118845 -74927 -220673 254033 76123 -32731 -203892 55682 -317458 -193192 -77607
9187 142405 -125018 159705 -178613 40062 -63127 -214064 -153434 -479868 156914 -314437
9176 -350469 -305226 -246270 -61911 -351702 -97858 -73930 181745 -144838 69403 -277338 -138690
9165 -138690 29154 -227191 -42946 -304768 -99447 281564 50868 -42829 -56016 166952 106593
9154 106593 -354988 4725 31885 -236755 -43145 -338947 82772 -135488 291815 17342 -33940
9142 -105466 -255106 -59262 14866 -205644 -142514 100512 -117595 -36083 45269 399229 164705
9130 -48702 -437955 399907 -424558 -59519 64405 -194067 141093 -136670 98757 39088 14220
9118 -229309 -423903 -447847 -36907 -191936 -61042 -171027 61547 -184647 -107311 -123649 -59490
9106 -310884 104971 -529678 -483558 -43054 -199615 -131008 63094 -59281 -336420 -50617 -203243
9095 -203243 -241499 -78082 93630 13962 -234967 -20643 -276082 80056 122748 -169403 -60057
9083 -153848 271620 22293 -103285 -180914 23556 39144 -352071 -85225 28465 -532931 -305016
9072 -305016 -226293 -232422 135128 69948 -93251 -226181 -48014 114937 123522 -171420 29813
9060 -434334 25784 68112 -103790 39578 188809 -37285 -166821 -3687 -146766 -78232 -142938
9049 -142938 176537 -37521 -108891 47856 -19916 -32082 88930 -37452 -41630 -218537 -42200
9037 79608 120773 -267822 92278 -319531 -332091 -284168 -8598 19387 19252 -79268 70500 76790
9025 76790 -183667 25692 -20350 11737 -79516 101300 -8431 37461 -305418 64259 -372088
9013 198137 118116 -268906 -120162 -11281 51848 15478 -277958 -118646 193482 91180 27822
9001 -389429 -20462 -22731 85755 3011 -38621 16676 218780 -141620 -118870 -112722 -148924 -174734
8989 -174734 -232620 -159919 -69803 -15912 -95801 -2734 336825 20361 -86772 51032 73222 68160
8977 68160 -183793 145849 -142952 -178788 141551 353842 67594 123997 37398 -20302 -45289
8966 -45289 172124 -23125 -23524 -221939 -207921 164797 -10439 -101895 240274 -72654 48457
8954 -104291 74243 -62200 376565 184800 -33272 193992 -252773 -103371 -1209 107595 148529
8943 148529 -141865 71179 43165 132257 5277 84370 313257 363 6472 288094 166641 75282
8930 95954 286164 425538 308526 644403 362391 1008222 1269437 3326425 7282508 7493662
8920 7493662 3198409 1706017 677579 324218 478754 321543 152909 300939 280319
8911 280319 252511 399222 265061 452671 265394 -43969 17056 15325 -16583 118856 -280965
8899 451792 -118841 30528 -24690 -85973 4536 -717 -28209 79556 28403 -106029 297813 46302
8886 -6219 -107679 104978 -259511 -20798 92657 61895 -9335 1754 -117803 -211649 -395628
8875 -395628 -93920 -196757 57655 -296284 -14761 347997 -173653 39230 -309494 -74505 25908
8863 -95214 -73666 -334248 212321 -40276 -140478 38610 -149323 -80615 4540 138706 -278307
8851 -114854 -188896 -296933 -81413 92883 26007 -526223 184930 88644 -89404 -268144 -116666
8839 -85380 -283613 -248076 -108028 190506 3501 64458 -88035 274 -183766 189035 182457 44529
8826 -75290 -55934 -137959 3277 198212 25575 134605 75618 -123031 42471 -331485 22741
8814 -214835 56812 -57223 55271 -225563 7500 -242057 -66511 -285271 34041 -71329 -194240
8803 -194240 -304272 2024 -241373 122782 -75501 62509 159237 33495 -158834 364810 290376
8792 290376 303540 -399302 -14192 101236 -480219 -24841 40680 -58628 -196058 22404 127063
8781 127063 -16606 23719 -301100 4380 -170934 -174545 -431766 -133226 141762 -77623 123638
8769 -42508 -94868 -360558 137160 -113304 77559 -165908 102227 -42605 -258427 -383787
8759 -383787 167551 -271990 -9416 -158617 49265 -156268 129268 -7982 -43034 127610 -6257
8747 -246659 462706 -149823 50362 -192035 194824 -107927 -314104 49086 196357 -409924
8736 -205692 -89533 -94572 -46183 21435 -93675 -131161 -47315 -201877 -68225 20967 -563172
8724 -56982 192460 -335717 -190787 -53682 220051 -111969 69775 -65703 -111794 245249 -21849
8712 -127633 -80748 -121294 -54403 -115366 -227825 -414936 -8355 -70178 -235387 -76590 209685
8700 -141321 -87870 222362 -186094 127259 101861 -116913 79273 -184184 59726 -133801
8689 -18715 38679 46310 -97237 -1936 216280 158014 -184168 105783 205538 -178786 -81520
8677 -237645 13838 -54245 23942 -75707 231089 -49840 -156045 -196715 882 229304 308508
8666 308508 10047 194889 -46178 -267641 92437 -115191 -35446 -115438 -61057 158785 -11027
8654 209772 82437 37490 -295259 414673 59791 -342230 26834 240615 -154982 78447 -51720
8642 -113960 -94314 31051 -214506 -223909 21924 -18512 -57296 63834 -67996 33057 -112682
8630 -25374 185235 110307 -74578 121399 -374582 -66970 -99320 -12088 -16956 -29025 30957
8618 -30820 221202 -142460 -292836 200821 174167 275573 96071 40985 -307482 162125
8607 -214139 83811 -162827 413212 -230973 30377 813 -137022 -184062 -22426 -93628 -73716
8596 -73716 5503 -147032 -77930 -156284 -133028 -91120 -389610 29734 -154648 -76853 -141960
8585 -141960 40700 -47341 -261889 246739 -240030 -112951 -201429 8402 52066 -168753 -139637
8574 -139637 -250830 195136 -24980 -180274 -436185 231654 15485 105030 170726 -552237
8563 -260946 96390 -56740 144589 107070 -54095 36671 -164617 102877 -317011 -172748 -48833
8551 254777 -52725 -225748 -278213 -113701 -77639 5457 -22441 69762 5954 -139900 -99362
8540 -99362 18326 -76175 -51460 318454 -219947 -37540 -28313 4258 -213076 -8010 102229 -131742
8527 -12639 -93235 -21699 215462 30980 57373 -32553 -15934 -108785 -307981 -21220 -37758
8516 -37758 -38052 79268 103405 -51245 -36880 63067 -243036 -182356 -293986 -32646 -188204 -7706
8503 30120 -179482 310751 -196513 199323 -164161 -44044 -125862 -137835 -277104 -146067
8493 -146067 -86290 -36425 -44332 -36453 -112291 -73611 -265467 -75423 -125388 -11672 80845 32821
8480 -74669 -184589 -51557 84490 -225084 -74837 323111 254071 101105 -2996 -28239 -143898
8469 -143898 174243 -84402 -7155 -56359 -230074 -206581 22400 -21913 -1566 268279 -7058 63934
8456 156364 -275087 5793 -167414 108714 188980 317001 -174249 107179 -34427 -275086
8446 -275086 -182609 -46273 238955 178474 123352 -102800 -4337 -366066 -56364 191570 -116608
8434 293487 -73814 265105 -65237 45607 -21281 -144400 -148101 -271787 -327718 -15885 -375687
8423 -375687 97846 236937 -289508 -340487 51162 56029 -28482 -422498 -276658 -259990 -317323
8412 -317323 -195343 6127 449 -234524 -96694 -110733 109909 -141257 -78432 -189139 -182798
8401 -182798 -316547 -36522 -53291 -94776 58556 -56679 -497912 86248 -111082 -231164 16508
8389 -181838 110702 -123227 71946 -119699 240195 -14077 -291610 -225859 -190073 -104374 26915
8377 -131951 -128912 -285020 -62373 186447 -168208 2012 -138613 -24549 -245672 -91737 148860
8365 351121 -67830 276539 59233 29578 143987 -22798 224988 6424 -234799 156533 116436
8354 116436 -138327 -53171 -49995 -110396 183855 20504 162515 268640 -44690 -141741 36089
8342 239744 99019 212274 -127940 -6294 230087 -206945 -15013 -366737 145597 -153085
8331 -97363 -221170 -282879 11582 -76543 150307 207653 2722 -443229 34809 -77753 -218587
8320 -218587 48426 408797 -98083 321867 -197959 15340 -104031 46644 131579 -68114 -35237
8309 -35237 536279 30871 162949 145225 -384340 35110 -238341 -221484 -97292 131424 -20615
8297 -237557 -108119 14190 29704 -28980 177720 127758 140641 -110717 -242574 162327 -21955
8285 366749 -203721 215792 267252 -105665 -68547 -58377 144210 -178614 -238640 126202
8274 -41855 139646 10893 -422263 112644 226690 -183749 -475260 8125 -81457 120826 43583
8262 -310861 -378465 -213982 189302 -130674 -34063 -9150 64688 -372763 -324411 -232052 8283
8250 -108280 -231170 38202 122950 -79098 -1159 -386596 284338 -48310 -73773 -322765 -36280
8238 182900 -8029 -83252 35569 -56370 -139383 75183 257334 53389 -85076 -78915 -13289 -29205
8226 -29205 27214 54423 -192215 126084 150272 -79280 -286878 -44303 173420 -18944 -358510
8215 -358510 -135677 -184431 -23485 109376 115032 214763 56123 391647 -89056 297078 218805
8204 218805 -4449 -369633 -127432 110331 -127888 -51516 50754 130625 95485 39043 48368
8193 48368 -57690 -218193 -262523 224430 -26876 -296146 167950 -153779 -35419 59215 60577
8182 60577 116065 -319249 -164106 -14259 20079 -308577 -224478 -70935 276730 -10965 115398
8170 129089 -217149 -18794 -68897 106498 -211269 -83359 -302901 -192304 137462 -53182
8159 46340 -356316 -257662 -168509 -181148 37005 97851 -107714 -266528 -114789 -143079 52072
8147 -95749 -85722 160602 191534 6029 99630 -252854 80303 104516 169712 84206 150572 -44906
8134 51539 -157135 232914 36055 168242 -87556 -225698 124196 -110235 11250 -281680
8123 15813 -104314 7914 66478 -80790 84519 -164920 141791 45980 -235797 -33030 -41201
8112 -41201 116823 61237 97187 120238 -41249 192100 -148682 -142778 -31201 -67133 -74681 63099
8099 272078 -316100 1408 70960 144906 -225496 -261184 83219 96630 125449 -282556 -218259
8088 -218259 -240698 -250523 -256963 -116620 -74455 -34712 -32793 -12077 -11102 -322093 -104850 -102559
8076 -102559 -124892 90419 -215239 72904 -269330 98488 -228726 55983 -84634 94333 196960
8065 196960 -220528 -383315 -162809 -165957 -247500 -59568 84942 -231734 -30011 -7917 218452
8053 301256 79829 -350386 -37354 -112089 -1391 73257 161602 -134584 -8026 207603 -28384
8041 -148178 -106858 -217067 123573 -187108 -158937 -246411 -144589 258567 -190863 22585
8030 -137763 -150139 271999 -111990 -281862 -6999 -84147 314621 -101880 154484 -81085 34032
8018 -133319 -141451 35482 -292904 -37232 155788 66018 -25042 -128038 43385 -86027 92290
8006 60872 -127995 -125274 -244702 -8794 -16506 -67473 59150 -241117 -43754 -37224 -124339 -315394
7994 -315394 219856 -135893 231211 -261637 -93143 101311 -58304 -102597 32881 -78437 -72152
7983 -72152 47538 -269012 161001 -210120 -169568 296799 -191671 59004 165889 -183200
7972 -88925 161828 -73842 148267 -78656 336515 -7222 -210408 -212776 127105 -46647 -64093
7961 -64093 161062 -22357 -266918 234756 -127478 -178416 35581 108131 -340180 78718 -113608
7949 59408 -311013 -386350 -103804 73523 14295 -100336 -129381 27254 34092 -86649 -29082
7937 101224 199993 115014 -126369 145997 -68512 -43335 -32302 -130828 -90683 -108712 -122492
7926 -122492 134539 -71217 -173712 -182897 -7054 -204372 -291463 -322943 -114715 -193966 -269667
7915 -269667 116455 211836 -9336 -55127 76597 28027 -60048 -151391 176958 104154 174823
7904 174823 -63424 -141035 199080 -126342 -326336 187486 -290033 37989 257654 -140946
7893 -164396 -117075 30187 -303315 -34702 -42994 -77834 -192970 83733 90869 -12577 132465
7881 -31836 -127150 -71831 44740 35606 -77852 47529 129926 162965 -116861 -59827 159864 -92103
7868 -81321 -400141 -50260 105428 -81118 162989 83185 -174939 6485 106479 160371 -194009
7856 -286922 -288626 -96780 -218926 -295117 -79287 227771 7546 9956 -178314 45180 -166134
7844 -118568 -87881 182342 72036 98004 -211009 145472 -50130 8691 8059 79413 250921
7833 250921 99738 -34294 22336 -84832 117558 -53004 -254904 46479 -252660 62228 53923
7822 53923 -135831 99203 -289048 -340611 -130924 100589 -340607 -188359 -174876 49845 138930
7811 138930 41044 219069 29092 -9623 48351 -67737 -5178 197696 -182327 -83160 -2787 -154650
7799 -154650 -82266 -164742 -11482 137500 -326517 9381 -174742 -156516 17495 -69100 -339402
7788 -339402 -180932 82409 -198767 -27466 -169064 -150764 -212566 -107346 -171891 -99753 2625
7776 137516 -99083 -109864 324913 387102 -84467 -77309 -103393 -55878 68818 84463 29371 171496
7764 171496 -346355 -263582 197166 149348 -193300 19320 -265175 -1422 -132655 -382276 -1402
7752 -102267 -74177 55552 86480 -142725 162720 169484 114572 -6854 74994 313247 187131
7741 187131 -64435 -154962 -60825 137937 56993 -59187 -236056 -49259 -140107 -285957 -108690
7729 273359 232432 306817 -169149 64288 5968 -58038 -167537 -128284 192990 -162231 167891
7717 -33780 112755 52745 233844 4989 -137950 25276 -20343 -384495 -254796 -382758 -105225
7705 -255727 -158410 69994 182129 -93830 -215565 141983 -262768 -44670 -132550 -437584 -72524
7693 2941 -116526 -106855 -134824 338367 -92816 11224 255100 143099 246262 183898 57200
7681 24252 -338804 -272555 -110950 174687 -240198 -69474 140954 48951 -92573 116828 -190657
7669 -149628 -168659 -350188 280991 280615 -22600 62993 215092 73851 171281 -334803 145504
7657 -208930 52674 68421 2269 159983 26127 -67999 36951 -75253 -73075 21599 -246777 -67200
7644 -51890 -101870 -228267 -21967 -150844 127615 -68379 122869 34820 315188 -219539 137634
7632 -45321 -300584 195099 -79674 -221724 -323810 -390402 -190390 165348 -344088 28856
7621 -311899 163602 -455372 -144418 145783 56152 197828 -237242 -183373 -15098 86461
7610 -9138 -43914 -198978 3297 34157 -157464 78829 -259745 67171 251603 -52345 140442
7598 22342 191113 -96758 -292291 -134253 14156 20063 17198 -25908 -193101 64358 -13485
7586 -152093 -241659 155721 -191544 -7953 87866 30296 2283 59085 -203299 -159610 -27116
7574 -57066 -169356 33530 29565 130730 -135756 71037 -172724 -173569 244867 -161008 -61856
7562 -221249 163753 -249649 100803 92324 53213 68737 -160733 -2427 40782 -63565 167262
7550 -215340 -34935 -332762 -33294 -171776 -5375 206385 -385598 -62334 187259 -270965 -98214
7538 -197418 -197346 30051 60542 115318 -92289 -50711 -130645 -321126 348342 209531 -141678
7526 49855 35589 -76005 261279 -14847 117125 215281 -166911 211407 118352 -63201 -99897
7515 -99897 -140989 -136741 205328 -204968 -122737 277693 185476 -221518 15636 -89393 -46523
7504 -46523 -203404 -241988 -107620 -365467 -58670 -274801 7486 60586 -170574 59672 15397
7492 -207660 -49151 -137724 -14699 -233352 -205869 -269654 56991 -12778 -356124 23642 80817
7481 80817 105138 -1665 -297698 106415 19348 -71986 222307 -231977 79543 -150610 47625
7469 56817 -176342 -290474 -131553 -185108 -36392 -111233 -65468 -391706 -251047 52350 117965
7458 117965 52914 4398 118398 95042 -307435 270423 -5858 -47591 -55393 -393364 221891
7446 -171627 66502 -132234 -60839 119841 -311782 61306 -169406 -158659 55639 -46574 63028
7434 -175950 -141234 -119129 945 -117459 130922 -46236 56242 -4301 -288901 -200627 -35979 -50227
7422 -50227 75792 69930 13673 -76009 249490 228262 -150038 254236 -270388 -328061 -43251
7410 212394 -220998 157226 -303408 -139927 -123048 -101392 -165173 7528 -53799 56203 -122172
7398 118235 -227420 126600 -62762 140234 52595 45563 -224344 -209276 -273114 210607 238296
7387 238296 -112864 -99092 -16536 5724 -438038 245688 127881 156962 -70425 -205169 -74303
7375 5173 -88622 67688 -27978 79146 136317 129128 -32285 -32414 112765 62543 -28104 -167723
7363 -167723 44506 -95754 -129878 -339258 -224184 110433 -86352 140418 -232839 74103 268424
7352 268424 197054 -299808 129766 -225404 31924 -3418 57776 285794 -159240 78281 -84244
7340 173796 -12723 -156501 -194621 141283 119176 -137209 -46775 -172357 -173961 -259757 -96717
7328 111131 -368065 91307 132603 -54228 410485 127336 82520 -19579 26581 -44935 94576
7316 33618 -48047 -81031 -106850 -5162 245734 336178 139048 -83561 -115753 131601 -71735
7304 -171535 -174660 -167881 -24025 14805 111427 67342 28954 184336 -207637 175484 -4834 -225796
7292 -225796 239837 -298056 -62579 -95567 -193162 -188976 -13599 -278751 -120318 -64561 31703
7280 -152718 -207747 -120267 -83202 -39939 137186 -106244 -123741 70691 207653 70873 -252814
7268 55110 104126 86784 127594 -195674 -308244 178796 -128951 -180940 208208 -28423 -78775
7257 -78775 -177285 -143795 -7611 -323326 -124282 -65051 -132979 -112903 116363 -148660 30262
7245 -205953 -49258 -15250 -24272 -33768 4248 -49229 -448445 -103479 -258971 16473 163271
7234 163271 233801 52447 38704 -112625 57259 -16433 57375 2162 -324027 -183653 -83370
7222 85512 155795 -88019 -190326 -55450 14342 -108943 252000 -64534 -14899 147275 -36867
7210 -114831 -231945 -63510 -86425 -191438 -95697 253948 -16552 -339171 -101502 55752 -325000
7198 -125207 16079 -50075 -338849 -305399 -465863 172803 -317955 -105362 119870 37511
7187 -23214 219189 -123711 27791 -345462 117025 32345 97374 -500907 -209763 62839 -270836
7175 -240734 399204 -232860 -374926 -4368 -204484 223970 160814 260274 -400660 -291813
7165 -291813 255120 -178472 33209 -68550 145741 -149875 -293171 -279417 -66844 7504 175422
7154 175422 222840 -33795 -14271 188205 130212 -128489 -84571 -34273 -66563 273632 -29559
7142 52699 122456 -58959 -113422 -19675 85509 31863 -119870 67359 -96464 -6548 -38790 -166492
7130 -166492 -251220 -179542 305266 115193 77674 27240 -64998 -65168 -357063 15945 102957
7119 102957 -133449 348854 -145348 27951 9484 45878 -146690 99883 -40738 -128668 -35525
7107 239016 -11672 183532 -85832 -39408 -99342 -21163 125905 105136 -81253 -408272 -254148
7096 -254148 -12761 103535 185159 -105500 182967 98209 -124873 -8875 -287299 162270 -146976
7084 -306976 -255022 -172450 71760 131487 -14488 -176744 -147233 262459 -101428 -82639 -293892
7073 -293892 -262395 -173709 -215081 230286 -32605 179028 246527 18473 -168202 91226 -102620
7061 93192 239283 17191 -44941 187349 19799 -216726 -70413 -61838 -198122 -274888 53142
7049 -76431 -106324 75655 92715 -121057 336421 -205774 -305221 1161 29671 -256061 -93188
7037 144992 216418 -502541 146718 -201508 167117 33217 -125385 -245546 -12727 -309134
7027 -309134 165324 101812 79839 -188728 83114 11726 -108753 -4578 147210 -132104 298647
7015 -4455 -172271 27899 48112 94601 133878 80331 45391 66091 -180917 -178810 155606 -400848
7002 -354443 -68769 177524 -67199 -159681 167345 -220110 100535 -135588 -192702 -140207 -45979
6990 -14516 319785 240438 -282569 -193377 -180582 170780 -21016 36873 1953 -106107 57445
6978 -179966 62963 20438 205407 -57589 113641 329847 -175178 281631 427 -137082 -89190
6967 -89190 -7803 23581 82009 238302 -3527 -180407 28869 -111295 83457 -61237 -6930 400342
6954 -49780 96169 -233810 -55956 -54910 -94629 -18659 153832 132325 -422513 -80436 -59564
6943 -59564 19597 76678 -50197 -88063 72674 241658 -201302 165102 226987 -96329 -244357
6932 -244357 -380334 -224272 46031 15197 292560 -357402 -121318 263359 -113184 -245139
6922 -245139 102545 -338788 -136885 119027 55226 111687 -183285 -150663 25573 90692 197547
6911 197547 -82513 -92673 135094 37461 -311575 87915 49711 90412 -80361 -59978 -127504
6900 -127504 67874 -301488 -52457 1582 -331940 40304 -121681 -285143 -9497 -106983 333960
6888 242469 -84883 -72929 -105499 -188237 -314010 -194179 99536 -65682 -242009 -85593 167262
6876 353534 85433 210107 166830 -148191 164562 -107749 -59005 129816 -89965 -455809
6866 -455809 232051 31638 -180226 -25379 164113 63481 -134235 8040 329996 -136812 -37416
6854 -137860 -111319 -423611 76053 -185003 37260 38946 -88883 -156390 80053 -62014 119279
6842 84069 152482 -99682 15042 -49126 -277967 192611 40173 -28362 -104283 -50067 76411
6830 -33325 -104754 -214381 -230879 -86156 4083 -13273 335493 -104795 156846 142268 16167
6818 20199 -145999 63101 -55045 225714 -69033 -90490 -239001 -36600 130039 -133843 138798
6806 54254 -1887 -129723 38010 86323 -169975 9370 -19393 -10365 -339384 -164447 -133413 -139836
6794 -139836 -262984 131726 -144492 -112946 -85946 -100917 1025 8266 -28253 -266119 45196
6782 70284 -16617 56820 -8197 174627 -50021 -133205 -91942 -106206 164125 264676 -103064
6770 188637 127920 -266681 61527 208083 -172095 -3220 -75150 318077 244059 -258562 232133
6758 -32809 -43149 -26931 27640 -115910 -83311 112334 -163820 -121878 -275611 -109473 -319506
6747 -319506 46561 -21325 -124908 95765 48320 88633 -56898 78093 -277442 -307760 -122037
6735 148426 -155115 155458 -326265 -11629 -14310 -202975 -4126 -153087 43088 32429 -23546
6723 -5512 89268 12923 94216 252436 125882 -122662 -393860 -298054 -67658 -331603 -38179
6711 45554 -54824 -125313 -144413 -65215 225574 8353 -91185 -4404 -54297 -52696 143045 -378562
6698 4297 -252195 -2524 327450 23769 485640 116252 -28762 225109 -163061 109048 -5081
6686 111601 -166484 49334 -94746 -93862 -17515 95333 24011 -13109 407311 -77890 21454 -44969
6673 -350854 -67012 52176 -229361 -375408 220531 128818 -244786 -172670 -29435 -79027 -37053
6661 11877 296374 -68412 -95868 -194825 -12166 -198863 -347823 197302 73888 -238580 -222469
6650 -222469 243134 -326551 216767 90145 -118474 235581 527044 -88290 -216382 58514
6639 -185157 -336498 698 25586 62688 74362 -22336 -129085 -32889 205765 -11666 -97772
6628 -97772 58917 92376 349149 -224932 -365781 74904 139933 -291226 48262 -8306 -130897
6617 -130897 209673 26090 162875 88287 -270300 -41281 218022 -2384 387700 -277711 -163434
6606 -163434 1633 -572916 310852 -11455 -23664 -106665 158925 -221368 102769 -184546 -134325
6595 -134325 -253607 -490521 -243004 58062 -377961 -146504 -122223 202475 -27727 -4497 -217680
6584 -217680 -462352 272796 -73216 227719 180949 -171676 245099 -175432 -302433 -52310
6573 -167162 6569 4907 -59205 -404668 -177605 -12702 38017 -324387 44683 80390 -264692
6561 -62240 -58673 40493 -280820 253174 -178091 137470 20444 71582 -33796 130989 575
6549 -9975 -44520 92411 -5030 69666 133968 179592 -2176 50334 134255 -177741 208019 29533
6536 -182760 286283 212872 -44297 -166880 188899 248464 -45630 -31246 43843 -91492 -174941
6525 -174941 -116872 -402146 10697 -104293 193058 -93472 -8867 207474 -246414 117731 -93381
6513 -83478 -157884 -6228 -54778 291491 -88858 64692 54306 -97908 339661 -235903 90007
6501 -218008 101900 132248 -154410 -434504 -23821 243459 -91659 86362 -273292 334684
6490 25166 306867 -287806 153912 -67415 -83560 -111046 111864 -123464 173471 9909 129317
6479 129317 -104735 227221 -299730 -223625 58314 -1142 -80599 106753 61000 38714 183616
6468 183616 34104 -52456 41649 -488012 67159 103202 -140868 3741 243886 22323 19455
6457 19455 -346614 -87770 165140 -312200 -299089 100147 -122721 59288 -293865 -170890
6447 -170890 1654 146736 -228783 128356 -215273 251844 280676 50827 -16382 51660 -181939
6435 123922 -54250 -151729 -315406 -77455 -330371 480964 -32323 35700 -244884 -18832 118621
6423 84606 -126695 -147366 -91549 -139984 -127918 46969 139102 -36847 -523439 113557 80007
6412 80007 255566 -179128 29445 222542 -407385 -35974 -244445 -173734 -170068 -319282 48086
6400 -145535 -25095 -21850 -2926 -134055 -443034 -74698 -243276 -43273 142866 135979 -69450
6388 -122555 1260 -120493 -193926 -162861 -62272 -158022 -31466 -107626 -119834 58386 60321 290865
6376 290865 179825 -285764 -56348 98385 214164 -259186 267800 -179148 -86871 128994
6365 97104 35044 -27973 38318 -3299 209642 127015 -58890 31093 223139 -80207 -348569
6354 -348569 -73884 -161328 -125564 91603 -184680 -79311 43330 -53385 11282 -56775 -136939
6343 -136939 55349 -15890 88200 -95389 -295413 45680 -30162 -87842 -114104 -25524 31995
6331 29708 -146206 33539 -124372 231826 137333 -49469 28375 169796 14642 -245406 338401
6319 -283098 277256 -201837 123634 445054 143833 -229156 -95563 -15249 -228820 356886
6308 212826 123841 88414 17481 254592 61134 180304 130546 -120366 153042 -134371 -89094
6297 -89094 -55317 -43584 120929 378249 -303045 -196069 13134 77565 -109910 100451 58123
6286 58123 96571 -6795 268874 24792 -289970 22480 113286 -74778 20786 -311276 -161322
6275 -161322 -14568 -25821 324096 -97427 -47815 179451 -177108 -214936 200917 284045 406197
6264 406197 312310 -85544 -6741 -234574 -27754 148462 -358366 126323 -4336 -12886 56720
6252 -134099 -42123 128886 249906 -139443 -155228 -85160 -200332 97561 -6196 180421 -279252
6240 -41781 295033 -271003 14496 130857 129691 -144745 73053 183440 -44598 -50778 201350
6228 -197309 78887 -322953 208287 -107613 51196 311783 -118223 -83642 -82261 32615 -170026
6216 -171821 482305 68880 -166550 -104824 -12543 96653 -64017 229007 -89589 -152949 105120
6204 251537 -244703 -69397 -4621 -208452 24460 198614 -94153 35558 -33877 83491 -14544
6192 65438 94089 251100 -86369 5374 289525 76543 -192268 -52627 189915 -139132 -263465
6181 -263465 -27028 -134404 121617 202753 72284 151266 36771 -11310 -69081 165847 288596
6170 288596 -202939 56198 -111546 -9117 -56257 -42105 211113 14554 -49210 -33194 -84240
6159 -84240 -90251 132121 122052 -335640 178977 -60068 -347405 26748 -133986 229424 55697
6147 120200 -74521 -28641 -11602 282375 -216311 -132004 254250 118399 178647 -144777 93174
6135 -101609 140732 -509141 174648 -10074 -339986 225172 142551 -395678 272470 117500
6124 -61758 -347684 -106980 -93841 101790 -39141 31126 165722 -103456 79491 -223286 20194
6112 59195 -201520 -179579 202029 -170674 52709 -67524 -192033 -133528 -89552 -382138 -14958
6100 -232877 220115 -136983 -90561 -94599 -406912 10188 -205271 -288720 121491 -287942 159337
6088 -75368 115231 69962 -38524 -75725 51457 241228 -62196 209415 -26631 -37605 -221430
6077 -221430 -179616 -72223 282038 151924 16497 24851 -40949 194206 146299 -75447 -202665
6066 -202665 -110329 -118068 -321260 172419 113463 -117138 -56618 74704 -28510 -181877 -74586
6054 -28238 223584 53359 194035 50057 -24102 61877 -122456 290129 -32120 -71501 -102201
6043 -102201 -135380 403871 -302106 140751 -71940 206069 -72172 -152870 210447 -11056 72409
6031 170975 -2484 100037 -188067 -234886 -166328 -342355 -37670 81901 251165 -55033 252314
6019 284859 -84913 -350383 -127 -204604 51027 12088 -12768 73179 -66357 190709 285176
6008 285176 19522 -238165 -66043 -11420 -153394 -222679 143790 14819 -5120 -25060 -236426
5997 -236426 -43349 58605 219472 -112957 -126234 80049 -83251 -71742 5505 -17739 -89351
5986 -89351 65586 -80215 82870 -81394 -274345 -205994 -50051 381210 275862 298162 42771
5974 55862 -20432 8188 22565 -61391 42280 256386 67909 134327 -145652 75511 -137394
5962 127605 -198451 -48927 -39210 -15996 188284 -25478 12144 -73840 -77804 -117680 17447 4339
5949 -104247 -191142 -14181 221172 -5339 96943 92315 -134958 -66434 -34403 -47232 -290985
5938 -290985 123826 182926 176509 14161 -5338 92822 -15503 -272039 33885 215520 -10867
5926 218876 83345 173607 -13160 -86487 -257885 -101881 -281042 -357938 -104692 -183348 -157939
5915 -157939 235199 508400 -149077 -23073 16662 50483 1448 -305023 50075 164245 -74022
5903 -27852 231873 155860 -2485 -187138 36386 129830 72190 -93827 -51602 -166177 63262
5891 5761 -145445 -171276 -25743 76506 66087 -12094 31056 127014 -263385 -15703 -83189 -99947
5879 -99947 -84009 -295336 8552 204797 -21813 -63304 503683 -266541 -263256 -139559 146979
5867 61240 88181 -205847 -161321 45018 -143103 -119421 -76055 168061 330879 209755 67579
5855 -361770 -46788 212258 -22721 -133225 -210860 -235939 -162468 75880 159915 -166271 215310
5843 -250912 159213 -400859 265713 -267322 115321 -17341 -127467 80750 66404 -123406
5832 193873 92805 -197154 25709 164296 7861 373407 -33536 -69518 -15908 113280 8395
5820 -46240 33117 -19563 96653 14078 -8922 680 38910 -18913 548919 -130887 66717 338822
5808 338822 308877 80113 233849 182574 -89851 588499 138999 -83660 -424494 -293733 -54651
5796 -415439 234812 27851 -197183 72277 110217 -108762 -50532 204787 147433 -170755 147635
5784 22754 219164 -200544 68116 -27119 145543 112707 -263552 114191 133327 24332 47517
5773 47517 -274893 107634 -250350 -38485 5782 188113 133870 195699 27411 197959 135344
5762 135344 322955 -128601 214516 -169531 -32248 98897 93974 73076 9563 378807 17797
5750 70833 199296 151940 -59116 -21796 60512 122434 77002 34256 -26328 -27453 281593 188660
5738 188660 -338451 160635 -52419 175766 -28521 -120044 -247511 12755 25866 -51583 -55501
5727 -55501 -135330 -12843 -76751 235776 260622 -91808 145454 17270 -244401 158235 62713
5715 130816 163441 81960 -362831 -252730 250655 178004 137138 -220066 -128556 -301663 -268619
5704 -268619 -85042 79426 -255663 -92658 -104895 274443 -36721 -182208 -26597 -10795 311401
5692 -13328 182427 -233515 21355 -40079 -22859 106643 -317418 -165491 237576 -113817
5681 -88373 252823 156835 115483 19427 -153031 164649 101705 -14368 211633 34083 36959
5670 36959 187618 -143325 -140687 -106263 -244463 -9848 -620 -224553 -50625 186898 85054 15070
5657 121507 3081 -272918 462373 -32705 193906 -89426 105399 -148040 79751 -437186 36729
5645 86101 -74478 -151611 14393 157141 -44284 -161247 -41498 12937 -82963 -129840 276144
5633 -262703 141401 -156630 1833 -122555 -3051 111714 -42966 110586 281974 52549 -233507
5621 -94142 1847 -109687 139640 -89281 110624 -428430 110876 -67790 63942 -175621 -189887
5610 -189887 96638 -47295 -309650 -195207 -104034 -201223 -193249 -141052 87421 -7117 -101094 -186625
5598 -186625 -164705 -306293 -383262 43702 67094 184074 212702 63880 122247 -143290 -203624
5587 -203624 -124029 -196326 265062 183349 -79798 277742 -112192 72878 -104720 -41353 -27481
5576 -27481 -59820 74701 4294 161801 158449 -147844 -167281 71946 -320419 -13258 -35731 -132677
5564 -132677 -124683 20899 -9230 47730 -226669 -140682 319088 -337379 184577 115793 101003
5553 101003 165641 125933 74114 280724 17054 -92136 -211395 276512 -121906 184360 -174326
5541 -112219 -120908 270617 12675 -31509 122191 -79445 157641 -39129 284257 -52063 139888
5529 183641 -352381 221160 245901 -107353 -7824 50112 -128009 119135 -14152 -3403 181613
5517 19018 -125054 -351138 20036 -106335 117978 40584 -103309 -68670 20232 -220991 -109642
5505 22347 61951 233467 -172336 -30098 307937 223818 91475 241578 -80720 27947 14538
5494 14538 150587 6236 428940 -47880 152101 -128701 -33311 190316 219871 -91449 16322
5482 -18076 1590 152286 67059 -87733 -193652 -149489 179410 251748 -190820 -252629 -377730
5471 -377730 43745 -310695 354521 -161678 -82022 96118 -187951 57543 -28236 147728 -208931
5459 -105056 17141 -226216 -115709 294946 71276 -155039 121688 -52011 -116188 -176061 -290787
5448 -290787 145161 -279773 80655 -1227 -144600 6497 26934 823 43944 199827 350961
5437 350961 93914 -145007 148551 -131077 170733 -52181 -94885 117908 165724 -44737 153766
5425 162470 -179459 -30561 -495365 -346 -36705 -4955 68975 247977 47684 -141707 35539
5413 -174122 154669 42486 -51448 46301 50930 208542 -257996 -33598 396460 -96176 16814
5401 -77936 240800 274774 -174915 -16830 206501 42475 23937 82163 5928 253182 -118089
5389 32639 175380 -36967 4119 -129307 29622 -94503 62759 -57928 59490 317448 53104
5377 -246461 -15601 -69688 334383 251481 234120 93030 -582010 -160718 91189 48617 -4514
5365 129034 182777 -176746 137094 -407730 279253 292018 -35531 123677 -33064 -381812
5355 -381812 -260085 -54734 -41683 -35242 -131882 75851 -135910 -43530 3051 -177807 85073
5343 -88402 68416 -93348 -292935 -2926 -259627 85363 -138995 -75352 -22425 60686 140574
5332 140574 163237 65365 280382 -308302 379387 -343876 127816 -144323 -14173 45068
5321 115335 -126046 141688 -15231 100557 -42175 -97256 -73575 -115485 -199429 254036 -62093
5309 227820 -287931 332762 16275 22322 -475937 -45517 -80547 -163158 255039 -96649 -85963
5298 -85963 25407 33236 -61068 -46588 3398 35894 35825 -144254 44069 -253545 158490 38862
5285 296481 -140682 -124517 -110147 224578 267913 155052 -172479 64971 235329 -263924
5274 323189 351322 -228507 -86216 -247834 112554 -14284 147640 77001 -289929 -105690
5263 33194 164508 -100606 11987 -112957 -110848 126542 270759 -349376 372836 -73530 -30088
5251 157687 185425 -151140 198208 50127 200168 11232 -187908 -117791 -76359 -35245 -301826
5240 -301826 -20691 57031 261939 -156625 -96919 -127444 -216915 -161847 -117023 243392 -228669
5228 -55677 -4389 18539 65282 -133854 -86741 148833 54100 -153289 24171 -17292 69496
5216 48580 -116646 131502 -51699 147909 63891 -6888 280769 118079 -182778 8736 184526
5205 184526 60376 140145 47716 -70545 -127611 -167600 16739 -57227 250731 -40488 -3918 -203600
5193 -203600 150418 -322061 -75268 -95836 23396 185848 -96227 -144438 -50422 142169 11527
5181 -5778 -168001 -274484 136369 288104 -44005 168601 -150665 -92366 343949 -373741
5170 103696 179968 42674 164086 -191363 -10691 170966 27123 340183 -58767 -17498 41505
5158 356671 -210428 -26078 111787 -45449 -196040 186639 -288976 -69922 31656 104680 -114258
5146 -231702 -53451 154619 -147847 -139851 -240044 83187 -99605 361403 43200 285268 99194
5134 106851 9971 163275 396746 -85355 195267 -19368 -61044 -29406 -313260 -36915 -227096
5123 -227096 -125834 267191 115496 -116863 1417 33361 -390179 -136492 -114569 -236927
5113 -236927 86413 33409 -262232 -72067 4215 -86945 -2017 51761 -24032 -107754 -191247 3520
5100 -430045 341267 119999 53139 -319478 -63482 415837 -124859 -51083 -73674 53359 144068
5089 144068 -114390 -96634 -109798 -86979 77807 160368 -278984 -101223 180293 22887 103815
5078 103815 65845 55145 -65734 71747 -245143 -261232 -220216 -63511 -36518 136681 -241782
5066 -29367 -107857 -62186 203066 71803 -91133 35177 118100 173626 336166 235144 13379
5054 164437 -82881 90887 -53252 59716 94367 -345672 -202632 -404473 142258 -51149 195870
5042 164116 254553 97465 -131429 -29581 31275 20748 97036 -176674 -303412 -97427 127461
5030 -36060 311259 43046 169377 -99299 -202470 71510 -15188 -138713 -66214 -144742 -128071
5019 -128071 40280 -400918 -236636 -127808 -54392 -72063 65730 323667 -49176 453500 -57028
5007 191596 28124 -184053 -31486 -53869 18277 192070 -107630 -69768 -216877 -76044 -311748
4996 -311748 10977 201361 -52918 -259513 204072 -65437 -43377 146058 -88386 219332 -2645
4984 -39901 -191159 -263997 -154423 -87598 36823 34038 -169451 -33824 55379 9667 54620 -88689
4971 -203992 -29547 138450 75145 74058 226136 -224346 -276416 -180510 -20138 160412 -26467
4959 -100122 -34964 72053 274031 -81489 -53075 85988 235645 154793 -97468 61906 40778
4948 40778 302987 336127 25278 100690 212828 219952 -114383 -141734 18417 135558 -73192
4936 -42288 -16142 27219 43509 185291 123855 -198425 107349 -210550 -141416 -225772 230722
4924 -82566 -122584 -32701 -23283 -138859 -112882 179415 -107069 261864 45249 69288 -13839
4912 -58381 194118 120359 196316 318056 35257 82531 176207 270334 -297610 117083 -120163
4900 282349 168253 63989 -17979 245818 147395 -100396 -347020 108881 -135439 255874
4889 -138026 88875 96123 381682 225399 -127292 -60562 237454 280252 135738 -179267 534259
4877 -393366 9680 85879 3799 -48443 78418 -107413 43501 -79865 -55940 120058 180640 313799
4865 313799 -42225 102092 156261 -74678 -20134 141690 -18114 70436 165875 7629 171668
4854 171668 22267 160951 119388 -36419 -53827 -181879 -273113 14021 418605 -49079 -115488
4843 -115488 30778 -57606 -10954 41815 -5874 235413 -35369 117571 307604 155112 -730
4831 122297 20010 58515 -40163 23201 -11902 31792 -419279 323234 -164397 -145918 -218378
4820 -218378 -155391 -95455 -344587 292411 -96179 -105694 -4534 195919 -83531 -42937 20232
4808 41771 11960 36058 259701 -19970 -4539 -166246 47891 197670 -147867 -194107 -314834
4797 -314834 259440 18448 -77571 -60930 185034 39003 -86585 -174590 144716 -81088 -68433
4786 -68433 -63772 241955 -325056 160989 439404 -5684 280188 185823 -199816 41611 -19999
4774 -88412 -64536 -304723 64251 -68037 38878 -215231 -46181 -375201 29445 -199613 170330
4762 55193 59099 234716 -279786 -90689 71816 110053 -12967 312565 -229126 247699 127493
4751 127493 -228708 -56616 6565 -121207 84247 -123814 141895 98183 93558 -55341 -113934
4740 -113934 222256 -75769 352639 30535 108777 203884 -171 -184973 66272 223312 -78135
4728 -42992 83365 189577 -19783 77161 -47739 54063 -122796 -78148 -221313 -359801 -102045
4716 316299 349601 402918 25410 -97377 347426 -342124 -366374 118909 -161361 -175011 -6853
4704 -153763 132682 24819 127791 115396 135897 -22940 -26622 -125686 145116 -146679 85799
4692 23442 28838 176104 250857 -31072 76014 89800 152735 1567 17769 186290 -174305 -300623
4680 -300623 -73301 158537 -249110 6306 -195458 -114968 45716 -247864 -161639 3942 -194914
4668 274295 -14306 -182273 -121773 87034 135241 -377586 107135 -147462 166158 -86871 81184
4656 149064 343601 222636 161314 201919 -241573 10457 32476 -124206 -47033 -45517 4079
4644 49017 191025 6442 189116 -12456 152083 -63337 366967 -315954 -195770 -292228 56597
4632 28565 -111403 -101100 61131 114997 351440 -22426 -53493 257022 143544 -130622 -52632
4620 51105 -117088 -72163 13186 157064 21553 20074 -42241 73168 -16486 77993 -5231 -17407
4608 -17407 8139 -114265 -128086 125084 -242379 245193 -19750 32816 -82620 187362 176511
4597 176511 72769 47057 -46969 70076 20153 -413022 -43589 -85264 -97084 73913 25221
4585 395112 -172661 -55063 162489 -135615 16871 131574 83127 54628 213063 370327
4575 370327 128586 80737 44487 11895 25153 23602 -76839 -126065 87751 250969 -159610
4563 104410 -61565 -40668 309002 134650 -230047 -166907 34654 88376 -86607 166541 96719
4552 96719 118541 29519 28861 175379 12787 59944 -100355 -139800 130493 136434 96679 78469
4540 78469 25008 101949 -117665 -96016 29423 -27120 474429 20666 -347924 35390 -121056
4528 110475 -137205 108360 159302 531348 64800 -67062 -195574 -12355 -42566 -153037 4426
4516 -10008 85765 -98692 97568 268605 79502 -3998 -5233 -167181 -64132 -59032 76054 -152776
4503 -87738 126692 -157880 298365 122945 -127760 97486 55498 22366 -80141 -93740 92537
$$ [...]
##END NTUPLES=NMR SPECTRUM
##END=
