
##TITLE=AC1247__6945447_2EnzlCZ7cf
##JCAMPDX= 6.0         $$ Bruker NMR JCAMP-DX V2.0
##DATA TYPE= NMR SPECTRUM
##DATA CLASS= NTUPLES
##ORIGIN= BRUKER
##OWNER= Administrator
$$ 1.72 TOPSPIN		Version 2.1
$$ 2012-10-18 13:45:19.427 -0700  Administrator@X
$$ Compression mode = diff/dup
##.OBSERVE FREQUENCY= 400.02188249412
##.OBSERVE NUCLEUS= ^1H
##.ACQUISITION MODE= SIMULTANEOUS (DQD)
##.ACQUISITION SCHEME= undefined
##.AVERAGES= 64
##.DIGITISER RES= 22
##SPECTROMETER/DATA SYSTEM= spect
##.PULSE SEQUENCE= noesygpps1d.comp
##.SOLVENT NAME= COFFEE_meoh
##.SHIFT REFERENCE= INTERNAL, COFFEE_meoh, 1, 14.96085
##AUDIT TRAIL= $$ (NUMBER, WHEN, WHO, WHERE, PROCESS, VERSION, WHAT)
$$ ##TITLE= Audit trail, TOPSPIN		Version 2.1
$$ ##JCAMPDX= 5.01
$$ ##ORIGIN= Bruker BioSpin GmbH
$$ ##OWNER= Administrator
$$ $$ C:\Bruker\TOPSPIN/data/COFFEE/nmr/AC1247__6945447_2EnzlCZ7cf/12/pdata/1/auditp.txt
$$ ##AUDIT TRAIL=  $$ (NUMBER, WHEN, WHO, WHERE, PROCESS, VERSION, WHAT)
(   1,<2012-10-13 20:40:16.046 -0500>,<Administrator>,<TOPSPIN>,<go>,<TOPSPIN 2.1>,
      <created by zg
	started at 2012-10-13 20:28:45.828 -0500,
	POWCHK enabled, PULCHK disabled,
       configuration hash MD5:
       6B 1B 68 BB D9 2E 58 E2 7F 35 AD 54 07 DF 0E 41
       data hash MD5: 64K
       CC 6A EA FF E0 53 07 63 E7 0F BC 4C E3 CC FC 54>)
(   2,<2012-10-13 20:40:18.984 -0500>,<Administrator>,<TOPSPIN>,<proc1d>,<TOPSPIN 2.1>,
      <Start of raw data processing
       efp LB = 0.3 FT_mod = 6 PKNL = 1 PHC0 = 0 PHC1 = 0 SI = 128K 
       data hash MD5: 128K
       31 B0 64 48 C7 F8 C3 31 69 27 13 11 E1 5F 39 8F>)
(   3,<2012-10-13 20:40:20.125 -0500>,<Administrator>,<TOPSPIN>,<proc1d>,<TOPSPIN 2.1>,
      <pk PHC0 = 2.466431 PHC1 = 0 
       data hash MD5: 128K
       3E 8D F3 47 89 32 76 9D 3D C5 34 13 01 E2 E6 4B>)
(   4,<2012-10-13 20:40:20.359 -0500>,<Administrator>,<TOPSPIN>,<proc1d>,<TOPSPIN 2.1>,
      <abs ABSG = 1 
       data hash MD5: 128K
       13 7E FB 80 4C 7C A3 9D C5 29 AD 42 FE D9 1A 25>)
(   5,<2012-10-13 20:40:20.437 -0500>,<Administrator>,<TOPSPIN>,<proc1d>,<TOPSPIN 2.1>,
      <abs ABSG = 2 
       data hash MD5: 128K
       42 98 2C DE 98 DC FD FE E7 0E 90 4A 5B 99 0B 12>)
(   6,<2012-10-13 20:40:20.484 -0500>,<Administrator>,<TOPSPIN>,<proc1d>,<TOPSPIN 2.1>,
      <abs ABSG = 3 
       data hash MD5: 128K
       4E 20 D4 BE BE 40 65 59 79 A9 80 86 3A E2 FF 8A>)
(   7,<2012-10-13 20:40:20.625 -0500>,<Administrator>,<TOPSPIN>,<proc1d>,<TOPSPIN 2.1>,
      <abs ABSG = 4 
       data hash MD5: 128K
       20 75 08 A3 D0 D4 0F DD 59 D0 67 A1 A0 7C 12 F7>)
(   8,<2012-10-13 20:40:20.781 -0500>,<Administrator>,<TOPSPIN>,<proc1d>,<TOPSPIN 2.1>,
      <abs ABSG = 5 
       data hash MD5: 128K
       D3 36 F2 59 BB FB 52 FD 5E 31 36 2D DD F8 25 D1>)
(   9,<2012-10-13 20:40:21.015 -0500>,<Administrator>,<TOPSPIN>,<audit>,<TOPSPIN 2.1>,
      <user comment:
       ICON-NMR User ID: COFFEE
       data hash MD5: 128K
       D3 36 F2 59 BB FB 52 FD 5E 31 36 2D DD F8 25 D1>)
$$ [...]
##$TP07= 0
##$TPNAME0= <>
##$TPNAME1= <>
##$TPNAME2= <>
##$TPNAME3= <>
##$TPNAME4= <>
##$TPNAME5= <>
##$TPNAME6= <>
##$TPNAME7= <>
##$TPOAL= (0..7)
0.5 0.5 0.5 0.5 0.5 0.5 0.5 0.5
##$TPOFFS= (0..7)
0 0 0 0 0 0 0 0
##$TUNHIN= 0
##$TUNHOUT= 0
##$TUNXOUT= 0
##$USERA1= <user>
##$USERA2= <user>
##$USERA3= <user>
##$USERA4= <user>
##$USERA5= <user>
##$V9= 5
##$VALIST= <valist>
##$VCLIST= <CCCCCCCCCCCCCCC>
##$VD= 0
##$VDLIST= <DDDDDDDDDDDDDDD>
##$VPLIST= <PPPPPPPPPPPPPPP>
##$VTLIST= <TTTTTTTTTTTTTTT>
##$WBST= 2048
##$WBSW= 25
##$XGAIN= (0..3)
0 0 0 0
##$XL= 0
##$YL= 0
##$YMAX_a= 12303947
##$YMIN_a= -9336303
##$ZGOPTNS= <>
##$ZL1= 120
##$ZL2= 120
##$ZL3= 120
##$ZL4= 120
##$ABSF1= 14.96085
##$ABSF2= -5.597332
##$ABSG= 5
##$ABSL= 3
##$ALPHA= 0
##$AQORDER= 0
##$ASSFAC= 0
##$ASSFACI= 0
##$ASSFACX= 0
##$ASSWID= 0
##$AUNMP= <proc_prof1d_extract.lims>
##$AXLEFT= 0
##$AXNAME= <>
##$AXNUC= <1H>
##$AXRIGHT= 0
##$AXTYPE= 0
##$AXUNIT= <>
##$AZFE= 0.1
##$AZFW= 0.1
##$BCFW= 0
##$BC_mod= 0
##$BYTORDP= 0
##$COROFFS= 0
##$CY= 15
##$DATMOD= 1
##$DC= 0
##$DFILT= <>
##$DTYPP= 0
##$F1P= 0
##$F2P= 0
##$FCOR= 0.5
##$FTSIZE= 131072
##$FT_mod= 6
##$GAMMA= 0
##$GB= 0
##$INTBC= 1
##$INTSCL= 1
##$ISEN= 128
##$LB= 0.3
##$LEV0= 0
##$LPBIN= 0
##$MAXI= 10000
##$MC2= 0
##$MEAN= 0
##$ME_mod= 0
##$MI= 0
##$NCOEF= 0
##$NC_proc= -2
##$NLEV= 6
##$NOISF1= 0
##$NOISF2= 0
##$NSP= 0
##$NTH_PI= 0
##$NZP= 0
##$OFFSET= 14.96085
##$PC= 1
##$PHC0= 2.466431
##$PHC1= 0
##$PH_mod= 1
##$PKNL= yes
##$PPARMOD= 0
##$PPDIAG= 0
##$PPIPTYP= 0
##$PPMPNUM= 2147483647
##$PPRESOL= 1
##$PSCAL= 4
##$PSIGN= 0
##$PYNMP= <proc.py>
##$REVERSE= no
##$SF= 400.020009698005
##$SI= 131072
##$SIGF1= 0
##$SIGF2= 0
##$SINO= 400
##$SIOLD= 131072
##$SPECTYP= <>
##$SREGLST= <1H.CDCl3>
##$SSB= 0
##$STSI= 131072
##$STSR= 0
##$SW_p= 8223.68421052631
##$SYMM= 0
##$S_DEV= 0
##$TDeff= 65536
##$TDoff= 0
##$TI= <>
##$TILT= no
##$TM1= 0
##$TM2= 0
##$TOPLEV= 0
##$USERP1= <user>
##$USERP2= <user>
##$USERP3= <user>
##$USERP4= <user>
##$USERP5= <user>
##$WDW= 1
##$XDIM= 131072
##$YMAX_p= 325397314
##$YMIN_p= -13393
##$CURPLOT= <Network HP LaserJet P1505>
##$CURPRIN= <$Network HP LaserJet P1505>
##$DFORMAT= <normdp>
##$LAYOUT= <+/1D_H.xwp>
##$LFORMAT= <normlp>
##$PFORMAT= <normpl>
##$SURQMSG= 1
$$ End of Bruker specific parameters
$$ ---------------------------------
##NTUPLES= NMR SPECTRUM
##VAR_NAME=  FREQUENCY,     SPECTRUM/REAL,   SPECTRUM/IMAG
##SYMBOL=    X,             R,               I
##VAR_TYPE=  INDEPENDENT,   DEPENDENT,       DEPENDENT
##VAR_FORM=  AFFN,          ASDF,            ASDF
##VAR_DIM=   131072,        131072,          131072
##UNITS=     HZ,            ARBITRARY UNITS, ARBITRARY UNITS
##FACTOR=    0.0627417313425164, 1,          1
##FIRST=     8223.62146879497, 1382,         -63926
##LAST=      0,             3928,            -65256
##MIN=       0,             -13393,          0
##MAX=       8223.62146879497, 325397314,    0
$$ Real data points
##PAGE= N=1
##DATA TABLE= (X++(R..R)), XYDATA
$$ [...]
64042C25063P143Q013Q199Q172Q696R570R738Q692P022N400L801K066M88o73j630
64027D09760k497k908k826l009l868m469l738k173j274j464j821j769j870k614
64013C73460l531l964l924l721l430l119k993l010k796k277j798j419o76N60J685
63998C39047K176K295K537K931L331L906M778N624O133O496O939P199P061P007
63984D07460P607Q526Q911Q691Q747R676J1019J1972J2394J2749J3316J3868J4091
63971E49027J4139J4620J5982J7990J9946K1395K2439K3345K4172K4991K6136
63960G74182K7953L0365L3034L5883L9261M3505M8508N3784N9000O4418P0677
63949A280570P8124Q6460R5314J04767J14918J25137J34369J42220J49108J55186
$$ plain form
64042 325063 332206 340219 348418 356590 365286 374856 384594 393286 400308 405708 409509 411575 412063 411390 409760
64027 409760 407263 404355 401529 398520 394652 390183 386445 384272 382998 381534 379713 377944 376074 373460
64013 373460 369929 365965 362041 358320 354890 351771 348778 345768 342972 340695 338897 337478 336802 337362 339047
63998 339047 341223 343518 346055 348986 352317 356223 361001 366625 372758 379254 386193 393392 400453 407460
63984 407460 415067 423593 432504 441195 449942 459618 470637 482609 495003 507752 521068 534936 549027
63971 549027 563166 577786 593768 611758 631704 653099 675538 698883 723055 748046 774182
63960 774182 802135 832500 865534 901417 940678 984183 1032691 1086475 1145475 1209893 1280570
63949 1280570 1358694 1445154 1540468 1645235 1760153 1885290 2019659 2161879 2310987 2466173
63939B466173J59869J62536J62965J60644J54512J44126J30426J14586R6576P5828
63929C828241N2838K9060N262j8845m3221o6755q8221j07184j23536j36970j47332
63918C183337j54881j59627j60977j58659j53551j46969j39467j30948j21642
63909A856616j12188j02863r3482q4155p5442o7583o0186n3037m6696m1864l8422
63898A080698l5549l2636k9687k6934k4517k2584k1276k0408j9442j8019j6410
63887H13236j5207j4571j3996j2888j1196r368p748o232m572k780j028P43K730
63874G17123M777O344P229P894Q821R792J0303J0533J1231J2598J3813J3963J2981
63861H47402J1403R608P669N653L690J878L41q89k243m400p354j0098j1751j2646
$$ plain form
63939 2466173 2626042 2788578 2951543 3112187 3266699 3410825 3541251 3655837 3752413 3828241
63929 3828241 3881079 3910139 3915401 3896556 3853335 3786580 3698359 3591175 3467639 3330669 3183337
63918 3183337 3028456 2868829 2707852 2549193 2395642 2248673 2109206 1978258 1856616
63909 1856616 1744428 1641565 1548083 1463928 1388486 1320903 1260717 1207680 1160984 1119120 1080698
63898 1080698 1045149 1012513 982826 955892 931375 908791 887515 867107 847665 829646 813236
63887 813236 798029 783458 769462 756574 745378 736010 728262 722030 717458 714678 713650 714393 717123
63874 717123 721900 728244 735473 743367 752188 761980 772283 782816 794047 806645 820458 834421 847402
63861 847402 858805 868413 876082 881735 885425 887303 887644 886755 884512 880112 872758 862660 850909 838263
63847H38263j3759j5303j6681j7646j8655j9976k1135k1632k1626k1609k1744
63836F28497k1779k1347k0211j8569j7160j6682j6909j6845j5897j4494j3337
63825D35267j2539j1798j0980j0130r257q458p964p680p099o023n103n060n619
63812C27557n769n101m230l862l886l742l274k813k547k275j867j647j994k685
63798B81865l048k773k239j912j821j836k023k364k531k433k596l351m003l581
63784B45354k294j298j090j013n62j68l11p20r31r92j097j164j179j411j820j855
63768B27449j329q22p21n81k2M30K17k68l68k89n91j027r39m93l92n98l91L04
63750B19569P79O96M52K85k6l34mJ054J980K058J525R86O28M09L98N08M36K38
$$ plain form
63847 838263 824504 809201 792520 774874 756219 736243 715108 693476 671850 650241 628497
63836 628497 606718 585371 565160 546591 529431 512749 495840 478995 463098 448604 435267
63825 435267 422728 410930 399950 389820 380563 372105 364141 356461 349362 343339 338236 333176 327557
63812 327557 321788 316687 312457 308595 304709 300967 297693 294880 292333 290058 288191 286544 284550 281865
63798 281865 278817 276044 273805 271893 270072 268236 266213 263849 261318 258885 256289 252938 248935 245354
63784 245354 243060 241762 240672 239659 239097 238929 238618 237898 236967 235975 234878 233714 232535 231124 229304 227449
63768 227449 226120 225298 224577 223996 223974 224404 224621 224353 223985 223696 223105 222078 221139 220646 220254 219656 219265 219569
63750 219569 220348 221044 221496 221781 221755 221421 221417 222471 224451 226509 228034 229020 229648 230057 230455 230963 231399 231637
63732B31637M50J263K050K237K116K318K784K969K834K964L568L930L250J827
63718B66197R04J256K188K379J478L73k39p74j778k702k537j378m77o72j565k283
63702B60370k407j918r47J78J060J636K016K037J490P89O94J240J721J887K307
63687B72153L216L894L721L069K521J905Q44k69o98m05P3M55O94M92l66j294j436
63670B88569q25k91j77k7L75N30J50j73J78P55N26p72k261k948k715k215k047
63653B76632k239k383k141j583j039p13m99k19Q3J88P1J12P25J804K700K910K687
63636B77096K740L365M102M311L899L396L368L932M738N416N952O608P424Q054
63622C44401Q256Q337Q771R479R946J0087J0496J1619J3108J4353J5360J6648
$$ plain form
63732 231637 232087 233350 235400 237637 239753 242071 244855 247824 250658 253622 257190 261120 264370 266197
63718 266197 267101 268357 270545 272924 274402 274775 274536 273762 271984 269282 266745 265367 264890 264218 262653 260370
63702 260370 257963 256045 255098 255276 256336 257972 259988 262025 263515 264304 264998 266238 267959 269846 272153
63687 272153 275369 279263 282984 286053 288574 290479 291323 291054 290356 289951 290024 290479 291173 291665 291299 290005 288569
63670 288569 287744 287453 287276 287249 287624 288154 288304 288131 288309 289064 289590 288818 286557 283609 280894 278679 276632
63653 276632 274393 272010 269869 268286 267247 266534 266035 265816 265899 266087 266158 266270 266995 268799 271499 274409 277096
63636 277096 279836 283201 287303 291614 295513 298909 302277 306209 310947 316363 322315 328923 336347 344401
63622 344401 352657 360994 369765 379244 389190 399277 409773 421392 434500 448853 464213 480861
63610D80861J8388K0050K1000K1138K0746J9896J8264J5624J2363R225O526L866
63598F67947Q85j928l640m015l859m117m941n914o811p872r398j1349j3249j4484
63584E77255j4776j4468j4196j4166j3921j2906j1098r045p406o537o228n758
63572D46750m456k379k81J200K099K765L286L583L846M477N536O604P291P749
63558D88070Q470R645J0859J1592J1922J2513J3783J5418J6932J8417K0298K2419
63546F60338K3928K4113K2864K0198J5942J0251M104j231n097p615r078r566r134
63533G40017q071o880o085o015o737q129r990j2072j4151j6156j8143j9917k0966
63520E86705k1033k0596k0323k0173j9485j7988j6147j4514j3219j2233j1539
$$ plain form
63610 480861 499249 519299 540299 561437 582183 602079 620343 635967 648330 657555 664081 667947
63598 667947 668832 666904 663264 659249 655390 651273 646332 640418 633607 625735 616337 604988 591739 577255
63584 577255 562479 548011 533815 519649 505728 492822 481724 472679 465273 458736 452508 446750
63572 446750 442294 439915 439634 440834 442933 445698 448984 452567 456413 460890 466426 473030 480321 488070
63558 488070 496540 506185 517044 528636 540558 553071 566854 582272 599204 617621 637919 660338
63546 660338 684266 708379 731243 751441 767383 777634 781738 780507 775410 767795 758717 749151 740017
63533 740017 731946 725066 718981 712966 706229 698100 688110 676038 661887 645731 627588 607671 586705
63520 586705 565672 545076 524753 504580 485095 467107 450960 436446 423227 410994 399455
63509C99455j0889r826q237o531n126m195l875m167m489m070l078k612l124l644
63495C25592l149k008j270j068o58K13R50J087R12Q81J038J140J019P25N12O17
63479C26533R19J095J264J988L237L951L240J660N08J53q4n82r49j015j321k219
63463C38378l145l287k614j763j210q44k97N35J370J923K333K885L374L244K631
63448C43513K627L896N590O441O530P029Q383R874J0971J2043J3421J4850J6223
63435D61391J7948J9982K1269K0781J8602J5474J1900Q282N437M179M550N940
63423F15735P759R621J1269J2820J4838J7635K0675K3052K4324K4470K3372K0813
63411H26383J6873J1939O571J648j803l501m378n521o888p722p959q433r719j1551
$$ plain form
63509 399455 388566 378740 370503 363972 358846 354651 350776 346609 342120 338050 334972 332360 329236 325592
63495 325592 322443 320435 319165 318097 317439 317652 318602 319689 320601 321482 322520 323660 324679 325404 325916 326533
63479 326533 327452 328547 329811 331799 335036 338987 342227 343887 344395 344548 344464 343882 342933 341918 340597 338378
63463 338378 335233 331946 329332 327569 326359 325515 325218 325753 327123 329046 331379 334264 337638 340882 343513
63448 343513 346140 350036 355626 362067 368597 375626 384009 393883 404854 416897 430318 445168 461391
63435 461391 479339 499321 520590 541371 559973 575447 587347 595629 601066 605245 609795 615735
63423 615735 623494 633115 644384 657204 672042 689677 710352 733404 757728 782198 805570 826383
63411 826383 843256 855195 861766 863414 861611 858110 853732 848211 841323 833601 825642 817209 807490 795939
63397G95939j3497j5474j7385j8946k0163k1366k2423k2528k1268j9368j7840
63386E85681j6718j5346j3600j2101j1172j0240q609o397m333k863j779p39K66
63373D82050J141K170L864O187Q284R344R597J0021J1128J2543J3869J5298J7042
63360F02538J8687J9774K0602K1749K2975K3407K2759K1521J9835J7088J3039
63349H23974Q534M522R86k431n319o917p317p383p533p584p756q855j1138j3787
63335G51996j5988j7824j9665k1252k2038k1974k1335k0087j8084j5736j3797
63324E44216j2439j1040r052o715m850m201n016o942r181j0932j1838j2052j1923
63311D28035j1698j1415j0901r959q620p139n722m411l334k778k837l185l418
$$ plain form
63397 795939 782442 766968 749583 730637 710474 689108 666685 644157 622889 603521 585681
63386 585681 568963 553617 540017 527916 516744 506504 497895 491498 487165 484302 482523 481784 482050
63373 482050 483191 485361 489225 495412 503696 513040 522637 532658 543786 556329 570198 585496 602538
63360 602538 621225 640999 661601 683350 706325 729732 752491 774012 793847 810935 823974
63349 823974 832508 837030 838016 835585 830266 823349 816032 808649 801116 793532 785776 776921 765783 751996
63335 751996 736008 718184 698519 677267 655229 633255 611920 591833 573749 558013 544216
63324 544216 531777 520737 511685 504970 500120 495919 490903 483961 474780 463848 452010 439958 428035
63311 428035 416337 404922 394021 384062 375442 368303 362581 358170 354836 352058 349221 346036 342618
63298C42618l377l052k485j990k060k622k785j892o19k96j213k226k191j213k53
63283C14344k4n24j236j502r69JN73L57j41j70L70R79J373J792K419K808K303
63266C22753R85j11j8J093K175K581K639K917L423L860M168M332M011K977J793
63251C59578J470K374L927N339O202O454O337O466P391Q910J0241J0975J1459
63238D47123J2087J2776J3354J3959J4805J5838J6932J8015J8840J9027J8593
63227F21349J8029J7602J7097J6526J6582J7663J8925J9086J8065J7076J7005
63216H15005J7360J7039J5690J3901J2288J0729Q474M974N65l733p194j0052j2941
63203H82105j5878j8145j9167j9145j8699j8133j7234j5672j3455j1057r031p336
$$ plain form
63298 342618 339241 336189 333704 331714 329654 327032 324247 322355 321736 321440 320227 318001 315810 314597 314344
63283 314344 314320 313796 312560 311058 310089 310090 310663 311020 310879 310709 311079 312058 313431 315223 317642 320450 322753
63266 322753 323738 323627 323609 324702 326877 329458 332097 335014 338437 342297 346465 350797 354808 357785 359578
63251 359578 361048 363422 367349 372688 378890 385344 391681 398147 405538 414448 424689 435664 447123
63238 447123 459210 471986 485340 499299 514104 529942 546874 564889 583729 602756 621349
63227 621349 639378 656980 674077 690603 707185 724848 743773 762859 780924 798000 815005
63216 815005 832365 849404 865094 878995 891283 902012 910486 915460 916025 912292 905098 895046 882105
63203 882105 866227 848082 828915 809770 791071 772938 755704 740032 726577 715520 706489 699153
63191F99153n272k359Q45L336M972O628Q764J0700J1750J2423J3641J5198J6019
63178G95798J5893J5793J6310J6790J6560J6070J6014J6062J5352J3874J2307
63167I66823J0764Q673N879K933R4l075o973j1405j5956k0248k3693k5793k6874
63154H61149k7833k8838k9109k8218k6774k5373k3802k1863k0068j8740j7258
63143E93273j5055j2771j1389j0811j0202r269q178o778n032l778l784m302l926
63130D87998k724k032k173j931o65N94Q70O77R42J571K030K403K866K893K038
63115D95357R96Q42J565K201K225J930J677J590J873K637L359L252K286J250P08
63100E23748L92j33o43m38P29K152K732K107J094Q01J370J966K053K037K456L049
$$ plain form
63191 699153 693881 691522 692367 695703 700675 707303 716067 726767 738517 750940 764581 779779 795798
63178 795798 811691 827484 843794 860584 877144 893214 909228 925290 940642 954516 966823
63167 966823 977587 986260 992139 995072 995166 992091 985118 973713 957757 937509 913816 888023 861149
63154 861149 833316 804478 775369 747151 720377 695004 671202 649339 629271 610531 593273
63143 593273 578218 565447 554058 543247 533045 523776 515598 508820 503788 500010 496226 491924 487998
63130 487998 485274 483242 481069 479138 478473 479067 479937 480614 481556 483127 485157 487560 490426 493319 495357
63115 495357 496353 497195 498760 500961 503186 505116 506793 508383 510256 512893 516252 519504 521790 523040 523748
63100 523748 524140 524007 523364 522926 523655 525807 528539 530646 531740 532541 533911 535877 537930 539967 542423 545472
63084E45472L223L060L221L961M829N380N727O181O676O796O377N896O164P533
63070F20496R492J1170J2148J2582J2751J2896J3443J4759J6541J7961J8698J9356
63058G92293K0620K2447K4446K6646K9320L2263L4803L6542L7747L9025M0671
63047A136823M2383M3508M3704M3299M2834M2381M1673M0810M0267M0102L9846
63036A597630L9314L8931L8891L8580L7284L5005L2042K8177K2877J6105Q414
63025A933250L78p654j5386k2494k8678l3732l7722m1059m3972m5851m5702m3411
63013A567967l9993l6320l2289k7593k2552j7556j2391o810j306L431P441J1259
63001A393288J5055J8617K1830K4589K6594K7876K9038L0386L1236L0840K9597
$$ plain form
63084 545472 548695 551755 554976 558937 563766 569146 574873 581054 587730 594526 600903 606799 612963 620496
63070 620496 629988 641158 653306 665888 678639 691535 704978 719737 736278 754239 772937 792293
63058 792293 812913 835360 859806 886452 915772 948035 982838 1019380 1057127 1096152 1136823
63047 1136823 1179206 1222714 1266418 1309717 1352551 1394932 1436605 1477415 1517682 1557784 1597630
63036 1597630 1636944 1675875 1714766 1753346 1790630 1825635 1857677 1885854 1908731 1924836 1933250
63025 1933250 1933628 1925974 1910588 1888094 1859416 1825684 1787962 1746903 1702931 1657080 1611378 1567967
63013 1567967 1527974 1491654 1459365 1431772 1409220 1391664 1379273 1372463 1371157 1374588 1382029 1393288
63001 1393288 1408343 1426960 1448790 1473379 1499973 1527849 1556887 1587273 1618509 1649349 1678946
62990A678946K8473K7671K6721K5529K4287K2557J9539J5209J0146M320k879j1216
62978A869303j9340k6265l2331l8290m4211m9561n3776n6418n7325n6961n6106
62967A378719n5008n3212n0385m6815m3008l9330l6167l3803l1999l0143k7992
62956I30857k5857k4052k2643k1675k1018k0050j8313j6421j5478j5444j5131
62945G14775j4035j3110j3149j3457j2951j1764j0833j0389r853q937p994p311
62933E80992o762o243n821n447m887m139l528l350l582l923l947l310k093r36
62919E23024o12j368k711l840m316m274m011l470k421j161n84j188k367l135l265
62904D84301l241l330l359l240l022k553j776j204j314j560j003J03M23m67j405
$$ plain form
62990 1678946 1707419 1735090 1761811 1787340 1811627 1834184 1853723 1868932 1879078 1883398 1880519 1869303
62978 1869303 1849963 1823698 1791367 1753077 1708866 1659305 1605529 1549111 1491786 1434825 1378719
62967 1378719 1323711 1270499 1220114 1173299 1130291 1090961 1054794 1020991 988992 958849 930857
62956 930857 905000 880948 858305 836630 815612 795562 777249 760828 745350 729906 714775
62945 714775 700740 687630 674481 661024 648073 636309 625476 615087 605234 596297 588303 580992
62933 580992 574230 567987 562166 556719 551832 547693 544165 540815 537233 533310 529363 526053 523960 523024
62919 523024 522412 521044 518333 514493 510177 505903 501892 498422 496001 494840 494256 493068 490701 487566 484301
62904 484301 481060 477730 474371 471131 468109 465556 463780 462576 461262 459702 458699 458802 459225 458758 457353
62889D57353j442j141j346j673j293m92k72p74j173r59m33k0J63M4l57o88n99
62872D44898k98l04o90j119j407j540j301n21K99L69l44r85q93k89K52N33P17
62855D37377R17J091J117R14N48K51J35ol85p90q17l73K82Q77J165Q45m0p78o66
62836D41664j0K17k24m20L25J414J759J255Q52J243K107K629K431J842J499J774
62820D60357K468L038L236L396L963M870N667O139O451O667O555O055N628N758
62806E30248O389P160P957Q845R608R888R800R891J0328J0710J0884J1393J2700
62793F55801J4398J5815J7083J8951K1620K4398K6625K8424L0427L3081L6401
62782I23024M0082M3695M6971N0054N3344N7031O0810O3915O5427O4848O2576
$$ plain form
62889 457353 455911 454770 453424 451751 450458 449966 449694 448920 447747 446788 446355 446335 446498 446542 446185 445497 444898
62872 444898 444600 444296 443606 442487 441080 439540 438239 437718 438017 438386 438042 437057 436164 435875 436127 436660 437377
62855 437377 438294 439385 440502 441416 441964 442215 442350 442344 441959 441169 440352 439979 440261 441138 442303 443148 443108 442330 441664
62836 441664 441654 441871 441647 441227 441552 442966 444725 445980 446832 448075 450182 452811 455242 457084 458583 460357
62820 460357 462825 465863 469099 472495 476458 481328 486995 493134 499585 506252 512807 518862 524490 530248
62806 530248 536637 543797 551754 560599 570207 580095 589895 599786 610114 620824 631708 643101 655801
62793 655801 670199 686014 703097 722048 743668 768066 794691 823115 853542 886623 923024
62782 923024 963106 1006801 1053772 1103826 1157170 1214201 1275011 1338926 1404353 1469201 1531777
62771A531777N9487N5758N0523M3085L4012K4345J4213L140q436j9102k8015l5607
62759A725180m2449m8353n2926n6260n8530n9617n9576n8854n7597n5384n2125
62748A123509m8633m5634m2833l9566l5954l2718l0196k8124k6066k3611k0510
62737G49664j7185j4669j3447j2717j1386r435p578o095m755l621k966k512j647
62724F41651l84O98J509K590M115N488O250O699P360Q390R745J1424J3274J4951
62710G33760J6375J7866J9705K1891K4468K7624L1274L4902L8089M0908M3594
62699A050456M6164M8609N1189N4220N7641O0867O3033O3418O1879N8841N4645
62688A670962M9068M1673L2581K2388J1443k70j2384k3893l3886m2190m9057n4628
$$ plain form
62771 1531777 1591264 1647022 1697545 1740630 1774642 1798987 1813200 1816340 1807904 1788802 1760787 1725180
62759 1725180 1682731 1634378 1581452 1525192 1466662 1407045 1347469 1288615 1231018 1175634 1123509
62748 1123509 1074876 1029242 986409 946843 910889 878171 847975 819851 793785 770174 749664
62737 749664 732479 717810 704363 691646 680260 670825 663247 657152 652397 648776 645810 643298 641651
62724 641651 641267 641965 643474 646064 650179 655667 661917 668616 675976 684366 694111 705535 718809 733760
62710 733760 750135 768001 787706 809597 834065 861689 892963 927865 965954 1006862 1050456
62699 1050456 1096620 1145229 1196418 1250638 1308279 1369146 1432179 1495597 1557476 1616317 1670962
62688 1670962 1720030 1761703 1794284 1816672 1828115 1827845 1815461 1791568 1757682 1715492 1666435 1611807
62676A611807n9002o2397o4832o5881o5148o2851n9629n6011n2329m8945m6031
62665I68751m3220l9910l6060l2311k9233k6777k4644k2770k1136j9401j7209
62654F56080j4916j3391j2979j3004j2675j2065j1750j1640j0910r201p326o318
62642E19905o192o054n247l965k806k130j917j930j935j853j805j930k160k235
62628D77746j931j267n32j13j50l55l41j01P3J75N93J416K076K042J668J833K858
62611D85690M127M856M967N026N557O526P501Q240Q977J0072J1507J3049J4720
62598E90815J6748J9024K1096K2805K4490K6356K8123K9514L0537L0993L0287
62587H70788K8225K5428K2345J8476J3284P466K307k017o480j1532j6379k0137
$$ plain form
62676 1611807 1552805 1490408 1425576 1359695 1294547 1231696 1172067 1116056 1063727 1014782 968751
62665 968751 925531 885621 849561 817250 788017 761240 736596 713826 692690 673289 656080
62654 656080 641164 627773 614794 601790 589115 577050 565300 553660 542750 533549 526223 519905
62642 519905 513713 507659 502412 498447 495641 493511 491594 489664 487729 485876 484071 482141 479981 477746
62628 477746 475815 474548 474016 473903 473753 473398 473057 472956 473029 473204 473797 475213 477289 479331 480999 482832 485690
62611 485690 489817 494673 499640 504666 510223 516749 524250 532490 541467 551539 563046 576095 590815
62598 590815 607563 626587 647683 670488 694978 721334 749457 778971 809508 840501 870788
62587 870788 899013 924441 946786 965262 978546 986012 988319 986302 979822 968290 951911 931774
62575I31774k2874k5084k6832k7943k8581k9020k9091k8285k6415k3963k1711
62564F41975k0080j8789j7222j5259j3489j2387j1556j0271q582p254o575n905
62552D94606m699l352k617k528k405j814j047o10n43m19N7P00J137J348J597J933
62536D81344K073J962J977K395K999L574M329N357O160O338O459P447R277J1065
62522E52756J2449J3958J5969J8134K0193K2471K5062K7318K8735K9877L1663
62511G98585L4024L5959L6791L6783L6462L5793L4178L1008K6161K0156J3811
62500A139711P700J820m054r799j4749j8155j9798k0169j9980j9493j8398j6410
62488I88226j3725j0767p748m709j755J089M046P200J0096J2189J3579J4685J5251
$$ plain form
62575 931774 908900 883816 856984 829041 800460 771440 742349 714064 687649 663686 641975
62564 641975 621895 603106 585884 570625 557136 544749 533193 522922 514340 507086 500511 494606
62552 494606 489907 486555 483938 481410 479005 477191 476144 475534 474991 474572 474629 475329 476466 477814 479411 481344
62536 481344 483417 485379 487356 489751 492750 496324 500653 506010 512170 518508 524967 532414 541691 552756
62522 552756 565205 579163 595132 613266 633459 655930 680992 708310 737045 766922 798585
62511 798585 832609 868568 905359 942142 978604 1014397 1048575 1079583 1105744 1125900 1139711
62500 1139711 1147411 1149231 1145177 1135378 1120629 1102474 1082676 1062507 1042527 1023034 1004636 988226
62488 988226 974501 963734 955986 951277 949522 950611 954657 961857 971953 984142 997721 1012406 1027657
62475A027657J4304J1421P409L435k03m039q467j3204j7662k1473k4645k7292
62463I47241k9415l0896l1640l1606l0763k9291k7772k6740k5917k4363k1739
62452F37099j8906j6752j4976j2706j0001p866o863o507o068n238m002k498j163
62439E23553l33L25J374K554K937K198J020K7q80j914k899l737m674n761o621
62424E07169p092p435p621p149o001n003m767m962n093n275n575n331m093k702
62410D29070k441l296l959l524k433j657j525j607j393q64m23l34k75L07J382
62395D07028K306K649K618K549K470K399K535K890L164L253L376L541L522L608
62381D47908M487O015O938O553N811N970O837P347P305P488Q293R332J0224J0913
$$ plain form
62475 1027657 1041961 1053382 1060791 1064226 1064023 1059984 1051517 1038313 1020651 999178 974533 947241
62463 947241 917826 886930 855290 823684 792921 763630 735858 709118 683201 658838 637099
62452 637099 618193 601441 586465 573759 563758 555892 549029 542522 536454 531216 527214 524716 523553
62439 523553 523220 523545 524919 527473 530410 532608 533628 533655 532775 530861 527962 524225 519551 513790 507169
62424 507169 500077 492642 485021 477872 471871 466868 462101 457139 452046 446771 441196 435865 431772 429070
62410 429070 426629 423333 419374 415850 413417 411760 410235 408628 407235 406371 405948 405614 405339 405646 407028
62395 407028 409334 411983 414601 417150 419620 422019 424554 427444 430608 433861 437237 440778 444300 447908
62381 447908 452395 458410 465348 471901 477712 483682 490519 497866 505171 512659 520952 530284 540508 551421
62367E51421J1280J1297J1502J2574J4462J6567J8686K1003K3333K5264K7013
62356G44402K9307L2278L5165L7206L8095L7537L5155L1101K6128K0798J5189
62345A082361R478M213k43m025p333j0257j3101j6356j9969k3198k5376k6487
62333I49707k6780k6318k5141k3536k1823k0135j8545j7098j5687j4208j2906
62322G27530j2157j1910j1799j1782j2167j2959j3683j4032j4111j3934j3322
62311E85674j2451j1860j1582j0918r537q165p576p464o928n746m421l275k221
62298D83530j292o23O7J237K597L136K396J209P31J204K086K982L861M539M723
62283E12383M612M874N751O720P296P698Q303Q900R100R128R528J0209J0576J0584
$$ plain form
62367 551421 562701 573998 585500 598074 612536 629103 647789 668792 692125 717389 744402
62356 744402 773709 805987 841152 878358 916453 953990 989145 1020246 1046374 1067172 1082361
62345 1082361 1091839 1096052 1095809 1091784 1084451 1074194 1061093 1044737 1024768 1001570 976194 949707
62333 949707 922927 896609 871468 847932 826109 805974 787429 770331 754644 740436 727530
62322 727530 715373 703463 691664 679882 667715 654756 641073 627041 612930 598996 585674
62311 585674 573223 561363 549781 538863 529326 521161 513585 506121 499193 493447 489026 485751 483530
62298 483530 482238 481615 481682 482919 485516 488652 491048 492257 492988 494192 496278 499260 503121 507660 512383
62283 512383 516995 521869 527620 534340 541636 549334 557637 566537 575637 584765 594293 604502 615078 625662
62269F25662J0897J1852J3018J3977J4823J5533J5678J5359J5703J7605K0468
62258G90575K3008K4973K7126K9759L2149L3586L4104L3957L3004L0877K7330
62247A120448K2346J6315J0204N041R88k738o891j1496j6222k0976k5720k9984
62235A061315l2995l4429l4842l5154l5630l5537l4037l1322k8424k6011k3793
62224G09141k1389j8996j6955j5186j3529j2140j1025r726q063o672o077n790
62212E63593n153m457m267m138l256k024j630k031j868n72Q21J357J421J672J901
62197E41369J753J650K109K853L382L907M924O319P572Q424Q822Q623P974P505
62183F17186P611P868P767P537P590P604O928N686M721M587N153O110P305Q639
$$ plain form
62269 625662 636559 648411 661429 675406 690229 705762 721440 736799 752502 770107 790575
62258 790575 813583 838556 865682 895441 927590 961176 995280 1029237 1062241 1093118 1120448
62247 1120448 1142794 1159109 1169313 1174354 1175342 1172604 1165713 1154217 1137995 1117019 1091299 1061315
62235 1061315 1028320 993891 959049 923895 888265 852728 818691 787369 758945 732934 709141
62224 709141 687752 668756 651801 636615 623086 610946 599921 590195 582132 575460 569383 563593
62212 563593 558440 553983 549716 545578 542322 540298 538668 536637 534769 534197 535018 536375 537796 539468 541369
62197 541369 543122 544772 546881 549734 553116 557023 561947 568266 575838 584262 593084 601707 609681 617186
62183 617186 624797 632665 640432 647969 655559 663163 670091 675777 680498 685085 690238 696348 703653 712292
62169G12292J0080J1759J3787J6061J8508K1210K3934K5961K6817K6826K6412
62158I33647K5186K2357J7975J3061Q583M781J485j470m294p257j0502j3963j7412
62145I72177k0389k2292k2840k2334k1231j9683j7834j6195j5184j4451j3244
62134G66500j1347r207p200n323l683k680k455k517k188j216J46J492K531L140
62120G25993L278K903K057J038K26l44j016j884k504k485k154k187k807l763m948
62105G11403o461q067r093r037p970o272m279k261m77Q59J584J663J489J800K970
62090F67851M416N215N292N498O409P504P844P273O569O575P422Q641R769J0736
62076G67014J1686J2648J3538J4411J5394J6345J6911J7035J7029J6970J6482
$$ plain form
62169 712292 722372 734131 747918 763979 782487 803697 827631 853592 880409 907235 933647
62158 933647 958833 981190 999165 1012226 1020809 1025590 1027075 1025605 1021311 1014054 1003552 989589 972177
62145 972177 951788 929496 906656 884322 863091 843408 825574 809379 794195 779744 766500
62134 766500 755153 745946 738746 733423 729740 727060 724605 722088 719900 718684 718830 720322 722853 725993
62120 725993 729271 732174 734231 735269 735495 735151 734135 732251 729747 727262 725108 722921 720114 716351 711403
62105 711403 704942 696875 687782 678745 670775 664503 660224 657963 657486 658345 659929 661592 663081 664881 667851
62090 667851 672267 677482 682774 688272 694681 702185 710029 717302 723871 730446 737868 746509 756278 767014
62076 767014 778700 791348 804886 819297 834691 851036 867947 884982 902011 918981 935463
62065I35463J5504J4800J5100J6067J6694J6600J6095J5162J3180R953O257K969
62053A093844J62k550n258p782j0137j2534j5107j7973k1254k4678k7345k8445
62041I20943k8208k7747k7851k8196k7875k6533k4777k3466k2729k1856k0220
62030F41485j8067j6168j4810j3533j1913j0175q816q020p715p835q098p857o721
62017E01757n238m376m325m364m039l800m101m438l943k624j393q96r27r96q60
62002D55437l30P90K257L284L373K882K390J870J009M5m59n12p23j328j883k081
61986D66021k218k613l100l507m067m985n900o284o020n292m211l061k422k538
61972D09803k830k691k463k866l617l565k352j032o53r53j006o03k63j95j9N10
$$ plain form
62065 935463 950967 965767 980867 996934 1013628 1030228 1046323 1061485 1074665 1084618 1090875 1093844
62053 1093844 1094006 1091456 1086198 1078416 1068279 1055745 1040638 1022665 1001411 976733 949388 920943
62041 920943 892735 864988 837137 808941 781066 754533 729756 706290 683561 661705 641485
62030 641485 623418 607250 592440 578907 566994 556819 548003 539983 532268 524433 516335 508478 501757
62017 501757 496519 492143 487818 483454 479415 475615 471514 467076 463133 460509 459116 458220 457293 456297 455437
62002 455437 455107 455897 458154 461438 464811 467693 470083 471953 472962 473007 472548 472036 471313 469985 468102 466021
61986 466021 463803 461190 458090 454583 450516 445531 439631 433347 427327 422035 417824 414763 412341 409803
61972 409803 406973 404282 401819 398953 395336 391771 389419 388387 387734 386781 385775 385172 384909 384714 384695 385205
61956C85205J103J473J723K026K244K209K187K645L605M581N227N737O404P092
61942D33461P504P755Q259R011R597J0023J0944J2643J4217J4506J3546J2429
61930E63895J1764J1070R819Q344P172O155M856L393K185J063n13k359l525l588
61916F19731l259l225l086k079m60P54J263J853L122M665N854O774P774Q573Q434
61901F56688P108N064K907R37p80k352l984n626o855p484p988q816r509r243q196
61886F01871p536p786q078p474o377n985o694p658p783o770n259m270m338n011
61872E10852n315m803l842k832j705m12P08J512K503M054N528N875N060M234M527
61857E25944O102Q271J0170J1322J1953J2754J4134J5792J7252J8445J9421J9850
$$ plain form
61956 385205 386308 387781 389504 391530 393774 395983 398170 400815 404420 409001 414228 419965 426369 433461
61942 433461 440965 448720 456979 465990 475587 485610 496554 509197 523414 537920 551466 563895
61930 563895 575659 586729 596548 604892 612064 618219 623075 626468 628653 629716 629203 626844 623319 619731
61916 619731 616472 613247 610161 608082 607622 608376 609639 611492 614614 619279 625133 631907 639681 648254 656688
61901 656688 663796 668860 671767 672704 671924 669572 665588 659962 653107 645623 637635 628819 619310 610067 601871
61886 601871 594335 586549 578471 570997 564620 558635 551941 544283 536500 529730 524471 520201 515863 510852
61872 510852 505537 500734 496892 494060 492355 491943 492651 494163 496666 500720 506248 512123 517183 521417 525944
61857 525944 532046 540317 550487 561809 573762 586516 600650 616442 633694 652139 671560 691410
61845F91410J9454J8642J7992J7249J5558J2675R260N902K612n16k888m084m465
61832G98801m712n121n587n946n897m924k678N06L712O023P029O976O398N476
61818H00056L887J420j434m018o463r441j2938j5887j7313j7389j6997j6735j6693
61805F70055j6824j7044j7087j6597j5380j3511j1404r754r085r138r046q302
61793E16883p203o240n463m690l912l190k494j977k025k636l128k946k451k404
61779D66124k884l317l372l280l228l085k785k491k248j894j491j397j703j957
61765D30992j713j055l53K59Q56J349J524J392J217J121R15M29q9j89K12O24M62
61748D37953l11j264k077k756l214l066k121r34l07l42l67N9N55O03L79M43P44
$$ plain form
61845 691410 710864 729506 747498 764747 780305 792980 802240 808142 810754 810238 807350 803266 798801
61832 798801 794089 788968 783381 777435 771538 766614 763936 764442 768154 774177 781206 788182 794580 800056
61818 800056 803943 805363 803929 799911 793448 784007 771069 755182 737869 720480 703483 686748 670055
61805 670055 653231 636187 619100 602503 587123 573612 562208 552454 543369 534231 525185 516883
61793 516883 509680 503440 497977 493287 489375 486185 483691 481714 479689 477053 473925 470979 468528 466124
61779 466124 463240 459923 456551 453271 450043 446958 444173 441682 439434 437540 436049 434652 432949 430992
61765 430992 429279 428224 427871 428130 428986 430335 431859 433251 434468 435589 436504 436933 436844 436655 436867 437491 437953
61748 437953 437642 436378 434301 431545 428331 425265 423144 422210 421903 421561 421194 421253 421808 422411 422790 423233 423977
61731D23977N34n30j680j775n80R92J866J742J080M99L28N78J044J445J603J557
61715D32680J476J408J246Q66L25k10o40j002j314j510j613j933k780l925m596
61700D18478m308l481k970l002k998k471j671j173j203j609k217k877l342l444
61686C81712l282l024k661k208j940k150k741l340l694l636k917j490J9O79K51
61671C49578n34q53o29k72M6M90J057J378J091K81n76j045j087r75r54r73p66
61654C45257j81N81J061R83O20O07J177J754J659J119J073J884K796K950K451
61639C65791J961J712J499J309J237R85J29j109k053k567l181m056m539m079l035
61624C50004k190j848j806j794j615j057j62N60N53j55r62j301j124q14p43r13
$$ plain form
61731 423977 424511 423981 422301 420526 419946 420938 422804 424546 425626 426125 426453 427031 428075 429520 431123 432680
61715 432680 434156 435564 436810 437676 438001 437791 437151 436149 434835 433325 431712 429779 426999 423074 418478
61700 418478 414170 410689 407719 404717 401719 399248 397577 396404 395201 393592 391375 388498 385156 381712
61686 381712 378430 375406 372745 370537 368597 366447 363706 360366 356672 353036 350119 348629 348648 349327 349578
61671 349578 349044 348191 347562 347290 347336 347826 348883 350261 351352 351633 351057 350012 348925 347950 346996 346023 345257
61654 345257 345076 345657 346718 347701 348321 348928 350105 351859 353518 354637 355710 357594 360390 363340 365791
61639 365791 367752 369464 370963 372272 373509 374494 374623 373514 371461 368894 365713 361657 357118 353039 350004
61624 350004 347814 345966 344160 342366 340751 339694 339532 340092 340645 340490 339528 338227 337103 336289 335546 334633
61608C34633j022r65j125j906l049l779l686l152k757k643k628k646k782l026
61594B99467l175l003k439j681j075p35m08KNq50k012k294j371k43P0k69n10m86
61576B78993n28n82j85P24J531J611Q78k79j275j585j149n41l84n73m28L23J139
61559B77690J409J223J094J095P54j18q81p06L16J134R57K01q8M64J250J548J217
61542B88559N11k57o41j61J092K213K256J263K14ON94J183J123N70K25M05O26
61525B99781L07l96q77j013j241j683j915j762j635j710j468n32N18Q15L50j37
61509B87402j91L1K84N31P42Q02O78L85p2n12o15m27m48q39r35j73Q15Q45j94
61490B88109j131r66J21J285J841J487L95o12o03L52J130J025O81J107K137K613
$$ plain form
61608 334633 333611 332646 331521 329615 326566 322787 319101 315949 313192 310549 307921 305275 302493 299467
61594 299467 296292 293289 290850 289169 288094 287359 286951 286953 286958 286108 284096 281802 280431 280188 280258 279989 279479 278993
61576 278993 278465 277883 277698 278422 279953 281564 282442 282163 280888 279303 278154 277613 277229 276656 276228 276551 277690
61559 277690 279099 280322 281416 282511 283265 283147 282266 281560 281876 283010 283967 284168 284080 284544 285794 287342 288559
61542 288559 289070 288813 288172 288011 289103 291316 293572 294835 295049 295055 295649 296832 297955 298525 298750 299155 299781
61525 299781 300088 299692 298815 297802 296561 294878 292963 291201 289566 287856 286388 285856 286374 287189 287539 287402
61509 287402 287211 287242 287526 288057 288799 289601 290279 290664 290592 290080 289465 289038 288590 287751 286816 286643 287458 288303 288109
61490 288109 286978 286012 286133 287418 289259 290746 291141 290529 289926 290278 291408 292433 293114 294221 296358 298971
61474B98971J926O95r1j06L14P41R33P92M09O6k8k0k20o17p89m43J92O99J036
61455C04460J387J559J048j23j119j198n72N7M85J007J561J573Q02j54n31j98
61439C10044M17R69J386J630J634J421J115Q34P02R05J495K144K357K024J591
61424C30668J496J618J497J043N95L35M8l36m20J8M81M08J29M02J138J359O72
61407C41151p1m5L90L59k06p02q49q45p47m74l38p35j338j270l40O37R24P05N01
61388C36707L27o5m84m09K79J071J409J217R09R43J364J739J585R61M62N86J196
61371C49797J737J836J549J141Q45Q19J154J752K265K350K088K012K544L429L975
61356C79293L867L448L162L056L010L190L840M778N455N493M994M356L955L919
$$ plain form
61474 298971 300897 301592 301501 301395 301709 302450 303383 304175 304584 304650 304622 304602 304382 303765 302976 302533 302725 303424 304460
61455 304460 305847 307406 308454 308331 307212 306014 305442 305499 305984 306991 308552 310125 310927 310773 310242 310044
61439 310044 310461 311430 312816 314446 316080 317501 318616 319450 320152 321057 322552 324696 327053 329077 330668
61424 330668 332164 333782 335279 336322 336917 337252 337300 336964 336544 336562 337043 337451 337580 337982 339120 340479 341151
61407 341151 341080 341035 341425 341784 341578 340876 340027 339182 338435 337961 337623 336888 335550 334280 333940 334577 335501 336206 336707
61388 336707 337034 336969 336485 336076 336355 337426 338835 340052 340961 341904 343268 345007 346592 347553 348015 348601 349797
61371 349797 351534 353370 354919 356060 356905 357724 358878 360630 362895 365245 367333 369345 371889 375318 379293
61356 379293 383160 386608 389770 392826 395836 399026 402866 407644 413099 418592 423586 427942 431897 435816
61342D35816L983L666K854K095K001K474K790K425J499M59l54q41j113j479k096
61327D54179k709k916k689k303j842j140l34O0j54l62J95J428K400K418J861J821
61311D49913K885M469N441N436N296O068P744R244R603Q915Q006P440O998O105
61297E43563M585K878J495M13o96j766k284k132j940k295k895l066k837k963l809
61282E26251m829n234m838m062l388k960k521j709n25N08R43J047J452K211K639
61267E04985K267J491J042J106J354J605K141L229M610N547N487M571L446K532
61253E45413J778J190J160J879K670K574J556N77L13L48j02j105k051k447k307
61238E51446j935j659j703k011k240k128j806j504j098k42J001K017K297K043
$$ plain form
61342 435816 439799 443465 446319 448414 450415 452889 455679 458104 459603 460062 459708 458867 457754 456275 454179
61327 454179 451470 448554 445865 443562 441720 440580 440246 440306 440152 439790 439985 441413 443813 446231 448092 449913
61311 449913 452798 457267 462708 468144 473440 479508 487252 496496 506099 515014 523020 530460 537458 543563
61297 543563 548148 551026 552521 552934 552238 550472 548188 546056 544116 541821 538926 535860 533023 530060 526251
61282 526251 521422 516188 511350 507288 503900 500940 498419 496710 496185 496693 497636 498683 500135 502346 504985
61267 504985 507252 508743 509785 510891 512245 513850 515991 519220 523830 529377 534864 539435 542881 545413
61253 545413 547191 548381 549541 551420 554090 556664 558220 558797 559110 559458 559356 558251 556200 553753 551446
61238 551446 549511 547852 546149 544138 541898 539770 537964 536460 535362 535120 536121 538138 540435 542478
61224E42478J902K228K871L612M404N095N311M966M627M946N811O458O370N679
61210F06758M747L892L473L645L870L412K524K459L795N482O161N864N625N929
61196F67636O466P135Q181R359R871R393Q463P614O696N311L494J748P12P69J596
61181G54444K099J296o83k806m282n061n390n511n768o345o847o780o414o530
61167F95422p220p734p689p604p905q214q084p785p740p777p473o858o156n233
61153E91950l859k359j374j091j055p45o7N64M13j044l431n501o203n641m711
61138E55846l997l351k493j583r98p36k70Q75K520M002M912N439N869O234O658
61123E78927P600R185J0700J1388J1579J2271J3654J4874J5328J5433J5832J6531
$$ plain form
61224 542478 544380 546608 549479 553091 557495 562590 567901 572867 577494 582440 588251 594709 601079 606758
61210 606758 611505 615397 618870 622515 626385 629797 632321 634780 638575 644057 650218 656082 661707 667636
61196 667636 674102 681237 689418 698777 708648 718041 726504 734118 740814 746125 749619 751367 752079 752848 754444
61181 754444 756543 757839 757156 754350 750068 745007 739617 734106 728338 721993 715146 708366 701952 695422
61167 695422 688202 680468 672779 665175 657270 649056 640972 633187 625447 617670 610197 603339 597183 591950
61153 591950 588091 585732 584358 583267 582212 581467 581400 581964 582377 581333 577902 572401 566198 560557 555846
61138 555846 551849 548498 546005 544422 543424 542688 542418 543293 545813 549815 554727 560166 566035 572269 578927
61123 578927 586527 595712 606412 617800 629379 641650 655304 670178 685506 700939 716771 733302
61111G33302J7127J7374J7188J6530J5614J4839J4289J3581J2296J0342P829N070
61099H95381K597Q01m73j588k548l317m359o104q013r129r477r936j0709j1009
61085H22117j0481r740r193q434p292o342n818n028l536j903o20P36K498M035
61071G60999M725N019N644O538P431Q693J0713J3009J4903J6446J7888J8968J9589
61058I10565K0537K2464K4776K6471K7515K8436K9263K9925L1078L3391L6364
61047A220785L8966M0917M2461M3498M4092M5167M7402M9973N1722N3056N5170
61036A733209N7892N9912O0928O1926O3350O4561O5148O5414O5527O5558O6309
61025B429734O8611P1844P4734P7599Q2101Q8583R5481J01759J08240J16208J26491
$$ plain form
61111 733302 750429 767803 784991 801521 817135 831974 846263 859844 872140 882482 890311 895381
61099 895381 897978 898779 898306 896718 894170 890853 886494 880390 872377 863248 853771 843835 833126 822117
61085 822117 811636 801896 792703 784269 776977 770635 764817 759789 756253 754350 753730 754466 756964 760999
61071 760999 765724 770743 776387 782925 790356 799049 809762 822771 837674 854120 872008 890976 910565
61058 910565 931102 953566 978342 1004813 1032328 1060764 1090027 1119952 1151030 1184421 1220785
61047 1220785 1259751 1300668 1343129 1386627 1430719 1475886 1523288 1573261 1624983 1678039 1733209
61036 1733209 1791101 1851013 1911941 1973867 2037217 2101778 2166926 2232340 2297867 2363425 2429734
61025 2429734 2498345 2570189 2644923 2722522 2804623 2893206 2988687 3090446 3198686 3314894 3441385
61014C441385J40417J59762J85010K15576K52377K98089L54099M19726M95575
61005E962016N84299O85686P94421R05806J017653J116031J159100J090304Q84449
60996A4199765N84136K82667O4226m0880m9205Q913R9964J71248J50958j1240
60986A5460552k98291o27728r04445j073860j133331j109438j034266r35796q34943
60977G508454p42692o60716n86614n18395m54927l95416l40162k90702k48313
60968C270517k13078j84521j61981j44097j29092j16039j04989r5763q7503p9665
60958A953789p2452o6045o0238n5069n0916m7734m5025m2711m1139m0079l8660
60947A393721l6586l4456l2526l0242k7515k5405k4644k4397k3409k1811k0787
$$ plain form
61014 3441385 3581802 3741564 3926574 4142150 4394527 4692616 5046715 5466441 5962016
61005 5962016 6546315 7232001 8026422 8932228 9949881 11065912 12225012 13315316 14199765
60996 14199765 14783901 15066568 15130794 15089914 15040709 15049622 15149586 15320834 15471792 15460552
60986 15460552 15162261 14534533 13630088 12556228 11422897 10313459 9279193 8343397 7508454
60977 7508454 6765762 6105046 5518432 5000037 4545110 4149694 3809532 3518830 3270517
60968 3270517 3057439 2872918 2710937 2566840 2437748 2321709 2216720 2120957 2033454 1953789
60958 1953789 1881337 1815292 1755054 1699985 1649069 1601335 1556310 1513599 1472460 1432381 1393721
60947 1393721 1357135 1322679 1290153 1259911 1232396 1206991 1182347 1157950 1134541 1112730 1091943
60936A091943k0815k1222k1291k0949k0349j9508j8510j7584j6824j6115j5408
60925H83368j4801j4358j4063j3816j3318j2203j0606r278q767q694q358p788
60913G47318p557p689p549o893o213n803n230m219l314l090l265l331l525m273
60899F75367n041m860l935l578m330n175n075m396m128m540n287o207p150p583
60885F04082p320p204q111r478r868q903p673p132p078o949o693o426n950n113
60871E00184m197l614l462l582l658l229k115q83l03l25k59J9r5o73q25k8R84
60854D73939J306J096J005R77M65n16j345j593j335q36m05l01l92k72k8l96j690
60837D69679l089l617l368l110l064k876k440k038j844j896k336l056l450l172
$$ plain form
60936 1091943 1071128 1049906 1028615 1007666 987317 967809 949299 931715 914891 898776 883368
60925 883368 868567 854209 840146 826330 813012 800809 790203 780925 772158 763464 755106 747318
60913 747318 739761 732072 724523 717630 711417 705614 700384 696165 692851 689761 686496 683165 679640 675367
60899 675367 670326 665466 661531 657953 653623 648448 643373 638977 634849 630309 625022 618815 611665 604082
60885 604082 596762 589558 581447 571969 562101 553198 545525 538393 531315 524366 517673 511247 505297 500184
60871 500184 495987 492373 488911 485329 481671 478442 476327 475444 475141 474816 474557 474576 474481 473808 472983 472955 473939
60854 473939 475245 476341 477346 478323 478788 478272 476927 475334 473999 473163 472758 472457 472065 471793 471765 471369 469679
60837 469679 466590 462973 459605 456495 453431 450555 448115 446077 444233 442337 440001 436945 433495 430323
60823D30323k764k848l063k712k073k055k686l093k931k765k916l074l201l774
60809C90368m684m929l989k682k045k067k114k036k115k365k527k511k351j963
60795C51990j408j093j250j452j081j29Q20J285J235R07N67L72K86J71O6J62L79
60778C51827L62L5j52J64O54P04K56o7L36J390K370K514J759Q19L90L58J40l40
60760C63519n62l71l24q33j509j802j749j658j443r11l58k82o33r06q44o22m12
60743C48300k38j62k39l93o60j342k495l498l707l323l068l122l075k785k566
60728C17627k477k178j671j363j245p44K62J039J050P08N53L90n9l33J06Q53J153
60711C13671J134J467J957J632L81o01l30Q05J866K509K840K767K179J385P86
$$ plain form
60823 430323 427559 424711 421648 418936 416863 414808 412122 409029 406098 403333 400417 397343 394142 390368
60809 390368 385684 380755 376766 374084 372039 369972 367858 365822 363707 361342 358815 356304 353953 351990
60795 351990 350582 349489 348239 346787 345706 345577 346397 347682 348917 349824 350391 350763 351049 351220 351286 351448 351827
60778 351827 352189 352224 352072 352236 352890 353594 353850 353783 354119 355509 357879 360393 362152 362971 363361 363719 363859 363519
60760 363519 362957 362586 362262 361429 359920 358118 356369 354711 353268 352357 351999 351717 351084 350178 349334 348712 348300
60743 348300 348062 347900 347661 347268 346608 345266 342771 339273 335566 332243 329175 326053 322978 320193 317627
60728 317627 315150 312972 311301 309938 308693 307949 308211 309250 310300 311008 311561 311951 311892 311559 311665 312518 313671
60711 313671 314805 316272 318229 319861 320242 319641 319311 320116 321982 324491 327331 330098 332277 333662 334448
60696C34448L79J1k20j99r0J1L10Q08R70N11M0K69Q62R31M08Q1L01N77N44M81
60676C41433N56M13m2j87L78R80O57n02j457j583j304j375j931k484k590k317
60660C28645k013j762j283n08M7j31o82o84J30J037J370J363J583K023K272K208
60644C33615K058J918J720J513J329R16M0r96j542j374r55q53j142j452j442j158
60628C32195r27r26q69l61M61R72R00O84P60Q42L86n28j248j366j019m63J90Q23
60610C30506J217J249R74N21O6j88k13j91j79O7O17J010P49K8m82m62j46K23O23
60591C35989R56J003Q51R38J445J930J774Q99j07m81N6J000J548J441J267J670
60575C52179K551L301L651L849M161M607N141N651N857N692N700O486P724Q286
$$ plain form
60696 334448 334827 334838 334618 334419 334329 334340 334650 335458 336428 336939 336979 337248 338110 339041 339449 339530 339831 340408 340952 341433
60676 341433 341989 342402 342360 342173 342551 343531 344188 343686 342229 340646 339342 337967 336036 333552 330962 328645
60660 328645 326632 324870 323587 323079 323126 322995 322313 321629 321759 322796 324166 325529 327112 329135 331407 333615
60644 333615 335673 337591 339311 340824 342153 343069 343109 342113 340571 339197 338242 337389 336247 334795 333353 332195
60628 332195 331268 330342 329473 329112 329573 330545 331445 332129 332889 333731 334117 333589 332341 330975 329956 329493 329683 330506
60610 330506 331723 332972 333946 334467 334533 334345 334132 333941 333762 333829 334446 335456 336205 336233 335751 335289 335143 335366 335989
60591 335989 336945 337948 338799 339737 341182 343112 344886 345785 345678 345197 345253 346253 347801 349242 350509 352179
60575 352179 354730 358031 361682 365531 369692 374299 379440 385091 390948 396640 402340 408826 416550 424836
60561D24836P494N713L641J610j20j102j286j386k061k933l007j912k79J091J959
60546D32258K516L008L654M644N924P076P690P850Q116Q903J0021J0901J1219
60533E23780J1044J0435R222P367N229L181J156r85k841l748l706l526l760l968
60519E48880l421k302j686k278l491l980k982r84R14K082K747L471M488N615O563
60504E53636P302Q207R890J2593J5709J8270K0008K1600K3579K5476K6417K6254
60492G68941K5511K4496K2993K0748J7692J3743Q923L709j291o096j1240j6841
60480H71288k2202k6477k9317l0724l0816k9937k8623k7173k5529k3631k1590
60469E75269j9428j7144j5093j3797j3154j2344j0805q894p308o273n646n322
$$ plain form
60561 424836 432330 438043 441684 443294 443174 442072 440786 439400 437339 434406 431399 429487 429208 430299 432258
60546 432258 434774 437782 441436 446080 452004 459080 466770 474620 482736 491639 501660 512561 523780
60533 523780 534824 545259 554481 561848 567077 570258 571414 570429 567588 563840 560134 556608 552848 548880
60519 548880 545459 543157 541471 539193 535702 531722 528740 527756 528670 530752 533499 536970 541458 547073 553636
60504 553636 560938 569145 579035 591628 607337 625607 645615 667215 690794 716270 742687 768941
60492 768941 794452 818948 841941 862689 880381 894124 903047 906756 905465 899369 888129 871288
60480 871288 849086 822609 793292 762568 731752 701815 673192 646019 620490 596859 575269
60469 575269 555841 538697 523604 509807 496653 484309 473504 464610 457302 451029 445383 440061
60457D40061n174m889m302l677l316l180l142l329l826m299m303l785k963k017
60443C87859j146o92p14p48l91M0j02q85j752k249k320k004j359p01m32n00l88
60426C71516J87R31J363J282P86J48k71k95j27qL17J252K465K926K214J228J072
60409C86986J595J663P72l03n90j6P96J356J530J334R53P86J019J331J358J322
60393D01892J691K343K656K499K484L046L783M058L734L003K005J048P05J123
60379D36070J574J386R09J005J780K589L017L168L049K570K127K293K847K935
60365D67319K355J823J741J616J103P33J049J767K475L405M774N978O319O083
60351E08540O047O209N919N066M214L572K682J290k06j421k511l759n028n894
$$ plain form
60457 440061 434887 429998 425696 422019 418703 415523 412381 409052 405226 400927 396624 392839 389876 387859
60443 387859 386713 386021 385307 384559 384168 384208 384106 383221 381469 379220 376900 374896 373537 372836 372404 371904 371516
60426 371516 371703 372634 373997 375279 376065 376213 375942 375647 375520 375512 375829 377081 379546 382472 384686 385914 386986
60409 386986 388581 390244 391016 390713 390123 390107 390903 392259 393789 395123 396076 396862 397881 399212 400570 401892
60393 401892 403583 405926 408582 411081 413565 416611 420394 424452 428186 431189 433194 434242 434947 436070
60379 436070 437644 439030 439939 440944 442724 445313 448330 451498 454547 457117 459244 461537 464384 467319
60365 467319 469674 471497 473238 474854 475957 476690 477739 479506 481981 485386 490160 496138 502457 508540
60351 508540 514587 520796 526715 531781 535995 539567 542249 543539 543333 541912 539401 535642 530614 524720
60337E24720o092n647m791l852l080k533k261k421k941l290l008k422k329k933
60323D77120l558l442k523j279k19L53M25L84Q20J963L442M739N702O528P411
60308D97866Q357R205R721R733R281Q615P923P144O062M563K708N84j899m851
60294E75012q009j0612j1990j2212j1822j0990r426p259n420m657m588m290l580
60281D70157k998k753k416j790j331j450j924k314k498k484k087j274n38n35j394
60266D42371k617l453l276j974l17M36j93j200j247l22L76J72k62j61J50p2o34
60249D27777o36J82J069J364J221J051Q86O03L07P4k79p77j002o45n3K15J17k0
60231D31454o2M5N72J512K092J551L48k58K48J213K045K801L423L414K817K517
$$ plain form
60337 524720 518628 512981 508190 504338 501258 498725 496464 494043 491102 487812 484804 482382 480053 477120
60323 477120 473562 470120 467597 466318 466099 466452 466877 467261 468081 470044 473486 478225 483927 490455 497866
60308 497866 506223 515428 525149 534882 544163 552778 560701 567845 573907 578470 581178 581762 579863 575012
60294 575012 567003 556391 544401 532189 520367 509377 499951 492692 487272 482615 478027 473737 470157
60281 470157 467159 464406 461990 460200 458869 457419 455495 453181 450683 448199 446112 444838 444300 443765 442371
60266 442371 439754 436301 433025 431051 430734 431170 430977 429777 428530 428208 428584 428756 428494 428333 428483 428411 427777
60249 427777 427141 427323 428392 429756 430977 432028 432914 433517 433824 433898 433619 432842 431840 431195 431142 431357 431474 431454
60231 431454 431392 431437 432009 433521 435613 437164 437512 437254 437502 438715 440760 443561 446984 450398 453215 455732
60215D55732K972L408L044K453K707L751M581M721M563M437M288M228M480M721
60201E10086M334L487L112L563M079L961L573L617L941L748K694J217j19j106
60187E50187j750k069k225k478k845k940k396j468r64j447k602l593l970l917
60173E15523l688l228k522j832j335q22j85K06M8k98k61L9m9p22j494j909j887
60156D95584j379l47P67J223R26O04P39Q49L65l10k68N60J244J095M66J94N92
60139E02904J324J950K274K297K163K190K641L322L552K868J670R02J024J532
60125E32613J621J100N16M69J034J737K006J729J373J409J649J471P34P7N0M27
60109E50015O88P74Q72P93K30n60r88j033j260j839k247k081j671j520j617j671
$$ plain form
60215 455732 458704 462112 465156 467609 470316 474067 478648 483369 487932 492369 496657 500885 505365 510086
60201 510086 514420 517907 521019 524582 528661 532622 536195 539812 543753 547501 550195 551412 551293 550187
60187 550187 548437 546368 544143 541665 538820 535880 533484 532016 531052 529605 527003 523410 519440 515523
60173 515523 511835 508607 506085 504253 502918 502096 501911 502117 502165 501867 501606 501645 501596 500874 499380 497471 495584
60156 495584 494205 493858 494625 495848 496774 497378 498117 498966 499331 499021 498753 499313 500557 501652 502118 502312 502904
60139 502904 504228 506178 508452 510749 512912 515102 517743 521065 524617 527485 529155 530057 531081 532613
60125 532613 534234 535334 535850 536319 537353 539090 541096 542825 544198 545607 547256 548727 549461 549538 549588 550015
60109 550015 550703 551477 552349 553142 553372 552812 551824 550791 549531 547692 545445 543364 541693 540173 538556 536885
60093E36885j641j653j597j255p30l67k39k5N03J068J149N95k42r92j676k437
60077E27346l057l171k898k791l055l215k889k400k325k763l429m113m580m401
60063D82259l512k642k536k974l219l237l539l952l594k291j070p50q35l50P77
60048D48535J809K191J947J410J070J371K163K666K408J899J871K194K165J686
60034D75385J402J657J944J629P35k58j099j865k556k978l086l241l891m940n661
60019D53177n404m394l580l658m449n275n704n704n356m673l668k416j064J04
60005C97936P23O26N6m70n60k60k4l02r85j350q24K35Q84P27L31L63Q10J289J691
59986D00896K089K266J886J031J62m11o54n28m2L95J42q84j972k347j948j272
$$ plain form
60093 536885 535244 533591 531994 530739 530009 529642 529403 529378 529881 530949 532098 532693 532451 531459 529783 527346
60077 527346 524289 521118 518220 515429 512374 509159 506270 503870 501545 498782 495353 491240 486660 482259
60063 482259 478747 476105 473569 470595 467376 464139 460600 456648 453054 450763 449693 448943 448108 447758 448535
60048 448535 450344 452535 454482 455892 456962 458333 460496 463162 465570 467469 469340 471534 473699 475385
60034 475385 476787 478444 480388 482017 482752 482494 481395 479530 476974 473996 470910 467669 463778 458838 453177
60019 453177 447773 443379 439799 436141 431692 426417 420713 415009 409653 404980 401312 398896 397832 397936
60005 397936 398659 399285 399341 398871 398311 398051 398027 397725 396740 395390 394566 394801 395685 396412 396743 397106 397916 399205 400896
59986 400896 402985 405251 407137 408168 408330 407919 407265 406737 406695 407090 407232 406348 404376 402029 400081 398809
59970C98809o90k53oq0m69r07j069p42J09J228K023J922J026J02k03J8L12N97
59952D01727J106J722J937J549R44M75L1n70j053j042o46l72m69p25p84m64J84
59935D03550Q70J172R31M53K15M15R42J560J986K011J809J829K125K183J740J372
59919D25163J676K205J950P52n14j127j173q89j78Q53J521J257L37m28m94J01
59903D31012R49J548J590J274J114J373J847K254K496K461K085J723K044L170
59889D56940M319M673M308L959M031M272M251L849L284K930L084L736M520M988
59875E13144M883M138K821J214k20j117j483j574j570j447j145q09o96q08p47
59860E14584k01M60N54J24N6Q68J912K341K308K509K945L087K956L021K997J969
$$ plain form
59970 398809 398119 397866 397860 397780 397311 396404 395335 394593 394702 395930 397953 399875 400901 401003 400800 400818 401130 401727
59952 401727 402833 404555 406492 408041 408985 409460 409491 408921 407868 406826 406180 405808 405339 404614 403830 403366 403550
59935 403550 404420 405592 406523 406976 407191 407606 408548 410108 412094 414105 415914 417743 419868 422051 423791 425163
59919 425163 426839 429044 430994 431746 431232 430105 428932 428043 427865 428718 430239 431496 431833 431405 430911 431012
59903 431012 431961 433509 435099 436373 437487 438860 440707 442961 445457 447918 450003 451726 453770 456940
59889 456940 461259 465932 470240 474199 478230 482502 486753 490602 493886 496816 499900 503636 508156 513144
59875 513144 518027 522165 524986 526200 525980 524863 523380 521806 520236 518789 517644 516835 516139 515331 514584
59860 514584 514383 514843 515397 515521 515577 516445 518357 520698 523006 525515 528460 531547 534503 537524 540521 542490
59844E42490o6j750j930q96L68J284J539P21j073k853l782m106m395m334l206
59829E18011j339%K16N5L74R39R30K04n15o87p13j356k604l540l502k922k700
59812E00851l059l519l800m049m214l912l074k153j449q34l80n49j433k334k577
59797D63515k237j722j122m20O4K6k94l89j12K44K76k27r64j001L65K418L369
59780D61789K354M98n19l70L2M5r4J37R66K139K954K771J874J372J766K248J950
59763D81912J285J249J881K356K304K133K156K223K294K603L201L859M372M553
59749E18381M085K956J861J566K034K676L216L705L902L448K567J949J948K401
59735E56695L040L510L205J909M58OO18J306J371R87M74j19o11o10j35K62J62
$$ plain form
59844 542490 542424 540674 538744 537848 538216 539500 541039 541760 540687 537834 534052 529946 525551 521217 518011
59829 518011 516672 516672 516888 516943 517317 518256 519186 519390 518875 518188 517475 516119 513515 509975 506473 503551 500851
59812 500851 497792 494273 490473 486424 482210 478298 475224 473071 471622 470788 470408 469859 468426 466092 463515
59797 463515 461278 459556 458434 458014 458078 458104 457810 457421 457309 457553 457829 457602 456638 455637 456002 458420 461789
59780 461789 464143 464641 464122 463752 463784 463829 463735 463872 464838 466977 469931 472702 474576 475948 477714 479962 481912
59763 481912 483197 484446 486327 488683 490987 493120 495276 497499 499793 502396 505597 509456 513828 518381
59749 518381 522466 525422 527283 528849 530883 533559 536775 540480 544382 547830 550397 552346 554294 556695
59735 556695 559735 563245 566450 568359 568817 568823 569441 570747 572118 573105 573579 573460 572849 572239 572104 572366 572528
59718E72528l36r72j491j570j125p08r36j535j744j545j663k173k123r20O33J266
59702E55586O29o43j772k324k220j713j139m96M23J425J860J331J36j139k119
59687E47825k641k684k437k136j838j582j646k145k605k538k244k316k527k188
59673E16298j550j714k873l796l527k653k195k194k144j977j823j360m70N5o13
59658D87464j951k597k000p60N47J856K849K759J465M3l50J74N91L81no8p0o20
59640D89708j754k823l284l205k958k694k322j786j134n30l25p96j613j974j598
59625D60912j161j326j789j923j909k341k964k875j969j193j152j406j462j547
59611D35895j867j912j157N6R35J204J157J125J312J721K006J705R39M38O05J022
$$ plain form
59718 572528 572192 571220 569729 568159 567034 566326 565390 563855 562111 560566 558903 556730 554607 553687 554320 555586
59702 555586 556215 555572 553800 551476 549256 547543 546404 545908 546331 547756 549616 550947 551083 549944 547825
59687 547825 545184 542500 540063 537927 536089 534507 532861 530716 528111 525573 523329 521013 518486 516298
59673 516298 514748 513034 510161 506365 502838 500185 497990 495796 493652 491675 489852 488492 488022 488077 487464
59658 487464 485513 482916 480916 480156 480703 482559 485408 488167 489632 489675 489325 489499 490090 490471 490466 490398 490328 489708
59640 489708 487954 485131 481847 478642 475684 472990 470668 468882 467748 467218 466893 466097 464484 462510 460912
59625 460912 459751 458425 456636 454713 452804 450463 447499 444624 442655 441462 440310 438904 437442 435895
59611 435895 434028 432116 430959 431015 431950 433154 434311 435436 436748 438469 440475 442180 443119 443557 444162 445184
59595D45184J201J236J399J591J668J722J667J080k5q58q73n08l62k32K55O54
59579D54799L00n19r42q70r29j310j599j680j820j784r26N74J545J252K75m23
59563D45943n90m11J01P81R96L71m72n82J10Q41J114J110J092J042J034J406K186
59546D56072K797K713K275K475L934O251Q406R691J0305J1080J2442J3530J2608
59533E54579Q708K871k561n842o805o189m689k912j593j161j243j106n60p7j45
59518E31275p58j530j980j868j564j889l147m510m884m311l854m077m338l906
59504D88659l131k953l590m257m134l316k633k656l014k856j988j175j046j160
59490D50750p07K00P05N55M28Q29J442J834K053K198K052J628J423J750K233K525
$$ plain form
59595 445184 446385 447621 449020 450611 452279 454001 455668 456748 456723 455865 454992 454484 454122 453890 454145 454799
59579 454799 455099 454580 453638 452768 451839 450529 448930 447250 445430 443646 442720 443294 444839 446091 446366 445943
59563 445943 445353 444942 445043 445824 446820 447191 446719 446137 446247 447088 448202 449312 450404 451446 452480 453886 456072
59546 456072 458869 461582 463857 466332 470266 476517 484923 494614 504919 515999 528441 541971 554579
59533 554579 563287 566158 563597 557755 550950 544761 540072 537160 535567 534406 533163 532057 531497 531420 531275
59518 531275 530517 528987 527007 525139 523575 521686 518539 514029 509145 504834 500980 496903 492565 488659
59504 488659 485528 482575 478985 474728 470594 467278 464645 461989 458975 456119 454131 452956 451910 450750
59490 450750 450043 450243 450948 451503 451931 452760 454202 456036 458089 460287 462339 463967 465390 467140 469373 471898
59474D71898K907L673M339M198L356K587K277K091J631R40L68K20N57J133J586
59459E03761J816J999K165K167K189K797M139N544O300O412O117N199L472J589
59445E55666N06K48k3o93j270j371j385j723k041j751r68l97m16p47r73r78p48
59428E40936j55Q59J980K820L387M024M887N733O430P331Q920J1211J3749J6041
59414F28153J7819J9093K0136K1120K1296J8920J2757L876m582r664j0594q767
59402G29563o273m334k631n2L522O262N779J542m576j0085j3637j5095j4871j3612
59388F61502j2013j0415q798p292o215n555m929m195l548k936k049j036m70m01
59374E91650k49J82L82J83J82O36Q71M05j37J9O55J188J696K495L248L465L444
$$ plain form
59474 471898 474805 478478 482817 487015 490371 492958 495235 497326 498957 499897 500265 500485 501042 502175 503761
59459 503761 505577 507576 509741 511908 514097 516894 521033 526577 532877 539289 545406 550605 554077 555666
59445 555666 556172 556420 556397 555704 554434 553063 551678 549955 547914 546163 545195 544798 544382 543635 542662 541684 540936
59428 540936 540781 541640 543620 546440 549827 553851 558738 564471 570901 578232 587152 598363 612112 628153
59414 628153 645972 665065 685201 706321 727617 746537 759294 763170 758588 748924 738330 729563
59402 729563 723290 718956 716325 716273 719795 726057 731836 733378 728802 718717 705080 689985 675114 661502
59388 661502 649489 639074 630276 622984 616769 611214 606285 602090 598542 595606 593557 592521 592051 591650
59374 591650 591401 591583 591965 592148 592330 592966 593837 594242 594105 594124 594779 595967 597663 600158 603406 606871 610315
59357F10315L787M330M478M367M778N974P372Q345Q775Q823Q726Q695Q683Q422
59343G05870P942P660P601P065N628L858K432J221j63j463k355l253m640o079
59329G31324o965p688q903j0099j0260r649r489r871r551q068o612o240o504o535
59315F14890o395o452o280n213l501k062j256n72N42K066L583M749N431N518M643
59300F09691K364j122m645o871p496p296p099p093p045o647n724m436l403l104
59286E40074l183k750j467J26J348J981K147K127K366L232M523N641O287O729
59272E69181P241P711P896P811P708P780P927P766P032O002N205M552L335J350
59258F58497m90j324j526k075l095l874l997l633k947k093j650k043k598k192
$$ plain form
59357 610315 614102 618432 622910 627277 632055 638029 645401 653746 662521 671344 680070 688765 697448 705870
59343 705870 713812 721472 729073 736138 741766 745624 748056 749277 749114 747651 745296 742043 737403 731324
59329 731324 724359 716671 707768 697669 687409 677760 668271 658400 648849 640781 634169 627929 621425 614890
59315 614890 608495 602043 595763 590550 587049 584987 583731 583159 583701 585767 589350 594099 599530 605048 609691
59300 609691 612055 610933 606288 599417 591921 584625 577526 570433 563388 556741 551017 546581 543178 540074
59286 540074 536891 534141 532674 532800 534148 536129 538276 540403 542769 546001 550524 556165 562452 569181
59272 569181 576422 584133 592029 599840 607548 615328 623255 631021 638053 644055 649260 653812 657147 658497
59258 658497 658007 656683 655157 653082 649987 646113 642116 638483 635536 633443 631793 629750 627152 624960
59244F24960r16j09m53r88m95R61K376L118L308L221K859K130J164L91J42J56
59228F41825k50j308k508l519m717o273p323p077o250o248p099p427o520n234
59214E70072m582m521m497m301l874l089k142j615j729k017j933j266k6J377J973
59199E37830J170j15k62R63K130K206J700J386J103N60K27N25R62R74R38J402
59183E53699J953J749R20M31P27J239J235O39j0m4P62J883K457K199J639J336
59167E72814J295J308J436J749K067K172J991J397K82r19j387q73j70k35j298
59152E81629k913m424n206n011m326l929l896l639l016k670k986l502l782m090
59138E28239m689n116m762l654k272j021k84l75r65j169o15J16N45J028J965K961
$$ plain form
59244 624960 624044 623935 623482 622494 621999 622960 625336 628454 631762 634983 637842 639972 641136 641527 641669 641825
59228 641825 641575 640267 637759 634240 629523 623250 615927 608850 602600 596352 589253 581826 575306 570072
59214 570072 565490 560969 556472 552171 548297 545208 543066 541451 539722 537705 535772 534506 534480 535857 537830
59199 537830 539000 538885 538623 539586 541716 543922 545622 547008 548111 548671 548898 549423 550385 551359 552297 553699
59183 553699 555652 557401 558321 558752 559479 560718 561953 562592 562582 562538 563300 565183 567640 569839 571478 572814
59167 572814 574109 575417 576853 578602 580669 582841 584832 586229 586511 585592 584205 583332 583162 582927 581629
59152 581629 578716 574292 569086 564075 559749 555820 551924 548285 545269 542599 539613 536111 532329 528239
59138 528239 523550 518434 513672 510018 507746 506725 506441 506066 505101 503932 503317 503433 503978 505006 506971 509932
59122E09932L523L932M675N503N823N677N599N781O055O403O915P416P621P474
59108E92329P028O337N712N589N774N457M325L039K127J213o8j214j701j948k488
59093F31511k869k412j557j262j430j144l12J43k18p35q02p30j143k137l333m241
59077F07329m501m104l511l190l150l301l884m979n878n722m731l917l650l318
59063E49493k569j977k089k525k559k140j833j959k233k228j887j538j458j474
59049E21024j149m48L0k12p77p86k3Q35J167J175J378J714J584P37k55o17k76
59032E25101J65K95M32J080K206L295L991M322M486M776N561O812P812P809O991
59017E85134O253O032N920N440M617L679K728J866J131K77q46j722j648p49J72
$$ plain form
59122 509932 513455 517387 522062 527565 533388 539065 544664 550445 556500 562903 569818 577234 584855 592329
59108 592329 599357 605694 611406 616995 622769 628226 632551 635590 637717 638930 638862 637648 635947 633999 631511
59093 631511 628642 626230 624673 623411 621981 620837 620525 620668 620450 619715 618913 618183 617040 614903 611570 607329
59077 607329 602828 598724 595213 592023 588873 585572 581688 576709 570831 565109 560378 556461 552811 549493
59063 549493 546924 544947 542858 540333 537774 535634 533801 531842 529609 527381 525494 523956 522498 521024
59049 521024 519875 519427 519457 519245 518468 517682 517659 518494 519661 520836 522214 523928 525512 526249 525994 525377 525101
59032 525101 525266 525561 525993 527073 529279 532574 536565 540887 545373 550149 555710 562522 570334 578143 585134
59017 585134 591387 597419 603339 608779 613396 617075 619803 621669 622800 623077 622231 620509 618861 618112 618284
59002F18284P70J388K080K459K577K994L630L731L220K973L261L133K039Q73M91
58987F53903L51l48j131j153p87r76j562j570p84J38Q87J678K486L117L921N371
58971F63541P040P993Q145Q290Q777R075Q738Q030P382O942O756O779O623N824
58957G69935M390K678P94j365l511n057n861o478p500q926j0181j0658j0295r688
58943F98277r415r230q417o932n630n103m934m412l413k271j346j029j472k073
58929F32600j916j017k70L1M37Q33K07j401k214j158M07P27J89J87O55N66J05
58912F28968L35J095J150L90J46J188K850M267N185N506N338N521O903Q911J0002
58897F87755R628Q750Q334Q420Q670Q924R086R246R842J0938J1718J1525J0942
$$ plain form
59002 618284 619054 620442 622522 624981 627558 630552 634182 637913 641133 644106 647367 650500 652539 653412 653903
58987 653903 654254 653906 652775 651622 650835 649859 648297 646727 645943 646081 646968 648646 651132 654249 658170 663541
58971 663541 670581 678574 686719 695009 703786 712861 721599 729629 737011 743953 750709 757488 764111 769935
58957 769935 774325 777003 777797 776432 772921 767864 762003 755525 748025 739099 728918 718260 707965 698277
58943 698277 688862 679632 671215 664283 658653 653550 648616 644204 640791 638520 637174 636145 634673 632600
58929 632600 630684 629667 629397 629428 629865 630698 630905 629504 627290 626132 626539 627266 627455 627642 628297 628863 628968
58912 628968 629303 630398 631548 631938 632084 633272 636122 640389 645574 651080 656418 661939 668842 677753 687755
58897 687755 697383 706133 714467 722887 731557 740481 749567 758813 768655 779593 791311 802836 813778
58884H13778J0868J1011J0507R401Q220O646M192J680L02m97k322n140p230p890
58870H53526q227q953r293q688p813p198o361n110m286m427m922n220n680o590
58856G60758p387p589p503p454p213o708o330o191o019o082p005q344q636p398
58842F60899n867n208n231n388n812o560o948o479n549m594l487k276j547j492
58828E94461j514j278j118r84k19J092J771J338R56J690K901L291K659J714R75
58813F07735O90J125K062K627K284J469Q03M11K63L47J15j100k761l349k481j537
58797F08703j634k266k737l455m747n650n251m201l662l551l040k104j376j055
58783E63974r82j209j546j182K84J994K833K728K236J604R36N08R3j094k940l963
$$ plain form
58884 813778 824646 835657 846164 855565 863785 870431 874623 876303 876605 876108 873786 868646 861416 853526
58870 853526 845299 836346 827053 818365 810552 803354 796993 791883 787597 783170 778248 773028 767348 760758
58856 760758 753371 745782 738279 730825 723612 716904 710574 704383 698364 692282 685277 676933 668297 660899
58842 660899 655032 649824 644593 639205 633393 626833 619885 613406 607857 603263 599776 597500 595953 594461
58828 594461 592947 591669 590551 589567 589348 590440 592211 593549 594505 596195 599096 602387 605046 606760 607735
58813 607735 608425 609550 611612 614239 616523 617992 618795 619206 619469 619816 619931 618831 616070 612721 610240 608703
58797 608703 607069 604803 602066 598611 593864 588214 582963 578762 575100 571549 568509 566405 565029 563974
58783 563974 562992 561783 560237 559055 559339 561333 564166 566894 569130 570734 571670 572178 572271 571177 568237 564274
58767E64274l331k341k577l628m007l522l116k938k313j369j106j744k295j935
58753E28052q55L36J173J409J234J295J841K216J880J431J761K638L209L427L900
58738E54947M612M990N024N255N656N628N108M712M677M580M178L747L407K868
58724F19389K088J546J666K313K971L181K886K567K824L540L911L580L234L629
58710F59325M492M992M737L758K016l37k548l898m525n060n819o887q485j0543
58696F31218j2250j2785j2262j1339j0282r072q022p492p216o673n883n237m769
58683E17936m198l485k794k164j683j587j784j650r05k00j85m74k08P39J860K933
58667E02151M135N420O440O977P062O839O619O624O482N461L505J380m52k220
$$ plain form
58767 564274 560943 558602 556025 552397 548390 544868 541752 538814 536501 535132 534026 532282 529987 528052
58753 528052 527197 527533 528706 530115 531349 532644 534485 536701 538581 540012 541773 544411 547620 551047 554947
58738 554947 559559 564549 569573 574828 580484 586112 591220 595932 600609 605189 609367 613114 616521 619389
58724 619389 621477 623023 624689 627002 629973 633154 636040 638607 641431 644971 648882 652462 655696 659325
58710 659325 663817 668809 673546 677304 679320 678983 676435 672537 668012 662952 657133 650246 641761 631218
58696 631218 618968 606183 593921 582582 572300 563228 555206 547714 540498 533825 527942 522705 517936
58683 517936 513738 510253 507459 505295 503612 502025 500241 498591 497686 497486 497301 496827 496619 497358 499218 502151
58667 502151 506286 511706 518146 525123 532185 539024 545643 552267 558749 564210 567715 569095 568643 566423
58653E66423l787m330l723l195l632m209l743k568j866j793j584j107j040j657
58639E28189k404k612k010q26J11r6j187j751j141m82r09j761j696p76l3L26Q24
58622E11766J297J109N75P41J760K687K938K869K891L074L516M195M469L710K374
58607E49971J552J540J707J675J657J751J732J578J427J115M14l41o12m88m84
58592E64194o44m60L67J635K951L900M196M093M346N327O602P600Q137Q051P200
58577F27495O226O207P002P116N966M923N149N753N483N019N906Q075J0128J1527
58563G21975J2825J4158J5045J5437J5726J5902J5764J5437J4741J2787R374N936
58551H85107L763K178k9k286l174k944l137m114m891n221n932p234q361r002r638
$$ plain form
58653 566423 562636 558306 554583 551388 547756 543547 539804 537236 535370 533577 531993 530886 529846 528189
58639 528189 525785 523173 521163 520337 520448 520352 519165 517414 516273 515791 514882 513121 511425 510649 510616 510942 511766
58622 511766 513063 514172 514747 515488 517248 519935 522873 525742 528633 531707 535223 539418 543887 547597 549971
58607 549971 551523 553063 554770 556445 558102 559853 561585 563163 564590 565705 566119 565778 565166 564678 564194
58592 564194 563550 563090 563457 565092 568043 571943 576139 580232 584578 589905 596507 604107 612244 620295 627495
58577 627495 633721 639928 646930 654046 660012 664935 670084 675837 681320 686339 692245 700320 710448 721975
58563 721975 734800 748958 764003 779440 795166 811068 826832 842269 857010 869797 879171 885107
58551 885107 888870 891048 891019 888733 885559 882615 879478 875364 870473 865252 859320 852086 843725 834723 825085
58536H25085j0436j1085j1597j2082j2017j1025r874r381q835p139m935l804l778
58523G09097l487k605k211k720l237l136k719k207j537j175j699k589k761k190
58509F74824j702j466j091q68j379k137k106j344o93k90J10M5p95j247j83J366
58493F61044J606Q51Q05J564J822J691K619M547N697N405M771M371L793L558M938
58478G09082P471R070R108Q989R342R080P777O384N051K708l34j973j505q74j640
58463G77736k870l237l061k914k162k74J915L496M676N749O243N980N663N665
58449H02605N467M743L762K403K66k022l184l198l221l604l697l528l631l338
58435G89823j556O94J119k89j088j60J117J839K853M269M619L580K864L339L769
$$ plain form
58536 825085 814649 803564 791967 779885 767868 756843 746969 737588 728753 721614 716679 712875 709097
58523 709097 705610 703005 700794 698074 694837 691701 688982 686775 685238 684063 682364 679775 677014 674824
58509 674824 673122 671656 670565 669697 668318 666181 664075 662731 662038 661748 661858 661903 661108 659861 659678 661044
58493 661044 662650 663501 664306 665870 667692 669383 672002 676549 682246 687651 692422 696793 700586 704144 709082
58478 709082 716553 725623 734731 743720 753062 762142 769919 776303 781354 784062 783728 781755 780250 779376 777736
58463 777736 774866 771629 768568 765654 763492 763218 765133 768629 773305 779054 785297 791277 796940 802605
58449 802605 808072 812815 816577 818980 819246 817224 814040 810842 807621 804017 800320 796792 793161 789823
58435 789823 788267 788961 790080 789791 788703 788543 789660 791499 794352 798621 803240 806820 809684 813023 816792
58420H16792L435L366L872L493J710J05m27j067k415l077k362j793k427l106k872
58405H13227k660k973k491p11N16n0q97l81P54J422K347M200N690N653N141N428
58389H34215N788N153M156L740L477L003L228M402M959M022L189L977N417N957
58375H94683N904O208O579O577O828P565P728O948O525P031P161O364O248P718
58361I90067R141R144Q881R610J0424J0258R882R926R268P398N960N977N972M866
58347A106774M146N013O036N965O214Q012R673R494Q959J0156J2160J2852J2497
58334A217951J2743J3779J4801J5723J6378J5881J4544J4172J4844J4169J1458
58323A376443R505J0044J0921J0212R641J1017J2695J2811J2706J3795J4450J3451
$$ plain form
58420 816792 820227 823593 827465 830958 832668 832773 832346 831279 828864 825787 823425 821632 819205 816099 813227
58405 813227 810567 807594 805103 804392 804908 804858 803961 803580 804334 805756 808103 812303 817993 823646 828787 834215
58389 834215 840003 845156 849312 853052 856529 859532 862760 867162 872121 876143 879332 883309 888726 894683
58375 894683 900587 906795 913374 919951 926779 934344 942072 949020 955545 962576 969737 976101 982349 990067
58361 990067 999208 1008352 1017233 1026843 1037267 1047525 1057407 1067333 1076601 1083999 1089959 1095936 1101908 1106774
58347 1106774 1110920 1115933 1121969 1127934 1134148 1142160 1151833 1161327 1170286 1180442 1192602 1205454 1217951
58334 1217951 1230694 1244473 1259274 1274997 1291375 1307256 1321800 1335972 1350816 1364985 1376443
58323 1376443 1385948 1395992 1406913 1417125 1426766 1437783 1450478 1463289 1475995 1489790 1504240 1517691
58311A517691J3216J5728J8460J8472J7454J8518K0726K1343K0973K1981K3937
58300A728499K4902K5290K6480K7582K7372K7232K8630L0034K9906L0007L2040
58289B037974L4015L3904L3832L6331L9624M1009M1794M4188M6600M6926M7264
58278B483461N0314N4186N6024N7493O1201O5103O6291O7169P1581P7855Q2025
58267C192703Q5167R0919R8385J04208J09393J17307J26987J35019J41920J50326
58257D352334J59065J65569J71706J80676J90759J98858K07315K20024K34771
58248F081077K46970K58166K72952K90188L05316L18714L33556L48182L59143
58239H814264L69177L83505M00795M16365M31179M48693M66315M79812M92843
$$ plain form
58311 1517691 1530907 1546635 1565095 1583567 1601021 1619539 1640265 1661608 1682581 1704562 1728499
58300 1728499 1753401 1778691 1805171 1832753 1860125 1887357 1915987 1946021 1975927 2005934 2037974
58289 2037974 2071989 2105893 2139725 2176056 2215680 2256689 2298483 2342671 2389271 2436197 2483461
58278 2483461 2533775 2587961 2643985 2701478 2762679 2827782 2894073 2961242 3032823 3110678 3192703
58267 3192703 3277870 3368789 3467174 3571382 3680775 3798082 3925069 4060088 4202008 4352334
58257 4352334 4511399 4676968 4848674 5029350 5220109 5418967 5626282 5846306 6081077
58248 6081077 6328047 6586213 6859165 7149353 7454669 7773383 8106939 8455121 8814264
58239 8814264 9183441 9566946 9967741 10384106 10815285 11263978 11730293 12210105 12702948
58230A2702948N11865N35026N56589N78716O07534O41254O74181P08755P50767
58221A8267635P96192Q36308Q72782R14019R60166J006130J055952J118904J194888
58212B7022976J279208J377275J497618J635375J781226J941405K129073K342410
58204D1006566K573826K834526L145514L512208L936638M447255N085047N868787
58196G2410367O810314P953750R355466J1033923J2984388J5217328J7704229
58189A53469765K0299293K2803892K5055170K6717801K6892490K4215970J7784094
58182C17238475Q158839k638746j2249595j9172259k3103749k4521478k4168298
58175B19543189k2778157k0942309j9022929j7167153j5408965j3746651j2162083
$$ plain form
58230 12702948 13214813 13749839 14306428 14885144 15492678 16133932 16808113 17516868 18267635
58221 18267635 19063827 19900135 20772917 21686936 22647102 23653232 24709184 25828088 27022976
58212 27022976 28302184 29679459 31177077 32812452 34593678 36535083 38664156 41006566
58204 41006566 43580392 46414918 49560432 53072640 57009278 61456533 66541580 72410367
58196 72410367 79220681 87174431 96529897 107563820 120548208 135765536 153469765
58189 153469765 173769058 196572950 221628120 248345921 275238411 299454381 317238475
58182 317238475 325397314 322758568 310508973 291336714 268232965 243711487 219543189
58175 219543189 196765032 175822723 156799794 139632641 124223676 110477025 98314942
58168I8314942j0642643r212325p918397o785820n808138m976624m287822l723542
58160D4959631l252542k855895k529574k262424k033662j832854j662134j517490
58152B7013056j386451j265132j159838j070308r87576r09498q42720p87789p36947
58143A7866797o88141o47233o14642n83003n49904n20512m95866m70430m43251
58134A2853815m20200m02933l86084l67412l50847l37535l23275l06835k92065
58125I666629k80061k67581k54543k44821k38334k30417k20245k12048k06874
58116G511705k00989j93551j88002j84503j78684j69541j61314j55824j49902
58107E929395j42074j35167j30560j26088j21127j17756j15584j11466j05535
$$ plain form
58168 98314942 87672299 78459974 70541577 63755757 57947619 52970995 48683173 44959631
58160 44959631 41707089 38851194 36321620 34059196 32025534 30192680 28530546 27013056
58152 27013056 25626605 24361473 23201635 22131327 21143751 20234253 19391533 18603744 17866797
58143 17866797 17178656 16531423 15916781 15333778 14783874 14263362 13767496 13297066 12853815
58134 12853815 12433615 12030682 11644598 11277186 10926339 10588804 10265529 9958694 9666629
58125 9666629 9386568 9118987 8864444 8619623 8381289 8150872 7930627 7718579 7511705
58116 7511705 7310716 7117165 6929163 6744660 6565976 6396435 6235121 6079297 5929395
58107 5929395 5787321 5652154 5521594 5395506 5274379 5156623 5041039 4929573 4824038
58098D824038j01553j00207r8020r3897r0672q9055q6233q1822p9168p9194p8720
58087C845497p6469p5080p5508p5071p2796p1271p1433p0683o7999o5845o5264
58076C058078o4017o1343n9554n9214n7709n4408n2287n2424n1815m8829m6000
58065B450478m5137m4155m1395l8778l8021l7576l5887l4211l3833l3817l3528
58054B034140l4148l5688l5914l4060l2392l2259l1950l0238k8595k8117k7531
58043A683248k6165k5559k6250k6213k4409k2796k2838k3174k2642k2502k3607
58032A417093k4328k3479k2466k2579k2742k2039k1750k2872k4015k3758k2806
58021A164259k2052k0824j8801j7305j7038j6750j5735j5267j5994j6401j5441
$$ plain form
58098 4824038 4722485 4622278 4524258 4430361 4339689 4250634 4164401 4082579 4003411 3924217 3845497
58087 3845497 3769028 3693948 3618440 3543369 3470573 3399302 3327869 3257186 3189187 3123342 3058078
58076 3058078 2994061 2932718 2873164 2813950 2756241 2701833 2649546 2597122 2545307 2496478 2450478
58065 2450478 2405341 2361186 2319791 2281013 2242992 2205416 2169529 2135318 2101485 2067668 2034140
58054 2034140 1999992 1964304 1928390 1894330 1861938 1829679 1797729 1767491 1738896 1710779 1683248
58043 1683248 1657083 1631524 1605274 1579061 1554652 1531856 1509018 1485844 1463202 1440700 1417093
58032 1417093 1392765 1369286 1346820 1324241 1301499 1279460 1257710 1234838 1210823 1187065 1164259
58021 1164259 1142207 1121383 1102582 1085277 1068239 1051489 1035754 1020487 1004493 988092 972651
58010I72651j4306j3988j3454j1982j0872j1129j1611j1233j0826j1222j1591
57999H40437j1265j1063j1355j0965r466q352q465q503p576o901p382p824p214
57986G24106o546o701o771o124n931o910p717p339o955p698q675q912r120r777
57972F18930r702q347p341p764q065o705m815m135m296m260m510n573o164n089
57958E32164l464k896l004k769k693l518m348m218m051m948n902n418m084l401
57944D77450l301k894k479k736l002k272r42J48J266K692L487L089K743L479M053
57929D80781K933Q69o14j870l959o095o793o569p101q373q992q637q029p146n654
57914D04751m545n064o447o793n847m901m321l248j614m75k35k31j37l43r39j553
$$ plain form
58010 972651 958345 944357 930903 918921 908049 896920 885309 874076 863250 852028 840437
57999 840437 829172 818109 806754 795789 786323 777971 769506 761003 753427 746526 739144 731320 724106
57986 724106 717560 710859 704088 697964 692033 685123 677406 670067 663112 655414 646739 637827 628707 618930
57972 618930 609228 600881 593540 585776 577711 571006 566191 562056 557760 553500 548990 543417 537253 532164
57958 532164 528700 525804 522800 520031 517338 513820 509472 505254 501203 496255 490353 484935 480851 477450
57944 477450 474149 471255 468776 466040 463038 460766 459824 459972 461238 463930 467417 470506 473249 476728 480781
57929 480781 483714 484583 483969 482099 478140 472045 465252 458683 451582 443209 434217 425580 417551 410405 404751
57914 404751 400206 395142 388695 381902 376055 371154 366833 363585 361971 361496 361261 361030 360893 360550 359611 358058
57898C58058k095k584k571j740o53N1N48J027R49J77j77O03J452J172M12L91O96
57881C55716J73r39j525j521j580j526r62p08j677l026l281k741k806l453l461
57866C26683k733k354k438k018r76k86j57K25J101J809K166K617K995K617J716
57851C30967J343J710J992J782J491J349J163J045J206J255Q00M21Q23J385R72
57836C49704k08j027j320j784k273j912q76l44o28r14q91j066j390j149m90m53
57820C32979j139j372o48q6q33k584m291n403n957o201o481o915p016o302n100
57805B72651m136l530k956k527k530k603k192j609j555j876j861j537j509j747
57791B40483j703j389j173p39M13J711K148K061K728M222N203N074M807N176N504
$$ plain form
57898 358058 355963 353379 350808 349068 348415 348466 349014 350041 350990 351167 350990 351593 353045 354217 354629 355020 355716
57881 355716 355889 354950 353425 351904 350324 348798 347836 347128 345451 342425 339144 336403 333597 330144 326683
57866 326683 323950 321596 319158 317140 316164 315878 315721 315946 317047 318856 321022 323639 326634 329251 330967
57851 330967 332310 334020 336012 337794 339285 340634 341797 342842 344048 345303 346103 346524 347347 348732 349704
57836 349704 349496 348469 347149 345365 343092 341180 340304 339960 339332 338418 337527 336461 335071 333922 333432 332979
57820 332979 331840 330468 329820 329734 328901 326317 322026 316623 310666 304465 297984 291069 284053 277751 272651
57805 272651 268515 264985 262029 259502 256972 254369 252177 250568 249013 247137 245276 243739 242230 240483
57791 240483 238780 237391 236218 235479 235892 237603 239751 241812 244540 248762 253965 259039 263846 269022 274526
57776B74526M836L304J810J072J317K180K748K343J322M80q3o72r19k15R79J406
57760B96434O83l67j037j316j167m14N42R40P59O98J020J324J450J657J931K006
57744C05143J922J808J337L72l40j71J85k64j113j384j393k167l289l330k221
57729B95095j294r31k63O66O61k45l37R93K108J761R75J048J327N17j045j924
57713B99112j534l83R07J764J575M34o03p79n75p47j147j239r89o14j07L02n2
57696B95325j292k478k727k269j784j401j030r09j164j284p98K0O26R35J071J000
57680B81841Q85J324K616M294N841P405R396J1880J4819J8379K2517K6709L0504
57667D38410L3906L6767L8133L6553L0732K0099N520j0158k3163l1117l4203l4072
$$ plain form
57776 274526 279362 282666 284476 285548 286865 289045 291793 294136 295458 295938 295855 295183 294264 294049 295028 296434
57760 296434 297117 296750 295713 294397 293230 292816 293358 294298 295057 295755 296775 298099 299549 301206 303137 305143
57744 305143 307065 308873 310210 310582 310242 310071 310256 309992 308879 307495 306102 303935 300646 297316 295095
57729 295095 293801 292870 292607 293273 293934 293689 293352 294345 296453 298214 299189 300237 301564 302081 301036 299112
57713 299112 297578 297195 298102 299866 301441 301875 301272 300493 299918 299171 298024 296785 295796 295182 295075 295377 295325
57696 295325 294033 291555 288828 286559 284775 283374 282344 281435 280271 278987 278189 278209 278835 279770 280841 281841
57680 281841 282726 284050 286666 290960 296801 304206 313602 325482 340301 358680 381197 407906 438410
57667 438410 472316 509083 547216 583769 614501 634600 640120 629962 606799 575682 541479 507407
57655E07407l2218k9545k6599k3543k0331j7264j4943j3456j2116j0328q302o632
57643B92130n560m846m048k907j746j330j848k379k009j139p50q12n21Q0J37m30
57627B62022p70o97j029j943k449k031j529j662j893j547r96q80j035j015q99
57612B41647r14r41r58j217j536j258m07L5m67j217j502j578j825j906j515j108
57596B23333j075j034o78m92r10j537j920k255k653k608k027j782k366k868k339
57581A96789j368j115j465j348m63M45P39L63n31j565k029j596r26q12j050q90
57565A83178l14ql13q44j122r61m45J36L79K11L3K54R33J851K532K335J215K59
57547A89309M63J154Q19l92p25L83J337J037N48R61J345N74l31K50J681J922P25
$$ plain form
57655 507407 475189 445644 419045 395502 375171 357907 342964 329508 317392 307064 298762 292130
57643 292130 286570 281724 277676 274769 273023 271693 269845 267466 265457 264318 263568 262756 262235 262315 262452 262022
57627 262022 261252 260555 259526 257583 255134 253103 251574 249912 248019 246472 245476 244596 243561 242546 241647
57612 241647 240733 239792 238834 237617 236081 234823 234416 234451 233984 232767 231265 229687 227862 225956 224441 223333
57596 223333 222258 221224 220546 220054 219144 217607 215687 213432 210779 208171 206144 204362 201996 199128 196789
57581 196789 195421 194306 192841 191493 191030 191475 192214 192577 192046 190481 188452 186856 185930 185118 184068 183178
57565 183178 182864 182856 182543 181699 180577 179616 179171 179307 179686 179897 179930 180184 181117 182968 185500 187835 189050 189309
57547 189309 189772 190926 191745 191353 190628 191011 192348 193385 193933 194894 196239 196813 196482 196732 198413 200335 201060
57530B01060j63J44O05K09o52j169j193q85l58R8J58L2J86N80Q17R21J144J277
57512B02811R71O19R67J980K911L373L515L344K687J793J086M04o98j993k728
57497B21042k647k141j508q36m78p94j448j667j184l64M54J031R65J30q35j222
57481B08498j228j447j649j052K72J257J235O55K89L28M75M12J42J17P87J778
57465B10869K068J443J056J742K577K237J213J178K442L523L368K611K255K290
57451B40872K198J897J634J501J512J740K110K440K713K985L070K802K504K641
57437B72619L127L469L455L187K634J805J145J125J599K134K741L605M408M684
57423C11737M553M366L943K987J980J722K166K598K779L020L310L325L144L063
$$ plain form
57530 201060 200897 201041 201646 201855 201203 200034 198841 197956 197598 197696 197854 197886 198072 198652 199469 200390 201534 202811
57512 202811 203782 204401 205368 207348 210259 213632 217147 220491 223178 224971 226057 226461 225763 223770 221042
57497 221042 218395 216254 214746 213910 213432 212638 211190 209523 208339 207975 208429 209460 210425 210555 209720 208498
57481 208498 207270 205823 204174 203122 203394 204651 205886 206541 206830 207158 207633 208045 208187 208304 209091 210869
57465 210869 212937 214380 215436 217178 219755 221992 223205 224383 226825 230348 233716 236327 238582 240872
57451 240872 243070 244967 246601 248102 249614 251354 253464 255904 258617 261602 264672 267474 269978 272619
57437 272619 275746 279215 282670 285857 288491 290296 291441 292566 294165 296299 299040 302645 307053 311737
57423 311737 316290 320656 324599 327586 329566 331288 333454 336052 338831 341851 345161 348486 351630 354693
57409C54693K953K651K626L261L847L536K915L247M351M773M100L444L440L354
57395D03191K660K069K278K914L421L835M134L863L176L169M464O211P213P212
57381D59810O536N387M205L845M530N268N101M360L982M158M417M571M724M755
57367E25649M470M124M173M638N154N429N379N021M572M373M469M556M551M844
57353E91402N639O470O709O373O061O225O765P217P237O933O687O613O467O283
57339F83081O550P326P699O964N928O044P446Q887R564R893J0297J0452J0111
57326G90242R740R747R880R833R822J0080J0342J0281R954R517R020Q624Q593
57313I15675Q830Q998R128R468R730R312Q417Q117Q956J0285J1236J1678J1900
$$ plain form
57409 354693 357646 360297 362923 366184 370031 373567 376482 379729 384080 388853 392953 396397 399837 403191
57395 403191 405851 407920 410198 413112 416533 420368 424502 428365 431541 434710 439174 445385 452598 459810
57381 459810 466346 471733 475938 479783 484313 489581 494682 499042 503024 507182 511599 516170 520894 525649
57367 525649 530119 534243 538416 543054 548208 553637 559016 564037 568609 572982 577451 582007 586558 591402
57353 591402 597041 603511 610220 616593 622654 628879 635644 642861 650098 657031 663718 670331 676798 683081
57339 683081 689631 696957 704656 711620 717548 723592 731038 739925 749489 759382 769679 780131 790242
57326 790242 799982 809729 819609 829442 839264 849344 859686 869967 879921 889438 898458 907082 915675
57313 915675 924505 933503 942631 952099 961829 971141 979558 987675 996631 1006916 1018152 1029830 1041730
57300A041730J2063J2281J2617J2775J2452J2090J2466J3447J4021J3772J3325
57289A183039J3216J3276J3483J4194J5101J5086J3809J2517J2466J3418J4319
57278A333924J4681J4582J4082J3341J2760J2367J1735J0871J0511J0962J1557
57267A471373J1755J1923J2416J2842J2958J3392J4581J5911J6722J7379J8388
57256A629640J9300J9553J9695K0576K1870K2530K2337K1933K1684K1507K1588
57245A862213K2214K3071K3590K3805K4122K4419K4286K3957K4186K5280K6953
57234B128096K8953L1096L2838L3651L3800L4107L4971L6138L7339L8519L9576
57223B509084M0418M1240M2261M3319M4141M4901M6007M7520M9240N1141N3348
$$ plain form
57300 1041730 1053793 1066074 1078691 1091466 1103918 1116008 1128474 1141921 1155942 1169714 1183039
57289 1183039 1196255 1209531 1223014 1237208 1252309 1267395 1281204 1293721 1306187 1319605 1333924
57278 1333924 1348605 1363187 1377269 1390610 1403370 1415737 1427472 1438343 1448854 1459816 1471373
57267 1471373 1483128 1495051 1507467 1520309 1533267 1546659 1561240 1577151 1593873 1611252 1629640
57256 1629640 1648940 1668493 1688188 1708764 1730634 1753164 1775501 1797434 1819118 1840625 1862213
57245 1862213 1884427 1907498 1931088 1954893 1979015 2003434 2027720 2051677 2075863 2101143 2128096
57234 2128096 2157049 2188145 2220983 2254634 2288434 2322541 2357512 2393650 2430989 2469508 2509084
57223 2509084 2549502 2590742 2633003 2676322 2720463 2765364 2811371 2858891 2908131 2959272 3012620
57212C012620N5800N8388O1176O4166O7023O9369P1086P2061P2092P1398P0747
57201C745926P0657P0900P1196P1864P3300P5254P7261P9325Q1524Q3378Q4270
57190D584855Q4241Q3782Q3050Q1839Q0046P7745P5017P2136O9649O7905O6804
57179E427069O6216O6174O6393O6337O6187O7013O9362P2343P4689P6116P6994
57168F194893P7409P7362P7352P7906P8937Q0270Q2312Q5506Q9699R4838J01717
57157G118201J11064J22235J33559J43655J51692J56992J59307J59352J58362
57148H414419J57467J57788J60293J64639J68893J71305J71952J71745J70605
57139I909106J67673J62570J55180J44760J30768J14355R7736Q2140O7341N2886
$$ plain form
57212 3012620 3068420 3126808 3187984 3252150 3319173 3388542 3459628 3531689 3603781 3675179 3745926
57201 3745926 3816583 3887483 3958679 4030543 4103843 4179097 4256358 4335683 4417207 4500585 4584855
57190 4584855 4669096 4752878 4835928 4917767 4997813 5075558 5150575 5222711 5292360 5360265 5427069
57179 5427069 5493285 5559459 5625852 5692189 5758376 5825389 5894751 5967094 6041783 6117899 6194893
57168 6194893 6272302 6349664 6427016 6504922 6583859 6664129 6746441 6831947 6921646 7016484 7118201
57157 7118201 7229265 7351500 7485059 7628714 7780406 7937398 8096705 8256057 8414419
57148 8414419 8571886 8729674 8889967 9054606 9223499 9394804 9566756 9738501 9909106
57139 9909106 10076779 10239349 10394529 10539289 10670057 10784412 10882148 10964288 11031629 11084515
57129A1084515L8444K3213O409j1314k8020m2327n4362o4898p4397q3022r0822
57118A0703419r7738j03849j09576j15254j20771j25956j30848j35207j38519
57109I625701j40942j43256j45306j45526j42808j37420j28969j14989r3175o3760
57099H369550k7892J5227O7650J30365K03818K89691L89479N01827O23196P49992
57089A1312903Q77871J001645J120905J245485J390579J565185J766124J976084
57081B2256781K153374K221204K087107J700506J103956M23168k02929o91943
57073C1051224j034357j260770j403009j479571j501938j482937j437028j375697
57065B0075917j304870j226371j140630j048002r49167q45834p41112o38503n40644
$$ plain form
57129 11084515 11122959 11146172 11152581 11141267 11113247 11070920 11016558 10951660 10877263 10794241 10703419
57118 10703419 10605681 10501832 10392256 10277002 10156231 10030275 9899427 9764220 9625701
57109 9625701 9484759 9341503 9196197 9050671 8907863 8770443 8641474 8526485 8433310 8369550
57099 8369550 8341658 8356885 8424535 8554900 8758718 9048409 9437888 9939715 10562911 11312903
57089 11312903 12190774 13192419 14313324 15558809 16949388 18514573 20280697 22256781
57081 22256781 24410155 26631359 28718466 30418972 31522928 31946096 31743167 31051224
57073 31051224 30016867 28756097 27353088 25873517 24371579 22888642 21451614 20075917
57065 20075917 18771047 17544676 16404046 15356044 14406877 13561043 12819931 12181428 11640784
57056A1640784m49316l66169k92532k28668j73910j27574q9106n7441l0919q173
57046I816976J1238K7274M0266N1065O0282O7572P2031P3613P3814P4515P6397
57035A0445043P8996Q2069Q5923R0369R4219R6038R4801Q9948Q1901P2734O5301
57024A1377342O1143N9994O1353O5284P1151P6917Q0735Q2376Q2332Q0561P7220
57013A2176408P3716P1580P0597O9331O7334O5789O5950O7857P0675P3596P6147
57002A2948980P8073P9146P9123P8077P6793P6176P6118P5566P4137P2843P2685
56991A3787717P3339P3990P4693P5894P7109P7288P6237P4581P2335O8556O2546
56980A4594285N4609M5493L5841K6482J8584J3149J0537J0525J2429J5214J7889
$$ plain form
57056 11640784 11191468 10825299 10532767 10304099 10130189 10002615 9913509 9856068 9825149 9816976
57046 9816976 9828214 9855488 9895754 9946819 10007101 10074673 10146704 10220317 10294131 10368646 10445043
57035 10445043 10524039 10606108 10692031 10782400 10876619 10972657 11067458 11157406 11239307 11312041 11377342
57024 11377342 11438485 11498479 11559832 11625116 11696267 11773184 11853919 11936295 12018627 12099188 12176408
57013 12176408 12250124 12321704 12392301 12461632 12528966 12594755 12660705 12728562 12799237 12872833 12948980
57002 12948980 13027053 13106199 13185322 13263399 13340192 13416368 13492486 13568052 13642189 13715032 13787717
56991 13787717 13861056 13935046 14009739 14085633 14162742 14240030 14316267 14390848 14463183 14531739 14594285
56980 14594285 14648894 14694387 14730228 14756710 14775294 14788443 14798980 14809505 14821934 14837148 14855037
56969A4855037K0125K2140K4010K5360K5916K6044K6482K7582K9043L0417L1702
56958A5143858L3126L4367L4345L2151K7800K1832J4573O420j486p850j2483j6133
56946A5310520j9015k0372j9747j7847j5822j4370j3721j3731j3704j2883j1464
56935A5137844j0353r710q640o776n152m977o575j0184j6718k6625l8631n0615
56923A4942888o1194o9765p5747p8916q0055q0287q0013p9182p8050p6794p4902
56912A4107983p2014o9103o7681o8016o8982o9633o9919o9945o9456o8339o6939
56901A3347956o5665o4704o4217o4365o5094o6200o7575o9147p0710p2063p3081
56890A2605135p3515p3093p2030p0949p0054o9037o8181o8731p1476p5544p9299
$$ plain form
56969 14855037 14875162 14897302 14921312 14946672 14972588 14998632 15025114 15052696 15081739 15112156 15143858
56958 15143858 15176984 15211351 15245696 15277847 15305647 15327479 15342052 15348472 15346986 15339136 15326653 15310520
56946 15310520 15291505 15271133 15251386 15233539 15217717 15203347 15189626 15175895 15162191 15149308 15137844
56935 15137844 15127491 15117781 15109141 15102365 15097213 15092236 15085661 15075477 15058759 15032134 14993503 14942888
56923 14942888 14881694 14811929 14736182 14657266 14577211 14496924 14416911 14337729 14259679 14182885 14107983
56912 14107983 14035969 13966866 13899185 13831169 13762187 13692554 13622635 13552690 13483234 13414895 13347956
56901 13347956 13282291 13217587 13153370 13089005 13023911 12957711 12890136 12820989 12750279 12678216 12605135
56890 12605135 12531620 12458527 12386497 12315548 12245494 12176457 12108276 12039545 11968069 11892525 11813226
56879A1813226q1907q3302q3311q1860p9739p8135p7451p7257p7237p7425p7767
56868A0937835p8181p8904q0069q0998q0585p8367p4804p0666o6581o3007o0350
56857A0125323n9398o1644o8351p8655q9395r7570j02509j05035j05543j03964
56847I253259j00928r7463r3836q9733q5395q1426p7683p3423o8408o2927n7003
56836H365034n0618m4503l9624l6088l3945l4968m2078n6388p5618r5698j13127
56825G742379j25806j32982j35248j34036j30601j25604j19656j13505j07568
56816F617373j01764r6014r0374q4735p8899p3051o7539o2298n7041n2144m8904
56805E804610m8986n3781o3766p7687r2632j05642j15187j20829j22293j19893
$$ plain form
56879 11813226 11731319 11648017 11564706 11482846 11403107 11324972 11247521 11170264 11093027 11015602 10937835
56868 10937835 10859654 10780750 10700681 10619683 10539098 10460731 10385927 10315261 10248680 10185673 10125323
56857 10125323 10065925 10004281 9935930 9857275 9767880 9670310 9567801 9462766 9357223 9253259
56847 9253259 9152331 9054868 8961032 8871299 8785904 8704478 8626795 8553372 8484964 8422037 8365034
56836 8365034 8314416 8269913 8230289 8194201 8160256 8125288 8083210 8026822 7951204 7855506 7742379
56825 7742379 7616573 7483591 7348343 7214307 7083706 6958102 6838446 6724941 6617373
56816 6617373 6515609 6419595 6329221 6244486 6165587 6092536 6024997 5962699 5905658 5853514 5804610
56805 5804610 5755624 5701843 5638077 5560390 5467758 5362116 5246929 5126100 5003807 4883914
56795D883914j15255j10210j05066r9054r2252q5823q0409p5562p0979o7082o4104
56784C918118o1620n9295n7260n5547n4061n3307n4358n7827o3426p0375p7408
56773C253634q2684q4939q4852q4243q3778q2623q0230p7181p4006p0527o6812
56762B381759o3598o1202n9055n6744n4535n2505n0275m8032m6653m6249m5693
56751A797218m4242m2566m1468m0600l9247l7475l5723l4078l2651l1927l1910
56740A385331l1702l0685k9393k8512k7727k6467k5050k4190k3788k3176k2141
56729A092500k0987j9888j8944j8452j8487j8500j8067j7649j7962j8851j9531
56718H85182j9706j9781k0085k0463k0629k0488k0148j9898k0059k0469k0407
$$ plain form
56795 4883914 4768659 4658449 4553383 4454329 4362077 4276254 4195845 4120283 4049304 3982222 3918118
56784 3918118 3856498 3797203 3739943 3684396 3630335 3577028 3522670 3464843 3401417 3331042 3253634
56773 3253634 3170950 3086011 3001159 2916916 2833138 2750515 2670285 2593104 2519098 2448571 2381759
56762 2381759 2318161 2256959 2197904 2141160 2086625 2034120 1983845 1935813 1889160 1842911 1797218
56751 1797218 1752976 1710410 1668942 1628342 1589095 1551620 1515897 1481819 1449168 1417241 1385331
56740 1385331 1353629 1322944 1293551 1265039 1237312 1210845 1185795 1161605 1137817 1114641 1092500
56729 1092500 1071513 1051625 1032681 1014229 995742 977242 959175 941526 923564 904713 885182
56718 885182 865476 845695 825610 805147 784518 764030 743882 723984 703925 683456 663049
56707F63049j9277j7331j5413j4126j3478j3102j2618j1859j0880r809q809q257
56695E08090q548r417r824r174q193p911q129p908p217o899p049o797n929n344
56681C99751n454n490m960m566m930n449n341m834m464m083l523l392m185n255
56667C33825n688n636n781n990n621m782m212m041l697k994k513k668l098l180
56653B73924k755k223k097k483k916k952k810l073l750m225m203m018l823l341
56639B29255k681k458k714k591j721j020j317j986j859q79P6M61L20l04j292k123
56623B07167k388k398k615k848k670k231k006k074k281k678l101k874j793r08
56609A74302j346k658l343k829j931j400j055n13J12N28P02O97N27L46L80N57
$$ plain form
56707 663049 643772 626441 611028 596902 583424 570322 557704 545845 534965 525156 516347 508090
56695 508090 499542 490125 480301 471127 462934 455023 446894 438986 431769 424870 417821 411024 405095 399751
56681 399751 394297 388807 383847 379281 374351 368902 363561 358727 354263 350180 346657 343265 339080 333825
56667 333825 328137 322501 316720 310730 305109 300327 296115 292074 288377 285383 282870 280202 277104 273924
56653 273924 271169 268946 266849 264366 261450 258498 255688 252615 248865 244640 240437 236419 232596 229255
56639 229255 226574 224116 221402 218811 217090 216070 214753 212767 210908 210029 210105 210566 210886 210582 209290 207167
56623 207167 204779 202381 199766 196918 194248 192017 190011 187937 185656 182978 179877 177003 175210 174302
56609 174302 172956 170298 166955 164126 162195 160795 159740 159227 159339 159867 160569 161266 161793 162139 162519 163076
56593A63076N52L06R8J12J54nk65k57K17Q35R67M17j99j18O00J248J463J440J257
56574A71898P58K41L91J249J953J870J284P40M50O56J634K978L783L966M401N313
56558B03565N614M606L164K336J806Q95P0J41O92O46l6n32o03p05q98q17n46m61
56540B18937m07p7L0q74k425l303k909j985j475j561j899k105j877j216n38j87
56524A96129JJ92Q5n36j230j510j638k033k361k056j356q74m89L34J359J724J221
56507A86962N08N8k94p05r80j000q99q47r76j405j922j982j431q17n27k09M00
56490A73934P48L62k36l81l47o12o85R4J122J200L67j84J26P62J147J189Q90M11
56472A79907L52R30J228L55r71j300o13k54p78j354j383j219j103p32k20k11o52
$$ plain form
56593 163076 163628 163934 164032 164144 164298 164293 164028 163771 163988 164823 165790 166207 166008 165890 166490 167738 169201 170641 171898
56574 171898 172656 172897 173288 174537 176490 178360 179644 180384 180834 181490 183124 186102 189885 193851 198252 203565
56558 203565 209179 213785 216949 219285 221091 221986 222056 222197 222889 223535 223499 222967 222364 221659 220761 219944 219398 218937
56540 218937 218530 218453 218483 217609 215184 211881 208972 206987 205512 203951 202052 199947 198070 196854 196316 196129
56524 196129 196130 196322 196407 195871 194641 193131 191493 189460 187099 185043 183687 182813 182324 182658 184017 185741 186962
56507 186962 187470 187528 187234 186529 185549 184549 183650 182803 181827 180422 178500 176518 175087 174270 173743 173534 173934
56490 173934 174682 175044 174808 174427 174080 173468 172783 172877 173999 175199 175566 175382 175508 176270 177417 178606 179496 179907
56472 179907 180259 181189 182417 182772 181801 180501 179888 179634 178856 177502 176119 174900 173797 173065 172845 172634 171982
56455A71982o16J98R36R63P95J013J279J038M76J79L92R76J643J881J285J85n40
56438A84065m84PN42J057J365J105L17m13o35l86P1M14K35n10j099p86J73Q69
56420A85907R98J081J481J922K006J605P64j88n86j21O50J020J012R23N24m03
56404A98595j211j116m32j5J39N79J030P06j32l24M02J050R12L36k21p50j107
56387A98441q93j90M66R34J507K051K097J763J646J797J748J499J498J719J729
56372B17812J600J721J841J390O10K96M78N73N73Q65J114P10J08K63Q49O45l18
56355B31130o68R1R73J291J491J784J614R36N44O52N67J71L00J144J742J632J617
56338B47011K268K992L143K862K344J437M29O9M18Q52J344K414L617L710K688
$$ plain form
56455 171982 171366 171564 172500 173463 174258 175271 176550 177588 178064 178243 178635 179611 181254 183135 184420 184605 184065
56438 184065 183581 183588 184130 185187 186552 187657 187974 187561 186926 186540 186611 187025 187260 186750 185651 184865 185038 185907
56420 185907 186905 187986 189467 191389 193395 195000 195764 195576 194990 194869 195519 196539 197551 198474 198998 198595
56404 198595 197384 196268 195836 195821 195960 196539 197569 198275 198143 197819 198221 199271 200183 200519 200298 199548 198441
56387 198441 197548 197358 197824 198758 200265 202316 204413 206176 207822 209619 211367 212866 214364 216083 217812
56372 217812 219412 221133 222974 224364 224974 225270 225748 226321 226894 227759 228873 229583 229691 229954 230803 231448 231130
56355 231130 230462 230553 231526 232817 234308 236092 237706 238642 239186 239838 240405 240576 240876 242020 243762 245394 247011
56338 247011 249279 252271 255414 258276 260620 262057 262486 262555 262973 263825 265169 267583 271200 274910 277598
56323B77598K044K539L242L290L041K935K764K619K976L330K452O35j37R71K446
56308C12745K853K699K850K912K462K301L142M352N132N698O235O070N074M519
56294C69044N277O369O528O035N806N843N784N946O626P325P736Q418R558J0189
56280D66484R747R239R742J0835J1599J2140J2968J3869J4463J4974J5577J5925
56268F17562J6115J6958J8525J9656J9868K0373K2221K4783K7063K9178L1484
56257H63786L3677L5868L9166M3937M8929N3285N7992O4004P0469P6212Q1527
56246A468852Q6996R1925R5564R8477J01081J02109J00216R5878R0003Q1944P0774
56235B483819N7363M3281K8573J2566m002j9536l3686m7030n9290o9470p7231
$$ plain form
56323 277598 279642 282181 285423 288713 291754 294689 297453 300072 303048 306378 308830 309465 309328 310299 312745
56308 312745 315598 318297 321147 324059 326521 328822 331964 336316 341448 347146 353381 359451 364525 369044
56294 369044 374321 380690 387218 393253 399059 404902 410686 416632 423258 430583 438319 446737 456295 466484
56280 466484 476231 485470 495212 506047 517646 529786 542754 556623 571086 586060 601637 617562
56268 617562 633677 650635 669160 688816 708684 729057 751278 776061 803124 832302 863786
56257 863786 897463 933331 972497 1016434 1065363 1118648 1176640 1240644 1311113 1387325 1468852
56246 1468852 1555848 1647773 1743337 1841814 1942895 2045004 2145220 2241098 2331101 2413045 2483819
56235 2483819 2541182 2584463 2613036 2625602 2621600 2602064 2568378 2521348 2462058 2392588 2315357
56224B315357q2825q6267q7888q8759q9253q8189q4827q0565p7105p4046p0065
56213A405568o5407o1202n7256n2609m7653m3761m1171l8847l6087l2819k8949
56202H99807k4915k2087k1093k0506j8706j6214j4553j3700j2554j1133j0325
56191G14021r928q914p305o079n451m772l890l232k825k433k188k126j666o56
56177F52556Mk18m69n4K99N2K93J947L837M381M016M115M611M686M709N511O607
56160F96883P101P465Q585R947J0581J0898J1772J2810J3352J4110J5929J8031
56148H37464J9427K0939K3855K7752L1653L6093M1882M8093N3537N8815O4562
56137A264072O8970O9619O6664O1691N4863M6010L7304L1651K9031K7123K4761
$$ plain form
56224 2315357 2232532 2146265 2058377 1969618 1880365 1792176 1707349 1626784 1549679 1475633 1405568
56213 1405568 1340161 1278959 1221703 1169094 1121441 1077680 1036509 997662 961575 928756 899807
56202 899807 874892 852805 831712 811206 792500 776286 761733 748033 735479 724346 714021
56191 714021 704093 695179 687874 681795 676344 671572 667682 664450 661625 659192 657004 654878 653212 652556
56177 652556 652560 652342 651873 651819 652118 652170 652463 654410 658247 662628 666644 670759 675370 680056 684765 690276 696883
56160 696883 703984 711449 720034 729981 740562 751460 763232 776042 789394 803504 819433 837464
56148 837464 856891 877830 901685 929437 961090 997183 1039065 1087158 1140695 1199510 1264072
56137 1264072 1333042 1402661 1469325 1531016 1585879 1631889 1669193 1700844 1729875 1756998 1781759
56126A781759K2097J8371J2604N891J92m567r521j3927j6302j7843k1572k8351
56114A728831l6381m4166n1161n6129n7818n6982n5135n1880m6151l9249l3674
56103A200105k9535k5082k0229j6524j4134j1812r397p578n842l403j389j176
56091A054004j522l43J718K735L239M953O921O819N308N170O718P904Q377R512
56077A121513J0997J1340J1281J2728J4832J5236J4582J5552J7903J8807J7946
56066A282717J7768J8859J9382J9051J9470K0588K0963K1240K3120K5442K5674
56055A514274K4664K5273K6974K6856K5326K5398K6844K6742K5615K7034L1030
56044A806030L3804L4411L5736L8407L9814L9886M1757M5682M8306M8966N0805
$$ plain form
56126 1781759 1803856 1822227 1834831 1840722 1840914 1836347 1826826 1812899 1796597 1778754 1757182 1728831
56114 1728831 1692450 1648284 1597123 1540994 1483176 1426194 1371059 1319179 1273028 1233779 1200105
56103 1200105 1170570 1145488 1125259 1108735 1094601 1082789 1073392 1065814 1059972 1056569 1055180 1054004
56091 1054004 1052482 1052139 1053857 1056592 1059831 1064784 1071705 1078524 1083832 1089002 1095720 1103624 1112001 1121513
56077 1121513 1132510 1143850 1155131 1167859 1182691 1197927 1212509 1228061 1245964 1264771 1282717
56066 1282717 1300485 1319344 1338726 1357777 1377247 1397835 1418798 1440038 1463158 1488600 1514274
56055 1514274 1538938 1564211 1591185 1618041 1643367 1668765 1695609 1722351 1747966 1775000 1806030
56044 1806030 1839834 1874245 1909981 1948388 1988202 2028088 2069845 2115527 2163833 2212799 2263604
56033B263604N4617N7531N8922O1596O6026O9385P1394P5110Q0912Q5911R0168
56022C035176R6994J06105J13366J18347J25152J34567J42669J48571J56062J66067
56012D343076J75072J82711J93114K06827K19376K29762K42255K57707K71497
56003F321397K82296K94257L08235L19783L28353L39319L54193L68059L79375
55994I295267L92537M08159M21192M31663M46381M66748M86267N03579N25953
55985A3377746N55793N86355O15315O49344O89928P28400P61112P95906Q37296
55976A9597195Q79484R20869R70721J034402J106977J188309J287923J407603
55968B8393483J537014J674669J834211K021729K228288K454502K719289L034437
$$ plain form
56033 2263604 2318221 2375752 2434674 2496270 2562296 2631681 2703075 2778185 2859097 2945008 3035176
56022 3035176 3132170 3238275 3351641 3469988 3595140 3729707 3872376 4020947 4177009 4343076
56012 4343076 4518148 4700859 4893973 5100800 5320176 5549938 5792193 6049900 6321397
56003 6321397 6603693 6897950 7206185 7525968 7854321 8193640 8547833 8915892 9295267
55994 9295267 9687804 10095963 10517155 10948818 11395199 11861947 12348214 12851793 13377746
55985 13377746 13933539 14519894 15135209 15784553 16474481 17202881 17963993 18759899 19597195
55976 19597195 20476679 21397548 22368269 23402671 24509648 25697957 26985880 28393483
55968 28393483 29930497 31605166 33439377 35461106 37689394 40143896 42863185 45897622
55960D5897622L397269L821084M343644M991741N770743O705090P849410R238552
55952I2015155J0869273J2746995J4880727J7190908J9495482K1619665K3352331
55945B12170536K4108827K2764638J8228489J0467698R30820q192607j5200375
55938B65278026j9509064k1415064k1557152k0592475j9079701j7403050j5746594
55931A29974926j4164923j2669483j1253831r900474q613297p429899o384223
55924E9558796n477346m697342m041722l503429l057350k679317k362713k103395
55916C1636182j885201j693588j528457j391173j272372j163414j066914r85553
55908B0649510r12541q42584p80583p30400o85932o41748o01792n69395n39068
$$ plain form
55960 45897622 49294891 53115975 57459619 62451360 68222103 74927193 82776603 92015155
55952 92015155 102884428 115631423 130512150 147703058 167198540 188818205 212170536
55945 212170536 236279363 259044001 277272490 287740188 288671008 280478401 265278026
55938 265278026 245768962 224353898 202796746 182204271 163124570 145721520 129974926
55931 129974926 115810003 103140520 91886689 81986215 73372918 65943019 59558796
55924 59558796 54081450 49384108 45342386 41838957 38781607 36102290 33739577 31636182
55916 31636182 29750981 28057393 26528936 25137763 23865391 22701977 21635063 20649510
55908 20649510 19736969 18894385 18113802 17383402 16697470 16055722 15453930 14884535 14345467
55899A4345467n06375m76001m52118m30123m05700l82946l65892l50527l32770
55890A0643015l16095l03919k92285k77497k63568k54895k48461k40227k32477
55881H213591k27967k23202k14550k05101j98846j93566j85950j78261j73586
55872F412562j69507j62736j55312j50248j45596j38584j31240j26353j22048
55863E110938j15754j09493j05992j03489r9428r5463r3733r2147q8269q4195
55853D122975q2616q1716p8800p5482p4388p4111p2315p0597p1403p3122p2960
55842C295465p1799p1604p0900o7526o3296o1278o0655n8689n5613n3402n1756
55831B608947m9252m6688m5513m4843m3333m1930m1637m0954l8748l7046l7600
$$ plain form
55899 14345467 13839092 13363091 12910973 12480850 12075150 11692204 11326312 10975785 10643015
55890 10643015 10326920 10023001 9730716 9453219 9189651 8934756 8686295 8446068 8213591
55881 8213591 7985624 7762422 7547872 7342771 7143925 6950359 6764409 6586148 6412562
55872 6412562 6243055 6080319 5925007 5774759 5629163 5490579 5359339 5232986 5110938
55863 5110938 4995184 4885691 4779699 4676210 4576782 4481319 4387586 4295439 4207170 4122975
55853 4122975 4040359 3958643 3879843 3804361 3729973 3655862 3583547 3512950 3441547 3368425 3295465
55842 3295465 3223666 3152062 3081162 3013636 2950340 2889062 2828407 2769718 2714105 2660703 2608947
55831 2608947 2559695 2513007 2467494 2422651 2379318 2337388 2295751 2254797 2216049 2179003 2141403
55820B141403l8372l7011l5086l5098l5869l4931l3128l2680l2830l1457k9215
55809A765726k8104k7624k6118k4300k3694k3266k1315j9125j8941j9731j8773
55798A514735j6210j4377j3789j3317j3287j4836j7039j8000j8050j8807k0041
55787A336982k0370k0100k0425k0916k0707k0961k3097k5634k6007k4449k3017
55776A091299k1826j9519j6566j4719j3724j1869r384q340r345j1189j3372j6199
55764I25247j8715j9317j8391j7845j8153j8151j7531j7194j7279j6939j5967
55753G29765j4799j3297j1296r798r763j0398j0396j0024j0080r872q353o411
55741F05278n758o329o869p253q039q620q169p570q151r194r087q125p838q301
$$ plain form
55820 2141403 2103031 2066020 2030934 1995836 1959967 1925036 1891908 1859228 1826398 1794941 1765726
55809 1765726 1737622 1709998 1683880 1659580 1635886 1612620 1591305 1572180 1553239 1533508 1514735
55798 1514735 1498525 1484148 1470359 1457042 1443755 1428919 1411880 1393880 1375830 1357023 1336982
55787 1336982 1316612 1296512 1276087 1255171 1234464 1213503 1190406 1164772 1138765 1114316 1091299
55776 1091299 1069473 1049954 1033388 1018669 1004945 993076 983692 975352 966007 954818 941446 925247
55764 925247 906532 887215 868824 850979 832826 814675 797144 779950 762671 745732 729765
55753 729765 714966 701669 690373 680575 670812 660414 650018 639994 629914 620042 611689 605278
55741 605278 599520 593191 586322 579069 571030 562410 554241 546671 538520 529326 520239 512114 504276 495975
55727D95975q450q413q954r355q367o808o548p346p254n892m770m480m048l106
55713D02184k406k030j338o68j055k194k689k367k362k983l375l384l792m673
55699C66868n260n518o136o984p198o764o461o400o117n756n650n217l880k569
55685B86958k515l074k622j222l66m22l53J51L04r0m04o73j488k517k746k208
55669B66713j913k185k520k825l247l216k247j269j471k247k011o70M48P19N74
55654B42633J63n34p39J20R45L61j005j508j158j179j585j492j408k658m762n805
55638B20389n431n105n436n551n209n231n596n305m346l706l376k497j476j693
55624A60431k908l307k417j660j685j515q00o59j529k322k355k216k181j782j307
$$ plain form
55727 495975 487525 479112 470158 460803 452436 445628 439080 431734 424480 418588 413818 409338 405290 402184
55713 402184 399778 397748 396410 395742 394687 392493 389804 387437 385075 382092 378717 375333 371541 366868
55699 366868 361608 356090 349954 342970 335772 329008 322547 316147 310030 304274 298624 293407 289527 286958
55685 286958 284443 281369 278747 277525 277159 276737 276384 276535 276839 276749 276345 275672 274184 271667 268921 266713
55669 266713 264800 262615 260095 257270 254023 250807 248560 247291 245820 243573 241562 240892 241340 242059 242633
55654 242633 242796 242262 241523 241643 242588 242949 241944 240436 239278 238099 236514 235022 233614 230956 226194 220389
55638 220389 214958 209853 204417 198866 193657 188426 182830 177525 173179 169473 166097 163600 162124 160431
55624 160431 157523 154216 151799 150139 148454 146939 146139 145480 143951 141629 139274 137058 134877 133095 131788
55609A31788j738k719k676j457p13j084j272o36m24j411k348j970q42j62j52n24
55593A11660j111j402q67j49m21j271j085J56O59j78q31m04j6m35o66o2L62P4
55575A04013L51J942L350L102K026J618J709J431J042J032P52l52j269q90J3k4
55559A19846q91j408j408j626k141k395k472k916l560l644l017k289j885j666
55545H8528j311o85L7L44l3m40Q5J438K483K580K156J654J044N48O04P92J25j235
55527I8714j891j275m24j92j71K2j33q77j517j691j940k321j944p17ln63j246
55510H1831q77m8J43j73l05k44n5P82K228K975K175P98R6j87q88j749k062k044
55492H2396k218k234j625r26q42j039r62j027j710k266j676l03O42O99K49l79
$$ plain form
55609 131788 130050 127331 124655 123198 122485 121401 120129 119493 119069 117658 115310 113340 112498 112336 112184 111660
55593 111660 110549 109147 108280 108131 107710 106439 105354 105510 106169 105991 105160 104756 104740 104305 103639 103577 103939 104013
55575 104013 104364 106306 109656 112758 114784 116402 118111 119542 120584 121616 122368 122016 120747 119857 119870 119846
55559 119846 118955 117547 116139 114513 112372 109977 107505 104589 101029 97385 94368 92079 90194 88528
55545 88528 87217 86532 86569 86913 86880 86440 86525 87963 90446 93026 95182 96836 97880 98428 99032 99824 99949 98714
55527 98714 96823 95548 95124 94932 94761 94783 94650 93773 92256 90565 88625 86304 84360 83643 83640 83077 81831
55510 81831 80954 80906 81049 80876 80571 80327 80272 81054 83282 86257 88432 89230 89326 89139 88251 86502 84440 82396
55492 82396 80178 77944 76319 75393 74551 73512 72550 71523 69813 67547 65871 65568 66210 66909 67158 66779
55476F6779q65o69P7K61n85j256o14N76R25N81N75P85K97o98j124q46p13q86o70
55457F1930mK82j11m98l90j25q2j01Q3M38Q04R91Q21N00N83J155J416O97n16j176
55437F6697q73L0R24J115J53j312j769o39Q18J201P20M16M41K97O9J94M97N71
55419F9550P34J460K267K298J667J146Q41L59k5L65J299J720J192K70n93j508
55403H3042k443k923k712k174j752j472j074l47N37R43M52l48l68L63N76l20j210
55386F8770r35LM45L83N23P52M00l78p67o18m77m55j48M41Q23P83M81k4o99j158
55366F8145j136r37q65o37k6M70L87O3q2l72j068j525j153m45NO70J933K682J699
55347F7808j37q34j13M94J92j93J5M26P19J164J562J079l60j605j724r35J30J138
$$ plain form
55476 66779 65914 65245 65322 65583 64998 63742 63128 63704 64629 65210 65785 66570 66867 66169 65045 64199 63486 62600 61930
55457 61930 61926 62208 62097 61599 61209 61084 61002 60901 60984 61422 62226 63217 64038 64538 65121 66276 67692 68389 67873 66697
55437 66697 65824 65854 66778 67893 68046 66734 64965 64326 65144 66345 67065 67481 67922 68219 68288 68482 68979 69550
55419 69550 70284 71744 74011 76309 77976 79122 79963 80322 80297 80662 81961 83681 84873 85143 84550 83042
55403 83042 80599 77676 74964 72790 71038 69566 68492 68145 68682 69625 70077 69729 69361 69724 70300 69980 68770
55386 68770 67835 67838 68283 68666 69189 69941 70341 69963 69196 68578 68101 67646 67498 67939 68762 69545 70026 70002 69303 68145
55366 68145 67009 66072 65207 64570 64544 65014 65401 65464 65382 65010 63942 62417 61264 60819 60824 61494 63427 66109 67808
55347 67808 67671 66837 66724 67218 67410 67217 67232 67658 68377 69541 71103 72182 71822 70217 68493 67558 67688 68826
55329F8826J678J233K8q83p98r7M20L12m49j521k150j803q28n6K07K45K19J29
55311F4712J36K14j60j161j861j384l44J0k74q9P88J447J454J293J105M67m34
55294F5919p43l89k10l54Q5J339K209J745N63k17m11m80n99p32r50j112q30j09
55276F4724M99O34M23o4q39j373r31K01Q10M15j64k61l00o91q70k73O06R02O30
55257F4078M06M43N00M43L04P0j25M6N93R75P59J57l93p45r04p46k57L21P83J102
55237F7810J194R24M60J52k4m20r52j056n36K7M2l61o16l81J64N19L08j78j73
55218F6903M87Q44Q0j130j351l28Q35J289J223R35K75o87j347j310p86j10M82
55201F6304O14J78j07M51J164P32n73r29M02J942K169J470J030R33N57j2k02j01
$$ plain form
55329 68826 70504 71737 71765 70882 70084 69987 70407 70719 70270 68749 66599 64796 63968 63912 64119 64364 64583 64712
55311 64712 64848 65062 64902 63741 61880 60496 60152 60162 59888 59799 60587 62034 63488 64781 65886 66353 65919
55294 65919 65176 64787 64577 64223 64308 65647 67856 69601 70164 69947 69536 69056 68457 67725 66775 65663 64833 64724
55276 64724 65223 65857 66280 66216 65377 64004 63073 63274 64084 64499 64335 64074 63774 63083 62213 61940 62546 63448 64078
55257 64078 64484 64927 65427 65870 66174 66244 66119 66165 66758 67733 68492 68649 68256 67511 66607 65861 65604 65925 66708 67810
55237 67810 69004 69928 70388 70540 70516 70096 69144 68088 67552 67579 67621 67260 66644 66263 66427 66946 67254 67076 66903
55218 66903 67390 68234 68314 67184 65833 65505 66340 67629 68852 69787 70062 69375 68028 66718 65932 65822 66304
55201 66304 66918 67096 66989 67440 68604 69336 68763 67834 68236 70178 72347 73817 74847 75780 76337 76325 76123 76022
55183G6022l23r83j563j642j209n50j80m73j030r91k43L15J57o1L63J026J140
55166F9775O99K17j97o22p26k35L99N34K91K56N08O65O77Q24J061R94M93j97q55
55147G4561j376j589j386r73o73n45m38k82k7M25J005J380J315R38N11J81P6K75
55129G3378N16L19l37q81q58m60j24l2j30k87k56P9L75K36OM91J679K464K028
55110G8206Q66J4j93j08k5jr1l31o50r99j296j223n64K60O11O06R24J493J360
55091G8859K56o79l85O60J190P59r3q00j162j072n07L28J117J558J310L86l91
55074H1334q5R85J432O48l97o61l18M2M63J003J011O6j001j037j39O30O36nr92
55055H3615j821j727n60O75J004Q02R84J362R81j88j080j025m00K30O67P51L66
$$ plain form
55183 76022 75699 74716 73153 71511 70302 69752 69572 69099 68069 67078 66835 67150 67307 67246 67609 68635 69775
55166 69775 70474 70691 70494 69872 69146 68911 69310 69844 70135 70391 70899 71564 72241 73065 74126 75120 75613 75416 74561
55147 74561 73185 71596 70210 69237 68564 68019 67581 67299 67272 67697 68702 70082 71397 72335 72846 73027 73103 73378
55129 73378 73894 74213 73876 72995 72137 71677 71553 71521 71391 71104 70848 70927 71302 71538 71544 72035 73714 76178 78206
55110 78206 79072 79086 78893 78785 78760 78759 78668 78337 77687 76688 75392 74169 73605 73865 74476 75082 76006 77499 78859
55091 78859 79115 78436 78051 78711 79901 80660 80567 79767 78605 77533 77026 77354 78471 80029 81339 81725 81334
55074 81334 81249 82234 83666 84314 83917 83256 82938 82980 83443 84446 85457 85523 84522 83485 83346 83976 84612 84607 83615
55055 83615 81794 80067 79507 80182 81186 81988 82972 84334 85315 85127 84047 83022 82622 82852 83519 84270 84636
55038H4636p0L4M64M07k46o47l29J7m46j446j887j144K68J232J043K0q20p20J60
55019H0526J035J254P12k06q64q02j71M44P05P50O99L96j41m85l66m9J57L05M43
55000H4342K77l47j104j613j806j592p78L29Q83N79J53L11P68R29Q43Q24P87O63
54982H4448Q44J416J613Q65j65m55p3K03J50N5j18m51m07M63J469J519O52k15
54964I1813p31j127j140k11J234K000J729J126O35L8n31m76P1J39n47j033n75
54947I2414K87O92N98M29L26K97N16R04R57M22l09p58r14r15p14l13O8L32N74
54928I4893P52P47P82J208J782J900J667J977L214M563N071M726M143L703L398
54913A34526L107K590J566J46j174k113k820l337l402k978k527k346k222j942
$$ plain form
55038 84636 84566 84600 85064 85471 85225 84578 84249 84266 83820 82374 80487 79343 79611 80843 81886 81906 81086 80366 80526
55019 80526 81561 82815 83527 83321 82457 81655 81484 81928 82633 83383 84082 84478 84337 83852 83486 83437 83594 83899 84342
55000 84342 84619 84272 83168 81555 79749 78157 77379 77708 78591 79170 79323 79634 80402 81331 82174 82998 83785 84448
54982 84448 85292 86708 88321 89186 89021 88566 88493 88696 88846 88901 88783 88332 87925 88388 89857 91376 92028 91813
54964 91813 91082 89955 88815 88604 89838 91838 93567 94693 95328 95366 94835 94359 94430 94569 94022 92989 92414
54947 92414 92701 93393 93991 94420 94746 95043 95559 96463 97420 97842 97533 96775 95861 94946 94232 93919 93987 94319 94893
54928 94893 95645 96392 97174 98382 100164 102064 103731 105708 108922 113485 118556 123282 127425 131128 134526
54913 134526 137633 140223 141789 141935 140761 138648 135828 132491 129089 126111 123584 121238 119016 117074
54899A17074j710j667j506j025o22p91j370j714j464q19j70K21L17K58J72L0r9
54882A05115K32J469L287M637M775L979L143K874L131L407L221K584J964J581
54868A45399R60l44j827k548k512k726l686m558m330l139k018j693k116k774l095
54853A08993k743j921j192q84q78j057j496j950j749o23O47R98L30l87l00M13
54837I6201Q90O00j19n28l56l6k7k49l79m62p48j114j105o60k71l36o78q27n38
54818H9258Q4O63P96M37L4OK09K97L92R20J728K024J326R9p93r27n61k65m44r40
54798I4343j165q12k30J23L71Q34J317J378J102R21Q07M41M7J68N60L19o02j011
54780I8911j17J273J828J382Q78J032J673K244K433K306K169K225K357K346K277
$$ plain form
54899 117074 115364 113697 112191 111166 110544 109753 108383 106669 105205 104386 104216 104437 104754 105012 105184 105214 105115
54882 105115 105347 106816 110103 114740 119515 123494 126637 129511 132642 136049 139270 141854 143818 145399
54868 145399 146359 146015 144188 141640 139128 136402 132716 128158 123828 120689 118671 116978 114862 112088 108993
54853 108993 106250 104329 103137 102253 101375 100318 98822 96872 95123 94500 95147 96145 96475 96088 95788 96201
54837 96201 97091 97691 97572 97044 96688 96652 96625 96376 95997 95535 94787 93673 92568 91908 91637 91301 90623 89796 89258
54818 89258 89342 90005 90801 91238 91272 91278 91487 91784 92176 93096 94824 96848 98174 98273 97480 96553 95992 95727 95283 94343
54798 94343 93178 92366 92136 92259 92630 93464 94781 96159 97261 98182 98989 99430 99477 99645 100205 100524 99922 98911
54780 98911 98794 100067 101895 103277 104155 105187 106860 109104 111537 113843 116012 118237 120594 122940 125217
54765A25217K367K577K799L304M336N246M881L129J247K91j67j193k902m410m972
54750A41750m660l998l411l005k620k145j730j579j526j219o75k45j3K21L42m9
54734A15438q75j411j189m96J99P95J286J548J674K070K858L632M053M255M353
54719A38190M092L292K163R94n9o97o52l69p98k131l407l798l657l743m068m046
54703A21306l376k204q70N7N1o44j056p64n26j035j767j805j307j215j788k237
54687A00820j839o78O32J461J433O57k60p00m90J62Q78J094M32o90j323j142q16
54670I9631q92r69n14K31Q21J394K125K416J597J7j319j921j891j265j94N68L35
54653A00170m73p94l39K42M61M54L60P6l59p91j242j635j440l63Q04R85L53O8
$$ plain form
54765 125217 127584 130161 132960 136264 140600 145846 150727 153856 155103 155394 155227 154034 151132 146722 141750
54750 141750 137090 133092 129681 126676 124056 121911 120181 118602 117076 115857 115182 114937 114924 115145 115487 115438
54734 115438 114563 113152 111963 111467 111666 112461 113747 115295 116969 119039 121897 125529 129582 133837 138190
54719 138190 142282 145574 147737 148731 148672 147975 147323 146954 146156 144025 140618 136820 133163 129420 125352 121306
54703 121306 117930 115726 114856 114913 114964 114320 113264 112500 111974 110939 109172 107367 106060 104845 103057 100820
54687 100820 98981 98303 98935 100396 101829 102486 102226 101526 101036 101198 102076 103170 103602 102912 101589 100447 99631
54670 99631 98739 97770 97256 97487 98308 99702 101827 104243 105840 105857 104538 102617 100726 99461 99267 99835 100170
54653 100170 99697 98903 98564 98806 99267 99721 100081 100157 99798 99007 97765 96130 94690 94327 95131 96116 96469 96537
54635I6537N45J014R86R86J420J656R65k92j050p61K02J061J148L14q39j444j263
54618A01185q47o80o47n11m31o08q79r84r27p17j09R73J981K230J715J113R16
54601A02773R38P08J13m94p52o33l98k91l97o76r95j135r47n31o2N28J331J946
54583A01026J711O45k95l00L05O56N34M17N45N85K21m18r31r48l19O50J254J088
54565A06426N50K73K27j17q50j419j394r49m51o3J67J83K0j64k24l7M78J052J142
54546A04850O29K27O03J321J373O81K18N61J117J116O08Q4l24o84p77m19kj54
54528A11028q85j465j284n32L1r5o08p65k67L47M22N1r1K40N51M32J45J43L53
54509A07751M05K70K18K45Rn83j100j111p68n69o27m96J86J103J513J060J23n83
$$ plain form
54635 96537 97082 98096 99082 100068 101488 103144 104109 103817 102767 102006 102208 103269 104417 104731 103892 102448 101185
54618 101185 100338 99658 99011 98500 98069 97461 96582 95598 94671 93954 93845 94818 96799 99029 100744 101857 102773
54601 102773 103711 104419 104532 104038 103286 102653 102255 101964 101567 100891 99896 98761 97814 97283 97221 97749 99080 101026
54583 101026 102737 103382 103087 102787 103092 103748 104282 104699 105244 105829 106050 105632 104701 103753 103434 104084 105338 106426
54565 106426 106976 107249 107476 107359 106509 105090 103696 102747 102296 102233 102400 102583 102603 102439 102215 102178 102656 103708 104850
54546 104850 105479 105706 106309 107630 109003 109684 109902 110463 111580 112696 113304 113388 113064 112380 111603 111184 111182 111028
54528 111028 110143 108678 107394 106862 106893 106798 106190 105425 105158 105505 105927 105978 105887 106127 106678 107110 107255 107398 107751
54509 107751 108156 108426 108644 108889 108898 108315 107215 106104 105336 104767 104140 103644 103830 104933 106446 107506 107629 107046
54491A07046o30j26M18M94M6m39m67o0M29Q33J187J335J011L63j65m05m88k93
54473A10089M26J250J297M75j69J47R58J407J382J156P06R2j39K17L91k43j007
54456A18435q99j97O7j58p5L49K77m12q33o26n08q70j039n30L6N1K5P03J718K019
54436A17533J335M06p4j37j83l70m76k09L51O78L76k71n81k63L88R46J085N90
54418A21124l15q60n62j3q1n66n15J54N12K04K3N02J071J163J142J355J231K46
54400A25815r18j161m05N79J305J778J880J529J145J180J364J134O09L50L09j05
54384A36388r23j356r14q0L42J55k33l65r5L94P20O25K16j25m1N88J559K349K510
54365A41714K167J942K145K405K322K069J996J936J455N12n18j373j949k039j569
$$ plain form
54491 107046 106416 106290 106708 107202 107248 106809 106342 106282 106711 107544 108731 110066 111077 111440 111275 110870 110382 110089
54473 110089 110515 111765 113062 113537 113368 113515 114473 115880 117262 118418 119124 119216 119077 119294 119685 119442 118435
54456 118435 117536 117339 117406 117248 117173 117522 117799 117387 116554 115928 115420 114550 113511 112981 113017 113068 113093 113796 115514 117533
54436 117533 118868 119274 119200 119063 118880 118510 118034 117825 118176 118854 119230 118959 118378 118115 118503 119449 120534 121124
54418 121124 120809 119949 119387 119374 119293 118727 118212 118366 118878 119082 119105 119607 120678 121841 122983 124338 125569 125815
54400 125815 124897 123736 123331 123910 125215 126993 128873 130402 131547 132727 134091 135225 135834 136184 136493 136388
54384 136388 135465 134109 133195 133115 133457 133612 133379 133014 132919 133313 134033 134658 134874 134749 134708 135296 136855 139204 141714
54365 141714 143881 145823 147968 150373 152695 154764 156760 158696 160151 160663 160145 158772 156823 154784 153215
54350A53215j017j087j878k775l180l008k501j922j499j300j120p50m02m91r52
54335A29333j108m52O79J370J010j37j128j115j34Q75R92K89k84q0N20O60J08
54318A31398n24o51m17l49m89l66J97O42L78m20j094j376j513j603j366o57J87
54301A21977P39Q84O75J98l09m93k99o0j1j7Q9K14K55K69K05j64p72j112q52k64
54281A21152K51P11J253J664J698J537J472J350Q98L18N3J0k85q14j004o48k71
54264A29345k77k83K95J316K004J862J121L17k51n92p64p23l93J80P38R27O47
54247A35469K38K11O19Q95M88l73r31q55o19p18r74r28n24%O28J335J593Q27n68
54228A35813j441j281p76o57o61j45P55J224Q61J35k69j69J06J64n9l53n26n72
$$ plain form
54350 153215 152198 151111 149233 146458 143278 140270 137769 135847 134348 133048 131928 131178 130776 130285 129333
54335 129333 128225 127773 128452 129822 130832 130695 129567 128452 128318 129193 130185 130474 130190 130110 130630 131290 131398
54318 131398 130874 130223 129806 129457 128968 128602 128799 129441 129819 129399 128305 126929 125416 123813 122447 121790 121977
54301 121977 122716 123600 124275 124473 124164 123671 123372 123312 123301 123284 123373 123587 123842 124111 124316 124152 123380 122268 121416 121152
54281 121152 121403 122114 123367 125031 126729 128266 129738 131088 131986 132304 132357 132367 132082 131268 130264 129616 129345
54264 129345 129068 128785 129080 130396 132400 134262 135383 135700 135449 134857 134093 133370 132977 133157 133895 134822 135469
54247 135469 135707 135918 136537 137432 137920 137547 136616 135761 135142 134424 133450 132522 131998 131998 132626 133961 135554 136381 135813
54228 135813 134372 133091 132315 131658 130997 130852 131607 132831 133692 133827 133558 133389 133495 133659 133600 133247 132721 132149
54210A32149m63j4O68R04J17j217j908j440m64K72P39J095J031L20m54n04R8N46
54192A31475M12O1l4J24K77L17L20L25K53M5j32M9O45J158J039M01j33k80l21
54173A36001m18l22RJ06k70o06l44L05O94N71J98q2l4L72P10L84m27o33L96J771
54153A38381K128J319L31k34o94j353j864j807j256n85q2R0p2l32m47m72n55m93
54135A32003L9Q75J400J337J094J219J716K061J711O13o28j157o23M36J088Q36
54119A44020q1r35r64K9J344J887J312L45k01l03k87m7O93J669K268K265J867
54102A54881J269P33Q21J827L086L579L187K696K571K402J673M66q28j914k541
54087A73908k526k066j649j471j290r11n29l72l80l86l34k10N1M85J041J657K190
$$ plain form
54210 132149 131686 131672 132340 133244 133361 132144 130236 128796 128332 128604 129343 130438 131469 131789 131335 130831 130929 131475
54192 131475 131887 131948 131914 132038 132315 132632 132952 133277 133530 133575 133443 133492 134137 135295 136334 136735 136602 136322 136001
54173 136001 135583 135261 135270 135376 135106 134500 134156 134461 135155 135726 135924 135842 135808 136180 136890 137274 136847 136214 136610 138381
54153 138381 140509 141828 142159 141925 141231 139878 138014 136207 134951 134366 134284 134374 134302 133970 133523 133051 132496 132003
54135 132003 132042 132917 134317 135654 136748 137967 139683 141744 143455 144068 143440 142283 141660 142096 143184 144020
54119 144020 143939 143004 142040 142069 143413 145300 146612 146957 146756 146453 146166 146119 146812 148481 150749 153014 154881
54102 154881 156150 156883 157704 159531 162617 166196 169383 172079 174650 177052 178725 179191 178363 176449 173908
54087 173908 171382 169316 167667 166196 164906 163995 163466 163094 162714 162328 161994 161784 161835 162320 163361 165018 167208
54070A67208K400K223J909J705J510J128O23J21m52j077j304q29j59q4o11j003
54054A73308q75n49k45L55J416K436K837K728K716L100L606L819L662L393L233
54039B04940L169L172L492M331N312N708N372M872M571M227L781L752M226M255
54025B65180L096J431M12J2n60j282j423j037r65j413j759j946k645l778m191
54010B49132l389k410k246k471k224j699j688k278k935l450l927m151l738k821
53996B09705j997j638j594j520j184o06j41k03p66j290j291p49L7O51O82J29l47
53979A97878j03N58P49K79k00k85j82J25J000K179K770K702L100M522N855N957
53963B26904N393N539O637P867Q749R236Q753O513K797j033l921n666o294n808
$$ plain form
54070 167208 169608 171831 173740 175445 176955 178083 178706 178827 178375 177298 175994 175165 175006 174922 174311 173308
54054 173308 172433 171884 171639 171994 173410 175846 178683 181411 184127 187227 190833 194652 198314 201707 204940
54039 204940 208109 211281 214773 219104 224416 230124 235496 240368 244939 249166 252947 256699 260925 265180
54025 265180 268276 269707 270119 270131 269571 268289 266866 265829 264864 263451 261692 259746 257101 253323 249132
54010 249132 245743 243333 241087 238616 236392 234693 233005 230727 227792 224342 220415 216264 212526 209705
53996 209705 207708 206070 204476 202956 201772 201166 201025 200822 200056 198766 197475 196726 196763 197414 198096 198225 197878
53979 197878 197775 198333 199082 199361 199161 198876 198694 198819 199819 201998 204768 207470 210570 215092 220947 226904
53963 226904 232297 237836 244473 252340 261089 270325 279078 285591 288388 287355 283434 277768 271474 265666
53949B65666m728l950l758l531k692j359O0J351K349K762K491J907J634K078L100
53934B63380L961L859K812J798J632J971J987J708K006L220M568N128M911M591
53920C07532M572M627M376L893L754M416N514O076N639M812M435M456M132L139
53906C71373J895Q68J46l46o30r12j552k638l854m834n400n470n152m921n271
53891C33302o000o306n831n257n469o363o950o616n881n600n750n394m024k430
53877B55431j898k627l502l449k588j827j763k260k862l222l303l357l593l742
53863B15438l271k168j172r13j175j322j145q70o66n90p99j263j516j128l68P3
53847A97145l1l50o23q75j000p41k24k4m95j281j661j230j84Q30J178P85J76j21
$$ plain form
53949 265666 260938 256988 253230 249699 247007 245648 245708 247059 249408 252170 254661 256568 258202 260280 263380
53934 263380 267341 271200 274012 275810 277442 279413 281400 283108 285114 288334 292902 298030 302941 307532
53920 307532 312104 316731 321107 325000 328754 333170 338684 344760 350399 355211 359646 364102 368234 371373
53906 371373 373268 374136 374282 373936 373306 372394 370842 368204 364350 359516 354116 348646 343494 338573 333302
53891 333302 327302 320996 315165 309908 304439 298076 291126 284510 278629 273029 267279 261885 257861 255431
53877 255431 253533 250906 247404 243955 241367 239540 237777 235517 232655 229433 226130 222773 219180 215438
53863 215438 212167 209999 208827 207914 206739 205417 204272 203402 202736 202146 201347 200084 198568 197440 197072 197145
53847 197145 197114 196764 196141 195266 194266 193525 193301 193277 192782 191501 189840 188610 188426 189256 190434 191219 191395 191274
53829A91274j22j27j74j21m6j03m2M97J270J525J025M72O05J293J787J689J365
53812B02067J430K042K767L070K954K961L483M236M597M313L682L175L074L419
53798B47270L951M163L714K803K037J858K221K685K737K214J534J286J471J434
53784B81378P25l50j300k097k839l275l298l464m278n172n088m031l194l420m267
53769B36030m764m486l629k594j836j597j637j539j410j701k398k882k804k387
53755B00366j789q76O0K55l84q05k04P41Q22L7n43l71J7Ol24o20q14r75j030r16
53735A92653o58j36Q79K212L082K756J323l22j266j212m75M69J307J887K069J805
53719B06373J237O40J85n9R5Q53K000K790K590J572N62K55P55J703K537K756K273
$$ plain form
53829 191274 191152 191025 190851 190730 190684 190581 190539 191036 192306 193831 194856 195328 195933 197226 199013 200702 202067
53812 202067 203497 205539 208306 211376 214330 217291 220774 225010 229607 233920 237602 240777 243851 247270
53798 247270 251221 255384 259098 261901 263938 265796 268017 270702 273439 275653 277187 278473 279944 281378
53784 281378 282103 281753 280453 278356 275517 272242 268944 265480 261202 256030 250942 246911 243717 240297 236030
53769 236030 231266 226780 223151 220557 218721 217124 215487 213948 212538 210837 208439 205557 202753 200366
53755 200366 198577 197701 197761 198016 197632 196827 196623 197364 198186 198223 197680 197309 197326 197332 197008 196388 195574 194599 193569 192653
53735 192653 191995 191859 192738 194950 198032 200788 202111 201789 200523 199311 198836 199305 200612 202499 204568 206373
53719 206373 207610 208250 208435 208376 208471 209324 211324 214114 216704 218276 218838 219093 219848 221551 224088 226844 229117
53702B29117J618J501K033K625K799K812L159L722L793L029J920J136P44M22K01
53687B60631M51J081J301N43o55j182o96J6O5m99r55q75n13k82k44j82M8M18Q52
53668B59323J229J337J017M16j19m04n81q27j097j224j106o30L15J507K232J952
53652B63340J028M08N37R74J107Q45M76K14J69M18Q45J175J365J689K172K361
53636B79123J976J431J310J554J737J893K433L266L649L117K154J619J807K333
53622C09402K705K772K689K682K854L075K972K271J217O42J201K535L480L378
53608C43875K823K758L141L199K770K498K625K538J918J421J644K079J934J308
53594C76531P69K87m80j119q53J29O95L02m28q26j010j288j443j101l47M04Q23
$$ plain form
53702 229117 230735 232236 234269 236894 239693 242505 245664 249386 253179 256208 258128 259264 260008 260430 260631
53687 260631 261082 262163 263464 264007 263352 262170 261474 261490 261555 261056 260101 259226 258713 258431 258187 258005 258053 258471 259323
53668 259323 260552 261889 262906 263322 263203 262799 262218 261391 260294 259070 257964 257334 257649 259156 261388 263340
53652 263340 264368 264776 265313 266287 267394 268239 268715 268929 269098 269516 270361 271536 272901 274590 276762 279123
53636 279123 281099 282530 283840 285394 287131 289024 291457 294723 298372 301489 303643 305262 307069 309402
53622 309402 312107 314879 317568 320250 323104 326179 329151 331422 332639 333281 334482 337017 340497 343875
53608 343875 346698 349456 352597 355796 358566 361064 363689 366227 368145 369566 371210 373289 375223 376531
53594 376531 377300 377587 377107 375988 375135 375264 375959 376261 375833 375007 373997 372709 371266 370165 369818 370222 371045
53577C71045O73j65j409k369k521j924j034l23p5k29l10J30R28J453J380R92P03
53560C66945O43P31P90N52J1k76K70J311J761J123J56l4P94J989K823L017K728
53543C85334K385K360K661K949K950K711K539K823L818N305O587P157P238P329
53529D44146P405P190O952P333Q397R520J0335J1051J1716J1942J1618J1308J1527
53516E70440J2181J2984J3859J4687J5222J5574J6264J7390J8343J8693J8787
53505G44424J9025J9168J8827J8205J7793J7690J7681J7628J7403J6851J6166
53494I40861J5875J6054J6064J5480J4752J4419J4222J3679J3013J2780J2918
53483A100117J2959J2915J3143J3473J3295J2462J1512J0897J0567J0238R580
$$ plain form
53577 371045 371718 371553 370144 367775 365254 363330 362296 361973 361898 361669 361359 361489 362417 363870 365250 366242 366945
53560 366945 367588 368319 369109 369661 369672 369396 369666 370977 372738 373861 374017 373983 374777 376766 379589 382606 385334
53543 385334 387719 390079 392740 395689 398639 401350 403889 406712 410530 415835 422422 429579 436817 444146
53529 444146 451551 458741 465693 473026 481423 490943 501278 512329 524045 535987 547605 558913 570440
53516 570440 582621 595605 609464 624151 639373 654947 671211 688601 706944 725637 744424
53505 744424 763449 782617 801444 819649 837442 855132 872813 890441 907844 924695 940861
53494 940861 956736 972790 988854 1004334 1019086 1033505 1047727 1061406 1074419 1087199 1100117
53483 1100117 1113076 1125991 1139134 1152607 1165902 1178364 1189876 1200773 1211340 1221578 1231158
53472A231158Q154N760K968P28o43j763l334n292o901p522p267o960p301q076
53458A193709q491q428q739r966j1349j1836j1580j1637j2382j3116j3218j2874
53446A060093j2498j2107j1497j0563r249p572n821m383l361k654k265k135j816
53433I74172q74L92J249J569J980K877L917M684N292O063P059Q232R569J0886
53419A037067J1853J2498J3295J4489J5674J6420J6958J7902J9455K1244K2835
53408A219690K4085K5100K5981K6643K6842K6576K6429K7267K9358L2027L4325
53397A524323L5921L7101L8163L9068L9689M0126M0591M1044M1089M0415L9259
53386A956789L8238L7538L6635L5061L3176L1769L0929K9818K7620K4360K0701
$$ plain form
53472 1231158 1239312 1245072 1248040 1248768 1248125 1246362 1243028 1237736 1230835 1223313 1216046 1209086 1201785 1193709
53458 1193709 1185218 1176790 1168051 1158085 1146736 1134900 1123320 1111683 1099301 1086185 1072967 1060093
53446 1060093 1047595 1035488 1023991 1013428 1004179 996607 990786 986403 983042 980388 978123 975988 974172
53433 974172 973298 973690 974939 976508 978488 981365 985282 989966 995258 1001321 1008380 1016612 1026181 1037067
53419 1037067 1048920 1061418 1074713 1089202 1104876 1121296 1138254 1156156 1175611 1196855 1219690
53408 1219690 1243775 1268875 1294856 1321499 1348341 1374917 1401346 1428613 1457971 1489998 1524323
53397 1524323 1560244 1597345 1635508 1674576 1714265 1754391 1794982 1836026 1877115 1917530 1956789
53386 1956789 1995027 2032565 2069200 2104261 2137437 2169206 2200135 2229953 2257573 2281933 2302634
53375B302634J7240J4212J1549Q987O207L019o02m660r129j3840j8526k2967k6931
53362B267193l0053l2055l3107l3723l4283l4856l5393l5751l5553l4488l2859
53351A895072l1407l0452k9596k8503k7527k7223k7577k8120k8571k8855k8692
53340A578549k7692k5999k4359k3304k2581k1596k0261j8995j7942j6693j4971
53329A344156j3286j2442j2448j2414j1721j0857j0754j1575j2560j2999j2835
53318A210265j2356j1681j0799r762q632p354n880m356l109k425k313k330j774
53305A127494k98J657L258M186M901O002P524Q985J0003J0622J1160J1828J2552
53292A219874J3153J3655J4257J4949J5341J5154J4656J4314J4059J3319J1840
$$ plain form
53375 2302634 2319874 2334086 2345635 2354622 2360829 2363848 2363246 2358586 2349457 2335617 2317091 2294124 2267193
53362 2267193 2237140 2205085 2171978 2138255 2103972 2069116 2033723 1997972 1962419 1927931 1895072
53351 1895072 1863665 1833213 1803617 1775114 1747587 1720364 1692787 1664667 1636096 1607241 1578549
53340 1578549 1550857 1524858 1500499 1477195 1454614 1433018 1412757 1393762 1375820 1359127 1344156
53329 1344156 1330870 1318428 1305980 1293566 1281845 1270988 1260234 1248659 1236099 1223100 1210265
53318 1210265 1197909 1186228 1175429 1165667 1157035 1149681 1143801 1139445 1136336 1133911 1131598 1129268 1127494
53305 1127494 1127196 1128853 1132111 1136297 1141198 1147200 1154724 1163709 1173712 1184334 1195494 1207322 1219874
53292 1219874 1233027 1246682 1260939 1275888 1291229 1306383 1321039 1335353 1349412 1362731 1374571
53281A374571J0055Q521P321O208M981L450J326j391m100o081p339q618j0489
53268A378415j2671j4415j5320j5654j5994j6762j7989j9319k0254k0623k0781
53257A188633k1155k1604k1520k0693j9753j9417j9596j9617j9245j8979j9266
53246I67788j9842k0021j9382j8033j6567j5809j6215j7321j8073j7937j7334
53235G71254j6788j6130j4907j3203j1499j0032q798p998p890q239q503q547q790
53222F29930r575j0781j2003j2772j2687j1845j1114j1364j2298j2626j1647j0169
53210D91049r408r444r319q454p329o651o439o267o111o404p197p841p808p478
53196C84899p548p866p583o499n487n260n398n112m388l762l377l071l012l456
$$ plain form
53281 1374571 1384626 1393147 1400468 1406676 1411657 1415107 1416433 1415042 1410942 1404861 1397522 1388904 1378415
53268 1378415 1365744 1351329 1336009 1320355 1304361 1287599 1269610 1250291 1230037 1209414 1188633
53257 1188633 1167478 1145874 1124354 1103661 1083908 1064491 1044895 1025278 1006033 987054 967788
53246 967788 947946 927925 908543 890510 873943 858134 841919 824598 806525 788588 771254
53235 771254 754466 738336 723429 710226 698727 688695 679897 671899 664009 655770 647267 638720 629930
53222 629930 620355 609574 597571 584799 572112 560267 549153 537789 525491 512865 501218 491049
53210 491049 481641 472197 462878 454424 447095 440444 434005 427738 421627 415223 408026 400185 392377 384899
53196 384899 377351 369485 361902 355403 349916 344656 339258 334146 329758 325996 322619 319548 316536 313080
53182C13080m056m179l870l710l809l681l179k732k547k327j944j724j775j812
53168B71735j835k210k769k678j688p69q18j422j629j372j208j143o63J35M48
53153B52114q7q87j285j278j226j233j167r68p00m92m79o26n98j22M70M87j86
53136B41737p81o24l5J79o0RQ02J702J846J259P07O21O66M27l3m10o00o11l94
53117B46407p9k3l29n11p3P20J113P48n3q46j460j889k140k248k161j740j102
53100B34334q01j155j649j515q42m33o09q70q16p22q08p32k09L54M04M4k02j95
53082B23578j98l59n52p11q92j041r58n40PK64l5o39q86m60J38K14j04q8L88N54
53062B17680o3q80j107q46p43r52j030o88n5O61J321J697J578J111P08O12P02
$$ plain form
53182 313080 309024 304845 300975 297265 293456 289775 286596 283864 281317 278990 277046 275322 273547 271735
53168 271735 269900 267690 264921 262243 260555 259786 258968 257546 255917 254545 253337 252194 251531 251666 252114
53153 252114 252027 251140 249855 248577 247351 246118 244951 243983 243283 242791 242312 241686 241088 240966 241436 241923 241737
53136 241737 240956 240332 240297 240476 240416 240425 241227 242929 244775 246034 246741 247362 248028 248455 248422 248012 247412 246801 246407
53117 246407 246328 246305 245976 245465 245392 246112 247225 247973 247920 247074 245614 243725 241585 239337 237176 235436 234334
53100 234334 233533 232378 230729 229214 228372 227939 227330 226460 225644 224922 224114 223382 223173 223527 223931 223975 223773 223578
53082 223578 223380 223021 222469 221758 220866 219825 218867 218327 218334 218598 218563 217924 217038 216578 216716 216930 216826 216738 217126 217680
53062 217680 217617 216737 215630 214784 214041 213089 212059 211371 211316 211977 213298 214995 216573 217684 218392 219004 219706
53045B19706P31N80K69j10m79p64q08m63P5K20l25r83r34j93M64O22N94O12M88
53026B19302L39P12J546J839R82j87n09l9L11K43J85K72J43k50m81l46j40j30
53008B23792k95n20o64n04o8J49j61m86j68N55Q74O29M12M29K09m40r69r09m47
52989B21418N7N46R12P93J49l83j75O34J376J581J210N08j22l16%O30J416K176
52971B32410K441J791O00j40kL71L64L52J034K129K526J648J33r68j253j078j001
52954B41357j275j784k254k484k387j923j156m11j85p13j649k250j941p75N27
52939B20697J121P93K35K74Q22R46Q5j116j514q36J3nr18j771j661o93K00L30
52921B17002L1J39Q83J617J696J222P29M56K16j89p75j412j843j733j012j12L93
$$ plain form
53045 219706 220437 221017 221286 221176 220697 219933 219125 218662 218737 218957 218632 217649 216715 216522 216986 217608 218202 218814 219302
53026 219302 219641 220353 221899 223738 224720 224533 224024 223985 224296 224539 224724 224996 225139 224889 224408 224062 223922 223792
53008 223792 223497 222977 222313 221809 221741 221890 221729 221243 221075 221630 222504 223133 223545 223974 224183 223743 222774 221865 221418
52989 221418 221475 222021 222933 223726 223875 223492 223317 223951 225327 226908 228118 228626 228504 228188 228188 228818 230234 232410
52971 232410 234851 236642 237242 237102 237100 237471 237835 238187 239221 241350 243876 245524 245657 244689 243436 242358 241357
52954 241357 240082 238298 236044 233560 231173 229250 228094 227683 227498 226785 225136 222886 220945 220170 220697
52939 220697 221818 222611 222846 223120 223942 224888 224973 223857 222343 221507 221520 221515 220597 218826 217165 216472 216672 217002
52921 217002 217033 217172 218055 219672 221368 222590 223319 223775 223991 223802 223027 221615 219772 218039 217027 216915 217308
52904B17308M00K83L58N39N33J54n85j402j718j059L64J635J950J266J52p60j029
52887B18389n01M77J117Q95J80k39r5K32M16M74L88O3j69L16J459K319K250J754
52869B29725J574J538J005Q6m55l43qK25L74K23n93j781k440k196j658j498j732
52852B22046k076k348k236j404j78M64M0q22j266j110n79J45O33K43r76j970j937
52835B06669j296q82p67n65k98j60M6M51N64J7o26o66l50k49q3O52J372J090K24
52816B05143K03J243J959J536Q57Q90J230J001K50m28q99j339j626j590j432j299
52800B05699r08j22N62O26L11J52J72O5j38j78q9j01k09k48k02p9K72P84R74N87
52780B07930J39K49O33M58m33j281j469j230j049r20n54KL65L86L38M63O36O49
$$ plain form
52904 217308 217708 217991 218349 218888 219421 219575 218990 217588 215870 214811 215175 216810 218760 220026 220178 219418 218389
52887 218389 217888 218365 219482 220377 220557 220318 220223 220455 220871 221345 221733 221796 221627 221943 223402 225721 227971 229725
52869 229725 231299 232837 233842 233928 233473 233130 233122 233347 233721 233944 233351 231570 229130 226934 225276 223778 222046
52852 222046 219970 217622 215386 213982 213804 214268 214308 213486 212220 211110 210531 210676 211309 211552 210576 208606 206669
52835 206669 205373 204491 203724 203159 202861 202701 202747 203198 203762 203779 203153 202487 202137 201888 201805 202457 203829 204919 205143
52816 205143 205346 206589 208548 210084 210941 211831 213061 214062 214312 213884 212985 211646 210020 208430 206998 205699
52800 205699 204791 204669 205231 205857 206168 206320 206492 206557 206419 206241 206152 206051 205842 205594 205392 205313 205585 206369 207343 207930
52780 207930 208069 208318 208951 209409 208976 207695 206226 204996 203947 203027 202473 202475 202840 203226 203564 204027 204663 205312
52762B05312O00O78O59J09q38j330q35Q2M49J07k87k61J08O96J497K180K206J663
52744B12795J366J815K515K672K118J184J74n96o47J71J243J700J363Q28O64Q43
52728B30208R32O03p5q17j406j791j860j403n29J43J24l02n27n28p30j112j194
52711B19736r18p02m92K12J177J270J89p38l21P10Q41N4l52O4K91l20r28n23N01
52692B19751R34L77m19p22o13m91l32J22O92P85K26l77m76l93p24j209r96m5O60
52673B16750N59K50L13L18k51q15n14L41P01M33M02R09J189P37R9j3L50Q07J346
52654B23911K051K600K587K029J201K48o72j204j171r08p98p12k78M46R78J006
52638B31314O33P3m96q08o45j48K59M64Q00J474K125K281J967J548J039J43j004
$$ plain form
52762 205312 205912 206590 207249 207358 206520 205190 204355 204437 204886 204993 204706 204445 204553 205249 206746 208926 211132 212795
52744 212795 214161 215976 218491 221163 223281 224465 224639 224043 223396 223567 224810 226510 227873 228701 229365 230208
52728 230208 231140 231743 231668 230851 229445 227654 225794 224391 223862 224005 224129 223827 223300 222772 222042 220930 219736
52711 219736 218818 218116 217624 217836 219013 220283 220472 219734 219413 220123 220964 221018 220666 220730 221021 220701 219773 219250 219751
52692 219751 220685 221062 220643 219921 219308 218817 218485 218607 219299 220084 220310 219933 219457 219064 218340 217131 216135 216090 216750
52673 216750 217309 217559 217872 218190 217939 217124 216610 216951 217652 218085 218487 219396 220585 221322 221421 221408 221758 222565 223911
52654 223911 225962 228562 231149 233178 234379 234627 233955 232751 231580 230672 229874 229162 228884 229330 230308 231314
52638 231314 231947 232020 231524 230716 230071 229923 230182 230646 231446 232920 235045 237326 239293 240841 241880 242023 241019
52621B41019j681j416o60j64l3J41L36j8j105k184k331j417j49P00Q55N70L66
52604B32829N78R96J003K65q46j601j537p45K89R52Q93L63L8L22R11J181Q86L50
52586B37127M7J55M37M98J90j75j96J31M45N30N07N33N92O35O11L33l39j119j456
52567B39486j212q09n77l46J68R26J667K084J832Q07m69j214j300j276j347j071
52551B37349k97L28K93m5k09m16r37j269p94J35O50N53K88J2m10p07m09K77O34
52532B35026M92M07O97J005R03L89k90p93p11m4N04L05k13r8O96J235J008M90
52514B41008K17J43J89N83J242J566J299R75J077J307J136N19k96j199j938j931
52498B45897r84J40M34k35j118j500j318j014j030j370j437o58O65J513J379Q27
$$ plain form
52621 241019 239338 237922 237262 237098 237065 237206 237542 237524 236419 234235 231904 230487 230338 231038 231893 232463 232829
52604 232829 233407 234403 235406 235671 234825 233224 231687 230942 231231 232183 233076 233439 233477 233799 234710 235891 236777 237127
52586 237127 237174 237329 237766 238264 238454 238279 238083 238214 238659 239189 239696 240229 240821 241456 242067 242400 242061 240942 239486
52567 239486 238274 237465 236888 236542 236710 237636 239303 241387 243219 244026 243557 242343 241043 239767 238420 237349
52551 237349 237052 237380 237673 237628 237419 237003 236066 234797 234003 234138 234788 235341 235629 235641 235231 234524 234115 234392 235026
52532 235026 235518 235925 236622 237627 238530 238919 238629 237836 237125 237081 237585 237890 237677 237579 238275 239510 240518 241008
52514 241008 241225 241368 241557 242140 243382 244948 246247 247222 248299 249606 250742 251261 250965 249766 247828 245897
52498 245897 244913 245053 245487 245252 244134 242634 241316 240302 239272 237902 236465 235807 236472 237985 239364 240191
52482B40191N04K34l77r38p18J41P19O24M72P97J166Q54Km68j4R06J465J422J172
52463B48154J064J086J167J390J635J419M67o27q97j09R40J297P14l80j367j763
52447B54190j463r06p01r36j082p21j16J94O8j99l26l26l64n55p84p22j51O60
52429B45760J120R56N26L56N63Q55R09O45K15r4m3L75R45J506K080K740L381L780
52411B66575L835L767L999M731N642O228O400O367N886M233J322j662l368l721
52397C10234l610l551l395l158l164l288k959k157j582j529j369n90L90R36J049
52382B82257J033Q52M42K22O42J524K308K699K675K246J671J552K162K928L154
52367C08367L006L230L977M544M268L202J897Q81L89L06L21L82Q18J814K826L054
$$ plain form
52482 240191 240695 240929 240552 239614 238896 239037 239756 240380 240852 241649 242815 243669 243671 243203 243189 244095 245560 246982 248154
52463 248154 249218 250304 251471 252861 254496 255915 256382 255755 254858 254749 255689 256986 257700 257320 255953 254190
52447 254190 252727 251821 251120 250184 249102 248381 248265 248459 248527 248328 248002 247676 247312 246757 245973 245251 245100 245760
52429 245760 246880 247836 248362 248718 249281 250136 251045 251690 251905 251811 251768 252143 253088 254594 256674 259414 262795 266575
52411 266575 270410 274177 278176 282907 288549 294777 301177 307544 313430 317663 318985 317323 313955 310234
52397 310234 306624 303073 299678 296520 293356 290068 287109 284952 283370 281841 280472 279882 280272 281208 282257
52382 282257 283290 284142 284584 284806 285448 286972 289280 291979 294654 296900 298571 300123 302285 305213 308367
52367 308367 311373 314603 318580 323124 327392 330594 332491 333372 333761 334067 334388 334770 335588 337402 340228 343282
52351C43282K422J750J852K695L614M114M277M431M614M612M451M538N103N796
52337C97551O219O574P255Q045Q415Q550R219J0553J1850J2783J3855J5187J5942
52324E31998J5669J5289J5827J6854J7254J6948J6757J6899J6841J6462J6216
52313G13014J6132J5712J4943J4422J4252J3794J2804J1937J1630J1367J0540
52302H60547R445Q749Q431P855O592M794K898J313K36m18q61j185j519k240l520
52287I01117m728m912m080l228k931k550j344L29J563K203K856L891N136O490
52273H99812Q061R647J0631J0656J0069R566R578J0069J0625J0770J0389R837
52261A019710R488R250Q809Q249P992Q088Q014P341O259N209M287L348K356J335
$$ plain form
52351 343282 345704 347454 349306 352001 355615 359729 364006 368437 373051 377663 382114 386652 391755 397551
52337 397551 403770 410344 417599 425644 434059 442609 451828 462381 474231 487014 500869 516056 531998
52324 531998 547667 562956 578783 595637 612891 629839 646596 663495 680336 696798 713014
52313 713014 729146 744858 759801 774223 788475 802269 815073 827010 838640 850007 860547
52302 860547 869992 878741 887172 895027 901619 906413 909311 910624 910860 910442 909581 908396 906877 904637 901117
52287 901117 896389 891477 887397 884169 881238 878688 877344 877673 879236 881439 884295 888186 893322 899812
52273 899812 907873 917520 928151 938807 948876 958442 968020 978089 988714 999484 1009873 1019710
52261 1019710 1029198 1038448 1047257 1055506 1063498 1071586 1079600 1086941 1093200 1098409 1102696 1106044 1108400 1109735
52247A109735J67j198k423l197l824m860o159o897o763o479o721p118o933o285
52233A041045n904n910n724n102m405l748k816j724j152j214j072k40O20Q31R00
52218A004385J584K465K591K135K175K965L660L891M338N354O122N821M836M131
52204A056453L999M070M109M149M129L946L762L774L904L950L916L834L588L127
52190A110710K648K205J495M11n12o96m06n03j433k839m211n318o051o235n903
52175A083362n436n238n283n184m572l462k275j524j343j319r12NJ017J609J654
$$ plain form
52247 1109735 1109902 1108704 1106281 1103084 1099260 1094400 1088241 1081344 1074581 1068102 1061381 1054263 1047330 1041045
52233 1041045 1035141 1029231 1023507 1018405 1014000 1010252 1007436 1005712 1004560 1003346 1002274 1002034 1002654 1003485 1004385
52218 1004385 1005969 1008434 1011025 1013160 1015335 1018300 1021960 1025851 1030189 1035543 1041665 1047486 1052322 1056453
52204 1056453 1060452 1064522 1068631 1072780 1076909 1080855 1084617 1088391 1092295 1096245 1100161 1103995 1107583 1110710
52190 1110710 1113358 1115563 1117058 1117469 1116957 1116261 1115855 1115352 1113919 1111080 1106869 1101551 1095500 1089265 1083362
52175 1083362 1077926 1072688 1067405 1062221 1057649 1054187 1051912 1050388 1049045 1047726 1046814 1046819 1047836 1049445 1051099
$$ [...]
##END NTUPLES=NMR SPECTRUM
##END=
