
##TITLE=AC1247__6608933_3rmGbhHjgC
##JCAMPDX= 6.0         $$ Bruker NMR JCAMP-DX V2.0
##DATA TYPE= NMR SPECTRUM
##DATA CLASS= NTUPLES
##ORIGIN= BRUKER
##OWNER= Administrator
$$ 1.72 TOPSPIN		Version 2.1
$$ 2012-08-01 19:43:05.265 -0500  Administrator@TOPSPIN
$$ Compression mode = diff/dup
##.OBSERVE FREQUENCY= 400.02188249412
##.OBSERVE NUCLEUS= ^1H
##.ACQUISITION MODE= SIMULTANEOUS (DQD)
##.ACQUISITION SCHEME= undefined
##.AVERAGES= 8
##.DIGITISER RES= 22
##SPECTROMETER/DATA SYSTEM= spect
##.PULSE SEQUENCE= zg30
##.SOLVENT NAME= COFFEE_meoh
##.SHIFT REFERENCE= INTERNAL, COFFEE_meoh, 1, 14.98509
##AUDIT TRAIL= $$ (NUMBER, WHEN, WHO, WHERE, PROCESS, VERSION, WHAT)
$$ ##TITLE= Audit trail, TOPSPIN		Version 2.1
$$ ##JCAMPDX= 5.01
$$ ##ORIGIN= Bruker BioSpin GmbH
$$ ##OWNER= Administrator
$$ $$ C:\Bruker\TOPSPIN/data/COFFEE/nmr/AC1247__6608933_3rmGbhHjgC/10/pdata/1/auditp.txt
$$ ##AUDIT TRAIL=  $$ (NUMBER, WHEN, WHO, WHERE, PROCESS, VERSION, WHAT)
(   1,<2012-08-01 19:42:56.656 -0500>,<Administrator>,<TOPSPIN>,<go>,<TOPSPIN 2.1>,
      <created by zg
	started at 2012-08-01 19:41:50.031 -0500,
	POWCHK enabled, PULCHK disabled,
       configuration hash MD5:
       6B 1B 68 BB D9 2E 58 E2 7F 35 AD 54 07 DF 0E 41
       data hash MD5: 64K
       D1 7C 53 F2 ED 03 EA DC 55 6A E4 4D 6F 8B F7 AE>)
(   2,<2012-08-01 19:43:00.906 -0500>,<Administrator>,<TOPSPIN>,<proc1d>,<TOPSPIN 2.1>,
      <Start of raw data processing
       efp LB = 0 FT_mod = 6 PKNL = 1 PHC0 = 0 PHC1 = 0 SI = 32K 
       data hash MD5: 32K
       BB 6E 6B 29 51 4E AC D9 44 5F 8C 3C 41 4B 86 F0>)
(   3,<2012-08-01 19:43:01.203 -0500>,<Administrator>,<TOPSPIN>,<proc1d>,<TOPSPIN 2.1>,
      <pk PHC0 = 176.8579 PHC1 = 0 
       data hash MD5: 32K
       BA F0 79 79 43 90 8A 6D 3A 9E 69 5C 7D C3 D6 18>)
(   4,<2012-08-01 19:43:01.265 -0500>,<Administrator>,<TOPSPIN>,<proc1d>,<TOPSPIN 2.1>,
      <abs ABSG = 1 
       data hash MD5: 32K
       8F AC AA D6 B7 AB CB 46 19 54 97 4D FF CE A1 52>)
(   5,<2012-08-01 19:43:01.296 -0500>,<Administrator>,<TOPSPIN>,<proc1d>,<TOPSPIN 2.1>,
      <abs ABSG = 2 
       data hash MD5: 32K
       14 87 8F 5E 7F 20 E9 C1 58 32 C8 B0 0C 4B 93 2F>)
(   6,<2012-08-01 19:43:01.328 -0500>,<Administrator>,<TOPSPIN>,<proc1d>,<TOPSPIN 2.1>,
      <abs ABSG = 3 
       data hash MD5: 32K
       9C 79 4E AF 64 FD AF ED DE F7 05 07 BB 08 E3 68>)
(   7,<2012-08-01 19:43:01.359 -0500>,<Administrator>,<TOPSPIN>,<proc1d>,<TOPSPIN 2.1>,
      <abs ABSG = 4 
       data hash MD5: 32K
       30 DB 69 19 22 D3 D0 FA 8B F1 28 54 B4 4D 47 00>)
(   8,<2012-08-01 19:43:01.390 -0500>,<Administrator>,<TOPSPIN>,<proc1d>,<TOPSPIN 2.1>,
      <abs ABSG = 5 
       data hash MD5: 32K
       48 DE 5A C8 4E 4D 86 52 B3 09 09 FE D1 07 80 E0>)
$$ ##END=
$$ 
$$ $$ hash MD5
$$ $$ 1B F8 FE 1F 55 A6 7E 27 3F 93 2E 93 AE 29 32 2D
##$RELAX= 
##$RELAX= 
##$RELAX= 
##$RELAX= 
##$RELAX= 
##$RELAX= 
##$RELAX= 
$$ Bruker specific parameters
$$ --------------------------
##$DU= <C:\Bruker\TOPSPIN>
$$ [...]
##$TP= (0..7)
150 150 150 150 150 150 150 150
##$TP07= 0
##$TPNAME0= <>
##$TPNAME1= <>
##$TPNAME2= <>
##$TPNAME3= <>
##$TPNAME4= <>
##$TPNAME5= <>
##$TPNAME6= <>
##$TPNAME7= <>
##$TPOAL= (0..7)
0.5 0.5 0.5 0.5 0.5 0.5 0.5 0.5
##$TPOFFS= (0..7)
0 0 0 0 0 0 0 0
##$TUNHIN= 0
##$TUNHOUT= 0
##$TUNXOUT= 0
##$USERA1= <user>
##$USERA2= <user>
##$USERA3= <user>
##$USERA4= <user>
##$USERA5= <user>
##$V9= 5
##$VALIST= <valist>
##$VCLIST= <CCCCCCCCCCCCCCC>
##$VD= 0
##$VDLIST= <DDDDDDDDDDDDDDD>
##$VPLIST= <PPPPPPPPPPPPPPP>
##$VTLIST= <TTTTTTTTTTTTTTT>
##$WBST= 1024
##$WBSW= 4
##$XGAIN= (0..3)
0 0 0 0
##$XL= 0
##$YL= 0
##$YMAX_a= 449969
##$YMIN_a= -588652
##$ZGOPTNS= <>
##$ZL1= 120
##$ZL2= 120
##$ZL3= 120
##$ZL4= 120
##$ABSF1= 14.98509
##$ABSF2= -5.573092
##$ABSG= 5
##$ABSL= 3
##$ALPHA= 0
##$AQORDER= 0
##$ASSFAC= 0
##$ASSFACI= 0
##$ASSFACX= 0
##$ASSWID= 0
##$AUNMP= <proc_prof1d_extract_pilot.lims>
##$AXLEFT= 0
##$AXNAME= <>
##$AXNUC= <1H>
##$AXRIGHT= 0
##$AXTYPE= 0
##$AXUNIT= <>
##$AZFE= 0.1
##$AZFW= 0.1
##$BCFW= 0
##$BC_mod= 0
##$BYTORDP= 0
##$COROFFS= 0
##$CY= 15
##$DATMOD= 1
##$DC= 0
##$DFILT= <>
##$DTYPP= 0
##$F1P= 0
##$F2P= 0
##$FCOR= 0.5
##$FTSIZE= 32768
##$FT_mod= 6
##$GAMMA= 0
##$GB= 0
##$INTBC= 1
##$INTSCL= 1
##$ISEN= 128
##$LB= 0
##$LEV0= 0
##$LPBIN= 0
##$MAXI= 10000
##$MC2= 0
##$MEAN= 0
##$ME_mod= 0
##$MI= 0
##$NCOEF= 0
##$NC_proc= -8
##$NLEV= 6
##$NOISF1= 0
##$NOISF2= 0
##$NSP= 0
##$NTH_PI= 0
##$NZP= 0
##$OFFSET= 14.98509
##$PC= 1
##$PHC0= 176.8579
##$PHC1= 0
##$PH_mod= 1
##$PKNL= yes
##$PPARMOD= 0
##$PPDIAG= 0
##$PPIPTYP= 0
##$PPMPNUM= 2147483647
##$PPRESOL= 1
##$PSCAL= 4
##$PSIGN= 0
##$PYNMP= <proc.py>
##$REVERSE= no
##$SF= 400.02
##$SI= 32768
##$SIGF1= 0
##$SIGF2= 0
##$SINO= 400
##$SIOLD= 32768
##$SPECTYP= <>
##$SREGLST= <1H.CDCl3>
##$SSB= 0
##$STSI= 32768
##$STSR= 0
##$SW_p= 8223.68421052631
##$SYMM= 0
##$S_DEV= 0
##$TDeff= 65536
##$TDoff= 0
##$TI= <>
##$TILT= no
##$TM1= 0
##$TM2= 0
##$TOPLEV= 0
##$USERP1= <user>
##$USERP2= <user>
##$USERP3= <user>
##$USERP4= <user>
##$USERP5= <user>
##$WDW= 1
##$XDIM= 32768
##$YMAX_p= 433359399
##$YMIN_p= -741322
##$CURPLOT= <Network HP LaserJet P1505>
##$CURPRIN= <$Network HP LaserJet P1505>
##$DFORMAT= <normdp>
##$LAYOUT= <+/1D_H.xwp>
##$LFORMAT= <normlp>
##$PFORMAT= <normpl>
##$SURQMSG= 1
$$ End of Bruker specific parameters
$$ ---------------------------------
##NTUPLES= NMR SPECTRUM
##VAR_NAME=  FREQUENCY,     SPECTRUM/REAL,   SPECTRUM/IMAG
##SYMBOL=    X,             R,               I
##VAR_TYPE=  INDEPENDENT,   DEPENDENT,       DEPENDENT
##VAR_FORM=  AFFN,          ASDF,            ASDF
##VAR_DIM=   32768,         32768,           32768
##UNITS=     HZ,            ARBITRARY UNITS, ARBITRARY UNITS
##FACTOR=    0.250966925370066, 1,           1
##FIRST=     8223.43324360094, -122308,      23160
##LAST=      0,             174522,          -51960
##MIN=       0,             -741322,         0
##MAX=       8223.43324360094, 433359399,    0
$$ Real data points
##PAGE= N=1
##DATA TABLE= (X++(R..R)), XYDATA
$$ [...]
19480E9721B4498a74865c46l55880A84072Q431a40890K326o1606B86902b13783
$$ 59721 24498 -174865 -346 -356226 184072 192503 -140890 -138564 -200170 286902 -213783
19468D0563P8794a31096e9795A73899A3490c13694g4322m6244j22196h1974A95859
$$ 40563 119357 -131096 -59795 173899 13490 -313694 -74322 -120566 -242762 -81974 195859
19456b06049A17583a74898P2446c10j80161Q1136B1721g0523j34187a28k10441
$$ -206049 117583 -174898 -102452 -310 -180471 -99335 21721 -70523 -204710 -128 -210569
19445b10569A24232a79400j15317a04636A36332E3126b13988P0959j44627F3284
$$ -210569 124232 -179400 -294717 -104636 136332 53126 -213988 -143029 -287656 63284
19434H7748b12915M5883d5642r4177a8846j13651j55433a13587F4376J2260b46783
$$ 87748 -212915 -167032 -45642 -139819 -18846 -132497 -287930 -113587 64376 76636 -246783
19422b10356A08923d61840b02954i9138M3853j34229R4388j6405N2514n6405j31281
$$ -210356 108923 -461840 -202954 -99138 -55285 -189514 -95126 -111531 -59017 -115422 -246703
19411b46703F338a53014a5225B37201b23664R0549K2085d3862j93463C1207g1865
$$ -246703 6338 -153014 -15225 237201 -223664 -133115 -111030 -43862 -237325 31207 -71865
19399b11082b1538j07554l38810J35893a4777K108l27731E1548d08138a78977
$$ -211082 -21538 -129092 -467902 -332009 -14777 -12669 -340400 51548 -408138 -178977
19388a98413O2954r4743L4947R5415i906A30937a91728A77498h7098n9622J1455
$$ -198413 -135459 -230202 -195255 -99840 -9906 130937 -191728 177498 -87098 -146720 -135265
19377a35265D547a14085j21336p1030B3956c01035c0254q8180g671k30638g1209
$$ -135265 4547 -114085 -235421 -306451 23956 -301035 -30254 -118434 -7671 -238309 -71209
19365a73994r8711F4013f450j15383A39293M2722b00849k17201J96846a0374l81249
$$ -173994 -272705 64013 -6450 -121833 139293 182015 -200849 -418050 -221204 -10374 -391623
19354c91623a09228B56198a15041m12904A97560a47260B48779b75517J10386A14934
$$ -391623 -109228 256198 -115041 -527945 197560 -147260 248779 -275517 -165131 114934
19343a65428J0248B35209g6464j56716l5486m3337B454b13828h5737j8191r0333
$$ -165428 -155180 235209 -76464 -233180 -268666 -312003 2454 -213828 -85737 -103928 -194261
19332a94261h0474A14237b65424O2547r6567C1491P2597c5023j83723H9023a98337
$$ -194261 -80474 114237 -265424 -202877 -299444 31491 104088 -35023 -218746 89023 -198337
19320a1508l35884a31495m41526g5996b4745I0916a07675B85056f3635B0162L6238
$$ -11508 -347392 -131495 -573021 -75996 -24745 90916 -107675 285056 -63635 20162 56400
19309E6400d10520C5051d2504p6225j71936A60931p7955a9253A20661h8569j69456
$$ 56400 -410520 35051 -42504 -118729 -290665 160931 82976 -19253 120661 -88569 -258025
19298b58025c5447n337J8885d136j55103g1931A18861d6845C226J74934e1521
$$ -258025 -35447 -40784 -21899 -4136 -159239 -71931 118861 -46845 3226 178160 -51521
19286A24280b76360a4165j62402O4164j80181i1666A44054b84311K5986d0825
$$ 124280 -276360 -14165 -176567 -112403 -292584 -91666 144054 -284311 -258325 -40825
19275i4929j76464B63564b35382R8258B79182b62412i1762B34430a81462J6782
$$ -94929 -271393 263564 -235382 -137124 279182 -262412 -91762 234430 -181462 -164680
19265a64680B9323a78582G4436J28450g5177j51594o2341J12900A00655b73244
$$ -164680 29323 -178582 74436 202886 -75177 -226771 -289112 -176212 100655 -273244
19254H8182R1515a27785i456B40755D8114J06870e14769C42377b6163j52242p7857
$$ 88182 179697 -127785 -9456 240755 48114 154984 -514769 342377 -26163 -178405 -256262
19243b56262m4000J08297b7276A21146b23072B306e0654D3099a99454B49615G7009
$$ -256262 -300262 -191965 -27276 121146 -223072 2306 -50654 43099 -199454 249615 77009
19231h4267A9725a47533A87103G924J07086a12789k47830d3839p5572B3568d9969
$$ -84267 19725 -147533 187103 7924 115010 -112789 -360619 -43839 -119411 23568 -49969
19219A80575a60707j56803R7470A27549a18072B59006a00185k34687h6149M0491
$$ 180575 -160707 -317510 -220040 127549 -118072 259006 -100185 -334872 -86149 -45658
19209d5658I3174c14189J21360J0526H4707m258B3064e8424I4404B3190h1224
$$ -45658 93174 -314189 -192829 -182303 84707 80449 23064 -58424 94404 23190 -81224
19197A59789c91463I9650j6335J34387a56134j66934L3740h2900B53179a65281
$$ 159789 -391463 99650 83315 217702 -156134 -323068 -289328 -82900 253179 -165281
19186d85783g633B1190a8640j81582A31986D0954L2461O4674b03600d9637A64623
$$ -485783 -7633 21190 -18640 -200222 131986 40954 73415 138089 -203600 -49637 164623
19174C10959F1873O0936a27671A79390b18975g9730j87574Q3098d3032C44958
$$ 310959 61873 122809 -127671 179390 -218975 -79730 -267304 -184206 -43032 344958
19163a88661A39943a45736m5341c5117k50877a01649j85682H304J38275J39902
$$ -188661 139943 -145736 -191077 -35117 -285994 -101649 -287331 8304 146579 286481
19153B86481e790B33261c4600j41893k4765d9677a4927k08426N0339g4520K0586
$$ 286481 -5790 233261 -34600 -176493 -201258 -49677 -14927 -223353 -173014 -74520 -53934
19142e3934k30592D6147M5534L0166e2030J1946J5355l05587b9976p1489j10530
$$ -53934 -284526 46147 91681 121847 -52030 -40084 -24729 -330316 -29976 -101465 -211995
19131b11995H6364a59293K7137o1237g1572B27328E6264b92459A58374a67748
$$ -211995 86364 -159293 -132156 -193393 -71572 227328 56264 -292459 158374 -167748
19120F3426K24848A957J14651b25619a4161m4497d230j87404a2675l17783i191
$$ 63426 288274 1957 116608 -225619 -14161 -58658 -4230 -191634 -12675 -330458 -9191
19108A0992c04740h7667C10283h6863a9797j5734q0073o5463E7764a14698D6481
$$ 10992 -304740 -87667 310283 -86863 -19797 -35531 -115604 -181067 57764 -114698 46481
19096i6664F0948K2159a02947d2582j13384k8310B8040J8606i9855B38833i8464
$$ -96664 60948 83107 -102947 -42582 -155966 -184276 28040 46646 -99855 238833 -98464
19084c1057l6784k0322m2278D2086l793f1931A84505A222O8296O4293a35722B2828
$$ -31057 -67841 -88163 -130441 42086 38293 -61931 184505 1222 69518 133811 -135722 22828
19071A57694a06287A07087a09014D9344i9451j03020C4501a68725E3621B3826
$$ 157694 -106287 107087 -109014 49344 -99451 -202471 34501 -168725 53621 23826
19060b0581q909j22451B5385b9347D3748h5418B4443N5068c09065c792m5606l2376
$$ -20581 -29490 -151941 25385 -29347 43748 -85418 24443 79511 -309065 -3792 -49398 -81774
19048h1774J2306i06j99864e3308o5877e5258B2095J51996c47979Q6400H7404
$$ -81774 -69468 -906 -200770 -53308 -119185 -55258 22095 174091 -347979 -261579 87404
19036A118d37876C22272i4609k61426J77130h5470A03011J22078j8813H1878J30313
$$ 1118 -437876 322272 -94609 -356035 -178905 -85470 103011 225089 206276 81878 212191
19025B12191o7546A070a30616p4032B34204l4867a61179B19338g1816B0914o833
$$ 212191 144645 1070 -130616 -204648 234204 199337 -161179 219338 -71816 20914 14081
19014A4081N835d6238j11948B884K18074e4654E994e6562k40641J45902A6459
$$ 14081 19916 -46238 -158186 2884 220958 -54654 5994 -56562 -297203 -151301 16459
19002i3396m7700A15943A54b06368A04019a25045o008B6518K2580M0226M6387
$$ -93396 -141096 115943 154 -206368 104019 -125045 -131053 26518 49098 89324 135711
18991A35711c61826J37043A43579g8747K2992B09232n1173a8861B5553a42378
$$ 135711 -361826 -224783 143579 -78747 -55755 209232 158059 -18861 25553 -142378
18980a61295B75502a51169f0646b0449n0810A48575J1101n8219L14471J42293
$$ -161295 275502 -151169 -60646 -20449 -71259 148575 159676 101457 415928 558221
18970E58221j69730a59326O4646A75010a35057n7701F8640a33093j74671i8965
$$ 558221 388491 -159326 -94680 175010 -135057 -192758 68640 -133093 -307764 -98965
18959A19534g8933I0787a60536A44811b45336e4026r5217B1060H299K42832c87004
$$ 119534 -78933 90787 -160536 144811 -245336 -54026 -149243 21060 8299 251131 -387004
18947C59946A29082a75131A61089c7963C8901e474J985j45509g0653c5115A6623
$$ 359946 129082 -175131 161089 -37963 38901 -5474 -3489 -148998 -70653 -35115 16623
18935c28576E8946d8454m77833C4871N1592K83801E479J55188P526a8232A51175
$$ -328576 58946 -48454 -526287 34871 86463 370264 5479 160667 168193 -18232 151175
18923B03829j5589D8854a04139A31149K35608c9686H4912a38611B1012b54985
$$ 203829 188240 48854 -104139 131149 366757 -39686 84912 -138611 21012 -254985
18912c4671k06785f5507C42225J10407M54107B80605K60695A45483b56313J05993
$$ -34671 -241456 -65507 342225 452632 906739 280605 541300 145483 -256313 -150320
18902a50320A88623F2515c73076P2736Q9405B413d8511A65962b14404B88552b61734
$$ -150320 188623 62515 -373076 -300340 -210935 2413 -48511 165962 -214404 288552 -261734
18890C1429c340A15643b42043a3230k7800C15164a68233L141f9999j18475a7706
$$ 31429 -3340 115643 -242043 -13230 -41030 315164 -168233 -165092 -69999 -188474 -17706
18878a41192C27529b17798A25276Q4560a59480A85873H4595P2047C844b89608
$$ -141192 327529 -217798 125276 209836 -159480 185873 84595 156642 3844 -289608
18867b22487g5997n0070D1174b14142M4600P521f141k95498A21789g4874B48335
$$ -222487 -75997 -126067 41174 -214142 -169542 -162021 -6141 -301639 121789 -74874 248335
18855A0043e8095k91539B01683f7104E8458d1019l81887a13930E3513c15364f4717
$$ 10043 -58095 -349634 201683 -67104 58458 -41019 -422906 -113930 53513 -315364 -64717
18843A67377N7809f23284D5633a87659B02306f8846l24692h432l9126j32501f585
$$ 167377 225186 -623284 45633 -187659 202306 -68846 -393538 -8432 -47558 -180059 -6585
18831c14519a51242B54169C6752b24112C46873b9246D8375q222c09725b2953m5669
$$ -314519 -151242 254169 36752 -224112 346873 -29246 48375 40153 -309725 -22953 -68622
18820f8622B10885d07295A0509K46786b0596D8011J82845M2423j11832b23377
$$ -68622 210885 -407295 10509 257295 -20596 48011 230856 273279 161447 -223377
18809C62723J0395O502o7730E7294P7427b79689R4546A2551c41296B38698b6059
$$ 362723 373118 379620 311890 57294 134721 -279689 -185143 12551 -341296 238698 -26059
18797a78027O2096o12132C48728b35591A64564b9151k56571K1598N9158A94569
$$ -178027 -115931 -728063 348728 -235591 164564 -29151 -285722 -264124 -204966 194569
18786a10691F0789e8520j6014k38487a01619E3195b24393d2763J6524k08587J2752
$$ -110691 60789 -58520 -74534 -313021 -101619 53195 -224393 -42763 -26239 -234826 -222074
18775b22074c3355B17847C039a23006j48868A24398a70303j53718I4523c38820
$$ -222074 -33355 217847 3039 -123006 -271874 124398 -170303 -324021 94523 -338820
18764I0468b79861h3267a8657m7591b1824A84258H0811a58393A68924a94727Q7976
$$ 90468 -279861 -83267 -18657 -66248 -21824 184258 80811 -158393 168924 -194727 -106751
18753a06751b1264j30364j4083k07645M6960K6194J5044N8643G7090i8334B6748
$$ -106751 -21264 -151628 -165711 -373356 -326396 -300202 -285158 -226515 77090 -98334 26748
18741a28760f4230J7398d120I7777D2949J09770N9156a68859C3771a66530k7047
$$ -128760 -64230 -46832 -4120 97777 42949 152719 211875 -168859 33771 -166530 -193577
18730a93577E6873c87599f7826E3913a43574e6452k692k11691A92057D7045j5517
$$ -193577 56873 -387599 -67826 53913 -143574 -56452 -59144 -270835 192057 47045 31528
18719C1528K31306j14063c00391B29684a02186k4103j33293r1053A18410i0549
$$ 31528 262834 148771 -300391 229684 -102186 -126289 -259582 -350635 118410 -90549
18708a22982k04796A36921B811e520n4341p6856j27891J4309g1886A12028c08204
$$ -122982 -327778 136921 2811 -5520 -59861 -136717 -264608 -250299 -71886 112028 -308204
18696d3727k78266A65585a16618N2688r3349A56565d204H5996B8209Q6880a27647
$$ -43727 -321993 165585 -116618 -63930 -157279 156565 -4204 85996 28209 115089 -127647
18684c71685A77691J2249b04365G4645J74157A6732N9848j6416b00600N3455l3196
$$ -371685 177691 189940 -204365 74645 248802 16732 76580 60164 -200600 -147145 -180341
18673a80341a3452D5962f5397r2162d9605j32275k5487G6595C4695d7231E5304
$$ -180341 -13452 45962 -65397 -157559 -49605 -181880 -207367 76595 34695 -47231 55304
18661h4395A04073A613J05278d80259C48584b726A87631a79890f2199o2410p1656
$$ -84395 104073 1613 106891 -480259 348584 -2726 187631 -179890 -62199 -124609 -196265
18650a96265a0494B0184K35836b51274C03988a52302A4891a20112p0338j49407
$$ -196265 -10494 20184 256020 -251274 303988 -152302 14891 -120112 -190450 -339857
18640c39857Q5893P6905j47824A90100b25154e3929D4860d0063m8859c1646j43533
$$ -339857 -253964 -177059 -324883 190100 -225154 -53929 44860 -40063 -88922 -31646 -175179
18629a75179l4733h6324r013A02909A9050b20766C6324b02008g7448D36216a23252
$$ -175179 -209912 -86324 -95337 102909 19050 -220766 36324 -202008 -77448 436216 -123252
18617D5249g7955A17169B3563g9283l89285L9611b04177j74069a0091A90892d77270
$$ 45249 -77955 117169 23563 -79283 -468568 -428957 -204177 -378246 -10091 190892 -477270
18605a95064Q396O1177K9702a405j83501G1202a32919A54019G2731c20111B9900
$$ -195064 -186668 -125491 -95789 -1405 -184906 71202 -132919 154019 72731 -320111 29900
18593b1981q3603j25860R0660G9405d09305d7219G3838f7632A0323J82317F3482
$$ -21981 -105584 -231444 -140784 79405 -409305 -47219 73838 -67632 10323 192640 63482
18581B37165a9273k51643P6489B35892H8048a31066A46750a66018B6967R1802
$$ 237165 -19273 -270916 -194427 235892 88048 -131066 146750 -166018 26967 118769
18571A18769d0950l043A0213a25577C8961a1612j2619B2811a61953M3991l0231
$$ 118769 -40950 -43993 10213 -125577 38961 -11612 -24231 22811 -161953 -117962 -148193
18560a48193B78792a82812j51364L6551C48835a12388k84611A04312b81930B28061
$$ -148193 278792 -182812 -334176 -297625 348835 -112388 -396999 104312 -281930 228061
18549A51403b66762J09399j1549F6848a92100i3536A51206P5285a33328q1431
$$ 151403 -266762 -157363 -168912 66848 -192100 -93536 151206 226491 -133328 -214759
18539b14759a4804A8479J18757E3891J49236j00326c16778C88232a25488o289
$$ -214759 -14804 18479 137236 53891 203127 102801 -316778 388232 -125488 -131777
18529a31777d4111j48926B95062b40519F332b27009a2838l25447h9128c5323A13907
$$ -131777 -44111 -193037 295062 -240519 6332 -227009 -12838 -338285 -89128 -35323 113907
18517a94716P8454A07920C3357e6917j82465J03289C9548b18799i3566E0267b24250
$$ -194716 -116262 107920 33357 -56917 -239382 -136093 39548 -218799 -93566 50267 -224250
18505a31286A4091J49644d33531g2426p4328j21934i0225l6905e6322j44975R6763
$$ -131286 14091 163735 -433531 -72426 -146754 -268688 -90225 -127130 -56322 -201297 -104534
18494a04534l96782A00126j901d357p2889A13975b71853B75458C3255g0580c1197
$$ -104534 -501316 100126 98225 -4357 -77246 113975 -271853 275458 33255 -70580 -31197
18482b59264D2548P0476O2998b65652I3873J05073i9471j0477D1978b98184A15916
$$ -259264 42548 113024 176022 -265652 93873 198946 -99471 -109948 41978 -298184 115916
18470A44410a54988C28322a64621B11289g7728P834D8692b9712D2418a2366k31636
$$ 144410 -154988 328322 -164621 211289 -77728 -69894 48692 -29712 42418 -12366 -244002
18459b44002j40568a14798G8130a08529l1618B46637G0805c17428A98507c3987
$$ -244002 -384570 -114798 78130 -108529 -140147 246637 70805 -317428 198507 -33987
18448b70936l3226D1313A9881a7783l52799a74779A9847d2193J902k44435A5785
$$ -270936 -304162 41313 19881 -17783 -370582 -174779 19847 -42193 -40291 -284726 15785
18436A85932p291G9474J62367f2671p4468h220B94391d41747c1230I9394A2134
$$ 185932 178641 79474 241841 -62671 -137139 -8220 294391 -441747 -31230 99394 12134
18424I4875j1783C9196b63370i596j89910B62600b09904C9864e9559m6093F3402
$$ 94875 83092 39196 -263370 -9596 -199506 262600 -209904 39864 -59559 -105652 63402
18412E5076A0091c2216A16212M0541N2972g7497k00182B37059a63567r9611H8021
$$ 55076 10091 -32216 116212 156753 209725 -77497 -277679 237059 -163567 -263178 88021
18400A51435J36425a61641j0596F9734l1072L6869B0862R1857J06772p1492a21667
$$ 151435 287860 -161641 -172237 69734 38662 75531 20862 112719 219491 147999 -121667
18388f7263j62020A80288p166d2361k43246I803b38716J14861m2406o7521M7122
$$ -67263 -229283 180288 173122 -42361 -285607 9803 -238716 -123855 -166261 -233782 -186660
18377a86660A7772K46064a2325q0010D2840b3527k7333A00491K66265b1054j90990
$$ -186660 17772 263836 -12325 -92335 42840 -23527 -50860 100491 366756 -21054 -212044
18366b12044l9948B34459a69746B86068f3191D3394h2797k0353M842r0154b0173
$$ -212044 -251992 234459 -169746 286068 -63191 43394 -82797 -103150 -98308 -188462 -20173
18354A32231B5297b45231g8038A06507a47446N2149F7490Q830a84277E3578J50330
$$ 132231 25297 -245231 -78038 106507 -147446 -95297 67490 76320 -184277 53578 203908
18343B03908a11685B94264c98568f3983j21875M4233B0346K41722a38014A99095
$$ 203908 -111685 294264 -398568 -63983 -185858 -141625 20346 262068 -138014 199095
18332a93665e8579B4909a57868A64592i3036B23649a6775C1924a66762N2905j04185
$$ -193665 -58579 24909 -157868 164592 -93036 223649 -16775 31924 -166762 -113857 -218042
18321b18042M3582A0509c16869a04051j27664A2592g7761J2855l09109a54711
$$ -218042 -174460 10509 -316869 -104051 -231715 12592 -77761 -64906 -374015 -154711
18310f2539A40866b08643b7017B61796n1557I7034a60366O4598B3960a92403h5389
$$ -62539 140866 -208643 -27017 261796 210239 97034 -160366 -95768 23960 -192403 -85389
18298E1966A8595R3400a0369n0734H7505B440K4213Q4716h9027J3203n0388e6116
$$ 51966 18595 111995 -10369 -61103 87505 2440 26653 111369 -89027 -75824 -126212 -56116
18285B0854g4143m5282A78442b64974d1859A53663J73451a52589o2826A83056
$$ 20854 -74143 -119425 178442 -264974 -41859 153663 327114 -152589 -215415 183056
18274a03859E6337e348k01421A19926Q7591G8563b41350Q5119B04534a01271b1568
$$ -103859 56337 -5348 -206769 119926 207517 78563 -241350 -156231 204534 -101271 -21568
18262F3370a51054a1508n7943K3990g829r1392p4806b2541G6281i0735q0131E35527
$$ 63370 -151054 -11508 -69451 -45461 -7829 -99221 -174027 -22541 76281 -90735 -170866 535527
18249a5051B3522f9205A56314a76672B6971b7536E3180L1622b89836J28323N6126
$$ -15051 23522 -69205 156314 -176672 26971 -27536 53180 84802 -289836 -161513 -105387
18238a05387j80225A4684J40721d5936l33429h8377a9925A28760J19331H3602
$$ -105387 -285612 14684 155405 -45936 -379365 -88377 -19925 128760 248091 83602
18227B72525a04681M1395k45317A30021R6081a88461D9508K18373b70455a05679
$$ 272525 -104681 -63286 -308603 130021 226102 -188461 49508 267881 -270455 -105679
18216b32759i0046j06246N47g4645B93315b83222A36405J68215A0177g1956D2536
$$ -232759 -90046 -196292 -195745 -74645 293315 -283222 136405 304620 10177 -71956 42536
18204g341j29536A34189c79421A43584O0459M7623d7950j19909C6789g477l50022
$$ -7341 -136877 134189 -379421 143584 204043 251666 -47950 -167859 36789 -7477 -357499
18193c57499J18870F3393L7882f4433j78699E8737i3936j13415h7697D4142h2742
$$ -357499 -238629 63393 101275 -64433 -243132 58737 -93936 -207351 -87697 44142 -82742
18181B38060b21662a9180l0439A94624E8944j9509R5530f0488G6722b06550d0909
$$ 238060 -221662 -19180 -49619 194624 58944 39435 134965 -60488 76722 -206550 -40909
18169A80268n6669a03598d6120l98187A40056a11643B22825b38513J9522J03735
$$ 180268 123599 -103598 -46120 -444307 140056 -111643 222825 -238513 -218991 -115256
18159a15256G4699J18480i56n6727D0463i4697J7504A01665J2047C4213P4939
$$ -115256 74699 193179 -956 -57683 40463 -94697 -77193 101665 113712 34213 109152
18148A09152d778p3178A70431n2494R6j9827b16688J01319B23252h5538A31549
$$ 109152 -4778 -77956 170431 117937 118033 98206 -216688 -115369 223252 -85538 131549
18136F7136a24305c6002A96193a44912o1256L5045b455G3767K6641a98994j6323
$$ 67136 -124305 -36002 196193 -144912 -206168 -171123 -2455 73767 100408 -198994 -215317
18125b15317i9474l1467N8529H8222M7014n8443e5820l8956q4685L6888M0492
$$ -215317 -99474 -130941 -72412 88222 135236 76793 -55820 -94776 -179461 -142573 -102081
18114a02081A8976a99234C00146j31145B3008b73394B43465J15741c26992B3392
$$ -102081 18976 -199234 300146 169001 23008 -273394 243465 359206 -326992 23392
18103b09857L5303B76102A26313J45367I7359L5235b35240a2961A14410d8519
$$ -209857 -174554 276102 126313 271680 97359 132594 -235240 -12961 114410 -48519
18092a52940A61814h1522A9759a85758n0818R5485A74080h1031L9116o5701B16414
$$ -152940 161814 -81522 19759 -185758 -236576 -141091 174080 -81031 -41915 -107616 216414
18080G8955Q4017J02130F3106b59407p3189C444K28844c13269A05351a72485j2140
$$ 78955 162972 265102 63106 -259407 -332596 3444 232288 -313269 105351 -172485 -184625
18069a84625A26262l1822J20191b11125n0582B13056J09158b35468m1862i5965
$$ -184625 126262 94440 214631 -211125 -261707 213056 322214 -235468 -277330 -95965
18058a21993m5217A48213a88168N7761L4705p9132E6476L45260a04612G6685J31864
$$ -121993 -167210 148213 -188168 -130407 -95702 -174834 56476 401736 -104612 76685 208549
18047B08549J57485A60705B8511L40435a35819O1807r8156B84946A27462A1450
$$ 208549 366034 160705 28511 368946 -135819 -74012 -172168 284946 127462 11450
18036a06285e259o5178j05399d1037j5938o7222k155p4563N6014B07270j00828
$$ -106285 -5259 -70437 -175836 -41037 -56975 -124197 -126352 -200915 -144901 207270 106442
18025A06442B8983J23061E0869J02396l9687a1812B672c4302o1905j3005A33260
$$ 106442 28983 152044 50869 153265 113578 -11812 2672 -34302 -96207 -109212 133260
18013A17798L9696a55560A06300d3923j8896A34565B2812a29842A8603b58840
$$ 117798 157494 -155560 106300 -43923 -62819 134565 22812 -129842 18603 -258840
18002A81234m3451A1728J7427b4127k81006J8481B3385J28234K7897c8590A32922
$$ 181234 137783 11728 29155 -24127 -305133 -286652 23385 151619 179516 -38590 132922
17990B58286i8701M2509B7174j0749a59430m01107a64442d0201r2413d4425E5289
$$ 258286 -98701 -56192 27174 16425 -159430 -560537 -164442 -40201 -132614 -44425 55289
17978D8361a60726B48518A24130a4136C16144b70469h2651j2063j58965j5865
$$ 48361 -160726 248518 124130 -14136 316144 -270469 -82651 -94714 -253679 -269544
17968b69544a03047J4790j20329K2275B44823h0791A1839N1837a60102P5202A28009
$$ -269544 -103047 -88257 -208586 -186311 244823 -80791 11839 63676 -160102 -84900 128009
17956b02191i3073b1464G3333J47376f5784k7791B83878a31283j39898A5184a00165
$$ -202191 -93073 -21464 73333 220709 -65784 -93575 283878 -131283 -271181 15184 -100165
17944c5538F9164b09614B26924a17363B56337e8073E4206c7170A09530R82h4676
$$ -35538 69164 -209614 226924 -117363 256337 -58073 54206 -37170 109530 110512 -84676
17932b53691B10209j4016b61549c6718l6566A23328i0637C0348e2965o7832E0862
$$ -253691 210209 196193 -261549 -36718 -73284 123328 -90637 30348 -52965 -120797 50862
17920a9006l27392c3210k03098g2627r6932F232K49916b6959l5518j33449d6670
$$ -19006 -346398 -33210 -236308 -72627 -169559 6232 256148 -26959 -62477 -195926 -46670
17908d2879C96955A21534b29129m7345d3294A02761j3790k3504k7164e7864G2426
$$ -42879 396955 121534 -229129 -276474 -43294 102761 88971 65467 38303 -57864 72426
17896A42544R6722m292a55446M2459E9086a31137B00882C7434c46368a481q4366
$$ 142544 239266 234974 -155446 -112987 59086 -131137 200882 37434 -346368 -1481 -85847
17885h5847A18263K41382C8398M4919b2181C2516O9840b4767H9571a25736C0426
$$ -85847 118263 359645 38398 83317 -22181 32516 102356 -24767 89571 -125736 30426
17873A22773P872K05582G5564c1246A42549K79950l096E0951i1256C70409A04581
$$ 122773 130645 336227 75564 -31246 142549 422499 419403 50951 -91256 370409 104581
17861B60297d448q7450A6139g7956B28801b101A77636N9831H4510L916i6749p5841
$$ 260297 -4448 -91898 16139 -77956 228801 -2101 177636 237467 84510 88426 -96749 -172590
17849a72590M8571c9275q488G9467d01396A92144b7596F4333a60917K2001B09997
$$ -172590 -124019 -39275 -47763 79467 -401396 192144 -27596 64333 -160917 -138916 209997
17837A58462m2526a01378q1552B03775e8516a9087B19235a572H9024d07781B03964
$$ 158462 115936 -101378 -182930 203775 -58516 -19087 219235 -1572 89024 -407781 203964
17825C1279J78651d3252q2139B5055K4800a70977a8245o820P108n0383j12803
$$ 31279 209930 -43252 -125391 25055 49855 -170977 -18245 -25065 -17957 -68340 -181143
17814a81143c5092A2759a13524A90330a19426A87887a69696C49813b28407E1492
$$ -181143 -35092 12759 -113524 190330 -119426 187887 -169696 349813 -228407 51492
17803a35762k9752c013B1735i0527I5961J86637a66859D84967b65361a15977j23059
$$ -135762 -165514 -3013 21735 -90527 95961 282598 -166859 484967 -265361 -115977 -239036
17792b39036b571E3009b24402A76688l3810a2431k9566C89701A07123g1372k7234
$$ -239036 -2571 53009 -224402 176688 142878 -12431 -41997 389701 107123 -71372 -98606
17781i8606A82213N6559A668i5801G7680J13601G3854d629C6491d46179B20382
$$ -98606 182213 238772 1668 -95801 77680 191281 73854 -4629 36491 -446179 220382
17769d3466I0900J38902a25890k1783F0296J65679a27997A45265k3757P8940H2812
$$ -43466 90900 229802 -125890 -147673 60296 225975 -127997 145265 121508 200448 82812
17757H5940K62669g7887C60239d0629A26789j5792J25026a6547m4318k26369a29828
$$ 85940 348609 -77887 360239 -40629 126789 110997 236023 -16547 -60865 -287234 -129828
17745A06397J17124R9068e2418n5334A57226g4549b0735m862n578G5873B1665
$$ 106397 223521 322589 -52418 -107752 157226 -74549 -20735 -25597 -31175 75873 21665
17733A12419J67795A15788D5116b1476n7330A47480a44307A50667k4653b14090
$$ 112419 280214 115788 45116 -21476 -78806 147480 -144307 150667 126014 -214090
17722C39421h1663M0023o7629j35302A8810O209J35926D1815K30103J09458a31957
$$ 339421 -81663 -41640 -109269 -244571 18810 25019 160945 41815 271918 381376 -131957
17710B3304a25486D5903O1571a8610A93090C7858J79402c97712A42828J28499
$$ 23304 -125486 45903 107474 -18610 193090 37858 217260 -397712 142828 271327
17700B71327F6604d7173A30906d8763B70943b631j30917H9395i3283a9434F2139
$$ 271327 66604 -47173 130906 -48763 270943 -2631 -133548 89395 -93283 -19434 62139
17688A36473R7961J4714b40166A63625a17648k7551D7820B003J7171J11029m2913
$$ 136473 234434 249148 -240166 163625 -117648 -145199 47820 2003 19174 130203 87290
17677H7290K0783a25121B48069k4361l468E7564a83214D51342j88593n6459G8257
$$ 87290 108073 -125121 248069 223708 220240 57564 -183214 451342 262749 206290 78257
17665A51456L4471n2376a39203B06623L4821C6606c9372A59669a32667H2679J3598
$$ 151456 185927 133551 -139203 206623 241444 36606 -39372 159669 -132667 82679 96277
17654I6277k5644K86661A08638Q2702G6776b1839m7246C67648e6548a158B43901
$$ 96277 70633 357294 108638 191340 76776 -21839 -69085 367648 -56548 -1158 243901
17642A34787b56181E4131K74208p5678O5394A43256E0112e6008j36581A82890
$$ 134787 -256181 54131 328339 252661 318055 143256 50112 -56008 -192589 182890
17631d7135G859c1262p2228p6887B38457i0215b176B2279K64976B1902P3001b7146
$$ -47135 7859 -31262 -103490 -180377 238457 -90215 -2176 22279 287255 21902 94903 -27146
17618F3807j0314i8055C62281F6171N4626K1654Q4170L8690m2653A4800J4615
$$ 63807 53493 -98055 362281 66171 120797 142451 226621 265311 222658 14800 29415
17607B9415K87826l6573K452a0601m9355H0208M8883P9919f7527C45016K2914
$$ 29415 317241 280668 283120 -10601 -59956 80208 129091 209010 -67527 345016 367930
17596C67930F7633Q6609b3096A44749b25575B90498j056F4912R8536a40840D14833
$$ 367930 67633 154242 -23096 144749 -225575 290498 289442 64912 163448 -140840 414833
17584A96001C4803R0058h3020c6233C05815A48669l1494R5399c3954A19088N8766
$$ 196001 34803 124861 -83020 -36233 305815 148669 117175 212574 -33954 119088 177854
17573A77854m0613n0267C3364f2744C8329J29709k1890J0100K76767a5654j03166
$$ 177854 137241 86974 33364 -62744 38329 168038 146148 156248 433015 -15654 -118820
17562a18820j9738H6585J33829j05754a03716B7063J2568K55656a9550C30988
$$ -118820 -138558 86585 220414 114660 -103716 27063 39631 295287 -19550 330988
17551G5312K90020H5114K08114a50849B24191G2098A5317R1672N74406F0948K80668
$$ 75312 365332 85114 293228 -150849 224191 72098 15317 106989 681395 60948 341616
17540C41616j50549G9859b1087B51150j16540K0783K45168r5116j3288k8459L06176
$$ 341616 191067 79859 -21087 251150 134610 155393 400561 305445 292157 263698 569874
17529E69874I1621M46841K02225n797K70902R0351r7401j47954k21342j27393
$$ 569874 91621 538462 740687 734890 1005792 1096143 998742 850788 629446 502053
17519E02053j59578J29626j26215n0406j524r0682K767M23591r0995J68370M65751
$$ 502053 342475 472101 345886 295480 293956 203274 206041 629632 538637 707007 1172758
17508A172758j50670j84038k44906j89064q6689J49107j6686A83220M7771K83604
$$ 1172758 1022088 838050 593144 404080 317391 466498 449812 183220 230991 514595
17498E14595B9111K08294l4264J94262q267n6417A1590K65478J444A26503K47587
$$ 514595 29111 237405 203141 397403 389136 332719 11590 277068 278512 126503 374090
17487C74090C5220M31774j14788o8206J69626n7480A21233K28042o8763c5120
$$ 374090 35220 466994 352206 284000 453626 396146 121233 349275 280512 -35120
17476d2295H3223K07547k5379H7487J29523k113K55528m2259J50427n2503o0806
$$ -42295 83223 290770 265391 87487 217010 214897 470425 428166 578593 526090 465284
17465D65284j88143J61622A71011K7426R5214j21995K4360m7912J4719J21185
$$ 465284 277141 438763 171011 198437 293651 171656 196016 148104 162823 284008
17455B84008J13347F9564O31067B68481P0042k2047A57235P9593p022M5213N495
$$ 284008 397355 69564 700631 268481 338523 316476 157235 236828 229806 275019 280514
17444B80514p542p2864L30885K11545B89438n5078N09487A56655K49432J140q3266
$$ 280514 272972 200108 530993 742538 289438 234360 743847 156655 406087 407227 323961
17433C23961j32365a43600D20586j14382j30109J71158J06453o2731q4162A02320
$$ 323961 191596 -143600 420586 306204 176095 347253 453706 390975 306813 102320
17422A88508J30741D0291J86435M35684l16002j22085m5842O18468b5762B72579
$$ 188508 319249 40291 226726 662410 346408 224323 178481 796949 -25762 272579
17411D77245A78011o4383J71924a20002C48299F6126M16693j64754i815A84629
$$ 477245 178011 113628 285552 -120002 348299 66126 482819 318065 -9815 184629
17400B05522E3415N3655l9875M47774j96436q3250H7815L54077P3847H1727K31957
$$ 205522 53415 107070 67195 514969 318533 235283 87815 441892 515739 81727 313684
17389C13684j45210l7863J58607R526q0278A08229L54171j60218q6947K65261
$$ 313684 168474 130611 289218 298744 218466 108229 462400 302182 215235 480496
17379D80496A0201b5330B66610a97977F37069k65788m9308B4707M56524J08549
$$ 480496 10201 -25330 266610 -197977 637069 371281 321973 24707 481231 589780
17369E89780B40204J13073A39273K45654j601J47602B13252J09488P0741j47990
$$ 589780 240204 353277 139273 384927 383326 530928 213252 322740 393481 245491
17359B45491J77935C8709N15423j33307A05394J58743K51753B22282P7189A10601
$$ 245491 423426 38709 554132 420825 105394 264137 515890 222282 299471 110601
17348c41658C56694P1455j13762D4527L11336l6193A25623J70350A45886K33957
$$ -341658 356694 428149 314387 44527 355863 319670 125623 295973 145886 379843
17338C79843A15194K79846l2361j15712J7652K5030J15241A92128L33796B50227
$$ 379843 115194 395040 362679 246967 264619 289649 404890 192128 525924 250227
17327C47029p929p3664j5097l4816I6688R7297M42442B92350R1932n4209A31344
$$ 347029 339100 265436 250339 215523 96688 193985 636427 292350 384282 330073 131344
17315A94219Q8225J70406o2759j70300O5903A36301P0644P5324A26170J60246
$$ 194219 282444 452850 390091 219791 285694 136301 206945 282269 126170 286416
17305B86416K19341D7207K90164J74629A13429M50087A07772a30749E12838j84635
$$ 286416 505757 47207 337371 512000 113429 563516 107772 -130749 512838 328203
17295C28203N7524j78414h1545B13507K39788j92893L28660n327I3516l9303K21783
$$ 328203 385727 207313 -81545 213507 453295 260402 589062 583735 93516 54213 275996
17284B75996b0650B15592J10848p0441J03588A14555K00277J82279j39779Q7750
$$ 275996 -20650 215592 326440 255999 359587 114555 314832 497111 357332 445082
17274D45082j75010J5869J74961j41683K05082J9243P1435k48647J08048k06846
$$ 445082 270072 285941 460902 319219 524301 543544 614979 366332 474380 267534
17264B67534n7479A03440M74080k58160J67381A91253B1827N42445j40037r8049
$$ 267534 210055 103440 577520 319360 486741 191253 21827 564272 424235 326186
17254C26186A59893A359K3090M43737A28363M22152A84077K61415A14213M40618
$$ 326186 159893 1359 24449 468186 128363 550515 184077 445492 114213 554831
17244E54831j88849r2752j2204J13200R9477A63727K72600J9180j02063j37402
$$ 554831 365982 273230 261026 374226 473703 163727 436327 455507 353444 216042
17234B16042J26330N1092Q7727A85467K36852J02206k50699K23955k2174O558
$$ 216042 342372 393464 481191 185467 422319 524525 273826 497781 475607 482165
17224D82165o1801j82170C0651K85750R7105j48538j02481n159j8695J77173L40638
$$ 482165 420364 238194 30651 316401 413506 264968 162487 157328 138633 315806 656444
17213F56444C08753K1094K69357k51952K34151k47342J14342j52975j0164J95943
$$ 656444 308753 329847 599204 347252 581403 334061 448403 295428 285264 481207
17203D81207n4425k02842K94223K0416A56556M77356j83516K14418B51634J97346
$$ 481207 426782 223940 518163 538579 156556 633912 450396 664814 251634 448980
17193D48980m3891r907J18480j94745j3506J67600B16936L16162p6393n5817j03866
$$ 448980 405089 395182 513662 318917 305411 473011 216936 533098 456705 400888 297022
17182B97022K09789j41524K05515o3254B8242M38367j07512q4659R4827r912j64097
$$ 297022 506811 365287 570802 507548 28242 466609 359097 274438 369265 359353 195256
17171A95256L69952Q7316k7130j69000j97459J7241J80375j8998L54967l40340
$$ 195256 565208 652524 625394 456394 258935 276176 456551 437553 792520 452180
17161D52180j87186K90008B67696C4529Q13458l37285J32670r5719j51268O0855
$$ 452180 264994 555002 267696 34529 847987 510702 643372 547653 396385 457240
17151D57240K54727A97962L78315j60564j83168K86886j24464J58531j25500J20569
$$ 457240 711967 197962 576277 415713 232545 519431 394967 553498 427998 548567
17141E48567n7169j44620I441M95195L22470k49250k4601j29072K02856j00060
$$ 548567 491398 346778 9441 504636 827106 577856 553255 424183 627039 526979
17131E26979k35246J30859J44544P4708k98154J87722O8746j17815k2676k01083
$$ 526979 291733 422592 567136 641844 343690 531412 600158 482343 459667 258584
17121B58584J35199J67984L05024j83480k16872P9195j70840J9286J65038j6328
$$ 258584 393783 561767 866791 683311 466439 545634 374794 394080 559118 542790
17111E42790J50558n3345k9440K97J39946l02198J25063j912o6989j31398J34548
$$ 542790 693348 640003 610563 610860 750806 448608 573671 571759 504770 373372 507920
17100E07920K29806B98466N16180l28740j8790M77901n9181j45020q9767J17796
$$ 507920 737726 298466 814646 485906 467116 945017 885836 740816 651049 768845
17090G68845K5562p7718J64930l29264K82795q5746J88711K9053k19222K37914
$$ 768845 794407 716689 881619 552355 835150 749404 938115 967168 747946 985860
17080I85860j3402D02067L79920L1609l35127K14113j16193Q0677j08053M6855
$$ 985860 972458 402067 781987 813596 478469 692582 576389 657066 549013 595868
17070E95868K94793k49564K02787l62138k5203K65478j39380K67490J32304j97526
$$ 595868 890661 641097 843884 481746 456543 722021 582641 850131 982435 784909
17060G84909L17641l24415K68592j07677o8641J21314k74993J70756j70511M84107
$$ 784909 1102550 778135 1046727 939050 870409 991723 716730 887486 716975 1201082
17050A201082l11341k08113L33880k56014L33449l74371K9315J22308o6428j13008
$$ 1201082 889741 681628 1015508 759494 1092943 718572 747887 870195 803767 690759
17040F90759j19778L32779K33648l57641K35480O0318j01531L9756j00943J55598
$$ 690759 570981 903760 1137408 779767 1015247 1075565 974034 1013790 912847 1068445
17030A068445p1799j57011K6804K84701k56308K21619n9945o5262L68564m21214
$$ 1068445 996646 839635 866439 1151140 894832 1116451 1056506 991244 1359808 938594
17020I38594O2033J13770m085K7001n7426j36042J2778K36816l57295L99868k93004
$$ 938594 1000627 1114397 1110312 1137313 1079887 943845 956623 1193439 836144 1236012 943008
17009I43008K09214j14397J82711l0757M4206R2433m06898J09033J50890J25648
$$ 943008 1152222 1037825 1220536 1189779 1233985 1326418 919520 1028553 1179443 1305091
16999A305091k7531O1374l65839K83380J27488J03514l43269J55215P6110K39668
$$ 1305091 1277560 1338934 973095 1256475 1383963 1487477 1144208 1299423 1375533 1615201
16989A615201r1028q2305j0340k60385J19716j16260M42634k06688k078j08534
$$ 1615201 1524173 1441868 1431528 1171143 1290859 1174599 1617233 1410545 1408467 1299933
16979A299933j75196N70411l91365Q5409l2200J00348K34718k88466k11503L78412
$$ 1299933 1124737 1695148 1303783 1389192 1356992 1457340 1692058 1403592 1192089 1570501
16969A570501o3906k49169L78474l88091M43014k28935O1097J65650j87256L03348
$$ 1570501 1506595 1257426 1635900 1247809 1690823 1461888 1522985 1688635 1501379 1804727
16959A804727o62887M68911J75191K07571l06431k31634K74775j09734O6038K92994
$$ 1804727 1141840 1610751 1785942 1993513 1687082 1455448 1730223 1620489 1686527 1979521
16949A979521l97943K31643j7144J62394j89638L81157n10181J53004P2502L0693
$$ 1979521 1581578 1813221 1796077 1958471 1768833 2149990 1639809 1792813 1865315 1896008
16939A896008k18352k70378O15957J8782K248j36628K42418j6897o5463J5590
$$ 1896008 1677656 1407278 2023235 2042017 2044265 1907637 2150055 2133158 2067695 2083285
16929B083285J20207k84763J3437M52866L08000l34126k7836O0461l81108J30416
$$ 2083285 2203492 1918729 1932166 2385032 2693032 2358906 2331070 2391531 2010423 2140839
16919B140839K50303j18297j29582K60649K4654O6369J2122j73907J52986j31745
$$ 2140839 2391142 2272845 2143263 2403912 2428566 2494935 2507057 2333150 2486136 2354391
16909B354391K65784K70048k99766J29489j69956j47146K18616L96395r3175K9299
$$ 2354391 2620175 2890223 2590457 2719946 2549990 2402844 2621460 3017855 2924680 2953979
16899B953979J77141k20150k6800N4654L93265k42954J79462k23832J79694J04049
$$ 2953979 3131120 2910970 2884170 2938824 3332089 3089135 3268597 3044765 3224459 3328508
16889C328508j93671k2097J19860M1717j14165k85072Q74844n45671M04399o7181
$$ 3328508 3134837 3112740 3232600 3274317 3160152 2875080 3749924 3204253 3608652 3541471
16879C541471K34818j91889r0399M34645n8681l47301K77630j41486M30229j63562
$$ 3541471 3776289 3584400 3494001 3928646 3869965 3522664 3800294 3658808 4089037 3925475
16869C925475L79300j2634r8150n0852K80819j5905r329R9476r4170P6200J19030
$$ 3925475 4304775 4292141 4193991 4143139 4423958 4408053 4398724 4498200 4404030 4480230 4599260
16858D599260J12272j24514K31097K10256r6356R6914M93120k86542M97082k71549
$$ 4599260 4711532 4587018 4818115 5028371 4932015 5028929 5522049 5235507 5732589 5461040
16848E461040o7618L81052k82381K38341N0943l4923N9335q5616N05870m1871
$$ 5461040 5393422 5774474 5492093 5730434 5781377 5746454 5805789 5720173 6226043 6184172
16838F184172L03139J56865M2519J37721m9550L90733R5063Q9602M3781j83941
$$ 6184172 6487311 6644176 6686695 6824416 6774866 7165599 7260662 7350264 7394045 7210104
16828G210104L2083P40438J20253j15940J70956K75408J45053J31170N1097K34936
$$ 7210104 7242187 7982625 8102878 7986938 8157894 8433302 8578355 8709525 8760622 8995558
16818H995558M85829j41393K74794j48915K73183N71807R8652j84855L75745K92294
$$ 8995558 9481387 9339994 9614788 9465873 9739056 10310863 10409515 10224660 10600405 10892699
16808A0892699J87343L98262o8399M77889O05102n19365O94729L21271K72809
$$ 10892699 11080042 11478304 11409905 11887794 12492896 11973531 12668260 12989531 13262340
16799A3262340n8823P44688K6084L05001N43271N34624L13021L97761M16003n6615
$$ 13262340 13203517 13948205 13974289 14279290 14822561 15357185 15670206 16067967 16483970 16427355
16789A6427355P50072L88257L21605P95884L29779L28559N63196N68905O26607
$$ 16427355 17177427 17565684 17887289 18683173 19012952 19341511 19904707 20473612 21100219
16780B1100219P8514J063182N11883N11259J205824O43198M38710R44234M84063
$$ 21100219 21178733 22241915 22753798 23265057 24470881 25114079 25552789 26497023 26981086
16771B6981086J165407N87196R29860Q14879J188870R16840J148604J024936R72959
$$ 26981086 28146493 28733689 29663549 30478428 31667298 32584138 33732742 34757678 35730637
16762C5730637J124760J259101J165061J334164J649033J139793J751930J383801
$$ 35730637 36855397 38114498 39279559 40613723 42262756 43402549 45154479 46538280
16754D6538280J467607J987305J745379J479625J974181J909551J752426K474279
$$ 46538280 48005887 49993192 51738571 53218196 55192377 57101928 58854354 61328633
16746F1328633J701723K154152K207040K226056K070251K496032K356999K644378
$$ 61328633 63030356 65184508 67391548 69617604 71687855 74183887 76540886 79185264
16738G9185264J980581K359427K596922K061256K396686K573775J761450K180453
$$ 79185264 81165845 83525272 86122194 88183450 90580136 93153911 94915361 97095814
16730I7095814K234052J283647J815320J461818J230342J081324O03912O13315
$$ 97095814 99329866 100613513 102428833 103890651 105120993 106202317 106806229 107419544
16722A07419544O64977j49381o9628l62217r22955p26596j439905j173769j535540
$$ 107419544 108084521 107935140 107865512 107503295 106580340 105853744 104413839 103240070 101704530
16713A01704530j530956j766210k560187j606085k650837k177061k441263k365710
$$ 101704530 100173574 98407364 95847177 94241092 91590255 89413194 86971931 84606221
16705H4606221k144937k262529k771865k283744k818757k086663k496295j801461
$$ 84606221 82461284 80198755 77426890 75143146 72324389 70237726 67741431 65939970
16697F5939970k515370k129678k050435k104188j949074j756376j593388j942916
$$ 65939970 63424600 61294922 59244487 57140299 55191225 53434849 51841461 49898545
16689D9898545j803846j575180j630900j598750j041440j784719j242230j150104
$$ 49898545 48094699 46519519 44888619 43289869 42248429 40463710 39221480 38071376
16681C8071376j513332j147109q81289j328363j148488p71051j006246j162912
$$ 38071376 36558044 35410935 34529646 33201283 32052795 31281744 30275498 29112586
16673B9112586n69096q62897j037351m87980j089711n98899o19841p69502j101811
$$ 29112586 28543490 27680593 26643242 26155262 25065551 24466652 23846811 23077309 21975498
16664B1975498j20003q38424n44202k32698o55149p04709n14613l13419n55699
$$ 21975498 21855495 21017071 20472869 20240171 19585022 18880313 18365700 18052281 17496582
16655A7496582n42865o9p93220l52158j6389l88106o13034k55646o63585j53070
$$ 17496582 16953717 16953648 16160428 15808270 15791881 15403775 14790741 14535095 13871510 13718440
16645A3718440m17540j64607m03014J35471n14925l74925j90099m40071j97592
$$ 13718440 13300900 13136293 12733279 12868750 12353825 11978900 11788801 11348730 11151138
16636A1151138R9743l74627l70067j9871m25070j16458l19647l48421R6411j17044
$$ 11151138 11250881 10876254 10506187 10486316 10061246 9944788 9625141 9276720 9373131 9256087
16626I256087j55549l05138l01631J32105n93612L07187l79881N1318k39306k29314
$$ 9256087 9100538 8795400 8493769 8625874 8032262 8339449 7959568 8010886 7771580 7542266
16616G542266k08384p1913Q0107l65196r5303l8372p2967j08940j93872j8343
$$ 7542266 7333882 7261969 7342076 6976880 6881577 6843205 6770238 6661298 6467426 6449083
16606F449083l07657J96724m6305m11387J16882k51532l89119L10244k1810k52927
$$ 6449083 6141426 6338150 6291845 5880458 5997340 5745808 5356689 5666933 5645123 5392196
16596E392196N9947n50491K63901K5337j04166k03132N3195r6628m51164P29393
$$ 5392196 5452143 4901652 5165553 5190890 5086724 4883592 4936787 4840159 4388995 5118388
16586E118388p05914O8489K69268k15429o5698R8834q1661l32324K36088k07549
$$ 5118388 4412474 4480963 4750231 4534802 4469104 4567938 4486277 4153953 4390041 4182492
16576D182492j79086K68125m5177n23503m5162J02107R4603K5926k83281n831
$$ 4182492 4003406 4271531 4226354 3702851 3657689 3759796 3854399 3880325 3597044 3591213
16566C591213O7950M0714m07439J28173k16644K36790k43504k87356L43724J81423
$$ 3591213 3659163 3699877 3292438 3420611 3203967 3440757 3197253 2909897 3253621 3435044
16556C435044k41092j12328J389j38143K04403j01428j62119K42940l4042n40835
$$ 3435044 3193952 3081624 3083013 2944870 3149273 3047845 2885726 3128666 3094624 2553789
16546B553789J11547J01456O1019j01979K1056r5546K9350j33252q8086M09213
$$ 2553789 2665336 2766792 2827811 2725832 2746888 2651342 2680692 2547440 2459354 2868567
16536B868567l95719K18480k34917j13317N1302k77210L52860P2253l64178J74808
$$ 2868567 2472848 2691328 2456411 2343094 2394396 2117186 2470046 2542299 2178121 2352929
16526B352929O0532k33489o5622k34272L55020l0966M8473m6239k07558L4785
$$ 2352929 2413461 2179972 2114350 1880078 2235098 2204132 2252605 2206366 1998808 2033593
16516B033593k5687l0301J3668Q6114m9226k16517K78446m83608L09592J28433
$$ 2033593 2007906 1977605 1991273 2077387 2028161 1811644 2090090 1606482 1916074 2044507
16506B044507l27256o0031J84829p2827n1420m7640L64746k27968l424O9875P7342
$$ 2044507 1717251 1657220 1842049 1769222 1717802 1670162 2034908 1806940 1803516 1873391 1950733
16495A950733k58559J86937m69909N17215n22894K74948J914j00942j36767N01271
$$ 1950733 1692174 1879111 1409202 1926417 1403523 1678471 1680385 1579443 1442676 1943947
16485A943947m72227m7992l3812K77129j74572q2393q2046J86516K33305n15747
$$ 1943947 1471720 1423728 1389916 1667045 1492473 1410080 1328034 1514550 1747855 1232108
16475A232108R5768r717J30142j28282p6857K53248K67973o81039L02080M3485
$$ 1232108 1327876 1318159 1448301 1320019 1243162 1496410 1764383 1083344 1385424 1428909
16465A428909m44192K64300k50281L94250m48283K79232m79038M81385m647l46845
$$ 1428909 984717 1249017 998736 1392986 944703 1223935 744897 1226282 1221635 874790
16455H74790K97624R6597k04642K27410K77409m04012l6782o704o95N6407l39293
$$ 874790 1172414 1269011 1064369 1291779 1569188 1165176 1128394 1121690 1120995 1177402 838109
16444H38109M54889l57486K76647K17725m67162K87913k2557r2274k58990J03991
$$ 838109 1292998 935512 1212159 1429884 962722 1250635 1228078 1135804 876814 980805
16434I80805J82644j99486J08365j62347K26059k42892J4580M0282P2893K09150
$$ 980805 1163449 963963 1072328 909981 1136040 893148 907728 948010 1020903 1230053
16424A230053k11618j35116j2712M60834j41519j5466l78567J15483m8731j92790
$$ 1230053 1018435 883319 870607 1331441 1189922 1174456 795889 911372 862641 669851
16414F69851J13813J24808P1822j21739Q6583O7026l06562J27831J11904M7115
$$ 669851 783664 908472 980294 858555 945138 1012164 705602 833433 945337 992452
16404I92452j76615J42336j29010j8615r6051K62952Q0262k58224J56180j65798
$$ 992452 815837 958173 829163 810548 714497 977449 1057711 799487 955667 789869
16394G89869k26878R9644L95798q4796J7607l07714M69822n03905K61964P9752
$$ 789869 562991 662635 1058433 973637 991244 683530 1153352 649447 911411 991163
16384I91163l87183L5178q0320K38471N5035k47390K36272j48385R5062j70429
$$ 991163 603980 639158 558838 797309 852344 604954 841226 692841 787903 617474
16374F17474O32J6896j28053L31554j83261j1735K94378k20332r0555l669J09598
$$ 617474 618106 635002 506949 838503 655242 643507 937885 717553 626998 623329 732927
16363G32927A05891K90465J77693J19845j89445R3727k81721K34889j11061K15184
$$ 732927 105891 396356 574049 693894 504449 598176 316455 551344 440283 655467
16353F55467p0263J62843k96881J90507q7700J78602j57798j11795J12000N9181
$$ 655467 585204 748047 451166 641673 553973 732575 574777 462982 574982 634163
16343F34163l2358Q5497A51446P31666m29590K65711C22474K38227J67476P9467
$$ 634163 601805 687302 151446 883112 453522 719233 322474 560701 728177 807644
16333H07644k40092L4429j4073l9574M0247j13663B32935K99546J88846k17912
$$ 807644 567552 601981 587908 548334 588581 474918 232935 532481 721327 503415
16323E03415J78667B45458O8292J97289j68536p973k580N04407m00506J92610
$$ 503415 682082 245458 313750 511039 342503 334530 331950 836357 435851 628461
16313F28461k14248Q4281K70584k55823L8496R2298j86844M7874A46713M46156
$$ 628461 414213 498494 769078 513255 551751 644049 457205 505079 146713 592869
16303E92869n9356A85551K03619K16642B80301j12658K30205J05246k48929K36420
$$ 592869 533513 185551 389170 605812 280301 167643 397848 503094 254165 490585
16293D90585I9757J02383K78727j29827J78581k25761L8069R2478p8719R3951
$$ 490585 99757 202140 480867 351040 529621 303860 341929 434407 355688 449639
16283D49639n8158K51570j04728A39390L82600j7367J39663k69449K16740J48206
$$ 449639 391481 643051 538323 139390 521990 504623 644286 374837 591577 739783
16273G39783C61340L16961j58087k14314M58693C76204J38941k43582m2431R0842
$$ 739783 361340 678301 520214 305900 764593 376204 515145 271563 229132 319974
16263C19974n7292K9537K19936B10672P4952M9403M4673j20151q9459J57876O8768
$$ 319974 262682 292219 512155 210672 285624 335027 379700 259549 170090 327966 396734
16252C96734n1964P8858j08669R1209l2027R64O3017J5149a15585G27334G5139
$$ 396734 344770 423628 314959 406168 374141 375105 438122 453271 -115585 727334 75139
16240B42386Q3747A03265L16697j9636C2311L97156A23220K59394m154A38058
$$ 242386 326133 103265 419962 400326 32311 429467 123220 382614 378460 138058
16229A76857l2054K72542J06156j39338k3149F9259M48923M2367j69712k5875
$$ 176857 144803 417345 523501 384163 361014 69259 518182 560549 390837 364962
16219C64962j68765J96313A50439l8200D8967J80330J17758l2401n3582K26033
$$ 364962 196197 392510 150439 112239 48967 229297 347055 314654 261072 487105
16209D87105C202K24521D1659J46412n5626L82085P6762j68714l9473A82668K07243
$$ 487105 3202 227723 41659 188071 132445 514530 591292 422578 383105 182668 389911
16198C89911a47706F5867K45043L1206H0825J61146J6537Q4628j18686J19076
$$ 389911 -147706 65867 310910 342116 80825 241971 258508 343136 224450 343526
16188C43526A08473P9578L02595A16840K20604q2057q9439k3701J24119M2799
$$ 343526 108473 188051 490646 116840 337444 255387 165948 142247 266366 309165
16178C09165A34131d0262C38539I4813d6913C76592F9665J33943J80867d2196
$$ 309165 134131 -40262 338539 94813 -46913 376592 69665 203608 384475 -42196
16167B8926a17387B46665J372L7822j14261C6531J34270J1168E00M82739b8866
$$ 28926 -117387 246665 248037 285859 171598 36531 170801 181969 500 483239 -28866
16155B39132a00925B58774e3666E66807k44738A50910K3297O5122m7952K40354
$$ 239132 -100925 258774 -53666 566807 322069 150910 174207 239329 191377 431731
16145D31731B10467R337q8673J70332b5798A13450L04327a5748B53473g8196A43406
$$ 431731 210467 219804 131131 301463 -25798 113450 417777 -15748 253473 -78196 143406
16133A57355A9802K7549K87957a08268J4653G1894Q258K7925K98575j36435j04714
$$ 157355 19802 47351 335308 -108268 -93615 71894 80152 108077 406652 270217 165503
16122A65503R6529F7442h70A91879J06442p3406a3437j42265B57253G5616J64305
$$ 165503 262032 67442 -870 191879 298321 224915 -13437 -155702 257253 75616 239921
16111B39921o6558b8466B61452B3256M10331b39538a11906B76820a83669A67430
$$ 239921 173363 -28466 261452 23256 433587 -239538 -111906 276820 -183669 167430
16100A36916K93791C7838b13947B59695o3361n4241g4857E14917A18789J98812
$$ 136916 430707 37838 -213947 259695 196334 142093 -74857 514917 118789 317601
16090C17601f4510A64531N8258c4257C52914A58947l7350e5144k8381F8664L82934
$$ 317601 -64510 164531 222789 -34257 352914 158947 121597 -55144 -83525 68664 451598
16079D51598B13134e1636G8114r145M72760B209e6708C00504j8973a80644M2093
$$ 451598 213134 -51636 78114 68969 541729 2209 -56708 300504 281531 -180644 -138551
16068a38551I7728K00881A01583b18788d1340A70940K77260A6738N8036f7369
$$ -138551 97728 298609 101583 -218788 -41340 170940 448200 16738 74774 -67369
16057C4941K07318r8367b01912C02379A7311a83936B56842a1292k80585B15129
$$ 34941 242259 143892 -201912 302379 17311 -183936 256842 -11292 -291877 215129
16046B41619J12790A30263i7180G0774P7923n550a73257d3011j4185E7063K41910
$$ 241619 354409 130263 -97180 70774 148697 143147 -173257 -43011 -57196 57063 298973
16035B98973b3089p973d324n1718g627A09346B4145L68102i1225A42978A6600
$$ 298973 -23089 -31062 -4324 -56042 -7627 109346 24145 392247 -91225 142978 16600
16023A6848M28286A08950B2519L00928a50416E2937a5104B47492b07142P23B57327
$$ 16848 445134 108950 22519 323447 -150416 52937 -15104 247492 -207142 -206419 257327
16011h1064A50369f626A01611A4659b14924g2748B05607K6799e6716F00219a04104
$$ -81064 150369 -6626 101611 14659 -214924 -72748 205607 232406 -56716 600219 -104104
15999A28241J9591C2147J63042m9050J5721J77558r2009A144c1890C47613Q6641
$$ 128241 147832 32147 195189 146139 161860 339418 247409 1144 -31890 347613 434254
15988D34254F4520J85492P99860O1989J4369R037j33532k96110I2696K59311a11479
$$ 434254 64520 250012 1049872 1111861 1126230 1135267 1001735 705625 92696 352007 -111479
15976b90661A25310J29719N4083b29680J11022%b1125j9273A32327d4233A5026
$$ -290661 125310 255029 309112 -229680 -118658 -118658 -21125 -40398 132327 -44233 15026
15964A72910a01873A0532J39467Q0494C9650p604c15051A13717P5539f9438A52365
$$ 172910 -101873 10532 149999 230493 39650 32046 -315051 113717 189256 -69438 152365
15952f4942B15972a21162c4349m558A37985b74385H3328d3287A86747J02190Q353
$$ -64942 215972 -121162 -34349 -38907 137985 -274385 83328 -43287 186747 288937 297290
15941B97290a04995E2489a9644A43599b80539A63024D8610a08094A75876D2892
$$ 297290 -104995 52489 -19644 143599 -280539 163024 48610 -108094 175876 42892
15930F6979b58479R1236P7414H9802k6444a40584k7671I6880P685D1738n400b13021
$$ 66979 -258479 -167243 -89829 89802 63358 -140584 -168255 96880 104565 41738 36338 -213021
15917B6265f554B00386n2626K7765a3090q392p1511L0980K384j29128c724k71455
$$ 26265 -6554 200386 147760 175525 -13090 -21482 -92993 -62013 -59629 -188757 -3724 -275179
15905b75179B05462f1328b1181A61171F5904J00860L6600o8518c64809E179b16918
$$ -275179 205462 -61328 -21181 161171 65904 166764 203364 134846 -364809 5179 -216918
15893b9814o1424f034A84396a33091j45323i9859H2941l0173J80957F9609a29983
$$ -29814 -91238 -6034 184396 -133091 -278414 -99859 82941 52768 233725 69609 -129983
15881c03495a20635d9712F11b4103j3315j35451G8109K35067i2948A85239K3197
$$ -303495 -120635 -49712 611 -24103 -37418 -172869 78109 313176 -92948 185239 208436
15870B08436b26311A50369A8542i5157M7445K1523n4293K8766k91945E9718a52166
$$ 208436 -226311 150369 18542 -95157 -47712 -26189 -80482 -51716 -343661 59718 -152166
15858a38564j07375B76368B4210J99181A05027j5139l8571a41948j10559c4062
$$ -138564 -245939 276368 24210 223391 105027 89888 51317 -141948 -252507 -34062
15847B33879h6931k31184A6834b4349k10685c4964A73046D4544M9328a96500j5254
$$ 233879 -86931 -318115 16834 -24349 -235034 -34964 173046 44544 93872 -196500 -211754
15836b11754B8558a55846N5422B63421r3124j4446c0289A82159a03767K2462K9367
$$ -211754 28558 -155846 -100424 263421 170297 155851 -30289 182159 -103767 -81305 -51938
15825e1938B1557e2573k95801R2063F6744O6075b67535a16626F2621M1573c19920
$$ -51938 21557 -52573 -348374 -256311 66744 132819 -267535 -116626 62621 104194 -319920
15813G414a55007B45261B0830J31262a50855b9921j0418k891j06368A83784o6312
$$ 7414 -155007 245261 20830 152092 -150855 -29921 -40339 -43230 -149598 183784 117472
15802A17472J0211J56689l8359i9715M702j62319m7223a7365E6919b2148C4327
$$ 117472 127683 284372 246013 -99715 -95013 -257332 -304555 -17365 56919 -22148 34327
15790d4521H4034c4333l11030h0289B00668d6298j20611A52968d8985k05621g354
$$ -44521 84034 -34333 -345363 -80289 200668 -46298 -166909 152968 -48985 -254606 -7354
15778A74665c50468H3089k4230h6003A06962b27572a2603l23695f0404B30684
$$ 174665 -350468 83089 58859 -86003 106962 -227572 -12603 -336298 -60404 230684
15767A24318E3895A7815J40210a31864o0320I3446c0818A33571d0422I2818J95
$$ 124318 53895 17815 158025 -131864 -192184 93446 -30818 133571 -40422 92818 93013
15756I3013R0747q8696b48779b6778j28078B17650C1570K60614p1002m8631h0194
$$ 93013 183760 95064 -248779 -26778 -154856 217650 31570 292184 221182 172551 -80194
15744F6812f5499k200F2656C0482r289L6867K3689g5063I462L120J80337o4345
$$ 66812 -65499 -67699 62656 30482 21193 58060 81749 -75063 9462 12582 192919 128574
15732A28574R3646a94182A41825J009E4569L4989a86954M0627A0638K6517J58206
$$ 128574 222220 -194182 141825 142834 54569 89558 -186954 -146327 10638 37155 195361
15721A95361K1364N4334j4185l3396N9558a90520m0448C07799J84372A63790c00637
$$ 195361 216725 271059 256874 223478 283036 -190520 -230968 307799 492171 163790 -300637
15709a19668g493A80545a21131L1754I1234a29428B60356J37389H1640e6305B43178
$$ -119668 -7493 180545 -121131 -89377 91234 -129428 260356 397745 81640 -56305 243178
15697A60866m2255b69988P8165A0976b19870A90543n7286B4754a85634A7658K74410
$$ 160866 118611 -269988 -191823 10976 -219870 190543 133257 24754 -185634 17658 292068
15686B92068a43080F244K00750c2526A3078a93991A89239o3230B0293J81302C2265
$$ 292068 -143080 6244 206994 -32526 13078 -193991 189239 126009 20293 201595 32265
15674a58645o2775d6568l050l3713E7391P9262D0150a83653p7594A37376k7126
$$ -158645 -221420 -46568 -49618 -83331 57391 136653 40150 -183653 -261247 137376 110250
15663A10250b46661a07A06207k7983i0747A19827K02865a57000E1119a30851n5760
$$ 110250 -246661 -107 106207 78224 -90747 119827 322692 -157000 51119 -130851 -186611
15652a86611m1785f04j655j42470e0579h507j05570d2574l0445G7287d1715k9246
$$ -186611 -228396 -604 -2259 -144729 -50579 -8507 -114077 -42574 -73019 77287 -41715 -70961
15640g0961c5068B60251c1145B85285e6124F4062i8187D6689K60003a65508f5416
$$ -70961 -35068 260251 -31145 285285 -56124 64062 -98187 46689 306692 -165508 -65416
15628a79505A89847c11129R4537c184A78929p9484a93311B7697M16149b49202
$$ -179505 189847 -311129 -216592 -3184 178929 99445 -193311 27697 443846 -249202
15617b71314I35c44398a21189B9838J41856p8466d57848A49969N5886G9719i179
$$ -271314 935 -344398 -121189 29838 171694 93228 -457848 149969 205855 79719 -9179
15605I7314g2592q1449C69218A72058b37227d9653K3734l15035J4168d121A80756
$$ 97314 -72592 -154041 369218 172058 -237227 -49653 -25919 -340954 -326786 -4121 180756
15593A60896J3472a08331A02860c65729B39366A19333h1488A90633O7013F7185
$$ 160896 174368 -108331 102860 -365729 239366 119333 -81488 190633 257646 67185
15582B93757r4253c7824A17234a11929A37636g3024C8099b25007m6320A28670
$$ 293757 199504 -37824 117234 -111929 137636 -73024 38099 -225007 -271327 128670
15571a1943k80931o6165K4285a31190m8944M7564A11479c5445m3545k35041m2383
$$ -11943 -292874 -359039 -334754 -131190 -180134 -132570 111479 -35445 -78990 -314031 -356414
15560c56414B00579C1718O9052l4119k929c2228A64722B0158b20537A92890a99569
$$ -356414 200579 31718 100770 66651 63722 -32228 164722 20158 -220537 192890 -199569
15548A21328A9159K51466h2360j01488A38653o0901L29759C3880a33073C73448
$$ 121328 19159 270625 -82360 -183848 138653 77752 407511 33880 -133073 373448
15537D36163D6999K5570a02369L3697A35000J79230H5224d4040k82302C2965L40491
$$ 436163 46999 72569 -102369 -68672 135000 314230 85224 -44040 -326342 32965 373456
15526C73456A38128c02444c6923A63972L802p5087j9745g0562F4035b50764C18733
$$ 373456 138128 -302444 -36923 163972 167774 92687 72942 -70562 64035 -250764 318733
15514B59905F5182K80796M7160A45456L8185C3312K96372F7422b6605A31174a28116
$$ 259905 65182 345978 393138 145456 183641 33312 329684 67422 -26605 131174 -128116
15502B53874n4823Q487a28143B50048B6896b51972B48535f6802B45358d4346B6761
$$ 253874 199051 207538 -128143 250048 26896 -251972 248535 -66802 245358 -44346 26761
15490a55888B14426q125a47230j64217A72162J13483a93267D35585b01662R0869
$$ -155888 214426 206301 -147230 -311447 172162 285645 -193267 435585 -201662 -110793
15480a10793B26411p2794J35924j07845k5104Q5607K88572k6351m564B49501H0460
$$ -110793 226411 153617 289541 181696 156592 242199 530771 504420 499856 249501 80460
15468h2452B90953H6548e9676H9616Q0832p4668P0381K4116q3814h0405p1264
$$ -82452 290953 86548 -59676 89616 170448 95780 166161 190277 106463 -80405 -151669
15457a51669A00153N3911K5422A8174g8037l25094A12488a2924k05025q789A85179
$$ -151669 100153 154064 179486 18174 -78037 -403131 112488 -12924 -217949 -226738 185179
15445A94920J37926J28127R6742L01364K22174J35572n06893m9614C14041m3502
$$ 194920 332846 460973 557715 859079 1081253 1216825 709932 660318 314041 270539
15435B70539M4297B5435J88759I6516k3826K8380C3697c08718A66882a57045j7844
$$ 270539 314836 25435 214194 96516 72690 101070 33697 -308718 166882 -157045 -174889
15424a74889d190k301j01332A34293L3765a08037l64869e6839A90923Q7192n4941
$$ -174889 -4190 -6491 -107823 134293 168058 -108037 -472906 -56839 190923 278115 223174
15413B23174H650K33316b71718B7507a96419H6591b64917B1350a71176l74n8550
$$ 223174 8650 241966 -271718 27507 -196419 86591 -264917 21350 -171176 -171550 -230100
15402b30100e886A39404J63B2566J16430b35279G8384b7496A35333K5754a41196
$$ -230100 -5886 139404 139567 22566 138996 -235279 78384 -27496 135333 161087 -141196
15390A82519h3449A2511J10371b35823b9572A1988J03273C2371b83572A7802Q007
$$ 182519 -83449 12511 122882 -235823 -29572 11988 115261 32371 -283572 17802 25809
15379B5809K3737a38899B11016K39485j07898G0080j3177L33191A20325B2791
$$ 25809 49546 -138899 211016 450501 342603 70080 56903 390094 120325 22791
15368B4777b78310h7236B22798P5639b0262G3504k1094f7564A65383M1811C7771
$$ 24777 -278310 -87236 222798 298437 -20262 73504 52410 -67564 165383 207194 37771
15356B82707m42G011K24193G4544K03315d8166B3633N7185g7397C32177A44125
$$ 282707 282265 7011 231204 74544 277859 -48166 23633 80818 -77397 332177 144125
15344C25046A29188K39246O0908j31687J54873A17175h1986A95640K29236A44584
$$ 325046 129188 368434 429342 297655 452528 117175 -81986 195640 424876 144584
15333B46367c26712B62812G0810L34364j16917D8334J81896I1091J45350a87907
$$ 246367 -326712 262812 70810 405174 288257 48334 230230 91091 236441 -187907
15322A47650A4822L25683H7367c2740C6727M9906J46926b85372D146L19202J3272
$$ 147650 14822 340505 87367 -32740 36727 86633 233559 -285372 4146 323348 336620
15311C36620j61704B7236J26428g8279A62441J79067A40143R7689J68824C6634
$$ 336620 174916 27236 153664 -78279 162441 341508 140143 237832 406656 36634
15300b02601h2199b7838C14883e7359b5972A43211N23964c6320C15296c64073
$$ -202601 -82199 -27838 314883 -57359 -25972 143211 667175 -36320 315296 -364073
15289A08474J28503K44608c38407A91486I1397M9569a35567G9220K59496a44693
$$ 108474 236977 481585 -338407 191486 91397 140966 -135567 79220 338716 -144693
15278b46346A767a87122q4442H1535b61903A59670b18218Q7945M0906j68779G4301
$$ -246346 1767 -187122 -271564 81535 -261903 159670 -218218 -130273 -89367 -258146 74301
15266A68621f7221B6386M7417h7691A3871n397J34011e7641E798J69827f7617
$$ 168621 -67221 26386 73803 -87691 13871 8474 142485 -57641 5798 175625 -67617
15254B06775e476m791A47724a45828p0619B65202l1200n1812L2732D3001M25083
$$ 206775 -5476 -10267 147724 -145828 -216447 265202 234002 182190 214922 43001 468084
15243D68084K80282O14532L22869k57899J87661F03704j65587j12474A19753n1386
$$ 468084 748366 1362898 1685767 1427868 1615529 603704 438117 325643 119753 68367
15233F8367J4150J55426j03101f1162b4782k7489A6678a71244l92A53065D9904
$$ 68367 82517 237943 134842 -61162 -24782 -52271 16678 -171244 -171636 153065 49904
15221h3142C37376E1603a57652c7989a124j45641A22984a4j18324A58741J49422
$$ -83142 337376 51603 -157652 -37989 -1124 -146765 122984 -14 -118338 158741 308163
15210C08163L3053j43797i3203B18999c25751A48980d7459j30716e4962i342p0793
$$ 308163 341216 197419 -93203 218999 -325751 148980 -47459 -178175 -54962 -9342 -80135
15199h0135I7541k5409J13977c78168g3165H4806J77311Q9380c1479m8825A02158
$$ -80135 97541 72132 186109 -378168 -73165 84806 262117 351497 -31479 -80304 102158
15187b3535F8562J36460N1760A17202h5545E5177a9395A72528b6724A04745A694
$$ -23535 68562 205022 256782 117202 -85545 55177 -19395 172528 -26724 104745 1694
15175a50872r6108F2462A8519M6468c24328D5953K7988J20077b3049B29242R031
$$ -150872 -246980 62462 18519 64987 -324328 45953 73941 194018 -23049 229242 238273
15164B38273b9351C08155j47114K28835r4183a54387a0239C1020a42482I2792
$$ 238273 -29351 308155 161041 389876 295693 -154387 -10239 31020 -142482 92792
15153C39471d8893A93411J2088G7162B9117J84368A03250L2756R9215L8094J8399
$$ 339471 -48893 193411 205499 77162 29117 213485 103250 136006 235221 273315 291714
15142B91714a02390F637b9206k77992A41237J48378a0448l0037l5149L0271n9269
$$ 291714 -102390 6637 -29206 -307198 141237 289615 -10448 -40485 -75634 -45363 -104632
15131a04632b0024A20169J0706C6246J96851n4587a09597B11618o7361J4859F4213
$$ -104632 -20024 120169 130875 36246 233097 178510 -109597 211618 144257 159116 64213
15119C37474R2353K95621l55540o2003A28015K4402j1511m1807a16646H3313a00471
$$ 337474 429827 725448 369908 307905 128015 152417 140906 99099 -116646 83313 -100471
15107A64105J81355A65711e8223B9727J87375A5568a68450A68984j942F1170b8377
$$ 164105 345460 165711 -58223 29727 217102 15568 -168450 168984 167042 61170 -28377
15095B3461h4340A88751J42293r624p1168E1529J62036m5315B0789J47548c1885
$$ 23461 -84340 188751 331044 321420 250252 51529 213565 168250 20789 168337 -31885
15083a677A61928N4663b18909B69422A10185P9328E0584J38932J35115o5563M9703
$$ -1677 161928 216591 -218909 269422 110185 189513 50584 189516 324631 259068 308771
15072C08771A32899J1833b36186A36337J35922B0881e4108C73065A64800Q1586
$$ 308771 132899 144732 -236186 136337 272259 20881 -54108 373065 164800 246386
15062B46386b06705D50071D7132K68232A33483N06230k84836A47209K71416O9037
$$ 246386 -206705 450071 47132 315364 133483 639713 354877 147209 418625 487662
15052D87662B40653J7615J72960k7495P3029A81230j9901K04317J57129q8864
$$ 487662 240653 258268 431228 403733 476762 181230 161329 365646 522775 433911
15042D33911A13239J16165K35292k5085A38040J57075A41209L64187J14283j78135
$$ 433911 113239 229404 464696 439611 138040 295115 141209 505396 619679 441544
15032D41544M7346K89085l15549N49786J55759n49301K19378k83074k7224k11416
$$ 441544 488890 777975 462426 1012212 1167971 618670 838048 554974 527750 316334
15022C16334J05612j06365J21166K14737M2946p6330c041E24681p6269I0615K67857
$$ 316334 421946 315581 436747 651484 694430 618100 -3041 524681 448412 90615 358472
15011C58472r0200K07438A68470K35921A76111m3689K94987k5925A92382L33025
$$ 358472 268272 475710 168470 404391 176111 132422 427409 401484 192382 525407
15001E25407B07700P2636j6944O05231C44188F1347K55477j20690K52890o6118
$$ 525407 207700 280336 263392 868623 344188 61347 316824 196134 449024 382906
14991C82906l5123M6301N0734p7616r7053K38754M3758k14411M20131l16120J32997
$$ 382906 347783 394084 444818 367202 270149 508903 552661 338250 758381 442261 575258
14980E75258J62179j78045K80557l07216B23011J03743M49414k14965J6526L7418
$$ 575258 737437 559392 839949 532733 223011 326754 776168 561203 577729 615147
14970F15147k0288k20310R0530I1192P1287J47575g4458C95617J533m3608n1570
$$ 615147 594859 374549 465079 91192 162479 310054 -74458 395617 397150 353542 301972
14959C01972K25251m5929J1689j71132r8923J81334J42044B60360M3491L7957
$$ 301972 527223 481294 492983 321851 222928 404262 546306 260360 303851 341808
14949C41808J602j13891K94804J09634k37242L796M13147j20783A73432N6363
$$ 341808 343410 229519 524323 633957 396715 400511 813658 692875 173432 229795
14939B29795M29336B45951J99377j6563R2902k32666M63892k07001L31668m2827
$$ 229795 659131 245951 445328 428765 521667 289001 752893 545892 877560 834733
14929H34733K28627K54316q2749M6211L67050L6838J57506o32799L99987m68238
$$ 834733 1063360 1317676 1234927 1281138 1648188 1685026 1842532 1209733 1609720 1141482
14919A141482L15807K87460K06245L13976l84178m65756O099l68006m28072N5252
$$ 1141482 1457289 1744749 1950994 2264970 1880792 1415036 1421135 1053129 625057 680309
14909F80309J36814C11128L33534K0376j82782k23441L7051J62709o1120j3534
$$ 680309 817123 311128 644662 665038 482256 258815 295866 458575 397455 383921
14899C83921j07067o8683N05488B35615p5647J69481K37984A19669L61449O5831
$$ 383921 276854 208171 713659 235615 159968 329449 567433 119669 481118 546949
14889E46949J51212j32023l2739k02792J93688K44344m5350j5937L9892j17965
$$ 546949 698161 566138 533399 330607 524295 768639 723289 707352 747244 629279
14879F29279J47612J02159k89775p1048R6754k90350l491J15353J07197j31022
$$ 629279 776891 879050 589275 518227 614981 324631 321140 436493 543690 412668
14869D12668J59931k46413K45976R5340A88776O21372k75827n786j21809K21270
$$ 412668 572599 326186 572162 667502 188776 810148 534321 528535 406726 627996
14859F27996A36491J74691K85470m8822N212j56577J31227k41969J72302j19719
$$ 627996 136491 311182 596652 547830 553042 396465 527692 285723 458025 338306
14849C38306L83665k85262l9184L20773K31849Q0118j48703r7869L07643j71888
$$ 338306 721971 436709 397525 718298 950147 1030265 881562 783693 1091336 919448
14839I19448n4615J23025k84964m9919L1386j51662K77724l87916L16418l10708
$$ 919448 864833 987858 702894 652975 684361 532699 810423 422507 738925 428217
14829D28217n614L26313j61621J0784l2990k40533K65800J97245n8011k77796
$$ 428217 422603 748916 587295 598079 565089 324556 590356 787601 729590 451794
14819D51794J16530J10662P0470k96288L99311k243q2029k62304n530J76340j94267
$$ 451794 568324 678986 749456 453168 852479 850236 768207 505903 500373 676713 482446
14808D82446K37728J44536n0710O6104K72753j15962l17246k50220j46392J20086
$$ 482446 720174 864710 814000 880104 1152857 1036895 719649 469429 323037 443123
14798D43123K65694C43201K46183J43819k82606j02822L33200k50383K44408l27259
$$ 443123 708817 343201 589384 733203 450597 347775 680975 430592 675000 347741
14788C47741K94536k63541J50829L01197C19831K69937M7619k37436K23304j3727
$$ 347741 642277 378736 529565 830762 319831 589768 637387 399951 623255 609528
14778F09528O6008K23833j01048r412R7135m02829N92628l69444k48043J92864
$$ 609528 675536 899369 798321 788909 886044 483215 1075843 706399 458356 651220
14768F51220k26906J14801j05480O974J70752K5898j74682j47930K15526j44150
$$ 651220 424314 539115 433635 440609 611361 637259 462577 314647 530173 386023
14758C86023Q6556L36325l09125K2053k45758M54944j01063j25907J32631K687
$$ 386023 472579 808904 499779 521832 276074 731018 629955 504048 636679 639366
14748F39366J2328K24747j68935O3828o7412C41925K60857J26086q5637K44984
$$ 639366 651694 876441 707506 771334 703922 341925 602782 728868 643231 888215
14738H88215l19758Q1545M00778j7511j39954m31665O12845n8336J76090M103
$$ 888215 568457 650002 1050780 1033269 893315 461650 1074495 1016159 1192249 1196352
14728A196352J12649L65153K13377n64637M02439m79401l59035R071J5561l0755
$$ 1196352 1309001 1674154 1887531 1322894 1725333 1245932 886897 895968 911529 880774
14718H80774J12809j99389j92821J45407K15641n5832k51084J07746K07189n3260
$$ 880774 993583 794194 601373 746780 962421 906589 655505 763251 970440 917180
14708I17180k02617K47378J08435L279P687P7750O10248J28916j25648p4775k48615
$$ 917180 714563 961941 1070376 1073655 1081342 1159092 1769340 1898256 1772608 1697833 1449218
14697A449218k49784j59750k52592Q6099J38912m5193N584j75517j29644K57152
$$ 1449218 1199434 1039684 787092 873191 1012103 966910 972494 796977 667333 924485
14687I24485D52693N65142k36422L1557K6867O0683k7267M07988l75701K2693
$$ 924485 452693 1017835 781413 812970 839837 900520 873253 1281241 905540 928233
14677I28233M9893K27055j68267J59402l65936k49236M43198J0245K58154m68405
$$ 928233 978126 1205181 1036914 1196316 830380 581144 1024342 1034587 1292741 824336
14667H24336M07169m94797J24924l4930J08104J1746K02898l86026M10818J13084
$$ 824336 1231505 736708 861632 826702 934806 946552 1149450 763424 1174242 1287326
14657A287326l56779J64358j35583k689K99191O8580j48146l7885j29001K12902
$$ 1287326 930547 1094905 959322 956633 1255824 1324404 1176258 1138373 1009372 1222274
14647A222274q1077K7895J99405l38507L2331R8149Q0485M8264m08033M04191
$$ 1222274 1141197 1169092 1368497 1029990 1062321 1160470 1240955 1289219 881186 1285377
14637A285377m46237m4976L49212J13309K34628l60244k28247J88823p4289M08510
$$ 1285377 839140 794164 1143376 1256685 1491313 1131069 902822 1091645 1017356 1425866
14627A425866l00382J37320j90561M44576q9649o5814R7842k64814L15355l35437
$$ 1425866 1125484 1262804 1072243 1516819 1427170 1361356 1459198 1194384 1509739 1174302
14617A174302L48724o3076O4938j49806n8559L01736m70505Q1525j22563L09706
$$ 1174302 1523026 1459950 1524888 1375082 1316523 1618259 1147754 1229279 1106716 1416422
14607A416422o1617J10260k18994J25519L03984l32445J89511K12099l8378M0689
$$ 1416422 1354805 1465065 1246071 1371590 1675574 1343129 1532640 1744739 1706361 1747050
14597A747050j72397J13370j47365L3701j28235J78627j728p8957l4773o9303
$$ 1747050 1574653 1688023 1540658 1574359 1446124 1624751 1623023 1544066 1509293 1439990
14587A439990J08189L21112J27802l09747n0730O7515K53632k90851K88580j57340
$$ 1439990 1548179 1869291 1997093 1687346 1636616 1704131 1957763 1666912 1955492 1798152
14577A798152J10741l30596L47954L04644k92804l94407L31816P182L11159k65313
$$ 1798152 1908893 1578297 1926251 2230895 1938091 1543684 1875500 1882682 2193841 1928528
14567A928528P7011J81453l52839L41722K57483J35737j71413k37880L68531O5956
$$ 1928528 2005539 2186992 1834153 2175875 2433358 2569095 2397682 2159802 2528333 2594289
14557B594289K61471J92453j47797N08640M43580J91067R08444P63246K198266
$$ 2594289 2855760 3048213 2900416 3409056 3852636 4043703 4952147 5715393 7913659
14548G913659M088568Q020004J9916053m050264A6572051F261661k945389p17771
$$ 7913659 12002227 20022231 39938284 35888020 16572051 6261661 3316272 2598501
14540B598501j77512N09032Q92414J213818k059763m40131m51961j43486K79649
$$ 2598501 2420989 2930021 3822435 5036253 2976490 2536359 2084398 1940912 2220561
14531B220561J2384l77411q9613L44983k14560K86701j04387k3414M62902l65990
$$ 2220561 2232945 1855534 1765921 2110904 1896344 2183045 2078658 2055244 2518146 2152156
14521B152156o8255K32636K32036l23029K28913P3389q0786K49334k86846j46632
$$ 2152156 2083901 2316537 2548573 2225544 2454457 2527846 2447060 2696394 2409548 2262916
14511B262916O3661L79352j79888J40486J95756J8646k65922K85489J97912Q284
$$ 2262916 2326577 2705929 2526041 2666527 2862283 2880929 2615007 2900496 3098408 3106692
14501C106692j95346o3978n0563J39321j73209M17412j96554j13774K95536p1445
$$ 3106692 2911346 2847368 2796805 2936126 2762917 3180329 2983775 2870001 3165537 3094092
14491C094092L06028K2222k75669K69273J53498k57923j72721M09372K25084l66796
$$ 3094092 3400120 3422342 3146673 3415946 3569444 3311521 3138800 3548172 3773256 3406460
14481C406460L35185p2065L33952m4298q5664R2328j04214K76615j65649m7289
$$ 3406460 3741645 3669580 4003532 3959234 3873570 3965898 3861684 4138299 3972650 3925361
14471C925361Q4530o5046M604K20088r9427J61381k8881P1598p1883J79407P5136
$$ 3925361 4009891 3944845 3949449 4169537 4070110 4231491 4202610 4274208 4202325 4381732 4456868
14460D456868J05461k7885J37174M4901N3547J18020n7397K97538L5655J11137
$$ 4456868 4562329 4534444 4671618 4716519 4770066 4888086 4830689 5128227 5163882 5275019
14450E275019J46029n39944N61001J11133k63139K53627j53775Q0317K83523m8352
$$ 5275019 5421048 4881104 5442105 5553238 5290099 5543726 5389951 5470268 5753791 5705439
14440E705439M83552l34319k29714R7067M70116j62540J28653J67509n8194p9284
$$ 5705439 6188991 5854672 5624958 5722025 6192141 6029601 6158254 6325763 6267569 6188285
14430F188285L04234P3865j52666N21848r9855M79172m50169L93109J21646M59178
$$ 6188285 6492519 6566384 6413718 6935566 6835711 7314883 6864714 7257823 7379469 7838647
14420G838647J81732J3344L3223K19403K2823j65412J9665P1579n3173M43047
$$ 7838647 8020379 8033723 8066946 8286349 8309172 8143760 8163425 8235004 8181831 8624878
14410H624878N0726P2001J58997L84195M60770k90332M72329j08190K60818j51641
$$ 8624878 8675604 8747605 8906602 9290797 9751567 9461235 9933564 9825374 10086192 9934551
14400I934551q9867M59954J76554o5868K90096L60563r4281K95260l23966R01076
$$ 9934551 9844684 10304638 10481192 10415324 10705420 11065983 10971702 11266962 10942996 11844072
14390A1844072R7209o2540K73913J52544M02573R7789M18159M03386M08749J11749
$$ 11844072 11941281 11878741 12152654 12305198 12707771 12805560 13223719 13627105 14035854 14147603
14380A4147603M01436N9699p1389L31538M58543K51012L99483R0151L51563L19012
$$ 14147603 14549039 14608738 14537349 14868887 15327430 15578442 15977925 16068076 16419639 16738651
14370A6738651K44700N84805L41884K07085N57737L72255K7505Q66250q8549P74603
$$ 16738651 16983351 17568156 17910040 18117125 18674862 19047117 19074622 19940872 19852323 20626926
14360B0626926L95972N10617L29528M91479M02574N52903N34209M55460P10246
$$ 20626926 21022898 21533515 21863043 22354522 22757096 23309999 23844208 24299668 25009914
14351B5009914O63328O76918P15345M14025J167195K41003P05396R21361R84226
$$ 25009914 25673242 26350160 27065505 27479530 28646725 28887728 29593124 30514485 31498711
14342C1498711O29335Q57170J264856R57981Q85346Q96063R79776J427048R00877
$$ 31498711 32128046 32985216 34250072 35208053 36093399 36989462 37969238 39396286 40297163
14333D0297163J238024J563394J220930J404904J194191J614819J814177J593574
$$ 40297163 41535187 43098581 44319511 45724415 46918606 48533425 50347602 51941176
14325E1941176J939975J638564J942167J677483K518010K539582K330532J951931
$$ 51941176 53881151 55519715 57461882 59139365 61657375 64196957 66527489 68479420
14317F8479420K631597K776979K500468L061741L365975L196721L295342L313584
$$ 68479420 71111017 73887996 76388464 79450205 82816180 86012901 89308243 92621827
14309I2621827M319270M017391M189363M947735M773552M969158N409044N827786
$$ 92621827 96941097 100958488 105147851 110095586 114869138 119838296 125247340 131075126
14301A31075126O124303O207322O846783P672389P369021P843353Q858020Q866060
$$ 131075126 137199429 143406751 150253534 157925923 165294944 173138297 181996317 190862377
14293A90862377R243350R964121J0618013J1082965J1435247J1952282J2402545
$$ 190862377 200105727 210069848 220687861 231770826 243206073 255158355 267560900
14286B67560900J3050803J3378669J3368598J4051368J3648008J4006233J3727324
$$ 267560900 280611703 293990372 307358970 321410338 335058346 349064579 362791903
14279C62791903J3491472J2612576J2082107J0696846R144714O485220L279789
$$ 362791903 376283375 388895951 400978058 411674904 420819618 427304838 430584627
14272D30584627J561540P03456N09776j970731m852488l524258p533204j0100114
$$ 430584627 432146167 432849623 433359399 431388668 426536180 423011922 415478718 405378604
14264D05378604j1560807j2820758j3853493j4151546j4869855j5102820j4792912
$$ 405378604 393817797 380997039 367143546 352992000 338122145 323019325 308226413
14257C08226413j4160826j4664983j3760752j3223099j2642341j2211614j1710776
$$ 308226413 294065587 279400604 265639852 252416753 239774412 227562798 215852022
14250B15852022j0678901j0383318q377196r165366q837459p829119p973737p121574
$$ 215852022 205173121 194789803 186412607 177247241 168409782 160580663 152606926 145485352
14242A45485352o816539o202201o540979n314853n219378n031969m861742m644408
$$ 145485352 138668813 132466612 125925633 120610780 115391402 110359433 105497691 100853283
14234A00853283l992419m086620l557092l561506l128409l402122l240063l001525
$$ 100853283 96860864 92774244 89217152 85655646 82527237 79125115 75885052 72883527
14226G2883527k564526k535946k737998k101133k088545k283738j392061k264423
$$ 72883527 70319001 67783055 65045057 62943924 60855379 58571641 57179580 54915157
14218E4915157j799997j703201j625491j619016j329587j272326j569971j493527
$$ 54915157 53115160 51411959 49786468 48167452 46837865 45565539 43995568 42502041
14210D2502041j000864j572937o64166p03920j295911j105160j237804q42188
$$ 42502041 41501177 39928240 39264074 38560154 37264243 36159083 34921279 34079091
14202C4079091p72287j296252l1408j314015r56210n42989r53610m57118o48066
$$ 34079091 33306804 32010552 31979144 30665129 29708919 29165930 28212320 27755202 27107136
14193B7107136n70760r81834m01920o67218l24156o55550m79212p50687l39360
$$ 27107136 26536376 25554542 25152622 24485404 24161248 23505698 23026486 22275799 21936439
14184B1936439o02006l43670q00119k48138l00197l36881o23703m58010k10437
$$ 21936439 21334433 20990763 20190644 19942506 19642309 19305428 18681725 18223715 18013278
14175A8013278l78263k57878l54519m48419k70760l65931l3803o70497o1366l67306
$$ 18013278 17635015 17377137 17022618 16574199 16303439 15937508 15903705 15233208 15171842 14804536
14165A4804536r1749k79906m10139m03397r2592l44796N4931o63902J66899l75322
$$ 14804536 14712787 14432881 14022742 13619345 13526753 13181957 13236888 12572986 12739885 12364563
14155A2364563R696k34969m11274q6784r8250n26927K00115j46178l37286l08267
$$ 12364563 12374259 12139290 11728016 11641232 11542982 11016055 11216170 11069992 10732706 10424439
14145A0424439n4334p0103k24806j20353l27250l0305r2831k27820j23022j85151
$$ 10424439 10370105 10300002 10075196 9954843 9627593 9597288 9504457 9276637 9153615 8968464
14135H968464j4010k98462Q6655k99525j05242K1778p870o08604J90017J73495
$$ 8968464 8954454 8655992 8742647 8443122 8337880 8359658 8351788 7743184 7933201 8106696
14125H106696l31983k32167j70050j38434J31896o8451l58413J38011k17002O552
$$ 8106696 7774713 7542546 7372496 7234062 7365958 7297507 6939094 7077105 6860103 6866655
14115F866655l49267M05663l08845N5942J3267k91112R5141P4441n06798O1913
$$ 6866655 6517388 6923051 6614206 6670148 6683415 6392303 6487444 6561885 6055087 6117000
14105F117000j98601N1235k68345j16984K42198j31156l23452K0935J79735k76791
$$ 6117000 5918399 5969634 5701289 5584305 5826503 5695347 5371895 5392830 5572565 5295774
14095E295774L77207l58289j48773Q8237q2847k36178o8678L22396k22403j66811
$$ 5295774 5672981 5314692 5165919 5254156 5171309 4935131 4866453 5188849 4966446 4799635
14085D799635j7410J82190l61438l46129M91099n61227M5826K29511j16816n9053
$$ 4799635 4782225 4964415 4602977 4256848 4747947 4186720 4232546 4462057 4345241 4286188
14075D286188j64363p1397R6414J30309l21736J84679m32886L41654j66467J61061
$$ 4286188 4121825 4050428 4146842 4277151 3955415 4140094 3707208 4048862 3882395 4043456
14065D043456J10321m14252j56664M77759l76935N1311k06762J53935J35412q6768
$$ 4043456 4153777 3739525 3582861 4060620 3683685 3734996 3528234 3682169 3817581 3730813
14055C730813P5689j95183M427m16935L14626L786m45154j68658K12313P825O0013
$$ 3730813 3806502 3611319 3615746 3198811 3513437 3517223 3072069 2903411 3115724 3123549 3183562
14044C183562j9533J17060l32744M58142k44128r6955O3481k81825j40019K60929
$$ 3183562 3164029 3281089 2948345 3406487 3162359 3065404 3128885 2847060 2707041 2967970
14034B967970j62325L05929k94205K42981J57057n03629J91739n3984l31456k1419
$$ 2967970 2805645 3111574 2817369 3060350 3217407 2713778 2905517 2851533 2520077 2498658
14024B498658O1712m52367M14172J98085r4225n41991L98643K0452l8039J41633
$$ 2498658 2560370 2108003 2522175 2720260 2626035 2084044 2482687 2503139 2465100 2606733
14014B606733l61388J87156o9853K76449q10739M50082J80748J02825n07173j0059
$$ 2606733 2245345 2432501 2362648 2639097 1828358 2278440 2459188 2562013 2054840 2044781
14004B044781j32356K35634l19682L84925k39883J46503J59086k09474L41911
$$ 2044781 1912425 2148059 1828377 2213302 1973419 2119922 2279008 2069534 2411445
13995B411445l10123N8049j6556J45962M31664L56152J348512K164861O722849
$$ 2411445 2101322 2159371 2142815 2288777 2720441 3076593 4425105 6589966 13312815
13986A3312815J8421025R623290j8264610j1442755m505278k183171q96724m66152
$$ 13312815 31733840 41357130 23092520 11649765 7144487 4961316 4064592 3598440
13978C598440m20131N1595o67114P9087j71089R4116l3790K8092j61883j87845
$$ 3598440 3178309 3229904 2562790 2641877 2470788 2564904 2531114 2559206 2397323 2209478
13968B209478J83447j03979J6179k92853Q4628r1080K23017k51281J76194k73908
$$ 2209478 2392925 2288946 2305125 2012272 2096900 2005820 2228837 1977556 2153750 1879842
13958A879842O5912p9502J37294k33736J07931K1380q4332N2248K67493n64707
$$ 1879842 1945754 1866252 2003546 1769810 1877741 1899121 1814789 1867037 2134530 1569823
13948A569823P27919o74970K04248J14681Q1009l27907m4880O7255O0116m74743
$$ 1569823 2297742 1622772 1827020 1941701 2022710 1694803 1649923 1717178 1777294 1302551
13938A302551L98451j48885L5250p2325K51099m01577L03218k96246J55396r1437
$$ 1302551 1701002 1552117 1587367 1515042 1766141 1364564 1667782 1371536 1526932 1435495
13928A435495M100J99303k75017p7604r4619K71537j61458J88012K45208j68146
$$ 1435495 1439595 1638898 1363881 1286277 1191658 1463195 1301737 1489749 1734957 1566811
13918A566811L7092k56648k5294J22009J7062k22840l1084L55141r2202K4222
$$ 1566811 1603903 1347255 1321961 1443970 1461032 1238192 1207108 1562249 1470047 1494269
13908A494269k51118k04383M23398k74258r3429K86000N5515l82347L67973k24817
$$ 1494269 1243151 1038768 1462166 1187908 1094479 1380479 1435994 1053647 1421620 1196803
13898A196803R5819L8673K08783o56199N18271n96429M86281O9847j24258M3890
$$ 1196803 1292622 1331295 1540078 883879 1402150 805721 1292002 1361849 1237591 1281481
13888A281481j77175j33154K14571j79712K16158k53189K41786J66647k97984
$$ 1281481 1104306 971152 1185723 1006011 1222169 968980 1210766 1377413 1079429
13879A079429r0730R3376m470j05464j5680N1951j56948O3163L85841k99961J39805
$$ 1079429 988699 1082075 1077605 972141 956461 1008412 851464 914627 1300468 1000507 1140312
13868A140312J62582m43986J56477M5201m00402J99266P2707K87524O3936o14583
$$ 1140312 1302894 858908 1015385 1060586 660184 859450 932157 1219681 1283617 669034
13858F69034L05781P7349j39778P7770p080l96976K80195K94850R2625n64613
$$ 669034 974815 1052164 912386 990156 983076 586100 866295 1161145 1253770 689157
13848F89157Q5375m2128N6827M7641P3419P7856j37730M2032l62952M57228l5771
$$ 689157 774532 732404 789231 836872 910291 988147 850417 892449 529497 986725 950954
13837I50954K64834p1809m50178K70062j41569m3137J26716j06062j79394J67650
$$ 950954 1215788 1143979 693801 963863 822294 779157 905873 799811 620417 788067
13827G88067L54700k84355O0685o1498K2199l879k2337r8397J8245K74755m47220
$$ 788067 1142767 858412 919097 857599 879798 875919 853582 755185 773430 1048185 600965
13816F00965L72559q2451P5957o3397l04817o420p8869J28672R5603K46193k96057
$$ 600965 973524 891073 967030 903633 598816 592396 513527 642199 737802 983995 687938
13805F87938J29623q945l28471K47864j43990M79815m31381K73538j51078R7385
$$ 687938 817561 808616 480145 728009 584019 1063834 632453 905991 754913 852298
13795H52298j81362j41256K47395J54658j66134J57783m42988R632K64631j59661
$$ 852298 670936 529680 777075 931733 765599 923382 480394 490026 754657 594996
13785E94996N5124J76754k26029Q6012J48923l50404O31758D50896K41587j44781
$$ 594996 650120 826874 600845 686857 835780 485376 1117134 450896 692483 547702
13775E47702K21528j35652j2921j26209K97618B20183M90575J80481k81360L91312
$$ 547702 769230 633578 620657 494448 792066 220183 710758 891239 609879 1001191
13765A001191k64315r7271J40275l56800k5032J38043N44969D89864l9497m4228
$$ 1001191 736876 639605 779880 423080 398048 536091 1081060 489864 450367 406139
13755D06139M03135l13862n3406J34028l689J53920N7333r1825m7984L86405D03551
$$ 406139 809274 495412 442006 576034 572345 726265 783598 691773 643789 1030194 403551
13743F63478L00646l87328q1182J47658j49443J07251K37052l13691o412k10104
$$ 663478 964124 576796 495614 643272 493829 601080 838132 524441 518029 307925
13733C07925L06218J79313q6321C27096K59275j17290Q1612j5841k03022K17455
$$ 307925 614143 793456 707135 327096 586371 469081 550693 534852 331830 549285
13723E49285J21649j79832J18117R4530k63392J30224B63374J81332q9063J76146
$$ 549285 670934 491102 609219 703749 440357 570581 263374 444706 355643 531789
13713E31789M6545k87592J30170K91942l04091j92486q3098L75921k9055j75681
$$ 531789 578334 290742 420912 712854 408763 216277 133179 509100 480045 304364
13703C04364J88576M22107l56320B06192L69309j12269l8909K65708k69256N9164
$$ 304364 492940 915047 558727 206192 575501 463232 424323 690031 420775 479939
13693D79939B07447K33998R5757j37592Q5557l6287J54177k64747N7259R5238
$$ 479939 207447 441445 537202 399610 485167 448880 603057 338310 395569 490807
13683D90807j158k34178J78749J10731B72201J04803c76C34690J62517J11855
$$ 490807 489649 255471 434220 544951 272201 377004 -376 334690 497207 609062
13673F09062j45971m8696j28012O2327J9674J52540j07614j37101L9892R1997
$$ 609062 463091 414395 286383 348710 368384 520924 413310 276209 316101 408098
13663D08098J99557k14798K20863q6910J95167k40456M0042A02480L56054q2972
$$ 408098 607655 392857 613720 526810 721977 481521 521563 102480 458534 375562
13653C75562L5290P2869Q1963l052J30955G8605K42172k0302L27492l03722R6592
$$ 375562 410852 483721 565684 562632 693587 78605 320777 300475 627967 324245 420837
13642D20837O2461k25546m3631J96840p1586J25972j44150O2549Q2171a14862
$$ 420837 483298 257752 214121 410961 339375 465347 321197 383746 465917 -114862
13631D54007n7014j17439J26525J1767r8358m8511N8745K54335B49339E7571K41227
$$ 454007 396993 279554 406079 417846 319488 270977 329722 584057 249339 57571 298798
13620B98798J79937O2300B35066O2674J03287r9839n0639J45378j19532J02427
$$ 298798 478735 541035 235066 297740 401027 301188 250549 395927 276395 378822
13610C78822O3382j48596J13910H010L12030J19586A27482K08033n4047J50912
$$ 378822 442204 293608 407518 8010 320040 439626 127482 335515 281468 432380
13600D32380J9145j44022j32936l7692J96056j57589f419C54973j1546k2498J2902
$$ 432380 451525 307503 174567 136875 332931 175342 -6419 354973 343427 320929 333831
13589C33831r5855M72267l39524J72261k01159A59873l7777J88970J47017j80413
$$ 333831 237976 710243 370719 542980 341821 159873 122096 311066 458083 277670
13579B77670j28375M2862R7554K54697A56561a54469C30535J78751L39449C60073
$$ 277670 149295 192157 289711 544408 156561 -154469 330535 509286 848735 360073
13568C92307j5393j4512Q268a63741E28895H5515K87345i7888B96809A05750K61205
$$ 392307 376914 362402 370670 -163741 528895 85515 372860 -97888 296809 105750 366955
13557C66955L5432j98976J59027n8805K10710k30233g1176E44422A05114b33747
$$ 366955 402387 203411 362438 303633 514343 284110 -71176 544422 105114 -233747
13546i151A69287D8883L39001A14067L01071K14647B15039K6791I2483N42314
$$ -9151 169287 48883 387884 114067 415138 629785 215039 241830 92483 634797
13536F34797B29971R1386p4271n3680Q5004m2371F580M12561f3682E40299B08578
$$ 634797 229971 321357 247086 193406 278410 236039 6580 419141 -63682 540299 208578
13524A81246J00255m373i735H3034K58510r3233N0516L4125j25562K47923A69643
$$ 181246 281501 277128 -9735 83034 341544 248311 298827 332952 207390 455313 169643
13512a31887C62630J84530k66375G9066J11944D7947M6019L12604A89393K00870
$$ -131887 362630 547160 280785 79066 191010 47947 93966 406570 189393 390263
13502C90263O8070i4077B98558K47480B8424a8054C07180A40550K21503j73195
$$ 390263 458333 -94077 298558 546038 28424 -18054 307180 140550 362053 188858
13492A88858g3579C10881I5316k8361R4886B7654M04986j84296a08441E36448
$$ 188858 -73579 310881 95316 66955 161841 27654 432640 248344 -108441 536448
13481C9668M26508K5925j87332j1537A21233K19868b62C83291d9863B35593K45290
$$ 39668 466176 492101 304769 293232 121233 341101 -262 383291 -49863 235593 480883
13470D80883j8751A35294m1427J3212l5811E071J93223i1372A91206G6198J82628
$$ 480883 462132 135294 93867 107079 71268 5071 198294 -91372 191206 76198 258826
13459B58826j0598d5132C56295d0798F6208a54429E849J47457J26816g9336D93296
$$ 258826 248228 -45132 356295 -40798 66208 -154429 5849 153306 280122 -79336 493296
13447D48626A74820J15498j43162J38630C8188J55367H1671B9405L14232j33116
$$ 448626 174820 290318 147156 285786 38188 193555 81671 29405 343637 210521
13437B10521j02139K11528j21756J13561G3832J08108J2554a46803E828R1773
$$ 210521 108382 319910 198154 311715 73832 181940 194494 -146803 5828 97601
13427I7601J77695k36j25843M8804F4282j5847L74050j07977e1964B27232K1998
$$ 97601 275296 275060 149217 198021 64282 48435 422485 314508 -51964 227232 249230
13416B49230J79795b03813A3970J12616K02051A40907J57029E8050K03587p4326
$$ 249230 429025 -203813 13970 126586 328637 140907 297936 58050 261637 187311
13406A87311Q9062n1664O3593a21933A57833k183K65139A52703L75985q1762A92208
$$ 187311 276373 224709 288302 -121933 157833 155650 420789 152703 528688 446926 192208
13394B96398O8531A37824d1968H7046b4727A46389p2530L76511I5712C8152a30712
$$ 296398 364929 137824 -41968 87046 -24727 146389 73859 450370 95712 38152 -130712
13382E5890J44985r8282f6673A15008P5318D0923L46843j75636A04535D5686J78931
$$ 55890 200875 102593 -66673 115008 190326 40923 387766 212130 104535 45686 224617
13371B24617K08667F7387K65161q998N3828G4000k5773O0512k4482K2450k5777
$$ 224617 433284 67387 332548 323550 377378 74000 48227 108739 84257 106707 80930
13360H0930J34343K16737p3972j28450l2376D2468A7038a18807e5242A84789h7326
$$ 80930 215273 432010 358038 229588 197212 42468 17038 -118807 -55242 184789 -87326
13348A08337J92023Q7198A19126O5364L33073A0570Q3137L12428A26588j5864
$$ 108337 300360 387558 119126 184490 517563 10570 93707 406135 126588 110724
13338A10724L16443A99778K592L01624j70996n9752A22277d1316C6581L59152
$$ 110724 427167 199778 202370 503994 332998 273246 122277 -41316 36581 395733
13328C95733L4329j81990I1419L93610A33428N1503J82361j25038P3193n2035
$$ 395733 430062 248072 91419 485029 133428 184931 367292 242254 315447 263412
13318B63412k9176H6372K0712G992K8841L59715A04119b49722A21374L32516d2903
$$ 263412 234236 86372 107084 7992 36833 396548 104119 -249722 121374 453890 -42903
13306D50411B0179M73597B44423n7230m816J41982b68139B06693J40523A13812
$$ 450411 20179 493776 244423 187193 182377 324359 -268139 206693 347216 113812
13295B99819H4191J66440o3655c5488I8096J21929a41348D15374i585B82996a07845
$$ 299819 84191 250631 186976 -35488 98096 220025 -141348 415374 -9585 282996 -107845
13283C30088E4696a19542m4065R604A31169K67780a1522r6077j64728I6257L59017
$$ 330088 54696 -119542 -163607 -154003 131169 398949 -11522 -107599 -272327 96257 455274
13272D55274j50607p6851e3952j05522C16037A57711C8576N7947J9763L5675f4157
$$ 455274 304667 227816 -53952 -159474 316037 157711 38576 96523 116286 151961 -64157
13260a7473A96648e1381A08317K46953j6074J32499A07358N1416h1085A5389a83159
$$ -17473 196648 -51381 108317 355270 339196 471695 107358 158774 -81085 15389 -183159
13248c2785F4921P8076j4199j8574c09819A81319n6142b61816C51762H0783A3364
$$ -32785 64921 142997 128798 110224 -309819 181319 125177 -261816 351762 80783 13364
13236b42260A87358l870j9703q1019i2529D39857j97608E2573p806L4904d0363
$$ -242260 187358 183488 163785 82766 -92529 439857 242249 52573 44767 79671 -40363
13224e8119C26174B416Q4400K13122A13809A2948M6683J11113C9448g8245A3692
$$ -58119 326174 2416 86816 299938 113809 12948 59631 170744 39448 -78245 13692
13212I5648H584Q9208d6092i699B01232J50489m3797a10709B25177N061r7672
$$ 95648 8584 97792 -46092 -9699 201232 351721 307924 -110709 225177 230238 132566
13201A32566H053L6318J33934G0191B7651i2675B64280g8844I1066B1658L16820
$$ 132566 8053 44371 178305 70191 27651 -92675 264280 -78844 91066 21658 338478
13190C38478g610C09659A44309g4944j45200B01190L4978b02255q814A73312j6845
$$ 338478 -7610 309659 144309 -74944 -220144 201190 236168 -202255 -211069 173312 156467
13179A56467J6662a39268f9550B40558c59127a8650A12176Q4047f3781A61768
$$ 156467 173129 -139268 -69550 240558 -359127 -18650 112176 196223 -63781 161768
13168A94485F3840K00466b03630B63169a7188B76224a2853A04455K90677H9774
$$ 194485 63840 264306 -203630 263169 -17188 276224 -12853 104455 395132 89774
13157a9037m2728H8118J56969a31314F4804f9352A02842c5849B70045G5477g8339
$$ -19037 -61765 88118 245087 -131314 64804 -69352 102842 -35849 270045 75477 -78339
13145i3565E5894J21060c3125p8266p1496c9248j89768m7169B32150I5938C2820
$$ -93565 55894 176954 -33125 -111391 -182887 -39248 -229016 -276185 232150 95938 32820
13133e7222A78993d0352j8707B65399e9751B5946L02009a5274n7172B47808r5579
$$ -57222 178993 -40352 -59059 265399 -59751 25946 327955 -15274 -72446 247808 152229
13122A52229a00886B6101J52532b61011B52576j05560l1935A578i7943K842C72155
$$ 152229 -100886 26101 178633 -261011 252576 147016 115081 1578 -97943 -95101 372155
13110F4203R1683F0562e3234j94517E6124N6173i4940H7279I942a91259k7729
$$ 64203 155886 60562 -53234 -247751 56124 112297 -94940 87279 9942 -191259 -218988
13099b18988f4179A43250K57380b21201A2445a35671I6433b72146A66267D6263
$$ -218988 -64179 143250 400630 -221201 12445 -135671 96433 -272146 166267 46263
13088A16383J06757b37188I8901K1814a84003A61503D1546d8084B13318k8249
$$ 116383 223140 -237188 98901 120715 -184003 161503 41546 -48084 213318 185069
13078A85069J20224A2519a5085k66294h9548A16397a68084N1333e8268K6850p0241
$$ 185069 305293 12519 -15085 -281379 -89548 116397 -168084 -116751 -58268 -31418 -101659
13067a01659A38504C8917K303K27538I2576J26207f3350A0138d4675C0321M60069
$$ -101659 138504 38917 41220 268758 92576 218783 -63350 10138 -44675 30321 490390
13056D90390B33020K01150j69283A06727J2215K940J99450A27793n9221a32815
$$ 490390 233020 434170 264887 106727 118942 121882 321332 127793 68572 -132815
13045h2943c4961A98490a03497C66185j13877q6335o7846M258r033K00639A07577
$$ -82943 -34961 198490 -103497 366185 252308 165973 98127 102385 93352 293991 107577
13033A07755a30128L0282B86076r0805D6005a9792H023B61g7062j72836A71572
$$ 107755 -130128 -99846 286076 195271 46005 -19792 8023 261 -77062 -249898 171572
13021B24950H7317A1388a06834E9488c41044a43367B3809a16651e6851j6229L5439
$$ 224950 87317 11388 -106834 59488 -341044 -143367 23809 -116651 -56851 -73080 -37641
13010c7641b666B8021b27908F9821a72643D39313a94725C48793G3724J19412J10953
$$ -37641 -2666 28021 -227908 69821 -172643 439313 -194725 348793 73724 193136 304089
12999C04089J6886b14801A94107n6062K30725m3837k2245A37695F0392d58315
$$ 304089 320975 -214801 194107 138045 368770 324933 302688 137695 60392 -458315
12988I8593M09711F4524K52195D8079a35911D2153c8750D8186h3343E738R4827
$$ 98593 508304 64524 316719 48079 -135911 42153 -38750 48186 -83343 5738 100565
12977A00565N2719a01954D04604j24094a99800A5596a09069C9417g0371q2253
$$ 100565 153284 -101954 404604 280510 -199800 15596 -109069 39417 -70371 -152624
12967a52624a6607q1654A1854b01936f3332D10714b33985P3968n9023A49165L0980
$$ -152624 -16607 -98261 11854 -201936 -63332 410714 -233985 -160017 -219040 149165 180145
12956A80145n0954J49289a80817j87159G5752c1561j67603F5198j8549L7270N9454
$$ 180145 129191 278480 -180817 -367976 75752 -31561 -199164 65198 46649 83919 143373
12945A43373b38509h9778j57904E1038j0601O9786b60208b7442n8312A91881J5450
$$ 143373 -238509 -89778 -247682 51038 40437 110223 -260208 -27442 -85754 191881 207331
12934B07331M5333B9549A4756G196J13309f9749C23830a30890B03942r2602b59987
$$ 207331 252664 29549 14756 7196 120505 -69749 323830 -130890 203942 111340 -259987
12922G4755B2519K07410e9978D31918a83882C7285q345a14439a7923A7213c50288
$$ 74755 22519 229929 -59978 431918 -183882 37285 28940 -114439 -17923 17213 -350288
12910b6352L163m4780D7564a75918l7264E1629a43946r4685B816f6280B25152
$$ -26352 -23189 -67969 47564 -175918 -213182 51629 -143946 -238631 2816 -66280 225152
12898a39136j8182k20327i4728A55441a90261A950J31488a37512A21685B9065
$$ -139136 -157318 -377645 -94728 155441 -190261 1950 133438 -137512 121685 29065
12887G8394b90676C84052A75246f2636B76404a77722N8641L2701A45016m9204
$$ 78394 -290676 384052 175246 -62636 276404 -177722 -119081 -86380 145016 95812
12877I5812Q7222H7834a45170C43995j71686R4377B4916b59112R3429A10722c31345
$$ 95812 183034 87834 -145170 343995 172309 266686 24916 -259112 -165683 110722 -331345
12865a04498B23570d40048A09998D042a31499B52826a33205A43804f5969l5576
$$ -104498 223570 -440048 109998 4042 -131499 252826 -133205 143804 -65969 -101545
12855a01545k8680D9180B3319a96640a234r35k26367f7044A99319a86790n4918
$$ -101545 -130225 49180 23319 -196640 -1234 -2169 -228536 -67044 199319 -186790 -241708
12844b41708F0036h980A22558b34759A25529c37285B4775b74805f9366k49525
$$ -241708 60036 -8980 122558 -234759 125529 -337285 24775 -274805 -69366 -318891
12834c18891A35159b82297B53793A9242D355J70218f8526C52251b54923F7165
$$ -318891 135159 -282297 253793 19242 4355 174573 -68526 352251 -254923 67165
12823A35066B5769a57516H0556a5193A56777L418N9216D2924a08941j31515h540
$$ 135066 25769 -157516 80556 -15193 156777 160195 219411 42924 -108941 -240456 -8540
12811e969r3596B18299L8559D3521a07859B69151a1664k01202A21251J90503C9519
$$ -5969 -99565 218299 256858 43521 -107859 269151 -11664 -212866 121251 311754 39519
12799a05343c9211B3908P9882L2398a00497C7089R1332a89584P2110F3865P4476
$$ -105343 -39211 23908 103790 136188 -100497 37089 128421 -189584 -117474 63865 138341
12788A38341l8350f8363D0914d14045F664J2842R1826N295M0988Q0370A9394M8170
$$ 138341 99991 -68363 40914 -414045 6664 19506 111332 116627 157615 237985 19394 67564
12776F7564J48585c21621A96754P5175d665k5943A5017c75032I091a8430B41010
$$ 67564 216149 -321621 196754 271929 -4665 -30608 15017 -375032 9091 -18430 241010
12764B17456b734l2876j51321d9233j32401I6281a09323B433b3644B3009P7600
$$ 217456 -2734 -35610 -186931 -49233 -181634 96281 -109323 2433 -23644 23009 100609
12753A00609d39600h2044J5314L848N722m7298j4428B72109H9145a11930p263
$$ 100609 -439600 -82044 -66730 -62882 -57160 -104458 -118886 272109 89145 -111930 -119193
12742a19193b2904r6036J7554A58546D6111e6858E1240d2750m1537d0902D13238
$$ -119193 -22904 -118940 -101386 158546 46111 -56858 51240 -42750 -84287 -40902 413238
12730a06281a8820C48936j47902H9202a69668O835A44022d4914K0567j22502j07097
$$ -106281 -18820 348936 201034 89202 -169668 -162833 144022 -44914 -24347 -146849 -253946
12719b53946j38060C17624a20900q9707N9346I9753L4251E3843L28072g4542B40447
$$ -253946 -392006 317624 -120900 -210607 -151261 99753 134004 53843 381915 -74542 240447
12707E0246J31743Q5332H3403K6663P7806F3836B6468e9967I7845J35993A298
$$ 50246 181989 267321 83403 110066 187872 63836 26468 -59967 97845 233838 1298
12695G011a87124j1571b4912k8798A34785D2588a1764j36580K4491a2533E217
$$ 7011 -187124 -198695 -24912 -53710 134785 42588 -11764 -148344 -123853 -12533 5217
12683D77J40505b0873j50272r7595e0974A69779C8635a15881A06247e7895B96964
$$ 477 140982 -20873 -171145 -268740 -50974 169779 38635 -115881 106247 -57895 296964
12671I1941b74555a0871j35972F2228b82732a15412K3916b981B53732J68161j97541
$$ 91941 -274555 -10871 -146843 62228 -282732 -115412 -91496 -2981 253732 421893 224352
12660B24352j00218a4849F605b08720A87935a14762B1679K11527r2814C7570Q2026
$$ 224352 124134 -14849 6605 -208720 187935 -114762 21679 233206 140392 37570 119596
12649A19596Q1604J58580a25241A2023O1067b9689A98170c0477l62994d792j08385
$$ 119596 201200 359780 -125241 12023 73090 -29689 198170 -30477 -393471 -4792 -113177
12638a13177K8211K751j64435e21o28784B19315E7906M2060J43430j10630a36665
$$ -113177 -84966 -82215 -246650 -521 -629305 219315 57906 99966 243396 132766 -136665
12626B52223b5623C13521j56503J68833N8499j90652e1432C21742A4327J8074
$$ 252223 -25623 313521 157018 325851 384350 193698 -51432 321742 14327 32401
12616C2401b77663Q1011B2130b61866a02659b1274h187G4701J49452I5531K53791
$$ 32401 -277663 -196652 22130 -261866 -102659 -21274 -8187 74701 224153 95531 349322
12605C49322B9782J81572a79031B86463A06420f9280A74958c0947l6508A2535
$$ 349322 29782 211354 -179031 286463 106420 -69280 174958 -30947 -67455 12535
12594H2157L007h5478n9529L0696A81162n4145O1805e4497I7909l2659a2917F6199
$$ 82157 85164 -85478 -145007 -114311 181162 127017 188822 -54497 97909 65250 -12917 66199
12581f4870B59327I9729a8030B94896E4287d3742j5002A8471P3678J39982G3991
$$ -64870 259327 99729 -18030 294896 54287 -43742 -58744 18471 92149 232131 73991
12569g316A31678N5960q3478K28969b94903A58889B4818a0662B87245h0703E7078
$$ -7316 131678 187638 104160 333129 -294903 158889 24818 -10662 287245 -80703 57078
12557h2615J6413B11153c0790A75041a51447j63943a49449G7462a54427F1422
$$ -82615 -66202 211153 -30790 175041 -151447 -315390 -149449 77462 -154427 61422
12546A68133a09330j18554b3508A2965b99608C5371a63490K2034p1176O977b5789
$$ 168133 -109330 -227884 -23508 12965 -299608 35371 -163490 -141456 -212632 -205655 -25789
12534A00045a4461p5473B1057P4518Q747J57536r2425f7482F1810L4101B289I68
$$ 100045 -14461 -89934 21057 95575 104322 261858 169433 -67482 61810 95911 2289 968
12521a34897L6182A38076a84073H9383e2386k87332B98081a17080m3072A9449
$$ -134897 -98715 138076 -184073 89383 -52386 -339718 298081 -117080 -160152 19449
12510f8374J5391b745l7420j09350A43305n8391h4536B93370n137A26230J3617
$$ -68374 -52983 -2745 -40165 -149515 143305 84914 -84536 293370 288233 126230 139847
12499A39847a19422A92970O189D0816J67789R5195n489f4271m0588n310j5741
$$ 139847 -119422 192970 199159 40816 208605 303800 298311 -64271 -104859 -110169 -125910
12488a25910j88639G4738C66J33269a10224A94105a14426m7510e8549l13731f7300
$$ -125910 -314549 74738 366 133635 -110224 194105 -114426 -161936 -58549 -372280 -67300
12476B68080e2480K0514m56312A61851c52976i7606A16333i0704j1704j1952J377
$$ 268080 -52480 -31966 -488278 161851 -352976 -97606 116333 -90704 -102408 -114360 -112983
12465a12983k11929B17834b16407O3103j9076F4833O741J65647d6691J761k34056
$$ -112983 -324912 217834 -216407 -153304 -172380 64833 71574 237221 -46691 -44930 -278986
12454b78986H5004e4975b5067A49138A8957b8012A9823a77678A537a37551A98991
$$ -278986 85004 -54975 -25067 149138 18957 -28012 19823 -177678 1537 -137551 198991
12442I5692b24102J7742A46332a48861D1038a04751o7199j60884f1359I1460b30249
$$ 95692 -224102 -206360 146332 -148861 41038 -104751 -171950 -332834 -61359 91460 -230249
12430A64647h2146J6188j95623I4738B0476a57407f7647A34158k2790n5483L97524
$$ 164647 -82146 -65958 -261581 94738 20476 -157407 -67647 134158 111368 55885 453409
12419D53409E156K3736M5113e08829A23963f6305I1043a26029b0683P518k17692
$$ 453409 5156 28892 74005 -508829 123963 -66305 91043 -126029 -20683 -13165 -230857
12408b30857i1589A31813b07379a7612k91355A67806a7546H3191a55055K9722
$$ -230857 -91589 131813 -207379 -17612 -308967 167806 -17546 83191 -155055 -125333
12398a25333L6914B57537c0794B37766e01399E9194a13739C34206i4549j3340
$$ -125333 -88419 257537 -30794 237766 -501399 59194 -113739 334206 -94549 -107889
12388a07889I4677Q1328D1542J45705J85806b5613a2234I8037A6482J25780N3844
$$ -107889 94677 176005 41542 187247 373053 -25613 -12234 98037 16482 142262 196106
12377A96106A8602M9644B1857J48743o8566J50293q3963d2706M151A89820q3677
$$ 196106 18602 68246 21857 170600 102034 252327 168364 -42706 -38555 189820 106143
12366A06143B9427b90074k63586a27115b3901m9619F4469J08742a44068A81733
$$ 106143 29427 -290074 -553660 -127115 -23901 -73520 64469 173211 -144068 181733
12355A20157g6853p0905A16129a53035F4711J53790j029q5667a28625A22062b90597
$$ 120157 -76853 -147758 116129 -153035 64711 218501 217472 131805 -128625 122062 -290597
12343a19581a944D36625c760A24573f8097G9064J78399q2557b76614A48777a16121
$$ -119581 -1944 436625 -3760 124573 -68097 79064 257463 174906 -276614 148777 -116121
12331a6074B78138Q5166n7801G7296i5836A66609J60709j1677g4012B05035d5110
$$ -16074 278138 363304 305503 77296 -95836 166609 327318 315641 -74012 205035 -45110
12319b0171C51720j31186Q0920i728B03340J63534p3943a55160A64826a08177
$$ -20171 351720 220534 301454 -9728 203340 366874 292931 -155160 164826 -108177
12308I5555J19500r5978P7308a72949A87500o9829R7373a61616B02541M5459b77343
$$ 95555 215055 119077 196385 -172949 187500 117671 215044 -161616 202541 248000 -277343
12296e8268j16900A50581D6191g6121C22545d7458k1732D12149j10072o9751J46746
$$ -58268 -175168 150581 46191 -76121 322545 -47458 -69190 412149 302077 232326 379072
12285C79072j31276o7672e2099B27213F8604K93758A63038F6759J94201J6082
$$ 379072 247796 180124 -52099 227213 68604 362362 163038 66759 260960 277042
12275B77042k8603E0413J26794K42655g0311D6239N3798d0321A45386m908K7120
$$ 277042 248439 50413 177207 419862 -70311 46239 100037 -40321 145386 140478 167598
12264A67598B1232Q8650K83842A24349J1862B8243Q5038A3178Q4601l2497J50838
$$ 167598 21232 109882 393724 124349 136211 28243 113281 13178 97779 65282 216120
12253B16120K01903i1690A44335J6037J00725p7372B8901J14909J09584A06910
$$ 216120 418023 -91690 144335 160372 261097 183725 28901 143810 253394 106910
12242B17009f2966L0447B52398c7193B69601P212p1105p3555h5883A96293I4352
$$ 217009 -62966 -32519 252398 -37193 269601 276813 205708 132153 -85883 196293 94352
12230d0649a2198p2993I3014J07230a57302H4549L3382B6641P5949J88329J93805
$$ -40649 -12198 -85191 93014 200244 -157302 84549 117931 26641 102590 290919 484724
12219D84724b01479D72494A2317K90333a0895A72702a74309c7482r3853C90298
$$ 484724 -201479 472494 12317 302650 -10895 172702 -174309 -37482 -131335 390298
12208h4379j89555A84845a6070C71907D1749R5074J99767A47372m9552c04057
$$ -84379 -273934 184845 -16070 371907 41749 136823 336590 147372 97820 -304057
12197A78106p5703J59126h9715B69040k5869B622g9031C36441e4627A77080a0358
$$ 178106 102403 261529 -89715 269040 243171 2622 -79031 336441 -54627 177080 -10358
12185b09853A81063R968L4882m6809R9531A02759j6597A6354J07185N9527O1125
$$ -209853 181063 191031 225913 179104 278635 102759 86162 16354 123539 183066 244191
12174B44191j07229n124p813L08544o948C9685J74884J79095j52938J37362A73104
$$ 244191 136962 131838 124025 432569 425621 39685 214569 393664 240726 378088 173104
12162B93294A4741a02A14109M78438G2194L66007i6672r46B97955G8878d1726
$$ 293294 14741 -102 114109 592547 72194 438201 -96672 -97618 297955 78878 -41726
12150b2309B70536m2539k1987J24943j29817a26421I3547i8773f080l5941A54083
$$ -22309 270536 227997 206010 330953 201136 -126421 93547 -98773 -6080 -42021 154083
12138A88753J51874A36852g8520G6283K37040A47069N4232d7700B2732h2814J7926
$$ 188753 340627 136852 -78520 76283 313323 147069 201301 -47700 22732 -82814 -64888
12127f4888B93068K29159B16083q3676J8586c1148F9212f4565A58960n2297K13772
$$ -64888 293068 522227 216083 132407 150993 -31148 69212 -64565 158960 106663 320435
12116C20435a74125M0070B85219l3140I4847Q8919j9368C7886j7480J90270j2421
$$ 320435 -174125 -134055 285219 252079 94847 183766 164398 37886 20406 210676 198255
12105A98255d59860A12950a19191M91a8650F4096O0311b52955D9838a95900a9831
$$ 198255 -459860 112950 -119191 -118700 -18650 64096 124407 -252955 49838 -195900 -19831
12093A92330n620a24480B82996E4606F602J87001O930l9939R3444A03669L18604
$$ 192330 186710 -124480 282996 54606 6602 193603 200533 160594 254038 103669 422273
12082D22273j33128l1409m6024J20131p4736j26857J11939a46302A50646J50562
$$ 422273 289145 257736 211712 331843 257107 130250 242189 -146302 150646 301208
12072C01208o4161f8371f70A24127a73570A70367e995B6789b57214B17398r5590
$$ 301208 237047 -68371 -670 124127 -173570 170367 -5995 26789 -257214 217398 121808
12061A21808b35086A66536a99181B61166j21162a9367A50646k3277C5699f2275
$$ 121808 -235086 166536 -199181 261166 140004 -19367 150646 127369 35699 -62275
12050I2492A8204c42771f4609K1026B9421a26677j46081p9227F3586j5064A953
$$ 92492 18204 -342771 -64609 -43583 29421 -126677 -272758 -351985 63586 48522 1953
12038C02580a3629H1507B9599f7077A44633d8634B75480B1905N9355a96971k1504
$$ 302580 -13629 81507 29599 -67077 144633 -48634 275480 21905 81260 -196971 -218475
12027b18475I8215J4934d00024E596J76104b23850D6565A8591K11899a55543A12724
$$ -218475 98215 113149 -400024 5596 181700 -223850 46565 18591 230490 -155543 112724
12015A34202j5102K24979a84125h7111A50926a95158A001b2780n3935A31903l3657
$$ 134202 119100 344079 -184125 -87111 150926 -195158 1001 -22780 -76715 131903 98246
12004I8246Q1967J68084Q529b73082A19703L531g1930C9434b40836e911B89967
$$ 98246 180213 348297 356826 -273082 119703 123234 -71930 39434 -240836 -5911 289967
11992d5564A7856J46799J3558c83167j07168F252a81958A56463k8947a97873l00942
$$ -45564 17856 164655 178213 -383167 -490335 6252 -181958 156463 127516 -197873 -498815
11981d98815F2197b2997A29724c12789k5756A8859J0418b21365E2844J95058K5601
$$ -498815 62197 -22997 129724 -312789 -338545 18859 29277 -221365 52844 247902 273503
11970B73503a06418J4228A3846N0414n26b12240c4934j80943J653h2175M074B23772
$$ 273503 -106418 -92190 13846 64260 63734 -212240 -34934 -215877 -214224 -82175 -78101 223772
11957B00829c20181Q2718E2733i796o2027g783l35135B892J8652b6781E9038N7421
$$ 200829 -320181 -237463 52733 -9796 -71823 -7783 -342918 2892 21544 -26781 59038 116459
11945A16459b54129A16103b15402B02383i1153A32361a47409B29973a71887A49658
$$ 116459 -254129 116103 -215402 202383 -91153 132361 -147409 229973 -171887 149658
11934E5931a52824j39259E5648a3235A05443d3660D7035i3019B19045A0348b72698
$$ 55931 -152824 -292083 55648 -13235 105443 -43660 47035 -93019 219045 10348 -272698
11922i3074K2325C03230e6162j84116f1502j70367P9775j32745h1353B15465B4504
$$ -93074 -70749 303230 -56162 -240278 -61502 -231869 -152094 -284839 -81353 215465 24504
11910G1392a6541A49726p3345i0718p8217C07929a18341C08628j42327c29475
$$ 71392 -16541 149726 76381 -90718 -168935 307929 -118341 308628 166301 -329475
11899F1488b36902b5225C2304a15297M3363m2092k223l41893f6767G6191B2083
$$ 61488 -236902 -25225 32304 -115297 -71934 -114026 -116249 -458142 -66767 76191 22083
11887a93467d0408D91305A15865a90678A74066b61627A97454c8778A23374a44498
$$ -193467 -40408 491305 115865 -190678 174066 -261627 197454 -38778 123374 -144498
11876f47455A52789a87946Q6177o5208Q0225B3532b34080l1723A04928j5207b87198
$$ -647455 152789 -187946 -101769 -166977 -86752 23532 -234080 -265803 104928 89721 -287198
11864b00596d4309q7453L5613B11500c9800E7067c5085A11965b25738I2322a94249
$$ -200596 -44309 -131762 -96149 211500 -39800 57067 -35085 111965 -225738 92322 -194249
11852B58939a87702c4882j78949J03818k42737H2280r469b80531B07853a6501
$$ 258939 -187702 -34882 -213831 -110013 -352750 82280 72811 -280531 207853 -16501
11841G4078b04742f3116C7813O115j8795a98761J1409B72697a17917m4135A06221
$$ 74078 -204742 -63116 37813 43928 25133 -198761 -187352 272697 -117917 -162052 106221
11829A34385a96240A82411J82217h638m6040K1513k38106j1882e4282A38650a62067
$$ 134385 -196240 182411 364628 -8638 -54678 -33165 -271271 -283153 -54282 138650 -162067
11817h208k30083D2690b64459h4404G4376a49393m7121J4129j475d3049l2461
$$ -8208 -238291 42690 -264459 -84404 74376 -149393 -196514 -182385 -183860 -43049 -75510
11806g5510l33912a25944I0383c0818A4306K86709a61901B60614a04895E7995
$$ -75510 -409422 -125944 90383 -30818 14306 301015 -161901 260614 -104895 57995
11795A38970B3194a01372k01001b2756k03538F3357R7673h1426j19453F8857a16625
$$ 138970 23194 -101372 -302373 -22756 -226294 63357 161030 -81426 -200879 68857 -116625
11783E0011J27345a32456j26573d4000m8816D7371a1811A9418L24941b1716A68890
$$ 50011 177356 -132456 -259029 -44000 -92816 47371 -11811 19418 344359 -21716 168890
11771C5372A5807a7129E2999b81184K0502C62728a40796A71941P5632c09852b2487
$$ 35372 15807 -17129 52999 -281184 -260682 362728 -140796 171941 247573 -309852 -22487
11759a32023N1212j52557B4032b79041c5621n126k9860J9500G6512J53522n2290
$$ -132023 -80811 -233368 24032 -279041 -35621 -40747 -70607 -51107 76512 230034 177744
11748A77744m3825b4906A63733a02499G6885b42292c3354C767L9378a02906k25229
$$ 177744 133919 -24906 163733 -102499 76885 -242292 -33354 3767 43145 -102906 -328135
11737c28135B31718F1823a68847D9591h6018C16426f9056l94778F2366h0944q110
$$ -328135 231718 61823 -168847 49591 -86018 316426 -69056 -463834 62366 -80944 -89054
11726h9054a3149k38315a10884F127a14025E7764j2994h1335a1144I099b8689
$$ -89054 -13149 -251464 -110884 6127 -114025 57764 44770 -81335 -11144 9099 -28689
11714B6518a00808J5778C2084K54952j15576e646k48480E459J11718L5935b9792
$$ 26518 -100808 -85030 32084 287036 171460 -5646 -254126 5459 117177 153112 -29792
11702E9791a23738M228C51630J9974e4677b2714j26618A58969a26795j12488e5383
$$ 59791 -123738 -119510 351630 371604 -54677 -22714 -149332 158969 -126795 -239283 -55383
11690A44473g6025o1690C29032c36303G3904M0732a00869a9196L769q9812B73000
$$ 144473 -76025 -137715 329032 -336303 73904 114636 -100869 -19196 -15427 -105239 273000
11678a52427b766j78364B24514h0250A1242M1001M0627k8478J43376q9664J44169
$$ -152427 -2766 -181130 224514 -80250 11242 52243 92870 64392 207768 118104 262273
11667B62273A10866b1088A2862a43572A86034b63014d1742B66125b06676j27507
$$ 262273 110866 -21088 12862 -143572 186034 -263014 -41742 266125 -206676 -334183
11657c34183d3826E0781a38498J8834R2d7510B56916n1515i9337A33214E2128
$$ -334183 -43826 50781 -138498 -119664 -119572 -47510 256916 205401 -99337 133214 52128
11645I3159B0601k552J57880b68971G747a4020B77935a32077d2210j97906a0180
$$ 93159 20601 18049 175929 -268971 7747 -14020 277935 -132077 -42210 -240116 -10180
11633A55983J13949I5728a17103B51127b35311b4804B53891J04861o7509A35740
$$ 155983 269932 95728 -117103 251127 -235311 -24804 253891 358752 291243 135740
11622C32259C6089K97489a21122C81332A75697e1940r1881k35500P2858a25697
$$ 332259 36089 333578 -121122 381332 175697 -51940 -143821 -379321 -306463 -125697
11611b9471A75932p4363I90L13995l0028F3528M9571g9864j87528g0268n1355
$$ -29471 175932 101569 990 314985 284957 63528 113099 -79864 -267392 -70268 -121623
11600a21623h517m5704H3823Q6362e2151J3873J4470p0281B15978a65814j05156
$$ -121623 -8517 -54221 83823 170185 -52151 -38278 -23808 -94089 215978 -165814 -270970
11589b70970A28249P5361b00412i7751D06802A74466o8528K27332A50715O0239
$$ -270970 128249 203610 -200412 -97751 406802 174466 105938 333270 150715 210954
11579B10954E6403K8169N3621L1086G8281a26403k86000d1046I020K6439N075
$$ 210954 56403 84572 138193 169279 78281 -126403 -412403 -41046 9020 35459 40534
11568D0534a28918b9398j27580O5026r9361B76971j09662J98152j73482J5652
$$ 40534 -128918 -29398 -156978 -91952 -191313 276971 167309 365461 191979 207631
11558B07631d0862A62554K5336J44132a585o4395l06121B30826I7886h1529m749
$$ 207631 -40862 162554 187890 332022 -1585 -65980 -372101 230826 97886 -81529 -86278
11547h6278B68063A4611J21950J2385C1788K61444E7365M510d6578g54n1197F8000
$$ -86278 268063 14611 136561 148946 31788 293232 57365 61875 -46578 -754 -51951 68000
11534B5562a69362b8912A23757K68777B8192L5366a11132A08305D4592f0377A8769
$$ 25562 -169362 -28912 123757 392534 28192 63558 -111132 108305 44592 -60377 18769
11522C47555j41009H885O7654a24393c7279B54216B5301c59750c1716p852B00373
$$ 347555 206546 8885 76539 -124393 -37279 254216 25301 -359750 -31716 -39568 200373
11510A09455Q4535a75621a6007M312B26750j01516a04754A13210L01295A9223
$$ 109455 193990 -175621 -16007 -11695 226750 125234 -104754 113210 414505 19223
11499A30873N2551M18n8997D8979K8369J3307c9145j55512B07724a29705A83229
$$ 130873 183424 183842 124845 48979 77348 90655 -39145 -194657 207724 -129705 183229
11487C84903c9341m1899j17385E7150j3723J71457D1075R0733l7422M5545a21147
$$ 384903 -39341 -81240 -198625 57150 43427 214884 41075 131808 94386 139931 -121147
11475A87956a42022H5946R3192d10273D88525a60930b0321B21592K44631I0287
$$ 187956 -142022 85946 179138 -410273 488525 -160930 -20321 221592 466223 90287
11464A92160a55047D09909B04593R0719q1051R8865k3906Q7866e5672B13089G606
$$ 192160 -155047 409909 204593 295312 214261 313126 289220 377086 -55672 213089 7606
11452a72193a1855D808a08374f979B00972d07379b0883j12946A53913a29174A08964
$$ -172193 -11855 4808 -108374 -6979 200972 -407379 -20883 -133829 153913 -129174 108964
11440b21314F5441K35510M9671b17394j64843C81019e4138A919R531J1191h7951
$$ -221314 65441 300951 350622 -217394 -382237 381019 -54138 1919 11450 22641 -87951
11428D1488K09604c8485k64739a49345j08358l3928A92546H2995J7246a11984
$$ 41488 251092 -38485 -303224 -149345 -257703 -291631 192546 82995 100241 -111984
11417A02636c5898m9787j46466B16133H6731r747a35706K9614L6251J604J4933
$$ 102636 -35898 -85685 -232151 216133 86731 76984 -135706 -106092 -69841 -68237 -53304
11406e3304A49155a74144C19286l4525e3994r8629B68742a34416C07982i3140
$$ -53304 149155 -174144 319286 284761 -53994 -152623 268742 -134416 307982 -93140
11395A13127f6057D4149d3749A38510J0801K2655C8851A5261L4911c72971g84
$$ 113127 -66057 44149 -43749 138510 149311 171966 38851 15261 50172 -372971 -784
11383a13781A51201F2891b99326f8970l7182k59962a19704C6130J512J78179D0881
$$ -113781 151201 62891 -299326 -68970 -106152 -366114 -119704 36130 37642 215821 40881
11371B4382J20486j9319a06609A64589d9815l4863n701B18505G7980J37537b21049
$$ 24382 144868 125549 -106609 164589 -49815 -84678 -90379 218505 77980 215517 -221049
11359a25932c6440A20163b8858F6381i2375A39144b42135I8559J44083c4503A96576
$$ -125932 -36440 120163 -28858 66381 -92375 139144 -242135 98559 242642 -34503 196576
11347h7446B90912b35987i3520A53039a39342c1120k21852i827I8676C5841L27922
$$ -87446 290912 -235987 -93520 153039 -139342 -31120 -252972 -9827 98676 35841 363763
11336C63763A67109a15573L7771A03406L75836a06857N0803j0551j59775P2081
$$ 363763 167109 -115573 -77802 103406 479242 -106857 -56054 -66605 -226380 -154299
11326a54299G9891i1373B05456k3948e6786k91986h1593B74334G6737K1894e4660
$$ -154299 79891 -91373 205456 181508 -56786 -348772 -81593 274334 76737 98631 -54660
11314B29753a07286A73867a69978I5737j7794b33099O4174j13906E3883A0425
$$ 229753 -107286 173867 -169978 95737 77943 -233099 -168925 -282831 53883 10425
11303b6092l22181A41441o2078e641h39j56911B28499q5351c8174A91534b71355
$$ -26092 -348273 141441 79363 -5641 -839 -157750 228499 143148 -38174 191534 -271355
11291A6984a74007F8984B8734b27972E0164h9165j31078Q2909B8995b33244c9263
$$ 16984 -174007 68984 28734 -227972 50164 -89165 -220243 -137334 28995 -233244 -39263
11279B10918G5478e8139D912a79512F3128h5284B17609B8559a16667k5252j22117
$$ 210918 75478 -58139 4912 -179512 63128 -85284 217609 28559 -116667 -141919 -264036
11268b64036E1974a83970A76705a34287B03115b57986j71913J27143b2211I6446
$$ -264036 51974 -183970 176705 -134287 203115 -257986 -429899 -302756 -22211 96446
11257E9217b94780G961M6767b71449E3084a876l47801B13463a04607B05998b40044
$$ 59217 -294780 7961 54728 -271449 53084 -1876 -349677 213463 -104607 205998 -240044
11245F3509a19378H0937f1083E68a10124j11328N7944n1469A97268o1631h3321
$$ 63509 -119378 80937 -61083 568 -110124 -221452 -163508 -214977 197268 135637 -83321
11233F1697J42169p0484c8899A76769o5617b40603j9322a16274C76002a5587k58280
$$ 61697 203866 133382 -38899 176769 111152 -240603 -259925 -116274 376002 -15587 -273867
11222b73867j588F3561J2018c8253I3866g9175a2424D0109b05458A76746a41299
$$ -273867 -275455 63561 75579 -38253 93866 -79175 -12424 40109 -205458 176746 -141299
11210i1903R615n03j52569g2426G5221g6548A53298a53874l0364A8353e7491C45571
$$ -91903 -82288 -82791 -235360 -72426 75221 -76548 153298 -153874 -184238 18353 -57491 345571
11197a13843I1728a02671m2703b5280E1343a46260b0484l34553m433e5715j41620
$$ -113843 91728 -102671 -145374 -25280 51343 -146260 -20484 -355037 -359470 -55715 -197335
11186a97335m9386A21293d87669g6275l78498a8700k18535a3726A48194h6063
$$ -197335 -246721 121293 -487669 -76275 -454773 -18700 -237235 -13726 148194 -86063
11175A57901a57768f0419k08910j06658E1136J42502c24811n0118i8432B5210
$$ 157901 -157768 -60419 -269329 -375987 51136 193638 -324811 -374929 -98432 25210
11164a40991f9151m1952A05067b57692D5817a09256c3845l07311D2067K24204
$$ -140991 -69151 -111103 105067 -257692 45817 -109256 -33845 -341156 42067 266271
11154B66271j32616c29638A09720b6490l55116a23477k81342a1512D3020h3492
$$ 266271 133655 -329638 109720 -26490 -381606 -123477 -404819 -11512 43020 -83492
11143A06461e0104j57243A42866a54222q1873B66124d7871A01614m8418d4141
$$ 106461 -50104 -207347 142866 -154222 -236095 266124 -47871 101614 53196 -44141
11132G7065L63579C4865K46516B8446j818L43623h7826E6106j0488d8900E5095
$$ 77065 440644 34865 281381 28446 26628 370251 -87826 56106 45618 -48900 55095
11120C25499a41667B41382H2771p006J23397d3533j5542k3596C8340b16937J01214
$$ 325499 -141667 241382 82771 75765 199162 -43533 -59075 -82671 38340 -216937 -115723
11109a15723m0443D3756a42299k11697a05715A16399b18254C94911A39803K05917
$$ -115723 -156166 43756 -142299 -353996 -105715 116399 -218254 394911 139803 345720
11099C45720h6343c9669D59995k26094r1892J39006a21954e9128B22330j10017
$$ 345720 -86343 -39669 459995 233901 142009 281015 -121954 -59128 222330 112313
11089A12313M1477A0225J55883f4497D05995j93637b73595C07699e6847C36077
$$ 112313 153790 10225 166108 -64497 405995 212358 -273595 307699 -56847 336077
11078A94034q9315J53799f9188H4165J31768p0938J31846I5973F995M35263l4733
$$ 194034 104719 258518 -69188 84165 215933 144995 276841 95973 6995 442258 407525
11067D07525j70429O4291J9786O302J58820j09222j40323J90706K36345C30085
$$ 407525 237096 301387 321173 327475 486295 377073 236750 427456 663801 330085
11056E00393Q8840k01740J05874J34671R8620l6020P3231N3395B55705L39935
$$ 500393 589233 387493 493367 628038 726658 690638 763869 817264 255705 595640
11046E95640J24499k43891J96018L6408j07632J71451r3812j20249O1999B08752
$$ 595640 720139 476248 672266 708674 601042 772493 678681 558432 620431 208752
11035E17393P7211K5085R6596J77863l8435j65284C38453J6851L48610j33594
$$ 517393 594604 619689 716285 894148 855713 690429 338453 355304 703914 570320
11025E70320l1521B57621M29006l02130N15929k69247k41275K25790B80670Q7558
$$ 570320 538799 257621 686627 384497 900426 631179 389904 615694 280670 368228
11015C68228J10956J6520N03824k09526C19418K07655j04346J329K51394k58412
$$ 368228 479184 495704 999528 790002 319418 527073 422727 424056 675450 417038
11005D17038K71849M6519k8743j48221j07165R3660m9868L15002j66257L4523
$$ 417038 688887 735406 706663 558442 451277 544937 495069 810071 643814 678337
10995F78337C07833M22117l14081K21160K79718l84912P6527m2261k49460K31406
$$ 678337 307833 729950 415869 637029 916747 531835 608362 566101 316641 548047
10985E48047p9651L61194j66813L73765M7340k13798J0301J21267J11845K96490
$$ 548047 468396 829590 662777 1036542 1083882 870084 880385 1001652 1113497 1409987
10975A409987j71970M3046L05831L16506J09296J71461J88384M95565j60514o38832
$$ 1409987 1238017 1281063 1586894 1903400 2012696 2184157 2372541 2868106 2707592 2068760
10965B068760J61050n6019n5698P3725m05733J1020n79555K15414n9473j2641
$$ 2068760 2229810 2173791 2118093 2191818 1786085 1797105 1217550 1432964 1373491 1360850
10955A360850N4286K8089K08977r1238j01141O9783l59742K15211l11815k79332
$$ 1360850 1415136 1443225 1652202 1560964 1459823 1529606 1169864 1385075 1073260 793928
10945G93928R2396l22199p6746B22513J40038e2698k7068C794R1130K13078F4894
$$ 793928 886324 564125 487379 222513 362551 -52698 -79766 3794 94924 308002 64894
10933F5687A3421J92892c2502G4273B7814f0405B20151r0111L9088J52541F4266
$$ 65687 13421 206313 -32502 74273 27814 -60405 220151 130040 169128 321669 64266
10921b10098B63497N6657g1907G5174b0218j63625j73915a52436c0987m9288c9842
$$ -210098 263497 320154 -71907 75174 -20218 -183843 -357758 -152436 -30987 -80275 -39842
10909B32585p2850d218B36288a00902m9654A80451a41752a097o599D68986g299
$$ 232585 159735 -4218 236288 -100902 -150556 180451 -141752 -1097 -7696 468986 -7299
10897a57549e8362C86100g5766o1126B7169K0336J60614a65331j86485h0958H508
$$ -157549 -58362 386100 -75766 -136892 27169 47505 208119 -165331 -351816 -80958 8508
10885a66494j1910P6509C7285d2197j07156c62B0311g5172F4235b21899C35956
$$ -166494 -178404 -101895 37285 -42197 -149353 -362 20311 -75172 64235 -221899 335956
10873e7603F4905J3735b68647j45383a10185k2580I891g3898j27154F2853a03472
$$ -57603 64905 78640 -268647 -414030 -110185 -132765 9891 -73898 -201052 62853 -103472
10861d2114m52233J39117B481K61171E0404a60344A78247c42616A5943J73764
$$ -42114 -494347 -355230 2481 263652 50404 -160344 178247 -342616 15943 189707
10851A89707j9495G6455B3850K53034b0006j52531E6670P7100Q0145o8227a12726
$$ 189707 170212 76455 23850 276884 -20006 -172537 56670 133770 213915 145688 -112726
10839b7737j45765k3668C61634i3948c5495j07655l2538B98477H67K72665a16146
$$ -27737 -173502 -197170 361634 -93948 -35495 -143150 -175688 298477 867 273532 -116146
10827C6169i6304j54297g004B60365a53139A12428M573m0399J21875L6722P2553
$$ 36169 -96304 -250601 -7004 260365 -153139 112428 117001 76602 198477 235199 307752
10816C07752I4612C8477K73245a54470O8063A07917c8362B466J03899h0946I0635
$$ 307752 94612 38477 311722 -154470 -86407 107917 -38362 2466 106365 -80946 90635
10804A6624J82554d7972j13253j0862j9277G828J97034a29940P319j46768H135
$$ 16624 199178 -47972 -161225 -172087 -191364 7828 204862 -129940 -122621 -269389 8135
10792a62741f4690l3709q7957P148j11528L0239A41310P0353n1054a32564j4945
$$ -162741 -64690 -98399 -186356 -179208 -290736 -260497 141310 211663 160609 -132564 -147509
10781a47509Q665B3515J10120b04263D36925a81905j01343Q3642Q9013B07168
$$ -147509 -138844 23515 133635 -204263 436925 -181905 -283248 -199606 -110593 207168
10770d4052j04603A4917P6567c06732A01462g2869A16397f3926k08401i198p0039
$$ -44052 -148655 14917 91484 -306732 101462 -72869 116397 -63926 -272327 -9198 -79237
10759g9237I0443a79433N9843j28758a23492K7341j64132D3188b33397I7551b54873
$$ -79237 90443 -179433 -119590 -248348 -123492 -96151 -260283 43188 -233397 97551 -254873
10747A51543E9172a29584a3897j9795C0478g15B5592J3120d6107K1645j38471
$$ 151543 59172 -129584 -13897 -33692 30478 -715 25592 38712 -46107 -24462 -162933
10736a62933g0143a1112p291j05319j57776a17567D7770Pc19598B639g7832m5444
$$ -162933 -70143 -11112 -18403 -123722 -281498 -117567 47770 47777 -319598 2639 -77832 -123276
10724a23276A49669a32487l13731A08540a83482b6115j17767f3925E8982h690
$$ -123276 149669 -132487 -446218 108540 -183482 -26115 -143882 -63925 58982 -8690
10713B5204a23429p8724h5834b4303F8652K2110b09969c229I1312a62007b7282
$$ 25204 -123429 -202153 -85834 -24303 68652 90762 -209969 -3229 91312 -162007 -27282
10701B82665l3071E0945a62465P7933d0161A44175J8276i6921B31302c1685j14538
$$ 282665 249594 50945 -162465 -84532 -40161 144175 162451 -96921 231302 -31685 -146223
10690a46223k50456J55421C6331J22369f2645a8981j34335A20395R9892B2602
$$ -146223 -396679 -241258 36331 158700 -62645 -18981 -153316 120395 220287 22602
10679c4872n5704A89182n3621c6250l61411J63723r0373f0381l4017n9957j42251
$$ -34872 -90576 189182 135561 -36250 -397661 -233938 -324311 -60381 -94398 -154355 -296606
10668b96606J21043c855p7637c2407C7319a09577d2421l19382d7510a0413A51472
$$ -296606 -175563 -3855 -81492 -32407 37319 -109577 -42421 -361803 -47510 -10413 151472
10656E7894a82855k252o5556i0679n5895A8285b3923A47623n7004d49969b19039
$$ 57894 -182855 -185107 -250663 -90679 -146574 18285 -23923 147623 90619 -449969 -219039
10644a38808A71381Q9825D8192a70149I0055a01998j6623M8622A8150e3310j29239
$$ -138808 171381 261206 48192 -170149 90055 -101998 -118621 -69999 18150 -53310 -182549
10633a82549A80787b3220A76851p020a22308b3903A17562c6237l0898G0461a03474
$$ -182549 180787 -23220 176851 169831 -122308 -23903 117562 -36237 -67135 70461 -103474
10621a09658C8667c6303B84813b8361j94847M0486B7942d1752k60478B4174f6541
$$ -109658 38667 -36303 284813 -28361 -223208 -182722 27942 -41752 -302230 24174 -66541
10609a92033b7988j46364A35793C1517A3989d30198a2006B3106b11337A5238i0028
$$ -192033 -27988 -174352 135793 31517 13989 -430198 -12006 23106 -211337 15238 -90028
10597g2894B25086C659O4504a91508h8521j31982f3859A61103p5078a13591m0081
$$ -72894 225086 3659 68163 -191508 -88521 -220503 -63859 161103 86025 -113591 -153672
10586a53672H8300m1191a73091j28670g7865h212l49105C8102M1591P9157l9622
$$ -153672 88300 47109 -173091 -301761 -77865 -8212 -357317 38102 79693 158850 119228
10575A19228Q7221e9941b0219F3817g1380A2537b2772l4778j2779F242a73930
$$ 119228 206449 -59941 -20219 63817 -71380 12537 -22772 -57550 -70329 6242 -173930
10563A37437l859a29769A99048m797a06777B33146h3745j45834k8483l0042n8299
$$ 137437 133578 -129769 199048 194251 -106777 233146 -83745 -229579 -258062 -288104 -346403
10552c46403J56934r1093c9786j18109C4104e8892q4598A64828b63102B06571
$$ -346403 -189469 -280562 -39786 -157895 34104 -58892 -143490 164828 -263102 206571
10541a89015F8290R5360c4482n091a3124B28721D7485a40021a4119m6560B0473
$$ -189015 68290 163650 -34482 -39573 -13124 228721 47485 -140021 -14119 -60679 20473
10529c9407k79218f4083j22826j00729j00594A50029a66269A89839a27745G2442
$$ -39407 -318625 -64083 -186909 -287638 -388232 150029 -166269 189839 -127745 72442
10518e40465B41163J11328f3928m8766e0695k81621a29349K8592j68088A6257
$$ -540465 241163 352491 -63928 -112694 -50695 -332316 -129349 -100757 -268845 16257
10507a92471B29500a58388d5724p7895a6007B00632a73503g1283A25706a92355
$$ -192471 229500 -158388 -45724 -123619 -16007 200632 -173503 -71283 125706 -192355
10496b13738a3633H7321a968k52580F4766J26603a06402A407a95979A84371a65903
$$ -213738 -13633 87321 -1968 -254548 64766 191369 -106402 1407 -195979 184371 -165903
10484A40940c31929i9563A08107R5830r0283O7752a49936B40670F3264M88989
$$ 140940 -331929 -99563 108107 203937 113654 181406 -149936 240670 63264 552253
10474E52253j42869k8257j8611J75373A32871F0656a07473B12202A04088L4640
$$ 552253 409384 381127 362516 537889 132871 60656 -107473 212202 104088 138728
10464A38728i8675A4615a47642A91485F9924b1231n1289j64071A65081a02125
$$ 138728 -98675 14615 -147642 191485 69924 -21231 -72520 -236591 165081 -102125
10453e6925G8823f2450C50936a79214f6403A07420J23861j4498J34985c2936F4955
$$ -56925 78823 -62450 350936 -179214 -66403 107420 231281 216783 351768 -32936 64955
10441a65525A43136a39301B28760c66887a10782j71378b2358C6901J09006b9194
$$ -165525 143136 -139301 228760 -366887 -110782 -282160 -22358 36901 145907 -29194
10430g0464A14225C2297d83881a52179d5202j03228a3998j7629A9693b21216m5558
$$ -70464 114225 32297 -483881 -152179 -45202 -148430 -13998 -31627 19693 -221216 -266774
10419b66774a13113n8713A78249a59306A4215Q1725f4641H9824g9829G1818a35572
$$ -266774 -113113 -171826 178249 -159306 14215 95940 -64641 89824 -79829 71818 -135572
10407a24591E015b2075l02620J14019O9364e5764j1766l6811q04q1940B53299
$$ -124591 5015 -22075 -324695 -210676 -141312 -55764 -67530 -104341 -105145 -187085 253299
10395b87912A03736j9002b19208i252B47841g5734C97346a0835C62511A53758
$$ -287912 103736 84734 -219208 -9252 247841 -75734 397346 -10835 362511 153758
10384A78184l0157k2445a09306B9731L16889G360b12945C01090D9376P2495K6809
$$ 178184 148027 125582 -109306 29731 346620 7360 -212945 301090 49376 121871 148680
10373A48680o6855P3408J1263J62986c6970D99244I2818R0546J85150K51584o2903
$$ 148680 81825 155233 166496 329482 -36970 499244 92818 183364 368514 620098 557195
10362E57195B25259q6033J46302c2206D57703j15280Q0231H2719M9987J17542
$$ 557195 225259 139226 285528 -32206 457703 342423 422654 82719 132706 250248
10352B50248j0139J96863B2927K70680J46975q4420Q584A56724O7606M4043L249
$$ 250248 240109 436972 22927 293607 440582 356162 364746 156724 224330 268373 271622
10341B71622K29918f8494A94585b99711H5531J24144n4007P419A8733b5259r1243
$$ 271622 501540 -68494 194585 -299711 85531 209675 155668 163087 18733 -25259 -116502
10330a16502D31081F1987j6963P9609j0558I833L57415j37038M8109G2773J46526
$$ -116502 431081 61987 45024 124633 114075 9833 367248 230210 278319 72773 219299
10319B19299O9380c4163l8799R388B82131a13571D30452C8153J96090b1561A74246
$$ 219299 288679 -34163 -72962 -63574 282131 -113571 430452 38153 234243 -21561 174246
10307F205N356a46852n3339D9469N4345j0502J94211i0128C02086b03707A12433
$$ 6205 11561 -146852 -200191 49469 103814 93312 287523 -90128 302086 -203707 112433
10295a15078m16165i8053C94227a82970A38776o6750b23153A5754K39425c9299
$$ -115078 -531243 -98053 394227 -182970 138776 72026 -223153 15754 255179 -39299
10284b4753j55325A16710b75699q517j13002d5799k4834r1684d583k68785e9245
$$ -24753 -180078 116710 -275699 -284216 -397218 -45799 -70633 -162317 -4583 -273368 -59245
10272a15763C03888c99707J1469A8220K40673j06302F4400e7757q581A56519b48795
$$ -115763 303888 -399707 -388238 18220 258893 152591 64400 -57757 -66338 156519 -248795
10260a23667i904n8546a2514j59153d6040C00313j30141c6161C96018m9848I9321
$$ -123667 -9904 -68450 -12514 -171667 -46040 300313 170172 -36161 396018 346170 99321
10248G5465J63874r765q8963i2234B52595a36356N2941F0736J05321a83167Q1924
$$ 75465 239339 229574 140611 -92234 252595 -136356 -83415 60736 166057 -183167 -101243
10237a01243p5816e1851B33727L4330A7673e78538A33592F6111h9489B7377h1635
$$ -101243 -177059 -51851 233727 268057 17673 -578538 133592 66111 -89489 27377 -81635
10225a18854A864J7911d9433k89086Q9096J08464f9934r4142j78263A43030a82572
$$ -118854 1864 19775 -49433 -338519 -249423 -140959 -69934 -164076 -342339 143030 -182572
10213C1608J18712b52086J318N6863A4154M8857f4071F8435a57176a8689B7638
$$ 31608 150320 -252086 -250768 -193905 14154 63011 -64071 68435 -157176 -18689 27638
10201b1814F4791b86181C02484h1495q9790o1118O215M0987j79349B8917J78801
$$ -21814 64791 -286181 302484 -81495 -171285 -232403 -226188 -185201 -364550 28917 207718
10190B07718I1650c902k41346j14708a36255M1325A08394b4738q9803G1821b14754
$$ 207718 91650 -3902 -245248 -359956 -136255 -94930 108394 -24738 -114541 71821 -214754
10178c01734o8515B34964a08117J1600o278E3583B0716a17150C3824e3166A920
$$ -301734 -370249 234964 -108117 -96517 -102795 53583 20716 -117150 33824 -53166 1920
10166b14034P0324f9720j10043j40018i3122H8900a02484d2404l12096A65536
$$ -214034 -143710 -69720 -179763 -319781 -93122 88900 -102484 -42404 -354500 165536
10155b32778D7119J22239n0152M8938E2531a63266a841n3302b4236A26400b22432
$$ -232778 47119 169358 119206 168144 52531 -163266 -1841 -55143 -24236 126400 -222432
10143E8589K596e485B26879G0260b02624B28814b55540K8055K5512N6135p6569
$$ 58589 61185 -5485 226879 70260 -202624 228814 -255540 -227485 -201973 -145838 -222407
10132b22407A41942a6523o4381j21152a1699r7848A0234e7615j20247E901b78
$$ -222407 141942 -16523 -80904 -202056 -11699 -109547 10234 -57615 -177862 5901 -278
10120a18777k27341a00642A97531m0329c928p0708B41777c17938A6133b48203
$$ -118777 -346118 -100642 197531 157202 -3928 -74636 241777 -317938 16133 -248203
10109b09976C03332a82449N9142l943A29356a89577A6993d3926k12699a23136
$$ -209976 303332 -182449 -123307 -127250 129356 -189577 16993 -43926 -256625 -123136
10098A89501b05831g1474D522i5192L9832l10651A96007J14379i1723D108h1312
$$ 189501 -205831 -71474 4522 -95192 -55360 -366011 196007 310386 -91723 4108 -81312
10086E1397a86820C5202J39978g1817C42748h0147A39879i1857p7349B66144B3294
$$ 51397 -186820 35202 175180 -71817 342748 -80147 139879 -91857 -169206 266144 23294
10074a82278k4409K4323M5387C3672J39071a65050c920k72509a26045A05032a13471
$$ -182278 -206687 -182364 -136977 33672 172743 -165050 -3920 -276429 -126045 105032 -113471
10062a52601A8720a97008f8802k62672C35218a28559r4067F0602J26460A1373
$$ -152601 18720 -197008 -68802 -331474 335218 -128559 -222626 60602 187062 11373
10051A73633d5628k79679C4219J42995a68697h0026j72907n242A20438E7452a10830
$$ 173633 -45628 -325307 34219 177214 -168697 -80026 -252933 -258175 120438 57452 -110830
10039b16908Q4713j73289d7940J6808m6549j18449A73997a20732L2863r9622N153
$$ -216908 -132195 -305484 -47940 -31132 -77681 -196130 173997 -120732 -87869 -187491 -182338
10028a82338J3803C62049c29578A39499d49411b4566j85928J4671H001b99683
$$ -182338 -168535 362049 -329578 139499 -449411 -24566 -210494 -195823 8001 -299683
10017a51561A04839m0858e3434l0595o5455A92303b63060g4088A9944b08335B74073
$$ -151561 104839 63981 -53434 -84029 -149484 192303 -263060 -74088 19944 -208335 274073
10005b09351A32776o63B8251a4746j01997j61786j45101g1871j30032i6600j60913
$$ -209351 132776 132113 28251 -14746 -116743 -278529 -423630 -71871 -201903 -96600 -257513
9994b57513j28565a33036G8620D779a45785d5695a9148E7514K73839e430q8258
$$ -257513 -386078 -133036 78620 4779 -145785 -45695 -19148 57514 331353 -5430 -93688
9983i3688r3863A65097b22193L9729a5278G6390O2886b1855k22776P0100P7475
$$ -93688 -187551 165097 -222193 -182464 -15278 76390 139276 -21855 -244631 -174531 -97056
9972i7056o3869F5393d00304g3146B42055F8823f0194G025a23250B5210a30772
$$ -97056 -160925 65393 -400304 -73146 242055 68823 -60194 7025 -123250 25210 -130772
9960d4537B38908a3422j38670n3347a1023j98277Q903I9834R327b63779l0173
$$ -44537 238908 -13422 -152092 -205439 -11023 -209300 -200397 99834 109161 -263779 -293952
9949b93952B151K2988a8725r9715B35926r0216j7356c7842B20074h9665d3330
$$ -293952 2151 25139 -18725 -118440 235926 145710 128354 -37842 220074 -89665 -43330
9937d40368e2358B39050m6240p8962a44453J3138p5450i010p0438j90289A41516
$$ -440368 -52358 239050 192810 113848 -144453 -131315 -206765 -9010 -79448 -269737 141516
9925E7776a41963q0360J05424L5247p620k11145h6836L0771r6728e1265A2051
$$ 57776 -141963 -222323 -116899 -81652 -89272 -300417 -86836 -56065 -152793 -51265 12051
9913B5088O5355a84631o1437J4942F9950b78053A55576f0243l3052B24943D0436
$$ 25088 90443 -184631 -246068 -231126 69950 -278053 155576 -60243 -93295 224943 40436
9901c32273c2147B3927b19223i9340I3930f6319A06191i1201q9608m4030N0239
$$ -332273 -32147 23927 -219223 -99340 93930 -66319 106191 -91201 -180809 -224839 -174600
9890a74600A69674A8509a75468M2974k14837B268h1225E0147c21714n040A79798
$$ -174600 169674 18509 -175468 -132494 -347331 2268 -81225 50147 -321714 -326754 179798
9878B11053F7115c50070B06213B0844f5296B3424n957g619A83048J64183j1367
$$ 211053 67115 -350070 206213 20844 -65296 23424 17467 -7619 183048 347231 335864
9867C35864A1884b03694A62374b12661B0365h3733A60937p1328i3760A05925R1562
$$ 335864 11884 -203694 162374 -212661 20365 -83733 160937 89609 -93760 105925 197487
9856A97487E7845h902F7327K5629b6831j28251P2569j15478r4852J13523Q5772
$$ 197487 57845 -8902 67327 92956 -26831 -155082 -82513 -197991 -292843 -179320 -93548
9845i3548k38246A58328a29927N0020j69134c431H1180d20709J84965j96317E9380
$$ -93548 -331794 158328 -129927 -79907 -249041 -3431 81180 -420709 -235744 -432061 59380
9833a50023j04314d1248A6633N2524C532h1977D3861a79598p3072f309C5673f7270
$$ -150023 -254337 -41248 16633 69157 3532 -81977 43861 -179598 -252670 -6309 35673 -67270
9820B15024j7635g7451j65645J05330M6704n3851C42965A69529h1964j86079b3274
$$ 215024 197389 -77451 -243096 -137766 -91062 -144913 342965 169529 -81964 -268043 -23274
9808C3257i7193N219O764A51680a00816K2005j12497h9359k0408L1843Q395n9010
$$ 33257 -97193 -91974 -85210 151680 -100816 -78811 -191308 -89359 -109767 -77924 -69529 -128539
9796a28539J4313j07889H1482b7634p2961n0606A38819J28851a57255j17830a17597
$$ -128539 -114226 -222115 81482 -27634 -100595 -151201 138819 267670 -157255 -275085 -117597
9784b5836A5168b10783j58515a9899k74550g5060m02642f3042j33314B49409d6126
$$ -25836 15168 -210783 -369298 -19899 -294449 -75060 -477702 -63042 -196356 249409 -46126
9772D5425d4218l51535D0237b8770I4510a82065G0616K70634a95449h8774n9086
$$ 45425 -44218 -395753 40237 -28770 94510 -182065 70616 341250 -195449 -88774 -147860
9761a47860j41797B55171a72230c0331j04337B82345h5514a9506n8396c6113k2252
$$ -147860 -289657 255171 -172230 -30331 -134668 282345 -85514 -19506 -77902 -36113 -58365
9750e8365j05329D0191P1279a30648d0214F4899k2636M0013d03214J70529A40525
$$ -58365 -163694 40191 111470 -130648 -40214 64899 42263 82276 -403214 -232685 140525
9738a19767j10267j02870C4786J2972b07928G5988K32257e20863c4037l27608
$$ -119767 -230034 -332904 34786 47758 -207928 75988 308245 -520863 -34037 -361645
9728c61645a03970B0403a63217I6459L70240e9936j12662j29383A17438g2393
$$ -361645 -103970 20403 -163217 96459 466699 -59936 -172598 -301981 117438 -72393
9717C1223J27462i8109j80779j03674C5609N6131b70587a22781A68916A8057J02197
$$ 31223 158685 -98109 -278888 -382562 35609 91740 -270587 -122781 168916 18057 120254
9706A20254E7249c26586a14310A002J6235b78296F3066i7808j3088j11000q554
$$ 120254 57249 -326586 -114310 1002 17237 -278296 63066 -97808 -110896 -221896 -230450
9695b30450m6855b4338B96486a3456l70300B204d2126k3870B75736b20998F5747
$$ -230450 -277305 -24338 296486 -13456 -383756 2204 -42126 -65996 275736 -220998 65747
9683C0622a45806a8186G4368c4895B88516c31696g8399m3374p5222A91507a3315
$$ 30622 -145806 -18186 74368 -34895 288516 -331696 -78399 -121773 -196995 191507 -13315
9671a87265Q9348B5657b93599C24543r6985b10002J1820L0832Q438k29738a6359
$$ -187265 -97917 25657 -293599 324543 227558 -210002 -198182 -167350 -158912 -388650 -16359
9659H234a1905j1049j57339a0793j3205l13320a10854I0880J47421d40904J61567
$$ 8234 -11905 -22954 -180293 -10793 -23998 -337318 -110854 90880 238301 -440904 -279337
9648b79337F8561c23343B3548K87010a38981O5764a7180e701o357j22333k87677
$$ -279337 68561 -323343 23548 310558 -138981 -73217 -17180 -5701 -12058 -134391 -422068
9637d22068a60224p7073O4986m0122a6177G2335a58572O5208C8043J29038k8508
$$ -422068 -160224 -237297 -172311 -212433 -16177 72335 -158572 -93364 38043 167081 138573
9626A38573c53961J06367P5865B2609e12162B05835c9823j68081J7591k86021
$$ 138573 -353961 -247594 -171729 22609 -512162 205835 -39823 -207904 -190313 -476334
9616d76334a3008m46197Q2376A63016b92937a29937J4348J5286p892k79258E7839
$$ -476334 -13008 -459205 -376829 163016 -292937 -129937 -115589 -100303 -108195 -387453 57839
9604b15637B75052g2270B88144a23903j25032d1013k87770B70095b73543A3824
$$ -215637 275052 -72270 288144 -123903 -248935 -41013 -328783 270095 -273543 13824
9593A05211R2244b32235O1027n60B5942J58436C4079c92034g2753b2649J989j15136
$$ 105211 197455 -232235 -171208 -171768 25942 184378 34079 -392034 -72753 -22649 -20660 -135796
9581a35796A56248F0910Q3046d59232b28312n1514f4506m5873a3074j54192J6537
$$ -135796 156248 60910 143956 -459232 -228312 -279826 -64506 -110379 -13074 -167266 -150729
9570a50729O1285I6962c54715A59370c01009E9423i2259p1915N4131E2377B2228
$$ -150729 -89444 96962 -354715 159370 -301009 59423 -92259 -164174 -110043 52377 22228
9558B7150J34850a90957B0207d3231f063k14152K2485f231r050A28561e2760l09107
$$ 27150 162000 -190957 20207 -43231 -6063 -220215 -197730 -6231 -15281 128561 -52760 -361867
9546c61867B37590b76243e3079j42786f3430l68673G6136i6684j48971a3256k37067
$$ -361867 237590 -276243 -53079 -195865 -63430 -432103 76136 -96684 -245655 -13256 -250323
9535b50323F8849d86005A73372p2489a49663L5837q2852h2974B68170F6125c20305
$$ -250323 68849 -486005 173372 100883 -149663 -113826 -196678 -82974 268170 66125 -320305
9523H2802A0830a85476O1516A80229a03329j24599A5021a69285N4651N0098j69602
$$ 82802 10830 -185476 -123960 180229 -103329 -227928 15021 -169285 -114634 -64536 -234138
9512b34138n1004k8378A28205j224c19484d2461A51721e7357c756k9199k00917
$$ -234138 -285142 -313520 128205 126981 -319484 -42461 151721 -57357 -3756 -32955 -233872
9501b33872A56787D8101b9400q6203j06846A43306b72131c9474j49854M9238c374
$$ -233872 156787 48101 -29400 -115603 -222449 143306 -272131 -39474 -189328 -140090 -3374
9489i6022E9008K04362a42878e6064j81804a06611a8989j00683D9549B4730a56524
$$ -96022 59008 263370 -142878 -56064 -237868 -106611 -18989 -119672 49549 24730 -156524
9477h4763j38278E5503a31288f0622K8863G0476c51539J38636C25187D1114b58019
$$ -84763 -223041 55503 -131288 -60622 -31759 70476 -351539 -212903 325187 41114 -258019
9465I4303k4023a61299P0117I5025j8536A8369c12955N4960B7615g981r4798j87695
$$ 94303 70280 -161299 -91182 95025 76489 18369 -312955 -257995 27615 -7981 -102779 -290474
9453b90474B0438i3121a5476j62173O1093I0012b40353M8548k9001b3582j8565
$$ -290474 20438 -93121 -15476 -177649 -116556 90012 -240353 -191805 -220806 -23582 -42147
9442d2147j6843A06401f0247C295K00033J29349i9339A25360J94733c1669E7046
$$ -42147 -58990 106401 -60247 3295 203328 332677 -99339 125360 320093 -31669 57046
9430a39859m64391b65093j5901B44014B5671f9634l50124B39372C1453b37602
$$ -139859 -604250 -265093 -280994 244014 25671 -69634 -419758 239372 31453 -237602
9419a29431B82807H8924d6511A16375n867A4581a07114c8976D25965a21130j55949
$$ -129431 282807 88924 -46511 116375 110508 14581 -107114 -38976 425965 -121130 -277079
9408b77079A8303J02636J61392c31669P019Q1696k16394J88719a08762k4226E34828
$$ -277079 18303 120939 282331 -331669 -324650 -242954 -459348 -270629 -108762 -132988 534828
9396A0312f8112A11613c07433H4676K05655h6690k02743A42503L3588d60664a08505
$$ 10312 -68112 111613 -307433 84676 290331 -86690 -289433 142503 176091 -460664 -108505
9384B9653m898R3768J0097b3650j04174A21238c70208b3491j0685k60387a34437
$$ 29653 24755 118523 128620 -23650 -127824 121238 -370208 -23491 -34176 -294563 -134437
9372a97322A68618H2863a61141O7997a0632m59302D1035b70327O0712F6928L1906
$$ -197322 168618 82863 -161141 -93144 -10632 -469934 41035 -270327 -209615 66928 98834
9361I8834c89087d5753m0370j62715k5925D0420J3733h2382o3786J8475j48597
$$ 98834 -389087 -45753 -86123 -248838 -274763 40420 54153 -82382 -146168 -127693 -276290
9350b76290g2498G771a87037A41137d9948K1171F0394A2049O3621c64610D0040
$$ -276290 -72498 7771 -187037 141137 -49948 -28777 60394 12049 75670 -364610 40040
9338a33368l6009I3264D4907a00249G7089J92813i5628k81432D7046a82587L2751
$$ -133368 -169377 93264 44907 -100249 77089 269902 -95628 -377060 47046 -182587 -149836
9327a49836A36391j6610i1396B51942a35521B07456b23027A63026p4771c3045
$$ -149836 136391 119781 -91396 251942 -135521 207456 -223027 163026 88255 -33045
9316h0256a6696j45170c0033k10404A39684E2741k2621q016c58328J08663B13466
$$ -80256 -16696 -161866 -30033 -240437 139684 52741 30120 22104 -358328 -249665 213466
9304c98429a6843B37060m0422g3674a2086j92931h596k82544A11661c394I1185
$$ -398429 -16843 237060 196638 -73674 -12086 -205017 -8596 -291140 111661 -3394 91185
9292b18153g2804c4086n3947o3530P2833n0363B00564a92966e8066B5119b95763
$$ -218153 -72804 -34086 -88033 -151563 -78730 -129093 200564 -192966 -58066 25119 -295763
9280A4405i1708h556j57962a1955j57652j7348A969J22750J59746a11055r1093
$$ 14405 -91708 -8556 -166518 -11955 -169607 -186955 1969 124719 284465 -111055 -202148
9269b02148A28217l9457J02958K3858A1389g3005L2097l15913C24303d28833b6440
$$ -202148 128217 88760 191718 215576 11389 -73005 -40908 -356821 324303 -428833 -26440
9257B909a25376j50126a11474j90493J14301q5859E211K5842b13926e5489j03591
$$ 2909 -125376 -275502 -111474 -301967 -187666 -273525 5211 31053 -213926 -55489 -159080
9246a59080e0531D4964Q6318b36439c3151o7417j79450B98722h9525A6209g2133
$$ -159080 -50531 44964 131282 -236439 -33151 -100568 -280018 298722 -89525 16209 -72133
9234e5053o459B21474r6807a8230k29966R9744j37980D4600A619a43096B24640
$$ -55053 -61512 221474 124667 -18230 -248196 -148452 -286432 44600 1619 -143096 224640
9222C2843c57356A80042q5377a11191a1793k13789P7698l68212g9923A89911b49474
$$ 32843 -357356 180042 94665 -111191 -11793 -225582 -147884 -516096 -79923 189911 -249474
9210c68050O7392i6823j48662B07650a62126b7184H6890J3611c32292a8539j27172
$$ -368050 -300658 -96823 -245485 207650 -162126 -27184 86890 100501 -332292 -18539 -145711
9199a45711k9134f5427A24172a82194H7546b04648A02150Q9668g4575m4453p5443
$$ -145711 -174845 -65427 124172 -182194 87546 -204648 102150 191818 -74575 -119028 -194471
9188a94471h3774K0013m9400l7807A63742d78116K18455k7466J30746j2257m3229
$$ -194471 -83774 -63761 -113161 -150968 163742 -478116 -259661 -287127 -156381 -168638 -211867
9177b11867C15363A34786N3840e4779O249J5769j51467M9283a3937j3579A88322
$$ -211867 315363 134786 188626 -54779 -48530 -32761 -184228 -134945 -13937 -27516 188322
9165B4991K36798a05661E1170O5351O6598i4087j42622M4319A56214a50830C96931
$$ 24991 261789 -105661 51170 116521 183119 -94087 -236709 -192390 156214 -150830 396931
9153F3365a35346C23201j26377l8314g9750C18555a58505O0869k16864g7044c8388
$$ 63365 -135346 323201 196824 158510 -79750 318555 -158505 -97636 -314500 -77044 -38388
9141C1437b6193j00834j55380d258l00777f1732m547p8366A57646C6267M616i6982
$$ 31437 -26193 -127027 -282407 -4258 -305035 -61732 -66279 -144645 157646 36267 40883 -96982
9128C1940a38452b5737j22514A73122p8367a59422p2987M5371k16026A34376a01989
$$ 31940 -138452 -25737 -148251 173122 94755 -159422 -232409 -187038 -403064 134376 -101989
9116b49782m4502J34452p4623A85278a35064k3380k4584A24529g5171D6652L86090
$$ -249782 -294284 -159832 -234455 185278 -135064 -158444 -183028 124529 -75171 46652 432742
9105D32742I2976a50510g0374K4317A93047d5181D1433d57014C23847A09705i4843
$$ 432742 92976 -150510 -70374 -46057 193047 -45181 41433 -457014 323847 109705 -94843
9093A54638k2500Q2434c80072J7204a70205B0783P4047A1694d49794A01320a9533
$$ 154638 132138 214572 -380072 -362868 -170205 20783 94830 11694 -449794 101320 -19533
9081F9359a02868a9284j80527e0346D7809a69559j7219A55143i6756j29885h0191
$$ 69359 -102868 -19284 -199811 -50346 47809 -169559 -186778 155143 -96756 -226641 -80191
9069c38840J4599A2020c6968n5422o5890B1640a3537j72523d2409m7483j11866
$$ -338840 -324241 12020 -36968 -92390 -158280 21640 -13537 -186060 -42409 -89892 -201758
9058b01758A28285b03239M1145B18699i5717a8389r1184b9828j59168A2164b15034
$$ -201758 128285 -203239 -162094 218699 -95717 -18389 -109573 -29828 -188996 12164 -215034
9046b5319k1614F140O4143a8739j10788j87604a40191A79507a84293M724j9213
$$ -25319 -46933 6140 70283 -18739 -129527 -317131 -140191 179507 -184293 -179569 -198782
9035a98782j49717f6324A29471b69951P5886e8518m4525r8017j126H3125b2382
$$ -198782 -348499 -66324 129471 -269951 -194065 -58518 -103043 -201060 -202186 83125 -22382
9023b40993J20173d7684A76185G585h3907n52972H6615O7076a35819K3967B7880
$$ -240993 -120820 -47684 176185 7585 -83907 -636879 86615 153691 -135819 -111852 27880
9011c13760B62134a06641n0613b012B12824q0384B0289L8595b29970I2295a89
$$ -313760 262134 -106641 -157254 -2012 212824 132440 20289 58884 -229970 92295 -189
8999I2067D3111a85732A28618Q014n7617h71l3380J4776m94709A17760B7933a31319
$$ 92067 43111 -185732 128618 136632 79015 -871 -34251 -19475 -514184 117760 27933 -131319
8986a32210K2461A08389b64758m2580f9946B24129b59558A5766c0049k07497a7213
$$ -132210 -109749 108389 -264758 -307338 -69946 224129 -259558 15766 -30049 -237546 -17213
8974a31418l6212d9158A2922a89824j59227g1373A95970a93775o0054c7626C3001
$$ -131418 -167630 -49158 12922 -189824 -349051 -71373 195970 -193775 -253829 -37626 33001
8962H6758R2847E9932a4915j47799O7859j00074h3479d296H0538a45461D5885
$$ 86758 179605 59932 -14915 -162714 -94855 -194929 -83479 -4296 80538 -145461 45885
8950i2047c0520p8504n8536c0108j12723k2737B39573e3523j11856M2966G6248
$$ -92047 -30520 -109024 -167560 -30108 -142831 -165568 239573 -53523 -165379 -122413 76248
8938a28722A5928R2923K33329F8055a78655G2871K78623a0057k00523B77658a84801
$$ -128722 15928 108851 342180 68055 -178655 72871 351494 -10057 -210580 277658 -184801
8926E2385G84K82924J7677O9174L42201J157217L305524Q930146E532952A718008
$$ 52385 784 283708 301385 370559 712760 1869977 5175501 14105647 5532952 1718008
8915F93904B95292G1079K66846d3170k63512J09879A68080M24266B03562L2287
$$ 693904 295292 71079 337925 -43170 -306682 -196803 168080 592346 203562 235849
8905B35849I8689h8153A84442F8440g6274G7609l36a46024F8388Q7635h7307o2765
$$ 235849 98689 -88153 184442 68440 -76274 77609 77273 -146024 68388 156023 -87307 -150072
8893a50072p3866j80271b8497l0478a4864E4036a85309g1172j22293j93264G6159
$$ -150072 -223938 -404209 -28497 -58975 -14864 54036 -185309 -71172 -193465 -386729 76159
8881D13030A47858a17526A01811h5659A80262e8586j07438g3135o2362a9631j58180
$$ 413030 147858 -117526 101811 -85659 180262 -58586 -166024 -73135 -135497 -19631 -177811
8870a77811c6814c574A50923b81210f8652l8736j17882A18736C1490Q13a3392
$$ -177811 -36814 -3574 150923 -281210 -68652 -107388 -225270 118736 31490 32303 -13392
$$ [...]
##END NTUPLES=NMR SPECTRUM
##END=
