
##TITLE=AC1247__6608933_3rmGbhHjgC
##JCAMPDX= 6.0         $$ Bruker NMR JCAMP-DX V2.0
##DATA TYPE= NMR SPECTRUM
##DATA CLASS= NTUPLES
##ORIGIN= BRUKER
##OWNER= Administrator
$$ 1.72 TOPSPIN		Version 2.1
$$ 2012-08-01 19:56:08.750 -0500  Administrator@TOPSPIN
$$ Compression mode = diff/dup
##.OBSERVE FREQUENCY= 400.02188249412
##.OBSERVE NUCLEUS= ^1H
##.ACQUISITION MODE= SIMULTANEOUS (DQD)
##.ACQUISITION SCHEME= undefined
##.AVERAGES= 64
##.DIGITISER RES= 22
##SPECTROMETER/DATA SYSTEM= spect
##.PULSE SEQUENCE= noesygpps1d.comp
##.SOLVENT NAME= COFFEE_meoh
##.SHIFT REFERENCE= INTERNAL, COFFEE_meoh, 1, 14.9624
##AUDIT TRAIL= $$ (NUMBER, WHEN, WHO, WHERE, PROCESS, VERSION, WHAT)
$$ ##TITLE= Audit trail, TOPSPIN		Version 2.1
$$ ##JCAMPDX= 5.01
$$ ##ORIGIN= Bruker BioSpin GmbH
$$ ##OWNER= Administrator
$$ $$ C:\Bruker\TOPSPIN/data/COFFEE/nmr/AC1247__6608933_3rmGbhHjgC/12/pdata/1/auditp.txt
$$ ##AUDIT TRAIL=  $$ (NUMBER, WHEN, WHO, WHERE, PROCESS, VERSION, WHAT)
(   1,<2012-08-01 19:56:03.484 -0500>,<Administrator>,<TOPSPIN>,<go>,<TOPSPIN 2.1>,
      <created by zg
	started at 2012-08-01 19:44:33.234 -0500,
	POWCHK enabled, PULCHK disabled,
       configuration hash MD5:
       6B 1B 68 BB D9 2E 58 E2 7F 35 AD 54 07 DF 0E 41
       data hash MD5: 64K
       AB 8A 66 57 7A D1 8B 64 6A 4B 3E 30 A1 D7 DC 8B>)
(   2,<2012-08-01 19:56:06.453 -0500>,<Administrator>,<TOPSPIN>,<proc1d>,<TOPSPIN 2.1>,
      <Start of raw data processing
       efp LB = 0.3 FT_mod = 6 PKNL = 1 PHC0 = 0 PHC1 = 0 SI = 128K 
       data hash MD5: 128K
       34 83 16 6C 9A 0D 25 B9 4E F5 F8 90 20 E7 1C 51>)
(   3,<2012-08-01 19:56:07.609 -0500>,<Administrator>,<TOPSPIN>,<proc1d>,<TOPSPIN 2.1>,
      <pk PHC0 = -0.03295898 PHC1 = 0 
       data hash MD5: 128K
       B4 30 A8 31 B4 BF BF C8 DE 75 70 42 26 5B 58 34>)
(   4,<2012-08-01 19:56:08.390 -0500>,<Administrator>,<TOPSPIN>,<proc1d>,<TOPSPIN 2.1>,
      <abs ABSG = 1 
       data hash MD5: 128K
       C1 82 A3 A7 E0 BA 40 0E C1 6F 0C FB 82 8B AD 1D>)
(   5,<2012-08-01 19:56:08.500 -0500>,<Administrator>,<TOPSPIN>,<proc1d>,<TOPSPIN 2.1>,
      <abs ABSG = 2 
       data hash MD5: 128K
       5F C2 91 30 27 6D 83 44 C2 B4 77 F1 28 F8 B4 07>)
(   6,<2012-08-01 19:56:08.562 -0500>,<Administrator>,<TOPSPIN>,<proc1d>,<TOPSPIN 2.1>,
      <abs ABSG = 3 
       data hash MD5: 128K
       27 A7 CA CE 40 F3 6E 21 86 34 AA EC 0F 69 53 97>)
(   7,<2012-08-01 19:56:08.609 -0500>,<Administrator>,<TOPSPIN>,<proc1d>,<TOPSPIN 2.1>,
      <abs ABSG = 4 
       data hash MD5: 128K
       CC FB 25 75 D6 F0 D3 0F F2 1E 69 A7 88 22 64 D2>)
(   8,<2012-08-01 19:56:08.671 -0500>,<Administrator>,<TOPSPIN>,<proc1d>,<TOPSPIN 2.1>,
      <abs ABSG = 5 
       data hash MD5: 128K
       B7 37 81 98 30 4F 7E 06 A8 32 41 FB BA 74 68 EF>)
$$ ##END=
$$ 
$$ $$ hash MD5
$$ $$ 55 78 70 4E F9 3A 83 E9 A8 E3 69 86 08 0C 22 2B
##$RELAX= 
##$RELAX= 
##$RELAX= 
##$RELAX= 
##$RELAX= 
##$RELAX= 
##$RELAX= 
##$RELAX= 
$$ Bruker specific parameters
$$ [...]
##$TP07= 0
##$TPNAME0= <>
##$TPNAME1= <>
##$TPNAME2= <>
##$TPNAME3= <>
##$TPNAME4= <>
##$TPNAME5= <>
##$TPNAME6= <>
##$TPNAME7= <>
##$TPOAL= (0..7)
0.5 0.5 0.5 0.5 0.5 0.5 0.5 0.5
##$TPOFFS= (0..7)
0 0 0 0 0 0 0 0
##$TUNHIN= 0
##$TUNHOUT= 0
##$TUNXOUT= 0
##$USERA1= <user>
##$USERA2= <user>
##$USERA3= <user>
##$USERA4= <user>
##$USERA5= <user>
##$V9= 5
##$VALIST= <valist>
##$VCLIST= <CCCCCCCCCCCCCCC>
##$VD= 0
##$VDLIST= <DDDDDDDDDDDDDDD>
##$VPLIST= <PPPPPPPPPPPPPPP>
##$VTLIST= <TTTTTTTTTTTTTTT>
##$WBST= 1024
##$WBSW= 4
##$XGAIN= (0..3)
0 0 0 0
##$XL= 0
##$YL= 0
##$YMAX_a= 16644743
##$YMIN_a= -10115513
##$ZGOPTNS= <>
##$ZL1= 120
##$ZL2= 120
##$ZL3= 120
##$ZL4= 120
##$ABSF1= 14.9624
##$ABSF2= -5.595781
##$ABSG= 5
##$ABSL= 3
##$ALPHA= 0
##$AQORDER= 0
##$ASSFAC= 0
##$ASSFACI= 0
##$ASSFACX= 0
##$ASSWID= 0
##$AUNMP= <proc_prof1d_extract.lims>
##$AXLEFT= 0
##$AXNAME= <>
##$AXNUC= <1H>
##$AXRIGHT= 0
##$AXTYPE= 0
##$AXUNIT= <>
##$AZFE= 0.1
##$AZFW= 0.1
##$BCFW= 0
##$BC_mod= 0
##$BYTORDP= 0
##$COROFFS= 0
##$CY= 15
##$DATMOD= 1
##$DC= 0
##$DFILT= <>
##$DTYPP= 0
##$F1P= 0
##$F2P= 0
##$FCOR= 0.5
##$FTSIZE= 131072
##$FT_mod= 6
##$GAMMA= 0
##$GB= 0
##$INTBC= 1
##$INTSCL= 1
##$ISEN= 128
##$LB= 0.3
##$LEV0= 0
##$LPBIN= 0
##$MAXI= 10000
##$MC2= 0
##$MEAN= 0
##$ME_mod= 0
##$MI= 0
##$NCOEF= 0
##$NC_proc= -2
##$NLEV= 6
##$NOISF1= 0
##$NOISF2= 0
##$NSP= 0
##$NTH_PI= 0
##$NZP= 0
##$OFFSET= 14.9624
##$PC= 1
##$PHC0= -0.03295898
##$PHC1= 0
##$PH_mod= 1
##$PKNL= yes
##$PPARMOD= 0
##$PPDIAG= 0
##$PPIPTYP= 0
##$PPMPNUM= 2147483647
##$PPRESOL= 1
##$PSCAL= 4
##$PSIGN= 0
##$PYNMP= <proc.py>
##$REVERSE= no
##$SF= 400.02000907794
##$SI= 131072
##$SIGF1= 0
##$SIGF2= 0
##$SINO= 400
##$SIOLD= 131072
##$SPECTYP= <>
##$SREGLST= <1H.CDCl3>
##$SSB= 0
##$STSI= 131072
##$STSR= 0
##$SW_p= 8223.68421052631
##$SYMM= 0
##$S_DEV= 0
##$TDeff= 65536
##$TDoff= 0
##$TI= <>
##$TILT= no
##$TM1= 0
##$TM2= 0
##$TOPLEV= 0
##$USERP1= <user>
##$USERP2= <user>
##$USERP3= <user>
##$USERP4= <user>
##$USERP5= <user>
##$WDW= 1
##$XDIM= 131072
##$YMAX_p= 416033168
##$YMIN_p= -13178
##$CURPLOT= <Network HP LaserJet P1505>
##$CURPRIN= <$Network HP LaserJet P1505>
##$DFORMAT= <normdp>
##$LAYOUT= <+/1D_H.xwp>
##$LFORMAT= <normlp>
##$PFORMAT= <normpl>
##$SURQMSG= 1
$$ End of Bruker specific parameters
$$ ---------------------------------
##NTUPLES= NMR SPECTRUM
##VAR_NAME=  FREQUENCY,     SPECTRUM/REAL,   SPECTRUM/IMAG
##SYMBOL=    X,             R,               I
##VAR_TYPE=  INDEPENDENT,   DEPENDENT,       DEPENDENT
##VAR_FORM=  AFFN,          ASDF,            ASDF
##VAR_DIM=   131072,        131072,          131072
##UNITS=     HZ,            ARBITRARY UNITS, ARBITRARY UNITS
##FACTOR=    0.0627417313425164, 1,          1
##FIRST=     8223.62146879497, -1902,        -62585
##LAST=      0,             364,             -63913
##MIN=       0,             -13178,          0
##MAX=       8223.62146879497, 416033168,    0
$$ Real data points
##PAGE= N=1
##DATA TABLE= (X++(R..R)), XYDATA
$$ [...]
60934B779341j81762j64396j49807j37664j26404j15246j04513r4032q3398p3667
60924A548452o6643o2440n9637n7513n6116n4559n1570m7609m4221m1384l7768
60913I68992l3429k9805k6997k3660j9777j6994j5753j4592j2863j1675j1374
60902G52073j0533q453o472n634n088l952k808k153j089J028L267M617N388O023
60888G26214O036N287M793N022M802L159R54o03j780l340m976o122p252q943j0514
60873G12737j1024j0824j0826j0913j0357r190q027p012n930m894m045l165k229
60860F14301j590j020M49K940N099N975O391P371Q417Q699Q905J0312J2749J5024
60846G04022J6727J8195J9237J9407J9136J9159J9074J7879J5674J3516J1740
$$ y = [2779341, 2597579, 2433183, 2283376, 2145712, 2019308, 1904062, 1799549, 1705517, 1622119, 1548452, 1481809, 1419369, 1359732, 1302219, 1246103, 1191544, 1139974, 1092365, 1048144, 1006760, 968992, 935563, 905758, 878761, 855101, 835324, 818330, 802577, 787985, 775122, 763447, 752073, 741540, 733087, 726615, 720981, 715893, 711941, 709133, 706980, 705891, 706919, 710186, 714803, 720191, 726214, 732250, 737537, 742330, 747352, 752154, 755313, 756267, 755664, 753884, 750544, 745568, 739446, 732194, 723251, 712737, 701713, 690889, 680063, 669150, 658793, 649603, 641576, 634564, 628634, 623740, 619695, 616530, 614301, 612711, 611691, 612140, 615080, 620179, 626154, 632545, 639916, 648333, 657032, 665937, 676249, 688998, 704022, 720749, 738944, 758181, 777588, 796724, 815883, 834957, 852836, 868510, 882026, 893766]
60835H93766R777P569N855M916M156L115K026J248Q43O40K05j047l024m657n221
60820I20167n459o483q051r125r667j0546j1825j2586j2536j2492j2925j3125
60808G95347j2340j0875r594q926q689q436p743o560n360m557l818k472n01J393
60794G06869K693L530M325N408O864Q332R205R513J0208J1868J3600J4046J3239
60781H19700J2386J2064J1640J0618R423Q519P762P047O803P253P807P743P188
60768I35953O779O736O701O375N876N417M965M346L550K732J889P72o48j830k143
60753I87470j665j153j186j706k342k697k354j281l30n96k087l690m693n472o362
60738I49856o898o731o403o418o383n891n466n693o015n502m310l333k806k301
$$ y = [893766, 903543, 911112, 916967, 921883, 926039, 929154, 931180, 932428, 933271, 933911, 934116, 933069, 930045, 925388, 920167, 914708, 908225, 900174, 891049, 881382, 870836, 859011, 846425, 833889, 821397, 808472, 795347, 783007, 772132, 762538, 753612, 744923, 736487, 728744, 722184, 716824, 712267, 708449, 705977, 705476, 706869, 709562, 713092, 717417, 722825, 729689, 738021, 747226, 756739, 766947, 778815, 792415, 806461, 819700, 832086, 844150, 855790, 866408, 875831, 884350, 892112, 899159, 905962, 913215, 921022, 928765, 935953, 942732, 949468, 956169, 962544, 968420, 973837, 978802, 983148, 986698, 989430, 991319, 992091, 991443, 989613, 987470, 985805, 984652, 983466, 981760, 979418, 976721, 974367, 973086, 972756, 972160, 970073, 966383, 961690, 956218, 949856, 942958, 936227, 929824, 923406, 917023, 911132, 905666, 899973, 893958, 888456, 884146, 880813, 878007, 875706]
60724H75706j799j750k129k403k337k106j812j557j745k556l413l716l696l771
60710H40916l570k649j702j866k939l517k855j536k78P60J304Q31n06j709k190
60695H18494k519l537n328p377r215j0624j1554j2062j2184j1907j1471j1368
60683G09348j1708j1930j1640j1186j0848j0036q180n908m346l521k520r64P61
60670F17322K451M154N334N280M377L857M151M575M699M817M910M402L290K472
60656F76091K422K564K361K101K116K199K344L146M851O653P614P694P440P162
60642G36758O873O551O091N501N320O216P941R393R994J0334J1080J2075J2982
60629H47109J3940J4948J5312J4478J2984J1717J0605Q869O355L827J757l78l279
$$ y = [875706, 873907, 872157, 870028, 867625, 865288, 863182, 861370, 859813, 858068, 855512, 852099, 848383, 844687, 840916, 837346, 834697, 832995, 831129, 828190, 824673, 821818, 820282, 820004, 820764, 822068, 822899, 822393, 820684, 818494, 815975, 812438, 807110, 799733, 790518, 779894, 768340, 756278, 744094, 732187, 720716, 709348, 697640, 685710, 674070, 662884, 652036, 642000, 633820, 627912, 623566, 620045, 617525, 616561, 617322, 619773, 623927, 629261, 634541, 638918, 642775, 646926, 651501, 656200, 661017, 665927, 670329, 673619, 676091, 678513, 681077, 683438, 685539, 687655, 689854, 692198, 695344, 700195, 706848, 714462, 722156, 729596, 736758, 743631, 750182, 756273, 761774, 767094, 773310, 781251, 790644, 800638, 810972, 822052, 834127, 847109, 861049, 875997, 891309, 905787, 918771, 930488, 941093, 949962, 956317, 960144, 961901, 961523, 958244]
60616I58244o596r105j0104j0261j0742j1716j2229j1585j0126q443o518m234
60604H46585k118p36K30J402K490K534J227q02k882m708n965o450o475o413n938
60589H11981m523k510p31O96K191L488L848L457L275L363K739J249J99M62J215
60574H30399J361J154J459K215K590K207J382M88l34r97j577k301l244m342n705
60559H24755p373q748r022q368p902q104q080o816m438j827L65J852K584L023
60545G61901M012N887Q107J0096J1923J3948J6402J9618K4045K9571L5344M0525
60533I81379M4706M7339M7439M4200L7540K7831J5799K836r223j9045k6123l0210
60521A164468l1208k9635k6438k2114j6724j0782n160q1M733Q826J1099J1451
$$ y = [958244, 951648, 942543, 932439, 922178, 911436, 899720, 887491, 875906, 865780, 857337, 850819, 846585, 844467, 843731, 843961, 845363, 847853, 850387, 851614, 850812, 847930, 843222, 837257, 830807, 824332, 817919, 811981, 807458, 804948, 804217, 804913, 807104, 810592, 814440, 817897, 821172, 824535, 827274, 828523, 828722, 829184, 830399, 831760, 832914, 834373, 836588, 839178, 841385, 842767, 843255, 842921, 841924, 840347, 838046, 834802, 830460, 824755, 817382, 808634, 799612, 791244, 783342, 775238, 767158, 760342, 755904, 754077, 754442, 756294, 758878, 761901, 765913, 771800, 779907, 790003, 801926, 815874, 832276, 851894, 875939, 905510, 940854, 981379, 1026085, 1073424, 1120863, 1165063, 1202603, 1230434, 1246233, 1249069, 1239846, 1220801, 1194678, 1164468, 1133260, 1103625, 1077187, 1055073, 1038349, 1027567, 1022407, 1022326, 1027059, 1035885, 1046984, 1058435]
60509A058435J1056J0629R798Q633Q386R764J1822J3569J5585J8929K3375K8047
60497A228028L3121L9702M8361N8683O9903Q1208R1873J01805J11578J21582J31760
60486B117604J42666J55995J73468J95949K24082K58516K98330L39638L76116
60477D282364M00027M02677L76344L18146K31902J25485P512j12475k22790l12035
60467E497157l73691m07508m17101m07609l84865l54243l19311k82396k46211
60458B304222k13534j85286j60483j38319j19144j03122q9347p6899o5808n6513
60448A095767m9083m3293l8760l4750l0565k6351k2840k0268j8223j6549j5608
60437G79477j5475j5643j5710j5578j4907j3227j0807q651p285o300n299m530
$$ y = [1058435, 1069491, 1080120, 1089918, 1098551, 1106937, 1116701, 1128523, 1142092, 1157677, 1176606, 1199981, 1228028, 1261149, 1300851, 1349212, 1407895, 1477798, 1559006, 1650879, 1752684, 1864262, 1985844, 2117604, 2260270, 2416265, 2589733, 2785682, 3009764, 3268280, 3566610, 3906248, 4282364, 4682391, 5085068, 5461412, 5779558, 6011460, 6136945, 6144457, 6031982, 5809192, 5497157, 5123466, 4715958, 4298857, 3891248, 3506383, 3152140, 2832829, 2550433, 2304222, 2090688, 1905402, 1744919, 1606600, 1487456, 1384334, 1294987, 1218088, 1152280, 1095767, 1046684, 1003391, 964631, 929881, 899316, 872965, 850125, 829857, 811634, 795085, 779477, 764002, 748359, 732649, 717071, 702164, 688937, 678130, 669479, 662194, 655894, 650595, 646065]
60425F46065m178l769k916k025j683j688j272j81R99J619J759K076K924L779L795
60410F45304K866J841J481J610J600J361J349J800K495L226M023M848N443N564
60396F84811N288N062N443O500P415P148N621L884K828K361K063J957K038J691
60382G44110M43j199k293k676k854l096l219l132k874k334j512q15n05j74N63
60367G18433J255J266R60J266K214K826K530J827J424J486J940K816L908M660
60353G48811M762M610M953O147P775Q914Q937Q196P752Q200R137R936J0501J0864
60339H59495J0650R612Q320P580P412P257O999P029P526Q407R833J2119J5152
60326I77391J8422K1565K4275K5840K5371K2558J7719J1245L536m607j2094j8176
$$ y = [646065, 641887, 638118, 635202, 633177, 631494, 629806, 628534, 628353, 629352, 630971, 632730, 634806, 637730, 641509, 645304, 648170, 650011, 651492, 653102, 654702, 656063, 657412, 659212, 661707, 664933, 668956, 673804, 679247, 684811, 690099, 695161, 700604, 707104, 714519, 721667, 727288, 731172, 734000, 736361, 738424, 740381, 742419, 744110, 744553, 743354, 741061, 738385, 735531, 732435, 729216, 726084, 723210, 720876, 719364, 718549, 718044, 717870, 718433, 719688, 720954, 721914, 723180, 725394, 728220, 730750, 732577, 734001, 735487, 737427, 740243, 744151, 748811, 753573, 758183, 763136, 769283, 777058, 785972, 794909, 803105, 810857, 819057, 828194, 838130, 848631, 859495, 870145, 879757, 888077, 895657, 903069, 910326, 917325, 924354, 931880, 940287, 950120, 962239, 977391, 995813, 1017378, 1041653, 1067493, 1092864, 1115422, 1133141, 1144386, 1147922, 1143315, 1131221, 1113045]
60314A113045k2651k5512k6757k6440k4751k2154j9527j7643j6239j4248j1345
60303H85778q577o934o018m827l293j995r42L48J790K756L058L105L158L172L175
60288H73754L126K678J738R42P79O77j22j159j285m33L20M09M24J011K048L202
60272H88109M435N752O982Q093R197J0257J1210J2222J3387J4459J5436J7014
60260A016553J9702K2926K5764K8244L1025L4120L7012L9836M3325M7688N2439
60249A398634N7404O2869O8821P4923Q1256Q8220R5647J02879J09639J15944J21212
60238B377448J24389J24997J23317J19554J13618J05616R5743Q3874P0124N5547
60228C394227M1290K7268J2732k121j6175k8762l9667m8005n2675n3992n3471
$$ y = [1113045, 1090394, 1064882, 1038125, 1011685, 986934, 964780, 945253, 927610, 911371, 897123, 885778, 877201, 870267, 864249, 859422, 856129, 854134, 853192, 853540, 855330, 858086, 861144, 864249, 867407, 870579, 873754, 876880, 879558, 881296, 882238, 883017, 883694, 883572, 882413, 881128, 880695, 881015, 881424, 881848, 882859, 884907, 888109, 892544, 898296, 905278, 913371, 922568, 932825, 944035, 956257, 969644, 984103, 999539, 1016553, 1036255, 1059181, 1084945, 1113189, 1144214, 1178334, 1215346, 1255182, 1298507, 1346195, 1398634, 1456038, 1518907, 1587728, 1662651, 1743907, 1832127, 1927774, 2030653, 2140292, 2256236, 2377448, 2501837, 2626834, 2750151, 2869705, 2983323, 3088939, 3184682, 3268556, 3338680, 3394227, 3435517, 3462785, 3475517, 3473396, 3457221, 3428459, 3388792, 3340787, 3288112, 3234120, 3180649]
60217C180649n1710m7883m1509l3339k4104j3670j972J0442K3248L6650N0375
60206C087177O3542P5971Q8489J01342J13245J22612J28784J31595J30718J26084
60196D169559J18166J07293R3441P7010N8937L9714J9210k126k2933m2244o0162
60185D555865p6658r0671j01004j07287j09596j07942j02674r4629q4338p1757
60175C609309n7149m1306k4688p216J0661K7801M3691N8813P3087Q5068R3399
60164C871470R8031R9256R6540Q9327P8248O4612M9289L2828J6053k27j5543k9226
60152D450658m0131m7489n1406n2040m9044m2381l2868k1184p214Q990K6384M4046
60140D186321O2399Q2322J03617J25335J47300J70329J95020K20979K47234K72932
$$ y = [3180649, 3128939, 3081056, 3039547, 3006208, 2982104, 2968434, 2966462, 2976904, 3000152, 3036802, 3087177, 3150719, 3226690, 3315179, 3416521, 3529766, 3652378, 3781162, 3912757, 4043475, 4169559, 4287725, 4395018, 4488459, 4565469, 4624406, 4664120, 4683330, 4681204, 4658271, 4616027, 4555865, 4479207, 4388536, 4287532, 4180245, 4070649, 3962707, 3860033, 3765404, 3681066, 3609309, 3552160, 3510854, 3486166, 3478950, 3489611, 3517412, 3561103, 3619916, 3693003, 3778071, 3871470, 3969501, 4068757, 4165297, 4254624, 4332872, 4397484, 4446773, 4479601, 4495654, 4495427, 4479884, 4450658, 4410527, 4363038, 4311632, 4259592, 4210548, 4168167, 4135299, 4114115, 4106901, 4115891, 4142275, 4186321, 4248720, 4331042, 4434659, 4559994, 4707294, 4877623, 5072643, 5293622, 5540856, 5813788]
60130E813788K97707L21530L43968L63543L78350L87345L90328L86708L75274
60121I058541L55686L29142K97035K59718K17223J70335J20253O7832J3773m1035
60111A0848503r5774j49596k00695k46413k84864l15726l38781l52641l55926
60102H508087l49093l34137l12913k86535k55998k22429j86760j49685j11914
60093F298623p4258l7715l458K7817N6526Q3281J07188J25998J38135J43492J41970
60082G007599J32636J15202R1299O3483L3779L732k5238n2413p7853j01229j21551
60071G069446j38681j53832j67659j79067j86842j91159j92405j89858j83149
60062E486794j73816j63673j52416j38595j22244j04760q6698o7564m7565k7707
$$ y = [5813788, 6111495, 6433025, 6776993, 7140536, 7518886, 7906231, 8296559, 8683267, 9058541, 9414227, 9743369, 10040404, 10300122, 10517345, 10687680, 10807933, 10875765, 10889538, 10848503, 10752729, 10603133, 10402438, 10156025, 9871161, 9555435, 9216654, 8864013, 8508087, 8158994, 7824857, 7511944, 7225409, 6969411, 6746982, 6560222, 6410537, 6298623, 6224365, 6186650, 6183192, 6211009, 6267535, 6350816, 6458004, 6584002, 6722137, 6865629, 7007599, 7140235, 7255437, 7346736, 7410219, 7443998, 7447730, 7422492, 7370079, 7292226, 7190997, 7069446, 6930765, 6776933, 6609274, 6430207, 6243365, 6052206, 5859801, 5669943, 5486794, 5312978, 5149305, 4996889, 4858294, 4736050, 4631290, 4544592, 4477028, 4429463, 4401756]
60052D401756q094J2171L3121N3414P2045Q9350J05777J20603J32375J39854J42315
60041E294687J39481J31448J18375J00373P8118N3217K7237O58k6565n3710p9372
60030E783947j02495j22525j38729j50303j57128j59659j58136j52533j43264
60021D499175j31274j17432j02329q6479p0265n3746l6917j9859k383J6005L5343
60010C929839N4914P4185R3429J12981J32444J51177J68729J84102J95367K00917
60000E298084K00498J94297J81878J63073J39280J12621Q4150N3903K2256r773
59990F440267m1215p1199r8655j22736j43114j59106j69258j72776j70680j64462
59980E127066j54345j40044j22473j03202q2796o1184l9208j8186J819K1697M1298
$$ y = [4401756, 4393662, 4405833, 4438954, 4492368, 4564413, 4653763, 4759540, 4880143, 5012518, 5152372, 5294687, 5434168, 5565616, 5683991, 5784364, 5862482, 5915699, 5942936, 5943594, 5917029, 5863319, 5783947, 5681452, 5558927, 5420198, 5269895, 5112767, 4953108, 4794972, 4642439, 4499175, 4367901, 4250469, 4148140, 4061661, 3991396, 3937650, 3900733, 3880874, 3878491, 3894496, 3929839, 3984753, 4058938, 4152367, 4265348, 4397792, 4548969, 4717698, 4901800, 5097167, 5298084, 5498582, 5692879, 5874757, 6037830, 6177110, 6289731, 6373881, 6427784, 6450040, 6440267, 6399052, 6327853, 6229198, 6106462, 5963348, 5804242, 5634984, 5462208, 5291528, 5127066, 4972721, 4832677, 4710204, 4607002, 4524206, 4463022, 4423814, 4405628, 4407447, 4429144, 4470442]
59969D470442N9320P5119Q9219J01811J12097J19411J23719J24788J21977J15233
59959E513136J05438R3472P9802O5021N0005L5398K1585R082j661j0489j6837
59948E943952j9257j6653r562Q91J4842L3310N6334Q2901J12438J44969J79936
59937F524101K16323K53868K92762L32140L70082M05052M35779M59675M72853
59928I762635M72008M55103M20352L66339K93761K05959J07596L967r8601j93693
59918A1795426k76894l45938l98811m33512m50225m51960m42121m22633l95047
59909H178285l61873l25653k87657k48433k08790j69458j30636r2531n5624k0002
59899F277628J4699M8224P9682J08914J36647J62608J84712K00833K10185K12066
$$ y = [4470442, 4529762, 4604881, 4694100, 4795911, 4908008, 5027419, 5151138, 5275926, 5397903, 5513136, 5618574, 5712046, 5791848, 5856869, 5906874, 5942272, 5963857, 5972939, 5971278, 5960789, 5943952, 5924695, 5908042, 5898480, 5899371, 5914213, 5947523, 6003857, 6086758, 6199196, 6344165, 6524101, 6740424, 6994292, 7287054, 7619194, 7989276, 8394328, 8830107, 9289782, 9762635, 10234643, 10689746, 11110098, 11476437, 11770198, 11976157, 12083753, 12087720, 11989119, 11795426, 11518532, 11172594, 10773783, 10340271, 9890046, 9438086, 8995965, 8573332, 8178285, 7816412, 7490759, 7203102, 6954669, 6745879, 6576421, 6445785, 6353254, 6297630, 6277628, 6292327, 6340551, 6420233, 6529147, 6665794, 6828402, 7013114, 7213947, 7424132, 7636198]
59889G636198K04587J85894J55890J15741O6605J0223m9873j09144j64017k12425
59879G839679k52905k84137l05379l16713l18919l13496l02286k86546k66748
59870E192550k43669k19101j94877j71683j49519j28861j10630r5289q2750p3061
59860C723110o6565o3220o2227o2369o2589o2248o0962n8247n3516m6712l8710
59849C085745l0606k2653j4489o413J51L693L611R9o282j4643k3821l2701m0402
59836B901289m6231m9868n1484n1287m9085m4858l9382l3652k7847k1537j4634
59825B471424p359M24Q925J7684K6021L3922M1375M7306N0676N2541N5385O0121
59813B858445O5309O9493P2562P4158P2584O6466N6410M4055L0568J7027N078
$$ y = [7636198, 7840785, 8026679, 8182569, 8298310, 8364915, 8375138, 8325265, 8216121, 8052104, 7839679, 7586774, 7302637, 6997258, 6680545, 6361626, 6048130, 5745844, 5459298, 5192550, 4948881, 4729780, 4534903, 4363220, 4213701, 4084840, 3974210, 3878921, 3796171, 3723110, 3656545, 3593325, 3531098, 3468729, 3406140, 3343892, 3282930, 3224683, 3171167, 3124455, 3085745, 3055139, 3032486, 3017997, 3011584, 3011735, 3015428, 3019039, 3019138, 3012856, 2998213, 2974392, 2941691, 2901289, 2855058, 2805190, 2753706, 2702419, 2653334, 2608476, 2569094, 2535442, 2507595, 2486058, 2471424, 2464065, 2464489, 2473414, 2491098, 2517119, 2551041, 2592416, 2639722, 2690398, 2742939, 2798324, 2858445, 2923754, 2993247, 3065809, 3139967, 3212551, 3279017, 3335427, 3379482, 3410050, 3427077, 3432155]
59802C432155m059j0497j4727j6398j4955j0729m479L538J3227K4096L5933M9317
59790C482422O4681Q1440R8965J17824J39163J63470J90861K21959K57257K95888
59780E113930L35912L75319M11241M37800M45771M25339L70135K80395J64237
59771H360079L6237q6929j91798k71200l23751l51386l57352l45680l21368k89874
59761E856978k55663k21183j87464j55336j25554r8134p2651m9274k8634j0535
59751D652550O330K3017L9521N5536P1241Q6864J02381J18109J34822J52766J71262
59740E614399J89911K09529K31204K55035K80490L07546L36813L68771M03328
59731H197026M39926M77751N16064N54332N91492O25075O51669O68505O73867
$$ y = [3432155, 3428096, 3417599, 3402872, 3386474, 3371519, 3360790, 3356311, 3359849, 3373076, 3397172, 3433105, 3482422, 3547103, 3628543, 3727508, 3845332, 3984495, 4147965, 4338826, 4560785, 4818042, 5113930, 5449842, 5825161, 6236402, 6674202, 7119973, 7545312, 7915447, 8195842, 8360079, 8396316, 8309387, 8117589, 7846389, 7522638, 7171252, 6813900, 6468220, 6146852, 5856978, 5601315, 5380132, 5192668, 5037332, 4911778, 4813644, 4740993, 4691719, 4663085, 4652550, 4658880, 4681897, 4721418, 4776954, 4848195, 4935059, 5037440, 5155549, 5290371, 5443137, 5614399, 5804310, 6013839, 6245043, 6500078, 6780568, 7088114, 7424927, 7793698, 8197026, 8636952, 9114703, 9630767, 10185099, 10776591, 11401666, 12053335, 12721840, 13395707]
59722A3395707O66169O44050O08247N62614N12642M63601M20384L87773L69391
59713A8030578L66512L78560M04296M41713M87106N35162N80147O16876O40884
59704B2481834O48301O35686O00213N40704M58826L59097K47663J31493J8180
59695B6121997q4929j72329k40717k87879l12200l13611k93962k55844k01655
59686B3958871j34027n5991L0138J23343K22802L26867M33744N42408O52080P61097
59676B6861332Q66402R63153J044083J099882J120794J097666J022092Q87843
59668C4963247O94198M48298J64259j39161m40523p18202r54123j136579j260282
59659C1621132j325279j336418j302401j233567j140440j034487r29044q38181
$$ y = [13395707, 14061876, 14705926, 15314173, 15876787, 16389429, 16853030, 17273414, 17661187, 18030578, 18397090, 18775650, 19179946, 19621659, 20108765, 20643927, 21224074, 21840950, 22481834, 23130135, 23765821, 24366034, 24906738, 25365564, 25724661, 25972324, 26103817, 26121997, 26037068, 25864739, 25624022, 25336143, 25023943, 24710332, 24416370, 24160526, 23958871, 23824844, 23768853, 23798991, 23922334, 24145136, 24472003, 24905747, 25448155, 26100235, 26861332, 27727734, 28690887, 29734970, 30834852, 31955646, 33053312, 34075404, 34963247, 35657445, 36105743, 36270002, 36130841, 35690318, 34972116, 34017993, 32881414, 31621132, 30295853, 28959435, 27657034, 26423467, 25283027, 24248540, 23319496, 22481315]
59651B2481315p74358p46237p55916p96276q52009r05768r44824r63113r59486
59642A4783328r35955q96674q46367p88871p27317o64865o04144n46467m92382
59633H280286m42580l97478l56638l19521k86228k56672k29756k04435j80915
59624E606063j59811j40773j23030j06633r1960p8573o5859n4471m5838m0470
59614D698645l7849l7637l9970m4693n1379n9776o9338p8599q6120r1807r6316
59603D005161r9477j00345r8582r4798q9632q3392p6414o8987o1068n2708m4470
59592C135288l6693k8888k0707j2925o445q87M734J0352J5066J8665K1687K4176
59580C123423K5527K5568K4815K3721K2617K2134K2727K3989K5439K7778L2308
$$ y = [22481315, 21706957, 20960720, 20204804, 19408528, 18556519, 17650751, 16705927, 15742814, 14783328, 13847373, 12950699, 12104332, 11315461, 10588144, 9923279, 9319135, 8772668, 8280286, 7837706, 7440228, 7083590, 6764069, 6477841, 6221169, 5991413, 5786978, 5606063, 5446252, 5305479, 5182449, 5075816, 4983856, 4905283, 4839424, 4784953, 4739115, 4698645, 4660796, 4623159, 4583189, 4538496, 4487117, 4427341, 4358003, 4279404, 4193284, 4101477, 4005161, 3905684, 3805339, 3706757, 3611959, 3522327, 3438935, 3362521, 3293534, 3232466, 3179758, 3135288, 3098595, 3069707, 3049000, 3036075, 3029630, 3028743, 3033477, 3043829, 3058895, 3077560, 3099247, 3123423, 3148950, 3174518, 3199333, 3223054, 3245671, 3267805, 3290532, 3314521, 3339960, 3367738, 3400046]
59569C400046L9164M7084N4889O2364O9850P7866Q7063R7693J09219J21179J34117
59558D300534J48850J65152J82096J99368K17208K35288K52725K68972K83794
59549F253987K96502L06178L12443L15099L13396L06673K95446K80828K63303
59540H943855K43374K22904K04025J86330J66667J42502J14875Q7884O5949N1579
59530A0429944M4796M4238M9059N9585P5692R5185J14613J31150J42520J45644
59520A1332426J37043J14855P9594L2924k3166q6015j52309k18856k82586l40018
59510A0593892l87825m24228m49103m62818m65845m59373m45159m24574l98616
59501F676351l68862l37443l05937k74980k44935k16191j88873j63062j39230
$$ y = [3400046, 3439210, 3486294, 3541183, 3603547, 3673397, 3751263, 3838326, 3936019, 4045238, 4166417, 4300534, 4449384, 4614536, 4796632, 4996000, 5213208, 5448496, 5701221, 5970193, 6253987, 6550489, 6856667, 7169110, 7484209, 7797605, 8104278, 8399724, 8680552, 8943855, 9187229, 9410133, 9614158, 9800488, 9967155, 10109657, 10224532, 10312416, 10378365, 10429944, 10474740, 10518978, 10568037, 10627622, 10703314, 10798499, 10913112, 11044262, 11186782, 11332426, 11469469, 11584324, 11663918, 11696842, 11673676, 11587661, 11435352, 11216496, 10933910, 10593892, 10206067, 9781839, 9332736, 8869918, 8404073, 7944700, 7499541, 7074967, 6676351, 6307489, 5970046, 5664109, 5389129, 5144194, 4928003, 4739130, 4576068, 4436838]
59492D436838j17745r8176p9832o2626m6579l0908j4756J528J6995L1784M6951
59481D083474O2883P9087R5382J12092J29166J46359J64163J83221K02812K21259
59471E479898K37757K52438K64560K72087K73298K67423K53491K30004J96318
59462G727274J53269J02259M4911j5995p6574j33384j84218k27303k61152k85601
59452F843486l01850l10899l12823l07889k97369k82888k65843k47710k29819
59443D286396k12439j94990j77349j60164j43764j27934j12891r9410q7702p7232
59433B892521o7739n9340n1467m3110l4382k6602k0393j4989r718m916q56K880
59421B561889O462R527J2342J5845J9961K3369K5880K9538L5834M2785M6289M4199
$$ y = [4436838, 4319093, 4220917, 4141085, 4078459, 4031880, 4000972, 3986216, 3987744, 4004739, 4036523, 4083474, 4146357, 4225444, 4320826, 4432918, 4562084, 4708443, 4872606, 5055827, 5258639, 5479898, 5717655, 5970093, 6234653, 6506740, 6780038, 7047461, 7300952, 7530956, 7727274, 7880543, 7982802, 8027713, 8011718, 7935144, 7801760, 7617542, 7390239, 7129087, 6843486, 6541636, 6230737, 5917914, 5610025, 5312656, 5029768, 4763925, 4516215, 4286396, 4073957, 3878967, 3701618, 3541454, 3397690, 3269756, 3156865, 3057455, 2969753, 2892521, 2824782, 2765442, 2713975, 2670865, 2636483, 2609881, 2589488, 2574499, 2564781, 2559865, 2559009, 2561889, 2568351, 2577878, 2590220, 2606065, 2626026, 2649395, 2675275, 2704813, 2740647, 2783432, 2829721, 2873920]
59409B873920L8079L1476K7465K7522L1513L8379M7173N7760P0556Q5593J01631
59398C431067J15961J25810J30981J34979J42560J56025J74526J96559K21838
59389D830306K50756K83456L19849L59554M01340M43625M85645N27129N66409
59380H468069N99863O23481O34256O30259O10959N78129N35250M85497M31157
59371A3596920L75000L20685K70910K26203J85926J49346J15066Q0724M4180M375
59361A5369335l9395q7878j40700j95587k49313k98617l39950l69767l86368l91037
59351A2870723l86802l76762l63971l51764l43009l39213l40608l46453l54885
59342I667256l63394l70010l73635l73244l67865l57567l43451l26223l05863
$$ y = [2873920, 2911999, 2943475, 2970940, 2998462, 3029975, 3068354, 3115527, 3173287, 3243843, 3329436, 3431067, 3547028, 3672838, 3803819, 3938798, 4081358, 4237383, 4411909, 4608468, 4830306, 5081062, 5364518, 5684367, 6043921, 6445261, 6888886, 7374531, 7901660, 8468069, 9067932, 9691413, 10325669, 10955928, 11566887, 12145016, 12680266, 13165763, 13596920, 13971920, 14292605, 14563515, 14789718, 14975644, 15124990, 15240056, 15320780, 15364960, 15369335, 15329940, 15242062, 15101362, 14905775, 14656462, 14357845, 14017895, 13648128, 13261760, 12870723, 12483921, 12107159, 11743188, 11391424, 11048415, 10709202, 10368594, 10022141, 9667256, 9303862, 8933852, 8560217, 8186973, 7819108, 7461541, 7118090, 6791867, 6486004]
59333F486004k82993k59314k36031k12929j89684j66982j45645j25599j06480
59324D760347q8336p1097n4345l8307k4087j2102j187R910K0923L0705L8707M4943
59312D616074M9195N1082N0493M7354M1489L3212K3507J3161K283r041k0199l0486
59300D868124l9346m6075n0047n1433n0873m8371m3526l6713k8806j9625q236
59289D445073N018J8480L1683M6083O2534P9679R5938J11489J27075J42129J55489
59278E320670J66857J76234J82766J85433J84189J79386J70641J57119J38326
59269F861621J13903Q3689M8879J2468k2182n2675p7345r5200j06929j14701j20026
59258F531502j22754j22837j21632j20456j19180j17454j15982j15225j13995
$$ y = [6486004, 6203011, 5943697, 5707666, 5494737, 5305053, 5138071, 4992426, 4866827, 4760347, 4672011, 4600914, 4546569, 4508262, 4484175, 4472073, 4470886, 4480796, 4501719, 4532424, 4571131, 4616074, 4665269, 4716351, 4766844, 4814198, 4855687, 4888899, 4912406, 4925567, 4927850, 4918809, 4898610, 4868124, 4828778, 4782703, 4732656, 4681223, 4630350, 4581979, 4538453, 4501740, 4472934, 4453309, 4445073, 4450091, 4468571, 4500254, 4546337, 4608871, 4688550, 4784488, 4895977, 5023052, 5165181, 5320670, 5487527, 5663761, 5846527, 6031960, 6216149, 6395535, 6566176, 6723295, 6861621, 6975524, 7059213, 7108092, 7120560, 7098378, 7045703, 6968358, 6873158, 6766229, 6651528, 6531502, 6408748, 6285911, 6164279, 6043823, 5924643, 5807189, 5691207, 5575982, 5461987]
59249E461987j10802j05756r9727r2599q3703p3238o1736m8743l3431j6025K652
59238D738879K2661M4741O9050R5186J23243J53803J86995K22278K58830K95700
59228F211366L31876L66500L98182M23852M39187M40700M26585L95581L46795
59219I780624K81376K02771J14309J8118q2549j81684k72801l51675m15716m62437
59209H630336m90550n01596m98592m83830m59395m28688l95406l61453l27317
59200D683509k93792k61896k31896k03953j79021j57653j38740j21007j04948
59191B990603r1706q0798p0785o1482n3672m7182m1047l5164l0101k5540k0605
59180B432521j5385j0621o225j633K775O270R417J3477J8440K3158K7247L1306
$$ y = [5461987, 5351185, 5245429, 5145702, 5053103, 4969400, 4896162, 4834426, 4785683, 4752252, 4736227, 4738879, 4761540, 4806281, 4875331, 4970517, 5093760, 5247563, 5434558, 5656836, 5915666, 6211366, 6543242, 6909742, 7307924, 7731776, 8170963, 8611663, 9038248, 9433829, 9780624, 10062000, 10264771, 10379080, 10397198, 10314649, 10132965, 9860164, 9508489, 9092773, 8630336, 8139786, 7638190, 7139598, 6655768, 6196373, 5767685, 5372279, 5010826, 4683509, 4389717, 4127821, 3895925, 3691972, 3512951, 3355298, 3216558, 3095551, 2990603, 2898897, 2818099, 2747314, 2685832, 2632160, 2584978, 2543931, 2508767, 2478666, 2453126, 2432521, 2417136, 2406515, 2400290, 2398657, 2401432, 2407702, 2417119, 2430596, 2449036, 2472194, 2499441, 2530747]
59168B530747L5518L9580M3805M8760N4022N8670O2828O7208P1470P4669P7037
59157C164314P9569Q1871Q2108P9351P4455O8391O0994N1731M0619K8161J5286
59146C826850L212p488j7444k7273l6211m2987m7468n0248n1179m9764m6529m2471
59134C411000l7469l0666k2163j2865k967P864J9157L0099M1114N3300O6418P9088
59122C601910R1008J03324J16719J30698J44846J59338J73973J88148K02012K16306
59112E128282K30858K44547K56809K67786K76660K81133K78968K69055K50740
59103G484838K23184J85783J38640Q2820K0949m2742j04004j60139k09439k50040
59093G369850k80791l02625l17466l25913l27498l22803l13683l01491k86733
$$ y = [2530747, 2566265, 2605845, 2649650, 2698410, 2752432, 2811102, 2873930, 2941138, 3012608, 3087277, 3164314, 3243883, 3325754, 3407862, 3487213, 3561668, 3630059, 3691053, 3742784, 3783403, 3811564, 3826850, 3830062, 3822574, 3805130, 3777857, 3741646, 3698659, 3651191, 3600943, 3549764, 3500000, 3453471, 3411000, 3373531, 3342865, 3320702, 3307837, 3304870, 3312734, 3331891, 3361990, 3403104, 3456404, 3522822, 3601910, 3692918, 3796242, 3912961, 4043659, 4188505, 4347843, 4521816, 4709964, 4911976, 5128282, 5359140, 5603687, 5860496, 6128282, 6404942, 6686075, 6965043, 7234098, 7484838, 7708022, 7893805, 8032445, 8115265, 8136214, 8093472, 7989468, 7829329, 7619890, 7369850, 7089059, 6786434, 6468968, 6143055, 5815557, 5492754, 5179071, 4877580, 4590847]
59084D590847k70333k53575k36643k18943k01000j84501j70110j56731j43354
59075B755657j30356j18597j08342r9383r1335q3583p5826o8592o2438n6939n1451
59064A808815m6402m2559l9499l6223l2922l0578k9056k7196k4693k2378k0732
59053A456577j9622j9270j9996k1042k1240k0684k0260j9763j8231j5932j4142
59042A246395j3007j1481r428p800o630m777k040M20K202M419P780J1532J4833
59029A232418J7687K0014K1285K1502K1244K0368J8044J4358J0483P050L741O32
59017A408826j550k723l420l341j515J830N174P716R913J1941J3274J4025J4872
59004A475022J5436J4445J1871R090O626L648N1k867m408n189n393m280k109n62
$$ y = [4590847, 4320514, 4066939, 3830296, 3611353, 3410353, 3225852, 3055742, 2899011, 2755657, 2625301, 2506704, 2398362, 2298979, 2207644, 2124061, 2048235, 1979643, 1917205, 1860266, 1808815, 1762413, 1719854, 1680355, 1644132, 1611210, 1580632, 1551576, 1524380, 1499687, 1477309, 1456577, 1436955, 1417685, 1397689, 1376647, 1355407, 1334723, 1314463, 1294700, 1276469, 1260537, 1246395, 1233388, 1221907, 1212479, 1204679, 1198049, 1193272, 1191232, 1191652, 1193854, 1198273, 1206053, 1217585, 1232418, 1250105, 1270119, 1291404, 1312906, 1334150, 1354518, 1372562, 1386920, 1397403, 1404453, 1408194, 1408826, 1407276, 1404553, 1401133, 1397792, 1396277, 1398107, 1403281, 1410997, 1420910, 1432851, 1446125, 1460150, 1475022, 1490458, 1504903, 1516774, 1525864, 1532490, 1536138, 1536189, 1533322, 1528914, 1523725, 1518332, 1514052, 1511943, 1511381]
58990A511381k84Q6J542L165L949M450N485O730P762R026J0679J1771J1744J1535
58976A599021J2207J3516J4821J6322J8461K1003K3507K5934K8192K9974L1463
58965A834421L3243L5152L6324L6618L6815L7117L6796L5665L4572L4102L4088
58954B224913L4705L6674M0000M3857M7975N2736N7813O2370O6832P2636P9932
58943B820443Q7328R4257J01719J10186J18753J26954J35627J45309J55617J66828
58933D063021J80175J95870K12712K30315K49885K72084K96108L21558L49229
58924F370957L79290M10854M44066M80393N19912N60600O01395O43309O86126
58915A1096902P26297P59902P85358Q01158Q02952P85105P43993O78054N86397
$$ y = [1511381, 1511097, 1511183, 1512725, 1515890, 1519839, 1524289, 1529774, 1536504, 1544266, 1553292, 1563971, 1575742, 1587486, 1599021, 1611228, 1624744, 1639565, 1655887, 1674348, 1695351, 1718858, 1744792, 1772984, 1802958, 1834421, 1867664, 1902816, 1939140, 1975758, 2012573, 2049690, 2086486, 2122151, 2156723, 2190825, 2224913, 2259618, 2296292, 2336292, 2380149, 2428124, 2480860, 2538673, 2601043, 2667875, 2740511, 2820443, 2907771, 3002028, 3103747, 3213933, 3332686, 3459640, 3595267, 3740576, 3896193, 4063021, 4243196, 4439066, 4651778, 4882093, 5131978, 5404062, 5700170, 6021728, 6370957, 6750247, 7161101, 7605167, 8085560, 8605472, 9166072, 9767467, 10410776, 11096902, 11823199, 12583101, 13368459, 14169617, 14972569, 15757674, 16501667, 17179721, 17766118]
58906A7766118M69791L32310J80326K0573j39773k92624m30592n48702o43915
58897A6713512p14431p60680p85587p92415p83311p60678p28273o89500o45999
58888A0052638n99181n51643n05694m61921m20501l82517l48641l18103k90391
58879F174046k66466k46814k29832k13830j99097j86349j74639j62645j50725
58870D343649j39876j29756j19533j09596j00677r2280q3746p5815o9417o3851
58860C359102n7811n1316m5117l9126l2991k7238k2262j7108j0808m008K273Q412
58848C062002J5200K2129K8380L4528M1528M8750N4839N9921O5351P1787P8955
58837C583370Q6799R5455J04675J14426J25405J37819J50508J62495J74671J88662
$$ y = [17766118, 18235909, 18568219, 18748545, 18769118, 18629345, 18336721, 17906129, 17357427, 16713512, 15999081, 15238401, 14452814, 13660399, 12877088, 12116410, 11388137, 10698637, 10052638, 9453457, 8901814, 8396120, 7934199, 7513698, 7131181, 6782540, 6464437, 6174046, 5907580, 5660766, 5430934, 5217104, 5018007, 4831658, 4657019, 4494374, 4343649, 4203773, 4074017, 3954484, 3844888, 3744211, 3651931, 3568185, 3492370, 3422953, 3359102, 3301291, 3249975, 3204858, 3165732, 3132741, 3105503, 3083241, 3066133, 3055325, 3051317, 3053590, 3062002, 3077202, 3099331, 3127711, 3162239, 3203767, 3252517, 3307356, 3367277, 3432628, 3504415, 3583370, 3670169, 3765624, 3870299, 3984725, 4110130, 4247949, 4398457, 4560952, 4735623, 4924285]
58827D924285K04887K22837K42481K64150K87721L13107L40880L71630M05399
58818G577377M42272M82372N24698N67396O09795O52326O93558P29273P55575
58809A3034642P70677P72182P54961P13941O47432N56008M40363L02931J50262
58800A8143399q845j66776l17010m52514n67149o58183p25441p69031p89998p92099
58790A2896353p80254p57518p25461o86585o44175o00290n55915n12583m71861
58781G161711m33790l97625l63644l32562l03925k76981k52519k31948k15076
58772D353641k00436j87280j75583j64735j53904j43282j33527j24479j15715
58763B954700j07507r9988r2355q4211p6520o9897o3257n5855m9131m4678m1652
$$ y = [4924285, 5129172, 5352009, 5594490, 5858640, 6146361, 6459468, 6800348, 7171978, 7577377, 8019649, 8502021, 9026719, 9594115, 10203910, 10856236, 11549794, 12279067, 13034642, 13805319, 14577501, 15332462, 16046403, 16693835, 17249843, 17690206, 17993137, 18143399, 18134554, 17967778, 17650768, 17198254, 16631105, 15972922, 15247481, 14478450, 13688452, 12896353, 12116099, 11358581, 10633120, 9946535, 9302360, 8702070, 8146155, 7633572, 7161711, 6727921, 6330296, 5966652, 5634090, 5330165, 5053184, 4800665, 4568717, 4353641, 4153205, 3965925, 3790342, 3625607, 3471703, 3328421, 3194894, 3070415, 2954700, 2847193, 2747205, 2654850, 2570639, 2494119, 2424222, 2360965, 2305110, 2255979, 2211301, 2169649]
58752B169649l8206l4260l0823k7749k4379k1360j9697j8877j7856j6936j6776
58741A902730j6552j5284j3902j3939j5112j6190j7160j8428j9103j8354j7369
58730A721337j7738j8901j9502k0070k1933k4473k6024k6644k7614k8970k9888
58719A459580l0620l1707l2183l0921k8841k7413k6125k3889k1709k1161k1391
58708A163620k0492j8852j8157j8038j6928j5344j5008j5293j4016j1474j0233
58697I89785j0841j1064r635p758o512n507m567m299m617m878n441p041q839r373
58683H89413r091r520j0400j0126q688p493o557m610j853j1L85L54K92k14p37
58668H21144n10j21m13m02J169L074L212K169K078K704J989M3q98k94K48L27J203
$$ y = [2169649, 2131443, 2097183, 2066360, 2038611, 2014232, 1992872, 1973175, 1954298, 1936442, 1919506, 1902730, 1886178, 1870894, 1856992, 1843053, 1827941, 1811751, 1794591, 1776163, 1757060, 1738706, 1721337, 1703599, 1684698, 1665196, 1645126, 1623193, 1598720, 1572696, 1546052, 1518438, 1489468, 1459580, 1428960, 1397253, 1365070, 1334149, 1305308, 1277895, 1251770, 1227881, 1206172, 1185011, 1163620, 1143128, 1124276, 1106119, 1088081, 1071153, 1055809, 1040801, 1025508, 1011492, 1000018, 989785, 978944, 967880, 958245, 950487, 943975, 938468, 933901, 929602, 924985, 920107, 914666, 907625, 898786, 889413, 880322, 870802, 860402, 850276, 841588, 834095, 827538, 822928, 821075, 821064, 821449, 821803, 822095, 821881, 821144, 820634, 820513, 820100, 819698, 820867, 823941, 827153, 829322, 831400, 834104, 836093, 836136, 835238, 834944, 835192, 835519, 836722]
58651H36722K913M110M830O305Q064Q491Q204R591J2872J5922J8101K0826K4234
58638I81185K6754K8394L0948L4539L7347L9285M2471M7434N2232N6095O0745
58627A437429O7219P4560Q2347R1606J02431J13687J25662J39945J56192J72070
58617B563148J86979K02601K19081K33866K44882K51629K52283K43165K22175
58608D619809J90103J48058R6929M0021j7164p0841j19745j61733j93230k13145
58598D319062k23908k27630k24481k15684k04470j92580j79150j64210j50039
58589B536910j37681j25413j12128r9225q7749p6691o5492n5415m7118l9678l3026
58578A657294k8511k6101k4037k2075k2003k4018k5957k6920k8320l0266l0607
$$ y = [836722, 839635, 843745, 848575, 854880, 862944, 871435, 879639, 889230, 902102, 918024, 936125, 956951, 981185, 1007939, 1036333, 1067281, 1101820, 1139167, 1178452, 1220923, 1268357, 1320589, 1376684, 1437429, 1504648, 1579208, 1661555, 1753161, 1855592, 1969279, 2094941, 2234886, 2391078, 2563148, 2750127, 2952728, 3171809, 3405675, 3650557, 3902186, 4154469, 4397634, 4619809, 4809912, 4957970, 5054899, 5094920, 5077756, 5006915, 4887170, 4725437, 4532207, 4319062, 4095154, 3867524, 3643043, 3427359, 3222889, 3030309, 2851159, 2686949, 2536910, 2399229, 2273816, 2161688, 2062463, 1974714, 1898023, 1832531, 1777116, 1729998, 1690320, 1657294, 1628783, 1602682, 1578645, 1556570, 1534567, 1510549, 1484592, 1457672, 1429352, 1399086, 1368479]
58567A368479k8710k6689k5613k4073k1717k0448k0712k0308j8507j7568j8509
58556A125625j9035j7526j5443j3921j1610p919m899l782l064j969k303m720o684
58543A012750o514o153p531r429j0296j1084j2814j4237j4199j3579j3014j1589
58531H82311r549r088j0545j1232r956r205j0630j2072j1518j0469j0617j0669
58519G56761r345q251q816r312p875n774m887m521l419k286j923j334m9M24m51
58504F88942o37R24K246J941J730K980M042L541L100M156N221M967M855O085P025
58489G41118O360N702O454P157O541O007O496O268M392K961L087K361q36m090
58475G99978n127n597p516r494r897j0151j1576j2316j0916r416r487r053o426
$$ y = [1368479, 1339769, 1313080, 1287467, 1263394, 1241677, 1221229, 1200517, 1180209, 1161702, 1144134, 1125625, 1106590, 1089064, 1073621, 1059700, 1048090, 1040171, 1035272, 1031490, 1028426, 1026457, 1024154, 1019434, 1012750, 1006236, 1000083, 992552, 983123, 972827, 961743, 948929, 934692, 920493, 906914, 893900, 882311, 872762, 863674, 853129, 841897, 831941, 822736, 812106, 800034, 788516, 778047, 767430, 756761, 747416, 739165, 730349, 721037, 713162, 707388, 702501, 697980, 694561, 692275, 690352, 689018, 688969, 689393, 688942, 688305, 689229, 691475, 693416, 695146, 698126, 702168, 705709, 708809, 712965, 718186, 723153, 728008, 734093, 741118, 747478, 753180, 759634, 766791, 773332, 779339, 785835, 792103, 796495, 799456, 802543, 804904, 804068, 799978, 794851, 789254, 781738, 772244, 762347, 752196, 740620, 728304, 717388, 707972, 698485, 689432, 683006]
58462F83006m055m306n145m072k813l753n106m163k331k301k999j860L09J150
58448F41561J073J639K023R84J17J257L038L629M237O286Q044P874P721R463J0839
58433G09785R261O605N867N982M519K637K739L804L646L283M544N842M805K741
58419G76060K116K105R21j47O88J712P68m77L25J626J074K74J686L681L482K233
58403G98127K269K229j16k932l316k570l395m573l543j614j379j629m5J783J297
58388G80593K53J657M182M907M839O246P437N874L687M214N807N037L245L870
58374H41848N889O124N501O784Q631Q166O991Q248J0174R089O422O158P588P224
58360I44837N691O074P408O536M471M446N641N196M221N393O991N829L593L636
$$ y = [683006, 678951, 674645, 669500, 665428, 662615, 658862, 653756, 649593, 647262, 644961, 641962, 640102, 640411, 641561, 642634, 644273, 646296, 647280, 647397, 648654, 651692, 655321, 659558, 665844, 673888, 681762, 689483, 698946, 709785, 719046, 725651, 731518, 737500, 742019, 744656, 747395, 751199, 754845, 758128, 762672, 768514, 773319, 776060, 778176, 780281, 781202, 781055, 781743, 783455, 784223, 783746, 784071, 785697, 786771, 787045, 788731, 792412, 795894, 798127, 800396, 802625, 802509, 799577, 796261, 793691, 790296, 785723, 782180, 780566, 779187, 777558, 777513, 779296, 780593, 780846, 782503, 786685, 791592, 796431, 802677, 810114, 815988, 819675, 823889, 829696, 834733, 837978, 841848, 847737, 853861, 859362, 866146, 874777, 882943, 889934, 898182, 908356, 917445, 923867, 930025, 937613, 944837, 950528, 956602, 964010, 970546, 975017, 979463, 985104, 990300, 994521, 999914, 1006905, 1012734, 1016327, 1019963]
58346A019963M275K204m16M62K959K665J035K532O053P217O742Q357J0833J0450
58332A085331R041J1063J4800J5150J3093J3582J6048J5895J3674J3699J5234
58321A236610J4090J1493J2189J5247J5794J4415J5579J8303J7811J4985J4670
58310A401186J6035J4361J0880J0906J3460J2966J0070J0444J3856J4856J3495
58299A542515J4845J8507J9194J7192J7865K1241K2416K1586K3254K6376K5973
58288A770964K3480K4625K8206K8191K5690K7153L1849L3211L1652L3698L9146
58277B097865M1525M0634M2082M5283M4626M1675M3050M7259M7082M3907M5580
58266B580568N1196N2666N0431N2468N8430O0441N9108O2663P0479P3791P2718
$$ y = [1019963, 1024238, 1026442, 1026026, 1026488, 1029447, 1032112, 1033147, 1035679, 1041732, 1048949, 1055691, 1064048, 1074881, 1085331, 1094372, 1105435, 1120235, 1135385, 1148478, 1162060, 1178108, 1194003, 1207677, 1221376, 1236610, 1250700, 1262193, 1274382, 1289629, 1305423, 1319838, 1335417, 1353720, 1371531, 1386516, 1401186, 1417221, 1431582, 1442462, 1453368, 1466828, 1479794, 1489864, 1500308, 1514164, 1529020, 1542515, 1557360, 1575867, 1595061, 1612253, 1630118, 1651359, 1673775, 1695361, 1718615, 1744991, 1770964, 1794444, 1819069, 1847275, 1875466, 1901156, 1928309, 1960158, 1993369, 2025021, 2058719, 2097865, 2139390, 2180024, 2222106, 2267389, 2312015, 2353690, 2396740, 2443999, 2491081, 2534988, 2580568, 2631764, 2684430, 2734861, 2787329, 2845759, 2906200, 2965308, 3027971, 3098450, 3172241, 3244959]
58255C244959P5868Q3061Q5634Q4030Q7437R5714R9686R9618J04881J14914J19675
58244D295477J19391J24201J33913J38516J39068J46727J60590J68748J71892
58235E598523J82578K00293K11725K17043K30360K52421K69287K80244K99512
58226G741986L27739L50273L66654L92362M28329M59471M86462N26519N79509
58217A1659304O27525O71466P31816Q09580Q85217R60282J058911J183760J314750
58208A9902611J456213J637873J864542K116602K405402K771518L222298L732856
58200C9109915M314025N011105N833441O768530P874020R265986J1012508J3145937
58192A02335467J5780916J9092869K3197204K8202586L4210193M0654843M5335469
$$ y = [3244959, 3320827, 3403888, 3489522, 3573552, 3660989, 3756703, 3856389, 3956007, 4060888, 4175802, 4295477, 4414868, 4539069, 4672982, 4811498, 4950566, 5097293, 5257883, 5426631, 5598523, 5781101, 5981394, 6193119, 6410162, 6640522, 6892943, 7162230, 7442474, 7741986, 8069725, 8419998, 8786652, 9179014, 9607343, 10066814, 10553276, 11079795, 11659304, 12286829, 12958295, 13690111, 14499691, 15384908, 16345190, 17404101, 18587861, 19902611, 21358824, 22996697, 24861239, 26977841, 29383243, 32154761, 35377059, 39109915, 43423940, 48435045, 54268486, 61037016, 68911036, 78177022, 89189530, 102335467, 118116383, 137209252, 160406456, 188609042, 222819235, 263474078, 308809547]
58185C08809547M4704215L6143898K0422207J675290j5254844k7511640l4722524
58178C34266149l7780952l7743222l5572814l2164716k8221840k4186673k0353085
58171A18242847j6936130j4017024j1550417r478363p775150o388489n231811
58164D6865463m250776l429316k729747k092936j492450r25721l61470K49542
58156C1832589R37731J736521K659315L528183L880390L249834J630184m31145
58148D9023602k254525l482221m124512m325160m209598l889816l471036l019255
58140B0247479k566623k146455j788281j491819j241020j034107q74143p46285
58132H358746o32319n34689m62699m08761l60029l19315k93720k75951k56077
$$ y = [308809547, 353513762, 389657660, 410079867, 411755157, 396500313, 368988673, 334266149, 296485197, 258741975, 223169161, 191004445, 162782605, 138595932, 118242847, 101306717, 87289693, 75739276, 66260913, 58485763, 52097274, 46865463, 42614687, 39185371, 36455624, 34362688, 32870238, 31944517, 31583047, 31832589, 32770320, 34506841, 37166156, 40694339, 44574729, 47824563, 49454747, 49023602, 46769077, 43286856, 39162344, 34837184, 30627586, 26737770, 23266734, 20247479, 17680856, 15534401, 13746120, 12254301, 11013281, 9979174, 9105031, 8358746, 7726427, 7191738, 6729039, 6320278, 5960249, 5640934, 5347214, 5071263, 4815186]
58123D815186k38614k30093k22747k07276j88987j75666j62406j43429j25629
58114C120339j15621j06307r0824p7200p4721p7917p7832p7244q1121q3756p9067
58103B178729p2909p2018p1222o4080n5775n3126n1956m6446m1135m1734m3591
58092A564737m0848l7752l9460m0912l6221l0189k9299k9952k6604k3072k4662
58081A205766k7249k5105k1828k2841k4633k2004j8575j9546k1203j8072j3740
58070I70970j4091j6240j4427j0885j0794j2151j0355p507p772q807o803m736
58058H46402o712r461q235n951p571j0574r816p158p394r093q000n445n110n503
58044G40379l479j215k005l267j232J646J312j67R96K723J463j66J997N402N017
$$ y = [4815186, 4576572, 4346479, 4123732, 3916456, 3727469, 3551803, 3389397, 3245968, 3120339, 3004718, 2898411, 2807587, 2730387, 2655666, 2577749, 2499917, 2422673, 2341552, 2257796, 2178729, 2105820, 2033802, 1962580, 1898500, 1842725, 1789599, 1737643, 1691197, 1650062, 1608328, 1564737, 1523889, 1486137, 1446677, 1405765, 1369544, 1339355, 1310056, 1280104, 1253500, 1230428, 1205766, 1178517, 1153412, 1131584, 1108743, 1084110, 1062106, 1043531, 1023985, 1002782, 984710, 970970, 956879, 940639, 926212, 915327, 904533, 892382, 882027, 874520, 866748, 857941, 851138, 846402, 839690, 830229, 821994, 816043, 808472, 797898, 788082, 780924, 773530, 764437, 756437, 750992, 745882, 740379, 736900, 735685, 733680, 730413, 729181, 730827, 732139, 731972, 732968, 735691, 737154, 736988, 738985, 744387, 749404]
58029G49404K106J143J499r8k229j532K00r24l545l794k573l305n155n175m446
58014G21576n593p001n874m132n026o910o600n693p160q886p306m397m291n822
58000F36885n204l381l889n896o165n547o892q673p337m016k449k255n15J943
57986E76609K237J445K698N032N222L983M336N644N196L929M574N949N006K789
57972F34649K432L076J767m97p14n6j841m933n507l952l767m878m367k692k923
57957F05797m652m802l640m017n527n353m056m410n384l531K64J741O02O47K729
57942E66408L774L016L039M241L988J956Q16R99jk549m184m528n895q512j0004
57927E52564j0028j0681j1862j1167q741p433p614o621l928j995j363K74L288
$$ y = [749404, 751510, 752653, 754152, 754054, 751825, 750293, 750493, 749569, 746024, 742230, 739657, 736352, 731197, 726022, 721576, 715983, 708982, 703108, 698976, 693950, 687040, 680440, 674747, 667587, 658701, 651395, 646998, 642707, 636885, 631681, 628300, 624411, 618515, 612350, 606803, 599911, 591238, 583901, 579885, 577436, 575181, 574666, 576609, 578846, 580291, 582989, 588021, 593243, 597226, 601562, 607206, 612402, 616331, 620905, 626854, 631860, 634649, 637081, 640157, 641924, 641427, 640713, 640657, 638816, 633883, 628376, 624424, 620657, 615779, 611412, 608720, 605797, 601145, 596343, 592703, 588686, 583159, 577806, 573750, 569340, 563956, 560425, 560689, 562430, 563032, 563679, 566408, 570182, 573198, 576237, 580478, 584466, 586422, 587238, 588237, 588236, 585687, 581503, 576975, 571080, 562568, 552564, 542536, 531855, 519993, 508826, 500085, 492652, 485038, 478417, 474489, 472494, 471131, 471405, 474693]
57914D74693N072M860N035O597P527O881O482P353Q078P787P448P375O718N828
57900E67734N882O027M336J601N41J231J110m95j734k175l343n117n597m876n031
57885E60094o152o218n180n094o004n740m141l393l743l097j318o84j479j312
57871E06539M94J883K250L449N803P179O966P005P658P050N186M643N942O321
57857E78368M538K799K511J981J09j408j426j499k811m099m317m438n056n065
57843E60187m151l801m501m746l903l257l238k573j220r96k207k870k351k594
57829E17779m422n902n806n559o298o924o634o489p029p057o168n783o363o368
57815D30977n177m355m757n096m548m016l777k746j071m07p30nJ933K757K006
$$ y = [474693, 479765, 484625, 489660, 496257, 503784, 510665, 517147, 524500, 532578, 540365, 547813, 555188, 561906, 567734, 573616, 579643, 583979, 585580, 586121, 587352, 588462, 587967, 586233, 584058, 580715, 575598, 570001, 565125, 560094, 553942, 547724, 542544, 537450, 531446, 525706, 521565, 518172, 514429, 511332, 510014, 509330, 507851, 506539, 507033, 508916, 511166, 514615, 520418, 527597, 534563, 541568, 549226, 556276, 561462, 566105, 572047, 578368, 582906, 585705, 588216, 590197, 590306, 588898, 587472, 585973, 583162, 579063, 574746, 570308, 565252, 560187, 556036, 552235, 547734, 542988, 539085, 535828, 532590, 530017, 528797, 527801, 525594, 522724, 520373, 517779, 513357, 507455, 501649, 496090, 489792, 482868, 476234, 469745, 462716, 455659, 449491, 443708, 437345, 430977, 425800, 421445, 416688, 411592, 407044, 403028, 399251, 396505, 395434, 395027, 394297, 394292, 396225, 398982, 400988]
57800D00988K346M854O875O648O453Q598J1499J2426J1432R954P984N262L148
57787D98467K794L280L454L792M593M536K839Q18m02j608l353m420m202m247n563
57772E00778o662o288n704o186o454m915k490r82l49L18Q02P77J159K496L540
57757D69840L230K617L084M220M992N471N863N513M384L808M317M557L700K994
57743E28590L477M192M227M386N181N428M568M256N619P082P012O393O797P674
57729F04882P944Q347R814J1185J0995J0023R810J0132J0182J0721J2652J4820
57717G31507J5595J5548J6291J7761J8828J9629K1132K3265K5340K7531L0212
57706I62639L2861L5261L8516M3246M8065N1674N5268O0911O8673P7197Q5966
$$ y = [400988, 403334, 408188, 415063, 421711, 428164, 436762, 448261, 460687, 472119, 482073, 490057, 495319, 498467, 501261, 504541, 507995, 511787, 516380, 520916, 523755, 524573, 524171, 522563, 519210, 514790, 510588, 506341, 500778, 494116, 487828, 482124, 475938, 469484, 464569, 462079, 461097, 460748, 461066, 461868, 462645, 463804, 466300, 469840, 473070, 475687, 478771, 482991, 487983, 493454, 499317, 504830, 509214, 513022, 517339, 521896, 525596, 528590, 532067, 536259, 540486, 544872, 550053, 555481, 560049, 564305, 569924, 577006, 584018, 590411, 597208, 604882, 612826, 621173, 630987, 642172, 653167, 663190, 673000, 683132, 693314, 704035, 716687, 731507, 747102, 762650, 778941, 796702, 815530, 835159, 856291, 879556, 904896, 932427, 962639, 995500, 1030761, 1069277, 1112523, 1160588, 1212262, 1267530, 1328441, 1397114, 1474311, 1560277]
57695A560277R5247J04879J15016J26965J41609J58008J74939J92424K10129K25892
57685C105385K37644K45133K47667K41776K23629J92822J51974J04067N2518K488
57675D805103m0690p4032r6208j05627j01225q4195n7502k5878J221R535j1737
57664D218765o0262j21206j77478k18204k39706k43299k33566k15948j94062j69732
57654B345302j45004j22156j01890q3412o6415n1458l8596k7383j8002j0710m355
57643A675921K764J0722J8281K5193L2484M0628M9075N7612O6730P6704Q7554
57632B143668R9703J13331J27520J41370J55337J69928J83670J94110K00332K02478
57622C731447J99045J86742J63380J29516Q7190L8818j2484o2878j08851j47735
$$ y = [1560277, 1655524, 1760403, 1875419, 2002384, 2143993, 2302001, 2476940, 2669364, 2879493, 3105385, 3343029, 3588162, 3835829, 4077605, 4301234, 4494056, 4646030, 4750097, 4802615, 4805103, 4764413, 4690381, 4594173, 4488546, 4387321, 4303126, 4245624, 4219746, 4220967, 4230502, 4218765, 4158503, 4037297, 3859819, 3641615, 3401909, 3158610, 2925044, 2709096, 2515034, 2345302, 2200298, 2078142, 1976252, 1892840, 1826425, 1774967, 1736371, 1708988, 1690986, 1680276, 1675921, 1678685, 1689407, 1707688, 1732881, 1765365, 1805993, 1855068, 1912680, 1979410, 2056114, 2143668, 2243371, 2356702, 2484222, 2625592, 2780929, 2950857, 3134527, 3328637, 3528969, 3731447, 3930492, 4117234, 4280614, 4410130, 4497320, 4536138, 4523654, 4460776, 4351925, 4204190]
57612D204190j77584j97572k08532k12150k09805k02676j92274j79927j66260
57603B457410j52052j38692j26801j15379j03510r2032q2207p3870o6251n9534
57593A447082n4040m8887m3278l8151l4679l2113k9004k5670k3371k1777j9530
57582A076582j6795j4942j4017j2728j0860r517q998q361p193o011m837l104j001
57569I58218O35J695K641L315L440L863N516P551Q432Q511R498J1617J3391J4193
57555A052516J4903J6006J7053J8206K0310K3189K5772K8154L1644L6487M1367
57544A325607M5620N0113N5590O1805O8686P6689Q5580R4467J03394J13390J24562
57533B205503J35676J45943J55562J64017J69315J69421J63148J49430J27263
$$ y = [4204190, 4026606, 3829034, 3620502, 3408352, 3198547, 2995871, 2803597, 2623670, 2457410, 2305358, 2166666, 2039865, 1924486, 1820976, 1728944, 1646737, 1572867, 1506616, 1447082, 1393042, 1344155, 1300877, 1262726, 1228047, 1195934, 1166930, 1141260, 1117889, 1096112, 1076582, 1059787, 1044845, 1030828, 1018100, 1007240, 997723, 988725, 980364, 973171, 967160, 962323, 959219, 958218, 958853, 960548, 963189, 966504, 969944, 973807, 979323, 986874, 995306, 1003817, 1013315, 1024932, 1038323, 1052516, 1067419, 1083425, 1100478, 1118684, 1138994, 1162183, 1187955, 1216109, 1247753, 1284240, 1325607, 1371227, 1421340, 1476930, 1538735, 1607421, 1684110, 1769690, 1864157, 1967551, 2080941, 2205503, 2341179, 2487122, 2642684, 2806701, 2976016, 3145437, 3308585, 3458015, 3585278]
57524C585278R6974O0409J9766k2538o2956r7622j24583j44002j56197j61100
57514B993429j59750j54401j46602j36667j25279j13843j02796r1347p9600o9200
57504A813944o1095n4238m7331m0493l4282k8503k2896j7901j3777r894n669j381
57492A476484K542O204R736J2969J6026J9393K3093K6751L0617L5537M1617M8037
57480A749006N4441O1406O9250P7567Q6264R5883J06558J17640J28743J39961
57470B686719J50709J59337J64143J63831J56885J41736J17942Q6347M8251N674
57460C881574l7666p7306j10552j37001j56639j68916j73873j72638j66401j56241
57450B524341j44039j31916j20350j08421r6223q5326p6368o8154n9875n2460
$$ y = [3585278, 3682252, 3742661, 3762427, 3739889, 3676933, 3579311, 3454728, 3310726, 3154529, 2993429, 2833679, 2679278, 2532676, 2396009, 2270730, 2156887, 2054091, 1962744, 1883144, 1813944, 1752849, 1698611, 1651280, 1610787, 1576505, 1548002, 1525106, 1507205, 1493428, 1483534, 1477865, 1476484, 1479026, 1485230, 1494966, 1507935, 1523961, 1543354, 1566447, 1593198, 1623815, 1659352, 1700969, 1749006, 1803447, 1864853, 1934103, 2011670, 2097934, 2193817, 2300375, 2418015, 2546758, 2686719, 2837428, 2996765, 3160908, 3324739, 3481624, 3623360, 3741302, 3827649, 3875900, 3881574, 3843908, 3766602, 3656050, 3519049, 3362410, 3193494, 3019621, 2846983, 2680582, 2524341, 2380302, 2248386, 2128036, 2019615, 1923392, 1838066, 1761698, 1693544, 1633669, 1581209]
57440A581209m6713m1825l6839l2185k8501k5291k1926j8867j6745j5145j3434
57429A283738j1886j0884r826p907n390l230j904j330j355j692j832j519q49K96
57415A224430K085L904M618M066L295L035K962K810L064L950M823N174N331N671
57401A279218O012O243O674P332P742P748P685P594P250P056P680Q739R155Q947
57387A385075R183R979J0196R506R007R199R143Q423Q171R143J0372J0863J1153
57374A509413J1982J2737J2524J1647J0872J0264R788J0024J1205J2493J3182
57363A636131J3642J4166J4083J3082J2305J2874J4265J5238J5548J5647J5561
57352A792542J5157J4783J4683J4487J4088J4168J5046J5975J6379J6808J7777
$$ y = [1581209, 1534496, 1492671, 1455832, 1423647, 1395146, 1369855, 1347929, 1329062, 1312317, 1297172, 1283738, 1271852, 1260968, 1251142, 1243235, 1237845, 1234615, 1232711, 1231381, 1230026, 1228334, 1226502, 1224983, 1224134, 1224430, 1226515, 1230419, 1235037, 1239103, 1242398, 1245433, 1248395, 1251205, 1254269, 1258219, 1263042, 1268216, 1273547, 1279218, 1285230, 1291473, 1298147, 1305479, 1313221, 1320969, 1328654, 1336248, 1343498, 1350554, 1358234, 1366973, 1376128, 1385075, 1394258, 1404237, 1414433, 1423939, 1432946, 1442145, 1451288, 1459711, 1467882, 1477025, 1487397, 1498260, 1509413, 1521395, 1534132, 1546656, 1558303, 1569175, 1579439, 1589227, 1599251, 1610456, 1622949, 1636131, 1649773, 1663939, 1678022, 1691104, 1703409, 1716283, 1730548, 1745786, 1761334, 1776981, 1792542, 1807699, 1822482, 1837165, 1851652, 1865740, 1879908, 1894954, 1910929, 1927308, 1944116, 1961893]
57341A961893J8707J9049J9349K0128K0700K0253J9286J8847J9068J9447J9851
57330B176578K0319K0567K0547K0763K1362K1744K1713K1918K2585K2997K2967
57319B414060K3407K4602K5437K5334K5442K6584K7633K7420K6836K7362K8759
57308B702876K9937L0934L2300L3557L4078L4560L5851L7256L7779L8154L9681
57297C086963M1856M3200M3824M5067M7068M8769N0051N1834N4050N5497N5758
57286C623937N5707N5948N6258N6498N6639N5854N3064M8397M2952L7257L1137
57275D173648K4881J9147J3972R218N633M089M044M310N003P060J0099J2624J4314
57262D308042J6312J8985K1193K2153K2462K2808K3084K3291K3935K5067K5999
$$ y = [1961893, 1980600, 1999649, 2018998, 2039126, 2059826, 2080079, 2099365, 2118212, 2137280, 2156727, 2176578, 2196897, 2217464, 2238011, 2258774, 2280136, 2301880, 2323593, 2345511, 2368096, 2391093, 2414060, 2437467, 2462069, 2487506, 2512840, 2538282, 2564866, 2592499, 2619919, 2646755, 2674117, 2702876, 2732813, 2763747, 2796047, 2829604, 2863682, 2898242, 2934093, 2971349, 3009128, 3047282, 3086963, 3128819, 3172019, 3215843, 3260910, 3307978, 3356747, 3406798, 3458632, 3512682, 3568179, 3623937, 3679644, 3735592, 3791850, 3848348, 3904987, 3960841, 4013905, 4062302, 4105254, 4142511, 4173648, 4198529, 4217676, 4231648, 4240866, 4246499, 4250588, 4254632, 4258942, 4263945, 4271005, 4281104, 4293728, 4308042, 4324354, 4343339, 4364532, 4386685, 4409147, 4431955, 4455039, 4478330, 4502265, 4527332, 4553331]
57251D553331K6476K7089K8201K9478L0721L2135L3541L4417L4918L5795L7076
57240D903178L8016L8485L9245M0516M1503M1725M1678M1738M1504M0849M0559
57229E348996M1224M2308M2990M3272M3593M3925M3877M3351M2629M2033M1706
57218E819904M1461M0793L9358L7517L6018L5211L4959L5166L5841L6775L7706
57207F230709L8754M0124M1518M2449M2953M3405M3778M3744M3369M3079M3013
57196F696895M2966M2823M2586M2177M1709M1651M2186M2814M3132M3494M4254
57185G166687M4940M4984M4679M4440M3681M1518L8217L4873L2017K9542K7609
57174G593187K6397K5219K3140K0318J7732J5687J3631J1314R011O640L697M7
$$ y = [4553331, 4579807, 4606896, 4635097, 4664575, 4695296, 4727431, 4760972, 4795389, 4830307, 4866102, 4903178, 4941194, 4979679, 5018924, 5059440, 5100943, 5142668, 5184346, 5226084, 5267588, 5308437, 5348996, 5390220, 5432528, 5475518, 5518790, 5562383, 5606308, 5650185, 5693536, 5736165, 5778198, 5819904, 5861365, 5902158, 5941516, 5979033, 6015051, 6050262, 6085221, 6120387, 6156228, 6193003, 6230709, 6269463, 6309587, 6351105, 6393554, 6436507, 6479912, 6523690, 6567434, 6610803, 6653882, 6696895, 6739861, 6782684, 6825270, 6867447, 6909156, 6950807, 6992993, 7035807, 7078939, 7122433, 7166687, 7211627, 7256611, 7301290, 7345730, 7389411, 7430929, 7469146, 7504019, 7536036, 7565578, 7593187, 7619584, 7644803, 7667943, 7688261, 7705993, 7721680, 7735311, 7746625, 7755636, 7762276, 7765973, 7766020]
57162G766020l972q109j2085j5378j7974k0802k4373k7541k8843k8506k7807k6946
57150G523684k5203k2814k0952j9903j8886j7693j6965j6752j6403j6052j6607
57139G315454j8159j9965k2263k6364l2548l9477m6315n3757o2134o9957p5378
57128F849137p7966p8123p5722p0424o2703n3770m4944l7567l2933l1667l3386
57117F249932l7083m1320m4179m3913l9964l2733k2524r490N559K1559L8661N8373
57105F102878Q2143J10922J46346J91185K48143L19134M06117N11686O38434P88641
57095I545629R65001J170798J408579J678587J977611K297663K625102K942294
57087B4611264L231344L476383L662834L776536L805216L739992L572806L291728
$$ y = [7766020, 7762048, 7753939, 7741854, 7726476, 7708502, 7687700, 7663327, 7635786, 7606943, 7578437, 7550630, 7523684, 7498481, 7475667, 7454715, 7434812, 7415926, 7398233, 7381268, 7364516, 7348113, 7332061, 7315454, 7297295, 7277330, 7255067, 7228703, 7196155, 7156678, 7110363, 7056606, 6994472, 6924515, 6849137, 6771171, 6693048, 6617326, 6546902, 6484199, 6430429, 6385485, 6347918, 6314985, 6283318, 6249932, 6212849, 6171529, 6127350, 6083437, 6043473, 6010740, 5988216, 5978726, 5984285, 6005844, 6044505, 6102878, 6185021, 6295943, 6442289, 6633474, 6881617, 7200751, 7606868, 8118554, 8756988, 9545629, 10510630, 11681428, 13090007, 14768594, 16746205, 19043868, 21668970, 24611264, 27842608, 31318991, 34981825, 38758361, 42563577, 46303569, 49876375, 53168103]
57079E3168103K882740K343503J699963J006158L19058l32485r54458j563366
57071E8569216k156848k706991l175583l530686l753378l839387l799624l656478
57063C1950241l436098l163301k861379k551546k249850j966084j706419j475199
57055A2540365j273687j099829r50829q24680p18788o29508n54023m90847m37812
57046E560362l91628l50368l14316k83503k56521k32506k12030j94871j79217
57037C145402j64208j51022j40166j30005j19433j09740j02120r5489q8545q1984
57027A962690p6753p2026o6877o2199n8890n5740n1200m5864m1123l6820l2254
57016A362944k8203k5689k3784k0726j6376j1757p119k108L121Q600J5334K4029
$$ y = [53168103, 56050843, 58394346, 60094309, 61100467, 61419525, 61087040, 60132582, 58569216, 56412368, 53705377, 50529794, 46999108, 43245730, 39406343, 35606719, 31950241, 28514143, 25350842, 22489463, 19937917, 17688067, 15721983, 14015564, 12540365, 11266678, 10166849, 9216020, 8391340, 7672552, 7043044, 6489021, 5998174, 5560362, 5168734, 4818366, 4504050, 4220547, 3964026, 3731520, 3519490, 3324619, 3145402, 2981194, 2830172, 2690006, 2560001, 2440568, 2330828, 2228708, 2133219, 2044674, 1962690, 1885937, 1813911, 1747034, 1684835, 1625945, 1570205, 1519005, 1473141, 1432018, 1395198, 1362944, 1334741, 1309052, 1285268, 1264542, 1248166, 1236409, 1229290, 1227182, 1230303, 1238903, 1254237, 1278266]
57004A278266L4339M6623O2760Q4092J10878J44575J85489K23477K35130J98979
56994B604608J16178J2648q0537j46469j84266j99588j98094j84876j64574j40634
56984A434396j15615r2178p2861n9244n1720m9392m9807m9825m7570m3258l8021
56973G64905l2655k7530k2732j7966j2983q281m604j852P89L619O266Q638J1199
56960F66813J4353J8340K3463K9218L3193L2092K4449J1900k127j4407k3002k7605
56948G86680k9135k8556k6137k2246j8198j5267j3139j0436o585k330J537N007
56936F21195Q504J2473J7294K2984K8994L4580L8655L8940L2521J8728R73j5571
56924H60270k7835l5632l9570l9988l7662l3921k9601k4959k0517j7016j4505
$$ y = [1278266, 1312605, 1359228, 1421988, 1506080, 1616958, 1761533, 1947022, 2170499, 2405629, 2604608, 2720786, 2733434, 2652897, 2506428, 2322162, 2122574, 1924480, 1739604, 1575030, 1434396, 1318781, 1226603, 1153742, 1094498, 1042778, 993386, 943579, 893754, 846184, 802926, 764905, 732250, 704720, 681988, 664022, 651039, 642758, 638154, 636302, 637091, 640710, 646976, 655614, 666813, 681166, 699506, 722969, 752187, 785380, 817472, 841921, 853821, 851694, 837287, 814285, 786680, 757545, 728989, 702852, 680606, 662408, 647141, 634002, 623566, 616981, 614651, 616188, 621195, 629699, 642172, 659466, 682450, 711444, 746024, 784679, 823619, 856140, 874868, 875841, 860270, 832435, 796803, 757233, 717245, 679583, 645662, 616061, 591102, 570585, 553569, 539064]
56913E39064j2430j0605r210q060o761n468m647m295m099l983l758k806j007O33
56899D62568J319J743K904M406N252N660O575P999R363J1169J4605J9659K5105
56886E78327K9933L3240L3132K7799J7965O651l584j1797j7363j9601j9078j7519
56874F38105j5732j3014q994m617p39K961P009J1332J5991K1700K8870L7107M6223
56861G66202N6779O8543P8581Q1561P2655N1063K1445q437l2342m8170n6565n8506
56849I92809n5236m8938m1599l3553k4495j5184o606J794J1274K1654L1971M2799
56837H76690N5904P1857Q9804J08771J26052J34195J23481R0056M0732j1401n5303
56826A650838q6023j03485j09881j07937j00030q8248p4753o1305m8424l5903
$$ y = [539064, 526634, 516029, 506819, 498759, 491998, 486530, 481883, 477588, 473489, 469506, 465748, 462942, 461935, 462568, 463887, 465630, 468534, 472940, 478192, 483852, 490427, 498426, 507789, 518958, 533563, 553222, 578327, 608260, 641500, 674632, 702431, 720396, 727047, 723463, 711666, 694303, 674702, 655624, 638105, 622373, 609359, 600365, 595748, 595009, 597970, 604979, 616311, 632302, 654002, 682872, 719979, 766202, 822981, 891524, 970105, 1051666, 1124321, 1175384, 1196829, 1188392, 1156050, 1107880, 1051315, 992809, 937573, 888635, 847036, 813483, 788988, 773804, 767198, 768992, 780266, 801920, 833891, 876690, 932594, 1004451, 1094255, 1203026, 1329078, 1463273, 1586754, 1676810, 1717542, 1706141, 1650838, 1564815, 1461330, 1351449, 1243512, 1143482, 1055234, 980481, 919176, 870752, 834849]
56816H34849k4064j3470l551P031J8574L0234M1976N5207P0592Q5732R5008R1548
56804A289666P0926L5294o039m2090o7040q1296q7186q6237q0328p2264o3745
56793H09661n4480m4225l4039k4854j6532r018k719L047J0099J8970K8061L6007
56781G19978M2909M7962M7779L9033K2092Q54k0051l6997m7841n2495n2694n0270
56769F60259m6004m0489l4969l0363k6306k2074j7762j3928j0779q349o791n952
56757C96493n300m661m259l927l165k160j699j834j884j792k230l032l083k147
56743C55320j438j789k664l348l861m145l748k835k189j904j383q29j095j815
56729C22277j645p00o66j828k268j019J80l77j852k618k794l303l898l721k845
$$ y = [834849, 810785, 797315, 793764, 800795, 819369, 849603, 891579, 946786, 1017378, 1103110, 1198118, 1289666, 1360592, 1395886, 1389847, 1347757, 1280717, 1199421, 1112235, 1025998, 945670, 873406, 809661, 755181, 710956, 676917, 652063, 635531, 626513, 623794, 626841, 636940, 655910, 683971, 719978, 762887, 810849, 858628, 897661, 919753, 920607, 900556, 863559, 815718, 763223, 710529, 660259, 614255, 573766, 538797, 508434, 482128, 460054, 442292, 428364, 417585, 409236, 402445, 396493, 391193, 386532, 382273, 378346, 375181, 373021, 371322, 369488, 367604, 365812, 363582, 360550, 357467, 355320, 353882, 352093, 349429, 346081, 342220, 338075, 334327, 331492, 329303, 327399, 326016, 325187, 324092, 322277, 320632, 319932, 319266, 317438, 315170, 314151, 314331, 313954, 312102, 309484, 306690, 303387, 299489, 295768, 292923]
56714B92923j860q70O5N26O65J285K223K132P65k37J32O42M6q46q29m64r22j926
56696B93450k435k243j578l21J056J129m70k019j996j077n20j11O71J037K98m19
56680B84452J87J376J645J162J105J504J604J424J260N28j174k782l204l096l483
56665B82508l666k470o27J54k13m80k98k61k94M7K17n63j600j609q51n97q93o74
56647B67830J42N29J84j78k92o25j195j473j409j387j337r68o16p97j326j739
56631B55343k085k383k101j142m77o92r56n41k58r42j720j363l31K34N10J233
56615B42329J867J458N49L75Q17R43Q60J253J770J680J369J479J389M30l62K26
56599B58432J188P39o56j089m40k48p87p85J1M77L79O79J393J407O27L20R82J708
$$ y = [292923, 291063, 290193, 290258, 290784, 291449, 292734, 294957, 297089, 297854, 297617, 297749, 298391, 298437, 297591, 296762, 296298, 295376, 293450, 291015, 288772, 287194, 286873, 287929, 289058, 288588, 286569, 284573, 283496, 282976, 282865, 283536, 284573, 284871, 284452, 284639, 286015, 287660, 288822, 289927, 291431, 293035, 294459, 295719, 296247, 295073, 292291, 289087, 285991, 282508, 278842, 276372, 275745, 275899, 275686, 275206, 274908, 274647, 274353, 274400, 274617, 274054, 272454, 270845, 269994, 269397, 268504, 267830, 267972, 268501, 268685, 268507, 268215, 267590, 266395, 264922, 263513, 262126, 260789, 259821, 259205, 258408, 257082, 255343, 253258, 250875, 248774, 247632, 247155, 246463, 245507, 244966, 244708, 243766, 242046, 240683, 240352, 240586, 241096, 242329, 244196, 245654, 246203, 246578, 247395, 248338, 249198, 250451, 252221, 253901, 255270, 256749, 258138, 258568, 258206, 258432, 259620, 260359, 259703, 258614, 258174, 257926, 257139, 256354, 256365, 256842, 257221, 257900, 259293, 260700, 261327, 261647, 262629, 264337]
56581B64337J929J975J886J437J305K352L770L857K710K134K766L389L324L442
56567C00613M242M886M780M458M342M076L657L746M426M860M626M301M410M868
56553C62291N482N962N599M094K468J873J818R94o17j963k855l940n021n231m792
56538C66162m869n614o011n712n426n505n563n459n280m615l256k189k346k877
56524C01440k375j298j255k340l191l304l221k840j654n00p29j841k159j653j762
56509B71318k515k389j155m11q71j427j319j042p55P0J022R04j17n35j4J55n47
56492B60372j082q38l27K96J396K312J888P53Q54K413L628L717L773M231M035
56477B87421L005K560L254L925M008M461N557O056N494N081N463N641N109M923
$$ y = [264337, 266266, 268241, 270127, 271564, 272869, 275221, 278991, 282848, 285558, 287692, 290458, 293847, 297171, 300613, 304855, 309741, 314521, 318979, 323321, 327397, 331054, 334800, 339226, 344086, 348712, 353013, 357423, 362291, 367773, 373735, 379334, 383428, 385896, 387769, 389587, 390581, 389964, 388001, 385146, 381206, 376185, 370954, 366162, 361293, 355679, 349668, 343956, 338530, 333025, 327462, 322003, 316723, 312108, 308852, 306663, 304317, 301440, 299065, 297767, 296512, 294172, 290981, 287677, 284456, 281616, 279962, 279462, 278733, 276892, 274733, 273080, 271318, 268803, 266414, 265259, 264848, 263977, 262550, 261231, 260189, 259434, 259504, 260526, 261430, 261313, 260778, 260764, 260919, 260372, 259290, 258452, 258125, 258421, 259817, 262129, 264017, 264770, 265624, 268037, 271665, 275382, 279155, 283386, 287421, 290426, 292986, 296240, 300165, 304173, 308634, 314191, 320247, 325741, 330822, 336285, 341926, 347035, 351958]
56463C51958N718O609O975P389P981P810O691N665M951L465J135m61o69q11j739
56448D12667k410j924j030n95m00l16q20j540j241p6J38j348l220m491n676o844
56432C80874o887n761n126n659n976n383n251o344p092o145m579l952m031l933
56418C04755l849m083l967l149k473k446k279j554j180j721k380k577k856l341
56404B66900l042j716n88k92J45J401K628L076L128K988K182J017O45J058J038
56389B80568N42Q91K049K338J487J268K266K785K018J449J965K378K092K345L436
56374C09877L647K480K019L303M315L455K225K359K921K533J914K043K068J277
56360C46436Q65J644K236J604J092J844K545J856Q45P98Q42%n93J66J143J133
$$ y = [351958, 357676, 364285, 371260, 378649, 386630, 394440, 401131, 406796, 411747, 415212, 416347, 415886, 415217, 414406, 412667, 410257, 408333, 407303, 406708, 406308, 405992, 405172, 403632, 402391, 402315, 402453, 401105, 397885, 393394, 387718, 380874, 373987, 368226, 363100, 357441, 351465, 346082, 340831, 334487, 327395, 321250, 316671, 312719, 308688, 304755, 300906, 296823, 292856, 289707, 287234, 284788, 282509, 280955, 279775, 278054, 275674, 273097, 270241, 266900, 263858, 262142, 261554, 261262, 261407, 262808, 265436, 268512, 271640, 274628, 276810, 277827, 278472, 279530, 280568, 281110, 282001, 284050, 286388, 287875, 289143, 291409, 294194, 296212, 297661, 299626, 302004, 304096, 306441, 309877, 313524, 316004, 318023, 321326, 325641, 329096, 331321, 333680, 336601, 339134, 341048, 343091, 345159, 346436, 347301, 348945, 351181, 352785, 353877, 355721, 358266, 360122, 360967, 361765, 362607, 362607, 362014, 362180, 363323, 364456]
56344C64456J160K307L423L289L045M030N221N154M574M826N465N629N935O868
56330D25382P260O504O238P695R447R927R946J0449J0244Q435O839P176P977O996
56316E40515M791L149J980M64n46j17N02j49j134r97n43j202k328k569k205j865
56300E37746p94J286K643K201J647K540L654L675M045O181Q378Q608Q213R578
56286E99601J2163J4009J5267J7042J8624J9056J9685K2024K4860K6437K7687
56275H16455L0275L3403L5615L7906M1893M6799N1262N6146O2591O9460P5800
56264A357605Q3476R4024J05359J15188J25243J38247J52859J65798J76861J87763
56254B702423J97772K04685K08518K10138K07766J98840J83941J65047J41564
$$ y = [364456, 365616, 367923, 371346, 374635, 377680, 381710, 386931, 392085, 396659, 401485, 406950, 412579, 418514, 425382, 432642, 439146, 445384, 453079, 462526, 472453, 482399, 492848, 503092, 511527, 518366, 525542, 533519, 540515, 545306, 548455, 550435, 550899, 550353, 550236, 550738, 550589, 549455, 548458, 547915, 546713, 544385, 541816, 539611, 537746, 536952, 538238, 540881, 543082, 544729, 547269, 550923, 554598, 558643, 564824, 573202, 581810, 590023, 599601, 611764, 625773, 641040, 658082, 676706, 695762, 715447, 737471, 762331, 788768, 816455, 846730, 880133, 915748, 953654, 995547, 1042346, 1093608, 1149754, 1212345, 1281805, 1357605, 1441081, 1535105, 1640464, 1755652, 1880895, 2019142, 2172001, 2337799, 2514660, 2702423, 2900195, 3104880, 3313398, 3523536, 3731302, 3930142, 4114083, 4279130, 4420694]
56245D420694J12111P8729M5323J3294j7624m5813o9067q7944j04072j16571j23902
56234D105158j27423j29381j29294j26150j22086j19743j18118j15266j12815
56225C004882j13173j14635j14179j12959j13783j15183j13564j09597j06800
56216A991009j05075j01329r5471r0202q5637p9601p2575o7031o2509n6536m9761
56205A125282m4970m1712l7148l1614k8042k6395k3982k0731j8945j8272j6217
56194H17254j3199j1895j2014j0851q496p346o990m914j709k32j23J438M149N273
56180G50345N294P175J0476J1956J1580J2233J3846J3654J1913J1436J1755R764
56168H81427N894L644L242J795o05j145l13j237l288k952p83o82k279j191K871
$$ y = [4420694, 4532805, 4611534, 4656857, 4670151, 4652527, 4606714, 4537647, 4449703, 4345631, 4229060, 4105158, 3977735, 3848354, 3719060, 3592910, 3470824, 3351081, 3232963, 3117697, 3004882, 2891709, 2777074, 2662895, 2549936, 2436153, 2320970, 2207406, 2097809, 1991009, 1885934, 1784605, 1689134, 1598932, 1513295, 1433694, 1361119, 1294088, 1231579, 1175043, 1125282, 1080312, 1038600, 1001452, 969838, 941796, 915401, 891419, 870688, 851743, 833471, 817254, 804055, 792160, 780146, 769295, 760799, 753453, 746463, 741549, 739840, 739608, 739485, 740923, 745072, 750345, 755639, 762814, 773290, 785246, 796826, 809059, 822905, 836559, 848472, 859908, 871663, 881427, 887321, 890965, 894207, 896002, 895397, 894252, 893939, 892702, 889414, 886462, 885679, 884997, 882718, 881527, 884398]
56153H84398N439N287N900Q302R600R680J2137J7275K1112K2666K5523L0918L6089
56140A094326M0808M8532N9636P0337P9869R1887J07104J21170J31274J38136
56130A983079J40244J33444J18317J01335Q6889P4519O4830O0588O0057N6561
56120B879863M6805L3312J7717o60j8326k8238k9592k9662l3729m0518m9343o3136
56108B684493q1373r7744j08251j14797j18297j15874j07557r8281r0327q0942
56098A671050o9871o1508n6953n1704m4011l7775l4496l0321k3907j9220j7626
56087A223658j5205j0745q202q455p047k964r29k039j133L407O383N657N928R156
56073A197470J0736R001Q858J1977J3112J0408R508J2944J5356J3930J3547J6662
$$ y = [884398, 889837, 895124, 901024, 909326, 918926, 928606, 940743, 958018, 979130, 1001796, 1027319, 1058237, 1094326, 1135134, 1183666, 1243302, 1313639, 1393508, 1485395, 1592499, 1713669, 1844943, 1983079, 2123323, 2256767, 2375084, 2476419, 2563308, 2637827, 2702657, 2763245, 2823302, 2879863, 2926668, 2959980, 2977697, 2977037, 2958711, 2930473, 2900881, 2871219, 2837490, 2796972, 2747629, 2684493, 2603120, 2505376, 2397125, 2282328, 2164031, 2048157, 1940600, 1842319, 1751992, 1671050, 1601179, 1539671, 1482718, 1431014, 1387003, 1349228, 1314732, 1284411, 1260504, 1241284, 1223658, 1208453, 1197708, 1189506, 1181051, 1174004, 1171040, 1170111, 1168072, 1166939, 1170346, 1176729, 1182386, 1188314, 1197470, 1208206, 1217207, 1226065, 1238042, 1251154, 1261562, 1271070, 1284014, 1299370, 1313300, 1326847, 1343509]
56061A343509J8235J5933J5152J8519K0462J7877J6061J8402K0282J8912J9002
56050A542346K2794K4847K2667K2035K5859K8378K6513K5983K9937L2726L1381
56039A835466L1780L6693L9574L7149L6171M0404M3255M0928M0338M5863N0773
56028B278394N0296N0453N5420N8868N6787N5908O0425O3533O1214O0849O6730
56017B918877P1064O9031O8353P4002P8336P6858P8282Q7834R6401R7716J00170
56006C816924J09565J17045J16857J18823J29712J39723J41529J44675J56546
55997D991399J67580J70715J76430J92357K07524K13593K21621K40265K58366
55988F839850K67433K79586L03814L27263L40511L57784L90441M25180M51203
$$ y = [1343509, 1361744, 1377677, 1392829, 1411348, 1431810, 1449687, 1465748, 1484150, 1504432, 1523344, 1542346, 1565140, 1589987, 1612654, 1634689, 1660548, 1688926, 1715439, 1741422, 1771359, 1804085, 1835466, 1867246, 1903939, 1943513, 1980662, 2016833, 2057237, 2100492, 2141420, 2181758, 2227621, 2278394, 2328690, 2379143, 2434563, 2493431, 2550218, 2606126, 2666551, 2730084, 2791298, 2852147, 2918877, 2989941, 3058972, 3127325, 3201327, 3279663, 3356521, 3434803, 3522637, 3619038, 3716754, 3816924, 3926489, 4043534, 4160391, 4279214, 4408926, 4548649, 4690178, 4834853, 4991399, 5158979, 5329694, 5506124, 5698481, 5906005, 6119598, 6341219, 6581484, 6839850, 7107283, 7386869, 7690683, 8017946, 8358457, 8716241, 9106682, 9531862, 9983065]
55979I983065M83046N32226N83584O25632O75727P47738Q25268Q96283R81874
55970A6334443J099022J229675J361197J520325J729881J972407K237692K562526
55962C0047168K977972L464591M008941M651394N424962O311526P325532Q573132
55954G2785218J0156592J2102558J4468095J7416443K1099381K5613300L1133523
55947B04775110L7626876M3813032M6546188M2213066K9604823J1454073p181331
55940D08851837k2129537l1874126l6921779l8364240l7205299l4371087l0677441
55933A77308328k6683357k2727483j9068748j5881850j3187754j0919656r039750
55926E9799730p527327o311187n303172m469753l806030l272312k816886k431053
$$ y = [9983065, 10466111, 10998337, 11581921, 12207553, 12883280, 13631018, 14456286, 15352569, 16334443, 17433465, 18663140, 20024337, 21544662, 23274543, 25246950, 27484642, 30047168, 33025140, 36489731, 40498672, 45150066, 50575028, 56886554, 64212086, 72785218, 82941810, 95044368, 109512463, 126928906, 148028287, 173641587, 204775110, 242401986, 286215018, 332761206, 374974272, 404579095, 416033168, 408851837, 386722300, 354848174, 317926395, 279562155, 242356856, 207985769, 177308328, 150624971, 127897488, 108828740, 92946890, 79759136, 68839480, 59799730, 52272403, 45961216, 40658044, 36188291, 32382261, 29109949, 26293063, 23862010]
55918B3862010k125357j877366j652922j453883j297323j169768j045601r29579
55910A2310211q39825p67694o92970o21009n68325n27598m81201m34132m01224
55901F976233l76155l43928l10318k89512k75465k53758k29576k16706k10251
55892D470564j96514j79163j70403j66263j54952j40259j33343j30282j20203
55883C079182j07140j02106j01619r4971q5033q1598q1620p5729o7082o4702o5088
55872B152494n9062n0070m7629m9178m6133m1310m2813m6886m4279l7801l6523
55861A650810l8071l3530k4834k0693j9826j4382n853k194l098k889l830j1730
55849A469880k2343k6597k5703k7159k9893k7499k2319k1964k5066k4388k1072
$$ y = [23862010, 21736653, 19859287, 18206365, 16752482, 15455159, 14285391, 13239790, 12310211, 11470386, 10702692, 10009722, 9388713, 8820388, 8292790, 7811589, 7377457, 6976233, 6600078, 6256150, 5945832, 5656320, 5380855, 5127097, 4897521, 4680815, 4470564, 4274050, 4094887, 3924484, 3758221, 3603269, 3463010, 3329667, 3199385, 3079182, 2972042, 2869936, 2768317, 2673346, 2588313, 2506715, 2425095, 2349366, 2282284, 2217582, 2152494, 2093432, 2043362, 1995733, 1946555, 1900422, 1859112, 1816299, 1769413, 1725134, 1687333, 1650810, 1612739, 1579209, 1554375, 1533682, 1513856, 1499474, 1493621, 1491427, 1488329, 1485440, 1481610, 1469880, 1447537, 1420940, 1395237, 1368078, 1338185, 1310686, 1288367, 1266403, 1241337, 1216949, 1195877]
55838A195877k2145k6668k7765k5897k7042l0086k8851k4559k3725k5649k4121
55827I09369j9571j7726j8138j5759j1923j2216j5318j5264j2825j3437j5833
55816G41359j4099r185p145p573m952O3J928J216L219O862O151J793L88K589K779
55801G25393J7j183o22k610o650p923o981r040j3803j5668j4018j3639j5007j3795
55787F04471j0219r278j1212j0981p780o074o666n598k590j917m224n823o481
55774E15628r579j4151j5301j3059j2411j4001j3217r244o563o486n430k805k528
55761C90853n371p349p059p319q594q055o057o219q243p888m912l657n017n238
55747B99875l573l550n611n979m044l473m800m333j695r59k764k809P4J730N36
$$ y = [1195877, 1173732, 1147064, 1119299, 1093402, 1066360, 1036274, 1007423, 982864, 959139, 933490, 909369, 889798, 872072, 853934, 838175, 826252, 814036, 798718, 783454, 770629, 757192, 741359, 727260, 718075, 710930, 703357, 698405, 698468, 700396, 701612, 704831, 711693, 717844, 719637, 720025, 722614, 725393, 725410, 724227, 723605, 720995, 714345, 706422, 699441, 690401, 676598, 660930, 646912, 633273, 618266, 604471, 594252, 584974, 573762, 562781, 555001, 548927, 542261, 536663, 534073, 532156, 527932, 522109, 515628, 506049, 491898, 476597, 463538, 451127, 437126, 423909, 414665, 408102, 401616, 396186, 393381, 390853, 385482, 378133, 371074, 363755, 355161, 347106, 341049, 334830, 326587, 318699, 313787, 310130, 305113, 299875, 296302, 292752, 287141, 281162, 277118, 273645, 268845, 264512, 262817, 261858, 259094, 256285, 256359, 258089, 258625]
55732B58625J39K115L029J236j44L69k67l415n790n412m720n314n148l388k609
55717B29306l748m083k388j064j170m66J737K923K387K866N328P168P287P929
55703B54012R810J0349Q500O508N399L573J197Q62K527K875J085P5O96J19k495
55688C05092m202l811l867n310n467l355j688j705j044J300K971L132M148O428
55674B92622O787M126J720J565J427k17j262m03L20k34p6J515K040M96n25L12
55658C10213P58k83m90J049J516m70k007j101k67j979m647o046o921q356r265
55643B71704r064r305j0332r966p675o271p223q229p563o824p113o640m651l626
55629A67222m919o022m895l283l113l273k492j916k263j918k89M26q59k012j637
$$ y = [258625, 258764, 260879, 263908, 265144, 265000, 265369, 265102, 261687, 255897, 250485, 245765, 240451, 235303, 231915, 229306, 225558, 221475, 219087, 218023, 216853, 216387, 218124, 221047, 223434, 226300, 231628, 238796, 246083, 254012, 263822, 274171, 282671, 289179, 294578, 298151, 299348, 300210, 302737, 305612, 306697, 306772, 307468, 307587, 305092, 300890, 297079, 293212, 287902, 282435, 279080, 277392, 275687, 274643, 275943, 278914, 282046, 286194, 292622, 299409, 303535, 305255, 306820, 308247, 308030, 306768, 306365, 306685, 306451, 306375, 307890, 309930, 310426, 309901, 310213, 310971, 310688, 310198, 311247, 312763, 312293, 310286, 309185, 308918, 306939, 302292, 296246, 289325, 280969, 271704, 262640, 253335, 243003, 233037, 225362, 219091, 211868, 203639, 196076, 189252, 182139, 175499, 170848, 167222, 162303, 156281, 151386, 148103, 144990, 141717, 139225, 137309, 135046, 133128, 132839, 133265, 132406, 130394, 128757]
55614A28757j443k435k673j182k29j180j907q86m0q46j459n42j29j762l335k789
55598A05920j517j262j010K46J049N22M34J590J728k37j617m96Q74K52o92O1J048
55581A06893M80j92O07J226M8j027l4J259N66q05o40J90Q8K44K122M000L701K460
55563A21186K420K658J274p50j337r53j121j342p14m98j894l275k776j503j217
55548A10158j035L75J668J144O0M32J555J848J985L009L597K525J567K661M229
55533A35778L847K446K322K978K544J535J531J854J006j77k56l41k017l852l659
55518A45539k557l081m666m883l939l988m935m760l460k996l699l967l301k723
55504I2584k531k238k200k855l142k039p42q98j821j846j210j024p80M05J453
$$ y = [128757, 127314, 124879, 122206, 121024, 120795, 119615, 117708, 116822, 116782, 115936, 114477, 113935, 113806, 112044, 108709, 105920, 104403, 103141, 102131, 102377, 103426, 103948, 104382, 105972, 107700, 107463, 105846, 105350, 106224, 106476, 105784, 105845, 106893, 107373, 107181, 107788, 109014, 109062, 108035, 108001, 109260, 109826, 109021, 108381, 108571, 108659, 108903, 111025, 115025, 118726, 121186, 123606, 126264, 127538, 126788, 125451, 124498, 123377, 122035, 121321, 120823, 118929, 115654, 112878, 111375, 110158, 109123, 109498, 111166, 112310, 112370, 112802, 114357, 116205, 118190, 121199, 124796, 127321, 128888, 131549, 135778, 139625, 142071, 144393, 147371, 149915, 151450, 152981, 154835, 155841, 155664, 155408, 155067, 153050, 149198, 145539, 142982, 139901, 135235, 130352, 126413, 122425, 117490, 112730, 109270, 106274, 102575, 98608, 95307, 92584, 90053, 87815, 85615, 82760, 79618, 77579, 76837, 75939, 74118, 72272, 71062, 70038, 69258, 69663, 71116]
55489G1116J057M17J336K789K484O47p35j428k592l822l655k459j892k033j684
55474E9546r19p30q72m05K38Q4l76k07m1p92j579j237o05q89j197k76P26J11j221
55455D9359j313n80o89j287r33j58m54j224q16K90L56l84m33k1l98j011m50N81
55437D0435L26p75q92j08J60J41J068K291K264J658K258L350K649L28j168j108
55421E2877j004j413j330p22o18p80m3J130J251N83N92J080P74K70J174K775K742
55404E9338J051q2l7l83j487j806q72o2MJ34M47J10o65q11n02o62q40j57K77j067
55384E1928k818k363l67pj704k539j197K11Q1n08n19o09r61m08J036J538L96q29
55366D0361j022q94r16l72P00J062N49M13Q44N74m58o43L88J011N11J70N55L70
$$ y = [71116, 72173, 72590, 73926, 76715, 79199, 79846, 79111, 77683, 75091, 71269, 67614, 65155, 63263, 61230, 59546, 58627, 57897, 57025, 56620, 56858, 56942, 56566, 56359, 56318, 55526, 53947, 52710, 52105, 51216, 50019, 49743, 50469, 50580, 49359, 48046, 47466, 46777, 45490, 44557, 44399, 43945, 42721, 41905, 42195, 42551, 42167, 41734, 41713, 41315, 40304, 39854, 40435, 40761, 39986, 39094, 38986, 39146, 39287, 40355, 42646, 44910, 46568, 48826, 52176, 54825, 55153, 53985, 52877, 51873, 50460, 49130, 48408, 47790, 47010, 46967, 48097, 49348, 49931, 50523, 51603, 52377, 52647, 53821, 56596, 59338, 60389, 60307, 60270, 59887, 58400, 56594, 55722, 55660, 55664, 55798, 56245, 56355, 55690, 54879, 54377, 53715, 52875, 52718, 52995, 51928, 49110, 46747, 46380, 46373, 44669, 42130, 40933, 41144, 41225, 40717, 40198, 39589, 38628, 38220, 39256, 40794, 41190, 40361, 39339, 38445, 37529, 37157, 37857, 38919, 39468, 39881, 40725, 41299, 40841, 40198, 40586, 41597, 42108, 42278, 42833, 43203]
55348D3203q98j709j070j68j90n18k79J47K08J25o5o96j231n94P89J243N67L32
55330C9196J046J235J10j117j366j075o88J51J087Q19o87j661j063R7P18J059
55314C7861J417J258M85q4k08o03j272j158j1J034J291J227J075N17P3Q19K300
55297D6021K742J702O52M64L80r1l62l86r77j914j836o40N8m18p95j74N64M63
55279D5453j62p52j196j078q2P28k5j494j485M5R16M34L45J404J994J200N07J011
55261D7763J507Q51j20m47o95j291j323m36L6o74j317q35j50k86n44l0O66P86
55243D3461Q19J203J170K46n22k08M79N22J76Q5J43J70M58Q58O49K2J09R79J286
55224E2105O26K66Q04J095M42j64l6J2m67n53J2n9j173j649m63Q46O73j69k54
$$ y = [43203, 42305, 40596, 39526, 39358, 39168, 38650, 38371, 38518, 38726, 38851, 38786, 38090, 36859, 36265, 37054, 38297, 38864, 39196, 40242, 41477, 41587, 40470, 39104, 38029, 37341, 37492, 38579, 39398, 38711, 37050, 35987, 36084, 36802, 37861, 39278, 40536, 41021, 40937, 40729, 40126, 38854, 37696, 37685, 38719, 40010, 41237, 42312, 42829, 42902, 43721, 46021, 48763, 50465, 51117, 51581, 51961, 51870, 51508, 51122, 50145, 48231, 46395, 45755, 45813, 45395, 44600, 44426, 44990, 45453, 45291, 44539, 43343, 42265, 42183, 42911, 42886, 41392, 39907, 39952, 40868, 41302, 41647, 43051, 45045, 46245, 46752, 47763, 49270, 50121, 50001, 49554, 48859, 47568, 46245, 45809, 45845, 45171, 43854, 43019, 42869, 42583, 42039, 42009, 42675, 43461, 44280, 45483, 46653, 46899, 46377, 46169, 46648, 47170, 47346, 47431, 47574, 47744, 48202, 49060, 49709, 49731, 49840, 50819, 52105, 52731, 52997, 53801, 54896, 55338, 55174, 55138, 55150, 54683, 54130, 54142, 54083, 52910, 51261, 50798, 51644, 52317, 52148, 51894]
55205E1894Pm07r81o72J65O11Q06J214J330O03l85q86j121j339j038k14Mq32j410
55186D7349o38N96R32N02J95J29Q2K40N50M67K09Q67K440L393L068K713L018K634
55168F8746N60j830k765k495k172j840j154p14j022j331r60n69q44j217j105j045
55152D8243j350j182k16M07P6n5P41J187K38r22q88l36m64p71l76P5j37L2J545
55133D5847K999K560R84L94R81J297R84R03J121R63N94O50O93q2j120j232o05
55116E7931m19q32r80n56M7P29J392J304J38r51o92M29R87O88K78P2r0m3K80L04
55096F0016j95l47M37J247J028K36q9R5L63Q41J453J360M65J94J307K309J649
55079G2369J77l47N0K47K48P24J208Q56J00j79l98j288k128j778o00L79J246K264
$$ y = [51894, 51901, 51494, 50513, 49841, 50006, 50617, 51423, 52637, 53967, 54570, 54185, 53299, 52178, 50839, 49801, 49587, 49591, 48759, 47349, 46711, 47307, 48239, 48741, 48936, 49065, 49147, 49387, 49937, 50404, 50613, 51480, 53920, 57313, 60381, 63094, 66112, 68746, 69306, 67476, 64711, 62216, 60044, 58204, 57050, 56336, 55314, 53983, 53023, 52454, 51610, 50393, 49288, 48243, 46893, 45711, 45495, 45902, 45978, 45923, 46664, 47851, 48089, 47167, 46279, 45943, 45479, 44708, 44332, 44407, 44270, 44302, 45847, 48846, 51406, 52390, 52784, 53765, 55062, 56046, 56949, 58070, 59033, 59627, 60277, 60970, 60888, 59768, 58536, 57931, 57512, 56680, 55700, 55144, 55191, 55920, 57312, 58616, 58754, 57803, 57111, 57540, 58527, 59215, 59493, 59565, 59475, 59432, 59712, 60016, 59821, 59474, 59911, 61158, 62186, 62422, 62333, 62428, 62791, 63632, 65085, 66445, 66910, 67104, 68411, 70720, 72369, 72546, 72199, 72249, 72496, 72744, 73468, 74676, 75532, 75632, 75453, 75055, 73767, 71639, 69861, 69261, 69640, 70886, 73150]
55061G3150K337O21j408j713p75n89j354j622j133j035j481j479r48q02r88n92
55045F0189K05K96k67l34K10K94l28p13m37J2M95J245J714J094j24o72m21k27
55027F2231j73L43J028J007N20N73J071J096P42Q67J197O48m76o51L52J018M38
55010G1831n61j069j179j090o10M9K14j69m79m83m10j41N57J147R10K00q3M0l0
54991F8644j48J89O16N42M98J296K291K233J379R68R63L08q37j169m48K30M13
54974G7968P05J201J362J468K324L536L847L289L091L460L333K543K257K963L888
54959A17235M680N853P317Q292R038J0761J3421J5492J6305J6735J7064J6058
54947B58251J2965Q667M164n23n208q924j1324j3255j5190j6326j6028j4879j3620
$$ y = [73150, 75487, 76108, 74700, 72987, 72212, 71623, 70269, 68647, 67514, 66479, 64998, 63519, 62571, 61769, 60781, 60189, 60394, 60690, 60423, 60089, 60299, 60593, 60265, 59552, 59115, 59127, 59622, 60867, 62581, 63675, 63551, 62879, 62458, 62231, 62058, 62401, 63429, 64436, 64956, 65529, 66600, 67696, 68438, 69305, 70502, 71150, 70674, 70023, 70375, 71393, 71831, 71270, 70201, 69022, 67932, 67322, 67371, 67585, 67416, 66937, 66454, 66044, 65903, 66460, 67607, 68517, 68717, 68634, 68674, 68644, 68496, 68685, 69301, 69843, 70341, 71637, 73928, 76161, 77540, 78508, 79471, 79779, 78942, 77773, 77325, 77555, 77968, 78673, 79874, 81236, 82704, 85028, 88564, 92411, 95700, 98791, 102251, 105584, 108127, 110384, 113347, 117235, 121915, 127768, 135085, 143377, 152415, 163176, 176597, 192089, 208394, 225129, 242193, 258251, 271216, 279883, 284047, 283524, 278316, 269392, 258068, 244813, 229623, 213297, 197269, 182390, 168770]
54934A68770j2173j0384q623p112n661m473m084m197l727k439j337j007q04m3
54920A02706J066K148L172L922M022L892M637O621R031J1052J2579J3766J4783
54907A93397J5905J6867J6384J3567R459N706K167k443p818j1981j4034j4993
54895B22183j5704j5772j4986j3923j2698j0785q480o846n919m762l546l555m588
54882A00619m633k893j049n88p94n22q0o8n9K48M8j078k034j895j450j738k266
54865G9768k015j207p41p15p49r92j663k213k064j539j199q75k43K73O0o85j232
54848F1969j212p19n8K54j51q73j082p11m84n70k71O76J501J598J302J055P71
54831F2995M38M23P15P77N37N63R55J070P02M63P13J105J496K175K879K777J849
$$ y = [168770, 156597, 146213, 137590, 130478, 124817, 120344, 116260, 112063, 108336, 105897, 104560, 103553, 102749, 102706, 103772, 105920, 109092, 113014, 117036, 120928, 125565, 132186, 141217, 152269, 164848, 178614, 193397, 209302, 226169, 242553, 256120, 265579, 271285, 273452, 271009, 263191, 251210, 237176, 222183, 206479, 190707, 175721, 161798, 149100, 138315, 129835, 122989, 117070, 112308, 108762, 105207, 100619, 95986, 93093, 92044, 91456, 90662, 90140, 90060, 89992, 89933, 90181, 90229, 89151, 87117, 85222, 83772, 82034, 79768, 77753, 76546, 75805, 75090, 74341, 73349, 71686, 69473, 67409, 65870, 64671, 63796, 63553, 63826, 63886, 63201, 61969, 60757, 60038, 59980, 60234, 60083, 59210, 58128, 57417, 56933, 56363, 56092, 56768, 58269, 59867, 61169, 62224, 62995, 63433, 63856, 64571, 65348, 65885, 66448, 67403, 68473, 69175, 69638, 70351, 71456, 72952, 75127, 78006, 80783, 82632]
54814H2632J139J240J669K101K908M057M752M728M740N292N975O484P157Q144
54800A43018R187J0516J2709J5385J7319J8060J8019J6932J3971R604N382J507
54788B91609l290q807j2604j3299j2550j2412j2649j2135j1159j0577j0043q812
54776A63272p289o243n395m155k879k094j361j27J097J544J441J513K027L123
54762A44474N037P214Q340Q207Q385J0097J2628J4795J6677J8653K0051K0067
54750B94625J9012J7312J4362R626L915j659o939j1824j5295j6825j7575j8742
54738B69993j9651j9021j7164j5333j3768j1956j0164r052q401p594o839o517
54726A24533o051m772l238k299j552k75Q15M44j035k000j862j471j435j436j207
$$ y = [82632, 83771, 85011, 86680, 88781, 91689, 95746, 100498, 105226, 109966, 115258, 121233, 127717, 134874, 143018, 152205, 162721, 175430, 190815, 208134, 226194, 244213, 261145, 275116, 284720, 290102, 291609, 288319, 279512, 266908, 253609, 241059, 228647, 215998, 203863, 192704, 182127, 172084, 163272, 155983, 149740, 144345, 140190, 137311, 135217, 133856, 133729, 134826, 136370, 137811, 139324, 141351, 144474, 149511, 156725, 165065, 173272, 181657, 191754, 204382, 219177, 235854, 254507, 274558, 294625, 313637, 330949, 345311, 354937, 358852, 357193, 350254, 338430, 323135, 306310, 288735, 269993, 250342, 231321, 214157, 198824, 185056, 173100, 162936, 153884, 145483, 137889, 131050, 124533, 118482, 113710, 110472, 108173, 106621, 106346, 107161, 107605, 106570, 104570, 102708, 101237, 99802, 98366, 97159]
54711I7159q56l47L53P50N43M51J247K293K292J199J78j32j32k25l41m29n05l10
54693A03188K50O26L82M2K69P03O34L10M55Q20M96n29j274j171n60J92J078J981
54675A07892K589K828K808K501K011J843K254K720K668K343K271K393K488K905
54661A42514L899M683M169K501J061R26J915L003L244K562J908K264L343M005
54647A81997M100M816O698Q624R500R818J0506J1284J1395J0953J0375R181O697
54634B95944L302j35l522p161j0597j3037j4396j4999j4720j3426j1659j0052
54622A85542q606p291o567o414n854m346k812k202k069j678j375j563j389o6J431
54607A34741J584N24m99j046j361j206m11J11l47q64m04Q9q80k668l423l121l311
$$ y = [97159, 96303, 95956, 96309, 97059, 97602, 98053, 99300, 101593, 103885, 105084, 105262, 105130, 104998, 104773, 104432, 104003, 103498, 103188, 103438, 104064, 104446, 104488, 104757, 105460, 106094, 106404, 106859, 107679, 108175, 107646, 106372, 105201, 104641, 104833, 105911, 107892, 110481, 113309, 116117, 118618, 120629, 122472, 124726, 127446, 130114, 132457, 134728, 137121, 139609, 142514, 146413, 151096, 155265, 157766, 158827, 159753, 161668, 164671, 167915, 170477, 172385, 174649, 177992, 181997, 186097, 190913, 197611, 206235, 215735, 225553, 236059, 247343, 258738, 269691, 280066, 289247, 295944, 299246, 299111, 295589, 288428, 277831, 264794, 250398, 235399, 220679, 207253, 195594, 185542, 176936, 169645, 163078, 156664, 150810, 146464, 143652, 141450, 139381, 137703, 136328, 134765, 133376, 133310, 134741, 136325, 136849, 136350, 135304, 133943, 132737, 132326, 132437, 132090, 131226, 130822, 130911, 130031, 127363, 123940, 120819, 117508]
54590A17508m170m298l420k869l121l055k143j377j416j681j806k265k926k679
54576H0282j260J3N9o76j296j569j492r44k94j90l93J8R36J120K04n93l31L72
54558G3966O67Q15J313J754J475P30K46J92K20J89K38M05N56N17K32J3M73J747
54540H5748L097L769L982M352M806M903M859N183N602N477N036N045N349N012
54526A52220L890K809K030Q19j294l790n995p611q314p794o427n042l891k781
54512A08829k048k298l176l561l103k471j999j344o19n86j281j668j104j71M02
54497H3802O71Q81Q58N06J46j9j09j1O19J618K329K543K616K587K068J187P23
54480A03015J015J522J734J718J548J031L03l2L00Q69J169J084O84J42j52j3J00
$$ y = [117508, 113338, 109040, 105620, 102751, 99630, 96575, 94432, 93055, 91639, 89958, 88152, 85887, 82961, 80282, 79022, 79035, 79094, 78418, 77122, 75553, 74061, 73117, 72823, 72633, 72240, 72258, 73194, 74314, 74518, 73925, 73594, 73966, 74633, 75448, 76761, 78515, 79990, 80720, 80966, 81158, 81378, 81567, 81805, 82210, 82766, 83283, 83515, 83528, 84001, 85748, 88845, 92614, 96596, 100948, 105754, 110657, 115516, 120699, 126301, 131778, 136814, 141859, 147208, 152220, 156110, 158919, 160949, 161768, 160474, 156684, 150689, 143078, 134764, 126970, 120543, 115501, 111610, 108829, 106781, 104483, 101307, 97746, 94643, 92172, 90173, 88829, 88210, 87624, 86343, 84675, 83571, 83400, 83802, 84473, 85354, 86212, 86718, 86864, 86845, 86736, 86725, 87344, 88962, 91291, 93834, 96450, 99037, 101105, 102292, 103015, 104030, 105552, 107286, 109004, 110552, 111583, 111886, 111854, 112154, 113023, 114192, 115276, 115960, 116102, 115950, 115937, 116037]
54463A16037l82j246j800j828j594j227q32q47j384j670j101l61m24q96p26j36
54447I9583k84j195j611r79j64M5k18o69j234j518j114n66p45j345j267m76mj04
54429H6135M6O07P47L00J70O62R34N79L04M96O05M52O72J305J400O92K85R09J843
54410I9143K277K463K723K579J760R88R25J268J606K156L041L697L750L573L521
54395A35470L434L252L172K857J657p0j104j148j203j802k331k547l173m279m582
54380A27603l447k063j713k074k315k570l158l473k873j862j269j038p47n45o87
54365I7769q65q57j025j480j531p95O5L82M34O29P39O52R12J705K252J991J473
54348A02450J344J385J349J709K700L588L736L494L284K750J677P21M06L37J47
$$ y = [116037, 115655, 114409, 112609, 110781, 109187, 107960, 107128, 106281, 104897, 103227, 102126, 101765, 101341, 100445, 99719, 99583, 99299, 98104, 96493, 95514, 95350, 95395, 95177, 94508, 93274, 91756, 90642, 90076, 89331, 87986, 86719, 86243, 86239, 86135, 86181, 86788, 87535, 87835, 88005, 88667, 89601, 90180, 90484, 90980, 91585, 92037, 92709, 94014, 95414, 96106, 96391, 97300, 99143, 101420, 103883, 106606, 109185, 110945, 111933, 112858, 114126, 115732, 117888, 120929, 124626, 128376, 131949, 135470, 138904, 142156, 145328, 148185, 149842, 149772, 148668, 147520, 146317, 144515, 142184, 139637, 136464, 132185, 127603, 124156, 122093, 120380, 118306, 115991, 113421, 110263, 106790, 103917, 102055, 100786, 99748, 99001, 98456, 97769, 96904, 96047, 95022, 93542, 92011, 91216, 91281, 91663, 92097, 92726, 93465, 94117, 95029, 96734, 98986, 100977, 102450, 103794, 105179, 106528, 108237, 110937, 114525, 118261, 121755, 125039, 127789, 129466, 130187, 130593, 130930, 131077]
54333A31077J84M73K21q24j701j867k191l290m254m211l821l803l446k123j095
54318I9329j902l779m588l726k380j442r05q70j514k182k006j293j030j245j155
54303F9312o09j29J97O24Q03J95p63j123q46o42o22l22J30J49j65j87M2p7n37
54284F5430p41o22o28o81k67M52P39N52N84R81J093P26N90J128J761J721J136
54267G3954Q09J248K091K406J652M31p0M27R28O45K3k25l16p18j035o49N3J91
54249H1845j45j12M82R87J028Q07L99l01r68j046o07k59k30k63k62l17j79M59
54231H1318J259J469R23J30n29j056j343j141n30O5M22O19P66R57J385J985K207
54214H8906J526J21j245j826j284R7J377J682J177P04M72n5p36n43O75J467P64
$$ y = [131077, 131261, 131734, 131955, 131131, 129430, 127563, 125372, 122082, 117828, 113617, 109796, 105993, 102547, 100424, 99329, 97427, 93648, 89060, 85334, 82954, 81512, 80607, 79737, 78223, 76041, 74035, 72742, 71712, 70467, 69312, 68703, 68574, 68771, 69395, 70198, 70393, 69630, 68507, 67661, 67019, 66397, 66075, 66205, 66354, 66189, 66002, 66044, 65967, 65430, 64689, 64067, 63439, 62758, 62491, 62943, 63682, 64234, 64818, 65799, 66892, 67618, 68208, 69336, 71097, 72818, 73954, 74763, 76011, 78102, 80508, 82160, 82591, 82521, 82948, 83876, 84521, 84544, 84319, 84003, 83285, 82250, 81601, 81654, 81845, 81700, 81588, 82070, 83057, 84085, 84892, 85291, 84990, 84022, 82976, 82369, 82110, 81880, 81617, 81355, 81038, 80859, 81318, 82577, 84046, 84969, 85099, 84570, 83514, 82171, 81030, 80500, 80565, 80987, 81606, 82372, 83329, 84714, 86699, 88906, 90432, 90553, 89308, 87482, 86198, 86295, 87672, 89354, 90531, 91235, 91707, 91652, 90916, 90373, 91048, 92515, 93279]
54197I3279n26j017q59r98j339j169p55r39j470j330n43k74r82j762j689r15j79
54180G6533K7k70n54k08O16R59L31m77o09l59l85m25P7O39L88m17p87o43p38j146
54160G2552j139n24M6J63Q1J8jK21P56J005M70k85l24K02M44L43N49J028J049
54141G6654N19P0j81p45j511j626q41L6L31K10L8j24k24k26m72j244k029k017
54123F6618j239m42O5M83O99M42J11L54Q52P66K78M38J360J891J376N07nm36j157
54104G2961j663j255p2J062J406P35n19j405j285n91l20p66j378j631j406o61
54088F3212M38J193R79K33jN58J179J170M45p14j693j676n42N86O45O2r3J78J43
54069F6302J4O11J569J610O95K21P33J146P63M83J158K082K103J262L61k38n99
$$ y = [93279, 92753, 91736, 90877, 89879, 88540, 87371, 86616, 85677, 84207, 82877, 82334, 82060, 81078, 79316, 77627, 76712, 76533, 76560, 76290, 75736, 75528, 76144, 77103, 77434, 76957, 76348, 75989, 75604, 75179, 75256, 75895, 76283, 75866, 75079, 74436, 73698, 72552, 71413, 70889, 70935, 71098, 71179, 71197, 71196, 71417, 72173, 73178, 73648, 73363, 73039, 73241, 73685, 74028, 74577, 75605, 76654, 77173, 77243, 77062, 76317, 74806, 73180, 72339, 72375, 72706, 72916, 72954, 72830, 72606, 72380, 71908, 70664, 68635, 66618, 65379, 64937, 65002, 65485, 66184, 66626, 66737, 67091, 67943, 68709, 68987, 69425, 70785, 72676, 74052, 74559, 74554, 74118, 72961, 71298, 70043, 69971, 71033, 72439, 73174, 72655, 71250, 69965, 69374, 69054, 68288, 66910, 65279, 63873, 63212, 63650, 64843, 65822, 66055, 66054, 66612, 67791, 68961, 69406, 68692, 66999, 65323, 64781, 65367, 66012, 66074, 65981, 66159, 66302, 66316, 66927, 68496, 70106, 70801, 71022, 71755, 72901, 73664, 74147, 75305, 77387, 79490, 80752, 81113, 80875, 80276]
54052H0276n84m6P48J453J947K149J994J813K046K455K317J619J211J575K231
54037A03204K676L058L574L928L871L649L631L962M729N810O506O098M959M280
54023A63935M532N001N063N036N366N779N705N013L912K655J543Q05L00k98r75
54008B13372j528k033k619k987k846k581k776l288l597l721l902l778k961k086
53994A72669k089k655k723k256k124k373k231j788j990k796l010k315j749j786
53980A40784j635r77p42j370j834j374p06o46q00n89k99j79L17J310J756J006
53964A34022R6L05J328J977J949J746J546J238J073J325J657J649J467J424J329
53949A54131R57N78N03O33R63J851L316M758N818O728P466P453O656N962N865
$$ y = [80276, 79692, 79646, 80394, 81847, 83794, 85943, 87937, 89750, 91796, 94251, 96568, 98187, 99398, 100973, 103204, 105880, 108938, 112512, 116440, 120311, 123960, 127591, 131553, 136282, 142092, 148598, 154696, 159655, 163935, 168467, 173468, 178531, 183567, 188933, 194712, 200417, 205430, 209342, 211997, 213540, 214345, 214645, 214347, 213372, 211844, 209811, 207192, 204205, 201359, 198778, 196002, 192714, 189117, 185396, 181494, 177716, 174755, 172669, 170580, 167925, 165202, 162946, 160822, 158449, 156218, 154430, 152440, 149644, 146634, 144319, 142570, 140784, 139149, 138172, 137430, 136060, 134226, 132852, 132146, 131500, 130700, 130111, 129812, 129633, 129950, 131260, 133016, 134022, 134118, 134423, 135751, 137728, 139677, 141423, 142969, 144207, 145280, 146605, 148262, 149911, 151378, 152802, 154131, 155088, 155666, 156169, 156802, 157765, 159616, 162932, 167690, 173508, 180236, 187702, 195155, 201811, 207773, 213638]
53934B13638N721M984M105L443K366M03j667k827l188l345l249k681k043j654
53920B14006r54M81J884K322K205K579L420L828L537L188L277L813M795O161P453
53905B61995Q219Q543Q557P870O247M358L068K304J414K41q94j955k999l636l450
53890B99882k895k874l609m546n274n858o406o887p296p600p605p260o804o335
53876B18633n607m616l934m001m502m877n016m984m561l621k660k387k946l834
53862A61087m342l959k803j829j985l017l727l558l080k725k120j157o05r74j576
53847A23630j588j269j342j863k374k626k498j864j115j002j461j408l99N23M15
53832A03759j04L9O42P90M26J88K37K75L59O42P81M68J53L44O91O22L86M89O24
$$ y = [213638, 219359, 224343, 228448, 231891, 234257, 234660, 232993, 230166, 226978, 223633, 220384, 217703, 215660, 214006, 213052, 213533, 215417, 217739, 219944, 222523, 225943, 229771, 233308, 236496, 239773, 243586, 248381, 254542, 261995, 270214, 278757, 287314, 295184, 301431, 305789, 308857, 311161, 312575, 312816, 311922, 309967, 306968, 303332, 299882, 296987, 294113, 290504, 285958, 280684, 274826, 268420, 261533, 254237, 246637, 239032, 231772, 224968, 218633, 213026, 208410, 204476, 200475, 195973, 191096, 186080, 181096, 176535, 172914, 170254, 167867, 164921, 161087, 156745, 152786, 149983, 148154, 146169, 143152, 139425, 135867, 132787, 130062, 127942, 126785, 126180, 125206, 123630, 122042, 120773, 119431, 117568, 115194, 112568, 110070, 108206, 107091, 106089, 104628, 103220, 102821, 103344, 103759, 103655, 103694, 104336, 105126, 105552, 105740, 105977, 106252, 106611, 107253, 108034, 108502, 108655, 108999, 109690, 110312, 110698, 111187, 111811]
53813A11811K30l01n8R64J912K311K389K332K119J987K270K813L145L151L117
53798A40192L278L761M620N592O135O073N731N242M381L327K656K357J834J306
53784A96485J842L424M333L489J995J204O53n90j764j520l69j03j165k322k802
53769B02790l040l402l569l383l159l066l057l215l475l314k564j977k113k305
53755A61151j783j128j325k040k121j387n71k4K90j3j157k287k393j744j137m22
53739A41909P59J519Q25n30r23m69o00j436j609p65j14k85n97p96j492k477k409
53722A30510q63Q42J497J266O91j15q19q62n41p26j142m76J348K671K478J707
53706A37466J462J543J548J925K809L148K178P88L27R42J911K800L395L374K825
$$ y = [111811, 112041, 111740, 111682, 112646, 114558, 116869, 119258, 121590, 123709, 125696, 127966, 130779, 133924, 137075, 140192, 143470, 147231, 151851, 157443, 163578, 169651, 175382, 180624, 185005, 188332, 190988, 193345, 195179, 196485, 198327, 201751, 206084, 209573, 211568, 212772, 213425, 212835, 211071, 209551, 209182, 209079, 207914, 205592, 202790, 199750, 196348, 192779, 189396, 186237, 183171, 180114, 176899, 173424, 170110, 167546, 165569, 163456, 161151, 159368, 158240, 156915, 154875, 152754, 151367, 150796, 150772, 151062, 151049, 149892, 147605, 145212, 143468, 142331, 141909, 142668, 144187, 145012, 144482, 143559, 143090, 142490, 141054, 139445, 138680, 138566, 138281, 137684, 136888, 135396, 132919, 130510, 129647, 130489, 131986, 133252, 133943, 133828, 133009, 132147, 131606, 130880, 129738, 129262, 130610, 133281, 135759, 137466, 138928, 140471, 142019, 143944, 146753, 149901, 152079, 152867, 153194, 154136, 156047, 158847, 162242, 165616, 168441]
53691A68441K400K309K026J507J632K695L583L391K824L000L627L575K641J706
53677B05357J412J626J893J755R80l6m27R7Q17J022Q10N08m0r63j781j991j783
53660B09256j574j376j102j015j296j582j413p75J16J061J610J176j02j184j324
53645B00476r04o51n97l70O4M55P44R68J095J248J625J940J548M57l84k98K60
53628B07676N34N52P70J190J449J437J281J041Q84J142J804K328K327K089K055
53613B28559K254K574L090L700L950L661L310L329L539L631L782M126M164L394
53599B77063K284J917K733M144N355O052O297O185N785N250M792M562M475M296
53585C41190L960L681L583L429L030K657K656K828K652J998J191N33K32N01J203
$$ y = [168441, 170841, 173150, 175176, 176683, 178315, 181010, 184593, 187984, 190808, 193808, 197435, 201010, 203651, 205357, 206769, 208395, 210288, 212043, 213023, 212987, 212560, 212657, 213474, 214496, 215306, 215814, 215774, 214811, 213030, 211039, 209256, 207682, 206306, 205204, 204189, 202893, 201311, 199898, 199123, 199239, 200300, 201910, 203086, 202984, 201800, 200476, 199572, 198921, 198324, 197954, 198018, 198473, 199217, 200185, 201280, 202528, 204153, 206093, 207641, 208098, 207714, 207416, 207676, 208210, 208762, 209532, 210722, 212171, 213608, 214889, 215930, 216814, 217956, 219760, 222088, 224415, 226504, 228559, 230813, 233387, 236477, 240177, 244127, 247788, 251098, 254427, 257966, 261597, 265379, 269505, 273669, 277063, 279347, 281264, 283997, 288141, 293496, 299548, 305845, 312030, 317815, 323065, 327857, 332419, 336894, 341190, 345150, 348831, 352414, 355843, 358873, 361530, 364186, 367014, 369666, 371664, 372855, 373388, 373620, 374121, 375324]
53570C75324J640J351Q09O73O88K84j47L65J760K888L053K600J931J049J86j71
53554C94283p4M1L13J122J891J593N67L23J222J942J697J330J457J278K75m20
53538D08840K71J607K342K710L577M541M518L565K683K179J688J432K038L265
53524D45256M204M737N577O842P744P955Q204R170J0517J1464J1743J1680J1675
53511E56768J1891J2263J2676J3210J4119J5424J6784J7881J8756J9628K0610
53500G30010K1720K2819K3556K3806K4113K5080K6313K6859K6739K7039K8053
53489A006107K8531K7485K5745K4766K4723K4799K4759K5055K5679K5969K5563
53478A289181K4783K4094K3707K3626K3635K3414K2975K2633K2296K1401J9915
$$ y = [375324, 376964, 378315, 379124, 379797, 380485, 380769, 380622, 380987, 382747, 385635, 388688, 391288, 393219, 394268, 394454, 394283, 394209, 394250, 394563, 395685, 397576, 399169, 399736, 400059, 401281, 403223, 404920, 406250, 407707, 408985, 409260, 408840, 409111, 410718, 413060, 415770, 419347, 423888, 428406, 431971, 434654, 436833, 438521, 439953, 441991, 445256, 449460, 454197, 459774, 466616, 474360, 482315, 490519, 499689, 510206, 521670, 533413, 545093, 556768, 568659, 580922, 593598, 606808, 620927, 636351, 653135, 671016, 689772, 709400, 730010, 751730, 774549, 798105, 821911, 846024, 871104, 897417, 924276, 951015, 978054, 1006107, 1034638, 1062123, 1087868, 1112634, 1137357, 1162156, 1186915, 1211970, 1237649, 1263618, 1289181, 1313964, 1338058, 1361765, 1385391, 1409026, 1432440, 1455415, 1478048, 1500344, 1521745, 1541660]
53467A541660J8706J8268J7833J6511J4676J3280J2329J1115R573Q211O910M844
53455A693916J767j491m046n843p400r191j1375j3684j5530j6576j7130j7710
53443A575707j8389j8949j9456k0258k1480k2880k4070k4705k4690k4436k4554
53432A331840k5072k5317k4772k3602k2161k0590j9130j8056j6971j5013j2299
53421A108857j0236r660r579q684p247o311n683m207j759M41J595K262L307M854
53407A057950O584Q339J0150J2057J4071J6010J7538J8673J9973K1684K3215K4085
53395A250329K4990K6914K9551L1638L2886L4383L6912L9811M2004M3351M4495
53384A637264M5829M7220M8534M9880N1370N2842N4009N4850N5672N6578N7061
$$ y = [1541660, 1560366, 1578634, 1596467, 1612978, 1627654, 1640934, 1653263, 1664378, 1673951, 1682162, 1689072, 1693916, 1695683, 1694192, 1690146, 1684303, 1676903, 1667712, 1656337, 1642653, 1627123, 1610547, 1593417, 1575707, 1557318, 1538369, 1518913, 1498655, 1477175, 1454295, 1430225, 1405520, 1380830, 1356394, 1331840, 1306768, 1281451, 1256679, 1233077, 1210916, 1190326, 1171196, 1153140, 1136169, 1121156, 1108857, 1098621, 1088961, 1079382, 1070698, 1063451, 1057140, 1051457, 1047250, 1045491, 1045932, 1047527, 1049789, 1053096, 1057950, 1064534, 1072873, 1083023, 1095080, 1109151, 1125161, 1142699, 1161372, 1181345, 1203029, 1226244, 1250329, 1275319, 1302233, 1331784, 1363422, 1396308, 1430691, 1467603, 1507414, 1549418, 1592769, 1637264, 1683093, 1730313, 1778847, 1828727, 1880097, 1932939, 1986948, 2041798, 2097470, 2154048, 2211109]
53373B211109N6552N5373N4468N4145N3634N2253N0259M8082M5467M1952L7639
53362B760933L2857K7679K2460J8135J5140J2427Q579L548j606o317j0857j5354
53350B867624j9505k3293k7004l0488l3348l5907l9130m3306m7553n0782n2579
53339B464729n2978n2138n0587m9158m8345m7842m7037m5659m4043m2878m2700
53328A941364m3281m3659m3015m1419l9486l7640l5993l4582l3245l1509k9106
53317A528429k6364k3722k1206j8783j6837j5754j5361j5310j5608j6238j6617
53306A326629j6123j4829j3143j1155r017p460p023p041o320m631k718j050N16
53293A226635J990L123L998N008O211P446Q900J0823J2789J4126J5026J6397J8558
$$ y = [2211109, 2267661, 2323034, 2377502, 2431647, 2485281, 2537534, 2587793, 2635875, 2681342, 2723294, 2760933, 2793790, 2821469, 2843929, 2862064, 2877204, 2889631, 2898210, 2901758, 2900152, 2893835, 2882978, 2867624, 2848119, 2824826, 2797822, 2767334, 2733986, 2698079, 2658949, 2615643, 2568090, 2517308, 2464729, 2411751, 2359613, 2309026, 2259868, 2211523, 2163681, 2116644, 2070985, 2026942, 1984064, 1941364, 1898083, 1854424, 1811409, 1769990, 1730504, 1692864, 1656871, 1622289, 1589044, 1557535, 1528429, 1502065, 1478343, 1457137, 1438354, 1421517, 1405763, 1390402, 1375092, 1359484, 1343246, 1326629, 1310506, 1295677, 1282534, 1271379, 1262362, 1254902, 1247879, 1240838, 1234518, 1229887, 1227169, 1226119, 1226635, 1228625, 1231748, 1235746, 1240754, 1246965, 1254411, 1263311, 1274134, 1286923, 1301049, 1316075, 1332472, 1351030]
53280A351030K0892K2818K4340K5501K6036K5797K4995K3949K2984K2490K2463
53269A613295K2199K1077J9433J7984J6638J4738J2297J0009Q102O175M240K819
53257A769006J831L38k209n224p869r978j1830j3583j5301j7075j8761k0011k0713
53244A628621k1156k1692k2519k3693k4958k5729k5729k5411k5326k5304k4854
53233A362250k4069k3393k2809k2038k1305k1011k0895k0424j9833j9738j9865
53222A126870j9336j8139j7190j6733j5959j4448j2924j2074j1687j1396j1339
53211I65645j1490j1262j0433r848j0427j1917j3209j3645j3584j3875j4994j6548
53199H14413j7570j7552j6953j6367j5617j4305j2934j2402j2626j2684j2379
$$ y = [1351030, 1371922, 1394740, 1419080, 1444581, 1470617, 1496414, 1521409, 1545358, 1568342, 1590832, 1613295, 1635494, 1656571, 1676004, 1693988, 1710626, 1725364, 1737661, 1747670, 1755772, 1761947, 1766187, 1769006, 1770837, 1771175, 1768966, 1763742, 1755873, 1745895, 1734065, 1720482, 1705181, 1688106, 1669345, 1649334, 1628621, 1607465, 1585773, 1563254, 1539561, 1514603, 1488874, 1463145, 1437734, 1412408, 1387104, 1362250, 1338181, 1314788, 1291979, 1269941, 1248636, 1227625, 1206730, 1186306, 1166473, 1146735, 1126870, 1107534, 1089395, 1072205, 1055472, 1039513, 1025065, 1012141, 1000067, 988380, 976984, 965645, 954155, 942893, 932460, 922612, 912185, 900268, 887059, 873414, 859830, 845955, 830961, 814413, 796843, 779291, 762338, 745971, 730354, 716049, 703115, 690713, 678087, 665403, 653024]
53188F53024j2539j3566j4702j5171j5131j5096j5201j5405j5684j5705j5005
53177D89819j3749j2658j2051j1660j1409j1461j1353j0248q400p276p691q733
53165C63130r087q539p681o929o511o619o968o797n849m734l997l504l143l250
53151B79522l817m136l821l428l470l581l244k664k168j565p43k90o63j374j657
53136B42901j489j289j154j038j133j361j061O4J260J665J416J141R54P50R09
53121B42535J737K606K669K098J645J329M69j024k380l021l108k959k708k589
53107B37299k875l371l520l127k608k384k414k402k191j924j954k490l239l617
53093A99183l437l064k710k124j329j045j762k814l190k860k587k598k319j472
$$ y = [653024, 640485, 626919, 612217, 597046, 581915, 566819, 551618, 536213, 520529, 504824, 489819, 476070, 463412, 451361, 439701, 428292, 416831, 405478, 395230, 386830, 379554, 371863, 363130, 354043, 345504, 337823, 330894, 324383, 317764, 310796, 303999, 298150, 293416, 289419, 285915, 282772, 279522, 275705, 271569, 267748, 264320, 260850, 257269, 254025, 251361, 249193, 247628, 246885, 246595, 245932, 244558, 242901, 241412, 240123, 238969, 237931, 236798, 235437, 234376, 234440, 235700, 237365, 238781, 239922, 240876, 241626, 242535, 244272, 246878, 249547, 251645, 253290, 254619, 255088, 254064, 251684, 248663, 245555, 242596, 239888, 237299, 234424, 231053, 227533, 224406, 221798, 219414, 217000, 214598, 212407, 210483, 208529, 206039, 202800, 199183, 195746, 192682, 189972, 187848, 186519, 185474, 183712, 180898, 177708, 174848, 172261, 169663, 167344, 165872]
53079A65872n67q7J61N17P80M92l21j060j185p78m16n85j204j777j889j508q58
53062A55587k49O4P9J47N15Q97P94K22l93r55j753k647k911k195j064j97M02R08
53044A47251R84K29j003j883k048j791j430j030o31l58k28j86k95o47j116j370
53028A34448j166n75N5L32J27l02o46r13j205j329j025m70j20J5L37Q57J066P66
53010A30252M57O08J040J272J075M55m00r13m23R42K121K218J362K72o51j394
52994A38293j909j993j442k40J155J838J315K98L2O97J300J254J186J731K489
52979A46004K782K709K779L017L070K842K490K153K078K513L116L038K073J105
52965A81769R31J240J320J098P78J32r98j978k097j695j711k283k577k002q96
$$ y = [165872, 165305, 165218, 165379, 165896, 166676, 167168, 166847, 165787, 164602, 163824, 163408, 162823, 161619, 159842, 157953, 156445, 155587, 155338, 155402, 155481, 155628, 156143, 157040, 157834, 158056, 157663, 156708, 154955, 152308, 149397, 147202, 146138, 145941, 146343, 147251, 148235, 148464, 147461, 145578, 143530, 141739, 140309, 139279, 138648, 138290, 138062, 137876, 137581, 136934, 135818, 134448, 133282, 132707, 132762, 133094, 133221, 132919, 132273, 131360, 130155, 128826, 127801, 127331, 127211, 127226, 127563, 128420, 129486, 130252, 130709, 131317, 132357, 133629, 134704, 135159, 134759, 133846, 133423, 134365, 136486, 138704, 140066, 140338, 139687, 138293, 136384, 134391, 132949, 132709, 133864, 135702, 137017, 137315, 137347, 138044, 139344, 140598, 141784, 143515, 146004, 148786, 151495, 154274, 157291, 160361, 163203, 165693, 167846, 169924, 172437, 175553, 178591, 180664, 181769, 182700, 183940, 185260, 186358, 187136, 187268, 186270, 184292, 182195, 180500, 178789, 176506, 173929, 171927, 171031]
52950A71031m6Ro97j504j584q69k74n58j294j447p46J26M76K59j32k70j0L28K60
52931A63058j70l20J56Q05J024Q36N72L31J61L07P47R38N33k8j78k7K1LJ28J99
52911A69096n0l34k11J64L18K13K11M64Q71J358J809J981J850J691J446O69m73
52894A81073r23j54Q28Q68L96O81J767K437K099J476J310J412J311J019P61N21
52878A96882K49J00J97M51O61O95N57M53N87P86O32J91J00O01J000O81P0K7O53
52859B05573J419K050K533K606K103J569J721K383K726K442K033J995K331K834
52845B36318L253L271K779K073J372M35q71j992k394k415k756l309l336k671j937
52830B27820j662j834k226k558k468j901j461j737k394k589k106j562j535k063
$$ y = [171031, 170985, 170994, 170297, 168793, 167209, 166340, 166066, 165508, 164214, 162767, 162021, 162147, 162623, 162882, 162750, 162480, 162470, 162798, 163058, 162888, 162568, 162724, 163529, 164553, 165389, 165961, 166292, 166453, 166760, 167507, 168445, 168978, 168950, 168772, 168745, 168766, 168769, 168897, 169096, 169046, 168712, 168501, 168665, 168983, 169196, 169407, 169871, 170742, 172100, 173909, 175890, 177740, 179431, 180877, 181546, 181073, 180150, 179996, 180824, 181692, 182088, 182769, 184536, 186973, 189072, 190548, 191858, 193270, 194581, 195600, 196361, 196882, 197131, 197231, 197428, 197879, 198540, 199235, 199792, 200245, 200832, 201618, 202250, 202441, 202541, 203142, 204142, 204823, 204893, 204920, 205573, 206992, 209042, 211575, 214181, 216284, 217853, 219574, 221957, 224683, 227125, 229158, 231153, 233484, 236318, 239571, 242842, 245621, 247694, 249066, 249501, 248630, 246638, 244244, 241829, 239073, 235764, 232428, 229757, 227820, 226158, 224324, 222098, 219540, 217072, 215171, 213710, 211973, 209579, 206990, 204884, 203322, 201787, 199724]
52816A99724k796l162k640j425n27o49j286j545j377j235j061n37mq4o05q52q11
52799A79128j095j738k035j705j268j132j096r67r36j167j580k038k379k303j788
52784A55901j397j623k124k219j838j354r00n42o91j453j984j463l48L02L73M68
52768A39108N33Qq78j318j320j630k262k435k050j841j957j752j201j125j696
52753A18184j966j433q45r31j351j494j394j346j406j652k117k270j500l08O7
52738I8238n41r86o11j03n9l5L68O64M53J28o2n55j317j318j07J099J018O2n08
52719I5828m34l37l94l58m31r68j526j312l65N49J082J518J932K017J804J796
52703A00401K201K574K435J926J592J677J778J274Q6j123j700j702j561j352r42
$$ y = [199724, 196928, 193766, 191126, 189701, 189174, 188525, 187239, 185694, 184317, 183082, 182021, 181484, 181480, 181396, 180791, 179939, 179128, 178033, 176295, 174260, 172555, 171287, 170155, 169059, 168092, 167156, 165989, 164409, 162371, 159992, 157689, 155901, 154504, 152881, 150757, 148538, 146700, 145346, 144446, 143904, 143213, 141760, 139776, 138313, 137965, 138267, 138640, 139108, 139641, 139649, 138771, 137453, 136133, 134503, 132241, 129806, 127756, 125915, 123958, 122206, 121005, 119880, 118184, 116218, 114785, 113940, 113009, 111658, 110164, 108770, 107424, 106018, 104366, 102249, 99979, 98479, 98171, 98238, 97697, 96711, 96100, 95997, 95938, 95903, 96271, 96935, 97388, 97516, 97454, 96899, 95582, 94264, 94157, 95256, 96274, 96336, 95828, 95394, 95057, 94663, 94305, 93874, 92906, 91380, 90068, 89703, 90252, 91334, 92852, 94784, 96801, 98605, 100401, 102602, 105176, 107611, 109537, 111129, 112806, 114584, 115858, 115944, 114821, 113121, 111419, 109858, 108506, 107564]
52688A07564o76j068j861k143j609r37p74j026j375j730j887j486o69j14j01j99
52672H9909j21j76n62r38j077j232j492j470j030o38n88n23j31K90L64J41k45
52655H0481p57j112r03l76k87p46j053q67o68o84m90j7J27j14J53J261K195K123
52637G8266J621J524J548J083L91j7l63q95j068n09l9m21r26l86Q30J369R85O84
52619H3677J005J405J357R06J98n36o75J12J029R56k5q66j072r37n06M86J547
52602H8061J599M93o57r08m23K57R59J543J677J373J089J028R20P03P26J038J133
52585A00611Q21O28R13J184R10N14Q74J954K673K250J186O62J102J762J743J117
52569A20904P05R76J660K311K770K874K392J574J232J727K320K105J246O48O00
$$ y = [107564, 106888, 105820, 103959, 101816, 100207, 99270, 98496, 97470, 96095, 94365, 92478, 90992, 90323, 90209, 90108, 89909, 89788, 89612, 89050, 88112, 87035, 85803, 84311, 82841, 81811, 81173, 80585, 80062, 79931, 80221, 80585, 80726, 80481, 79724, 78612, 77709, 77333, 77046, 76300, 75247, 74380, 73712, 73028, 72538, 72521, 72648, 72534, 72687, 73948, 76143, 78266, 79887, 81411, 82959, 84042, 84433, 84416, 84053, 83158, 82090, 81581, 81542, 81121, 80195, 79809, 80639, 82008, 82993, 83677, 84682, 86087, 87444, 88350, 88548, 88012, 87337, 87449, 88478, 89434, 89409, 88543, 87471, 86534, 86028, 86514, 88061, 89660, 90153, 89496, 88588, 88165, 88422, 89381, 90924, 92601, 93974, 95063, 96091, 97011, 97714, 98440, 99478, 100611, 101432, 102060, 102973, 104157, 105067, 105581, 106455, 108409, 111082, 113332, 114518, 115180, 116282, 118044, 119787, 120904, 121609, 122585, 124245, 126556, 129326, 132200, 134592, 136166, 137398, 139125, 141445, 143550, 144796, 145444, 146044]
52554A46044M56k44j003r56N8J282J828J555J114J086J263J041M25O3L00P30Q56
52537A55898O64L70J08R6N41J108J126O02L27O25P84K54m39n99m65n43o22l00
52519A59535M5j68o23o04k30j77m76o00n29o34o51N9J197J560O45p06j558j849
52501A54236j793j249k24O46P76M05J42J33J29J86O86J643K439K479J900J414
52485A63948J427J632J580J285R87O60J88j56p4P5k47p01m83K57M53r0k24O31
52467A71148J396J026K33K61R44J266J179J377J732J452O09J82M94Q67Q09M61
52451A85436j74j225k118j883n42P90J384J504J376P33k95r42r42r56j379j612
52435A79155j171o55p77j163r75l16n2m80r43q38l47l1j15m66r11j335j508j138
$$ y = [146044, 146500, 146256, 145253, 144297, 144355, 145637, 147465, 149020, 150134, 151220, 152483, 153524, 153949, 154012, 154312, 155042, 155898, 156562, 156932, 157040, 157136, 157677, 158785, 159911, 160513, 160840, 161465, 162249, 162503, 162064, 161465, 161000, 160457, 159835, 159535, 159580, 159412, 158789, 158185, 157955, 157778, 157302, 156702, 156173, 155539, 154888, 154947, 156144, 157704, 158349, 157643, 156085, 154236, 152443, 151194, 150970, 151616, 152392, 152797, 152939, 153072, 153201, 153387, 154073, 155716, 158155, 160634, 162534, 163948, 165375, 167007, 168587, 169872, 170859, 171519, 171707, 171551, 171477, 171552, 171305, 170604, 170121, 170378, 170831, 170741, 170517, 171148, 172544, 173570, 173803, 174064, 175008, 176274, 177453, 178830, 180562, 182014, 182623, 182805, 183299, 184166, 184975, 185436, 185262, 184037, 181919, 180036, 179494, 180284, 181668, 183172, 184548, 185281, 184986, 184044, 183102, 182146, 180767, 179155, 177984, 177329, 176552, 175389, 174414, 174098, 174046, 173566, 172623, 171785, 171438, 171407, 171292, 170826, 169915, 168580, 167072, 165934]
52417A65934k56O26R25N50j81r95j716j911j161J89J136J159P21L82Q2k35j05
52400A65144O41J176P02k53m55L88J455K084K299K191J677R87O61R14J450J879
52384A82940J934J494Q27N39Q04J057R87J179K057K856K699K085K079K439K042
52369B08018R67N74J386K352K595K550K817L131L030K633K139J489J002J417K698
52354B38798L666L548L083L323L971L837K600J278R55J572K203K195J877J983
52340B74889K508K623J958J342J589K221K243J798J787K165K004J230R75J789
52326C01121K826L220L127K893K373J617J256J510J784J802K188L249M203M417
52312C37586M445N025N866O398O852P666Q419Q527Q404Q877R878J0736J1379J2237
$$ y = [165934, 165678, 166304, 167229, 167779, 167598, 166603, 164887, 162976, 161815, 162004, 163140, 164299, 165020, 165402, 165484, 165249, 165144, 165785, 166961, 167663, 167410, 166955, 167343, 168798, 170882, 173181, 175372, 177049, 178036, 178697, 179611, 181061, 182940, 184874, 186368, 187195, 187734, 188538, 189595, 190582, 191761, 193818, 196674, 199373, 201458, 203537, 205976, 208018, 208985, 209559, 210945, 213297, 215892, 218442, 221259, 224390, 227420, 230053, 232192, 233681, 234683, 236100, 238798, 242464, 246012, 249095, 252418, 256389, 260226, 262826, 264104, 265059, 266631, 268834, 271029, 272906, 274889, 277397, 280020, 281978, 283320, 284909, 287130, 289373, 291171, 292958, 295123, 297127, 298357, 299332, 301121, 303947, 307167, 310294, 313187, 315560, 317177, 318433, 319943, 321727, 323529, 325717, 328966, 333169, 337586, 342031, 347056, 352922, 359320, 366172, 373838, 382257, 390784, 399188, 408065, 417943, 428679, 440058, 452295]
52298D52295J3152J3545J3549J3950J4965J5963J6512J6902J7439J7913J8070
52287F24255J8017J8002J8112J8360J8718J8983J8937J8631J8239J7695J6813
52276H24762J5718J4739J3895J2851J1509J0255R490R137Q770Q031O779N025K990
52263I53951J168K8m67q97j639k261k091j369j214k158l299l477k766k134j923
52248I29452j641j069o67o46m32N72K237L916N068N569N841O658Q307J0022J0840
52233I84027J0925J1281J2220J3045J3297J3344J3431J3122J2136J0944J0072
52222A117844R516R175R044Q636P090M433J925N37j61j050k186l190m122n196
52208A152295o124o596o925p588q500r375j0296j1302j1893j1646j0880j0120
$$ y = [452295, 465447, 478992, 492541, 506491, 521456, 537419, 553931, 570833, 588272, 606185, 624255, 642272, 660274, 678386, 696746, 715464, 734447, 753384, 772015, 790254, 807949, 824762, 840480, 855219, 869114, 881965, 893474, 903729, 913219, 922356, 931126, 939157, 945936, 950961, 953951, 955119, 955147, 954680, 953783, 952144, 949883, 947792, 946423, 945209, 943051, 939752, 936275, 933509, 931375, 929452, 927811, 926742, 926075, 925429, 924997, 925569, 927806, 931722, 936790, 942359, 948200, 954858, 963165, 973187, 984027, 994952, 1006233, 1018453, 1031498, 1044795, 1058139, 1071570, 1084692, 1096828, 1107772, 1117844, 1127360, 1136535, 1145579, 1154215, 1161305, 1165738, 1167663, 1168200, 1168039, 1166989, 1164803, 1161613, 1157491, 1152295, 1146171, 1139575, 1132650, 1125062, 1116562, 1107187, 1096891, 1085589, 1073696, 1062050, 1051170, 1041050]
52196A041050r385q608q102p925p416o153m821m254m086l397k205j376j287j614
52182I70421k145k832l247k982k456k344k379j794q51p27j733k749k809k265j979
52167I37129k170k560k980l347l481l382l312l357l333l271l539m207m781m800
52153H88609m297l536k718k205k456l421m371m663m368l932l616l510l666l920
52139H37930l931l711l752m251m590m137l219k791l184l811m087m052l951l762
52125G84701l461l415m015n047n781n687m826l630k568j974j855j774j172K4J331
52110G40851K292K906L352L622L694L827M412N579P167Q928J0588J1891J2849
52097H21958J3795J5065J6714J8578K0279K1196K1014K0447K0765K2200K3544
$$ y = [1041050, 1031665, 1023057, 1014955, 1007030, 999614, 993461, 988640, 984386, 980300, 976903, 974698, 973322, 972035, 970421, 968276, 965444, 962197, 959215, 956759, 954415, 952036, 950242, 949391, 948664, 946931, 944182, 941373, 939108, 937129, 934959, 932399, 929419, 926072, 922591, 919209, 915897, 912540, 909207, 905936, 902397, 898190, 893409, 888609, 884312, 880776, 878058, 875853, 873397, 869976, 865605, 860942, 856574, 852642, 849026, 845516, 841850, 837930, 833999, 830288, 826536, 822285, 817695, 813558, 810339, 807548, 804364, 800553, 796466, 792414, 788463, 784701, 781240, 777825, 773810, 768763, 762982, 757295, 752469, 748839, 746271, 744297, 742442, 740668, 739496, 739520, 740851, 743143, 746049, 749401, 753023, 756717, 760544, 764956, 770535, 777702, 786630, 797218, 809109, 821958, 835753, 850818, 867532, 886110, 906389, 927585, 948599, 969046, 989811, 1012011, 1035555]
52086A035555K3890K3913K4538K5159K4516K2801K1414K0695J9446J7016J4389
52075A273332J2658J1589J0362Q783P091N388L857K752J722q2k654m762n610o022
52061A318404p162q834r945j0049r538q806q105p837q149q484q247p610p062o544
52047A202032n695m563l380k041m98O79R83Q91J311K419L695M839N780O120N541
52032A218113M661M545N283N917N790N229M730M256L551K603J552N84o1l80q70
52017A265503j972l317m141m498n269o850q511r520j0200j1305j2811j4017j4796
52004A158296j5917j7912k0110k1412k1793k2351k3756k5307k5935k5599k5047
51993I13157k4682k4429k4445k4992k5652k5652k5009k4429k4061k3460k2859
$$ y = [1035555, 1059445, 1083358, 1107896, 1133055, 1157571, 1180372, 1201786, 1222481, 1241927, 1258943, 1273332, 1285990, 1297579, 1307941, 1316724, 1323815, 1329203, 1333060, 1335812, 1337534, 1337452, 1334798, 1330036, 1324426, 1318404, 1311242, 1302408, 1292463, 1282414, 1272876, 1264070, 1255965, 1248128, 1239979, 1231495, 1223248, 1215638, 1208576, 1202032, 1196337, 1191774, 1188394, 1186353, 1185855, 1186534, 1187517, 1188408, 1189719, 1192138, 1195833, 1200672, 1206452, 1212572, 1218113, 1222774, 1227319, 1232602, 1238519, 1244309, 1249538, 1254268, 1258524, 1262075, 1264678, 1266230, 1266814, 1266753, 1266373, 1265503, 1263531, 1260214, 1256073, 1251575, 1246306, 1239456, 1230945, 1221425, 1211225, 1199920, 1187109, 1173092, 1158296, 1142379, 1124467, 1104357, 1082945, 1061152, 1038801, 1015045, 989738, 963803, 938204, 913157, 888475, 864046, 839601, 814609, 788957, 763305, 738296, 713867, 689806, 666346, 643487]
51982F43487k3172k4196k4287k2624k0518j9471j9084j8115j6638j5668j5301
51971D24413j4661j3357j1707r871p954o711o808p631q026p967q232q625q075
51958C04788o523n224m793m376l307k283k159k567k627k298k230k707l359l670
51944B56665l377k594j808j443j373j216j052j235j517j164k04L19k33j117j271
51929B37380q11p27j368k020j984j484j283j678k167k103j466q98r63j617k302
51914B14509k437j774o29J30k55j602k820l090k609k011j565j244j162j400j724
51899A90317j876j824j469o28L31M63n25j649j903j576j545j840j806j347r12
51884A72211o35m16n51j252j845j532p75o85j161r58K66J304J230O65O18J000
$$ y = [643487, 620315, 596119, 571832, 549208, 528690, 509219, 490135, 472020, 455382, 439714, 424413, 409752, 396395, 384688, 374817, 366863, 360152, 353344, 345713, 337687, 329720, 321488, 312863, 304788, 298265, 293041, 288248, 283872, 280565, 278282, 276123, 273556, 270929, 268631, 266401, 263694, 260335, 256665, 253288, 250694, 248886, 247443, 246070, 244854, 243802, 242567, 241050, 239886, 239682, 240001, 239768, 238651, 237380, 236569, 235842, 234474, 232454, 230470, 228986, 227703, 226025, 223858, 221755, 220289, 219391, 218428, 216811, 214509, 212072, 210298, 209669, 209799, 209544, 207942, 205122, 202032, 199423, 197412, 195847, 194603, 193441, 192041, 190317, 188441, 186617, 185148, 184520, 184851, 185314, 184789, 183140, 181237, 179661, 178116, 176276, 174470, 173123, 172211, 171576, 171160, 170609, 169357, 167512, 165980, 165205, 164520, 163359, 162401, 162667, 163971, 165201, 165866, 166484, 167484]
51868A67484J043N18j31n19o53p01p11n19M1P01Q77O21Q67K082L150K693J188
51851A78031M85J277K393K787K813L003K860J788L40l68l9P15J245J203M53p60
51835A98226j657j574o84J59K98j49m94k22M34P81N89M12O67R54P90N14P47J294
51817B01085J447J074O20K90J20M89J474K069J246l10r80n92n24j311j801j209
51801B03187m05l16m61p9M43L85M4J33M48K39m84r33n90L23J255J746J733J688
51783B08356K083K516K079P65k61k43K44M43O18J299K089K143J435P39O64J251
51767B26220K230L118L339K814K136J881K063K483L088L674L816L527L394L721
51753B67504M096M260M673N757P061P762P499O364M672L102K371K317J887N58
$$ y = [167484, 168527, 169045, 168914, 168395, 167742, 167041, 166330, 165811, 165852, 166553, 167430, 168051, 168918, 171000, 174150, 176843, 178031, 178516, 179793, 182186, 184973, 187786, 190789, 193649, 195437, 195777, 195409, 195370, 196085, 197330, 198533, 198986, 198226, 196569, 194995, 194311, 194470, 194768, 194619, 194125, 193903, 194337, 195118, 195707, 196119, 196786, 197740, 198530, 199044, 199791, 201085, 202532, 203606, 204226, 204516, 204636, 205125, 206599, 208668, 209914, 209604, 208624, 208032, 207508, 206197, 204396, 203187, 202782, 202466, 202005, 201926, 202369, 202754, 202798, 202931, 203379, 203618, 203134, 202201, 201611, 201934, 203189, 204935, 206668, 208356, 210439, 212955, 215034, 215799, 215538, 215295, 215539, 215982, 216600, 217899, 219988, 222131, 223566, 224305, 224969, 226220, 228450, 231568, 234907, 237721, 239857, 241738, 243801, 246284, 249372, 253046, 256862, 260389, 263783, 267504, 271600, 275860, 280533, 286290, 293351, 301113, 308612, 314976, 319648, 322750, 325121, 327438, 329325, 329883]
51739C29883r70j875k186k150j542m20L32J65j68K66J147J571J530J566J462N95
51723C29206o54j100m21M44P27P05Q90J113Q48K3q90j431j650k047k891l602l317
51706C15953k169j378j655k196j871q42k20n17j251j869k245k336k080j636j191
51691B92497n97L67J534K523L267L903M411M883N875P796R937J0684Q950N149
51677C61179P61k804m990n993o168n593m407l183k463k046j350m79j63m95o32
51662C21174j18L82J24o77j403j942k498l162m167n843p719q493p601o126n383
51647B66548n349n289n097n017m780m097l464l417l464k904k194k286k928k969
51633B13293k161j390j155r87n42j63j22k09k67m03n19l92k72o76j483j930j606
$$ y = [329883, 328913, 327038, 324852, 322702, 321160, 320740, 321072, 321237, 321069, 321335, 322482, 324053, 325583, 327149, 328611, 329206, 328552, 327452, 327031, 327475, 328202, 328907, 329797, 330910, 331758, 331781, 330891, 329460, 327810, 325763, 322872, 319270, 315953, 313784, 312406, 310751, 308555, 306684, 305842, 305622, 305105, 303854, 301985, 299740, 297404, 295324, 293688, 292497, 291900, 292267, 293801, 296324, 299591, 303494, 307905, 312788, 318663, 326459, 336396, 347080, 356030, 361179, 361940, 359136, 354146, 348153, 341985, 336392, 331985, 328802, 326339, 324293, 322943, 322464, 322301, 321806, 321174, 321056, 321438, 321562, 320885, 319482, 317540, 315042, 311880, 307713, 301870, 294151, 285658, 278057, 271931, 266548, 261199, 255910, 250813, 245796, 241016, 236919, 233455, 230038, 226574, 223670, 221476, 219190, 216262, 213293, 211132, 209742, 208587, 207600, 207058, 206895, 206773, 206564, 206297, 205894, 205375, 204983, 204711, 204035, 202552, 200622, 199016]
51616A99016q39j04L59L95N7j72Q9M71L68q5l06k83m73q10p88n05o08j043r16
51597A93823J66J512K387K873L228L201K534J657J351J915K991M008M669N111
51583B31426N670O284O421N895N353N409N589M856L086J246J51k16j94l8j75j065
51567B79698k493l618l925l670l199k465j413l40M19Q32J075J321J767K477L207
51552B69673L689L998M371M775N005N022M802M158L216K642K811L064K584J632
51538C21442J070Q85L41n75r96o39k28j55K30J407K740L344L229K851K168Q73
51522C37987p88k073k583k569k497k591k782k932l090l498m126m402l793k632
51508B97631j895k134k985l716l880l483k870k506k496k414j890j209q54p24l68
$$ y = [199016, 198177, 198073, 198432, 198827, 198884, 198712, 198801, 199272, 199640, 199555, 199249, 198966, 198493, 197683, 196895, 196390, 195782, 194739, 193823, 193989, 195501, 197888, 200761, 203989, 207190, 209724, 211381, 212732, 214647, 217638, 221646, 226315, 231426, 237096, 243380, 249801, 255696, 261049, 266458, 272047, 276903, 279989, 281235, 281386, 281170, 280976, 280938, 280763, 279698, 277205, 273587, 269662, 265992, 262793, 260328, 258915, 258575, 258994, 259826, 260901, 262222, 263989, 266466, 269673, 273362, 277360, 281731, 286506, 291511, 296533, 301335, 305493, 308709, 311351, 314162, 317226, 319810, 321442, 322512, 323397, 323738, 323163, 322167, 321528, 321300, 321145, 321375, 322782, 325522, 328866, 332095, 334946, 337114, 337987, 337199, 335126, 332543, 329974, 327477, 324886, 322104, 319172, 316082, 312584, 308458, 304056, 300263, 297631, 295736, 293602, 290617, 286901, 283021, 279538, 276668, 274162, 271666, 269252, 267362, 266153, 265299, 264575, 264207]
51493B64207J80M96N78Q40J301J471J187R08J066J639K345K767K415J384P60J524
51477B85068L082L850L392K948L535M591N102N158N541O359O941O837O314N930
51463C54648O009O446O771O548N865N202M780M365L802L337L168L079K686J914
51449D18620J064N81P08J116J061K50n91n23L28R24O55j41j034k170l700n174
51433D11974n972o109o234o930q092q980q915p990o904o077n360m821n006n828
51419C18756n962m317j721l1J18l58o87r69j230r60k7J007J853K856M067M770
51403C17165M429L430K567K220K246K096J051j015l160m361m868n686o893p637
51389C01584p769q100q773q823p836o768o450o366n775m979m638m680m655m511
$$ y = [264207, 264387, 264883, 265461, 266301, 267602, 269073, 270260, 271168, 272234, 273873, 276218, 278985, 281400, 282784, 283544, 285068, 288150, 292000, 295392, 298340, 301875, 306466, 311568, 316726, 322267, 328626, 335567, 342404, 348718, 354648, 360657, 367103, 373874, 380422, 386287, 391489, 396269, 400634, 404436, 407773, 410941, 414020, 416706, 418620, 419684, 420265, 420973, 422089, 423150, 423400, 422809, 422286, 422614, 423538, 424193, 424052, 423018, 420848, 417148, 411974, 406002, 399893, 393659, 386729, 378637, 369657, 360742, 352752, 345848, 339771, 334411, 329590, 324584, 318756, 312794, 308477, 306756, 306725, 306843, 306485, 305798, 304829, 303599, 302639, 302612, 303619, 305472, 308328, 312395, 317165, 321594, 325024, 327591, 329811, 332057, 334153, 335204, 334189, 331029, 326668, 321800, 316114, 309221, 301584, 293815, 285715, 276942, 268119, 260283, 253515, 247065, 240699, 234924, 229945, 225307, 220627, 215972, 211461]
51375B11461m288l748k919k319k114j833j480j877l193m125l539k143j470j802
51361A74611k205k128j823j510j080o11l49k65j94k67o72j193j457j406j159p11
51345A57581j79P5m9j75n6O0O8K94Q30J188J121J079J349J573J647K232L461M119
51327A76218L236J783J621L098M863N725N574M742L642L036L481M385M486L427
51313B29317K053J029Q2j195k513l320l548l540l585l784m177m765n448n999o136
51298A84471n728m977m223l572l027k831l133l316k472p70M73M84o2l17m93j031
51282A49476j414q57K53P22Q5j047j929k217j853j200j014j558j979j376j52M69
51266A34409K1r19j681j937j386m1J282J612R94K74q8k49k23J41M67J92m22m64
$$ y = [211461, 207173, 203425, 200506, 198187, 196073, 194240, 192760, 190883, 187690, 183565, 180026, 177883, 176413, 174611, 172406, 170278, 168455, 166945, 165865, 165254, 164905, 164640, 164446, 164179, 163507, 162314, 160857, 159451, 158292, 157581, 157402, 157477, 157428, 157253, 157197, 157257, 157325, 157619, 158449, 159637, 160758, 161837, 163186, 164759, 166406, 168638, 172099, 176218, 179454, 181237, 182858, 185956, 190819, 196544, 202118, 206860, 210502, 213538, 217019, 221404, 225890, 229317, 231370, 232399, 232481, 231286, 228773, 225453, 221905, 218365, 214780, 210996, 206819, 202054, 196606, 190607, 184471, 178743, 173766, 169543, 165971, 162944, 160113, 156980, 153664, 151192, 150422, 150895, 151379, 151317, 151000, 150507, 149476, 148062, 147205, 147458, 148180, 148265, 147218, 145289, 143072, 141219, 140019, 139005, 137447, 135468, 134092, 133940, 134409, 134430, 133511, 131830, 129893, 128507, 128466, 129748, 131360, 132354, 132628, 132540, 132291, 132068, 132209, 132676, 132868, 132446, 131982]
51248A31982K16P42N19o7n04q52j217j323j052p94q60j015r29o29j85N46J505
51231A26083K166K054J284L16n04r56q57k33N92J321J856K092J771Q66p7k84M96
51214A37986J686K375K173J572J365J730K072J820J082L77K4%J66L32K92L2k26
51197A54858l95o24r65j189j118q53m78M8N46O90O45J006J816K221J635O17J3
51180A58473j42l18n56p05j006j599j882j257k73q5q31j503j357o55k4J71k40
51163A46211j178k080k324j981j638j478j151n51q4q9m63r41j230r89k02M81L56
51146A30669m10r67q83n06k76k11j38J18P27J659K470K690K344J758J107N39M14
51129A41104Q12J146Q36J22m01p08j097j393j294j158j504j914j524n34j15p24
$$ y = [131982, 132198, 132940, 133459, 133392, 132888, 132036, 130819, 129496, 128444, 127650, 126790, 125775, 124846, 124217, 124032, 124578, 126083, 128249, 130303, 131587, 131903, 131399, 130443, 129586, 129353, 129945, 131266, 133122, 135214, 136985, 137851, 137774, 137490, 137986, 139672, 142047, 144220, 145792, 147157, 148887, 150959, 152779, 153861, 154238, 154262, 154262, 154428, 154760, 155052, 155084, 154858, 154463, 153839, 152874, 151685, 150567, 149714, 149236, 149284, 149830, 150520, 151165, 152171, 153987, 156208, 157843, 158460, 158473, 158331, 158013, 157457, 156752, 155746, 154147, 152265, 151008, 150735, 150650, 149819, 148316, 146959, 146304, 146280, 146451, 146211, 145033, 142953, 140629, 138648, 137010, 135532, 134381, 133830, 133746, 133657, 133194, 132253, 131023, 130034, 129832, 130313, 130669, 130259, 129292, 128409, 127903, 127627, 127416, 127278, 127396, 128123, 129782, 132252, 134942, 137286, 139044, 140151, 140690, 141104, 141916, 143062, 143898, 144020, 143619, 142911, 141814, 140421, 139127, 137969, 136465, 134551, 133027, 132493, 132378, 131654]
51113A31654j542j787j551j052j00J157J853J405L76j92N7O49R58P68M00M19R35
51096A34407J367J267J091J537K295K449J889J399J210O23n93j530j392n78J04
51081A45545N45R46J008L41o16q83r7J097J835J871J595J454J453J339J139J187
51065A59759J407J106K3r38p42L36J144J296J338J384Q64j56n66K87J589K200
51049A70331K098K022K279K510K387J973J605J595J801J504K57j168j434m04N22
51034A87878K17q26j429j199n26K75J017J328J015N64O05J054J267R46N02M85
51018A93173R63J493J637J487J616K278K904K744J946J337J221J062N50K45P94
51003B15450K024L303M320N103N605N707N462N105M898N043N571O280P002P868
$$ y = [131654, 130112, 128325, 126774, 125722, 125622, 126779, 128632, 130037, 130413, 130221, 130278, 130927, 131885, 132653, 133053, 133472, 134407, 135774, 137041, 138132, 139669, 141964, 144413, 146302, 147701, 148911, 149534, 148941, 147411, 146019, 145441, 145545, 146090, 147036, 148044, 148385, 147769, 146886, 146789, 147886, 149721, 151592, 153187, 154641, 156094, 157433, 158572, 159759, 161166, 162272, 162295, 161357, 160615, 160951, 162095, 163391, 164729, 166113, 166977, 166821, 166255, 166542, 168131, 170331, 172429, 174451, 176730, 179240, 181627, 183600, 185205, 186800, 188601, 190105, 190362, 189194, 187760, 187356, 187878, 188095, 187269, 185840, 184641, 184115, 184390, 185407, 186735, 187750, 188314, 188919, 189973, 191240, 192186, 192688, 193173, 194136, 195629, 197266, 198753, 200369, 202647, 205551, 208295, 210241, 211578, 212799, 213861, 214411, 214656, 215450, 217474, 220777, 225097, 230200, 235805, 241512, 246974, 252079, 256977, 262020, 267591, 273871, 280873, 288741]
50989B88741R046J0270J1097J1483J1759J2100J2577J3405J4634J5848J6848J8392
50977D46200K1261K4863K7841L0096L2909L6900M1063M4322M6956M9883N3442
50966H55736N7422O1522O5108O7386O8313O8677O8817O8011O5613O1958N7576
50955A566139N2345M6137L9401L2488K5073J7077R421L104j889o034r243j1193
50943A762826j2028j2003j0977r070p265o464o463o662p314r145j2255j6254k1052
50930A625874k6614l2347l7691m2969m8621n3967n7795n9982o1398o2296o1934
50919A080260n9917n6922n3698n0228m6262m2014l7986l4443l1334k8424k5429
50908F13603k2278j9235j6490j3820j1022q463o731n816n103m099k787j368j74
$$ y = [288741, 297787, 308057, 319154, 330637, 342396, 354496, 367073, 380478, 395112, 410960, 427808, 446200, 467461, 492324, 520165, 550261, 583170, 620070, 661133, 705455, 752411, 802294, 855736, 913158, 974680, 1039788, 1107174, 1175487, 1244164, 1312981, 1380992, 1446605, 1508563, 1566139, 1618484, 1664621, 1704022, 1736510, 1761583, 1778660, 1788081, 1791185, 1789296, 1783262, 1774019, 1762826, 1750798, 1738795, 1727818, 1718748, 1711483, 1705019, 1698556, 1691894, 1684580, 1675435, 1663180, 1646926, 1625874, 1599260, 1566913, 1529222, 1486253, 1437632, 1383665, 1325870, 1265888, 1204490, 1142194, 1080260, 1020343, 963421, 909723, 859495, 813233, 771219, 733233, 698790, 667456, 639032, 613603, 591325, 572090, 555600, 541780, 530758, 522295, 515564, 509748, 504645, 500546, 497759, 496391, 496217]
50895D96217L75J53l49n61m91m53l18M00J759L223M293M861N047N141N603O618
50879E31518P661Q003P699P646Q564J0312J2173J3595J4541J5415J6647J8213
50867F71987J9725K1127K3025K5937K9493L2922L6208M0227M5652N2167N8969
50856A057439O5715P2714Q0324Q8476R6934J05801J15349J25218J34278J41762
50846B084010J48021J53573J57726J59168J57683J53952J47524J36462J19886
50837C418005R9630P8458N7601L7118J7676M51j4219k6563l5950m1142m2024l9765
50825C509276l5136k7910j8439q719j189K929L566P37n776j5948k9219m4615o0922
50812C268635p6971r2082j06163j19211j30668j39509j44950j47088j46599j43772
$$ y = [496217, 496592, 496745, 496396, 495835, 495344, 494891, 494573, 494973, 496732, 499955, 504248, 509109, 514156, 519297, 524900, 531518, 539179, 547182, 554881, 562527, 571091, 581403, 593576, 607171, 621712, 637127, 653774, 671987, 691712, 712839, 735864, 761801, 791294, 824216, 860424, 900651, 946303, 998470, 1057439, 1123154, 1195868, 1276192, 1364668, 1461602, 1567403, 1682752, 1807970, 1942248, 2084010, 2232031, 2385604, 2543330, 2702498, 2860181, 3014133, 3161657, 3298119, 3418005, 3517635, 3596093, 3653694, 3690812, 3708488, 3708939, 3694720, 3668157, 3632207, 3591065, 3549041, 3509276, 3474140, 3446230, 3427791, 3419072, 3417883, 3420812, 3424378, 3425115, 3419339, 3403391, 3374172, 3329557, 3268635, 3191664, 3099582, 2993419, 2874208, 2743540, 2604031, 2459081, 2311993, 2165394, 2021622]
50802B021622j38174j29585j19070j08388r8378q8514p8222o7901n8317m9730
50792A085343m2047l5285k9370k3986j9038j4731j0914p100l490j010J74J176
50780H99722K515K962J430r19k037j819j923l184m885o483q244r957j0680j0332
50766H46166j0104j0652j1074j0449r235q266p275n407k703r4J863L485N330P564
50752G89149J0010J2467J4923J7526K0314K3046K5485K7708K9930L2169L4434
50741A037161L6943L9863M3130M6990N2208N9043O6437P3136P9298Q5936R2910
50730A713055R8700J02282J03986J04164J02203R7443R0156Q0818O9192N4955
50720B616954L8743K1863N305j0510k5233l8253m8688n5493n7942n6286n1627
$$ y = [2021622, 1883448, 1753863, 1634793, 1526405, 1428027, 1339513, 1261291, 1193390, 1135073, 1085343, 1043296, 1008011, 978641, 954655, 935617, 920886, 909972, 902872, 899382, 898372, 898546, 899722, 902237, 905199, 906629, 905710, 903673, 901854, 899931, 896747, 891862, 885379, 877135, 867178, 856498, 846166, 836062, 825410, 814336, 803887, 794652, 786386, 779111, 773704, 771001, 770907, 772770, 776255, 781585, 789149, 799159, 811626, 826549, 844075, 864389, 887435, 912920, 940628, 970558, 1002727, 1037161, 1074104, 1113967, 1157097, 1204087, 1256295, 1315338, 1381775, 1454911, 1534209, 1620145, 1713055, 1811755, 1914037, 2018023, 2122187, 2224390, 2321833, 2411989, 2492807, 2561999, 2616954, 2655697, 2677560, 2682865, 2672355, 2647122, 2608869, 2560181, 2504688, 2446746, 2390460, 2338833]
50709B338833m5071l7357k9311k1871j5449r849n224k598k964o432j2538k0963
50697B129206l1399m3046n4736o5386p4228q0858q5310q7745q7949q5612q1131
50686A351806p5563o9560o2960n5765m8785m2719l7199l1300k4790j8308j2606
50675H72251p970m072k2M999J0671J5478J8320J9836K1450K3462K4865K4930K4114
50662A048312K3108K1823J9880J7671J6166J5721J5562J4779J3476J2549J2515
50651A231562J3039J3739J4853J6713J8946K0878K2471K4310K6596K8921L1042
50640A463070L3297L5928L8557M0673M2242M3387M3860M3265M1574L9061L5809
50629A900723L1698K6837K1709J6811J2281P983L883L19k161l176k639m93L334
$$ y = [2338833, 2293762, 2256405, 2227094, 2205223, 2189774, 2179925, 2174701, 2172103, 2169139, 2162707, 2150169, 2129206, 2097807, 2054761, 2000025, 1934639, 1860411, 1779553, 1694243, 1606498, 1518549, 1432937, 1351806, 1276243, 1206683, 1143723, 1087958, 1039173, 996454, 959255, 927955, 903165, 884857, 872251, 864281, 860209, 860187, 865186, 875857, 891335, 909655, 929491, 950941, 974403, 999268, 1024198, 1048312, 1071420, 1093243, 1113123, 1130794, 1146960, 1162681, 1178243, 1193022, 1206498, 1219047, 1231562, 1244601, 1258340, 1273193, 1289906, 1308852, 1329730, 1352201, 1376511, 1403107, 1432028, 1463070, 1496367, 1532295, 1570852, 1611525, 1653767, 1697154, 1741014, 1784279, 1825853, 1864914, 1900723, 1932421, 1959258, 1980967, 1997778, 2010059, 2018042, 2021925, 2022244, 2020083, 2016907, 2014268, 2013775, 2017109]
50616B017109Q487J3943J8554K1759K3549K3888K2660K0076J6627J2675Q347L843
50604B211517o47n280j0487j6477k3196l0632l8794m7283n5297o2218o7853p2181
50592A781172p5109p6524p6297p4317p0807o6515o2272n8421n4901n1570m8125
50581A066314m4098l9429l4744l0491k6334k2028j8323j5964j4251j1773q416
50570H00463n258k657J34L265N800P440R221J1748J4131J5610J7005J9336K2019
50557I18257K3871K5154K7190L0256L3308L5639L7642L9771M1828M3466M4546
50546A300928M4739M3555M1155L8621L7037L6516L6338L5836L5101L4919L6044
50535A720789L8433M1275M3839M6070M8225N0403N2783N5878O0002O4654O8990
$$ y = [2017109, 2025596, 2039539, 2058093, 2079852, 2103401, 2127289, 2149949, 2170025, 2186652, 2199327, 2207674, 2211517, 2210870, 2205590, 2195103, 2178626, 2155430, 2124798, 2086004, 2038721, 1983424, 1921206, 1853353, 1781172, 1706063, 1629539, 1553242, 1478925, 1408118, 1341603, 1279331, 1220910, 1166009, 1114439, 1066314, 1022216, 982787, 948043, 917552, 891218, 869190, 850867, 834903, 820652, 808879, 800463, 795205, 792548, 792682, 795947, 801747, 809187, 818408, 830156, 844287, 859897, 876902, 896238, 918257, 942128, 967282, 994472, 1024728, 1058036, 1093675, 1131317, 1171088, 1212916, 1256382, 1300928, 1345667, 1389222, 1430377, 1468998, 1506035, 1542551, 1578889, 1614725, 1649826, 1684745, 1720789, 1759222, 1800497, 1844336, 1890406, 1938631, 1989034, 2041817, 2097695, 2157697, 2222351, 2291341]
50524B291341P2805P6514Q0208Q3253Q4954Q5176Q3999Q1127P5965O8357N8852
50513C142551M8103L6157K2661P821p373k2087l6339n0153o2542p2167p8885q3622
50501B844125q6499q6156q1412p2854o2142n0352l7720k4606j1830j67J0041J8699
50489B359127K5792L1236L4571L4947L1672K4615J3944j37j6992l5157n2860o8846
50477B381912q2493r3327j00850j04819j05522j03728j00357r6024r0809q4691
50467A419292p7984p1113o4113n6952n0153m4316l9072l3478k7683k3039k0083
50456I11306j7402j3428q572m542k121o12R20K954N800R480J3268J6213J8252
50443I31516K0149K2282K4246K5710K6922K8143K9249L0187L1242L2529L3684
$$ y = [2291341, 2364146, 2440660, 2520868, 2604121, 2689075, 2774251, 2858250, 2939377, 3015342, 3083699, 3142551, 3190654, 3226811, 3249472, 3257293, 3249920, 3227833, 3191494, 3141341, 3078799, 3006632, 2927747, 2844125, 2757626, 2671470, 2590058, 2517204, 2455062, 2404710, 2366990, 2342384, 2330554, 2330387, 2340428, 2359127, 2384919, 2416155, 2450726, 2485673, 2517345, 2541960, 2555904, 2555767, 2538775, 2503618, 2450758, 2381912, 2299419, 2206092, 2105242, 2000423, 1894901, 1791173, 1690816, 1594792, 1503983, 1419292, 1341308, 1270195, 1206082, 1149130, 1098977, 1054661, 1015589, 982111, 954428, 931389, 911306, 893904, 880476, 871904, 867362, 865241, 864629, 865549, 868503, 874303, 883783, 897051, 913264, 931516, 951665, 973947, 998193, 1023903, 1050825, 1078968, 1108217, 1138404, 1169646, 1202175, 1235859]
50432A235859L4393L4839L5303L5588L5244L4149L2561L0686K8611K6539K4753
50421A588525K3208K1542J9737J8508J8571J9665K0828K1774K3299K5976K9029
50410A830662L1253L2561L3807L5237L6072L5677L4210L1924K8630K4245J9215
50399B173493J3985Q496K466m282j1909k0425k9426l8461m7644n7085o5739p1885
50387A851584p5011p6194p6295p4817p1157o5821n9616n2577m4575l6144k7861
50376A191516j9608j1316l590L226R791J6425K1859K4481K4216K1938J7689J1018
50364A307645K636n814j3592k1088k8176l3769l7228l9033l9815l9750l9116l8353
50352I74547l7253l5095l1901k8717k6282k4238k2027j9785j7887j6240j4475
$$ y = [1235859, 1270252, 1305091, 1340394, 1375982, 1411226, 1445375, 1477936, 1508622, 1537233, 1563772, 1588525, 1611733, 1633275, 1653012, 1671520, 1690091, 1709756, 1730584, 1752358, 1775657, 1801633, 1830662, 1861915, 1894476, 1928283, 1963520, 1999592, 2035269, 2069479, 2101403, 2130033, 2154278, 2173493, 2187478, 2195974, 2198440, 2194158, 2182249, 2161824, 2132398, 2093937, 2046293, 1989208, 1923469, 1851584, 1776573, 1700379, 1624084, 1549267, 1478110, 1412289, 1352673, 1300096, 1255521, 1219377, 1191516, 1171908, 1160592, 1157002, 1160228, 1170019, 1186444, 1208303, 1232784, 1257000, 1278938, 1296627, 1307645, 1310281, 1304467, 1290875, 1269787, 1241611, 1207842, 1170614, 1131581, 1091766, 1052016, 1012900, 974547, 937294, 902199, 870298, 841581, 815299, 791061, 769034, 749249, 731362, 715122, 700647]
50341G00647j2447j0264q177o524n316m001k136k07J000J773L296N944Q653J0376
50327F82617J1393J2667J4488J6316J7590J8187J8315J8221J7995J7708J7781
50316H63278J8897K1053K3097K3865K3641K3661K4315K4724K4164K2909K1415
50305A115019J9555J7159J4560J2176J0028P989N982L691P16k621n255o590p204
50292A185205q019r235j0502j1658j2804j4010j5325j6879j8635k0370k1960k3415
50280A002393k4468k4634k3843k2615k1374k0152j9133j8836j9324j9715j9057
50269G69242j7383j5512j4054j2966j1875j0463q714o975n602m506l316k016r87
50256F54873k78O16J965L328M172M550M820N095N366N703N996N758M745L460K656
$$ y = [700647, 688200, 677936, 669759, 663235, 657919, 653918, 651782, 651575, 652575, 654348, 657644, 663588, 672241, 682617, 694010, 706677, 721165, 737481, 755071, 773258, 791573, 809794, 827789, 845497, 863278, 882175, 903228, 926325, 950190, 973831, 997492, 1021807, 1046531, 1070695, 1093604, 1115019, 1134574, 1151733, 1166293, 1178469, 1188497, 1196486, 1202468, 1206159, 1206875, 1204254, 1198999, 1192409, 1185205, 1177186, 1167951, 1157449, 1145791, 1132987, 1118977, 1103652, 1086773, 1068138, 1047768, 1025808, 1002393, 977925, 953291, 929448, 906833, 885459, 865307, 846174, 827338, 808014, 788299, 769242, 751859, 736347, 722293, 709327, 697452, 686989, 678275, 671300, 665698, 661192, 657876, 655860, 654873, 654595, 655211, 657176, 660504, 664676, 669226, 674046, 679141, 684507, 690210, 696206, 701964, 706709, 710169, 712825]
50241G12825K492K490K218J628R21L00k00q18j796k889l524l609l836m807o195
50226F95200p169p413p255o944o297n143l714k385j209R3J613K977L679L803L987
50211F63823M627N372N712N712N671N413M602L603L187L362L289K598J881J542
50197G20394J031k19j799k979l785m677n564n996o047o232o589o669o451o597
50183F57821p554q913r913j0209r952r410q801q255p753p122o225n096l860k593
50169E52165j291j3J020J461J144K80p25j657k504l160l453l582m149n447o895
50154E23194p509o944n759m731m146l850l705l703l704l352k480j431q08p54q15
50139D69503o04l54m88r35j143p74%Q49J603K214K675L089L596M163M642N043
$$ y = [712825, 715317, 717807, 720025, 721653, 722574, 722874, 722674, 721856, 720060, 717171, 713647, 710038, 706202, 701395, 695200, 688031, 680618, 673363, 666419, 660122, 654979, 651265, 648880, 647671, 647764, 649377, 652354, 656033, 659836, 663823, 668450, 673822, 679534, 685246, 690917, 696330, 700932, 704535, 707722, 711084, 714373, 716971, 718852, 720394, 721425, 721206, 719407, 716428, 712643, 707966, 702402, 696406, 690359, 684127, 677538, 670869, 664418, 657821, 650267, 641354, 631441, 621232, 611280, 601870, 593069, 584814, 577061, 569939, 563714, 558618, 554758, 552165, 550874, 550861, 551881, 553342, 554486, 554766, 554041, 552384, 549880, 546720, 543267, 539685, 535536, 530089, 523194, 515685, 508741, 502982, 498251, 494105, 490255, 486550, 482847, 479143, 475791, 473311, 471880, 471072, 470318, 469503, 468899, 468545, 468057, 467122, 465979, 465205, 465205, 466054, 467657, 469871, 472546, 475635, 479231, 483394, 488036, 493079]
50123D93079N487N879N947N634N263N114N092M891M332L445K397J470J014J206
50109E50250J761K012J413J69q34r64n47l50m53k80L48Q97J043J109J198Q54J61
50092E57787L37K213M773O323O665O970P831Q758R457J0268J1099J1257J0708
50079F54446J0416J0976J1841J2374J2695J2993J2909J2246J1602J1560J1814
50068G85872J1672J0970R987Q974Q166P808P732P463P034P135Q008Q909R163R098
50054I07991R328R714R749R504R526J0065J1004J2187J3269J3631J2996J1896
50042A040860J1084J0818J1109J2126J3801J5514J6862J8350K0664K3564K6139
50031A220891K7836K8556K8065K6138K3123J9634J5747J1183O273K103m21j209
$$ y = [493079, 498566, 504445, 510392, 516026, 521289, 526403, 531495, 536386, 540718, 544163, 546560, 548030, 549044, 550250, 552011, 554023, 555436, 555605, 554771, 553807, 553260, 552910, 552457, 552177, 552525, 553422, 554465, 555574, 556772, 557626, 557787, 558124, 560337, 565110, 571433, 578098, 585068, 592899, 601657, 611114, 621382, 632481, 643738, 654446, 664862, 675838, 687679, 700053, 712748, 725741, 738650, 750896, 762498, 774058, 785872, 797544, 808514, 818501, 827475, 835641, 843449, 851181, 858644, 865678, 872813, 880821, 889730, 898893, 907991, 917319, 927033, 936782, 946286, 955812, 965877, 976881, 989068, 1002337, 1015968, 1028964, 1040860, 1051944, 1062762, 1073871, 1085997, 1099798, 1115312, 1132174, 1150524, 1171188, 1194752, 1220891, 1248727, 1277283, 1305348, 1331486, 1354609, 1374243, 1389990, 1401173, 1407446, 1409549, 1409128, 1407919]
50019A407919p24M16J629K596L356L829L346J107l035q620j5223k2463k9476l5010
50005A309647l8317l9560l9296l7927l5801l3411l1178k9139k7050k4846k2886
49994I50236k1679k1245k1013k0524k0062k0128k0421k0013j8685j7370j6832
49983G32264j6602j5754j4255j2852j1959j1356j0748j0056r160p971o680n563
49971E99308m616l752l175l092l164k768j804q48m30n47q88j235j549j823j984
49956E67633j946j829k005k641l228l072k292j754j848j916j339n09k16m73n96
49941E41969j36Q04J874K707L067L222L810N001O215P049P938R332J0873J2118
49927F15843J3479J5551J7921J9708K1048K3004K6111K9987L4309L9159M4275
$$ y = [1407919, 1407195, 1407611, 1409240, 1411836, 1415192, 1419021, 1422367, 1423474, 1420439, 1411819, 1396596, 1374133, 1344657, 1309647, 1271330, 1231770, 1192474, 1154547, 1118746, 1085335, 1054157, 1025018, 997968, 973122, 950236, 928557, 907312, 886299, 865775, 845713, 825585, 805164, 785151, 766466, 749096, 732264, 715662, 699908, 685653, 672801, 660842, 649486, 638738, 628682, 619522, 611551, 604871, 599308, 594692, 590940, 587765, 584673, 581509, 578741, 576937, 576089, 575659, 575112, 574224, 572989, 571440, 569617, 567633, 565687, 563858, 561853, 559212, 555984, 552912, 550620, 548866, 547018, 545102, 543763, 543254, 543038, 542565, 541969, 541833, 542637, 544511, 547218, 550285, 553507, 557317, 562318, 568533, 575582, 583520, 592852, 603725, 615843, 629322, 644873, 662794, 682502, 703550, 726554, 752665, 782652, 816961, 856120, 900395]
49916I00395M8952N2902N6367N9026N9701N7586N3188M7619M1597L5565L0285
49905A443183K6567K4626K4075K4420K5216K5874K5614K3710J9679J3283M555
49894A680802n987j7163k7451l5953m2956m9173n4431n7757n8872n8809n8582
49883A213668n7965n6330n3996n1821m9835m7262m3798l9997l6381l3020k9964
49872G13299k7359k5068k2811k0681j8923j7327j5474j3477j1729j0042q000o067
49860E16341n374o117p125p336o813o054n151m179l657l914m487m637m186l507
49846D43804l056l113l606l936l517k660k343k866l387l178k672k656k996k827
49832D00991j784l82O96J158J071O72L02K02M05Q43J436J965K179K157K288K687
$$ y = [900395, 949347, 1002249, 1058616, 1117642, 1177343, 1234929, 1288117, 1335736, 1377333, 1412898, 1443183, 1469750, 1494376, 1518451, 1542871, 1568087, 1593961, 1619575, 1643285, 1662964, 1676247, 1680802, 1674815, 1657652, 1630201, 1594248, 1551292, 1502119, 1447688, 1389931, 1331059, 1272250, 1213668, 1155703, 1099373, 1045377, 993556, 943721, 896459, 852661, 812664, 776283, 743263, 713299, 685940, 660872, 638061, 617380, 598457, 581130, 565656, 552179, 540450, 530408, 522408, 516341, 510967, 504850, 497725, 490389, 483576, 477522, 472371, 468192, 464535, 460621, 456134, 451497, 447311, 443804, 440748, 437635, 434029, 430093, 426576, 423916, 421573, 418707, 415320, 412142, 409470, 406814, 403818, 400991, 399207, 398825, 399521, 400679, 401750, 402422, 402724, 402926, 403331, 404174, 405610, 407575, 409754, 411911, 414199, 416886]
49816D16886K997K954K896L373M483N904P363Q696R624R855R490R100R283J0208
49802E13112J1678J3591J6136J9379K2799K5616K7763L0025L2994L6246L8975
49791G88314M0918M2016M1572L8645L3322K6846K0463J4771J0123O859M949M187
49779A072985M830P200J0429J2447J1688Q149K504m954j3911k3320l1913l9056
49767A017078m4563m8153m9638m9303m7530m4419m0267l5909l1949k8103k3953
49756E73291j9974j6999j4964j3069j1061r546q873q527p810o543m964l435k435
49743D45091k279k602k564j844r68m55n1P77J992L059L616L662L200K149P05o38
49727D52850j448j631j296p06l02m66j032j389j230r01p98p46m07oj12p32j237
$$ y = [416886, 419883, 422837, 425733, 429106, 433589, 439493, 446856, 455552, 465176, 475031, 484521, 493621, 502904, 513112, 524790, 538381, 554517, 573896, 596695, 622311, 650074, 680099, 713093, 749339, 788314, 829232, 871248, 912820, 951465, 984787, 1011633, 1032096, 1046867, 1056990, 1063849, 1068798, 1072985, 1077815, 1085015, 1095444, 1107891, 1119579, 1127728, 1130232, 1125278, 1111367, 1088047, 1056134, 1017078, 972515, 924362, 874724, 825421, 777891, 733472, 693205, 657296, 625347, 597244, 573291, 553317, 536318, 521354, 508285, 497224, 487678, 478805, 470278, 462468, 455925, 450961, 447526, 445091, 442812, 440210, 437646, 435802, 434834, 434379, 434328, 435105, 437097, 440156, 443772, 447434, 450634, 452783, 453488, 452850, 451402, 449771, 448475, 447769, 447467, 447001, 445969, 444580, 443350, 442449, 441651, 440905, 440498, 440492, 440380, 439648, 438411]
49710D38411j213q12k81K60M75jo94m50J040K492K587J700J226J653K170K097
49694D50660J675J399J373J512J785K041K089J996J935J746J131K83l22n70o48
49679D68085m76R7O05M15j70j78N12R65P82Q09J632K449K246J432J261K072K960
$$ y = [438411, 437198, 436386, 436105, 436365, 436840, 436839, 436145, 435695, 436735, 439227, 441814, 443514, 444740, 446393, 448563, 450660, 452335, 453734, 455107, 456619, 458404, 460445, 462534, 464530, 466465, 468211, 469342, 469625, 469303, 468733, 468085, 467609, 467706, 468311, 468726, 468556, 468378, 468890, 469855, 470637, 471446, 473078, 475527, 477773, 479205, 480466, 482538, 485498]
$$ [...]
##END NTUPLES=NMR SPECTRUM
##END=
