
##TITLE=AC1248__6672293_lsV1smynyo
##JCAMPDX= 6.0         $$ Bruker NMR JCAMP-DX V2.0
##DATA TYPE= NMR SPECTRUM
##DATA CLASS= NTUPLES
##ORIGIN= BRUKER
##OWNER= Administrator
$$ 1.72 TOPSPIN		Version 2.1
$$ 2012-08-14 15:09:26.578 -0500  Administrator@TOPSPIN
$$ Compression mode = diff/dup
##.OBSERVE FREQUENCY= 400.02188249412
##.OBSERVE NUCLEUS= ^1H
##.ACQUISITION MODE= SIMULTANEOUS (DQD)
##.ACQUISITION SCHEME= undefined
##.AVERAGES= 8
##.DIGITISER RES= 22
##SPECTROMETER/DATA SYSTEM= spect
##.PULSE SEQUENCE= zg30
##.SOLVENT NAME= COFFEE_meoh
##.SHIFT REFERENCE= INTERNAL, COFFEE_meoh, 1, 14.98509
##AUDIT TRAIL= $$ (NUMBER, WHEN, WHO, WHERE, PROCESS, VERSION, WHAT)
$$ ##TITLE= Audit trail, TOPSPIN		Version 2.1
$$ ##JCAMPDX= 5.01
$$ ##ORIGIN= Bruker BioSpin GmbH
$$ ##OWNER= Administrator
$$ $$ C:\Bruker\TOPSPIN/data/COFFEE/nmr/AC1248__6672293_lsV1smynyo/10/pdata/1/auditp.txt
$$ ##AUDIT TRAIL=  $$ (NUMBER, WHEN, WHO, WHERE, PROCESS, VERSION, WHAT)
(   1,<2012-08-14 15:09:14.625 -0500>,<Administrator>,<TOPSPIN>,<go>,<TOPSPIN 2.1>,
      <created by zg
	started at 2012-08-14 15:08:07.515 -0500,
	POWCHK enabled, PULCHK disabled,
       configuration hash MD5:
       6B 1B 68 BB D9 2E 58 E2 7F 35 AD 54 07 DF 0E 41
       data hash MD5: 64K
       DA EA 00 F1 D1 C9 BF CF CA AE E9 28 54 9D 29 68>)
(   2,<2012-08-14 15:09:20.546 -0500>,<Administrator>,<TOPSPIN>,<proc1d>,<TOPSPIN 2.1>,
      <Start of raw data processing
       efp LB = 0 FT_mod = 6 PKNL = 1 PHC0 = 0 PHC1 = 0 SI = 32K 
       data hash MD5: 32K
       7C FC 1B 04 12 19 4B 67 D7 3B 4B 73 1D 8B 47 64>)
(   3,<2012-08-14 15:09:21.343 -0500>,<Administrator>,<TOPSPIN>,<proc1d>,<TOPSPIN 2.1>,
      <pk PHC0 = 175.0507 PHC1 = 0 
       data hash MD5: 32K
       32 F8 00 42 A6 26 DB 0E 07 B5 74 50 8B 75 6A 20>)
(   4,<2012-08-14 15:09:21.453 -0500>,<Administrator>,<TOPSPIN>,<proc1d>,<TOPSPIN 2.1>,
      <abs ABSG = 1 
       data hash MD5: 32K
       46 D1 8E 87 53 B2 9B 95 13 7A E3 EA 3F 97 D1 83>)
(   5,<2012-08-14 15:09:21.500 -0500>,<Administrator>,<TOPSPIN>,<proc1d>,<TOPSPIN 2.1>,
      <abs ABSG = 2 
       data hash MD5: 32K
       F2 E1 0E DA 11 30 7D A7 F9 E8 B2 CC A2 29 5B 61>)
(   6,<2012-08-14 15:09:21.531 -0500>,<Administrator>,<TOPSPIN>,<proc1d>,<TOPSPIN 2.1>,
      <abs ABSG = 3 
       data hash MD5: 32K
       FB 4C 06 46 4B 37 D6 55 52 26 FF 39 9E 8C 94 48>)
(   7,<2012-08-14 15:09:21.609 -0500>,<Administrator>,<TOPSPIN>,<proc1d>,<TOPSPIN 2.1>,
      <abs ABSG = 4 
       data hash MD5: 32K
       18 4B FB 98 77 B6 BE 29 7C A6 2D 6C 44 99 F7 F6>)
(   8,<2012-08-14 15:09:21.671 -0500>,<Administrator>,<TOPSPIN>,<proc1d>,<TOPSPIN 2.1>,
      <abs ABSG = 5 
       data hash MD5: 32K
       01 2E C2 9D 0E 46 9E 52 DF 1A 73 ED 83 D4 5E 92>)
$$ ##END=
$$ 
$$ $$ hash MD5
$$ $$ 1D DE 95 79 21 E1 F2 20 A3 82 5B C5 3D 4C 9A 82
##$RELAX= 
##$RELAX= 
##$RELAX= 
##$RELAX= 
##$RELAX= 
##$RELAX= 
##$RELAX= 
$$ Bruker specific parameters
$$ --------------------------
##$DU= <C:\Bruker\TOPSPIN>
$$ [...]
150 150 150 150 150 150 150 150
##$TP07= 0
##$TPNAME0= <>
##$TPNAME1= <>
##$TPNAME2= <>
##$TPNAME3= <>
##$TPNAME4= <>
##$TPNAME5= <>
##$TPNAME6= <>
##$TPNAME7= <>
##$TPOAL= (0..7)
0.5 0.5 0.5 0.5 0.5 0.5 0.5 0.5
##$TPOFFS= (0..7)
0 0 0 0 0 0 0 0
##$TUNHIN= 0
##$TUNHOUT= 0
##$TUNXOUT= 0
##$USERA1= <user>
##$USERA2= <user>
##$USERA3= <user>
##$USERA4= <user>
##$USERA5= <user>
##$V9= 5
##$VALIST= <valist>
##$VCLIST= <CCCCCCCCCCCCCCC>
##$VD= 0
##$VDLIST= <DDDDDDDDDDDDDDD>
##$VPLIST= <PPPPPPPPPPPPPPP>
##$VTLIST= <TTTTTTTTTTTTTTT>
##$WBST= 1024
##$WBSW= 4
##$XGAIN= (0..3)
0 0 0 0
##$XL= 0
##$YL= 0
##$YMAX_a= 496488
##$YMIN_a= -627039
##$ZGOPTNS= <>
##$ZL1= 120
##$ZL2= 120
##$ZL3= 120
##$ZL4= 120
##$ABSF1= 14.98509
##$ABSF2= -5.573092
##$ABSG= 5
##$ABSL= 3
##$ALPHA= 0
##$AQORDER= 0
##$ASSFAC= 0
##$ASSFACI= 0
##$ASSFACX= 0
##$ASSWID= 0
##$AUNMP= <proc_prof1d_extract_pilot.lims>
##$AXLEFT= 0
##$AXNAME= <>
##$AXNUC= <1H>
##$AXRIGHT= 0
##$AXTYPE= 0
##$AXUNIT= <>
##$AZFE= 0.1
##$AZFW= 0.1
##$BCFW= 0
##$BC_mod= 0
##$BYTORDP= 0
##$COROFFS= 0
##$CY= 15
##$DATMOD= 1
##$DC= 0
##$DFILT= <>
##$DTYPP= 0
##$F1P= 0
##$F2P= 0
##$FCOR= 0.5
##$FTSIZE= 32768
##$FT_mod= 6
##$GAMMA= 0
##$GB= 0
##$INTBC= 1
##$INTSCL= 1
##$ISEN= 128
##$LB= 0
##$LEV0= 0
##$LPBIN= 0
##$MAXI= 10000
##$MC2= 0
##$MEAN= 0
##$ME_mod= 0
##$MI= 0
##$NCOEF= 0
##$NC_proc= -8
##$NLEV= 6
##$NOISF1= 0
##$NOISF2= 0
##$NSP= 0
##$NTH_PI= 0
##$NZP= 0
##$OFFSET= 14.98509
##$PC= 1
##$PHC0= 175.0507
##$PHC1= 0
##$PH_mod= 1
##$PKNL= yes
##$PPARMOD= 0
##$PPDIAG= 0
##$PPIPTYP= 0
##$PPMPNUM= 2147483647
##$PPRESOL= 1
##$PSCAL= 4
##$PSIGN= 0
##$PYNMP= <proc.py>
##$REVERSE= no
##$SF= 400.02
##$SI= 32768
##$SIGF1= 0
##$SIGF2= 0
##$SINO= 400
##$SIOLD= 32768
##$SPECTYP= <>
##$SREGLST= <1H.CDCl3>
##$SSB= 0
##$STSI= 32768
##$STSR= 0
##$SW_p= 8223.68421052631
##$SYMM= 0
##$S_DEV= 0
##$TDeff= 65536
##$TDoff= 0
##$TI= <>
##$TILT= no
##$TM1= 0
##$TM2= 0
##$TOPLEV= 0
##$USERP1= <user>
##$USERP2= <user>
##$USERP3= <user>
##$USERP4= <user>
##$USERP5= <user>
##$WDW= 1
##$XDIM= 32768
##$YMAX_p= 468504632
##$YMIN_p= -870908
##$CURPLOT= <Network HP LaserJet P1505>
##$CURPRIN= <$Network HP LaserJet P1505>
##$DFORMAT= <normdp>
##$LAYOUT= <+/1D_H.xwp>
##$LFORMAT= <normlp>
##$PFORMAT= <normpl>
##$SURQMSG= 1
$$ End of Bruker specific parameters
$$ ---------------------------------
##NTUPLES= NMR SPECTRUM
##VAR_NAME=  FREQUENCY,     SPECTRUM/REAL,   SPECTRUM/IMAG
##SYMBOL=    X,             R,               I
##VAR_TYPE=  INDEPENDENT,   DEPENDENT,       DEPENDENT
##VAR_FORM=  AFFN,          ASDF,            ASDF
##VAR_DIM=   32768,         32768,           32768
##UNITS=     HZ,            ARBITRARY UNITS, ARBITRARY UNITS
##FACTOR=    0.250966925370066, 1,           1
##FIRST=     8223.43324360094, 33117,        -60563
##LAST=      0,             155931,          -277737
##MIN=       0,             -870908,         0
##MAX=       8223.43324360094, 468504632,    0
$$ Real data points
##PAGE= N=1
##DATA TABLE= (X++(R..R)), XYDATA
$$ [...]
19556g2503K1084l04230O2049D2693d3820A36961e2720j63092E7115h3299F0951
$$ -72503 -51419 -355649 -293600 42693 -43820 136961 -52720 -215812 57115 -83299 60951
19544A4716h4646J2161D5703N8793l5701k0185i8296k32090A89863b63312A04376
$$ 14716 -84646 -72485 45703 104496 68795 48610 -98296 -330386 189863 -263312 104376
19532C41256A31339a78529n2623F6267B4690K11962j04785a19178B77054m6428
$$ 341256 131339 -178529 -231152 66267 24690 236652 131867 -119178 277054 230626
19522B30626a93720Q3483A41160B0482M73288A11490a27576H6708Q8068D6624
$$ 230626 -193720 -110237 141160 20482 493770 111490 -127576 86708 174776 46624
19511b9049j29282A84529E5447J43876d1204D5292N7585e5462o1862G4452b86804
$$ -29049 -158331 184529 55447 199323 -41204 45292 102877 -55462 -117324 74452 -286804
19499A12729b08023n4498B00528D5886a0701G7881d2545o2801G7822a47030H8423
$$ 112729 -208023 -262521 200528 45886 -10701 77881 -42545 -105346 77822 -147030 88423
19487g9589l4909k25048B30110E1868c49935e8442B63934a22776a9637n271j9281
$$ -79589 -114498 -339546 230110 51868 -349935 -58442 263934 -122776 -19637 -24908 -44189
19476d4189r1695A95327i5621A44123b9191l5785B26802G8750J08417k5141a40479
$$ -44189 -135884 195327 -95621 144123 -29191 -64976 226802 78750 187167 162026 -140479
19464d84607f4540j55313C1454J970f0400A88053d44273A08326K4291o6136J3775
$$ -484607 -64540 -219853 31454 33424 -60400 188053 -444273 108326 132617 66481 80256
19453H0256c46307a1550q7718E7191c4728j14922A8673b99167a35167e6654D6540
$$ 80256 -346307 -11550 -99268 57191 -34728 -149650 18673 -299167 -135167 -56654 46540
19441C18834a82250L5342J2901f5744A4834N391b19531c6061A26442f1470b1850
$$ 318834 -182250 -146908 -134007 -65744 14834 20225 -219531 -36061 126442 -61470 -21850
19429A18996c5511q35397g166k84225C9233c57124B25885b53131e8207G6823P5238
$$ 118996 -35511 -870908 -7166 -291391 39233 -357124 225885 -253131 -58207 76823 152061
19418A52061b01159Q9858j51087A39595b15306Q0767j75178i0486C70306b93793
$$ 152061 -201159 -111301 -262388 139595 -215306 -134539 -309717 -90486 370306 -293793
19407b286j24720p6831B23868E9223a5527A73049a73480l6871e5517A5896O6933
$$ -2286 -127006 -203837 223868 59223 -15527 173049 -173480 -210351 -55517 15896 82829
19396H2829a56393p9302Q2880o6344a00555M4958j06705P3947q0938A59935b32618
$$ 82829 -156393 -235695 -152815 -219159 -100555 -55597 -162302 -88355 -169293 159935 -232618
19384b21592L0084A1693b8808b370l6567B43217a82820A8944e4081k98323F3427
$$ -221592 -191508 11693 -28808 -2370 -38937 243217 -182820 18944 -54081 -352404 63427
19372a89465j53089c9209l19914A66946A9141a28733K2065B54088c4088E469a10208
$$ -189465 -342554 -39209 -359123 166946 19141 -128733 -106668 254088 -34088 5469 -110208
19360h1940j03279l6957H4185A3725a08142j57393A32972h2213j5926d6330I8091
$$ -81940 -185219 -222176 84185 13725 -108142 -265535 132972 -82213 -98139 -46330 98091
19348b12394A88360C1078e692j48865C5910d36512g3619l2042D0810J3281c02962
$$ -212394 188360 31078 -5692 -154557 35910 -436512 -73619 -105661 40810 54091 -302962
19336a26201l0771j32432G7415M4920b44472o6117J26265k98427b28618J1380
$$ -126201 -156972 -289404 77415 122335 -244472 -310589 -184324 -482751 -228618 -217238
19326b17238J0380I5128J83220a49607A8127c86751J29806b7684p9467k13151
$$ -217238 -206858 95128 278348 -149607 18127 -386751 -256945 -27684 -107151 -320302
19316c20302J30927E5233q061a87516C40676D1894o275b09068k68301a35840a3176
$$ -320302 -189375 55233 47172 -187516 340676 41894 35619 -209068 -477369 -135840 -13176
19304I5338a83553g6556k33287A17479C459b64462A4851K17673o518G9912c06229
$$ 95338 -183553 -76556 -309843 117479 3459 -264462 14851 232524 226006 79912 -306229
19292B51399C0653O6987B7848a69026e7363A35115K7201a60808O1246A8671J22951
$$ 251399 30653 97640 27848 -169026 -57363 135115 162316 -160808 -99562 18671 141622
19281A41622b07835L8182f4582J7914a3280C6876c55038C63452b7459k07675f9017
$$ 141622 -207835 -169653 -64582 -46668 -13280 36876 -355038 363452 -27459 -235134 -69017
19269b2699B9351g1564G4732k1218a5769m0771A03379a72031D4046i5906M6333
$$ -22699 29351 -71564 74732 53514 -15769 -56540 103379 -172031 44046 -95906 -49573
19258d9573A09809P1262a08781n0313A44745a76053B9990K097J76567D2700h4600
$$ -49573 109809 181071 -108781 -159094 144745 -176053 29990 32087 208654 42700 -84600
19246a5042B14721I5174c9256J565E8771K49446i6168o0738I0349a90284g3393
$$ -15042 214721 95174 -39256 -37691 58771 308217 -96168 -156906 90349 -190284 -73393
19234f4848a196A90866G6303f5687j9786G7449a46221n0017c6425D8137a00789
$$ -64848 -1196 190866 76303 -65687 -85473 77449 -146221 -196238 -36425 48137 -100789
19222b23650C98283c470j5587k6764Q144G2024E530a50570e5843k95096H4996
$$ -223650 398283 -3470 -19057 -45821 -37677 72024 5530 -150570 -55843 -350939 84996
19210d84027a1637q2718A21576b20857e6010k03335a15491C04144c87242B2282
$$ -484027 -11637 -94355 121576 -220857 -56010 -259345 -115491 304144 -387242 22282
19199a51721B13373F8551a31457M6097C06002d6678A73342d2905j11164g0570
$$ -151721 213373 68551 -131457 -85360 306002 -46678 173342 -42905 -154069 -70570
19188d28455A88369C8233O026b54970E8644b7616C2729c19296a34p9925p661a7866
$$ -428455 188369 38233 44259 -254970 58644 -27616 32729 -319296 -134 -80059 -87720 -17866
19175A05456e569k03872B16004D3033g6180M282l34675P5277a50764j92312A8454
$$ 105456 -5569 -209441 216004 43033 -76180 -71898 -406573 -331296 -150764 -343076 18454
19163d03517d9673A13587L7914a32385j98583a03796A38912o5044K22498G1882
$$ -403517 -49673 113587 151501 -132385 -330968 -103796 138912 73868 296366 71882
19152B53324b59092A51457e5571j71514B11041a94063M7598F542J7263J19559
$$ 253324 -259092 151457 -55571 -227085 211041 -194063 -146465 6542 23805 143364
19142A43364b75521D9737a89261k85079a95965j9623I847P9085O0680j5594L4687
$$ 143364 -275521 49737 -189261 -474340 -195965 -215588 9847 88932 149612 134018 168705
19131A68705D143a9307H3727A2565a15043n858n686l70945a09047A3486J22028
$$ 168705 4143 -19307 83727 12565 -115043 -120901 -126587 -497532 -109047 13486 135514
19120A35514B3209d21381a14934A63121C467M4814J06908a58058n055q8485B45077
$$ 135514 23209 -421381 -114934 163121 3467 48281 155189 -158058 -163113 -251598 245077
19108b31938N4397E5824a14249B3849K5187i4345K8641j90153f0375C51613a64262
$$ -231938 -177541 55824 -114249 23849 49036 -94345 -65704 -255857 -60375 351613 -164262
19096a01057A90595c1883P384r8028G0580R7409D5679J6851b96630H1066M5884
$$ -101057 190595 -31883 -24499 -122527 70580 167989 45679 62530 -296630 81066 126950
19085A26950n0995a52886F0371a41611k828q001R407k9116f1213k84760j66789
$$ 126950 75955 -152886 60371 -141611 -144439 -152440 -143033 -172149 -61213 -345973 -512762
19074e12762A452J4343f5295j68248f4265I2414b26471B23659b19378O4997L9570
$$ -512762 1452 15795 -65295 -233543 -64265 92414 -226471 223659 -219378 -154381 -114811
19063a14811D2502c00122i6116i621A49805l7233N192g0044J7698o2303m26A84632
$$ -114811 42502 -300122 -96116 -9621 149805 112572 117764 -70044 -52346 -114649 -115075 184632
19050a91431O0242G1658J28560d8894l4127K077C0657a08984b1821A9971a90749
$$ -191431 -131189 71658 200218 -48894 -83021 -80944 30657 -108984 -21821 19971 -190749
19038a31364j25347A57652n5661b00154H1713M1736d8467j06149B55383A15637
$$ -131364 -256711 157652 101991 -200154 81713 123449 -48467 -154616 255383 115637
19027I6139l5419k0897a88791F3516a52230A64975l0163a4887j2244B67350q6582
$$ 96139 60720 39823 -188791 63516 -152230 164975 134812 -14887 -27131 267350 180768
19016A80768n4147h0236o328n9766A02281e61508A31404b34787B42243n6409A5464
$$ 180768 126621 -80236 -86564 -146330 102281 -561508 131404 -234787 242243 185834 15464
19004A73886e763j86514A23552N253a57720A52049a14377e3248l80382a62662
$$ 173886 -5763 -192277 123552 128805 -157720 152049 -114377 -53248 -433630 -162662
18993C2842P1836g037j97299a00307A6880M2927B5796K22738B9985D929a6678
$$ 32842 104678 -7037 -204336 -100307 16880 59807 25796 248534 29985 4929 -16678
18981a38132l764k78522a55359O0082A03316C3436R0569b42436H8107C139L9400
$$ -138132 -141896 -420418 -155359 -95277 103316 33436 124005 -242436 88107 3139 42539
18970D2539b45390j06560J16819A15639b1476m10244a69804C8406c01267Q1807
$$ 42539 -245390 -351950 -235131 115639 -21476 -431720 -169804 38406 -301267 -219460
18960b19460k7944I8432f3262A12070M4051A3961L12864a84187G3684a39942j84818
$$ -219460 -247404 98432 -63262 112070 156121 13961 326825 -184187 73684 -139942 -324760
18949c24760G0396b79416A3901K70760L900C137d01134M004a06143A10554L28194
$$ -324760 70396 -279416 13901 284661 288561 3137 -401134 -397130 -106143 110554 438748
18938D38748c11323N544b3289j76779j6763R5072l21834A40820E0901m462R173
$$ 438748 -311323 -305779 -23289 -200068 -216831 -121759 -443593 140820 50901 46439 55612
18927E5612a7086k17084H019K61330b70808C8067K9695O0433b4399j95770c8410
$$ 55612 -17086 -234170 8019 269349 -270808 38067 67762 128195 -24399 -220169 -38410
18915D3924b31357a15478A9094a01545j05516g7100J556p9001O2783H3286b30104
$$ 43924 -231357 -115478 19094 -101545 -207061 -77100 -75544 -154545 -91762 83286 -230104
18903a77389A30980d749l8555A70604B3853c41561C16005h0843I5887c36150a38496
$$ -177389 130980 -4749 -43304 170604 23853 -341561 316005 -80843 95887 -336150 -138496
18891a15885A622b16415O2360g6341A6299a12910L2513j2535D3791c22639j50162
$$ -115885 1622 -216415 -154055 -76341 16299 -112910 -80397 -92932 43791 -322639 -472801
18880d72801A21071b59906e7869n7573n4018j25509A80438h4660j7077j94086
$$ -472801 121071 -259906 -57869 -115442 -169460 -294969 180438 -84660 -101737 -295823
18870b95823A21263a11367j94335j0032a7012o1100I6782a54433e2472p2008G4858
$$ -295823 121263 -111367 -305702 -315734 -17012 -78112 96782 -154433 -52472 -124480 74858
18858H4852B9577c566j41994D4107a8356k33423n5821G9563e0130A59389C7921
$$ 84852 29577 -3566 -145560 44107 -18356 -251779 -307600 79563 -50130 159389 37921
18846A81818j5429g5157r0615f0235E1512c6167A23888b49468O6685A29016a63957
$$ 181818 166389 -75157 -165772 -60235 51512 -36167 123888 -249468 -182783 129016 -163957
18834h1603n3134K0850A67580E4499h5463n16963g5807q6451M2567N2601B40835
$$ -81603 -134737 -113887 167580 54499 -85463 -602426 -75807 -162258 -119691 -67090 240835
18822A98878h3255A13303J86790B8938J71L4101d0453B00675I5099J60674G5944
$$ 198878 -83255 113303 300093 28938 29109 63210 -40453 200675 95099 255773 75944
18810A32139a0887D90306B35418D6337h6468p4129L8135C48124a37416j14611
$$ 132139 -10887 490306 235418 46337 -86468 -160597 -122462 348124 -137416 -252027
18800b52027k18801A1475c3432A85632d86078J62298c2260j00991l5416a6377
$$ -252027 -470828 11475 -33432 185632 -486078 -323780 -32260 -133251 -168667 -16377
18789a37098j0342L6441L5903D9846O7494k4800L6577c6191j32996b9461o1505
$$ -137098 -147440 -110999 -75096 49846 117340 92540 129117 -36191 -169187 -29461 -90966
18778i0966K5766j60668J9586j48600c3196j50266b7137j10620k11376a52959
$$ -90966 -65200 -225868 -206282 -354882 -33196 -183462 -27137 -137757 -349133 -152959
18767E199e0420j81273N4110B90726a97210A11546e6465H4807c7030k39770D1494
$$ 5199 -50420 -231693 -177583 290726 -197210 111546 -56465 84807 -37030 -276800 41494
18755a3175j02192l05705b00964k5367Q349c4996k81733K1964B08159f4071K438
$$ -13175 -115367 -421072 -200964 -226331 -217982 -34996 -316729 -294765 208159 -64071 -61633
18744f1633k48460a36697H6451e0889j62220F8541a34997j21061a06787r3243
$$ -61633 -310093 -136697 86451 -50889 -213109 68541 -134997 -256058 -106787 -200030
18734b00030r3045b45F2674a39065j00636h1297B37808f806l48696e4615F8331
$$ -200030 -293075 -245 62674 -139065 -239701 -81297 237808 -6806 -355502 -54615 68331
18722A70400i1195H6732L9129C3356c18796a24588n1711f6658j51668P8348G5101
$$ 170400 -91195 86732 125861 33356 -318796 -124588 -176299 -66658 -218326 -139978 75101
18710D242c3186B49605a90391A67278C3820R0084f8710k32329J10134f1567j51400
$$ 4242 -33186 249605 -190391 167278 33820 123904 -68710 -301039 -190905 -61567 -212967
18699b12967k3940K4830F8191J5950a67024B37374d00720e2888o9663j00571f1044
$$ -212967 -236907 -212077 68191 84141 -167024 237374 -400720 -52888 -122551 -223122 -61044
18687a88898p8234h6405J4043j26567g5179l20032i870q8657K6889j8328F164
$$ -188898 -267132 -86405 -72362 -198929 -75179 -395211 -9870 -98527 -71638 -89966 6164
18675f2194B68841a56452m7780A09959A2323M8027P0375a26618A49674B0514B71
$$ -62194 268841 -156452 -204232 109959 12323 60350 130725 -126618 149674 20514 271
18663b70794J04600b9814C60671b55289L8402j72007a36492j93222J63378I282
$$ -270794 -166194 -29814 360671 -255289 -216887 -388894 -136492 -329714 -166336 9282
18652a81432j097D840c18614h598A17268a44647c8243p545j24640Q0004I1046
$$ -181432 -182529 4840 -318614 -8598 117268 -144647 -38243 -45788 -170428 -90424 91046
18640d28096K05161A6338j295g4712q3390D9039a3416j57815B24968C0579k58
$$ -428096 -222935 16338 15043 -74712 -158102 49039 -13416 -171231 224968 30579 30321
18629C0321d5915q1302A21223b967k81445f5852a137I0810e150C38567C4761g5314
$$ 30321 -45915 -127217 121223 -2967 -284412 -65852 -1137 90810 -5150 338567 34761 -75314
18616a94069I2073A7529a32125b0577A01800D2744j0104R5914b73703o6876a17342
$$ -194069 92073 17529 -132125 -20577 101800 42744 32640 128554 -273703 -340579 -117342
18604a2359A27131c5905d69C41131e0117l5080p0993C44393E4349a77508G812
$$ -12359 127131 -35905 -469 341131 -50117 -85197 -156190 344393 54349 -177508 7812
18592A35488J0631K7541a77199A13569l4950b92156c128B27694n8339i136A21804
$$ 135488 146119 173660 -177199 113569 78619 -292156 -3128 227694 169355 -9136 121804
18580a86585P884j81071k7270B88397b7637k44092a26728E6204a59608j89775
$$ -186585 -178701 -359772 -387042 288397 -27637 -271729 -126728 56204 -159608 -349383
18570c49383e2225A44585a53582A30077c71564B18060F351b0220n51786b37567
$$ -349383 -52225 144585 -153582 130077 -371564 218060 6351 -20220 -572006 -237567
18559c27582c1549j41516g270j76212H8106e0679j63500A72856l1755l4801b09735
$$ -327582 -31549 -173065 -7270 -183482 88106 -50679 -214179 172856 141101 106300 -209735
18547H7134J89332f1629j87685A93070p5776D860J10846c9949j3736j97063B2234
$$ 87134 276466 -61629 -249314 193070 117294 4860 115706 -39949 -53685 -250748 22234
18535b50109d521D6985K0404a36497d5690C1622a04374k52440B37884n3754k8728
$$ -250109 -4521 46985 67389 -136497 -45690 31622 -104374 -356814 237884 184130 155402
18524A55402m1741b1523B54031L9019K9629a0214l64479B37538h3933A46479L6607
$$ 155402 113661 -21523 254031 293050 322679 -10214 -374693 237538 -83933 146479 183086
18513A83086a71857C4205b08259d5422D4480c97705a50365q0631M4393R1615k41081
$$ 183086 -171857 34205 -208259 -45422 44480 -397705 -150365 -230996 -186603 -94988 -336069
18502c36069a14239F168b86771c8627C00335a94520K6046e4173j68779j64411
$$ -336069 -114239 6168 -286771 -38627 300335 -194520 -168474 -54173 -222952 -387363
18492c87363B70998A16439n3868b38142J00494A72782c14666f1532o9123k19406
$$ -387363 270998 116439 62571 -238142 -137648 172782 -314666 -61532 -130655 -350061
18482c50061H2436a62514A83463a62911e232k14895m3065J1449P9091Q0562p2971
$$ -350061 82436 -162514 183463 -162911 -5232 -220127 -263192 -251743 -172652 -92090 -165061
18471a65061J5597B1191g9293k09070a32063c1674j17291j75599a20914j3256
$$ -165061 -149464 21191 -79293 -288363 -132063 -31674 -148965 -324564 -120914 -134170
18461a34170G6554l4598d38743B15978A03733J71012a59363e4274m10216a6792
$$ -134170 76554 41956 -438743 215978 103733 274745 -159363 -54274 -464490 -16792
18450a48704O1417l19018B44565c54152a39654B060b97292a17944j89572i8018
$$ -148704 -87287 -406305 244565 -354152 -139654 2060 -297292 -117944 -307516 -98018
18439a44255c3622F7239Q4044a78231M3158d9614j56462F9090P097K89613I2736
$$ -144255 -33622 67239 151283 -178231 -135073 -49614 -206076 69090 76187 365800 92736
18427i9162a5587k9587l7385L6619A2972a88830A11246f3643B73056F8718b26221
$$ -99162 -15587 -45174 -82559 -45940 12972 -188830 111246 -63643 273056 68718 -226221
18415d71625J60220A81460g290B078b5049J0398k94836B84073j31634f2042B76850
$$ -471625 -311405 181460 -7290 2078 -25049 -14651 -309487 284073 152439 -62042 276850
18403F5566J32192a70840L8985b6340C55305k1455B0123b97183A63662m9808m5474
$$ 65566 197758 -170840 -131855 -26340 355305 333850 20123 -297183 163662 113854 68380
18392F8380a002q0312H9238n820a06380F0921a55134H7746O7682n9906e8437K093
$$ 68380 -1002 -81314 89238 83418 -106380 60921 -155134 87746 155428 95522 -58437 -56344
18380e6344j58643J9250O7580q636e0845o2624A32464J13422r7596Q4896b67490
$$ -56344 -214987 -195737 -128157 -136793 -50845 -113469 132464 245886 148290 233186 -267490
18368b32630R2266B70251a25724b9509B0668A794a06425k04799a25085B2196b94278
$$ -232630 -140364 270251 -125724 -29509 20668 1794 -106425 -311224 -125085 22196 -294278
18356B62165a86186f8753R366q9684f786k4743j27705A3852R4405H062M4841b37805
$$ 262165 -186186 -68753 -59387 -149071 -6786 -31529 -159234 13852 108257 8062 52903 -237805
18343B17357h1075j96246H7332g1013k73132A20658A2378J26928c73342H6633
$$ 217357 -81075 -277321 87332 -71013 -344145 120658 12378 139306 -373342 86633
18332B0920J78143i3871C1639b58202e6203j90709g2514l4531l4199p5067L3980
$$ 20920 199063 -93871 31639 -258202 -56203 -246912 -72514 -107045 -141244 -216311 -182331
18321a82331m8284A26055J36362d1017q0324F6092h4794A4236b53834j36073a90568
$$ -182331 -230615 126055 262417 -41017 -121341 66092 -84794 14236 -253834 -389907 -190568
18309H0180e0497A5113J06483i444l38789A06619J33864k2842I5115f9197j0578
$$ 80180 -50497 15113 121596 -9444 -348233 106619 240483 217641 95115 -69197 -79775
18298g9775L1095K0812j23883l24108I1094a94776A43881i806j84256q1422A92209
$$ -79775 -48680 -27868 -151751 -475859 91094 -194776 143881 -9806 -194062 -275484 192209
18286B9789a10572a7634j09272A85782D8251J23134o7202c47025j52062A01344
$$ 29789 -110572 -17634 -126906 185782 48251 171385 104183 -347025 -499087 101344
18275E2509J79473B2518M72987A25693D294e3571j40123M6579E3626c39063P4295
$$ 52509 231982 22518 495505 125693 4294 -53571 -193694 -147115 53626 -339063 -264768
18264b64768F645J28845a72322A54496D0273g2801r9391a7474j49433g9826j28447
$$ -264768 6645 135490 -172322 154496 40273 -72801 -172192 -17474 -166907 -79826 -208273
18253b08273i5112j41896A37176b46418A65791L231c11262J42192J4844f280k35094
$$ -208273 -95112 -237008 137176 -246418 165791 169022 -311262 -169070 -154226 -6280 -241374
18242b41374e5008k69729h0748m75782A2779a96061f7323A24836b65627h2082
$$ -241374 -55008 -324737 -80748 -556530 12779 -196061 -67323 124836 -265627 -82082
18231e9732k47284h8844A28362B8843a52572A63337a01007A92907J7985F970e5185
$$ -59732 -307016 -88844 128362 28843 -152572 163337 -101007 192907 210892 6970 -55185
18219c7475k15611f027A7803a20136j45629E2847i0163c9133B495a98427A28622
$$ -37475 -253086 -6027 17803 -120136 -265765 52847 -90163 -39133 2495 -198427 128622
18207f348l9279p99A20721h2192G5443l0725a74066P3768A26537b5461A46244
$$ -6348 -45627 -46426 120721 -82192 75443 44718 -174066 -100298 126537 -25461 146244
18195I8170b10466o9969J29853A45301c5853H8205M1565a54012n0812d9012J0886
$$ 98170 -210466 -280435 -150582 145301 -35853 88205 129770 -154012 -204824 -49012 -38126
18184c8126j24211B29840j01061d3451N799C23345f4485q1018r0398A21135D2497
$$ -38126 -162337 229840 128779 -43451 -37652 323345 -64485 -145503 -235901 121135 42497
18172a09701A164a53090A32965c79631g3081A67852D4795e255j65359A0219J00569
$$ -109701 1164 -153090 132965 -379631 -73081 167852 44795 -5255 -170614 10219 110788
18161A10788h2097D1085i2178C066h2224o6211o9756B8598f9973j61339A11688
$$ 110788 -82097 41085 -92178 3066 -82224 -148435 -218191 28598 -69973 -231312 111688
18149C7954c03862A19513J74673c40786a47208r6375e7672j57486j0313i2248
$$ 37954 -303862 119513 294186 -340786 -147208 -243583 -57672 -215158 -225471 -92248
18138g9743K3624j99107J00843M1582P725j23418H3973e3186k6615k39780f0107
$$ -79743 -56119 -255226 -154383 -112801 -105076 -228494 83973 -53186 -79801 -319581 -60107
18126H5422b0705j60443B2043N156h6118o1888A78922f9186j24032B0386Q8618
$$ 85422 -20705 -181148 22043 27199 -86118 -148006 178922 -69186 -193218 20386 109004
18115A09004P5627i560C4096a08117k21431C3585b18616h7503j4167C79453A18332
$$ 109004 184631 -9560 34096 -108117 -329548 33585 -218616 -87503 -101670 379453 118332
18103A90906C6533c36638P0411I6971K04375E0373J10573q294A4419h9419E1888
$$ 190906 36533 -336638 -266227 96971 301346 50373 160946 152652 14419 -89419 51888
18091A07378b84275A04823a51461G5760F43a43404p5376E7087a61640b3951j54685
$$ 107378 -284275 104823 -151461 75760 643 -143404 -218780 57087 -161640 -23951 -178636
18080a78636A08626h9620e288A75015c69087f6505C27346H0640J82358c25123
$$ -178636 108626 -89620 -5288 175015 -369087 -66505 327346 80640 262998 -325123
18069b97976C5030j6690P4995a23336A1910J02303l0483j7940c66966a37675M5008
$$ -297976 35030 18340 93335 -123336 11910 114213 83730 65790 -366966 -137675 -92667
18058i2667o5295N7945o9365O1494r9364F2742B9776J82754A01091a31148G8806
$$ -92667 -157962 -100017 -169382 -107888 -207252 62742 29776 212530 101091 -131148 78806
18046A4999J11806a20365a2217o8200k68470a37464o7622A28879h7103r4917E851
$$ 14999 126805 -120365 -12217 -80417 -348887 -137464 -205086 128879 -87103 -182020 5851
18034i3002F4464J35167b7092A50435d9613a4234j7342P638m4404m1211m6579
$$ -93002 64464 199631 -27092 150435 -49613 -14234 -31576 -23938 -68342 -109553 -156132
18023a56132d5318l9380A32576a57043C54324a41789k30203A18706J2570a45827
$$ -156132 -45318 -84698 132576 -157043 354324 -141789 -371992 118706 131276 -145827
18012b39889a19018o375D426K38908a51992A59486a61378A01922D6357K7888k1348
$$ -239889 -119018 -125393 4426 243334 -151992 159486 -161378 101922 46357 74245 52897
18001E2897a71088k75667a15421M7472E4719a0414p3966B429J08299a3689j76018
$$ 52897 -171088 -446755 -115421 -67949 54719 -10414 -84380 2429 110728 -13689 -189707
17990a89707a6854B80080B112c20563a12907q4782A23935a4290j56736c3183D25216
$$ -189707 -16854 280080 2112 -320563 -112907 -197689 123935 -14290 -171026 -33183 425216
17978c29278C234b1894o5304k7197A93595H6346i3940j41692A76492c97195B18288
$$ -329278 3234 -21894 -87198 -114395 193595 86346 -93940 -235632 176492 -397195 218288
17966C7800Q7546a61563A57069I254K67240A19829c4288j76863H6778J8607a041
$$ 37800 125346 -161563 157069 9254 276494 119829 -34288 -211151 86778 105385 -1041
17954C04642N4821a99846f7798F9051f7806F5856j0959K37964c22766A13407K4201
$$ 304642 359463 -199846 -67798 69051 -67806 65856 54897 292861 -322766 113407 137608
17943A37608a21247A98763a96625C4376J7576R0715b19850h9621q5952c2608B11633
$$ 137608 -121247 198763 -196625 34376 51952 142667 -219850 -89621 -175573 -32608 211633
17931c34980e4668g642k1845C2567a12649p1258h1096B02332h1692j75374l1964
$$ -334980 -54668 -7642 -29487 32567 -112649 -183907 -81096 202332 -81692 -257066 -289030
17920b89030J29751M9453L0393B28283A0601K6755J72675b89926F0579k2420b7060
$$ -289030 -159279 -109826 -79433 228283 10601 37356 210031 -289926 60579 38159 -27060
17908d3752l6223q8396A67936A7291J63657a49495A22866g6438F60b1583D3710
$$ -43752 -79975 -168371 167936 17291 180948 -149495 122866 -76438 660 -21583 43710
17896a79011M3947C79449K0554a13667e4884j80105c0866A8935N2215a73677B9697
$$ -179011 -135064 379449 400003 -113667 -54884 -234989 -30866 18935 71150 -173677 29697
17884B1878J28249a54443A44114b27583b9470k91041A89314b17842j62246B36431
$$ 21878 150127 -154443 144114 -227583 -29470 -320511 189314 -217842 -380088 236431
17873A86764a31641P309G3527b4688n9571j01439C1637a13655A27421o0037b2156
$$ 186764 -131641 -124332 73527 -24688 -84259 -185698 31637 -113655 127421 67384 -22156
17861B64038D4377a17072A68424H2853A6631f569B16438b52417g5474j77940J1118
$$ 264038 44377 -117072 168424 82853 16631 -6569 216438 -252417 -75474 -253414 -242296
17850b42296d4966H7148i5745d6555p4144j05640f5399A1338a12115G58b01585
$$ -242296 -44966 87148 -95745 -46555 -120699 -226339 -65399 11338 -112115 758 -201585
17838A20883a03030A1825a66336N8797k82705A22436a36186d7196A55289F5388
$$ 120883 -103030 11825 -166336 -107539 -390244 122436 -136186 -47196 155289 65388
17827c2470F7070C199Q8315D410K0305a59607A63118p2947a85919j33391A30146
$$ -32470 67070 3199 91514 4410 24715 -159607 163118 90171 -185919 -319310 130146
17815a3177A27020a91332J4587M9511L6391I4207A059h0433b3894l337l07071
$$ -13177 127020 -191332 -176745 -127234 -90843 94207 1059 -80433 -23894 -27231 -334302
17804c34302A45524K21809j72369a56718q255O4889c3465j64768b40j43196A04171
$$ -334302 145524 367333 194964 -156718 -164973 -100084 -33465 -198233 -240 -143436 104171
17792a81865A09976B0546a34887F6821c70021f4003D4897b1479B31165g7198m6833
$$ -181865 109976 20546 -134887 66821 -370021 -64003 44897 -21479 231165 -77198 -124031
17781a24031K6621G0695b7688I5292Q0979c255B06701A7603R8478b00863H607
$$ -124031 -97410 70695 -27688 95292 176271 -3255 206701 17603 116081 -200863 8607
17769A71488d5266G9167b7942m0087D6959b489m23l67555B55324a74890D21359
$$ 171488 -45266 79167 -27942 -68029 46959 -2489 -2912 -370467 255324 -174890 421359
17757G3369e8776A60964L1785b7091a1322A12254e7104k72837c0849B66072B7701
$$ 73369 -58776 160964 192749 -27091 -11322 112254 -57104 -329941 -30849 266072 27701
17745I4937f2831A65428B1020a50739A10453J80696L3091M7346e9727k34313o6739
$$ 94937 -62831 165428 21020 -150739 110453 291149 324240 371586 -59727 -294040 -360779
17734c60779F3841h1225B16533a52494k64417a46749A94110A1905c6403j19190
$$ -360779 63841 -81225 216533 -152494 -416911 -146749 194110 11905 -36403 -155593
17724a55593M9375c3244m08358C40159c21381J59018B75598r2358b22891A96513
$$ -155593 -106218 -33244 -441602 340159 -321381 -162363 275598 183240 -222891 196513
17713A90329p9939K0902C0271r978c11660E4511d76572C20396e0056A7575b10784
$$ 190329 110390 131292 30271 20293 -311660 54511 -476572 320396 -50056 17575 -210784
17701g4621p7207e0920i484B30499l1159M5241a96022j69410A9283i33q2336k77264
$$ -74621 -151828 -50920 -9484 230499 199340 244581 -196022 -365432 19283 -933 -83269 -360533
17689c60533i1320F4868j9225d55165a2735A90705p6526f0146m7922B02081a0960
$$ -360533 -91320 64868 45643 -455165 -12735 190705 114179 -60146 -108068 202081 -10960
17677a68256j49759a27298n8439H2985N274K03342d7958m0593A13546J56770J6784
$$ -168256 -318015 -127298 -185737 82985 88259 291601 -47958 -88551 113546 270316 287100
17666B87100g2950M371k40125E6885f6337C29625A42714i4103G7276h1048A16577
$$ 287100 -72950 -68579 -308704 56885 -66337 329625 142714 -94103 77276 -81048 116577
17654A94658d8533I5787b22I4060A3914m368b41704C61862j75774k449b50240
$$ 194658 -48533 95787 -222 94060 13914 9546 -241704 361862 186088 183639 -250240
17642A41778f152J289H5753L5368c8484B99218a3523p0369A55402F6245h2381
$$ 141778 -6152 -4863 85753 121121 -38484 299218 -13523 -83892 155402 66245 -82381
17630B42178N8703f5800K8895A19711A6479J12383h2130o5472c132A17325c67187
$$ 242178 300881 -65800 -36905 119711 16479 128862 -82130 -147602 -3132 117325 -367187
17618a70264B09335J07637A21290a62954A99940p0648b95531B41570k695D2804
$$ -170264 209335 316972 121290 -162954 199940 129292 -295531 241570 238875 42804
17607a50328B00768p8815K12313e0207G138J45907J39828a21797B54483H5407
$$ -150328 200768 121953 334266 -50207 7138 153045 292873 -121797 254483 85407
17596c81767B93117g90n2558A6934M077R9636a46913G7341D625J39198a28259
$$ -381767 293117 -790 -53348 16934 21011 120647 -146913 77341 4625 143823 -128259
17584A40510a63930E0198e682A59412Q1808b68499B13896a51951r7760B94701
$$ 140510 -163930 50198 -5682 159412 241220 -268499 213896 -151951 -249711 294701
17573a83409A2979K65201Q4495e8018K7207A04453J76848g1083A8474K68275B9723
$$ -183409 12979 278180 362675 -58018 -30811 104453 281301 -71083 18474 286749 29723
17561i6835c0713j00683C2219c12151B64176A7785a75144A89444P7893r0981j8248
$$ -96835 -30713 -131396 32219 -312151 264176 17785 -175144 189444 267337 176356 158108
17550A58108a75811H6883h2301j83252b7328r0987N7060A58934B673J06603f3831
$$ 158108 -175811 86883 -82301 -265553 -27328 -118315 -61255 158934 2673 109276 -63831
17538C57559n5725H1001a92696B88200b2141k40294C152J91447M0920h2497C6302
$$ 357559 301834 81001 -192696 288200 -22141 -262435 3152 194599 235519 -82497 36302
17526d8970A43544c9989o5150b8315B85540C7956K53829G9724c21849C25576c16084
$$ -48970 143544 -39989 -105139 -28315 285540 37956 291785 79724 -321849 325576 -316084
17514c1314B78499B0729d0889B08067a05021E0278a36427C00467h9552B45448
$$ -31314 278499 20729 -40889 208067 -105021 50278 -136427 300467 -89552 245448
17503h405j44945f6270r9450B26391m6845k3700N3854c5184g76A91707D4483L17162
$$ -8405 -153350 -66270 -165720 226391 179546 155846 209700 -35184 -776 191707 44483 361645
17491C61645F696c13534A78403C1294j643J11779M246a07910a392I8292J07740
$$ 361645 6696 -313534 178403 31294 29651 141430 145676 -107910 -1392 98292 206032
17480B06032p6368j1132i576A86296D3510M23920F4828J43236k869E3659J13154
$$ 206032 129664 118532 -9576 186296 43510 467430 64828 208064 205195 53659 166813
17469A66813i4883A47537P1020a49005a9l0119j0717A50623a12820B9666L4521
$$ 166813 -94883 147537 218557 -149005 -19 -30138 -40855 150623 -112820 29666 64187
17458F4187k6623J00113J97464A31783M7230a56622A04352L42532k15127L92474
$$ 64187 37564 137677 335141 131783 179013 -156622 104352 446884 231757 624231
17448F24231k85584l0938C94J43357o684J57989G3127C0142O3693J47702J29342
$$ 624231 338647 307709 394 143751 137067 295056 73127 30142 93835 241537 370879
17437C70879n8890A17825K64017j72472j00840K49092k9839j38267P6370j26250
$$ 370879 311989 117825 381842 209370 108530 357622 327783 189516 265886 139636
17427A39636K42936b535j54783B08452m9218K00750a41129g516C95694a51392
$$ 139636 382572 -2535 -157318 208452 159234 359984 -141129 -7516 395694 -151392
17416C22843G7095J43805M6167r4554e9982C14285a68303A53356D3900J40113
$$ 322843 77095 220900 267067 172513 -59982 314285 -168303 153356 43900 184013
17406A84013a49100B83885K70462a76275C35851b33904B256a81353B95195r5149
$$ 184013 -149100 283885 554347 -176275 335851 -233904 2256 -181353 295195 200046
17396B00046F2812O43303D1344A0834M64878j89062a76966A45398m3651J00186
$$ 200046 62812 706115 41344 10834 475712 286650 -176966 145398 101747 201933
17386B01933C8448H371J25923D7548K63028p5985i4550C61746a03480I850b76968
$$ 201933 38448 8371 134294 47548 310576 234591 -94550 361746 -103480 9850 -276968
17374a10147A12244K4337J03911J06749L3419B9242a76645B74093k8652D4065
$$ -110147 112244 136581 240492 347241 380660 29242 -176645 274093 245441 44065
17363a83596C1767a05614N0239F1027J75944F2731K17665b10414E4374J82294
$$ -183596 31767 -105614 -55375 61027 236971 62731 280396 -210414 54374 236668
17353B36668K87457R4739k28524j42601a08709F7838J92477a67398D68646a80206
$$ 236668 524125 618864 390340 247739 -108709 67838 260315 -167398 468646 -180206
17342D7833J33696j0255E3210j9584M4156P5305l1153J23815L6822B4534Q9450
$$ 47833 181529 171274 53210 33626 77782 153087 121934 245749 282571 24534 113984
17331A13984J14941A10190K02867J91534e8268B93852A068O7191K67368F4947
$$ 113984 228925 110190 313057 504591 -58268 293852 1068 68259 335627 64947
17320a5370E39401A31122Q4939M5159J73491A63109D3517A8156L09050G1493J30165
$$ -15370 539401 131122 216061 261220 434711 163109 43517 18156 327206 71493 201658
17309B01658G0590R4658j3277J46937i4769B80962B1117c8414n4495B84009a18148
$$ 201658 70590 165248 151971 298908 -94769 280962 21117 -38414 -92909 284009 -118148
17297e1937B10491J69401H1177J21464f6386A18219a3721B40453r4232F5547F130
$$ -51937 210491 379892 81177 202641 -66386 118219 -13721 240453 146221 65547 6130
17285C74739A67047R7369l739C3504R3954b6640B88072I2082J64007q3889e7022
$$ 374739 167047 264416 260677 33504 127458 -26640 288072 92082 256089 172200 -57022
17273A77399l2604L5328a27475B90519n0859j18158K341l3390O572N9241J12639
$$ 177399 144795 180123 -127475 290519 239660 121502 123843 90453 97025 156266 268905
17262B68905A17884J63933r6476L214n0684P7463G0213M5294A0480K24827j01469
$$ 268905 117884 281817 185341 188555 137871 215334 70213 115507 10480 235307 133838
17251A33838k3217d4160H1648f0958B52650g9174n5651B00712m2616C3685K88775
$$ 133838 110621 -44160 81648 -60958 252650 -79174 -134825 200712 158096 33685 322460
17240C22460A28362M39084i7300D55361A56459f277A62459m7976J04391n9806
$$ 322460 128362 567446 -97300 455361 156459 -6277 162459 114483 218874 159068
17230A59068Q9182A16423C5955J71543J91932A45586J74892o4963K82705A83053
$$ 159068 248250 116423 35955 207498 399430 145586 320478 255515 538220 183053
17219A66739p1327J51641f0567D6234L54657J20990j82634a97430h8604B73505
$$ 166739 95412 247053 -60567 46234 400891 521881 339247 -197430 -88604 273505
17208A86520L72492j09071B22033a7180C60674r0574A04893D968b0725E5747K845
$$ 186520 559012 449941 222033 -17180 360674 270100 104893 4968 -20725 55747 58592
17197E8592P7713L12625j64200E4557R1571L75438E0768M07084B08882a66679
$$ 58592 136305 448930 284730 54557 146128 521566 50768 457852 208882 -166679
17186D44572j86690R3824R6188A89789O284E791a3054r2149B30802h3236J6268
$$ 444572 257882 351706 447894 189789 196073 5791 -13054 -105203 230802 -83236 -66968
17175f6968A22489L64024F1944K97942k6236Q7809C9484M26121A76785L69104
$$ -66968 122489 486513 61944 359886 333650 421459 39484 465605 176785 545889
17165E45889B39628l1584A5711L31883K9195a86473C38125j43233K6007J6721
$$ 545889 239628 208044 15711 347594 376789 -186473 338125 194892 220899 237620
17155B37620j0436C6065L29434R2532q7964A1336K80579j06664K98160B16701
$$ 237620 227184 36065 365499 458031 370067 11336 291915 185251 483411 216701
17144B59143M5897j6669K20098D9838L61142A66484m0472K18960j03466L81879
$$ 259143 305040 288371 508469 49838 410980 166484 126012 344972 241506 623385
17134F23385j59220r197B15186K24785r1696H3994L95284C6524K87226j31448
$$ 623385 464165 454968 215186 439971 348275 83994 479278 36524 323750 192302
17124A92302L457Q4200J11149P6857p8695D9535J62191P3550I7952N78043B92150
$$ 192302 195759 279959 391108 467965 389270 49535 211726 285276 97952 675995 292150
17112D44876j29962E5112L07547K12932q4219p8009A38852k6717M65966k44082
$$ 444876 314914 55112 362659 575591 491372 413363 138852 112135 578101 334019
17102C34019m6655K23414p2480N9316j96642K24403B28920A7454N97978A38307
$$ 334019 287364 510778 438298 497614 300972 525375 228920 17454 615432 138307
17091C45024P662r9750K20909K2034A13954K45578j37212N62359B46578N4945
$$ 345024 352686 252936 473845 495879 113954 359532 222320 784679 246578 301523
17081C01523j48528J48517M91567B58309L10103B21158K80034R9814B81531K04337
$$ 301523 152995 301512 793079 258309 568412 221158 501192 601006 281531 485868
17071D85868n309A55740J52174k7044J0305M55699B37926L2184K66034m4331K8861
$$ 485868 480559 155740 307914 280870 291175 746874 237926 270110 536144 491813 520674
17060E20674J68404N6728B23195M54355M6249j27470r0263k2549n6821j4335Q1476
$$ 520674 689078 745806 223195 677550 723799 596329 506066 483517 426696 412361 493837
17049D93837J3804K92170k90797J48172n6609J55436H3861L91263K05466j84355
$$ 493837 507641 799811 509014 657186 600577 756013 83861 475124 680590 496235
17039D96235O3564N6633j30160L4140J06539J2444k6263K44958l43589R9209K6321
$$ 496235 559799 616432 486272 520412 626951 639395 613132 858090 514501 613710 640031
17028F40031j43822N0802K61494j90087k26070N8746M53101j80162O4571j41926
$$ 640031 496209 547011 808505 618418 392348 451094 904195 724033 788604 646678
17018F46678N6239j47231L31146k62554J0850j82051K97784r3165r272N7356k6195
$$ 646678 702917 555686 886832 624278 635128 453077 750861 657696 648424 705780 679585
17007F79585B97672O55203M6801D43285r8043J89417o1758K25238L729J63913
$$ 679585 297672 952875 999676 443285 345242 534659 472901 698139 701868 865781
16997H65781j14148P2754l4107l7332P573j4493o6343K2092J32177D06097L39204
$$ 865781 751633 824387 790280 752948 760521 746028 679685 701777 833954 406097 745301
16986G45301J84670C58107K20690J79943j28414J1527K98934k6208L17407m22202
$$ 745301 929971 358107 578797 758740 630326 641853 940787 914579 1231986 809784
16976H09784p2225L66649Q5066k68724k94174J59521N0083N9164J7416J05842
$$ 809784 737559 1104208 1189274 920550 626376 785897 835980 895144 912560 1018402
16966A018402j23968Q6873k32922K65394j69359K82951k14353j02085P25099o65752
$$ 1018402 894434 981307 748385 1013779 844420 1127371 913018 810933 1536032 870280
16956H70280N09602j26676m64093N7483N60298j77554J11127k53614R2301j66272
$$ 870280 1379882 1253206 789113 846596 1406894 1229340 1340467 1086853 1179154 1012882
16946A012882K63233j93324P9555j64252L25879o2308k24600K56816q1829l0848
$$ 1012882 1276115 1082791 1162346 998094 1323973 1261665 1037065 1293881 1212052 1181204
16936A181204j59196L733K92440k34085M40964l73639k04811N18761l85162k80434
$$ 1181204 1022008 1025741 1318181 1084096 1525060 1151421 946610 1465371 1080209 799775
16926G99775L24144K57839L65350o78343J21909n3893K84399j4536j49776O02667
$$ 799775 1123919 1381758 1747108 1068765 1190674 1136781 1421180 1406644 1256868 1859535
16916A859535l31586k51203L75148k32002N2418Q1990k31854O4927K98305l47804
$$ 1859535 1527949 1276746 1651894 1419892 1472310 1554300 1322446 1387373 1685678 1337874
16906A337874K79260p4876M65262k60404q5313J12637J92170j08270L6025J28624
$$ 1337874 1617134 1542258 2007520 1747116 1661803 1774440 1966610 1858340 1894365 2022989
16896B022989m26989N15557j97327m6643q3785L35360k48669L98098M2421m75702
$$ 2022989 1596000 2111557 1914230 1867587 1783802 2119162 1870493 2268591 2311012 1835310
16886A835310K35562q3181J36029p2531J07750Q6670K74270l52340J20626p0843
$$ 1835310 2070872 1987691 2123720 2051189 2158939 2245609 2519879 2167539 2288165 2217322
16876B217322j524J51991J20008j24383K86039k38605L93495l45063Q4464K16586
$$ 2217322 2215798 2367789 2487797 2363414 2649453 2410848 2804343 2459280 2543744 2760330
16866B760330p5966l20261N44291o9868j69110J27920R4725O8782Q361K8254k06586
$$ 2760330 2684364 2364103 2908394 2838526 2669416 2797336 2892061 2960843 2969204 2997458 2790872
16855B790872L51872o0641j23559r3682L71929j51814N42502j68614k33277O21002
$$ 2790872 3142744 3082103 2958544 2864862 3236791 3084977 3627479 3458865 3225588 3846590
16845C846590o9925r9114J71945M14039m43804J8824n8007k9661O5330J04927
$$ 3846590 3776665 3677551 3849496 4263535 3819731 3838555 3780548 3750887 3816217 3921144
16835C921144K44239M2022R2376L12743o6267P8587l69719L54821j30939K93502
$$ 3921144 4165383 4207405 4299781 4612524 4546257 4624844 4255125 4609946 4479007 4772509
16825D772509M57528l22864J56421L84044l21031L02883K31396L33363l25942
$$ 4772509 5230037 4907173 5063594 5447638 5126607 5429490 5660886 5994249 5668307
16816E668307K19658r1006L30766R7065J95865J73158K51919m9575J65460l7795
$$ 5668307 5887965 5796959 6127725 6224790 6420655 6593813 6845732 6796157 6961617 6923822
16806F923822L07967K8184M79486o4122K04615R7230K11916L6204M34209P0860
$$ 6923822 7231789 7259973 7739459 7675337 7879952 7977182 8189098 8225302 8659511 8730371
16796H730371M78152J22883o4041J53145N94982K51648L59856J78608M17920r2850
$$ 8730371 9208523 9331406 9267365 9420510 10015492 10267140 10626996 10805604 11223524 11130674
16786A1130674M31182L39722L13568M69901N08119M10765K7061N85118M93167
$$ 11130674 11561856 11901578 12215146 12685047 13193166 13603931 13630992 14216110 14709277
16777A4709277L55352O11363N53059K2140P14651Q48360M24795O17086P76222
$$ 14709277 15064629 15675992 16229051 16251191 16965842 17814202 18238997 18856083 19632305
16768A9632305O89548N20838M83975J030643J311304N10337J056089J119012R66761
$$ 19632305 20321853 20842691 21326666 22357309 23668613 24178950 25235039 26354051 27320812
16759B7320812J156235J250565O93282J771989J419312J875103J032272J740124
$$ 27320812 28477047 29727612 30420894 32192883 33612195 35487298 36519570 38259694
16751C8259694J791637K002788J991367K037146K272490K509650K685332L083724
$$ 38259694 40051331 42054119 44045486 46082632 48355122 50864772 53550104 56633828
16743E6633828K756254L135660L632571L738146M227751M207147M798338M510951
$$ 56633828 59390082 62525742 66158313 69896459 74124210 78331357 83129695 87640646
16735H7640646N521612N646869N854728O320798O484555O731094P549301P244056
$$ 87640646 93162258 98809127 104663855 110984653 117469208 124200302 131749603 138993659
16727A38993659P613169P640412P602286P829913P147764O671450N736006M552977
$$ 138993659 146606828 154247240 161849526 169679439 176827203 183498653 189234659 193787636
16719A93787636L995200K601331R25585l28877j509356l006338m185270n644418
$$ 193787636 197782836 200384167 201309752 200980875 199471519 196465181 192279911 186635493
16711A86635493o367367p010473p660942p560150q572604p783118p622122p920171
$$ 186635493 180268126 173257653 165596711 158036561 149463957 141680839 134058717 126138546
16703A26138546p179318p383768p121282o044694n941992n665373m948974m994118
$$ 126138546 118959228 111575460 104454178 98409484 92467492 86802119 81853145 76859027
16695G6859027m658367m311414l935523l302524l552258k958782l479142k477502
$$ 76859027 72200660 67889246 63953723 60651199 57098941 54140159 50661017 48183515
16687D8183515k479404k485675j938505j993138k286798j399915k003072j555338
$$ 48183515 45704111 43218436 41279931 39286793 36999995 35600080 33597008 32041670
16679C2041670j359684j336303j553174r08739j058596q40110j454383o93111
$$ 32041670 30681986 29345683 27792509 26883770 25825174 24985064 23530681 22837570
16671B2837570r06189n41232j057719q20374r11730o49235m76350p27214r00534
$$ 22837570 21931381 21390149 20332430 19512056 18600326 17951091 17474741 16747527 15846993
16662A5846993j65259m43559q30971l14370o43975k53085k90414o81241J7856
$$ 15846993 15681734 15238175 14407204 14092834 13448859 13195774 12905360 12224119 12241975
16653A2241975k04978o29114l16769n57452j94120n58253R0246l45962n76530
$$ 12241975 12036997 11407883 11091114 10533662 10339542 9781289 9871535 9525573 8949043
16644H949043j56670L65086o82993j07275n50107J79244j6931m27884l14807k71029
$$ 8949043 8792373 9157459 8474466 8367191 7817084 7996328 7979397 7551513 7236706 6965677
16634F965677l42414L2605k4238J8994k53215l55761k57197N9888K24293l73709
$$ 6965677 6623263 6655868 6631630 6650624 6397409 6041648 5784451 5844339 6068632 5694923
16624E694923j16582j11076l84121J92035k16578K20277m46697J45008m50988
$$ 5694923 5578341 5467265 5083144 5275179 5058601 5278878 4832181 4977189 4526201
16615D526201N7955j01779m6208m4240k89767J47493n5562m08292K92790l36563
$$ 4526201 4584156 4482377 4436169 4391929 4102162 4249655 4194093 3785801 4078591 3742028
16605C742028m03005K15283K57451m25245q9543K4473M24300r1910j81424k08491
$$ 3742028 3339023 3554306 3811757 3386512 3296969 3321442 3745742 3653832 3472408 3263917
16595C263917K41961o61338K86290l51073J64443j3417p0367k54393m5227K8364
$$ 3263917 3505878 2844540 3130830 2779757 2944200 2930783 2860416 2606023 2560796 2589160
16585B589160J30554k9483j89339R0135j31374J45202j66233J08836J67615l38181
$$ 2589160 2719714 2690231 2500892 2591027 2459653 2604855 2438622 2547458 2715073 2376892
16575B376892q6274j11490o7601p842j69156K77326l75815J92592J34409j49954
$$ 2376892 2290618 2179128 2111527 2103685 1934529 2211855 1836040 2028632 2163041 2013087
16565B013087J46545k51521k02150K08556L49077m85472k4928K61827j96366j57567
$$ 2013087 2159632 1908111 1705961 1914517 2263594 1778122 1753194 2015021 1818655 1661088
16555A661088L09187l66980K1304l5140j28814J19749J2096j4702k63563L1961
$$ 1661088 1970275 1603295 1624599 1589459 1460645 1580394 1592490 1577788 1314225 1346186
16545A346186M0252J70047Q356Q9341m55185M63114m04953O9655j36342M8308
$$ 1346186 1386438 1556485 1564841 1654182 1198997 1662111 1257158 1326813 1190471 1238779
16535A238779J42600k05195L33595j94318k15958K50489j25157l0461n7227P0977
$$ 1238779 1381379 1176184 1509779 1315461 1099503 1349992 1224835 1194374 1137147 1208124
16525A208124k63174K81521R5004k68914K54415k33609n7582K81988o12220O86328
$$ 1208124 944950 1226471 1321475 1052561 1306976 1073367 1015785 1297773 685553 1371881
16515A371881n17999J86426j24548K82274j96094j084Q610q4963J2152o4132L69452
$$ 1371881 853882 1040308 915760 1198034 1001940 1000856 1009466 924503 936655 872523 1241975
16504A241975l47803J01791L4534m55813K20646Q4342L5252k91891K22554O2217
$$ 1241975 894172 995963 1030497 574684 795330 879672 914924 623033 845587 907804
16494I07804j98900J60878j39661k7010J66281j1191k72541L20367k99752K91400
$$ 907804 708904 869782 730121 703111 869392 858201 585660 906027 606275 897675
16484H97675j65431l14504J71193K12379B88263N81354p288m8123R1943k28002
$$ 897675 732244 417740 588933 801312 288263 869617 862329 814206 906149 678147
16474F78147j48422J14614j24968J46938j59518J98962A99030K91403M45018m56837
$$ 678147 529725 644339 519371 666309 506791 705753 199030 490433 935451 478614
16464D78614k7339K53662M890J44629l93882J1491K28486k06863J2813J45230
$$ 478614 451275 704937 709827 854456 460574 472065 700551 493688 506501 651731
16454F51731J44920l29368j03073K16480J92399l18794p7873J42258j03539K73686
$$ 651731 796651 467283 364210 580690 773089 454295 376422 518680 415141 688827
16444F88827A87528O87503k83313B71127J25900r8361l7965n5065J5206K54060
$$ 688827 187528 875031 591718 271127 397027 298666 260701 205636 220842 474902
16434D74902L9529q1783j73912J68957K86068p5353H9277K60970M14953B51140
$$ 474902 514431 432648 258736 427693 713761 638408 89277 350247 765200 251140
16423D23052j40896J48143K89570O4385l21643Q458A32086M6022L85888k00794
$$ 423052 282156 430299 719869 784254 462611 471069 132086 178108 563996 363202
16413C63202K48842k82452J52085j57501K62247A88006K11341k7010j50013K41742
$$ 363202 612044 329592 481677 324176 586423 188006 399347 372337 222324 464066
16403D64066N4962A01448L60400k20364J58938j69312J03640J43700A21849M92077
$$ 464066 519028 101448 461848 241484 400422 231110 334750 478450 121849 613926
16393F13926k72527R5045n9607J12708k42582R2334k8013J86205m9172o9422j52714
$$ 613926 341399 436444 376837 489545 246963 339297 311284 497489 448317 378895 226181
16382B26181F3454J03193Q5808j11468J272P2357O7192f263C52180j75129N5559
$$ 226181 63454 166647 252455 140987 142259 214616 281808 -6263 352180 177051 232610
16371B32610J678J54882d1899B16244J12462A58116J56471K62258j01034D698
$$ 232610 234288 389170 -41899 216244 328706 158116 314587 576845 475811 4698
16360B45620K15776a6054F1275M81831A85545K58736B9427K32436O4053j61741
$$ 245620 461396 -16054 61275 543106 185545 444281 29427 261863 325916 164175
16350A64175L7020f0800D07907j79117O6416e2929A10556K28188L6850G0964j0064
$$ 164175 201195 -60800 407907 228790 295206 -52929 110556 338744 375594 70964 60900
16339F0900K51179A1155K08288D3430L09882j61391N356J14743P0636J259m6931
$$ 60900 312079 11155 219443 43430 353312 191921 197277 312020 382656 383915 336984
16328C36984j57608M3840A078N60211j41463A9554K26006a1137B36375o2997H2506
$$ 336984 179376 223216 1078 561289 419826 19554 245560 -11137 236375 173378 82506
16316H4172K57326g650B58178a10976C46939l5865J09798A98216N3778A08980
$$ 84172 341498 -7650 258178 -110976 346939 311074 420872 198216 251994 108980
16305B31436r8677J13123K809E3695N3170J35923m5079K2292m1803J38294H9895
$$ 231436 132759 245882 248691 53695 106865 242788 197709 220001 178198 316492 89895
16293E25563C6614K1924L22558j32888b2184D13921A17652K97264H8777L24195
$$ 525563 36614 58538 381096 248208 -22184 413921 117652 414916 88777 412972
16283D12972j41647o5983p2532D8206K5268P3369J9181L16618b4597E9264O772
$$ 412972 271325 205342 132810 48206 73474 146843 166024 482642 -24597 59264 66036
16272F6036P661F992K08974j8116J12469a44468d1844C1475o143L52573a0252
$$ 66036 73697 6992 215966 197850 310319 -144468 -41844 31475 25332 377905 -10252
16260A56116b6628o2153B08521n889B8514J90740E5709M0773K4413B0987J48343
$$ 156116 -26628 -88781 208521 202632 28514 219254 55709 96482 120895 20987 169330
16249A69330J4585a60786d3279D73079a17472A3245L83157h2378b4135B44422
$$ 169330 183915 -160786 -43279 473079 -117472 13245 396402 -82378 -24135 244422
16238B55121b94450d4242B69644A9161c17907B62693E7290a86979N4628C81366
$$ 255121 -294450 -44242 269644 19161 -317907 262693 57290 -186979 -132351 381366
16227a43555C03820q3773A08983m9979e2180k15472B17027o1701J01214B2463
$$ -143555 303820 220047 108983 59004 -52180 -267652 217027 155326 256540 22463
16216a54456H4324f1925H8949c0160A16432K9585b4872m3848o5873A1777a23770
$$ -154456 84324 -61925 88949 -30160 116432 146017 -24872 -68720 -134593 11777 -123770
16204I3994l8574L75244C7283a12193A28594a00077j1414B73453e0598I7317a1323
$$ 93994 55420 430664 37283 -112193 128594 -100077 -111491 273453 -50598 97317 -11323
16192A54007B0730f3029A25043a99469H577P6689R9742a33563B7225a84233B68570
$$ 154007 20730 -63029 125043 -199469 8577 85266 185008 -133563 27225 -184233 268570
16180F1109g6469F2045Q2818c74873a34915F9856a92226h3815B82530F628b6286
$$ 61109 -76469 62045 144863 -374873 -134915 69856 -192226 -83815 282530 6628 -26286
16168B8823J36131D3953d4885B50211e7982b4507A35523j321b14296P1983j13682
$$ 28823 164954 43953 -44885 250211 -57982 -24507 135523 134202 -214296 -142313 -255995
16157b55995B9453J41244e4558B87578c1149B03887H4058g0760a8390A90499b21680
$$ -255995 29453 170697 -54558 287578 -31149 203887 84058 -70760 -18390 190499 -221680
16145C29719j28605K58135I796b66317I6140b2803A64056J61551b44270A88838
$$ 329719 201114 459249 9796 -266317 96140 -22803 164056 325607 -244270 188838
16134C00338D3429e3827c783G2673g131A70940o1369a50386G8299c483p796l3482
$$ 300338 43429 -53827 -3783 72673 -7131 170940 109571 -150386 78299 -3483 -11279 -44761
16122d4761B99394a32521j33314E121M9468c9721B6272b37587j64173B09358n9801
$$ -44761 299394 -132521 -265835 5121 54589 -39721 26272 -237587 -401760 209358 149557
16111A49557e5380l47610C28617D6956a09241B99180j23622O7598q5339h246A29990
$$ 149557 -55380 -402990 328617 46956 -109241 299180 175558 243156 157817 -8246 129990
16099I8551J96681c48371A74331A3064J37282l3974i254D37509b51227i9880H8292
$$ 98551 295232 -348371 174331 13064 150346 116372 -9254 437509 -251227 -99880 88292
16087B86990C9258h3880G3338c18925e1704C90602g5296E5013R1138h5764D8431
$$ 286990 39258 -83880 73338 -318925 -51704 390602 -75296 55013 146151 -85764 48431
16075A39095b44568C2923i1173c3010k46638A83351c47252A4818a21135C1126
$$ 139095 -244568 32923 -91173 -33010 -279648 183351 -347252 14818 -121135 31126
16064C9821O7799K55943d1690F7393K41791j08945G8145d5658I6346f3436A81145
$$ 39821 107620 363563 -41690 67393 309184 200239 78145 -45658 96346 -63436 181145
16052b0544B25590c8960B85891E6779g3338k28864G1370b37988A30890J89776
$$ -20544 225590 -38960 285891 56779 -73338 -302202 71370 -237988 130890 320666
16042C20666a69464A35765l5207a01120d2586A85134b12145E0170a03920A35819
$$ 320666 -169464 135765 100558 -101120 -42586 185134 -212145 50170 -103920 135819
16031a14515A9686J31350b64209B59066F6688Q364c38854H6025h6411n4518j69891
$$ -114515 19686 151036 -264209 259066 66688 75052 -338854 86025 -86411 -140929 -310820
16020c10820D02561a56121O9572a1033j58382B7013N1504C6475b83154b4527k86948
$$ -310820 402561 -156121 -86549 -11033 -169415 27013 78517 36475 -283154 -24527 -311475
16009c11475J39949B20474a82938D15895B2256C275a24674a3155B26803a42239
$$ -311475 -171526 220474 -182938 415895 22256 3275 -124674 -13155 226803 -142239
15998A98202g8625K1809j80252F8125b95764p7503D7563J78004i3081j44506R3089
$$ 198202 -78625 -56816 -237068 68125 -295764 -373267 47563 225567 -93081 -237587 -144498
15987a44498k64630d4507B0359a26385E04129A95668J10653J95599E0649J00289
$$ -144498 -409128 -44507 20359 -126385 504129 195668 306321 501920 50649 150938
15977A50938b45648B35608F678K93469a17275B3085O3410C2183J06915k920n1088
$$ 150938 -245648 235608 6678 300147 -117275 23085 86495 32183 139098 136178 85090
15966H5090J28051m074c19847g5474J4782J6125C13403i0783D5302d0767B26446
$$ 85090 213141 209067 -319847 -75474 -60692 -44567 313403 -90783 45302 -40767 226446
15954F9985d04449E8256G36L5236M1734c69619C7276J11119k1758B4289c710k24593
$$ 69985 -404449 58256 736 35972 77706 -369619 37276 148395 126637 24289 -3710 -228303
15942b28303I646L4572i3342m7059k28687G6120j8338a33191j68939i7027j4490
$$ -228303 9646 44218 -93342 -140401 -369088 76120 57782 -133191 -302130 -97027 -111517
15931a11517c8308C35355d95227K46456c8659j46625B48412e4382p3599n0195
$$ -111517 -38308 335355 -495227 -248771 -38659 -185284 248412 -54382 -127981 -178176
15921a78176D02077j82992a61722p936K0171J4082f3332B43258a60525k35579
$$ -178176 402077 219085 -161722 -169658 -149487 -135405 -63332 243258 -160525 -396104
15911c96104a11407k0217A0599e074j10846A34235j1968e0386k06477a24563A1712
$$ -396104 -111407 -131624 10599 -5074 -115920 134235 122267 -50386 -256863 -124563 11712
15899A46323A6067a45914A83139G4733h6575j22629k8408a02165N224B39655F2203
$$ 146323 16067 -145914 183139 74733 -86575 -209204 -237612 -102165 -96941 239655 62203
15887a9135B14074r6798b17345a02851j47781A62867b01267h285m2673j47129
$$ -19135 214074 117276 -217345 -102851 -250632 162867 -201267 -8285 -50958 -198087
15877a98087Q3021b893l313j22821B63622a52438A92007C4471b98731f9190j59882
$$ -198087 -115066 -2893 -6206 -129027 263622 -152438 192007 34471 -298731 -69190 -229072
15866b29072B28420E940J28448d0419j41988g8205B58690j04849b53867I9660
$$ -229072 228420 5940 134388 -40419 -182407 -78205 258690 153841 -253867 99660
15855a0398A82157d4067j06218l4849a6713j00199m9149A87187m9482C4035b43267
$$ -10398 182157 -44067 -150285 -185134 -16713 -116912 -166061 187187 137705 34035 -243267
15843e7767A82805a67137o3022C9207A5659b0064k3805B2195a76489e1574k79465
$$ -57767 182805 -167137 -230159 39207 15659 -20064 -43869 22195 -176489 -51574 -331039
15832c31039A65770a66355O9075j75496a27975k68077P5686A91501d03205A56630
$$ -331039 165770 -166355 -97280 -272776 -127975 -396052 -320366 191501 -403205 156630
15821B50009b27512A46739c12943J16830f0334D0267b46929M5907H6747K13046
$$ 250009 -227512 146739 -312943 -196113 -60334 40267 -246929 -201022 86747 299793
15811B99793a85992d9842A77390R4970d6929C6444J7228a35925A04589i7831d365
$$ 299793 -185992 -49842 177390 272360 -46929 36444 53672 -135925 104589 -97831 -4365
15799g6792L1012A4372e9606k37297I2740e8015o1387l08742a99210j80574b246
$$ -76792 -45780 14372 -59606 -296903 92740 -58015 -119402 -428144 -199210 -379784 -2246
15787D44006c36683D8151J36874a50193N659m487j08099K1684B5382a25659e6420
$$ 444006 -336683 48151 185025 -150193 -144534 -149021 -257120 -235436 25382 -125659 -56420
15775F5573L05906b82194J24819f3952k56838a44622j46392A80632a87295d233
$$ 65573 371479 -282194 -157375 -63952 -320790 -144622 -291014 180632 -187295 -4233
15764A45697b26732O7325k4381k1522B54414B9020N2011K55497A03877M7325B8199
$$ 145697 -226732 -159407 -183788 -205310 254414 29020 81031 336528 103877 151202 28199
15752a7064r0531I9585m35D3929a06204B68712b9156A32308j1290a83464e8390
$$ -17064 -107595 99585 99150 43929 -106204 268712 -29156 132308 121018 -183464 -58390
15740a7490j18766A31479a55556F5474c03699B2961a12075J1984j67774J20365
$$ -17490 -136256 131479 -155556 65474 -303699 22961 -112075 -100091 -267865 -147500
15730a47500D30332C0936e7026b3788l861F667N880K4210K5548Q9519J28860I0953
$$ -147500 430332 30936 -57026 -23788 -27649 6667 12547 36757 62305 151824 280684 90953
15717a89520h1076B238d2553q3458j6930q2799C723J87101H9168N359c23484Q5207
$$ -189520 -81076 2238 -42553 -126011 -142941 -225740 3723 190824 89168 94527 -323484 -238277
15705b38277j0146J20580b4317j04174B28695f2720j98160g7313l8097H9473a37032
$$ -238277 -248423 -127843 -24317 -128491 228695 -62720 -260880 -77313 -115410 89473 -137032
15693a24571B70992b67425A49340K05765K00937b31497j03681a0568k09918H4332
$$ -124571 270992 -267425 149340 355105 556042 -231497 -335178 -10568 -220486 84332
15682H6811i0996j07905d7292B31759B0117d1745n4919J2115a5665A17973J57835
$$ 86811 -90996 -198901 -47292 231759 20117 -41745 -96664 -84549 -15665 117973 275808
15671B75808a61919g5589k8591C32912A58280b1063k5888j06748r5950f8031j7787
$$ 275808 -161919 -75589 -104180 332912 158280 -21063 -46951 -153699 -249649 -68031 -85818
15660h5818G8004c03511J34094M4475H2047K8889B3488a69053A24751j0514d888
$$ -85818 78004 -303511 -169417 -124942 82047 110936 23488 -169053 124751 114237 -4888
15648c21555f160C3294d9073l4161B312a21328B34511a09176H7213c16513G1890
$$ -321555 -6160 33294 -49073 -83234 2312 -121328 234511 -109176 87213 -316513 71890
15636a74682A5334h6250F1851d4963k57088J11932j48052k7914f0119m3602l11139
$$ -174682 15334 -86250 61851 -44963 -302051 -190119 -338171 -366085 -60119 -103721 -414860
15625d14860G5899J64746a61740f3242M16l7734D31034j39773F1209b36516A24468
$$ -414860 75899 240645 -161740 -63242 -62826 -100560 431034 291261 61209 -236516 124468
15613A97124c08619A33114J13448h2439o2378k26991A34879a10704n3581M9380
$$ 197124 -308619 133114 246562 -82439 -144817 -371808 134879 -110704 -164285 -114905
15603a14905A14277C1312a81033H9204P8573A1123g0385B16691L6165n5251a36758
$$ -114905 114277 31312 -181033 89204 167777 11123 -70385 216691 252856 197605 -136758
15591D5520a54778j41301A6512d351a813A58219b96720J17615E9985a1891j11424
$$ 45520 -154778 -296079 16512 -4351 -1813 158219 -296720 -179105 59985 -11891 -123315
15580a23315A19329E6904b5573j26285K1931A06084N4268J9855a77928K8679A3429
$$ -123315 119329 56904 -25573 -151858 -129927 106084 160352 180207 -177928 -149249 13429
15568d3455j78184l1739J3100a06268C5585b00358c6564F6991R1650G5136j2065
$$ -43455 -221639 -253378 -240278 -106268 35585 -200358 -36564 66991 158641 75136 63071
15557F3071M7547a47715F9206a2308A4363B612a93362c336j88469B8208a32354
$$ 63071 110618 -147715 69206 -12308 14363 2612 -193362 -3336 -191805 28208 -132354
15545B89108A04748b56450A54158i1368B77385l3350d0287F6771k8104C99b19339
$$ 289108 104748 -256450 154158 -91368 277385 244035 -40287 66771 38667 399 -219339
15533H5105b2142m0376A72760A3597d5411j71203B24314a17380B13246b71832
$$ 85105 -22142 -62518 172760 13597 -45411 -216614 224314 -117380 213246 -271832
15522g4796b0105j03120A61392a23023n2393P1195p9506b9317l9683A65172n8650
$$ -74796 -20105 -123225 161392 -123023 -175416 -104221 -183727 -29317 -69000 165172 106522
15511A06522L62805k01952q682a98050k09410a650A3358J13181k5858i3202B21210
$$ 106522 469327 267375 258693 -198050 -407460 -1650 13358 126539 100681 -93202 221210
15499b40633d3466c723r1850a1451D18303h4430C4621J62526E6012d8467B22290
$$ -240633 -43466 -3723 -95573 -11451 418303 -84430 34621 197147 56012 -48467 222290
15487C2630e45559F1494h551E503a9062n8193B72885g853C3554n402K10102C592
$$ 32630 -545559 61494 -8551 5503 -19062 -77255 272885 -7853 33554 28152 238254 3592
15474B80136E6327b20287A06379K3129h9553I7608B0120b49554e1467C2243c7883
$$ 280136 56327 -220287 106379 129508 -89553 97608 20120 -249554 -51467 32243 -37883
15462B8618K84655f4046p019k58380C02086a91989a0690j42798A07907O605b11808
$$ 28618 313273 -64046 -71065 -329445 302086 -191989 -10690 -153488 107907 114512 -211808
15450b5406H0883K00744Q06K10858a00276B27835D1700f5514j89392c0173A1681
$$ -25406 80883 281627 282433 493291 -100276 227835 41700 -65514 -254906 -30173 11681
15438a72519B5678a25564C09601j19052b10085j9631D5339b91B50855r7343a044
$$ -172519 25678 -125564 309601 190549 -210085 -229716 45339 -291 250855 153512 -1044
15426a31709c1415C0675J2683J76817e4160C2220a25459A02716c32753B9855a26299
$$ -131709 -31415 30675 43358 220175 -54160 32220 -125459 102716 -332753 29855 -126299
15414A34129b29033A16987D7810f160k92139j20646C15474E104J0708a39963E2211
$$ 134129 -229033 116987 47810 -6160 -298299 -418945 315474 5104 15812 -139963 52211
15402d16170A59721c3783C62528e9672D2693a97957k2645E474g4470o1629B39118
$$ -416170 159721 -33783 362528 -59672 42693 -197957 -220602 5474 -74470 -136099 239118
15390D07291m8842A690Q6686N0225l5289Q0865a85E4054g3305m5342D6793b3204
$$ 407291 358449 1690 88376 138601 103312 184177 -185 54054 -73305 -118647 46793 -23204
15377a91318E1064e4617q4379D3871Q5298n3634f4045B60292a14453o5594j3477
$$ -191318 51064 -54617 -138996 43871 129169 75535 -64045 260292 -114453 -180047 -193524
15366a93524B94168n3568J05045e8392j18799H9196K01569c45459A7820b26099
$$ -193524 294168 240600 345645 -58392 -177191 89196 290765 -345459 17820 -226099
15355a60999A70463E8950J85238H6162b04296A30190J92139B4934J4009a40916
$$ -160999 170463 58950 244188 86162 -204296 130190 322329 24934 38943 -140916
15344G6691j0049a78562h7491k3321B9040N0080b34280f5486n8787j0778A16965
$$ 76691 66642 -178562 -87491 -110812 29040 79120 -234280 -65486 -124273 -135051 116965
15332c5362J6375D7409J73974H6047a8826n2002D2889j5762b25955J11543A43341
$$ -35362 -18987 47409 221383 86047 -18826 -70828 42889 27127 -225955 -114412 143341
15320H1116b7466o0317D46296C052g0667j01960A53102d2880j84961j18707d0455
$$ 81116 -27466 -87783 446296 3052 -70667 -172627 153102 -42880 -227841 -346548 -40455
15308A43813M3012j1228L0055b88670A0099Q6743a08914d6687B29872c5710H9167
$$ 143813 186825 175597 205652 -288670 10099 96842 -108914 -46687 229872 -35710 89167
15296A40379L0162a08984E9144J4850d5235A1545L37843a59110f0534l57543C76444
$$ 140379 170541 -108984 59144 73994 -45235 11545 349388 -159110 -60534 -418077 376444
15284f5688I2050k8515M6227a22801e891B38168a08743C87451F908J71991J00394
$$ -65688 92050 63535 109762 -122801 -5891 238168 -108743 387451 6908 178899 279293
15273B79293a70913B23815L3005o0395f5115A3112J25197n7025a42832I7263a89914
$$ 279293 -170913 223815 256820 196425 -65115 13112 138309 81284 -142832 97263 -189914
15261e9747A35588f9585a4011D09916G2950M1959J00576A06485j9069K23560J5705
$$ -59747 135588 -69585 -14011 409916 72950 114909 215485 106485 87416 310976 326681
15250C26681N3147J73769N36366J38261j50274L27305m82683C50751p4465A2690
$$ 326681 379828 553597 1089963 1228224 1077950 1405255 922572 350751 276286 12690
15239F2857L03704p4462g9060B64558m2041C9193J64172q7253L43564F8000C1600
$$ 62857 366561 292099 -79060 264558 222517 39193 203365 116112 459676 68000 31600
15227A24574f8376D9428J53687J07243Q3774a04558c786A05533b52184A41532
$$ 124574 -68376 49428 203115 310358 394132 -104558 -3786 105533 -252184 141532
15216H3589J49865j04270J48017E1377g4420A58964G0398g5926j37748B22382
$$ 83589 233454 129184 277201 51377 -74420 158964 70398 -75926 -213674 222382
15205F7251i855A84790a89178I1688O4684L7878P3942a02699b2336o7782j36622
$$ 67251 -9855 184790 -189178 91688 156372 194250 268192 -102699 -22336 -90118 -226740
15194b26740A9121J37751J27659b5636k73196i6885L0644A10717b50608C39851
$$ -226740 19121 156872 284531 -25636 -298832 -96885 -66241 110717 -250608 339851
15183e7163F4285b25343C09022i588k92849i891A97014A1246a41886f7843D49136
$$ -57163 64285 -225343 309022 -9588 -302437 -9891 197014 11246 -141886 -67843 449136
15171A57308g9230j50198E0959A9372h14j25341F859c1182m7485o568A90126j4921
$$ 157308 -79230 -229428 50959 19372 -814 -126155 6859 -31182 -78667 -85235 190126 175205
15159A75205k0721j1272F4146f5017j91615C08622a10042D5251d4141E5607m64
$$ 175205 154484 143212 64146 -65017 -256632 308622 -110042 45251 -44141 55607 55143
15148E5143B5752L7079L364A3572K43088h1222A25722K87463J4975b55769h9734
$$ 55143 25752 62831 66195 13572 256660 -81222 125722 413185 428160 -255769 -89734
15136B14464n5966f242k20151C77547C8718L24K61382o6343o068a41342D15530
$$ 214464 158498 -6242 -226393 377547 38718 39042 300424 234081 228013 -141342 415530
15124D2960J25818k256a02702A90573f5303L2325B44467m3036F941J13253K03157
$$ 42960 168778 166522 -102702 190573 -65303 -32978 244467 201431 6941 120194 323351
15113C23351D9860K48888l7384f9296A5466a62420C51595b67784A03317J32472
$$ 323351 49860 298748 261364 -69296 15466 -162420 351595 -267784 103317 235789
15103B35789Q9495f6925B59320a21083A60809a74963G8682d6175A50055L8822
$$ 235789 325284 -66925 259320 -121083 160809 -174963 78682 -46175 150055 188877
15093A88877n3020m5686g0958B44129N8879j05913D2584c7450p2865B2658c01874
$$ 188877 135857 90171 -70958 244129 303008 197095 42584 -37450 -110315 22658 -301874
15081B86193A41674b2915B31127p4075K60077j16864E9712a16443A17860a25591
$$ 286193 141674 -22915 231127 157052 417129 300265 59712 -116443 117860 -125591
15070a32498B19285J33616j42012m7672J03960j7620B674R7092L68647B31102
$$ -132498 219285 352901 210889 163217 267177 249557 2674 99766 468413 231102
15059A50008i4817c2426D12570k00720A6788J55115K3981J2473a4804j66412C33856
$$ 150008 -94817 -32426 412570 211850 16788 171903 195884 208357 -14804 -181216 333856
15047A15404Q5383C2107J99461a77624B63587o5954A2364l128K02148j01165J8407
$$ 115404 200787 32107 231568 -177624 263587 197633 12364 9236 211384 110219 128626
15036A28626J44903J8795l8900a3463B40689r7456L8229Q3319a81778B8078K76680
$$ 128626 273529 292324 253424 -13463 240689 143233 181462 264781 -181778 28078 304758
15025C04758F1799b1795J0863A77873e4483k23118B57200J07763I7081a42186
$$ 304758 61799 -21795 -10932 177873 -54483 -277601 257200 364963 97081 -142186
15014B87824G1628M924K18454A24485a22716B10975c78312F9732A6564M06567
$$ 287824 71628 76552 295006 124485 -122716 210975 -378312 69732 16564 423131
15004D23131q6268b4805B09744P7504A22663J84761j2209K4610r5664n0683l2501
$$ 423131 336863 -24805 209744 287248 122663 307424 295215 319825 224161 173478 140977
14993A40977J1564i4510B50624p6537K35634j74405Q4016q0718K9281f2463H6563
$$ 140977 152541 -94510 250624 174087 409721 235316 319332 238614 267895 -62463 86563
14981E5731J33182l5342n8089J23042p3057K89358k15788C1068J12816j0501L47696
$$ 55731 188913 153571 95482 218524 145467 434825 219037 31068 143884 133383 481079
14970D81079B15050o3492O0871E0205J76027d7513D21818I9108N51558j58116
$$ 481079 215050 151558 212429 50205 226232 -47513 421818 99108 650666 492550
14960D92550A06703c0227G9704O5090L51596L43A52013G5201O4644J124n9151
$$ 492550 106703 -30227 79704 144794 496390 496733 152013 75201 139845 140969 81818
14949H1818L66750k14961K4722q4751G7664M20816B3237L08539A14536L11505
$$ 81818 448568 233607 258329 173578 77664 498480 23237 331776 114536 426041
14939D26041G4062A5598L95210j95980J12451O7919J06808j89834J44637B04558
$$ 426041 74062 15598 410808 214828 327279 395198 502006 312172 456809 204558
14928D90432k09007J55816j13624j09713J37307r2601C8153K21861J50378j05531
$$ 490432 281425 437241 323617 213904 351211 258610 38153 260014 410392 304861
14918C04861Q2954A54908J77998J15j24912I154L03175N5870J6723A80907M1450
$$ 304861 387815 154908 332906 333021 208109 9154 312329 368199 384922 180907 222357
14907B22357L17090q8085A80884L61513B16156i6936A51103R2310c3829E08566
$$ 222357 539447 451362 180884 542397 216156 -96936 151103 243413 -33829 508566
14896B03358L9571k2903n6751K43235l6594L2566k0759K12915A87346K2497I7567
$$ 203358 242929 220026 163275 406510 369916 402482 381723 594638 187346 209843 97567
14884a15236B63415J26292j00923l9181O3028O1338l1401A09249L59848j65080
$$ -115236 263415 389707 288784 249603 312631 373969 342568 109249 469097 304017
14874C04017o0738L0001K65086r4424J52676k47102N9619j1447J89993k11052
$$ 304017 243279 273280 538366 443942 596618 349516 409135 397688 587681 376629
14864C76629j15204R5045K35883k47220K14630k06934L32922A64732L33863J03735
$$ 376629 261425 356470 592353 345133 559763 352829 685751 164732 498595 602330
14854F02330A76159k2366N34215B80735K28508j18835Q2045l2983m6474j78556
$$ 602330 176159 153793 688008 280735 509243 390408 472453 439470 392996 214440
14844B14440L32801m8446k2658q0591A36929M52557B45517k990K23552N0313j45882
$$ 214440 547241 498795 476137 395546 136929 589486 245517 242527 466079 516392 370510
14833C70510K89962j38978j21733J70469A89253J58055J98375B53754M7539L4754
$$ 370510 660472 521494 399761 570230 189253 347308 545683 253754 301293 336047
14823C36047L3442j20567i8670F03754L9159k34334M5213j23140J28210L41320
$$ 336047 369489 248922 -98670 603754 642913 408579 453792 330652 458862 800182
14813H00182l34926j82405L46381n0110q7888J63521k96312N7086J30176J11249
$$ 800182 465256 282851 629232 579122 491234 654755 358443 415529 545705 656954
14803F56954j88056K57682l39635M10623r308l32471J62406k57018J57463j65271
$$ 656954 468898 726580 386945 797568 788260 455789 618195 361177 518640 353369
14793C53369K22497B82839R9128J67393L46382l87141j33810A16272M62565q1980
$$ 353369 575866 282839 381967 549360 895742 508601 374791 116272 578837 496857
14783D96857n4859Q5352K47897L237k55480l6370K20616q3361k83586L10944J7403
$$ 496857 441998 527350 775247 778484 523004 486634 707250 623889 340303 651247 668650
14772F68650j11598k77161K25462A83664N31992j26644j15682k1773L0859L91676
$$ 668650 557052 279891 505353 183664 715656 589012 473330 451557 482416 874092
14762H74092j60734M7499L05488k86611k90511L57156k90988J03254L7935J07483
$$ 874092 713358 760857 1066345 779734 489223 846379 555391 658645 696580 804063
14752H04063k48759L7480j15133J05615M12504m82312K31679k12656J1248N5830
$$ 804063 555304 592784 477651 583266 995770 513458 745137 532481 543729 599559
14742E99559K4771K31350j71171j09258K37357k14761L21052l47549L22826j46653
$$ 599559 624330 855680 684509 575251 812608 597847 918899 571350 894176 747523
14732G47523l0991K24750q4116B74781L66239J70305j90225J70831R9164J89548
$$ 747523 716532 941282 857166 274781 641020 811325 621100 791931 891095 1080643
14722A080643m67835L15442l8336n6862R3485l80116K66538J2542J93397l73158
$$ 1080643 612808 928250 889914 833052 926537 546421 812959 825501 1018898 645740
14712F45740o2508O9971L86724j11319r4431N1410J18407j2453J18304k52752
$$ 645740 583232 653203 1039927 928608 834177 885587 1003994 991541 1109845 857093
14702H57093M985L40564m62833R9206j51414M7326J35535J2518l38319L82246
$$ 857093 862078 1202642 739809 839015 687601 734927 870462 882980 544661 926907
14692I26907j48401J41642N7052L3245o6132P5600j37363l7117L51232j75363
$$ 926907 778506 920148 977200 1010445 944313 1019913 882550 845433 1196665 1021302
14682A021302L1789l01148J99339N4284J90729k21755K34386m34801N15326k89015
$$ 1021302 1053091 751943 951282 1005566 1196295 974540 1208926 774125 1289451 1000436
14672A000436L6793P6549K62082n96622K13286M42342l84833j08620N4944K94849
$$ 1000436 1037229 1113778 1375860 779238 992524 1434866 1050033 941413 996357 1291206
14662A291206k62429M0245q4245K91108j85911J09085R154j52009K0922M8629
$$ 1291206 1028777 1069022 984777 1275885 1089974 1199059 1208213 1056204 1077126 1125755
14652A125755J26960k23513K31024P5844J9072m64823M27436l39398L57027N2226
$$ 1125755 1252715 1029202 1260226 1336070 1355142 890319 1317755 978357 1335384 1387610
14642A387610o2832j07189O4828j05113J34280J36805k46522L33096j26949n92152
$$ 1387610 1324778 1217589 1282417 1177304 1311584 1448389 1201867 1534963 1408014 815862
14632H15862M26848M64458m72404M77231m23352n084O8158k97575M57498l2168
$$ 815862 1242710 1707168 1234764 1711995 1288643 1283559 1351717 1054142 1511640 1479472
14622A479472j28410M99383m17665p5505K508L36221k22706k65738L68695j99492
$$ 1479472 1351062 1850445 1432780 1357275 1359783 1696004 1473298 1207560 1576255 1376763
14612A376763L19984r2246n5662k9700J86058R6822k91500J21413j09457K1936
$$ 1376763 1696747 1604501 1548839 1519139 1705197 1802019 1510519 1631932 1522475 1544411
14602A544411Q7460J99202k60146J89069Q2904j24308J43356m86484O92613n19227
$$ 1544411 1631871 1831073 1570927 1759996 1842900 1718592 1861948 1375464 2068077 1548850
14592A548850L72626k38455K10620j7744n4641L80891m58693N838L64883o7720
$$ 1548850 1921476 1683021 1893641 1875897 1821256 2202147 1743454 1749292 2114175 2046455
14582B046455J65519l90499P6437L95620l15942K31143K60380l82394R6626K26432
$$ 2046455 2211974 1821475 1897912 2293532 1977590 2208733 2469113 2086719 2183345 2409777
14572B409777n35185N54667O9064k45046M24274m6040j62045K87901m00079L18362
$$ 2409777 1874592 2429259 2498323 2253277 2677551 2631511 2469466 2757367 2357288 2675650
14562B675650K95938q6761j42870K63794K71490L7930l69324M02605M70459L16613
$$ 2675650 2971588 2884827 2741957 3005751 3277241 3315171 2945847 3348452 3818911 4135524
14552D135524M84245L11082J004382J348456K729221P860227J5060843J2080107
$$ 4135524 4619769 4930851 5935233 7283689 10012910 17873137 32933980 45014087
14544D5014087j7551169A3493294o689353k824791j215064k87422n8415m39782
$$ 45014087 27462918 13493294 6803941 3979150 2764086 2476664 2418249 1978467
14536A978467K07622m0624m2598R3420k68482M57257J1405j26995L727J21275
$$ 1978467 2186089 2145465 2102867 2196287 1927805 2385062 2396467 2269472 2273199 2394474
14526B394474o1544N56589l54306L17395n24833K89122K2963j3989P3541k31742
$$ 2394474 2332930 2889519 2535213 2852608 2327775 2616897 2639860 2625871 2699412 2467670
14516B467670m6917K57426p982K00760L03521k55640J3531l23836N36924P839
$$ 2467670 2420753 2678179 2670197 2870957 3174478 2918838 2932369 2608533 3145457 3153296
14506C153296p0484M07906n65640o0461J33320K72665m3423n1057K62812Q252
$$ 3153296 3082812 3490718 2925078 2864617 2997937 3270602 3227179 3176122 3438934 3447186
14496C447186k33576K31847M1121K47322m21050L46981M4472J33613R6105m29321
$$ 3447186 3213610 3445457 3486578 3733900 3312850 3659831 3704303 3837916 3934021 3504700
14486C504700L90662M2601k7040J00739R6886k12691K9283L32142k84863J71472
$$ 3504700 3895362 3937963 3910923 4011662 4108548 3895857 3925140 4257282 3972419 4143891
14476D143891j28273N44015k41925j28088K14842J21976j65374M75420m20138
$$ 4143891 4015618 4559633 4317708 4189620 4404462 4526438 4361064 4836484 4416346
14467D416346N49546l20397K41679J14899m81894N47920K3535L0850L38440n63538
$$ 4416346 4965892 4645495 4887174 5002073 4520179 5068099 5091634 5122484 5460924 4897386
14457D897386J7122L99194L81798j18489L4169j28115L9700L11115q995l53462
$$ 4897386 4914508 5313702 5695500 5577011 5611180 5483065 5522765 5833880 5824885 5471423
14447E471423M68899O8689j34024Q5476J07218l4904p3813L74016K59167n6333
$$ 5471423 5940322 6009011 5874987 5960463 6067681 6032777 5958964 6332980 6592147 6535814
14437F535814L06255j8184j6506k1673m6888J31635O19487k46864Q7558L08146
$$ 6535814 6842069 6823885 6807379 6785706 6738818 6870453 7489940 7243076 7330634 7638780
14427G638780K77614j78552L93510m69446Q9688N87278O8982r037J89738q5595
$$ 7638780 7916394 7737842 8131352 7661906 7751594 8338872 8407854 8398817 8588555 8502960
14417H502960J55652J62813L58314K78808p8838J70445J6167r9541O45776O4489
$$ 8502960 8658612 8821425 9179739 9458547 9379709 9550154 9566321 9466780 10112556 10177045
14407A0177045M5892j68258L66907J06082K51346M02234j24739K73995J78808
$$ 10177045 10222937 10054679 10421586 10527668 10779014 11181248 11056509 11330504 11509312
14398A1509312K49832Q5394M62516r011L70540k94670M72712L82252m4728M07656
$$ 11509312 11759144 11844538 12307054 12298043 12668583 12373913 12846625 13228877 13184149 13591805
14388A3591805K09660J22803L01329K72839M58652L70077M5518M58898L112K89109
$$ 13591805 13801465 13924268 14225597 14498436 14957088 15327165 15372683 15831581 15834693 16123802
14378A6123802M31858L09428K22536K92623L51864N99825J21211N15559K72093
$$ 16123802 16555660 16865088 17087624 17380247 17732111 18331936 18453147 18968706 19240799
14369A9240799L56617O93441J34638L48537O58790K59776N48012O47992O2752
$$ 19240799 19597416 20290857 20425495 20774032 21432822 21692598 22240610 22888602 22951354
14360B2951354N09344R93503L57531M76812N94633R07295J84650N00350Q80724
$$ 22951354 23460698 24454201 24811732 25288544 25883177 26790472 26975122 27475472 28356196
14351B8356196P78628P36080O48518Q03770J109981M59228R12054J005849N11318
$$ 28356196 29134824 29870904 30519422 31323192 32433173 32892401 33804455 34810304 35321622
14342C5321622R69540J136572J025504J228344J339194Q04832J095576J325202
$$ 35321622 36291162 37427734 38453238 39681582 41020776 41825608 42921184 44246386
14334D4246386J583499J155759J748696R42418J841995J478722J701245J679777
$$ 44246386 45829885 46985644 48734340 49676758 51518753 52997475 54698720 56378497
14326E6378497K024897J765615J584941K303165K422764K229241K552377K585023
$$ 56378497 58403394 60169009 61753950 64057115 66479879 68709120 71261497 73846520
14318G3846520K638247K832432L016088L162642K984228L633847L417995L764354
$$ 73846520 76484767 79317199 82333287 85495929 88480157 92114004 95531999 99296353
14310I9296353M065326M188439M612032M670604M919954N451711N235935O132154
$$ 99296353 103361679 107550118 112162150 116832754 121752708 127204419 132440354 138572508
14302A38572508O111798O587056P049597P096439P965454Q188240Q560448R353705
$$ 138572508 144684306 151271362 158320959 165417398 173382852 181571092 190131540 199485245
14294A99485245R724013R895402J0666867J1122764J1737028J2233813J2623000
$$ 199485245 209209258 219104660 229771527 240894291 252631319 264865132 277488132
14287B77488132J2822006J3900487J3958583J4312084J4202537J4520361J4607760
$$ 277488132 290310138 304210625 318169208 332481292 346683829 361204190 375811950
14280C75811950J4084038J3866045J3459991J2467331J1086751J0286304Q092746
$$ 375811950 389895988 403762033 417222024 429689355 440776106 451062410 459155156
14273D59155156N943127L385690K0659l734948l160003n619918n107380n341304
$$ 459155156 465098283 468483973 468504632 464769684 461609681 455989763 450882383 445541079
14265D45541079q935759j1056445j2232822j3872432j5189005j5823570j6104928
$$ 445541079 436605320 425548875 413316053 399443621 384254616 368431046 352326118
14258C52326118j5534208j5986948j5258988j4202605j4032000j3955097j2807424
$$ 352326118 336791910 320804962 305545974 291343369 277311369 263356272 250548848
14251B50548848j2535845j1710093j1408138j0572980r908245r755655q725552
$$ 250548848 238013003 226302910 214894772 204321792 194413547 184657892 175932340
14244A75932340q066982p787747p590247p233646o462119o378745n561162n208327
$$ 175932340 167865358 160077611 152487364 145253718 138791599 132412854 126851692 121643365
14236A21643365n536661m677109m841420m183242m021909l670397m093857l209668
$$ 121643365 116106704 111429595 106588175 102404933 98383024 94712627 90618770 87409102
14228H7409102l405357l219768l121396k687889k763642k693648k102014k611546
$$ 87409102 84003745 80783977 77662581 74974692 72211050 69517402 67415388 64803842
14220F4803842j977655k115536k186812j568606j896547j566273j649717j570398
$$ 64803842 62826187 60710651 58523839 56955233 55058686 53492413 51842696 50272298
14212E0272298j526732j487310j571216j379351r83929j279664n84958j397674
$$ 50272298 48745566 47258256 45687040 44307689 43323760 42044096 41459138 40061464
14204D0061464j440617r29134j053642o60094q86786p92649j209507r92519q95582
$$ 40061464 38620847 37691713 36638071 35977977 35091191 34298542 33089035 32096516 31200934
14195C1200934n80657m34014o69856j096787n93424m99401j036917n71797n04430
$$ 31200934 30620277 30186263 29516407 28419620 27826196 27326795 26289878 25718081 25213651
14186B5213651n04209p08729m75998l65944p62605j5299r73633q5219n75431m46877
$$ 25213651 24709442 24000713 23524715 23158771 22396166 22380867 21407234 21322015 20746584 20299707
14176B0299707n01678k23632n80510L9168l57015m10502o53566q4376q92902o3088
$$ 20299707 19798029 19574397 18993887 19033055 18676040 18265538 17611972 17527596 16634694 16571606
14166A6571606k48583l59453j26677l78242l69292k70441m59985K70122k33947
$$ 16571606 16323023 15963570 15836893 15458651 15089359 14818918 14358933 14629055 14395108
14157A4395108n53558j55330J03107n46312l93685k18279M04465l73516m99637
$$ 14395108 13841550 13686220 13789327 13243015 12849330 12631051 13035516 12662000 12162363
14148A2162363l936j83251n18877M6537J59744m3670n39865m15874Q460o0765
$$ 12162363 12158427 11975176 11456299 11502836 11662580 11618910 11079045 10663171 10671631 10610866
14138A0610866k53770k40803j48904q7975k44416p5970j09343M819l24115N2797
$$ 10610866 10357096 10116293 9967389 9879414 9634998 9559028 9449685 9454504 9130389 9183186
14128I183186n5446l75001n1376N1248k41963l55163J12043O9488k03841j21532
$$ 9183186 9127740 8752739 8701363 8752611 8510648 8155485 8267528 8337016 8133175 8011643
14118H011643k23057n2311j64572j61761J28935P4301j33368m9796l10422l05437
$$ 8011643 7788586 7736275 7571703 7409942 7538877 7613178 7479810 7430014 7119592 6814155
14108F814155n7806k1626j7267m9260J08806q140k31116j50762n9253k53247K38480
$$ 6814155 6756349 6734723 6717456 6668196 6777002 6768862 6537746 6386984 6327731 6074484 6312964
14097F312964p5396l34656R1328l55156M63832l50227m8423J88947Q4656k65718
$$ 6312964 6237568 5902912 5994240 5639084 6102916 5752689 5704266 5893213 5977869 5712151
14087E712151J00758m62539q3681k7056K00097m65625L11606k47440j88324J13981
$$ 5712151 5812909 5350370 5266689 5239633 5439730 4974105 5285711 5038271 4849947 4963928
14077D963928m28047L06634K14963k01767j5638k89228j88715K09721k17854j12606
$$ 4963928 4535881 4842515 5057478 4855711 4840073 4550845 4362130 4571851 4353997 4241391
14067D241391K37751n0272j36228J1906n8818J33091l13424J39515K00435m73526
$$ 4241391 4479142 4428870 4292642 4304548 4245730 4378821 4065397 4204912 4405347 3931821
14057C931821r2744L18218J13811k39405k625N4078p39715O25864m66564j87445
$$ 3931821 3839077 4157295 4271106 4031701 4029076 4083154 3343439 3969303 3502739 3315294
14047C315294J99806R1040O5721j78224K45362m91555J65565J71496O9766j53408
$$ 3315294 3515100 3606140 3671861 3493637 3738999 3247444 3413009 3584505 3654271 3500863
14037C500863j7097j67243K1577p0593J62506k01294R5076Q2480p6943q6591o2285
$$ 3500863 3483766 3316523 3338100 3267507 3430013 3228719 3323795 3406275 3329332 3242741 3180456
14026C180456k12847j09580j09258N03139o66319L83114M3999j81422j71411k38404
$$ 3180456 2967609 2858029 2748771 3251910 2585591 2968705 3012704 2831282 2659871 2421467
14016B421467M45747J09667O0911j16830k90167o816O9077n40280M80971j80448
$$ 2421467 2867214 2976881 3037792 2920962 2630795 2623979 2693056 2152776 2633747 2453299
14006B453299l5473j05529J27651M96125l49847j44726J83052k29005q2217J5925
$$ 2453299 2417826 2312297 2439948 2936073 2586226 2441500 2624552 2395547 2313330 2329255
13996B329255r7925J58567k81331M70479N5786K28632M85486J69461J820971N765941
$$ 2329255 2231330 2389897 2108566 2579045 2634831 2863463 3348949 3518410 5339381 11105322
13986A1105322J4882367J6253132j2070640j2503872p091115l232160j809869
$$ 11105322 25987689 42240821 30170181 17666309 10575194 7343034 5533165
13979E533165j139173n17043p4145o17193m4059k51201J09131j55048l447j09381
$$ 5533165 4393992 3876949 3802804 3185611 3141552 2890351 2999482 2844434 2840987 2731606
13969B731606l35681R6274J81897r3080k97647J41243j83008j76760K96910r6027
$$ 2731606 2395925 2492199 2674096 2581016 2283369 2424612 2241604 2064844 2361754 2265727
13959B265727q3921K11045K596l10041J31301j85517j6640R1042k49967p6707
$$ 2265727 2181806 2392851 2395447 2085406 2216707 2031190 2014550 2105592 1855625 1778918
13949A778918N05257m86740K99239k05860P1659j64527p3647R0074n5398n7416
$$ 1778918 2284175 1797435 2096674 1890814 1962473 1797946 1724299 1814373 1758975 1701559
13939A701559K14805j59852J55883k38626J64354o546j06022J82805P5796L4271
$$ 1701559 1916364 1756512 1912395 1673769 1838123 1831577 1725555 1908360 1984156 2018427
13929B018427l93992r3711J41041L6637q0081j44083J77634P401K26318l68458
$$ 2018427 1624435 1530724 1671765 1708402 1628321 1484238 1661872 1669273 1895591 1527133
13919A527133K80337l15803P1852j22171K13761l95283K2548L53646n1527K12516
$$ 1527133 1807470 1491667 1563519 1441348 1655109 1259826 1282374 1636020 1584493 1797009
13909A797009n54771Q1579K40540k7798L9141J17909k67856k09102K08163J70532
$$ 1797009 1242238 1323817 1564357 1536559 1575700 1693609 1425753 1216651 1424814 1595346
13899A595346m40640K73514J07794l8281k9546k02779O8838j04973n1063M33254
$$ 1595346 1154706 1428220 1536014 1497733 1468187 1265408 1334246 1229273 1178210 1611464
13889A611464L0123l63384J60363J20588k20908P7764j58724P7067L3794m27978
$$ 1611464 1641587 1278203 1438566 1559154 1338246 1416010 1257286 1334353 1368147 940169
13879I40169K43204Q6516k21039J60419J36296J12828m90567L14015M2877p0255
$$ 940169 1183373 1269889 1048850 1209269 1345565 1458393 967826 1281841 1324718 1254463
13869A254463k27777J78510P8665j10323j60552n2604L64638j59897k30482N41622
$$ 1254463 1026686 1205196 1283861 1173538 1012986 960382 1325020 1165123 934641 1476263
13859A476263n19070L63231j57437L63132l64215k18987M9836l52972M24031k45461
$$ 1476263 957193 1320424 1162987 1526119 1161904 942917 992753 639781 1063812 818351
13849H18351K12851J12034j7596j51175J36876j01757K24401l18855m2205J25061
$$ 818351 1031202 1143236 1125640 974465 1111341 1009584 1233985 915130 872925 997986
13839I97986J04849M73806m70672J82221F10309M52196K966j3992k82153K62079
$$ 997986 1102835 1576641 1105969 1288190 610309 1062505 1065471 1051479 769326 1031405
13829A031405j58021J52571j31083K31209k44418N1918j12393K04633m0358j97180
$$ 1031405 873384 1025955 894872 1126081 881663 933581 821188 1025821 985463 788283
13819G88283M08102j83973J9940m89924L98616l04381J76942J52998k70162p5150
$$ 788283 1196385 1012412 1032352 542428 941044 636663 813605 966603 696441 621291
13809F21291K37553J1626l8078N5480N6415J09479k30349o9539q8296K19853o3438
$$ 621291 858844 870470 832392 887872 944287 1053766 823417 753878 665582 885435 821997
13798H21997J15393j15806k6602K43814j15756p8306N0400q3271l7959j14022
$$ 821997 937390 821584 794982 1038796 923040 844734 895134 811863 773904 659882
13788F59882M8354p505K00730J87430m05433J05917K33959m35075K22693l28611
$$ 659882 708236 700731 901461 1088891 683458 789375 1023334 588259 810952 482341
13778D82341O60812l20680j67605J8225K02507k24381L78367m5737k31196j3905
$$ 482341 1143153 822473 654868 673093 875600 651219 1029586 983849 752653 738748
13768G38748J05973J37319D48911K41992L33389D70032J39276N10797k98395k40339
$$ 738748 844721 982040 448911 690903 1024292 470032 609308 1120105 821710 581371
13758E81371O0230J40842M4675K5743k95502J61122R9903j87911k9304J95838
$$ 581371 641601 782443 827118 852861 557359 718481 818384 630473 601169 797007
13748G97007j64727R5011l20682l1714K35351p3518K36922k00613K65840j4831
$$ 797007 632280 727291 406609 374895 610246 536728 773650 573037 838877 824046
13738H24046o0930j12501k9221K53608k82k41000j76965o6890L21409j07906J12832
$$ 824046 763116 650615 621394 875002 874720 633720 456755 389865 711274 603368 716200
13727G16200k06122j71591L44634J5751M1705j26917k38338N03390n3659j7354
$$ 716200 510078 338487 683121 698872 740577 613660 375322 878712 825053 807699
13717H07699r5422k14365A33222N26430j79763K32300M9470m4570j17551l1210
$$ 807699 712277 497912 133222 659652 479889 712189 761659 717089 599538 568328
13707E68328k469K97998l39444Q1728O9291k31624Q5640l6282Q0681L4193k9232
$$ 568328 565859 863857 524413 606141 675432 443808 529448 493166 573847 608040 578808
13696E78808R9976p3197j61673Q4895R6208o4987L62900a198F82189J97669K6504
$$ 578808 678784 605587 443914 528809 625017 560030 922930 -1198 682189 879858 906362
13685I06362k28786J1693B53543K25241K450m8278J20638K62369q9890l32789
$$ 906362 677576 689269 253543 478784 481234 432956 553594 815963 726073 393284
13675C93284J24367k25095J70536N7828j52998q3247J86344J82260j49312P2235
$$ 393284 517651 292556 463092 520920 367922 284675 471019 653279 503967 576202
13665E76202B03773M71554k99857j46070K70532A67931O48404C94664A57888N93390
$$ 576202 203773 675327 375470 229400 499932 167931 816335 394664 157888 751278
13655G51278B94692J21484O504o6748K99554k58348k1544M26335C77905L21668
$$ 751278 294692 416176 422680 355932 655486 397138 375594 801929 377905 699573
13645F99573C16756K77396R0216B30580M0583K46273j1552M4643q7183K90121
$$ 699573 316756 594152 684368 230580 271163 517436 505884 550527 463344 753465
13635G53465r0941C26308L38742C24491q7676K57930L72824l00673B30621J20330
$$ 753465 662524 326308 665050 324491 236815 494745 867569 566896 230621 350951
13625C50951j5225j31686J95586J85061J20794B54932J73172K94024l56998J46770
$$ 350951 335726 204040 399626 584687 705481 254932 428104 722128 365130 511900
13615E11900j87577K27121A00739L82501j90767J52166J75304k00678K66274j99201
$$ 511900 324323 551444 100739 483240 292473 444639 619943 419265 685539 486338
13605D86338n6167J81690k88991A03125L48063m2689o5299l3860J21886P4895
$$ 486338 430171 611861 322870 103125 451188 408499 343200 309340 431226 506121
13595E06121j74839n5443p1784L2648J04128O9852J83171B86280N0154o0213L47649
$$ 506121 331282 275839 204055 236703 340831 410683 593854 286280 336434 276221 623870
13584F23870j13646K49702B32069L67670D6661L77561q4104R1441e2149D46275
$$ 623870 510224 759926 232069 599739 46661 424222 340118 431559 -52149 446275
13573F10494j97159j18291M49850C04207K83373j82789I4282O67101j98670k70204
$$ 610494 413335 295044 744894 304207 587580 404791 94282 761383 562713 292509
13563B92509M3883K66554A78136L48423I7241J1735D1981K05407L06671j46664
$$ 292509 336392 602946 178136 526559 97241 108976 41981 247388 554059 407395
13553D07395A97822K12789I8557K80108p7465K09567j60645q5617J57738m6628
$$ 407395 197822 410611 98557 378665 301200 510767 350122 264505 422243 375615
13543C75615M4485A14454J98687K275J97840j93802m7937o35J67170j85580N06199
$$ 375615 420100 114454 313141 315416 513256 319454 271517 270882 438052 252472 758671
13532G58671k72951B41087b01157B64924K39675B22591L03214E2209K97830A12803
$$ 758671 485720 241087 -201157 264924 504599 222591 525805 52209 350039 112803
13521F07375j94869p8341B8155g6317B04159J83156I4143N38404A41802K73924
$$ 607375 412506 334165 28155 -76317 204159 387315 94143 632547 141802 415726
13511D15726L4666A65326Q6352J70948n8174o9206M5722E1790b6051A88898n2938
$$ 415726 450392 165326 251678 422626 364452 295246 340968 51790 -26051 188898 135960
13500A35960R5463q2930G486M46211p4120m6839J27747c8468E69525A52183J54158
$$ 135960 231423 148493 7486 453697 379577 332738 460485 -38468 569525 152183 306341
13489C06341N8796j60477K11508j6484A41558J90498j48561L06410A00100J82514
$$ 306341 365137 204660 416168 399684 141558 332056 183495 489905 100100 282614
13479B82614j03554R955J07036k292j4539a17900C89430R262N1241A95628J57962
$$ 282614 179060 189015 296051 293759 279220 -117900 389430 398692 449933 195628 353590
13468C53590a44215C1150K47962C2117P0391f3394A70586C5765K07118J88661
$$ 353590 -144215 31150 279112 32117 102508 -63394 170586 35765 242883 431544
13458D31544j49821c8171F7668M6921K8040b1242B92204j26458J5232N0958o354
$$ 431544 281723 -38171 67668 114589 142629 -21242 292204 165746 180978 231936 225582
13447B25582j06099C5474M60761r8814A43936F8942R156J56629I3654R5678K96867
$$ 225582 119483 35474 496235 397421 143936 68942 78098 234727 93654 189332 486199
13436D86199A06218L53060A80089J12776j15849l1876K42093j54115p0134J45001
$$ 486199 106218 459278 180089 292865 177016 145140 387233 233118 162984 307985
13426C07985A42241j2302L85722j99020M13731k82171B11739J15858j01568J65680
$$ 307985 142241 129939 515661 316641 730372 448201 211739 327597 226029 391709
13416C91709A68360D6078K89603j16372D7622p07K82382p843J92606A61764J13078
$$ 391709 168360 46078 335681 219309 47622 46915 329297 321454 514060 161764 274842
13405B74842J19820j72661J47152o1444f464C63825G1267K20419l8231l4894J79075
$$ 274842 394662 222001 369153 307709 -6464 363825 71267 291686 253455 218561 397636
13394C97636j82300K13358J1324j36479b1614D57556C4339L11940j28683A6251
$$ 397636 215336 428694 440018 303539 -21614 457556 34339 346279 217596 16251
13383D8442K16221m8728N1963A26171M36339k43273a31920b9400D47565a03236
$$ 48442 264663 215935 267898 126171 562510 319237 -131920 -29400 447565 -103236
13372C91478I3407L56628A66205N6412j8767L49482A68834k3096K8422F7536K71411
$$ 391478 93407 450035 166205 222617 203850 553332 168834 145738 174160 67536 338947
13361C38947a7449B38469C4923L13700J54885B07124Q3773A39800L67844O0752
$$ 338947 -17449 238469 34923 348623 503508 207124 290897 139800 507644 568396
13351E68396k56284M149j1607O2480l6336A47761J29098K52680l0727A96840K583
$$ 568396 312112 316261 304654 367134 330798 147761 276859 529539 498812 196840 199423
13340A99423o4802K97501I4811J08210J59204j26490L5903A17984c3911C54882
$$ 199423 134621 432122 94811 203021 362225 235735 271638 117984 -33911 354882
13329A33360d1666C13727K5631A6141J26315K78078j65270j5837K33813J10810
$$ 133360 -41666 313727 339358 16141 142456 420534 255264 239427 473240 584050
13319E84050A05181K98382j72773k1817K92849B21181m7857K02705a00025C22324
$$ 584050 105181 403563 230790 208973 501822 221181 173324 376029 -100025 322324
13308a93182C85882J38254i8850g447A73486n2381k3537b53986N7298C47756A08940
$$ -193182 385882 524136 -98850 -7447 173486 121105 97568 -253986 -196688 347756 108940
13296B31436e7755B72237r0926R8975j24464j3920N1386k4164a0841D12121j26625
$$ 231436 -57755 272237 181311 280286 155822 141902 193288 169124 -10841 412121 285496
13285B85496D7385K55243j20504a80974C7865L9836Q4626L2083m6632P4087J84755
$$ 285496 47385 302628 182124 -180974 37865 77701 162327 194410 147778 221865 406620
13274D06620B1021J136i5578C63137E6408J96988P0651a50931E7693d6216B23151
$$ 406620 21021 22157 -95578 363137 56408 253396 324047 -150931 57693 -46216 223151
13262b5825A00362J07777B1344K12767B9661R001J91218l9215Q499D2209N9862
$$ -25825 100362 208139 21344 234111 29661 38662 229880 190665 199164 42209 102071
13251A02071J96131b61701D96029A38297J10300q8035J30123M2962b21331A17127
$$ 102071 298202 -261701 496029 138297 248597 160562 290685 333647 -221331 117127
13240d4525q6531C79152A49142c7912C77286a56565C95113a99976H0781J07650
$$ -44525 -131056 379152 149142 -37912 377286 -156565 395113 -199976 80781 188431
13230A88431D0757J39514A0381L4192d5025B69644Q3617H5885K2084H311J25099
$$ 188431 40757 180271 10381 44573 -45025 269644 353261 85885 107969 8311 133410
13219A33410K36883H0452a62946C36988f4726j46664A14988J49116N1276d7639
$$ 133410 370293 80452 -162946 336988 -64726 -211390 114988 264104 315380 -47639
13208C81699j39158n135d4020J7995B77528d1549B4032M65018i9090A43383h7252
$$ 381699 242541 237406 -44020 -26025 277528 -41549 24032 489050 -99090 143383 -87252
13196a49925d5622A0076K71432K6958i6155i96k56268B1748J49635a73416C07113
$$ -149925 -45622 10076 281508 308466 -96155 -996 -257264 21748 171383 -173416 307113
13184F8582K35431A03727J418L7049R5269K0636g2300B85022I1920J1372L36844
$$ 68582 304013 103727 105145 142194 237463 258099 -72300 285022 91920 103292 440136
13173D40136a59763A50337o3187L60099k12475J76222D2061b15365A49154n7920
$$ 440136 -159763 150337 87150 447249 234774 410996 42061 -215365 149154 91234
13163I1234J60518j20977h1495m3934A91657E9281a51253A841g8890B45942j00381
$$ 91234 251752 130775 -81495 -125429 191657 59281 -151253 1841 -78890 245942 145561
13152A45561a4931G1437J08470c66265A16849k3440C150P5602a45047C473b00467
$$ 145561 -14931 71437 179907 -366265 116849 93409 3150 78752 -145047 3473 -200467
13140A59520A2226L59576B5753Q9599j8405D2011a21110B9202K53083I203e2506
$$ 159520 12226 371802 25753 115352 96947 42011 -121110 29202 282285 9203 -52506
13128A10608m5217L73700b2427A75516K22161M0181b55793E5073c31182A25719
$$ 110608 65391 439091 -22427 175516 397677 437858 -255793 55073 -331182 125719
13117c94964C05850q9772K22056B2353a06506A49757h1833H2942J32773h6078
$$ -394964 305850 216078 438134 22353 -106506 149757 -81833 82942 215715 -86078
13106A79066a88673C3522M85954A72523K15037b39800g6192B06646K03629h1656
$$ 179066 -188673 33522 519476 172523 387560 -239800 -76192 206646 410275 -81656
13095A6739J18073E8539B320N2856K7403b07060F5733a81516I1045B9267P4088
$$ 16739 134812 58539 2320 55176 82579 -207060 65733 -181516 91045 29267 103355
13084A03355d2318G4289K02590L1393A31726F3000J08529L13525H6908Q1470J94037
$$ 103355 -42318 74289 276879 308272 131726 63000 171529 485054 86908 168378 362415
13073C62415H8668Q666J08747I5550J35479b05012P0123A75054R5957q683a53119
$$ 362415 88668 97334 206081 95550 231029 -205012 -134889 175054 271011 262328 -153119
13061e00C20441n4299C7913a54082A65494a68763A39809R7497c6374A09390a63535
$$ -500 320441 266142 37913 -154082 165494 -168763 139809 237306 -36374 109390 -163535
13049a37139C73492a09220A71641e2701n4873a7563H2829C1257L7008B2866J03417
$$ -137139 373492 -109220 171641 -52701 -107574 -17563 82829 31257 68265 22866 126283
13038A26283J3220n253l7654b3127j63617A25711K0424M69423B03208a43855B14678
$$ 126283 139503 134250 96596 -23127 -186744 125711 146135 615558 203208 -143855 214678
13026E40154B03318m5936G5999O0265J61335j46940j606p2038K55913A35100a93251
$$ 540154 203318 157382 75999 136264 297599 150659 149053 77015 332928 135100 -193251
13014a31978D6577K2233K27551h2378A81048q0342g496D29610B09229J4236k1765
$$ -131978 46577 68810 296361 -82378 181048 100706 -7496 429610 209229 223465 201700
13003B01700M4879G4918K2353l3627J20986K25790C2882a80574A62312q94f7062
$$ 201700 246579 74918 97271 63644 184630 410420 32882 -180574 162312 161418 -67062
12991A68958L4703a961j60780N8602G0413a77688B91146f2129C23817a58503C14861
$$ 168958 203661 -1961 -162741 -104139 70413 -177688 291146 -62129 323817 -158503 314861
12979A8274J92838E4878b9214A05964b3456F7163B0841J49937o5989R8891e3802
$$ 18274 211112 54878 -29214 105964 -23456 67163 20841 170778 104789 203680 -53802
12967a57220A13934J26775j03026J1482l5863C1953K13896f1753E19450E1491
$$ -157220 113934 240709 137683 149165 113302 31953 245849 -61753 519450 51491
12956B71350d91788A83970J8431J66758H7314J34550a77891g6874n0204a7748
$$ 271350 -491788 183970 202401 369159 87314 221864 -177891 -76874 -127078 -17748
12945A12724J92927I3014i4370K9582A07595a79622C4555a7060A76851M2837C1342
$$ 112724 305651 93014 -94370 -64788 107595 -179622 34555 -17060 176851 219688 31342
12933a19801E8948a01554A6251P2462R620I84a05056N0930l3296B45094I3698
$$ -119801 58948 -101554 16251 88713 98333 984 -105056 -54126 -87422 245094 93698
12921A88033k616k485f9997b4992A93260O7327I6241K21156F424J17178C0153
$$ 188033 185417 182932 -69997 -24992 193260 260587 96241 317397 6424 123602 30153
12909C93934F5888J29987d60758g604F098J52254a71524D90972b53757I9648M1979
$$ 393934 65888 195875 -460758 -7604 6098 158352 -171524 490972 -253757 99648 141627
12898A41627K3360j3114J26262G7334a98061R2072q3139h2241A4693a1334E23125
$$ 141627 164987 151873 278135 77334 -198061 -105989 -189128 -82241 14693 -11334 523125
12886a01765B5868j0775b525B63773c82811L6950A24155k1308M4695b25550J8057
$$ -101765 25868 15093 -2525 263773 -382811 -345861 124155 102847 147542 -225550 -207493
12875b07493B68516c17868F3309K04568H4097a96449j01884g5781F4051K59788
$$ -207493 268516 -317868 63309 267877 84097 -196449 -298333 -75781 64051 323839
12865C23839A61176a9600B11219h7553F3901J07928q0863J04249a4671j09605
$$ 323839 161176 -19600 211219 -87553 63901 171829 90966 195215 -14671 -124276
12855a24276e2814A11974J35591D0194O0521B2142a41217B13880f7179o5045q9969
$$ -124276 -52814 111974 247565 40194 100715 22142 -141217 213880 -67179 -132224 -222193
12844b22193A25072g1C49427E0283b14076i4699C01085r0241k3991D8258J15174
$$ -222193 125072 -71 349427 50283 -214076 -94699 301085 210844 186853 48258 163432
12833A63432E8273K62883a3962n6368A83440H272J74948a73434B55151b4255l2983
$$ 163432 58273 321156 -13962 -70330 183440 8272 183220 -173434 255151 -24255 -57238
12822e7238A56399b9467l2735B35768I3887h8597A48112b96054B37312b2242A47747
$$ -57238 156399 -29467 -62202 235768 93887 -88597 148112 -296054 237312 -22242 147747
12810a24581B98410j49185r652K1696a24395j97367F7178j1069J14234a9095j24148
$$ -124581 298410 149225 139573 161269 -124395 -321762 67178 56109 170343 -19095 -143243
12799a43243A63141D6281R7074k7217g4380c5322B1845a87921B0983J40473c09004
$$ -143243 163141 46281 143355 116138 -74380 -35322 21845 -187921 20983 161456 -309004
12787C8045K35050J41179a80671B7331M5170l2450f8121n0683B53294j15799c37165
$$ 38045 273095 414274 -180671 27331 72501 40051 -68121 -118804 253294 137495 -337165
12775A82866o7078M0167k4380O3438a81115B18546a9524l36406a15421n0987m462
$$ 182866 115788 155955 131575 195013 -181115 218546 -19524 -355930 -115421 -166408 -170870
12764a70870D6692M6333b42706B01794F2458b4818A4826P5130a23737p4749B16951
$$ -170870 46692 93025 -242706 201794 62458 -24818 14826 89956 -123737 -198486 216951
12752d1594j13663C9210J66183a24412j45712L8211j08732g592A71669d5684C18793
$$ -41594 -155257 39210 205393 -124412 -270124 -231913 -340645 -7592 171669 -45684 318793
12740G79N01145j76233b06639A94773m4895b1549j18408B69860m6416D0434f4267
$$ 779 501924 325691 -206639 194773 149878 -21549 -139957 269860 223444 40434 -64267
12728A55822j8550B6434a01488B79940H87a31754b2859o400H8832b05073P9387
$$ 155822 137272 26434 -101488 279940 887 -131754 -22859 -29259 88832 -205073 -125686
12717a25686e6091j67747F0067d0368a3825A98698J3024J74135A86548j8759J95590
$$ -125686 -56091 -223838 60067 -40368 -13825 198698 211722 385857 186548 167789 363379
12706C63379j63152f2671B29513A05647J20074a16617C08251j0507C7587j0046
$$ 363379 200227 -62671 229513 105647 225721 -116617 308251 297744 37587 27541
12696B7541R1382a8282A53445a66080g1621B30736F4989d643A82509K4199a04335
$$ 27541 118923 -18282 153445 -166080 -71621 230736 64989 -4643 182509 206708 -104335
12684i8870B58352a37566d664B02113I810K88594o7859J36902j44398a40015C1756
$$ -98870 258352 -137566 -4664 202113 9810 298404 230545 367447 223049 -140015 31756
12672B00582h100B7454M67333c516F7403b9200D53939M871B00936A7128P8181
$$ 200582 -8100 27454 494787 -3516 67403 -29200 453939 458810 200936 17128 95309
12661I5309a3206A94215Q7865E9099K38641J92833r7536c1308A88897D2575J97688
$$ 95309 -13206 194215 282080 59099 297740 490573 393037 -31308 188897 42575 240263
12650B40263n4718h7963k48819A34913D8167O538K1354M3399B107b17094A01387
$$ 240263 185545 -87963 -336782 134913 48167 54705 76059 119458 2107 -217094 101387
12638A60618A836J56841m6357Q6250a32428A2547K44493j05764R1332a05353A44783
$$ 160618 1836 158677 112320 198570 -132428 12547 257040 151276 242608 -105353 144783
12626A13258j1762e089B29769g4099C23272a81237D3236R4013L6009j9696J64058
$$ 113258 101496 -5089 229769 -74099 323272 -181237 43236 137249 173258 153562 317620
12615C17620A39731f7473L3610A79419F5063b80553A88710c6869a0925j738C53473
$$ 317620 139731 -67473 -33863 179419 65063 -280553 188710 -36869 -10925 -12663 353473
12603A44100Q0126B1987K39901K0020j37670b20534A81899L93260g6459B47044
$$ 144100 224226 21987 261888 281908 144238 -220534 181899 575159 -76459 247044
12592A85081J62624C4359N664b1778A09723A3890c32672J27059M4813A27175K9382
$$ 185081 347705 34359 40023 -21778 109723 13890 -332672 -205613 -160800 127175 156557
12581A56557C5172a2911l41782I4839Q4820q3587O744g5306J9999j30718B14683
$$ 156557 35172 -12911 -354693 94839 179659 96072 102816 -75306 -55307 -186025 214683
12569A52566N7709b6999B32462b89861B59864a19815B85473a83916A65269F0640
$$ 152566 210275 -26999 232462 -289861 259864 -119815 285473 -183916 165269 60640
12558b56880H0150a80249o3421Q6345C0077i9620m0814j05819G6912b25167h4862
$$ -256880 80150 -180249 -243670 -157325 30077 -99620 -140434 -246253 76912 -225167 -84862
12546c35498B96181a10203E8165J30490B4572b06082B8256c4943A00181R7730
$$ -335498 296181 -110203 58165 188655 24572 -206082 28256 -34943 100181 197911
12536A97911m6651D0285a01963A19863a26248r883C21333I2901K76333a837B05657
$$ 197911 151260 40285 -101963 119863 -126248 -136131 321333 92901 369234 -1837 205657
12524A45519C4593h6239k42021d2719B74145b58943A69901E4863M94i8392B46356
$$ 145519 34593 -86239 -328260 -42719 274145 -258943 169901 54863 55357 -98392 246356
12512I2932a34375C22916m0727a98426J6691f5036G5071J92328b6714B9126C548
$$ 92932 -134375 322916 282189 -198426 -181735 -65036 75071 267399 -26714 29126 3548
12500i5959A08115a07844M9403n0483I1019B1700J2604b71049A20774a7141H2482
$$ -95959 108115 -107844 -58441 -108924 91019 21700 34304 -271049 120774 -17141 82482
12488B20960h2332j64021F1947a13635c7530j08573G2539J81082b64488B70259
$$ 220960 -82332 -246353 61947 -113635 -37530 -146103 72539 253621 -264488 270259
12477B05494a5387A40957a15148A01617O4806H2247h87B061J123N4361d16902
$$ 205494 -15387 140957 -115148 101617 166423 82247 -887 2061 3184 57545 -416902
12465B04011o9323a00992H9932a01865c1860m9867A06279a2423A56482b09475
$$ 204011 134688 -100992 89932 -101865 -31860 -81727 106279 -12423 156482 -209475
12454a22443A5222E631K28997a22528k1305g470p7886B47828C6409a59252d5512
$$ -122443 15222 5631 234628 -122528 -143833 -7470 -85356 247828 36409 -159252 -45512
12442I6192K12116a21805B78183j22419p4191b10609Q6682a2049j07175j77833
$$ 96192 308308 -121805 278183 155764 81573 -210609 -123927 -12049 -119224 -297057
12432b97057f201p8736I3629R3192J19852d3742D1105c14383C5535b63846O8870
$$ -297057 -6201 -84937 93629 186821 306673 -43742 41105 -314383 35535 -263846 -194976
12421a94976C42530A16295o263K990a03286C41728h0940F677c82635c6506a4511
$$ -194976 342530 116295 110032 113022 -103286 341728 -80940 6677 -382635 -36506 -14511
12409b07310b704A7254f6374j56053c6193b096A01395b69557h7119B02517C9744
$$ -207310 -2704 17254 -66374 -222427 -36193 -2096 101395 -269557 -87119 202517 39744
12397a98677D40528B9533b38304K3860g2164j26384A08042c30655J23349I9963
$$ -198677 440528 29533 -238304 -214444 -72164 -198548 108042 -330655 -207306 99963
12386h9468J7748A9918L24972d2510I8466e8284F0552K6477k8757d0986B95308
$$ -89468 -71720 19918 344890 -42510 98466 -58284 60552 87029 58272 -40986 295308
12374c4224B2837D657K09914j01112M1189C801M8885c07739L1139C31628c03921
$$ -34224 22837 4657 214571 113459 154648 3801 52686 -307739 -276600 331628 -303921
12362f0623j8216G1742K42271a26755M6399F5031a52805j35305F1849K28529b3016
$$ -60623 -78839 71742 314013 -126755 -80356 65031 -152805 -288110 61849 290378 -23016
12350A67393k6381b42872D9295H942i5894D0363j7619a62806J5527A21174a51756
$$ 167393 141012 -242872 49295 8942 -95894 40363 22744 -162806 -147279 121174 -151756
12338d2473j34487L1883r6129G8866a4420H525c3305k1a4700C1102J44039N5987
$$ -42473 -176960 -145077 -241206 78866 -14420 8525 -33305 -33326 -14700 31102 175141 231128
12326B31128o6985c686j38000C6995a68709h1733E0805a94813A64989G1822a7544
$$ 231128 164143 -3686 -141686 36995 -168709 -81733 50805 -194813 164989 71822 -17544
12314a39436C4414a90257p2914h1120A65786J34465b51169d9627A961M70389A12768
$$ -139436 34414 -190257 -263171 -81120 165786 300251 -251169 -49627 1961 472350 112768
12302B02919H6498A031K36916a19814A27350a93061B7908b01796e2834B32506
$$ 202919 86498 1031 237947 -119814 127350 -193061 27908 -201796 -52834 232506
12291i821A49598D8936a96713D6596b8031m6403j75595I9211O5874B4641K02333
$$ -9821 149598 48936 -196713 46596 -28031 -74434 -250029 99211 165085 24641 226974
12280B26974q6068F0763P2659h5915E99794A01831K10142K6030j08180K2333j15843
$$ 226974 140906 60763 133422 -85915 599794 101831 311973 338003 229823 252156 136313
12269A36313O0044a93351P9274B74638f0248B7503N9110a776j7258E14372p1505
$$ 136313 196357 -193351 -114077 274638 -60248 27503 86613 -1776 -19034 514372 442867
12258D42867I6982P8113O494j5853A3568M143K33278A11310i6011B74812E6993
$$ 442867 96982 175095 181589 165736 13568 17711 250989 111310 -96011 274812 56993
12246A0886L10064F1126K36636m5238j08887K94198r1686j33967L5771j23918
$$ 10886 320950 61126 297762 252524 143637 437835 346149 212182 247953 124035
12236A24035M2554D0580O6860L9006N3486D4529K52709a05035C39882O4097J09954
$$ 124035 166589 40580 107440 146446 199932 44529 297238 -105035 339882 403979 513933
12225E13933k48889J57880N7863r1207F6709K37188J22750g6210F5753O4091k3181
$$ 513933 265044 422924 480787 389580 66709 303897 426647 -76210 65753 129844 106663
12214A06663c30127g5588O918A06807J54347j06463J43364n6550r1694o2057B5947
$$ 106663 -330127 -75588 -68670 106807 261154 154691 298055 241505 149811 87754 25947
12202C27573H5000K06743j3405j3749J33080A92252b52627A13986q208J37642
$$ 327573 85000 291743 278338 264589 397669 192252 -252627 113986 105778 243420
12192B43420c9695A04500C530K17109B3958L93929j98521r3257L8896n2224b98754
$$ 243420 -39695 104500 3530 220639 23958 417887 219366 126109 165005 112781 -298754
12180F2328K35106b13703H9273O6793k8352h4799a8453B64570d6536A46939G1097
$$ 62328 297434 -213703 89273 156066 127714 -84799 -18453 264570 -46536 146939 71097
12168A00426m2893B5321P2685j5553a7005B84988g3820q4414H0718L6575H928
$$ 100426 57533 25321 98006 82453 -17005 284988 -73820 -158234 80718 117293 8928
12156g697C78075A68270N4762N4806q0702j4774G6004G397a04491G9578J43220
$$ -7697 378075 168270 223032 277838 197136 182362 76004 7397 -104491 79578 222798
12145B22798h7259B3183d212A05148b31234a12198B9190g263o321F04852A73480
$$ 222798 -87259 23183 -4212 105148 -231234 -112198 29190 -7263 -13584 604852 173480
12133B55329a96564B63209c8810j8762A00094a51569A71495o8388f4342Q854l44469
$$ 255329 -196564 263209 -38810 -57572 100094 -151569 171495 103107 -64342 -55488 -399957
12122c99957D1106c4576p7227b3406j71990A02234m7210N4302a97659A19599L29937
$$ -399957 41106 -34576 -111803 -23406 -195396 102234 55024 109326 -197659 119599 449536
12111D49536f6291I6384d2124l1559B48687A20516b20503d0651A62644C01b03176
$$ 449536 -66291 96384 -42124 -73683 248687 120516 -220503 -40651 162644 301 -203176
12099A35245P1299b51089g3741B18093e1865C00004E4708P034h5325B72764b7899
$$ 135245 206544 -251089 -73741 218093 -51865 300004 54708 61742 -85325 272764 -27899
12087b11949h5943l08092h8892F2630d48330d0432G8275c7949q3936j33777a3336
$$ -211949 -85943 -394035 -88892 62630 -448330 -40432 78275 -37949 -121885 -255662 -13336
12075b82027C58778n3659R79325J40100m75505a87613G3177b66297A62404L07497
$$ -282027 358778 305119 1284444 1424544 949039 -187613 73177 -266297 162404 469901
12065D69901i9133l69631a36907D53025A88702a07178j6284K0466c068D867J47149
$$ 469901 -99133 -468764 -136907 453025 188702 -107178 -123462 -102996 -3068 4867 152016
12054A52016J06863f7920J4668k72366c0866D8412J00276g3197D9806K8850b3832
$$ 152016 258879 -67920 -53252 -325618 -30866 48412 148688 -73197 49806 78656 -23832
12042c02274q4991J05003A14169b4725B4997R6323a42953K9353j73568D2439a7976
$$ -302274 -387265 -282262 114169 -24725 24997 121320 -142953 -113600 -287168 42439 -17976
12030A76904b14229e9231k40306g6103A60530a1671k8584B25669o2545o4541b162
$$ 176904 -214229 -59231 -299537 -76103 160530 -11671 -40255 225669 163124 98583 -2162
12018e9761A41380a6289A68781A5493D200a7920m27248A10662j4227b11460e4238
$$ -59761 141380 -16289 168781 15493 4200 -17920 -445168 110662 96435 -211460 -54238
12006d6897A66452p8441L855L03314I717h6828j30269F6581J33507B572K69938
$$ -46897 166452 88011 91866 395180 9717 -86828 -217097 66581 200088 2572 272510
11995B72510b40731A36010a92687m2598F1765c29469M4780g5155j04604o5548
$$ 272510 -240731 136010 -192687 -235285 61765 -329469 -284689 -75155 -179759 -245307
11985b45307D5223e8172l43953B76769A5389a96288m5999g1052D9945M750a03673
$$ -245307 45223 -58172 -402125 276769 15389 -196288 -242287 -71052 49945 54695 -103673
11973a91916A66605M5455j02566N7822O1665f0p9900C42681j27168b73360a34334
$$ -191916 166605 212060 109494 167316 228981 -60 -79960 342681 215513 -273360 -134334
11961B6329P7444D5847a63836B90662b18281D7425i1104A35334a65907f9662p145
$$ 26329 103773 45847 -163836 290662 -218281 47425 -91104 135334 -165907 -69662 -76807
11950g6807C29760a5160p8875M6637D3778J00221E3268f3901l68235a29316e4903
$$ -76807 329760 -15160 -94035 -47398 43778 143999 53268 -63901 -432136 -129316 -54903
11938a0343B13955l5937b08265A07299b71573i7006J6166n5044B42165H705J87297
$$ -10343 213955 178018 -208265 107299 -271573 -97006 -80840 -135884 242165 8705 196002
11927A96002K24375j36251a5048k1314l215A14096d11232J15576H9339h7914B15263
$$ 196002 420377 284126 -15048 -36362 -39577 114096 -411232 -295656 89339 -87914 215263
11915b8321J1738o4596A335J6672g7663C6377K544b3303B03661i4549m08163G0964
$$ -28321 -16583 -81179 1335 18007 -77663 36377 38921 -23303 203661 -94549 -502712 70964
11902i730q3479o7269H6109f6457a0491r0958A34950j1324E5373j1342P2276a15786
$$ -9730 -93209 -160478 86109 -66457 -10491 -101449 134950 123626 55373 44031 116307 -115786
11889F7908a57805j76385A34835J22207d02177B0211b26597A88252K97948b13881
$$ 67908 -157805 -334190 134835 257042 -402177 20211 -226597 188252 486200 -213881
11878B75838a54227A58508d7915j56566E5929J31689J80467b98475A27383a3575
$$ 275838 -154227 158508 -47915 -204481 55929 187618 368085 -298475 127383 -13575
11867a58341j29762A42859A6954L03243A16325b42837E7494R133d87365B37436
$$ -158341 -288103 142859 16954 320197 116325 -242837 57494 66627 -487365 237436
11856a21307C2614h4096E612e3506m9038A06387k5140J48000d05100a81391f0973
$$ -121307 32614 -84096 5612 -53506 -102544 106387 81247 229247 -405100 -181391 -60973
11844a7958A0854K6791N9485f676q6480G2960a58395H7775a4394F2051L12198
$$ -17958 10854 37645 97130 -6676 -93156 72960 -158395 87775 -14394 62051 374249
11833C74249b80473g4522B8908b19983G4370a23207j47325R8586l9656C27382
$$ 374249 -280473 -74522 28908 -219983 74370 -123207 -270532 -171946 -211602 327382
11822I1892B5100L05139f625r0090j29320c2785k00301E3151b57611K0420A04293
$$ 91892 25100 330239 -6625 -96715 -226035 -32785 -233086 53151 -257611 -237191 104293
11810b93877P5453j41366B06307G7666h7001B7889d5740k38784f1547p9099B31240
$$ -293877 -218424 -359790 206307 77666 -87001 27889 -45740 -284524 -61547 -140646 231240
11798c26607e0386k84119G5843C7640a43529l40011i1033n404A37847N2532G3344
$$ -326607 -50386 -334505 75843 37640 -143529 -483540 -91033 -96437 137847 190379 73344
11786A09354g558l6660G9138M4683b35555G0811J47923i3316K9793j9569A46259
$$ 109354 -7558 -44218 79138 123821 -235555 70811 218734 -93316 -63523 -83092 146259
11774b38794k5389A39533h8791o2562O2777b5940C07027A14462P7211L3529a43794
$$ -238794 -264183 139533 -88791 -151353 -88576 -25940 307027 114462 191673 225202 -143794
11762H5874J55373b58783l2103B33753E9395c18559B36338C6378J67724k1506
$$ 85874 241247 -258783 -290886 233753 59395 -318559 236338 36378 204102 182596
11752A82596B3811D442d7137o2937k6762A3308B641K7659A0646Q1863J38447a59064
$$ 182596 23811 4442 -47137 -110074 -136836 13308 2641 30300 10646 92509 230956 -159064
11739D1804c00032A48853M1614F783Q8557B6750d1604j36443C05617F8800J37971
$$ 41804 -300032 148853 190467 6783 95340 26750 -41604 -178047 305617 68800 206771
11728B06771A4259P4376J66091F3733J66651a21974N3001D30628c9270G4197L0674
$$ 206771 14259 88635 254726 63733 230384 -121974 -68973 430628 -39270 74197 104871
11717A04871O396a29612A79581c7991A82147b37271H1790b52901C78334c3098
$$ 104871 111267 -129612 179581 -37991 182147 -237271 81790 -252901 378334 -33098
11706A54772d7887j04927F8945J4682Q7682M1359G6837B3499g484l25054A12111
$$ 154772 -47887 -152814 68945 83627 171309 212668 76837 23499 -7484 -332538 112111
11694b32906l2791j7051P262A70135K50682j08140G7996J66225c5384A67988J86514
$$ -232906 -265697 -282748 -275486 170135 420817 312677 77996 244221 -35384 167988 354502
11683C54502A8895a13808D04366e3025B274J69908M8296m3989c2923j69613C23062
$$ 354502 18895 -113808 404366 -53025 2274 172182 220478 176489 -32923 -202536 323062
11671A2691E84P6861f1744D3978n77m365e4658A59595J05932B8480J48230b59262
$$ 12691 584 77445 -61744 43978 43401 39036 -54658 159595 265527 28480 176710 -259262
11658a23419A90075h7947A0028d7618C27267A45537e2061r6808e4219o9456I892
$$ -123419 190075 -87947 10028 -47618 327267 145537 -52061 -148869 -54219 -123675 9892
11646A08588d8416F7280N9606E3111c09660b0485j54919M6321K6054M0670l32168
$$ 108588 -48416 67280 126886 53111 -309660 -20485 -175404 -129083 -103029 -62359 -394527
11635c94527g5820a8222k19607F07N8118J09791e4716A33982B9310b71302C0959
$$ -394527 -75820 -18222 -237829 607 58725 168516 -54716 133982 29310 -271302 30959
11623h1793j63454B86443b30779A28478b07274A33146m1331L69241j9173a86916
$$ -81793 -245247 286443 -230779 128478 -207274 133146 91815 461056 441883 -186916
11612a58499A31320a34445E24129b0811k1526j94345D27958j83741b4988k1805
$$ -158499 131320 -134445 524129 -20811 -42337 -236682 427958 244217 -24988 -46793
11602d6793I0881b02759D54K36913e7097J9686B9531J55900G051K2526a70802
$$ -46793 90881 -202759 454 237367 -57097 -37411 29531 185431 7051 29577 -170802
11590A91884C4021a16811M5350B54212B399a25890C08180F5385a0434A57034l3388
$$ 191884 34021 -116811 -71461 254212 2399 -125890 308180 65385 -10434 157034 123646
11579A23646K871b04375B69062b73527A3435K0923P173M06408f2840D35652I9920
$$ 123646 126517 -204375 269062 -273527 13435 34358 41531 447939 -62840 435652 99920
11567a8572A11383o664N93A1104J16928L4675N7373c7220E19356B50347b1248
$$ -18572 111383 104719 105312 11104 128032 162707 220080 -37220 519356 250347 -21248
11555A37452O9666C271L52082b6149k0720j55692D097K19150e4103l6981q0514
$$ 137452 207118 3271 355353 -26149 -46869 -202561 4097 223247 -54103 -91084 -171598
11544a71598J7053B70274a30094k93028A59393a19669D2896b04768N1841e1273
$$ -171598 -154545 270274 -130094 -423122 159393 -119669 42896 -204768 -152927 -51273
11533A38321F7661M85975B47311d7935C93548f8081H9820b13663A97419N9665
$$ 138321 67661 553636 247311 -47935 393548 -68081 89820 -213663 197419 257084
11523B57084g2779r945A80979Q6625K71629E4779b9455B11665o1486D5974M2441
$$ 257084 -72779 -82724 180979 267604 539233 54779 -29455 211665 150179 45974 88415
11512H8415K00019K8872A51190a84794f9359B39344B9219D700h7018A52432L45193
$$ 88415 288434 317306 151190 -184794 -69359 239344 29219 4700 -87018 152432 497625
11501D97625A92438G764L55480p7853r5853R0177d7543C6859d4961C83871A79453
$$ 497625 192438 7764 363244 285391 189538 279715 -47543 36859 -44961 383871 179453
11489A24965a05937q0129A34030K07624A40250e4773A61660a54460B28576q8550
$$ 124965 -105937 -186066 134030 341654 140250 -54773 161660 -154460 228576 140026
11479A40026M8132H1927k1462a805C15541I4839J73841K40478f9405G7406J36984
$$ 140026 188158 81927 60465 -1805 315541 94839 268680 509158 -69405 77406 214390
11468B14390Q4507c1930A34728J83094j02675L0230J71442B01551a25744O0202
$$ 214390 298897 -31930 134728 317822 215147 245377 416819 201551 -125744 -65542
11458f5542B47638b56421B34210M717A15409a59541A7418J80202K36299B1304
$$ -65542 247638 -256421 234210 238927 115409 -159541 17418 197620 433919 21304
11447B7999J41489J34942A37126b6708A37624K7109j938C0480a84211B88012d1265
$$ 27999 169488 304430 137126 -26708 137624 164733 162795 30480 -184211 288012 -41265
11435F6306b60618p5206B45026o6333c1978D7233J21722J99201g7194k9024C4039
$$ 66306 -260618 -335824 245026 178693 -31978 47233 168955 368156 -77194 -106218 34039
11423c1039A20938J38918H1091J83404a46645N5147C540J36645E9238a14468e5696
$$ -31039 120938 259856 81091 264495 -146645 -91498 3540 140185 59238 -114468 -55696
11411b9138B673b6638B01862o9473D1583a31235J5854d3205H4336j9597K1992
$$ -29138 2673 -26638 201862 132389 41583 -131235 -115381 -43205 84336 64739 86731
11400H6731K26627r8307g8437B28944a20381C50995A45010K15460A47489c16583
$$ 86731 313358 215051 -78437 228944 -120381 350995 145010 360470 147489 -316583
11389a99995f1314B1545c19099C71182A8635K03404c13109a6620A51466a36799
$$ -199995 -61314 21545 -319099 371182 18635 222039 -313109 -16620 151466 -136799
11378i5086A24576K109b5033D8887K63123F5302j3024b74427A74618H6070l3680
$$ -95086 124576 126685 -25033 48887 312010 65302 52278 -274427 174618 86070 52390
11367E2390b3890j92040a07649J4558D51c12121J18761E6205K64434f8537A3152
$$ 52390 -23890 -215930 -107649 -93091 451 -312121 -193360 56205 320639 -68537 13152
11355C3837C191e0981D3281a31404K2361F1162b1484A43173c88209C6311a12063
$$ 33837 3191 -50981 43281 -131404 -109043 61162 -21484 143173 -388209 36311 -112063
11343h3920K1423j51249l01753A6498K35072c8558a6483m4673q7166A46111a96739
$$ -83920 -62497 -213746 -515499 16498 251570 -38558 -16483 -61156 -148322 146111 -196739
11331A69886D8474c40222f1355q2510j49963E0848e467l6643A93789l4154J03612
$$ 169886 48474 -340222 -61355 -143865 -293828 50848 -5467 -42110 193789 159635 263247
11320B63247a8895j7828j19817L5799A91072b9907C8239J40525M551c8374H8796
$$ 263247 -18895 -36723 -156540 -120741 191072 -29907 38239 178764 183315 -38374 88796
11308h3115j76847B51342p8994b963A085e387j47803A2749L88719A31615i3445
$$ -83115 -259962 251342 172348 -2963 1085 -5387 -153190 12749 401468 131615 -93445
11296E1616L9590J33016J487a14210A13401g7149k42522I9487a09580A90318h7425
$$ 51616 91206 224222 225709 -114210 113401 -77149 -319671 99487 -109580 190318 -87425
11284f894A05188L6678f6996j80205L1168N2930B36671g5606p9478G5141c47948
$$ -6894 105188 141866 -66996 -247201 -216033 -163103 236671 -75606 -155084 75141 -347948
11272A9439Q0837a69356J4863j00959m6075a05524k66906B83590A30574f3860
$$ 19439 100276 -169356 -154493 -255452 -301527 -105524 -372430 283590 130574 -63860
11261a0926A01036b93079B3871A1789J86573R5598F8020A9796b23499d7523A48366
$$ -10926 101036 -293079 23871 11789 198362 293960 68020 19796 -223499 -47523 148366
11249a89068B1853J0282K09739r734i8198E2621b45461B40593A2659L2283J75716
$$ -189068 21853 32135 241874 232140 -98198 52621 -245461 240593 12659 44942 220658
11238B20658a332q3223j54024B04672A5617c4990m8208A21431a34472n5812G5018
$$ 220658 -1332 -84555 -238579 204672 15617 -34990 -83198 121431 -134472 -190284 75018
11226I5721a18838A88241G0551R8178c19942B92001a13577D1070F553b66642j94693
$$ 95721 -118838 188241 70551 168729 -319942 292001 -113577 41070 6553 -266642 -461335
11215d61335d9093j04000q1842P5128J3513a4646A53124e6627k04005Q1180C20174
$$ -461335 -49093 -153093 -234935 -159807 -146294 -14646 153124 -56627 -260632 -179452 320174
11203a23183j45664B22286A3844e64401a8838j15623r8903D4396P2702B0433a23026
$$ -123183 -268847 222286 13844 -564401 -18838 -134461 -233364 44396 117098 20433 -123026
11191G9760C2504e5545A78458Q4884A25472n716b99835B14108M0478A1786d1618
$$ 79760 32504 -55545 178458 263342 125472 119756 -299835 214108 254586 11786 -41618
11179C541a58677B7042a2565k2511J0009B52237i4835A7877K89527E1566b2446
$$ 3541 -158677 27042 -12565 -35076 -25067 252237 -94835 17877 307404 51566 -22446
11167a89270k04437H9830g7648a6869p0119B20347F0230A2603B625P6009a20369
$$ -189270 -393707 89830 -77648 -16869 -86988 220347 60230 12603 2625 78634 -120369
11155A15198C7468a13861F6404f4373A08760a76490d0621E3640C82K4892a10875
$$ 115198 37468 -113861 66404 -64373 108760 -176490 -40621 53640 382 25274 -110875
11143C06467a42593B14973E7349a00322I343M2422h1684m1138d080A6171h1760
$$ 306467 -142593 214973 57349 -100322 9343 51765 -81684 -122822 -4080 16171 -81760
11131A08154k5531b54999H4696a16300a3970C20019i5784L8723A73320b5111D8718
$$ 108154 82623 -254999 84696 -116300 -13970 320019 -95784 -57061 173320 -25111 48718
11119B54187P8658p2822p8552k9513a29198E230J56778P3796G5153a22642j26733
$$ 254187 332845 260023 181471 151958 -129198 5230 162008 235804 75153 -122642 -249375
11108b49375C57051j72145a04419B7625K0443J93768k8575I8055h2191A65886
$$ -249375 357051 184906 -104419 27625 48068 241836 213261 98055 -82191 165886
11097a79515B47725l6378h181C23177n1786r2944j0404E5598M2869K52003A64662
$$ -179515 247725 211347 -8181 323177 271391 178447 168043 55598 98467 350470 164662
11085D16262A65726G7963K20732o4698m2788J5626C546L20962A12346K03930d9726
$$ 416262 165726 77963 298695 233997 191209 206835 3546 324508 112346 316276 -49726
11073A29353M93184k12574A58416M20493B69898L44244B95842K2269K39419k31000
$$ 129353 622537 409963 158416 578909 269898 614142 295842 318111 557530 326530
11063C26530L373L58231k27590J34698R5945q58k14657J78171J98020l0597m01808
$$ 326530 329903 688134 460544 595242 691187 690329 475672 653843 851863 821266 419458
11052D19458j64885N41442k27775L84537k00690J45904J805n1687P614k43329
$$ 419458 254573 796015 568240 952777 752087 897991 899796 848109 855723 612394
11042F12394Q2043J04747C27753L63568R3883l86168J36511M7677K8526l6554
$$ 612394 694437 799184 327753 691321 785204 399036 535547 583224 611750 575196
11032E75196J27884j27698j60817Q6476K13090r5337K17875j79486K35188L497
$$ 575196 703080 575382 414565 501041 714131 618794 836669 657183 892371 895868
11022H95868k49069n7642r7392m2588A54605L26056K86629o95K02489P398k56214
$$ 895868 646799 589157 491765 449177 154605 480661 767290 766595 969084 976482 720268
11011G20268l00378L58556A65785M90867j30348k7407J77310j48018L65973k72166
$$ 720268 419890 778446 165785 656652 526304 498897 676207 528189 894162 621996
11001F21996m1894J34917J3253l59663J60979J92817j91935K99654k27959J82628
$$ 621996 580102 715019 728272 368609 529588 722405 530470 830124 602165 784793
10991G84793M7352k23002K17558j30720J15066J53351O4746J29471N0400j86929
$$ 784793 832145 609143 826701 695981 811047 964398 1029144 1158615 1209015 1022086
10981A022086J37129L1606J66724J73702L3389L48818J60362L35641k9772O08156
$$ 1022086 1159215 1190821 1357545 1531247 1564636 1913454 2073816 2409457 2379685 2987841
10971B987841k84139k20284L97802p2794n09020k29623k59096r3508J48166l34666
$$ 2987841 2703702 2483418 2881220 2808426 2299406 2069783 1810687 1717179 1865345 1530679
10961A530679K24037k17848K03031J45718k92421o1333K14147o6464l85488j82945
$$ 1530679 1754716 1536868 1739899 1885617 1593196 1531863 1746010 1679546 1294058 1111113
10951A111113k17856j08236J25813l18125j86619l6523J2183j4100L73719k91898
$$ 1111113 893257 785021 910834 592709 406090 369567 381750 367650 741369 449471
10941D49471B09106a68727E39007A20618L6585g0842C0488R526L26495A49210
$$ 449471 209106 -168727 539007 120618 157203 -70842 30488 40014 366509 149210
10930i5608A22921f6353b3777l5937h292A5284n377M1107d0294A36969f2540j55424
$$ -95608 122921 -66353 -23777 -59714 -8292 15284 9907 51014 -40294 136969 -62540 -217964
10918b17964D0921J00134h5807j08356j39619A61744c25074b5721B89645g4737
$$ -217964 40921 141055 -85807 -194163 -333782 161744 -325074 -25721 289645 -74737
10907H6095E265f1578G8073O9234K64293b11433B9938R1387a75477J340N1454
$$ 86095 5265 -61578 78073 147307 411600 -211433 29938 121325 -175477 -174137 -122683
10896a22683A42966b1638j4796p985A32127f2235A90099l6562C6244P2540i9241
$$ -122683 142966 -21638 -36434 -44419 132127 -62235 190099 153537 36244 108784 -99241
10884F175R8342b26103c5292F1484g6234j24318E0735J40997C368b6195B67673
$$ 6175 104517 -226103 -35292 61484 -76234 -200552 50735 191732 3368 -26195 267673
10872c10182M5654J27432B79699B0528J17413b54496a915o5610m6497p9458C27508
$$ -310182 -264528 -137096 279699 20528 137941 -254496 -1915 -67525 -114022 -193480 327508
10860H3425b87996E4010c690A6520K35056A17544b30421i9703A28540a72958O5986
$$ 83425 -287996 54010 -3690 16520 251576 117544 -230421 -99703 128540 -172958 -106972
10849a06972A7514a44224j53725B23440d6869q70B91859i1359A8225O6372C9210
$$ -106972 17514 -144224 -297949 223440 -46869 -47739 291859 -91359 18225 84597 39210
10837a77640m8479B1068K1812N3748C082h8492j66600a06517H8013b67776C40025
$$ -177640 -226119 21068 42880 96628 3082 -88492 -255092 -106517 88013 -267776 340025
10825A11681c276I1103K16727c10203B87106F2373d1207H9425b11412G1521c4256
$$ 111681 -3276 91103 307830 -310203 287106 62373 -41207 89425 -211412 71521 -34256
10813B61900p5732a8096j44789A13828m5569f9761K9847H550J9439b78486l1920
$$ 261900 186168 -18096 -162885 113828 68259 -69761 -39914 8550 27989 -278486 -310406
10802c10406A76630A9824f3913C94486A0667c97061C42342A07917h8209C07039
$$ -310406 176630 19824 -63913 394486 10667 -397061 342342 107917 -88209 307039
10791a61404D06548f8148J6144A17634f8405K8683F5974L9812i9324A4932b22336
$$ -161404 406548 -68148 -52004 117634 -68405 -39722 65974 105786 -99324 14932 -222336
10779g7051C2398a62134j67861O3526R8811c70l82290B48211d9631A61769F4433
$$ -77051 32398 -162134 -329995 -266469 -167658 -370 -382660 248211 -49631 161769 64433
10767C24765A51131b30017J08023A45583a87291r7106I825b08561B4161b26504
$$ 324765 151131 -230017 -121994 145583 -187291 -284397 9825 -208561 24161 -226504
10756a44164B9714a18672E1705a26582C5597a71151c7533A9199a11977j20115
$$ -144164 29714 -118672 51705 -126582 35597 -171151 -37533 19199 -111977 -232092
10746b32092c4020g561D8846d0447a5148A51319J3419a0893m34038B1963c8772
$$ -232092 -34020 -7561 48846 -40447 -15148 151319 164738 -10893 -444931 21963 -38772
10734A19412k7271c71551E4661b21424a05085E9492K8532a5172E9680N3265a7902
$$ 119412 92141 -371551 54661 -221424 -105085 59492 88024 -15172 59680 112945 -17902
10722b22365A60202N1079a8411A9414K32948J5389a8459E315K67548a56578O4245
$$ -222365 160202 211281 -18411 19414 252362 267751 -18459 5315 272863 -156578 -92333
10711i2333A21224I324f6823A06327b96876C00204E4924J67531G0050b20098P8261
$$ -92333 121224 9324 -66823 106327 -296876 300204 54924 222455 70050 -220098 -141837
10700a41837L4575j29522k8788O5739f0335k6300c3347A8879K41482D0498a77801
$$ -141837 -107262 -236784 -265572 -199833 -60335 -86635 -33347 18879 260361 40498 -177801
10688a33919j0342A91270a6507A97172c9723j75236K0203D5583e2506F3550f29134
$$ -133919 -144261 191270 -16507 197172 -39723 -214959 -194756 45583 -52506 63550 -629134
10676b56652D7436J8065c45748i9146k2871F7082a14145A0358a07319G6802d6294
$$ -256652 47436 65501 -345748 -99146 -122017 67082 -114145 10358 -107319 76802 -46294
10664C15571e0164l01702A58274f9110j9417h153j07771A19912J01020N5990c65922
$$ 315571 -50164 -351866 158274 -69110 -88527 -8153 -115924 119912 220932 276922 -365922
10652d79960a31324G2715a46008O4775B638a62002m008G5469B732J83474c74925
$$ -479960 -131324 72715 -146008 -81233 2638 -162002 -166010 75469 2732 186206 -374925
10640g9568j28504M3120d1190j98458A71015c53180E4572c62936a1857D3110b73579
$$ -79568 -208072 -164952 -41190 -239648 171015 -353180 54572 -362936 -11857 43110 -273579
10628A63392p7010e1764D9149P1592A1500J27145a08946j30447A65392M0116C046
$$ 163392 86382 -51764 49149 120741 11500 138645 -108946 -239393 165392 205508 3046
10616E2285N8123J67954f1823k8317C3324a31815C30783h649p9314C325J7652
$$ 52285 110408 278362 -61823 -90140 33324 -131815 330783 -8649 -87963 3325 20977
10605B0977Q8263a46539E0457A2232b58927f8253F9416N5520a28469p2652K9582
$$ 20977 109240 -146539 50457 12232 -258927 -68253 69416 124936 -128469 -201121 -171539
10594a71539H5507D2018b54097A4359L06631a97490h8439J1965o8008E58037C417
$$ -171539 85507 42018 -254097 14359 320990 -197490 -88439 -76474 -144482 558037 3417
10582a20695n8961O0438j20163j48109M5367J41003L8230Q0612k01978J28143
$$ -120695 -179656 -119218 -239381 -387490 -342123 -201120 -162890 -82278 -284256 -156113
10572a56113P6813j03394k2262C45081b07956h1018F3944K4156R3693b1180o0725
$$ -156113 -79300 -182694 -204956 345081 -207956 -81018 63944 88100 181793 -21180 -81905
10561h1905l28248m2136B57115k2633g3671A00595i5501k71300i5576n9841B20913
$$ -81905 -410153 -452289 257115 234482 -73671 100595 -95501 -366801 -95576 -155417 220913
10549G5608l6273a73116A9431f4018G8914O0896j5112b57678D3029N5764J48859
$$ 75608 39335 -173116 19431 -64018 78914 139810 124698 -257678 43029 98793 247652
10538B47652B539c59033b7681j9909k10158a25615b933A80J53839d7004A28916
$$ 247652 2539 -359033 -27681 -47590 -257748 -125615 -2933 180 154019 -47004 128916
10526A0301a8923j7614j00437j08732A48785d6528A58397M3465g4691r332c0238
$$ 10301 -18923 -36537 -136974 -245706 148785 -46528 158397 201862 -74691 -84023 -30238
10514e320G0697Q1849B8807a68342n226d6759B2718J482j874N2219Q562b46628
$$ -5320 70697 152546 28807 -168342 -173568 -46759 22718 24200 22326 74545 83107 -246628
10501a09854m6786P1115j70359N2770R7653B08285J211F4410c16747B20349h4452
$$ -109854 -156640 -85525 -255884 -203114 -105461 208285 209496 64410 -316747 220349 -84452
10489g2516A60091J0874d8463j85312B30676d2714D57551K38981j81784k27620
$$ -72516 160091 170965 -48463 -233775 230676 -42714 457551 696532 514748 287128
10479B87128K36449j34929j03019b15780B67770A20230n2257a9995j04995N094
$$ 287128 523577 388648 285629 -215780 267770 120230 67973 -19995 -124990 -119896
10469a19896B28522H9032r089Q8460B6523N4153a6142A06002a5617A53211k0880
$$ -119896 228522 89032 79943 168403 26523 80676 -16142 106002 -15617 153211 132331
10458A32331n3303j0617c6268B15388I5784b58101a5282l16550a56193i075q9597
$$ 132331 79028 68411 -36268 215388 95784 -258101 -15282 -331832 -156193 -9075 -98672
10447i8672B54635A9114a8958o901B19161g5478j51296P0444B4470b18530I3757
$$ -98672 254635 19114 -18958 -25859 219161 -75478 -226774 -156330 24470 -218530 93757
10435A3525b36061G9174d1371B99287e6083p3928L4679H4897a5813L869A05563
$$ 13525 -236061 79174 -41371 299287 -56083 -130011 -95332 84897 -15813 -11944 105563
10423c9870B49541a51464A45446O0789c6257j4355D11265G3785K07099b69977
$$ -39870 249541 -151464 145446 206235 -36257 -50612 411265 73785 280884 -269977
10412a36934M0375d0689l04805M1921G0959l3554J24747c0423A65187B3575a962
$$ -136934 -96559 -40689 -345494 -303573 70959 37405 162152 -30423 165187 23575 -1962
10400C4767K05452k1122G2154k2503J20261b09386c4450F4813J68928d90j98142
$$ 34767 240219 219097 72154 49651 169912 -209386 -34450 64813 233741 -490 -198632
10389a98632C15248A43030a99988A19525R1221b81979H9537c01604A38598K50766
$$ -198632 315248 143030 -199988 119525 210746 -281979 89537 -301604 138598 389364
10379C89364m5938p737j49765M32070l04937n9026o9146L4927q6857L43734B4413
$$ 389364 343426 335689 185924 617994 313057 254031 184885 219812 132955 476689 24413
10367C02486N2070p1554l9068O0489J84592k24558j03766a47238A92740J5086
$$ 302486 354556 283002 243934 304423 489015 264457 160691 -147238 192740 207826
10357B07826c3052F01623B21065p2372g2138A80721J95703Q5124A17646R7807
$$ 207826 -33052 601623 221065 148693 -72138 180721 376424 461548 117646 215453
10347B15453L28386k08788F2249K43087K39539j76061A06720J59538K47862j5584
$$ 215453 543839 335051 62249 305336 544875 368814 106720 266258 514120 498536
10337D98536E7392P0041J16689d2019B75555a41347K1422B89545g5241A10312
$$ 498536 57392 127433 244122 -42019 275555 -141347 -119925 289545 -75241 110312
10326g3921E3881d9288C41200n6690r2886L29854G5169L83823D2495b2988B08931
$$ -73921 53881 -49288 341200 284510 191624 521478 75169 458992 42495 -22988 208931
10314a32897c6078C55601j46519b28840E0608f5595C6351a49370C7196d5723l7164
$$ -132897 -36078 355601 209082 -228840 50608 -65595 36351 -149370 37196 -45723 -82887
10303h2887p1849c2656A45447J25929d7352C52426c15956J55125k3363E4543a08054
$$ -82887 -154736 -32656 145447 271376 -47352 352426 -315956 -160831 -184194 54543 -108054
10291D8779Q1198a74765K847A35279g8073j75385n5555k218I1971a0996l9494
$$ 48779 129977 -174765 -171918 135279 -78073 -253458 -309013 -311231 91971 -10996 -50490
10280e0490D11232j10515C5773R83J12890b43947P0164c9588k33885A36520b21855
$$ -50490 411232 300717 35773 36756 149646 -243947 -173783 -39588 -273473 136520 -221855
10268b7375A49547p1292M2772b74972A36568b35716A77969K11032m7952A54467
$$ -27375 149547 78255 121027 -274972 136568 -235716 177969 389001 341049 154467
10257B21691J51516D7395J44777m1273B1573J66678q4904b80775N2019B27032
$$ 221691 373207 47395 192172 150899 21573 188251 103347 -280775 -228756 227032
10246G0955b6527k01350C7232a28123B55107C0303g0146j1582B55145b09810N4857
$$ 70955 -26527 -227877 37232 -128123 255107 30303 -70146 -81728 255145 -209810 -154953
10235a54953f7209C36590j55989d7045q4754C6430b19025m1840J25455r3879B89592
$$ -154953 -67209 336590 180601 -47045 -131799 36430 -219025 -260865 -135410 -229289 289592
10223i986b703r576p4376l52893M0356D7249a25560K1145j37377k5255m2124h187
$$ -9986 -2703 -12279 -86655 -439548 -399192 47249 -125560 -104415 -241792 -267047 -309171 -8187
10210B1905N3538b51345B04316b05758e3409r94l54611g2689P549B6414h2795
$$ 21905 75443 -251345 204316 -205758 -53409 -54403 -409014 -72689 -65140 26414 -82795
10198B04550b6974j40314D8548A8012N228L10693j30396C4a54465o0459P7216
$$ 204550 -26974 -167288 48548 18012 23240 333933 203537 34 -154465 -214924 -137708
10187a37708A51840b15096A14385c06603C9324b23502A91802b70420E5561a78274
$$ -137708 151840 -215096 114385 -306603 39324 -223502 191802 -270420 55561 -178274
10176a520j64928g9959L0306C0530d9561j04301f4433a2667l15246g8387B98405
$$ -1520 -166448 -79959 -49653 30530 -49561 -153862 -64433 -12667 -327913 -78387 298405
10164b98379D9599L9350R8075C3225A5569a1219j78311p5568l5219A13615d12869
$$ -298379 49599 88949 187024 33225 15569 -11219 -189530 -265098 -300317 113615 -412869
10152i8286j03506B6576b00936K7644F4377a58025B21912G1330a23074A9205P5942
$$ -98286 -201792 26576 -200936 -173292 64377 -158025 221912 71330 -123074 19205 95147
10141I5147a87732A0818b00353a0732k66545o0955J48942E3441a0278H5844d1252
$$ 95147 -187732 10818 -200353 -10732 -277277 -338232 -189290 53441 -10278 85844 -41252
10129b01650i0940B7217Q3124J80406G8341b80513a4258j86036L654I967a38849
$$ -201650 -90940 27217 110341 290747 78341 -280513 -14258 -200294 -196640 9967 -138849
10117b6576k44282H5793a24228D02628c31597A85364I410e6534K6372n1383j52261
$$ -26576 -270858 85793 -124228 402628 -331597 185364 9410 -56534 -30162 -81545 -233806
10106b33806j2602q8324B7628Q5580b63474B12398b904A3981P8342b4511r2880
$$ -233806 -246408 -334732 27628 113208 -263474 212398 -2904 13981 92323 -24511 -117391
10095a17391k41786a62691K9554G6376i8432m71182A48233d4821m4110m29397
$$ -117391 -359177 -162691 -133137 76376 -98432 -569614 148233 -44821 -88931 -518328
10085e18328b26958A91240i3206K1044l72636b793A61668E7070b38780G7951d15369
$$ -518328 -226958 191240 -93206 -72162 -444798 -2793 161668 57070 -238780 77951 -415369
10073a14963G6829b74489p9788c0059l69377D4918b35779f1092q7910a6540A06865
$$ -114963 76829 -274489 -354277 -30059 -399436 44918 -235779 -61092 -149002 -16540 106865
10061c99243B01156b76951J18494b3497j31501A75441b3229q0395q1849E321a18721
$$ -399243 201156 -276951 -158457 -23497 -154998 175441 -23229 -103624 -185473 5321 -118721
10049b83125J26303O8042l48137J06804A65587P1536G4550i1294j21633h767C596
$$ -283125 -156822 -88780 -436917 -330113 165587 237123 74550 -91294 -212927 -8767 3596
10037c21620a5340k55151g7191G7356J0342R9974b85316A95737k5052d1901A63387
$$ -321620 -15340 -270491 -77191 77356 87698 187672 -285316 195737 170685 -41901 163387
10025B27659C7890K8120R2354a30589A90580h5238a1843A23421b14623F50135
$$ 227659 37890 66010 158364 -130589 190580 -85238 -11843 123421 -214623 650135
10014d15157d3926j50592A47790D3799c14022L2898A85754I0351b10309O8915
$$ -415157 -43926 -194518 147790 43799 -314022 -281124 185754 90351 -210309 -141394
10004a41394b5680A60423n4611b22066J02523A79474K33109j96029a24963j90975
$$ -141394 -25680 160423 105812 -222066 -119543 179474 412583 216554 -124963 -315938
9994c15938d7282o6417j73526M5525c386k8604J2796D05702E0595d38280a90060
$$ -315938 -47282 -113699 -287225 -241700 -3386 -31990 -19194 405702 50595 -438280 -190060
9982A09678c02722A54592l6802n7273b52517C2879a71909A34695b30856h722j33392
$$ 109678 -302722 154592 117790 60517 -252517 32879 -171909 134695 -230856 -8722 -142114
9971a42114A8320J68282a97731K8651l01630a72141A01722b01437A19253l0278
$$ -142114 18320 186602 -197731 -169080 -470710 -172141 101722 -201437 119253 88975
9961H8975d54183a08205o8607M9938A0496M0401A1215O039a79006j8834C9459
$$ 88975 -454183 -108205 -176812 -126874 10496 50897 11215 17254 -179006 -197840 39459
9949i400B48122g7062b211B00209e080l1670a3784c811F2289A177M081b8249F5436
$$ -9400 248122 -77062 -2211 200209 -5080 -36750 -13784 -3811 62289 1177 5258 -28249 65436
9935a20345k15898H8893a94221O9579e0093l39904b4688n04193A5080K4781J7862
$$ -120345 -336243 88893 -194221 -124642 -50093 -389997 -24688 -528881 15080 39861 57723
9924E7723a660j95746p590n3977O9057d7560A70940a91920D0805a43325A92209
$$ 57723 -1660 -197406 -204996 -258973 -189916 -47560 170940 -191920 40805 -143325 192209
9912b9376o1642A17287K7334c38303a8217A221g1753j51615B26524d20209D9939
$$ -29376 -91018 117287 144621 -338303 -18217 1221 -71753 -223368 226524 -420209 49939
9900F4099b67255e9404j20921N9854P442b7741B49647j16799f0533H7561c60995
$$ 64099 -267255 -59404 -180325 -120471 -113029 -27741 249647 132848 -60533 87561 -360995
9888a83592c4178j56276J1597C6781J07448l9068a26132l62113a4625j08483r4722
$$ -183592 -34178 -190454 -178857 36781 144229 105161 -126132 -488245 -14625 -123108 -217830
9877b17830O9553M4376b8800A38384b25251D3381c95450f8321B0268g1381j91009
$$ -217830 -148277 -103901 -28800 138384 -225251 43381 -395450 -68321 20268 -71381 -262390
9866b62390I8973K9905b87032a04741j15479B16529g1168k75949a813j41517j08878
$$ -262390 98973 128878 -287032 -104741 -220220 216529 -71168 -347117 -1813 -143330 -252208
9855b52208P3133j04109a22354J6984L7272l00649A37483c14864f7037j1037l56670
$$ -252208 -179075 -283184 -122354 -105370 -68098 -368747 137483 -314864 -67037 -78074 -434744
9844d34744C28903b70719B63992B9904b40677l8775E845a2203D7220J33432E5845
$$ -434744 328903 -270719 263992 29904 -240677 -279452 5845 -12203 47220 180652 55845
9832i9140H5753M940a77427R710j24052b2534j74396g2885n4304j25767J9665
$$ -99140 85753 90693 -177427 -167717 -291769 -22534 -196930 -72885 -127189 -252956 -233291
9821b33291R9788a7976l09429k00173a10503a551l46592J69067A03551c7998j09445
$$ -233291 -133503 -17976 -327405 -527578 -110503 -1551 -348143 -179076 103551 -37998 -147443
9810a47443C31054a89554j80508J00842J09384N7833A25652k2072b22520a0759
$$ -147443 331054 -189554 -370062 -269220 -159836 -102003 125652 103580 -222520 -10759
9799e20179a13187F8804a83331N1062O0987j5679j77153a26565o5762A54478f0121
$$ -520179 -113187 68804 -183331 -132269 -71282 -86961 -264114 -126565 -192327 154478 -60121
9787A69577a00788A81261i6929E3226c16527a27694L2056a5536I933a510C8357
$$ 169577 -100788 181261 -96929 53226 -316527 -127694 -95638 -15536 9933 -1510 38357
9775d05839J11268B7254c3638o8812B69264G1274b35491A0530b96674A94372m3463
$$ -405839 -294571 27254 -33638 -102450 269264 71274 -235491 10530 -296674 194372 150909
9764A50909a6403G8131K5395A7184h9193j1626o5857A26105C2789J15763B3034
$$ 150909 -16403 78131 103526 17184 -89193 -100819 -166676 126105 32789 148552 23034
9752b1866B69129b37439A40060d07606D61339b23061A66762B2391i3397C3669
$$ -21866 269129 -237439 140060 -407606 461339 -223061 166762 22391 -93397 33669
9741i330A7937b6758j26082l13981A8135J56789c85725a20096L9015F0413c23114
$$ -9330 17937 -26758 -152840 -466821 18135 174924 -385725 -120096 -81081 60413 -323114
9729A7209a85290D0027A2442c29291A5550K35637A4125b38657l1540a7916j05348
$$ 17209 -185290 40027 12442 -329291 15550 251187 14125 -238657 -270197 -17916 -123264
9718a23264I9439b07622a9273k05081G8320b47954O9306N4459j57638A0327a30313
$$ -123264 99439 -207622 -19273 -224354 78320 -247954 -178648 -124189 -281827 10327 -130313
9706B64669a32552G7055M0923a863B26926b40831J2825a01970K6868A99153b67140
$$ 264669 -132552 77055 117978 -1863 226926 -240831 -228006 -101970 -75102 199153 -267140
9694b48984I8781f176o342o279m1107A11662b23705g2297a2772A14692a8242H5666
$$ -248984 98781 -6176 -12518 -18797 -59904 111662 -223705 -72297 -12772 114692 -18242 85666
9681a02431k72093i9220p3289D1848a53029J4920k28645a54837A047J99877p5747
$$ -102431 -374524 -99220 -172509 41848 -153029 -138109 -366754 -154837 1047 200924 125177
9670A25177g1995k495k95097B80474a54392E968a3714A34306a3406j28531B52003
$$ 125177 -71995 -74490 -369587 280474 -154392 5968 -13714 134306 -13406 -141937 252003
9658F7459a26427a7556n8147j38121L1859g546j40941q069a5364C92277D3572
$$ 67459 -126427 -17556 -75703 -213824 -181965 -7546 -148487 -156556 -15364 392277 43572
9646g486j9056G1464Q7025m2141k1107m6589I221g2545j35080p7021a0934E3639
$$ -7486 -26542 71464 158489 116348 95241 48652 9221 -72545 -207625 -284646 -10934 53639
9633D0068b01020A08483J60915c27157a52880r4305J02333l5616J1621r2427C4134
$$ 40068 -201020 108483 269398 -327157 -152880 -247185 -144852 -180468 -168847 -261274 34134
9621C7251J8042O2084n2573J21877f3769j05493e8056j24506J807N7868C07180
$$ 37251 55293 117377 64804 186681 -63769 -169262 -58056 -182562 -180755 -122887 307180
9609h8708j07383A70222d63241F2640B5715a86099O7148L7335C3598a73958C0678
$$ -88708 -196091 170222 -463241 62640 25715 -186099 -118951 -81616 33598 -173958 30678
9597a14692o3163k1166E2757j8909a9201j24098A25725b02079C24284b2475l16976
$$ -114692 -177855 -199021 52757 33848 -19201 -143299 125725 -202079 324284 -22475 -339451
9586c39451a7169A04474A6117b71599j28987a50018b13j04232j67288C88086j21053
$$ -339451 -17169 104474 16117 -271599 -400586 -150018 -213 -104445 -271733 388086 267033
9575B67033a85206B22771H6284a15793N409j33808g7056l88479J97298f3239j25830
$$ 267033 -185206 222771 86284 -115793 -110384 -244192 -77056 -465535 -268237 -63239 -189069
9564a89069A62744a98263J3303l20003K00163A26052B0385b78322O0576A35938
$$ -189069 162744 -198263 -184960 -504963 -304800 126052 20385 -278322 -217746 135938
9553E9802b4954A19849b09900m1916A36468E5027e7068j75542J7636B29425F0476
$$ 59802 -24954 119849 -209900 -251816 136468 55027 -57068 -232610 -214974 229425 60476
9541I4265e5709f223k05872A02895Q9808o4169b52313J18730c5301G0364b24233
$$ 94265 -55709 -6223 -212095 102895 192703 128534 -252313 -133583 -35301 70364 -224233
9529a15449C2145b55466J04270L1312k998k48047a15202I7699m7469d20543C8543
$$ -115449 32145 -255466 -151196 -119884 -122882 -370929 -115202 97699 50230 -420543 38543
9517a13786A23218c18134J39788g694C5903J39334l7016n298P8890e8135l71292
$$ -113786 123218 -318134 -178346 -7694 35903 175237 138221 132923 211813 -58135 -429427
9506d29427C9957j6959b63247a24229j00288F914K85652a17846A3054K83245a95309
$$ -429427 39957 22998 -263247 -124229 -224517 6914 292566 -117846 13054 296299 -195309
9494a320l66551Q031p791a53496j46710n0646h7654j25193R6504o727m8804O6190
$$ -1320 -367871 -359840 -367631 -153496 -300206 -350852 -87654 -212847 -116343 -123070 -171874 -105684
9482a05684H3840d1145j09960a9457j59879h4338D6542O9156a82147g9637L6766
$$ -105684 83840 -41145 -151105 -19457 -179336 -84338 46542 115698 -182147 -79637 -42871
9471d2871B257c05328J01812N1790c2315E6826b6372A92016a93480c5041j23547
$$ -42871 2257 -305328 -203516 -151726 -32315 56826 -26372 192016 -193480 -35041 -158588
9460a58588A1179d12916F0058B9374h8330k5086b6437m89001c1194j17920A22856
$$ -158588 11179 -412916 60058 29374 -88330 -113416 -26437 -515438 -31194 -149114 122856
9448d4018j27595d0930i329A0755i1149C9993i8423d3957B17659a53367C2672
$$ -44018 -171613 -40930 -9329 10755 -91149 39993 -98423 -43957 217659 -153367 32672
9436b23639L1333N1827j10814g5473m26191h9393j28334A0039N0815O3610n6806
$$ -223639 -192306 -140479 -251293 -75473 -501664 -89393 -217727 10039 60854 124464 67658
9425F7658J66863R335c66975a7012k47026o0918i0115A81590C9357a40064D3696
$$ 67658 234521 243856 -366975 -17012 -264038 -324956 -90115 181590 39357 -140064 43696
9413a46790A35837a86172l5035b8435r7243O772q777A21309c90908d5742A5559
$$ -146790 135837 -186172 -221207 -28435 -125678 -118906 -127683 121309 -390908 -45742 15559
9401a46924n4293E1825J4131k8850K1281a63537j48524A47573I998b84170f3982
$$ -146924 -201217 51825 65956 37106 58387 -163537 -312061 147573 9998 -284170 -63982
9389A15912M9862M4272i3549j01536n9795A53254J4657D9113j9015a87603R2854
$$ 115912 165774 210046 -93549 -195085 -254880 153254 167911 49113 30098 -187603 -94749
9378i4749I196a23530e8773j93374B24454c57979g9884m7400e0734l20577B9568
$$ -94749 9196 -123530 -58773 -252147 224454 -357979 -79884 -127284 -50734 -371311 29568
9366d7154N045j25645j57738n128a37366M8398k9473C0069J9310B2294f0485G1052
$$ -47154 -42109 -167754 -325492 -330620 -137366 -88968 -118441 30069 49379 22294 -60485 71052
9353C4207J58961e2249l4305H5390k8498P0378h4163q7368G8905d093j46972C74843
$$ 34207 193168 -52249 -86554 85390 56892 127270 -84163 -171531 78905 -4093 -151065 374843
9340i1743B06065r1431f9343l7642A32617k0496h4483E4004J25861L5296B329
$$ -91743 206065 114634 -69343 -106985 132617 112121 -84483 54004 179865 215161 2329
9328F6864R8017l2276c16269A0255a91352A7831b29055e0201E9716K0430k6225
$$ 66864 164881 132605 -316269 10255 -191352 17831 -229055 -50201 59716 80146 53921
9317E3921a80921N7372M9208B2952J08656a79189B85106h0113E3881a4350A90009
$$ 53921 -180921 -123549 -74341 22952 131608 -179189 285106 -80113 53881 -14350 190009
9305b984K97k22801B5025L7733i7776A29451h2917p5879h762A79414r159b63791
$$ -2984 -2687 -225488 25025 62758 -97776 129451 -82917 -158796 -8762 179414 170255 -263791
9292e4488j23383A7302c63630e8498o0607d1215k2706j6943I2054K18907a41329
$$ -54488 -177871 17302 -363630 -58498 -119105 -41215 -63921 -80864 92054 310961 -141329
9280g8532j66199e937k12815C0716A199R3917c39579d1626o4439M1797j54276
$$ -78532 -244731 -5937 -218752 30716 1199 95116 -339579 -41626 -106065 -64268 -218544
9269b18544O6546A10477a08607m3609g4021j52098a1938I0059a59223G5688a33683
$$ -218544 -151998 110477 -108607 -152216 -74021 -226119 -11938 90059 -159223 75688 -133683
9257c368j48459D09830a21703k5026J6888j96352H595h2815a2596E9747b22681
$$ -3368 -151827 409830 -121703 -146729 -129841 -326193 8595 -82815 -12596 59747 -222681
9245a10645F0296b89115F3825K10908b95804B18483a23584l24567A08102c87792
$$ -110645 60296 -289115 63825 274733 -295804 218483 -123584 -448151 108102 -387792
9234a07328B37489b88290f2562o9013C52548a3828L342r6804a6002k07340G3285
$$ -107328 237489 -288290 -62562 -131575 352548 -13828 -10486 -107290 -16002 -223342 73285
9222a10698p0405h1771B2371h4256A89637Q0743d3900k90613h4191k57138e5394
$$ -110698 -181103 -81771 22371 -84256 189637 270380 -43900 -334513 -84191 -341329 -55394
9210b58752E6522a75169e6155A16467C0369k860J60149m4897c4107j08910A1659
$$ -258752 56522 -175169 -56155 116467 30369 27509 187658 142761 -34107 -143017 11659
9198f19k67409R0904A57547a40780j2552j69483a57919O3709M4322A4939J4864
$$ -619 -268028 -177124 157547 -140780 -153332 -322815 -157919 -94210 -49888 14939 29803
9187B9803g9292q6908L7833B35254B3523J51290a65534j39087G4626k5788j938
$$ 29803 -79292 -166200 -128367 235254 23523 174813 -165534 -304621 74626 48838 46900
9176D6900a31555k44471c1494B02607o3693a14625j03723C4383b38627O6614e4391
$$ 46900 -131555 -376026 -31494 202607 138914 -114625 -218348 34383 -238627 -172013 -54391
9164d20836J26042J28148b6634j19514L1423A98079b20509K8167A68160b50850
$$ -420836 -294794 -166646 -26634 -146148 -114725 198079 -220509 -192342 168160 -250850
9153a47404G6447a15324M1741b3038A31637E5776k6696K4643b17932b1648A41217
$$ -147404 76447 -115324 -73583 -23038 131637 55776 29080 53723 -217932 -21648 141217
9141B17040m2038a98870B6296R8560G010a67973B18954A9980b47504Q0567e4128
$$ 217040 175002 -198870 26296 124856 7010 -167973 218954 19980 -247504 -166937 -54128
9129a59566q1629f9019k5036c0950p7665o4838k85442A08374a25694G2511d4973
$$ -159566 -241195 -69019 -94055 -30950 -108615 -173453 -458895 108374 -125694 72511 -44973
9117a6922m28989G6657a46664c6859l12849A68812c9237A63303n5071J15961a41935
$$ -16922 -445911 76657 -146664 -36859 -349708 168812 -39237 163303 108232 224193 -141935
9105b16721F0207J11423b23876O5002a7833B1565N0740J91089F9430a64715H724
$$ -216721 60207 171630 -223876 -158874 -17833 21565 72305 263394 69430 -164715 8724
9093A64184b56841B48558I3554Q152c9118I0048i2578H6153c04428h7670b0187
$$ 164184 -256841 248558 93554 101706 -39118 90048 -92578 86153 -304428 -87670 -20187
9081B29939a43187H8435b53212j35563J00929h4276A5414a56097L5607D41454
$$ 229939 -143187 88435 -253212 -388775 -287846 -84276 15414 -156097 -120490 441454
9070A18468b09162A80590h2301B86058b7628A28143g5921B7038a57529A43794
$$ 118468 -209162 180590 -82301 286058 -27628 128143 -75921 27038 -157529 143794
9059a8482l1240k9433A3323O3693b96242N4974g5562A47166a0369j75996j23403
$$ -18482 -49722 -79155 13323 77016 -296242 -241268 -75562 147166 -10369 -186365 -309768
9048c09768Q5870l7550c9445E9927a57978B41524b13000L2480C00186a71523G0083
$$ -309768 -223898 -261448 -39445 59927 -157978 241524 -213000 -180520 300186 -171523 70083
9036b11499M9519j20803A79848b78208c0613m4131k3251A96818e3958A14057d72714
$$ -211499 -161980 -282783 179848 -278208 -30613 -74744 -97995 196818 -53958 114057 -472714
9024b83435A34534g1768k8234b9505A95020a20043p3276b5232A4187M0926A4774
$$ -283435 134534 -71768 -100002 -29505 195020 -120043 -193319 -25232 14187 55113 14774
9012B35788h7010A66297b62615A42116K22865H2004C3137b3015k46060O6881j5867
$$ 235788 -87010 166297 -262615 142116 364981 82004 33137 -23015 -269075 -202194 -218061
9001b18061C13292D73e6999k36987d9210o3392G4639A1335a26493r0601j80687
$$ -218061 313292 473 -56999 -293986 -49210 -112602 74639 11335 -126493 -217094 -397781
8990c97781A03839g8290A06121c27061A1109J85111C5580J21748d9514j94723
$$ -397781 103839 -78290 106121 -327061 11109 196220 35580 157328 -49514 -244237
8980b44237b3464A8417b88288J21926A1846O8351J19357a58207f7645r6178b943
$$ -244237 -23464 18417 -288288 -166362 11846 80197 199554 -158207 -67645 -163823 -2943
8968b63415B49496h6402A5430c59764a04423H0117a14385p9542o4960a3922A13878
$$ -263415 249496 -86402 15430 -359764 -104423 80117 -114385 -193927 -258887 -13922 113878
8956b08245A72835a06311c9256n682k9295l15722e1841j20623p8003c345k3103
$$ -208245 172835 -106311 -39256 -44938 -74233 -389955 -51841 -172464 -250467 -3345 -26448
8945b6448j50821f2916K6436B39028a17978A54682h0230G3245O9550E8569K31376
$$ -26448 -177269 -62916 -36480 239028 -117978 154682 -80230 73245 142795 58569 289945
8934B89945A08842M0731A5886L8146k4053o336J83282F0741N17474P1629R63263
$$ 289945 108842 149573 15886 54032 29979 23643 206925 60741 578215 649844 1613107
8923A613107L019794Q027293l579452C212505A497924D77905N13957A51019a33992
$$ 1613107 4632901 12660194 9080742 3212505 1497924 477905 991862 151019 -133992
8913B27046i896A6452P7417k4674b49590F50792e4347j8785j42577d5994r4549
$$ 227046 -9896 16452 93869 69195 -249590 650792 -54347 -73132 -215709 -45994 -140543
8902a40543C3265a05309G8328b02190m3059B370a85494M2096E0206a30057B5967
$$ -140543 33265 -105309 78328 -202190 -245249 2370 -185494 -143398 50206 -130057 25967
8890A71393D5781a14537G8732i3596n7934g46I9271a10216c9889m05560B08162
$$ 171393 45781 -114537 78732 -93596 -151530 -746 99271 -110216 -39889 -445449 208162
8878B7462O9997J68096b20664C4040a41994A90574a22921q8939B16502m9288K2418
$$ 27462 97459 265555 -220664 34040 -141994 190574 -122921 -211860 216502 167214 189632
8867A89632a17936B29339a4895l51349H0628a73434A09002m0746c16799g657A64328
$$ 189632 -117936 229339 -14895 -366244 80628 -173434 109002 68256 -316799 -7657 164328
8855b29442a09695j44361f9149G2270L1495d02732C08495b79991J36756E35380
$$ -229442 -109695 -254056 -69149 72270 103765 -402732 308495 -279991 -143235 535380
$$ [...]
##END NTUPLES=NMR SPECTRUM
##END=
