
##TITLE=AC1248__6608987_ZayRjl4W6g
##JCAMPDX= 6.0         $$ Bruker NMR JCAMP-DX V2.0
##DATA TYPE= NMR SPECTRUM
##DATA CLASS= NTUPLES
##ORIGIN= BRUKER
##OWNER= Administrator
$$ 1.72 TOPSPIN		Version 2.1
$$ 2012-08-01 20:32:41.125 -0500  Administrator@TOPSPIN
$$ Compression mode = diff/dup
##.OBSERVE FREQUENCY= 400.02188249412
##.OBSERVE NUCLEUS= ^1H
##.ACQUISITION MODE= SIMULTANEOUS (DQD)
##.ACQUISITION SCHEME= undefined
##.AVERAGES= 64
##.DIGITISER RES= 22
##SPECTROMETER/DATA SYSTEM= spect
##.PULSE SEQUENCE= noesygpps1d.comp
##.SOLVENT NAME= COFFEE_meoh
##.SHIFT REFERENCE= INTERNAL, COFFEE_meoh, 1, 14.9623
##AUDIT TRAIL= $$ (NUMBER, WHEN, WHO, WHERE, PROCESS, VERSION, WHAT)
$$ ##TITLE= Audit trail, TOPSPIN		Version 2.1
$$ ##JCAMPDX= 5.01
$$ ##ORIGIN= Bruker BioSpin GmbH
$$ ##OWNER= Administrator
$$ $$ C:\Bruker\TOPSPIN/data/COFFEE/nmr/AC1248__6608987_ZayRjl4W6g/12/pdata/1/auditp.txt
$$ ##AUDIT TRAIL=  $$ (NUMBER, WHEN, WHO, WHERE, PROCESS, VERSION, WHAT)
(   1,<2012-08-01 20:32:35.812 -0500>,<Administrator>,<TOPSPIN>,<go>,<TOPSPIN 2.1>,
      <created by zg
	started at 2012-08-01 20:21:05.484 -0500,
	POWCHK enabled, PULCHK disabled,
       configuration hash MD5:
       6B 1B 68 BB D9 2E 58 E2 7F 35 AD 54 07 DF 0E 41
       data hash MD5: 64K
       58 C4 19 F7 4F 2C 9E 4C 06 CB AD 8F 4A 2D 7B 84>)
(   2,<2012-08-01 20:32:38.828 -0500>,<Administrator>,<TOPSPIN>,<proc1d>,<TOPSPIN 2.1>,
      <Start of raw data processing
       efp LB = 0.3 FT_mod = 6 PKNL = 1 PHC0 = 0 PHC1 = 0 SI = 128K 
       data hash MD5: 128K
       E9 04 0A 55 D0 6D A8 03 3A 8C F9 7E D4 1A AF D7>)
(   3,<2012-08-01 20:32:40.046 -0500>,<Administrator>,<TOPSPIN>,<proc1d>,<TOPSPIN 2.1>,
      <pk PHC0 = -2.224731 PHC1 = 0 
       data hash MD5: 128K
       B1 3C A0 ED A0 12 46 29 BE 20 6C 1F F7 99 F4 73>)
(   4,<2012-08-01 20:32:40.765 -0500>,<Administrator>,<TOPSPIN>,<proc1d>,<TOPSPIN 2.1>,
      <abs ABSG = 1 
       data hash MD5: 128K
       46 87 97 0C 75 88 07 05 07 46 1A 4D 21 2A 0E ED>)
(   5,<2012-08-01 20:32:40.843 -0500>,<Administrator>,<TOPSPIN>,<proc1d>,<TOPSPIN 2.1>,
      <abs ABSG = 2 
       data hash MD5: 128K
       78 93 A5 C0 18 76 F5 89 17 D4 A2 19 DA 72 F7 6C>)
(   6,<2012-08-01 20:32:40.906 -0500>,<Administrator>,<TOPSPIN>,<proc1d>,<TOPSPIN 2.1>,
      <abs ABSG = 3 
       data hash MD5: 128K
       1E 3C 93 A9 BF A3 7F B4 A9 16 C5 AB 70 8D B1 75>)
(   7,<2012-08-01 20:32:40.984 -0500>,<Administrator>,<TOPSPIN>,<proc1d>,<TOPSPIN 2.1>,
      <abs ABSG = 4 
       data hash MD5: 128K
       35 7B 52 A3 DA BE C7 BE 3C 25 FC A4 BB 5E 4A C7>)
(   8,<2012-08-01 20:32:41.046 -0500>,<Administrator>,<TOPSPIN>,<proc1d>,<TOPSPIN 2.1>,
      <abs ABSG = 5 
       data hash MD5: 128K
       44 4A 6A CE 94 79 35 6B 83 DE 89 3D F6 0A A3 26>)
$$ ##END=
$$ 
$$ $$ hash MD5
$$ $$ 14 4A 4D AA 7F A2 10 ED CD 71 58 F1 58 96 88 48
##$RELAX= 
##$RELAX= 
##$RELAX= 
##$RELAX= 
##$RELAX= 
##$RELAX= 
##$RELAX= 
##$RELAX= 
$$ Bruker specific parameters
$$ [...]
150 150 150 150 150 150 150 150
##$TP07= 0
##$TPNAME0= <>
##$TPNAME1= <>
##$TPNAME2= <>
##$TPNAME3= <>
##$TPNAME4= <>
##$TPNAME5= <>
##$TPNAME6= <>
##$TPNAME7= <>
##$TPOAL= (0..7)
0.5 0.5 0.5 0.5 0.5 0.5 0.5 0.5
##$TPOFFS= (0..7)
0 0 0 0 0 0 0 0
##$TUNHIN= 0
##$TUNHOUT= 0
##$TUNXOUT= 0
##$USERA1= <user>
##$USERA2= <user>
##$USERA3= <user>
##$USERA4= <user>
##$USERA5= <user>
##$V9= 5
##$VALIST= <valist>
##$VCLIST= <CCCCCCCCCCCCCCC>
##$VD= 0
##$VDLIST= <DDDDDDDDDDDDDDD>
##$VPLIST= <PPPPPPPPPPPPPPP>
##$VTLIST= <TTTTTTTTTTTTTTT>
##$WBST= 1024
##$WBSW= 4
##$XGAIN= (0..3)
0 0 0 0
##$XL= 0
##$YL= 0
##$YMAX_a= 15502328
##$YMIN_a= -9838525
##$ZGOPTNS= <>
##$ZL1= 120
##$ZL2= 120
##$ZL3= 120
##$ZL4= 120
##$ABSF1= 14.9623
##$ABSF2= -5.595881
##$ABSG= 5
##$ABSL= 3
##$ALPHA= 0
##$AQORDER= 0
##$ASSFAC= 0
##$ASSFACI= 0
##$ASSFACX= 0
##$ASSWID= 0
##$AUNMP= <proc_prof1d_extract.lims>
##$AXLEFT= 0
##$AXNAME= <>
##$AXNUC= <1H>
##$AXRIGHT= 0
##$AXTYPE= 0
##$AXUNIT= <>
##$AZFE= 0.1
##$AZFW= 0.1
##$BCFW= 0
##$BC_mod= 0
##$BYTORDP= 0
##$COROFFS= 0
##$CY= 15
##$DATMOD= 1
##$DC= 0
##$DFILT= <>
##$DTYPP= 0
##$F1P= 0
##$F2P= 0
##$FCOR= 0.5
##$FTSIZE= 131072
##$FT_mod= 6
##$GAMMA= 0
##$GB= 0
##$INTBC= 1
##$INTSCL= 1
##$ISEN= 128
##$LB= 0.3
##$LEV0= 0
##$LPBIN= 0
##$MAXI= 10000
##$MC2= 0
##$MEAN= 0
##$ME_mod= 0
##$MI= 0
##$NCOEF= 0
##$NC_proc= -2
##$NLEV= 6
##$NOISF1= 0
##$NOISF2= 0
##$NSP= 0
##$NTH_PI= 0
##$NZP= 0
##$OFFSET= 14.9623
##$PC= 1
##$PHC0= -2.224731
##$PHC1= 0
##$PH_mod= 1
##$PKNL= yes
##$PPARMOD= 0
##$PPDIAG= 0
##$PPIPTYP= 0
##$PPMPNUM= 2147483647
##$PPRESOL= 1
##$PSCAL= 4
##$PSIGN= 0
##$PYNMP= <proc.py>
##$REVERSE= no
##$SF= 400.020009117154
##$SI= 131072
##$SIGF1= 0
##$SIGF2= 0
##$SINO= 400
##$SIOLD= 131072
##$SPECTYP= <>
##$SREGLST= <1H.CDCl3>
##$SSB= 0
##$STSI= 131072
##$STSR= 0
##$SW_p= 8223.68421052631
##$SYMM= 0
##$S_DEV= 0
##$TDeff= 65536
##$TDoff= 0
##$TI= <>
##$TILT= no
##$TM1= 0
##$TM2= 0
##$TOPLEV= 0
##$USERP1= <user>
##$USERP2= <user>
##$USERP3= <user>
##$USERP4= <user>
##$USERP5= <user>
##$WDW= 1
##$XDIM= 131072
##$YMAX_p= 432410300
##$YMIN_p= -10591
##$CURPLOT= <Network HP LaserJet P1505>
##$CURPRIN= <$Network HP LaserJet P1505>
##$DFORMAT= <normdp>
##$LAYOUT= <+/1D_H.xwp>
##$LFORMAT= <normlp>
##$PFORMAT= <normpl>
##$SURQMSG= 1
$$ End of Bruker specific parameters
$$ ---------------------------------
##NTUPLES= NMR SPECTRUM
##VAR_NAME=  FREQUENCY,     SPECTRUM/REAL,   SPECTRUM/IMAG
##SYMBOL=    X,             R,               I
##VAR_TYPE=  INDEPENDENT,   DEPENDENT,       DEPENDENT
##VAR_FORM=  AFFN,          ASDF,            ASDF
##VAR_DIM=   131072,        131072,          131072
##UNITS=     HZ,            ARBITRARY UNITS, ARBITRARY UNITS
##FACTOR=    0.0627417313425164, 1,          1
##FIRST=     8223.62146879497, 2418,         -57132
##LAST=      0,             4404,            -56924
##MIN=       0,             -10591,          0
##MAX=       8223.62146879497, 432410300,    0
$$ Real data points
##PAGE= N=1
##DATA TABLE= (X++(R..R)), XYDATA
$$ [...]
$$ plain form
60975 20451309 23483212 25891287 27258462 27553546 27097338 26330084 25626208 25269756 25464839
60966 25464839 26237718 27304187 28112367 28116356 27074269 25125179 22625190 19931841 17299111
60957 17299111 14879887 12752097 10933500 9402014 8123296 7064645 6192626 5472957
60949 5472957 4877626 4386538 3981121 3641871 3353061 3104753 2888896 2697501 2525240
60940 2525240 2369756 2228465 2098249 1978406 1870226 1773112 1684489 1603786 1532758 1470901
60930 1470901 1413804 1357173 1299862 1242240 1184469 1127555 1073568 1023534 976911 933796 895575
60919 895575 862617 833338 806338 781749 759835 740001 721846 705575 690806 676547 662780
60908 662780 650569 640212 630788 621834 613902 607153 600927 595089 590319 586760 583762 581236 579756 579116
$$ packed form
60975B0451309L031903K408075J367175K95084m56208p67254p03876l56452J95083
60966B5464839P72879J066469Q08180L989j042087j949090k499989k693349k632730
60957A7299111k419224k127790j818597j531486j278718j058651q72019p19669
60949E472957n95331m91088m05417l39250k88810k48308k15857j91395j72261
60940B525240j55484j41291j30216j19843j08180r7114q8623q0703p1028o1857
60930A470901n7097n6631n7311n7622n7771n6914n3987n0034m6623m3115l8221
60919H95575l2958k9279k7000k4589k1914j9834j8155j6271j4769j4259j3767
60908F62780j2211j0357r424q954p932o749o226n838m770l559k998k526j480o40
$$ plain form
60894 579116 578295 577198 577060 578832 582424 587636 594375 601755 608462 614373 620547 627399 634140 640096 645178
60879 645178 648904 650375 649473 646815 642443 635958 628067 620426 613646 606851 599541 592485 586360 580789
60865 580789 575204 569617 564250 559391 555706 553622 552464 551419 551203 553287 557514 562178 566645 572262
60851 572262 580182 589866 600377 611798 624731 639493 656321 675227 695131 714115 730982 745735
60839 745735 758506 769231 778585 787871 797548 806921 815460 823124 829109 831881 831149 828627 826125 823961
60825 823961 821804 819903 818611 817520 815894 813456 810335 806876 803784 801677 800175 798100 794714 790017
60811 790017 783859 775842 766355 756637 747404 738263 728741 718974 709121 699110 689338 680732 673755 668093
60797 668093 663501 660129 657873 656370 655776 656663 659018 662358 666848 673124 680848 688741 696384 704749 714479
$$ packed form
60894E79116q21j097j38J772L592N212O739P380O707N911O174O852O741N956N082
60879F45178L726J471r02k658m372o485p891p641o780o795p310p056o125n571
60865E80789n585n587n367m859l685k084j158j045k16K084M227M664M467N617
60851E72262P920R684J0511J1421J2933J4762J6828J8906J9904J8984J6867J4753
60839G45735J2771J0725R354R286R677R373Q539P664N985K772p32k522k502k164
60825H23961k157j901j292j091j626k438l121l459l092k107j502k075l386m697
60811G90017o158q017r487r718r233r141r522r767r853j0011r772q606o977n662
60797F68093m592l372k256j503n94Q87K355L340M490O276P724P893P643Q365R730
$$ plain form
60782 714479 724844 734976 745037 755524 766306 776970 787305 796975 805513 813044 820271 827458
60770 827458 834245 840652 847264 854152 860675 866646 872595 878517 883563 887472 891082 894796 897724 899147
60756 899147 899720 900345 900772 900280 899003 897657 896508 895489 894895 895204 896453 898189 899648 899724 897468 893002
60740 893002 887406 881381 874720 867350 860033 853544 847969 843256 839624 836866 834036 830537 826835 823521
60726 823521 820383 817116 814289 812759 812525 812863 813265 813648 813880 813678 812818 811162 808721 805859 803059 800259
60710 800259 796843 792442 787287 781735 776072 770971 767318 765221 763793 762300 760930 760114 759741 759500 759429
60695 759429 759590 759599 758889 757155 754288 750227 745058 738872 731403 722236 711427 699463 686674 673309
60681 673309 660176 648402 638343 629374 620916 612996 605723 599061 593362 589402 587562 587539 588981 591746
$$ packed form
60782G14479J0365J0132J0061J0487J0782J0664J0335R670Q538P531P227P187
60770H27458O787O407O612O888O523N971N949N922N046L909L610L714K928J423
60756H99147N73O25M27m92j277j346j149j019n94L09J249J736J459P6k256m466
60740H93002n596o025o661p370p317o489n575m713l632k758k830l499l702l314
60726H23521l138l267k827j530k34L38M02L83K32k02q60j656k441k862k800k800
60710H00259l416m401n155n552n663n101l653k097j428j493j370q16l73k41p1
60695G59429J61Rp10j734k867m061n169o186p469r167j0809j1964j2789j3365
60681F73309j3133j1774j0059q969q458p920p273o662n699l960j840k3J442K765
$$ plain form
60667 591746 595455 599563 604005 609070 614567 619897 624984 630210 635386 639852 643756 648082 653050 657595
60653 657595 660900 663463 666130 669072 672277 676077 680494 684840 688588 691989 695349 698452 701194 704060
60639 704060 707413 711040 714845 719251 724490 730281 736745 744817 755112 767081 779813 793001 806585
60626 806585 820166 833349 846089 858206 869208 878996 887984 896044 902193 905888 907833 908810 908530
60613 908530 906349 902468 897645 892326 886842 882000 878651 876886 876130 875726 875079 873631 870996 866690 859715
60598 859715 849263 836071 822171 808829 795658 782294 769915 760246 753790 749892 747945 747736 749119
60585 749119 752086 756734 762553 768188 772529 775637 778175 780474 782592 784603 786211 786690 785953 785163 785606
60570 785606 787302 789233 790600 791437 792456 794623 798331 802569 805400 805668 803690 800151 795197 789061 782621
$$ packed form
60667E91746L709M108M442N065N497N330N087N226N176M466L904M326M968M545
60653F57595L305K563K667K942L205L800M417M346L748L401L360L103K742K866
60639G04060L353L627L805M406N239N791O464Q072J0295J1969J2732J3188J3584
60626H06585J3581J3183J2740J2117J1002R788Q988Q060O149L695J945R77k80
60613I08530k181l881m823n319n484m842l349j765p56m04o47j448k635m306o975
60598H59715j0452j3192j3900j3342j3171j3364j2379r669o456l898j947k09J383
60585G49119K967M648N819N635M341L108K538K299K118K011J608M79p37p90M43
60570G85606J696J931J367Q37J019K167L708M238K831K68j978l539m954o136o440
$$ plain form
60555 782621 776641 771110 765890 761388 758092 756181 756129 758853 764601 772433 781491 792082 804902 820112
60541 820112 837982 859644 886200 917657 953645 994576 1040971 1091754 1143868 1193253 1235689
60530 1235689 1267261 1285091 1287930 1276101 1251441 1217462 1178679 1139023 1101152 1067269 1039483
60519 1039483 1018821 1004842 996908 995010 998739 1006496 1016685 1028796 1042415 1055982 1067744 1077447
60507 1077447 1086192 1095157 1105294 1117756 1133645 1153643 1178541 1209639 1248041 1294204 1348880 1413789
60495 1413789 1490612 1579922 1681623 1795494 1920635 2055571 2200133 2356582 2528230 2718291
60485 2718291 2931428 3175347 3459058 3789536 4169781 4596783 5057131 5523957 5960560
60476 5960560 6328816 6595470 6734466 6729646 6579319 6298422 5915182 5464644 4982460 4499705
$$ packed form
60555G82621n980n531n220m502l296j911n2K724N748P832R058J0591J2820J5210
60541H20112J7870K1662K6556L1457L5988M0931M6395N0783N2114M9385M2436
60530A235689L1572J7830K839j1829k4660l3979l8783l9656l7871l3883k7786
60519A039483k0662j3979p934j898L729P757J0189J2111J3619J3567J1762R703
60507A077447Q745Q965J0137J2462J5889J9998K4898L1098L8402M6163N4676O4909
60495A413789P6823Q9310J01701J13871J25141J34936J44562J56449J71648J90061
60485B718291K13137K43919K83711L30478L80245M27002M60348M66826M36603
60476E960560L68256K66654J38996m820j50327k80897l83240m50538m82184m82755
$$ plain form
60466 4499705 4039100 3614216 3231591 2893193 2597631 2341155 2119258 1927858 1763305
60457 1763305 1622007 1500449 1395325 1303729 1223594 1153841 1093639 1041536 995729 955001 918960
60446 918960 887487 860321 836909 816225 797028 778669 761291 744898 728872 712913 697771
60435 697771 684208 671805 659651 647736 636808 627214 618733 611215 604562 598394 592520 587381 583293
60422 583293 579699 576097 573209 572222 573192 575140 577357 579636 581628 583157 584940 587812 591348 594348 596566
60407 596566 598816 601433 603848 605837 608060 610985 614155 616926 619324 621924 625412 630343 636832 644375
60393 644375 652283 660179 667720 674272 679438 683618 687462 691058 694202 696925 699026 699641 698210 695489
60379 695489 692719 690166 687367 684312 681331 678177 674457 670745 668143 666814 666028 665528 665723 666524 667084
$$ packed form
60466D499705m60605m24884l82625l38398k95562k56476k21897j91400j64553
60457A763305j41298j21558j05124r1596q0135o9753o0202n2103m5807m0728l6041
60446I18960l1473k7166k3412k0684j9197j8359j7378j6393j6026j5959j5142
60435F97771j3563j2403j2154j1915j0928r594q481p518o653o168n874n139m088
60422E83293l594l602k888r87R70J948K217K279J992J529J783K872L536L000K218
60407E96566K250K617K415J989K223K925L170K771K398K600L488M931O489P543
60393F44375P908P896P541O552N166M180L844L596L144K723K101O15j431k721
60379F95489k770k553k799l055k981l154l720l712k602j329p86n00J95Q01N60
$$ plain form
60364 667084 666949 666617 666876 668253 671030 674991 679265 683155 686975 691404 696403 701630 707480 714599 722647
60349 722647 730716 738741 747318 756296 764826 772821 781103 789973 798774 807028 814943 822598 829597 835712
60335 835712 841056 845641 849676 854200 860411 868482 878103 890074 905972 926112 948965 972665 995751
60322 995751 1016185 1031136 1038517 1037956 1029975 1015301 995361 972352 948104 923466 899177 876539
60310 876539 856732 840096 826410 815358 806505 799364 793652 789039 784800 780500 776793 774638 773772
60297 773772 772971 771826 771170 771654 772937 774484 776156 777729 778813 779504 780319 781341 782334 783748 786509 790601
60281 790601 794862 798491 801754 804943 807698 809766 811482 813089 814419 815632 817440 820255 823876 828223
60267 828223 833621 840208 847851 856817 867590 879929 893095 907179 923175 941566 961903 984036
$$ packed form
60364F67084j35l32K59J377K777L961M274L890L820M429M999N227N850P119Q048
60349G22647Q069Q025Q577Q978Q530P995Q282Q870Q801Q254P915P655O999O115
60335H35712N344M585M035M524O211Q071R621J1971J5898K0140K2853K3700K3086
60322I95751K0434J4951P381n61p981j4674j9940k3009k4248k4638k4289k2638
60310H76539j9807j6636j3686j1052q853p141n712m613m239m300l707k155q66
60297G73772q01j145o56M84J283J547J672J573J084O91Q15J022R93J414K761M092
60281G90601M261L629L263L189K755K068J716J607J330J213J808K815L621M347
60267H28223N398O587P643Q966J0773J2339J3166J4084J5996J8391K0337K2133
$$ plain form
60255 984036 1008590 1035962 1065986 1098895 1135425 1175560 1218464 1264261 1314657 1371101 1433473
60244 1433473 1501382 1575625 1657364 1746710 1843139 1946672 2057641 2175635 2299303 2426793
60234 2426793 2555758 2683357 2806835 2923950 3032659 3130936 3217147 3290084 3348431 3390885
60224 3390885 3417064 3427659 3423494 3405138 3373667 3331068 3279641 3221846 3160920 3100618 3043805
60213 3043805 2991938 2946236 2908511 2880539 2863473 2858299 2866059 2887218 2921560 2969140 3030646 3106438
60201 3106438 3195946 3298232 3412316 3536551 3668329 3804570 3941652 4074819 4198854 4309844
60191 4309844 4405526 4483921 4542884 4581283 4599196 4596405 4571961 4525939 4460441 4378219 4281676
60180 4281676 4174139 4060817 3947233 3837364 3734172 3640919 3560741 3495461 3445801 3412338
$$ packed form
60255I84036K4554K7372L0024L2909L6530M0135M2904M5797N0396N6444O2372
60244A433473O7909P4243Q1739Q9346R6429J03533J10969J17994J23668J27490
60234B426793J28965J27599J23478J17115J08709R8277Q6211P2937N8347M2454
60224C390885K6179J0595m165j8356l1471m2599n1427n7795o0926o0302n6813
60213C043805n1867m5702l7725k7972j7066n174P760K1159L4342M7580O1506P5792
60201C106438Q9508J02286J14084J24235J31778J36241J37082J33167J24035J10990
60191D309844R5682P8395N8963L8399J7913k791k4444m6022o5498q2222r6543
60180D281676j07537j13322j13584j09869j03192r3253q0178o5280m9660l3463
$$ plain form
60170 3412338 3395526 3395424 3412159 3446085 3496762 3562301 3640256 3728410 3823999 3922885 4020199 4111363
60158 4111363 4192210 4259285 4310934 4347364 4368910 4375000 4365515 4342215 4307913 4265114 4216481 4165834
60146 4165834 4117406 4074469 4039462 4014878 4003064 4005513 4023208 4057246 4108450 4177004 4263398
60135 4263398 4369333 4496986 4647866 4823059 5023886 5251362 5505434 5785544 6091367
60126 6091367 6422037 6774949 7146026 7530661 7923529 8317918 8706210 9080952 9435090
60117 9435090 9761764 10054763 10308916 10519502 10681850 10792199 10848436 10849347 10793783 10681448
60107 10681448 10514141 10295591 10030758 9726242 9390913 9035090 8669138 8303146 7947016
60098 7947016 7609560 7297505 7015887 6768916 6559602 6388987 6256721 6162300 6105228 6084416
$$ packed form
60170C412338j6812j02J6735L3926N0677O5539P7955Q8154R5589R8886R7314R1164
60158D111363Q0847O7075N1649L6430K1546O090r485k3300l4302m2799m8633n0647
60146D165834m8428m2937l5007k4584j1814K449J7695L4038N1204O8554Q6394
60135D263398J05935J27653J50880J75193K00827K27476K54072K80110L05823
60126F091367L30670L52912L71077L84635L92868L94389L88292L74742L54138
60117I435090L26674K92999K54153K10586J62348J10349N6237R11n5564j12335
60107A0681448j67307k18550k64833l04516l35329l55823l65952l65992l56130
60098G947016l37456l12055k81618k46971k09314j70615j32266r4421n7072k0812
$$ plain form
60088 6084416 6098116 6144080 6219058 6318444 6436993 6569495 6710236 6852488 6989346 7114647
60078 7114647 7222517 7306926 7362990 7388657 7384485 7352145 7293739 7211730 7108292 6984836 6842809
60067 6842809 6684529 6512505 6328642 6135165 5935846 5735194 5536800 5343535 5158965
60058 5158965 4987177 4831094 4691970 4570567 4467851 4384434 4320307 4275526 4250611 4246149
60048 4246149 4262443 4299542 4357177 4434653 4531021 4645011 4774318 4915206 5063115 5213177
60038 5213177 5359736 5496195 5616415 5716179 5792876 5844342 5868838 5865736 5835315 5778019 5694612
60027 5694612 5586844 5457491 5310196 5149950 4983128 4815942 4652867 4496991 4351328
60018 4351328 4218842 4101507 4000273 3915835 3848761 3799112 3766684 3751486 3753465 3772280 3808141
$$ packed form
60088F084416J3700M5964P4978R9386J18549J32502J40741J42252J36858J25301
60078G114647J07870Q4409N6064K5667m172l2340n8406q2009j03438j23456j42027
60067F842809j58280j72024j83863j93477j99319k00652j98394j93265j84570
60058E158965j71788j56083j39124j21403j02716q3417o4127m4781k4915m462
60048D246149J6294L7099N7635P7476R6368J13990J29307J40888J47909J50062
60038E213177J46559J36459J20220R9764P6697N1466K4496l102l0421n7296q3407
60027E694612j07768j29353j47295j60246j66822j67186j63075j55876j45663
60018D351328j32486j17335j01234q4438o7074m9649l2428j5198J979J8815L5861
$$ plain form
60007 3808141 3862513 3937173 4032846 4149444 4287075 4445683 4623765 4818150 5024740 5238503
59997 5238503 5452926 5660444 5853753 6026578 6173868 6292233 6379997 6436134 6459245 6448034
59987 6448034 6402280 6322765 6210982 6070040 5905553 5724698 5534531 5341775 5153407 4976024
59977 4976024 4814530 4672134 4551255 4453503 4379212 4328146 4300526 4296432 4314448 4351999 4406899
59966 4406899 4477646 4562468 4659261 4766420 4882540 5005086 5130189 5253918 5373014 5484505
59956 5484505 5585519 5673721 5747488 5805845 5848847 5877712 5893806 5897861 5890977 5875956 5856573
59945 5856573 5835905 5816632 5802773 5799809 5812950 5846329 5903893 5989769 6107365 6259030 6446910
59934 6446910 6673310 6939922 7247320 7595234 7982424 8405867 8860281 9337964 9827980
$$ packed form
60007C808141N4372P4660R5673J16598J37631J58608J78082J94385K06590K13763
59997E238503K14423K07518J93309J72825J47290J18365Q7764N6137K3111j1211
59987F448034m5754p9515j11783j40942j64487j80855j90167j92756j88368j77383
59977D976024j61494j42396j20879r7752p4291n1066k7620m094J8016L7551N4900
59966D406899P0747Q4822R6793J07159J16120J22546J25103J23729J19096J11491
59956E484505J01014Q8202P3767N8357M3002K8865J6094M055o884j5021j9383
59945E856573k0668j9273j3859k964J3141L3379N7564Q5876J17596J51665J87880
59934F446910K26400K66612L07398L47914L87190M23443M54414M77683M90016
$$ plain form
59925 9827980 10315327 10781744 11207736 11573881 11861488 12054371 12141566 12118825 11988475 11759091
59915 11759091 11445124 11065037 10638268 10183222 9716851 9254209 8807487 8385786 7995845
59906 7995845 7642439 7328225 7054134 6820251 6626130 6470775 6353323 6273693 6231752 6226051
59896 6226051 6254289 6314896 6407097 6529516 6679752 6855193 7052711 7266908 7489438 7710412
59886 7710412 7919679 8106576 8259681 8367949 8422314 8416597 8348053 8217892 8031161 7795836
59876 7795836 7521796 7219894 6900792 6574062 6248234 5931035 5628770 5345652 5084344
59867 5084344 4846907 4634552 4446895 4282503 4140060 4018229 3914572 3825581 3747700 3677582
59857 3677582 3611725 3547105 3482314 3417377 3352616 3288585 3226788 3169219 3117109 3071202 3033135
$$ packed form
59925I827980M87347M66417M25992L66145K87607J92883Q7195k2741j30350k29384
59915A1759091l13967l80087m26769m55046m66371m62642m46722m21701l89941
59906G995845l53406l14214k74091k33883j94121j55355j17452p9630m1941n701
59896F226051K8238O0607R2201J22419J50236J75441J97518K14197K22530K20974
59886G710412K09267J86897J53105J08268N4365n717o8544j30161j86731k35325
59876G795836k74040l01902l19102l26730l25828l17199l02265k83118k61308
59867E084344k37437k12355j87657j64392j42443j21831j03657q8991p7881p0118
59857C677582o5857o4620o4791o4937o4761o4031o1797n7569n2110m5907l8067
$$ plain form
59846 3033135 3005171 2988061 2979963 2977601 2977586 2976545 2971145 2958724 2937624 2907111 2867690 2821429 2771094
59833 2771094 2718918 2666752 2616969 2572087 2533631 2502292 2478775 2463066 2453003 2445229 2438093 2432645
59821 2432645 2430787 2433878 2443382 2461328 2489081 2526224 2570952 2620908 2673744 2728079 2784275 2843334
59809 2843334 2904848 2966925 3027928 3086789 3141296 3187750 3223271 3247548 3261804 3267203 3265044 3257544
59797 3257544 3247453 3237345 3229700 3226977 3231107 3243542 3266100 3301039 3349960 3413419 3492004 3587106
59785 3587106 3700486 3834027 3990442 4173502 4387206 4635375 4922158 5251740 5626579
59776 5626579 6045487 6501865 6980713 7455250 7887273 8233798 8457647 8537226 8471779 8280116
59766 8280116 7993254 7645167 7266719 6883624 6515578 6175409 5869823 5601699 5371392
$$ packed form
59846C033135k7964j7110q098k362j5j041n400j2421k1100l0513l9421m6261n0335
59833B771094n2176n2166m9783m4882l8456l1339k3517j5709j0063p774p136n448
59821B432645j858L091R504J7946K7753L7143M4728M9956N2836N4335N6196N9059
59809B843334O1514O2077O1003N8861N4507M6454L5521K4277J4256N399k159p500
59797C257544j0091j0108p645k723M130J2435K2558L4939M8921O3459P8585R5102
59785C587106J13380J33541J56415J83060K13704K48169K86783L29582L74839
59776E626579M18908M56378M78848M74537M32023L46525K23849P9579o5447j91663
59766H280116k86862l48087l78448l83095l68046l40169l05586k68124k30307
$$ plain form
59757 5371392 5176611 5013321 4878050 4768866 4684086 4621401 4578778 4555042 4549066 4559584 4586260
59746 4586260 4629791 4690278 4766639 4858192 4965704 5090272 5232382 5392776 5573022 5774369
59736 5774369 5997168 6242292 6512161 6809436 7135793 7493012 7884275 8313163 8782006
59727 8782006 9292130 9844783 10440206 11075712 11745169 12439736 13148030 13855925 14547414
59718 14547414 15206593 15819859 16378258 16879658 17329283 17738180 18121228 18495721 18879400
59709 18879400 19287568 19731230 20217267 20748689 21323379 21932855 22562804 23194526 23805940
59700 23805940 24372877 24871516 25280931 25584829 25773214 25844147 25803988 25665472 25445620 25164871
59690 25164871 24846237 24513371 24188741 23892853 23643583 23455257 23338870 23303601 23357539 23506866
$$ packed form
59757E371392j94781j63290j35271j09184q4780o2685m2623k3736n976J0518K6676
59746D586260M3531O0487P6361R1553J07512J24568J42110J60394J80246K01347
59736E774369K22799K45124K69869K97275L26357L57219L91263M28888M68843
59727H782006N10124N52653N95423O35506O69457O94567P08294P07895O91489
59718A4547414O59179O13266N58399N01400M49625M08897L83048L74493L83679
59709A8879400M08168M43662M86037N31422N74690O09476O29949O31722O11414
59700B3805940N66937M98639M09415L03898J88385P0933m0159j38516k19852k80749
59690B5164871l18634l32866l24630k95888k49270j88326j16387l5269N3938J49327
$$ plain form
59680 23506866 23755619 24107079 24564752 25131544 25808698 26595560 27488561 28478711 29549578
59671 29549578 30676728 31826579 32954178 34003324 34911435 35616759 36064903 36215151 36047128
59662 36047128 35564851 34795439 33784164 32588917 31274103 29903297 28532954 27209624
59654 27209624 25969306 24836318 23822053 22925073 22131398 21413669 20732004 20040668 19299713
59645 19299713 18485591 17595634 16645529 15662153 14675320 13711694 12791947 11929883 11132581
59636 11132581 10401931 9737173 9136385 8596165 8111427 7676518 7286269 6935887 6620974
59627 6620974 6338401 6086397 5862983 5664862 5488456 5331510 5193093 5072580 4969119
59618 4969119 4881450 4807650 4745417 4692859 4648391 4609736 4573843 4537994 4499954 4456912 4405687
$$ packed form
59680B3506866K48753L51460M57673N66792O77154P86862Q93001R90150J070867
59671B9549578J127150J149851J127599J049146R08111P05324M48144J50248j68023
59662C6047128m82277p69412j011275j195247j314814j370806j370343j323330
59654B7209624j240318j132988j014265q96980p93675p17729o81665o91336p40955
59645A9299713q14122q89957r50105r83376r86833r63626r19747q62064p97302
59636A1132581p30650o64758o00788n40220m84738m34909l90249l50382l14913
59627F620974k82573k52004k23414j98121j76406j56946j38417j20513j03461
59618D969119q7669p3800o2233n2558m4468l8655l5893l5849l8040m3042n1225
$$ plain form
59607 4405687 4344717 4274739 4196921 4111499 4019011 3921615 3822086 3722376 3624051 3529159 3439659
59596 3439659 3356684 3281158 3214271 3156510 3107078 3065172 3031082 3005250 2987107 2975677 2970519
59585 2970519 2971292 2977253 2987894 3003192 3022541 3044478 3068136 3093774 3121061 3148132 3173418 3197293
59573 3197293 3220905 3244595 3268644 3294361 3323180 3355755 3393098 3437389 3490292 3551623 3621095
59562 3621095 3700151 3790571 3892487 4005562 4131110 4271210 4426557 4597078 4783918 4988920
59552 4988920 5212599 5454267 5713486 5989558 6280022 6581292 6890228 7203403 7515509
59543 7515509 7820432 8113607 8391724 8651136 8888887 9104699 9299008 9468565 9606500
59534 9606500 9707933 9774242 9811559 9826834 9825992 9814165 9796369 9778361 9767196 9770394 9794556 9845277
$$ packed form
59607D405687o0970o9978p7818q5422r2488r7396r9529r9710r8325r4892q9500
59596C439659q2975p5526o6887n7761m9432m1906l4090k5832j8143j1430n158
59585B970519P73N961J0641J5298J9349K1937K3658K5638K7287K7071K5286K3875
59573C197293K3612K3690K4049K5717K8819L2575L7343M4291N2903O1331O9472
59562C621095P9056R0420J01916J13075J25548J40100J55347J70521J86840K05002
59552D988920K23679K41668K59219K76072K90464L01270L08936L13175L12106
59543G515509L04923K93175K78117K59412K37751K15812J94309J69557J37935
59534I606500J01433O6309L7317J5275q42j1827j7796j8008j1165L198K4162N0721
$$ plain form
59522 9845277 9927495 10044024 10193256 10369094 10562721 10763025 10955654 11123875 11251715 11326170
59512 11326170 11337209 11277665 11143994 10936411 10658191 10315811 9919756 9483696 9021966 8547829
59502 8547829 8073422 7609699 7165680 6748177 6362100 6010294 5693334 5410368 5160212
59493 5160212 4941181 4750648 4586118 4446463 4331069 4238201 4165468 4111558 4076199 4058686
59483 4058686 4057902 4073656 4106655 4157142 4224811 4309818 4412617 4533038 4670938 4827562 5004616
59472 5004616 5202018 5418012 5651320 5901280 6165486 6438801 6714916 6987192 7247415
59463 7247415 7485294 7690089 7852091 7962759 8015302 8006233 7935717 7806345 7622808 7392847
59453 7392847 7126778 6834991 6526394 6209127 5891126 5579129 5277985 4991353 4722030
$$ packed form
59522I845277Q2218J16529J49232J75838J93627K00304J92629J68221J27840P4455
59512A1326170J1039n9544j33671k07583k78220l42380l96055m36060m61730m74137
59502H547829m74407m63723m44019m17503l86077l51806l16960k82966k50156
59493E160212k19031j90533j64530j39655j15394r2868p2733n3910l5359j7513
59483D058686p84J5754L2999N0487O7669Q5007J02799J20421J37900J56624J77054
59472E004616J97402K15994K33308K49960K64206K73315K76115K72276K60223
59463G247415K37879K04795J62002J10668N2543r069p0516j29372j83537k29961
59453G392847k66069k91787l08597l17267l18001l11997l01144k86632k69323
$$ plain form
59444 4722030 4471207 4238543 4023632 3826681 3647542 3485164 3338512 3207070 3090030
59435 3090030 2985877 2893221 2811279 2739315 2676473 2622381 2576933 2539285 2508056 2482751 2463868
59424 2463868 2451333 2443931 2440649 2441396 2446066 2454123 2465486 2480545 2498813 2519186 2542508 2572076
59412 2572076 2609501 2650491 2686519 2711181 2724443 2731245 2737338 2746805 2762251 2785902 2820115 2867167
59400 2867167 2928525 3003494 3087907 3174878 3258672 3338973 3421072 3511686 3615345 3734837 3873204
59389 3873204 4033612 4218104 4428148 4666192 4935433 5238399 5577076 5954230 6373249
59380 6373249 6836663 7345565 7899659 8495913 9126667 9779994 10441886 11097405 11730838
59371 11730838 12327351 12875767 13369471 13805269 14182998 14506132 14780879 15013615 15209507
$$ packed form
59444D722030k50823k32664k14911j96951j79139j62378j46652j31442j17040
59435C090030j04153r2656q1942p1964o2842n4092m5448l7648l1229k5305j8883
59424B463868j2535p402l282P47M670Q057J1363J5059J8268K0373K3322K9568
59412B572076L7425M0990L6028K4662J3262O802O093R467J5446K3651L4213M7052
59400B867167O1358P4969Q4413Q6971Q3794Q0301Q2099R0614J03659J19492J38367
59389C873204J60408J84492K10044K38044K69241L02966L38677L77154M19019
59380F373249M63414N08902N54094N96254O30754O53327O61892O55519O33433
59371A1730838N96513N48416M93704M35798L77729L23134K74747K32736J95892
$$ plain form
59362 15209507 15372829 15506524 15610596 15681820 15715260 15705244 15645268 15528950 15352321 15115173
59352 15115173 14820886 14476457 14092565 13681510 13253582 12815297 12370444 11921255 11468396
59343 11468396 11011374 10549919 10084829 9618022 9152993 8695095 8250052 7822050 7414124
59334 7414124 7029800 6672579 6343843 6042877 5769105 5522729 5303048 5107841 4934920
59325 4934920 4783031 4650995 4537403 4441368 4362223 4298266 4247259 4208281 4181564 4166463 4161280
59314 4161280 4165246 4178618 4200423 4228058 4259788 4295698 4335265 4375774 4414185 4448973 4479052
59303 4479052 4502428 4517276 4523349 4521294 4511470 4494295 4470890 4442687 4411228 4378794 4348166 4321285
59291 4321285 4299192 4283563 4277008 4281526 4298067 4328009 4373415 4435164 4512449 4604893 4713615
$$ packed form
59362A5209507J63322J33695J04072P1224L3440j0016n9976j16318j76629k37148
59352A5115173k94287l44429l83892m11055m27928m38285m44853m49189m52859
59343A1468396m57022m61455m65090m66807m65029m57898m45043m28002m07926
59334G414124l84324l57221l28736l00966k73772k46376k19681j95207j72921
59325D934920j51889j32036j13592r6035p9145o3957n1007l8978k6717j5101n183
59314D161280L966J3372K1805K7635L1730L5910L9567M0509L8411L4788L0079
59303D479052K3376J4848O073k055r824j7175k3405k8203l1459l2434l0628k6881
59291D321285k2093j5629o555M518J6541K9942M5406O1749P7285R2444J08722
$$ plain form
59280 4713615 4839330 4981003 5137428 5308436 5492670 5684703 5875521 6055586 6217279
59271 6217279 6355837 6469239 6556798 6617373 6649496 6653210 6630520 6583771 6515051 6427689 6326785
59260 6326785 6217325 6102781 5986024 5870125 5757357 5648446 5543510 5442643 5345183 5249763
59250 5249763 5155768 5063602 4973175 4883711 4795608 4710900 4631298 4557410 4490540 4433313 4387476
59239 4387476 4352910 4330034 4321521 4330292 4357360 4403133 4469562 4559573 4675493 4819375 4993845
59228 4993845 5201398 5443686 5722314 6039034 6394011 6784808 7207463 7656466 8122008
59219 8122008 8588471 9037110 9449444 9807620 10093999 10293186 10394471 10391679 10282387 10069296
59209 10069296 9761755 9374433 8924713 8431621 7915066 7393503 6881767 6391224 5930501
$$ packed form
59280D713615J25715J41673J56425J71008J84234J92033J90818J80065J61693
59271F217279J38558J13402Q7559O0575L2123L714k2690m6749o8720q7362j00904
59260F326785j09460j14544j16757j15899j12768j08911j04936j00867r7460r5420
59250E249763r3995r2166r0427q9464q8103q4708p9602p3888o6870n7227m5837
59239D387476l4566k2876q513Q771K7068M5773O6429R0011J15920J43882J74470
59228D993845K07553K42288K78628L16720L54977L90797M22655M49003M65542
59219H122008M66463M48639M12334L58176K86379J99187J01285k792j09292k13091
59209A0069296l07541l87322m49720m93092n16555n21563n11736m90543m60723
$$ plain form
59200 5930501 5504926 5116467 4765518 4452013 4174245 3928392 3710671 3518884 3350880
59191 3350880 3203206 3072742 2958159 2858165 2769758 2690061 2618599 2555969 2501382 2453360 2411656
59180 2411656 2376503 2346884 2321494 2300542 2284693 2273065 2264254 2258659 2257793 2261811 2269656 2281220
59168 2281220 2297402 2318276 2342963 2371168 2403240 2438928 2477615 2519660 2566112 2617162 2672118
59157 2672118 2730557 2792329 2856731 2922859 2990397 3058901 3126748 3191896 3253142 3309460 3358728
59146 3358728 3398471 3427510 3445843 3453579 3451223 3440303 3422318 3397521 3365927 3328991 3289074 3247889
59134 3247889 3206755 3167677 3132777 3103110 3079291 3062688 3054723 3055587 3065042 3083991 3113962 3155559
59122 3155559 3208611 3273321 3350023 3438304 3537541 3647795 3769184 3901120 4043206 4196001
$$ packed form
59200E930501m25575l88459l50949l13505k77768k45853k17721j91787j68004
59191C350880j47674j30464j14583r9994q8407p9697p1462o2630n4587m8022m1704
59180B411656l5153k9619k5390k0952j5849j1628q811n595q66M018P845J1564
59168B281220J6182K0874K4687K8205L2072L5688L8687M2045M6452N1050N4956
59157B672118N8439O1772O4402O6128O7538O8504O7847O5148O1246N6318M9268
59146C358728L9743K9039J8333P736k356j0920j7985k4797l1594l6936l9917m1185
59134C247889m1134l9078l4900k9667k3819j6603p965Q64R455J8949K9971M1597
59122C155559N3052O4710P6702Q8281R9237J10254J21389J31936J42086J52795
$$ plain form
59112 4196001 4359692 4533025 4714989 4906677 5110016 5325338 5551461 5787071 6030314
59103 6030314 6277725 6525075 6768395 7002429 7218662 7406459 7555698 7657283 7702739 7685970
59093 7685970 7605711 7465183 7270185 7028783 6751458 6449059 6130562 5803890 5477561 5159250
59083 5159250 4853222 4561098 4284622 4025905 3785737 3563837 3360370 3175284 3006699
59074 3006699 2852055 2710494 2582109 2465381 2357650 2258030 2167640 2086858 2014233 1948159
59064 1948159 1887776 1832209 1780700 1733640 1691904 1655160 1622194 1592605 1566598 1543499 1522218
59053 1522218 1502943 1486598 1472825 1460109 1447548 1434863 1421071 1405006 1386876 1367594 1347007
59042 1347007 1324681 1301944 1281084 1262785 1246315 1231827 1220274 1211349 1203876 1198234 1196163 1198137
$$ packed form
59112D196001J63691J73333J81964J91688K03339K15322K26123K35610K43243
59103F030314K47411K47350K43320K34034K16233J87797J49239J01585M5456j6769
59093G685970q0259j40528j94998k41402k77325l02399l18497l26672l26329l18311
59083E159250l06028k92124k76476k58717k40168k21900k03467j85086j68585
59074C006699j54644j41561j28385j16728j07731r9620r0390q0782p2625o6074
59064A948159o0383n5567n1509m7060m1736l6744l2966k9589k6007k3099k1281
59053A522218j9275j6345j3773j2716j2561j2685j3792j6065j8130j9282k0587
59042A347007k2326k2737k0860j8299j6470j4488j1553q925p473n642k071J974
$$ plain form
59030 1198137 1203099 1210808 1222142 1236802 1252913 1269264 1285892 1302140 1316185 1327026 1335149 1340884
59018 1340884 1343894 1344578 1344181 1343173 1341226 1338956 1337924 1338783 1341195 1345676 1353485 1364498 1377191 1390940
59004 1390940 1406250 1422318 1436574 1447345 1455044 1460119 1461825 1459912 1455786 1450994 1445759 1439737 1433006
58991 1433006 1425852 1418790 1413093 1410094 1409682 1410637 1412473 1415690 1420405 1426216 1433279 1441929 1451390 1460539
58977 1460539 1469724 1480112 1491549 1503062 1515238 1529857 1547169 1565811 1585579 1607922 1633425
58966 1633425 1661044 1690222 1721503 1754575 1787980 1821380 1855942 1891743 1926819 1959559 1990216
58955 1990216 2019455 2047347 2074507 2102337 2131379 2161133 2192037 2225903 2263944 2306113 2352765
58944 2352765 2404976 2462752 2524994 2591848 2665125 2745810 2833080 2926436 3026863 3135266 3251723
$$ packed form
59030A198137M962P709J1334J4660J6111J6351J6628J6248J4045J0841Q123N735
59018A340884L010O84l97j008j947k270j032Q59K412M481P809J1013J2693J3749
59004A390940J5310J6068J4256J0771P699N075J706j913m126m792n235o022o731
58991A433006p154p062n697k999m12R55J836L217M715N811P063Q650R461R149
58977A460539R185J0388J1437J1513J2176J4619J7312J8642J9768K2343K5503
58966A633425K7619K9178L1281L3072L3405L3400L4562L5801L5076L2740L0657
58955A990216K9239K7892K7160K7830K9042K9754L0904L3866L8041M2169M6652
58944B352765N2211N7776O2242O6854P3277Q0685Q7270R3356J00427J08403J16457
$$ plain form
58933 3251723 3376967 3512736 3660060 3819106 3991195 4178937 4383886 4606206 4847229
58924 4847229 5110075 5396995 5708353 6045100 6410050 6805886 7234137 7697026 8198012
58915 8198012 8739382 9321360 9944416 10609992 11317430 12062021 12836865 13633935 14441373
58906 14441373 15241463 16012704 16732260 17375359 17915046 18325646 18587075 18686524 18619092 18389103
58896 18389103 18009819 17500439 16883577 16184699 15430407 14644704 13847342 13055662 12285442
58887 12285442 11548604 10852012 10199707 9594598 9037153 8524854 8054695 7624839 7232957
58878 7232957 6875029 6547053 6246185 5969141 5711552 5470157 5243860 5031717 4832044
58869 4832044 4644561 4470873 4311250 4163149 4024470 3895990 3778890 3672092 3573936 3484398
$$ packed form
58933C251723J25244J35769J47324J59046J72089J87742K04949K22320K41023
58924D847229K62846K86920L11358L36747L64950L95836M28251M62889N00986
58915H198012N41370N81978O23056O65576P07438P44591P74844P97070Q07438
58906A4441373Q00090P71241P19556O43099N39687M10600K61429R9449o7432k29989
58896A8389103l79284n09380o16862o98878p54292p85703p97362p91680p70220
58887A2285442p36838o96592o52305o05109n57445n12299m70159m29856l91882
58878G232957l57928l27976l00868k77044k57589k41395k26297k12143j99673
58869D832044j87483j73688j59623j48101j38679j28480j17100j06798r8156q9538
$$ plain form
58859 3484398 3403623 3330153 3262644 3201691 3148097 3100997 3059534 3024628 2997194 2976220 2960469
58848 2960469 2950443 2946904 2949170 2956769 2971002 2992804 3020756 3053355 3091730 3137901 3191779 3252086
58836 3252086 3318953 3393314 3474830 3562615 3657168 3759766 3870924 3991160 4122195 4265619
58826 4265619 4421530 4590215 4773987 4975603 5196133 5436226 5698265 5985372 6299470
58817 6299470 6642287 7017163 7427859 7876438 8364078 8892917 9465233 10081503 10740618
58808 10740618 11440589 12176936 12940992 13720938 14502826 15268533 15994035 16652096 17216485
58799 17216485 17663040 17969644 18119352 18104551 17927266 17596680 17128207 16543604 15868776
58790 15868776 15130031 14352060 13557318 12764742 11988825 11240568 10528314 9856778 9226965
$$ packed form
58859C484398q0775p3470o7509o0953n3594m7100m1463l4906k7434k0974j5751
58848B960469j0026l539K266P599J4233K1802K7952L2599L8375M6171N3878O0307
58836C252086O6867P4361Q1516Q7785R4553J02598J11158J20236J31035J43424
58826D265619J55911J68685J83772K01616K20530K40093K62039K87107L14098
58817F299470L42817L74876M10696M48579M87640N28839N72316O16270O59115
58808A0740618O99971P36347P64056P79946P81888P65707P25502O58061N64389
58799A7216485M46555L06604J49708j4801j77285l30586m68473n84603o74828
58790A5868776p38745p77971p94742p92576p75917p48257p12254o71536o29813
$$ plain form
58781 9226965 8638758 8092784 7588867 7124555 6696854 6304054 5944299 5613958 5309202
58772 5309202 5027810 4767815 4526103 4300267 4090273 3896287 3716444 3548753 3393479
58763 3393479 3251173 3119884 2996942 2882173 2776743 2679913 2589720 2506059 2430443 2363080
58753 2363080 2302490 2247607 2198164 2153474 2112727 2076001 2043269 2013144 1984274 1957104 1932508
58742 1932508 1909710 1887355 1865552 1844905 1824555 1803153 1780783 1758055 1734452 1709604 1685025
58731 1685025 1662415 1641240 1619991 1598664 1577902 1556999 1535072 1513031 1491946 1470520 1446602
58720 1446602 1420240 1392901 1364779 1335416 1305909 1277827 1250698 1223182 1195907 1170625 1147243
58709 1147243 1124310 1101824 1080991 1061769 1043098 1025070 1008524 993048 977647 962735 949285
$$ packed form
58781I226965n88207n45974n03917m64312m27701l92800l59755l30341l04756
58772E309202k81392k59995k41712k25836k09994j93986j79843j67691j55274
58763C393479j42306j31289j22942j14769j05430r6830r0193q3661p5616o7363
58753B363080o0590n4883m9443m4690m0747l6726l2732l0125k8870k7170k4596
58742A932508k2798k2355k1803k0647k0350k1402k2370k2728k3603k4848k4579
58731A685025k2610k1175k1249k1327k0762k0903k1927k2041k1085k1426k3918
58720A446602k6362k7339k8122k9363k9507k8082k7129k7516k7275k5282k3382
58709A147243k2933k2486k0833j9222j8671j8028j6546j5476j5401j4912j3450
$$ plain form
58698 949285 936736 923953 911340 899692 888074 875371 862927 852910 845024 837637 831171 827312
58686 827312 825664 824461 824026 826149 830226 833227 833590 832255 829811 825562 819707 813749 808385 803274 798883
58671 798883 796173 794505 792186 789077 786438 784512 782713 781840 783429 786949 790117 791873 792623 791835 788127
58656 788127 781882 775260 769492 764366 760240 758160 757993 758750 760718 765085 771706 779419 788201 798699
58642 798699 810139 821219 832692 846530 862885 880435 899303 920933 945397 971612 999934
58631 999934 1031858 1067391 1105478 1146808 1193396 1245581 1302257 1363958 1432903 1510119 1595313
58620 1595313 1689444 1794590 1911375 2039283 2179358 2333722 2502626 2684909 2881194 3093427
58610 3093427 3321094 3560515 3807333 4056182 4297712 4519285 4709246 4858282 4957551 4999762
$$ packed form
58698I49285j2549j2783j2613j1648j1618j2703j2444j0017p886p387o466l859
58686H27312j648j203m35K123M077L001L63j335k444m249n855n958n364n111m391
58671G98883k710j668k319l109k639j926j799q73J589L520L168J756P50p88l708
58656G88127o245o622n768n126m126k080j67P57J968M367O621P713Q782J0498
58642G98699J1440J1080J1473J3838J6355J7550J8868K1630K4464K6215K8322
58631I99934L1924L5533L8087M1330M6588N2185N6676O1701O8945P7216Q5194
58620A595313R4131J05146J16785J27908J40075J54364J68904J82283J96285K12233
58610C093427K27667K39421K46818K48849K41530K21573J89961J49036R9269M2211
$$ plain form
58600 4999762 4983221 4912186 4793106 4633307 4442865 4233572 4014741 3792340 3572021 3359525
58590 3359525 3157777 2966984 2788124 2623309 2472579 2334029 2207716 2095976 1999167 1914453
58580 1914453 1839608 1774692 1719088 1670219 1626368 1587814 1554203 1523646 1495307 1470102 1448074
58569 1448074 1427661 1408048 1389434 1370667 1349721 1326920 1304571 1282927 1259805 1234543 1208878
58558 1208878 1183387 1156686 1128936 1102510 1078245 1054568 1031296 1010712 993755 978580 964087
58547 964087 951510 941386 932330 923997 917896 914134 910721 907216 905494 905610 904538 900561 895444 890635
58533 890635 884701 876234 866095 855037 842180 827513 812951 799312 785145 769917 755369 742347
58521 742347 729413 715985 703630 692803 681557 669152 657782 649026 641542 633845 626412 619655
$$ packed form
58600D999762j6541p1035j19080j59799j90442k09293k18831k22401k20319k12496
58590C359525k01748j90793j78860j64815j50730j38550j26313j11740r6809q4714
58580A914453p4845o4916n5604m8869m3851l8554l3611l0557k8339k5205k2028
58569A448074k0413j9613j8614j8767k0946k2801k2349k1644k3122k5262k5665
58558A208878k5491k6701k7750k6426k4265k3677k3272k0584j6957j5175j4493
58547I64087j2577j0124r056q333o101l762l413l505j722J16j072l977n117m809
58533H90635n934q467j0139j1058j2857j4667j4562j3639j4167j5228j4548j3022
58521G42347j2934j3428j2355j0827j1246j2405j1370q756p484p697p433o757
$$ plain form
58509 619655 612872 606639 603123 602531 602359 601507 601803 604095 606302 607119 608280 611321 615255 619084 623440
58494 623440 628087 631159 632595 635078 639832 644743 648227 651545 655526 658601 660087 662077 666063 670870
58480 670870 675693 681825 689484 696357 701234 705803 711063 715340 717656 719422 720896 719621 714443 707531
58466 707531 700437 691774 680764 669312 658466 646646 633604 622240 614205 607484 600626 595383 592763
58453 592763 590475 586968 584087 583118 582128 579905 578489 578980 578938 576922 575576 577059 579403 580715 583103
58438 583103 588941 596852 604766 613372 623164 631683 637149 641470 646347 649842 650127 649137 649188 649382 648624 648703
58422 648703 651106 654231 656911 661121 668108 675680 682499 690933 702202 712913 720137 725909 732848 739429
58408 739429 743666 747460 752961 758278 761027 762525 764421 764827 761912 757581 753503 747365 737362 726567
$$ packed form
58509F19655o783o233l516n92j72q52K96K292K207Q17J161L041L934L829M356
58494F23440M647L072J436K483M754M911L484L318L981L075J486J990L986M807
58480F70870M823O132P659O873M877M569N260M277K316J766J474j275n178o912
58466G07531p094q663j1010j1452j0846j1820j3042j1364q035o721o858n243k620
58453E92763k288l507k881r69r90k223j416M91m2k016j346J483K344J312K388
58438E83103N838P911P914Q606R792Q519N466M321M877L495K85r90N1J94p58P9
58422F48703K403L125K680M210O987P572O819Q434J1269J0711P224N772O939O581
58408G39429M237L794N501N317K749J498J896M06k915m331m078o138j0003j0795
$$ plain form
58394 726567 718392 711492 703565 696335 692157 689423 686075 683977 685148 687330 688029 689268 693466 698304
58380 698304 700613 701760 704274 706779 707323 708164 712145 717693 722273 727251 734449 741725 746989 752814 761922
58365 761922 772017 780268 788758 799950 810938 818056 823296 830252 837607 842603 847041 853699 860577
58352 860577 864941 869301 877079 886053 892348 897152 903027 907543 907355 904946 904505 904735 902530 900026 900950
58337 900950 903522 904112 904559 908779 915590 921909 929435 940983 953847 964164 974237 988184 1004038
58324 1004038 1017659 1030565 1046088 1061743 1073485 1083716 1097002 1111768 1124435 1137506 1154807
58313 1154807 1172875 1186243 1197241 1211160 1225626 1234628 1239525 1246020 1253618 1258188 1261806 1269728 1280479
58300 1280479 1289051 1297111 1309878 1325901 1340198 1354478 1373698 1395513 1413880 1430162 1449835 1471381
$$ packed form
58394G26567q175o900p927p230m178k734l348k098J171K182O99J239M198M838
58380F98304K309J147K514K505N44Q41L981N548M580M978P198P276N264N825R108
58365G61922J0095Q251Q490J1192J0988P118N240O956P355M996M438O658O878
58352H60577M364M360P778Q974O295M804N875M516j88k409m41K30k205k504R24
58337I00950K572N90M47M220O811O319P526J1548J2864J0317J0073J3947J5854
58324A004038J3621J2906J5523J5655J1742J0231J3286J4766J2667J3071J7301
58313A154807J8068J3368J0998J3919J4466R002M897O495P598M570L618P922J0751
58300A280479Q572Q060J2767J6023J4297J4280J9220K1815J8367J6282J9673K1546
$$ plain form
58288 1471381 1489610 1506872 1529349 1555227 1578335 1600533 1628365 1660277 1689582 1717404 1750011
58277 1750011 1785891 1818457 1849159 1884799 1924128 1960340 1994606 2033679 2076389 2116170 2154543
58266 2154543 2198062 2244449 2286279 2326018 2372515 2424995 2475743 2526120 2583946 2647390 2707906
58255 2707906 2767055 2833682 2906517 2976800 3046037 3123370 3207434 3289252 3371053 3463160 3564178
58244 3564178 3664071 3764901 3877834 4001313 4123744 4246499 4382018 4530328 4680535 4834625
58234 4834625 5005719 5193343 5385203 5583040 5801041 6039113 6284628 6540522 6823511
58225 6823511 7134440 7459673 7801903 8178588 8589696 9019914 9473686 9973748 10524210
58216 10524210 11111835 11745019 12452448 13241751 14101551 15046741 16117183 17329751 18680763
$$ packed form
58288A471381J8229J7262K2477K5878K3108K2198K7832L1912K9305K7822L2607
58277A750011L5880L2566L0702L5640L9329L6212L4266L9073M2710L9781L8373
58266B154543M3519M6387M1830L9739M6497N2480N0748N0377N7826O3444O0516
58255B707906N9149O6627P2835P0283O9237P7333Q4064Q1818Q1801R2107J01018
58244C564178R9893J00830J12933J23479J22431J22755J35519J48310J50207J54090
58234D834625J71094J87624J91860J97837K18001K38072K45515K55894K82989
58225F823511L10929L25233L42230L76685M11108M30218M53772N00062N50462
58216A0524210N87625O33184P07429P89303Q59800R45190J070442J212568J351012
$$ plain form
58207 18680763 20199449 21947300 23962843 26266849 28927084 32052604 35716242 39951788
58199 39951788 44833537 50481391 56989043 64454148 73105743 83313120 95481793 110094393
58191 110094393 127879665 149782385 176760101 209784022 249766448 296421835 346159445
58184 346159445 391221098 422145901 432410300 421480735 393989398 356505498 314888988
58177 314888988 273415616 234843475 200590981 171048466 146069653 125302096 108231126
58170 108231126 94233765 82769575 73463803 65994943 60041758 55392381 51980923 49763080
58162 49763080 48680897 48793741 50231082 52783351 55566504 57289366 56976835 54470936
58154 54470936 50321921 45321090 40129115 35168912 30671296 26737980 23381909 20558150
$$ packed form
58207A8680763J518686J747851K015543K304006K660235L125520L663638M235546
58199C9951788M881749N647854O507652P465105Q651595J0207377J2168673J4612600
58191A10094393J7785272K1902720K6977716L3023921L9982426M6655387M9737610
58184C46159445M5061653L0924803J0264399j0929565k7491337l7483900m1616510
58177C14888988m1473372l8572141l4252494k9542515k4978813k0767557j7070970
58170A08231126j3997361j1464190r305772p468860n953185m649377l411458k217843
58162D9763080j082183J12844J437341K552269K783153J722862l12531k505899
58154E4470936m149015n000831n191975m960203m497616l933316l356071k823759
$$ plain form
58146 20558150 18195810 16223579 14576929 13193554 12016867 11007406 10141762 9398400
58138 9398400 8753688 8191320 7702150 7271819 6880924 6519719 6189332 5885467 5594547
58129 5594547 5309747 5037209 4781928 4540689 4313331 4107337 3925357 3760191 3607495
58120 3607495 3471891 3355395 3251064 3152924 3061121 2972737 2879081 2777530 2675729 2579322
58110 2579322 2485673 2393752 2309164 2234335 2164008 2095415 2033069 1978850 1927257 1875310 1827421
58099 1827421 1785723 1745084 1702550 1662340 1626585 1590219 1550081 1510333 1474021 1437882 1400333
58088 1400333 1366043 1337566 1310563 1282096 1255601 1232902 1209392 1182141 1155138 1131629 1108758
58077 1108758 1084484 1062354 1044563 1027480 1008776 991863 978656 965162 949024 934333 923959
$$ packed form
58146B0558150k362340j972231j646650j383375j176687j009461q65644p43362
58138I398400o44712n62368m89170m30331l90895l61205l30387l03865k90920
58129E594547k84800k72538k55281k41239k27358k05994j81980j65166j52696
58120C607495j35604j16496j04331r8140r1803q8384r3656j01551j01801r6407
58110B579322r3649r1921q4588p4829p0327o8593o2346n4219n1593n1947m7889
58099A827421m1698m0639m2534m0210l5755l6366m0138l9748l6312l6139l7549
58088A400333l4290k8477k7003k8467k6495k2699k3510k7251k7003k3509k2871
58077A108758k4274k2130j7791j7083j8704j6913j3207j3494j6138j4691j0374
$$ plain form
58066 923959 914043 901258 888879 880368 873251 864658 856937 852485 848542 842168 835048 828611 819765 806405
58052 806405 792135 780789 770998 760450 750654 743149 735787 726969 719066 713792 708896 703038 698945
58039 698945 697952 696566 692433 688731 688620 690301 691528 693970 698833 703002 703916 703737 704595 704331 701115 697642
58023 697642 696435 695401 692305 689145 687804 685793 680863 675556 672612 669918 664637 658472 654125 650234
58009 650234 644432 638047 633225 628645 622457 616377 612620 609810 605943 602303 600495 598743 595156 591558
57995 591558 590024 588599 584356 577821 570702 562345 552305 543291 537674 534015 530700 529714 532800 537161
57981 537161 539280 540080 542090 544451 545097 545219 547111 549859 551373 552427 554695 557086 557907 558283 559481
57966 559481 559334 555426 549603 545258 542321 538910 535681 534331 533812 532103 529837 528241 525577 519780 512744
$$ packed form
58066I23959r916j2785j2379q511p117q593p721m452l943o374p120o437q846j3360
58052H06405j4270j1346r791j0548r796p505p362q818p903n274m896n858m093
58039F98945r93j386m133l702j11J681J227K442M863M169R14j79Q58k64l216l473
58023F97642j207j034l096l160j341k011m930n307k944k694n281o165m347l891
58009F50234n802o385m822m580o188o080l757k810l867l640j808j752l587l598
57995E91558j534j425m243o535p119q357j0040r014n617l659l315r86L086M361
57981E37161K119Q00K010K361O46J22J892K748J514J054K268K391Q21L76J198
57966E59481j47l908n823m345k937l411l229j350n19j709k266j596k664n797p036
$$ plain form
57951 512744 507828 504858 501640 498644 497978 499210 500396 501938 505413 509846 513006 515201 517989 520475
57937 520475 520710 519566 519294 519271 517022 512591 508132 503939 498389 491143 483058 473717 462294 450160 439523
57922 439523 430354 421546 414011 409494 407368 405786 405015 406576 410128 414229 419062 425349 431817 436957
57908 436957 442190 450048 460257 470648 480682 490864 499977 506408 511125 515972 520058 521281 520293
57895 520293 519348 518219 514983 510010 505420 501189 495500 488492 482040 476142 469082 460909 453444 447060
57881 447060 440732 434917 431130 428976 426840 425105 425413 427117 427909 427795 429078 432575 437069 442322 449205
57866 449205 456916 463524 469375 476634 485307 492956 498538 503270 507464 509844 510364 510505 510247 507853 503180
57851 503180 498263 494019 489196 483120 476776 470627 464068 457487 452183 447829 442660 436593 431468 427838
$$ packed form
57951E12744m916k970l218k996o66J232J186J542L475M433L160K195K788K486
57937E20475K35j144k72k3k249m431m459m193n550p246q085r341j1423j2134j0637
57922D39523r169q808p535m517k126j582p71J561L552M101M833O287O468N140
57908D36957N233P858J0209J0391J0034J0182R113O431M717M847M086J223r88
57895E20293r45j129l236m973m590m231n689p008o452n898p060q173p465o384
57881D47060o328n815l787k154k136j735L08J704P92j14J283L497M494N253O883
57866D49205P711O608N851P259Q673P649N582M732M194K380N20J41k58k394m673
57851E03180m917m244m823o076o344o149o559o581n304m354n169o067n125l630
$$ plain form
57837 427838 424292 420434 417679 416426 415150 413066 411072 409260 406059 400728 394416 387900 380476 371818
57823 371818 362889 354361 346018 338120 331305 324939 317719 310111 303881 299138 294375 289617 286763 286293
57809 286293 286420 286197 286814 288932 291370 293471 296402 301067 306914 313718 322319 332530 342327 350082 355769
57794 355769 359395 360420 359565 358970 359621 360633 361866 364994 370831 377628 383243 387286 390114 391487 391304
57779 391304 390044 387563 382867 375886 367964 360030 351928 344010 337473 332408 327364 321660 316369 312357
57765 312357 309117 306283 304521 304174 304713 306167 309302 313776 317937 321119 324246 327639 330316 332171 334704
57750 334704 338623 342765 346366 350419 355718 361548 367353 373755 380742 386785 391039 394636 398559 402039
57736 402039 404376 406559 409576 412663 414748 416298 418343 420873 423472 426434 430154 434461 439549 446403
$$ packed form
57837D27838l546l858k755j253j276k084j994j812l201n331o312o516p424q658
57823C71818q929q528q343p898o815o366p220p608o230m743m763m758k854m70
57809B86293J27k23O17K118K438K101K931M665N847O804Q601J0211R797P755N687
57794C55769L626J025q55n95O51J012J233L128N837O797N615M043K828J373j83
57779C91304j260k481m696o981p922p934q102p918o537n065n044n704n291m012
57765C12357l240k834j762l47N39J454L135M474M161L182L127L393K677J855K533
57750C34704L919M142L601M053N299N830N805O402O987O043M254L597L923L480
57736D02039K337K183L017L087K085J550K045K530K599K962L720M307N088O854
$$ plain form
57722 446403 455448 465925 477356 490314 505039 520689 536733 553634 571416 589051 606003 622848
57710 622848 639751 656199 672990 692455 715662 741315 768518 798562 832665 870076 910143
57699 910143 954337 1004178 1058677 1115948 1176227 1241469 1313003 1391488 1478498 1576397 1687021
57688 1687021 1811663 1951819 2108922 2283903 2477665 2690997 2923099 3170842 3429646
57679 3429646 3693419 3952875 4195679 4409875 4586751 4720833 4810005 4857607 4873219 4870088
57669 4870088 4861964 4860056 4866426 4865844 4827242 4719782 4531229 4272611 3968742 3646739 3329722
57658 3329722 3033830 2767028 2531224 2326082 2150463 2001553 1875309 1768433 1678769 1604031
57648 1604031 1541736 1490441 1449683 1418581 1395510 1379109 1368647 1363696 1364413 1371810 1386704 1408571
$$ packed form
57722D46403R045J0477J1431J2958J4725J5650J6044J6901J7782J7635J6952J6845
57710F22848J6903J6448J6791J9465K3207K5653K7203L0044L4103L7411M0067
57699I10143M4194M9841N4499N7271O0279O5242P1534P8485Q7010R7899J10624
57688A687021J24642J40156J57103J74981J93762K13332K32102K47743K58804
57679C429646K63773K59456K42804K14196J76876J34082Q9172M7602J5612l131
57669D870088q124j908O370n82l8602j07460j88553k58618l03869l22003l17017
57658C329722k95892k66802k35804k05142j75619j48910j26244j06876q9664p4738
57648A604031o2295n1295m0758l1102k3071j6401j0462m951P17P397J4894K1867
$$ plain form
57636 1408571 1436348 1469998 1510509 1558844 1615763 1682212 1758970 1846346 1944873 2055711 2179690
57625 2179690 2316762 2467051 2631404 2809928 3000728 3200642 3405610 3608943 3800348
57616 3800348 3968181 4102156 4193487 4234636 4221608 4156203 4044665 3894770 3715200 3516061
57606 3516061 3307315 3096592 2889550 2691206 2505014 2331461 2169726 2020403 1884877
57597 1884877 1762629 1651388 1549845 1458252 1376339 1302555 1235612 1175160 1120654 1071051 1025910
57586 1025910 985539 949788 917780 888849 862661 838510 815694 794523 775812 759438 744447
57575 744447 730464 717872 706833 697245 689454 683804 679657 676044 673045 671349 670705 670145 669631 670149
57561 670149 672207 675414 679544 684818 691167 698304 706474 716117 726973 738551 751174 765428 780920
$$ packed form
57636A408571K7777L3650M0511M8335N6919O6449P6758Q7376R8527J10838J23979
57625B179690J37072J50289J64353J78524J90800J99914K04968K03333J91405
57616C800348J67833J33975R1331M1149j3028o5405j11538j49895j79570j99139
57606C516061k08746k10723k07042j98344j86192j73553j61735j49323j35526
57597A884877j22248j11241j01543r1593q1913p3784o6943o0452n4506m9603m5141
57586A025910m0371l5751l2008k8931k6188k4151k2816k1171j8711j6374j4991
57575G44447j3983j2592j1039r588p791n650m147l613k999j696o44n60n14N18
57561F70149K058L207M130N274O349P137Q170R643J0856J1578J2623J4254J5492
$$ plain form
57548 780920 796930 814069 833943 857312 883823 913363 946337 982843 1023034 1068242 1120318
57537 1120318 1179852 1246361 1320101 1402197 1493067 1592459 1701269 1821654 1954797 2099799
57527 2099799 2254919 2418316 2586896 2755686 2918868 3070214 3202014 3305036 3370925 3394705
57517 3394705 3375297 3315078 3219615 3096711 2954409 2799623 2638308 2475914 2317130 2165547
57507 2165547 2023671 1892766 1772774 1663070 1563345 1473374 1392368 1319453 1254600 1198140
57497 1198140 1149536 1107485 1071048 1039771 1013005 990249 972013 959192 951588 948051 947982 951646
57485 951646 959155 970330 985551 1005551 1030322 1059277 1092546 1131140 1175930 1227515 1286897 1355034
57473 1355034 1431782 1516453 1609428 1712057 1825102 1948473 2082272 2226527 2379574 2537809
$$ packed form
57548G80920J6010J7139J9874K3369K6511K9540L2974L6506M0191M5208N2076
57537A120318N9534O6509P3740Q2096R0870R9392J08810J20385J33143J45002
57527B099799J55120J63397J68580J68790J63182J51346J31800J03022O5889K3780
57517C394705j9408o0219r5463j22904j42302j54786j61315j62394j58784j51583
57507B165547j41876j30905j19992j09704r9725q9971q1006p2915o4853n6460
57497A198140m8604m2051l6437l1277k6766k2756j8236j2821p604l537o9L664
57485I51646P509J1175J5221K0000K4771K8955L3269L8594M4790N1585N9382O8137
57473A355034P6748Q4671R2975J02629J13045J23371J33799J44255J53047J58235
$$ plain form
57463 2537809 2696723 2850594 2991095 3108064 3192519 3238390 3242006 3202188 3121710 3007255
57453 3007255 2867087 2709253 2541510 2370917 2202592 2039813 1885502 1742284 1610991
57444 1610991 1490761 1381166 1282858 1195823 1118586 1049708 988531 933861 883599 836615 793730
57433 793730 756016 723275 694826 670371 649219 629884 611385 593996 578071 563227 549299
57422 549299 536778 525609 514828 504250 495162 488396 482874 477091 470947 465127 459753 454699 450302
57409 450302 446721 443378 439931 437001 435100 433711 432220 430878 430041 429371 428661 428522 429373 430625 431735
57394 431735 433179 435530 438409 441219 444021 446852 449163 450897 453151 456689 460633 463723 466049 468464
57380 468464 471040 473238 475041 476861 478841 481120 484216 488250 492402 495899 498847 501387 502953 503370
$$ packed form
57463B537809J58914J53871J40501J16969Q4455M5871L616l9818q0478j14455
57453C007255j40168j57834j67743j70593j68325j62779j54311j43218j31293
57444A610991j20230j09595r8308q7035p7237o8878o1177n4670n0262m6984m2885
57433G93730l7714l2741k8449k4455k1152j9335j8499j7389j5925j4844j3928
57422E49299j2521j1169j0781j0578r088o766n522n783o144n820n374n054m397
57409D50302l581l343l447k930j901j389j491j342q37o70p10j39Q51J252J110
57394D31735J444K351K879K810K802K831K311J734K254L538L944L090K326K415
57380D68464K576K198J803J820J980K279L096M034M152L497K948K540J566M17
$$ plain form
57366 503370 503792 505439 508130 511162 514779 519509 524617 528653 531262 533441 536251 540145 545116 550579
57352 550579 555458 559309 563017 567727 573493 579637 585797 591861 597575 603028 608888 615375 621780 627831
57338 627831 634578 642886 651966 660573 668848 677650 686780 695358 703464 711892 720574 728629 735892 743246
57324 743246 751519 760959 771522 782719 793498 803287 812919 823653 835699 848511 861932 875935
57312 875935 889857 903127 916346 930475 945362 960319 975658 992305 1010238 1028692 1047707
57301 1047707 1067953 1089122 1109979 1130254 1151204 1174018 1198687 1224679 1251814 1280222 1310189
57290 1310189 1342129 1376076 1411292 1446998 1483214 1520236 1557693 1595001 1632226 1669404 1705280
57279 1705280 1737833 1765884 1789232 1807569 1820296 1827152 1827983 1822336 1810497 1794547 1777040 1758914
$$ packed form
57366E03370M22J647K691L032L617M730N108M036K609K179K810L894M971N463
57352E50579M879L851L708M710N766O144O160O064N714N453N860O487O405O051
57338F27831O747Q308R080Q607Q275Q802R130Q578Q106Q428Q682Q055P263P354
57324G43246Q273R440J0563J1197J0779R789R632J0734J2046J2812J3421J4003
57312H75935J3922J3270J3219J4129J4887J4957J5339J6647J7933J8454J9015
57301A047707K0246K1169K0857K0275K0950K2814K4669K5992K7135K8408K9967
57290A310189L1940L3947L5216L5706L6216L7022L7457L7308L7225L7178L5876
57279A705280L2553K8051K3348J8337J2727O856Q31n647j1839j5950j7507j8126
$$ plain form
57267 1758914 1740003 1721242 1704665 1691226 1680222 1671154 1664646 1661213 1660460 1661953 1665700 1671397 1678267
57254 1678267 1686069 1695254 1705862 1717301 1729538 1743423 1759313 1776285 1793195 1809827 1826675 1844261
57242 1844261 1862901 1882465 1902200 1921434 1940530 1960490 1981720 2003927 2027116 2051706 2077566
57231 2077566 2103795 2129530 2154337 2178085 2201306 2225421 2251487 2278869 2306157 2333105 2360403
57220 2360403 2387875 2414556 2440611 2467567 2496257 2525999 2556259 2587729 2621121 2656076 2691756
57209 2691756 2727473 2762315 2795416 2827264 2859644 2893590 2928236 2962160 2994897 3026651 3057648
57198 3057648 3088453 3119933 3152058 3183439 3212732 3239944 3265841 3290796 3314734 3337609 3359434
57187 3359434 3380338 3400898 3421779 3442802 3463085 3482418 3501705 3521709 3542136 3562382 3582433
$$ packed form
57267A758914j8911j8761j6577j3439j1004r068o508l433p53J493L747N697O870
57254A678267P802R185J0608J1439J2237J3885J5890J6972J6910J6632J6848J7586
57242A844261J8640J9564J9735J9234J9096J9960K1230K2207K3189K4590K5860
57231B077566K6229K5735K4807K3748K3221K4115K6066K7382K7288K6948K7298
57220B360403K7472K6681K6055K6956K8690K9742L0260L1470L3392L4955L5680
57209B691756L5717L4842L3101L1848L2380L3946L4646L3924L2737L1754L0997
57198C057648L0805L1480L2125L1381K9293K7212K5897K4955K3938K2875K1825
57187C359434K0904K0560K0881K1023K0283J9333J9287K0004K0427K0246K0051
$$ plain form
57176 3582433 3602625 3623172 3644292 3666190 3688647 3711223 3733992 3757339 3780843 3803254 3823799
57165 3823799 3842744 3860492 3877019 3892466 3907383 3922046 3936293 3950275 3964589 3979487 3994811
57154 3994811 4010823 4028116 4046539 4065290 4084277 4104330 4125770 4147896 4170264 4193266 4216980
57143 4216980 4240570 4263364 4285500 4306962 4326979 4344931 4360904 4374746 4385538 4392572 4396065 4396425
57131 4396425 4393725 4388336 4381262 4373490 4365949 4360380 4359079 4363338 4373181 4388836 4410970 4438854 4469707
57118 4469707 4500756 4530929 4559909 4587024 4612213 4637163 4664595 4697374 4739162 4794832 4869074
57107 4869074 4965139 5085746 5234586 5416579 5637978 5907536 6237303 6642141 7139581 7750748
57097 7750748 8500161 9413715 10517927 11842139 13420653 15291408 17491820 20053446
$$ packed form
57176C582433K0192K0547K1120K1898K2457K2576K2769K3347K3504K2411K0545
57165C823799J8945J7748J6527J5447J4917J4663J4247J3982J4314J4898J5324
57154C994811J6012J7293J8423J8751J8987K0053K1440K2126K2368K3002K3714
57143D216980K3590K2794K2136K1462K0017J7952J5973J3842J0792P034L493L60
57131D396425k700n389p074p772p541n569j301M259R843J5655K2134K7884L0853
57118D469707L1049L0173K8980K7115K5189K4950K7432L2779M1788N5670P4242
57107D869074R6065J20607J48840J81993K21399K69558L29767M04838M97440O11167
57097G750748P49413R13554J104212J324212J578514J870755K200412K561626
$$ plain form
57089 20053446 22995441 26317611 29995817 33980507 38196216 42541834 46893649 51109744
57081 51109744 55032417 58492883 61328289 63410136 64666144 65080031 64674915 63498097
57073 63498097 61615349 59109765 56080200 52639389 48910798 45021552 41092789 37231912
57065 37231912 33527772 30046944 26832101 23904888 21271318 18925347 16850958 15025994
57057 15025994 13426875 12030338 10812703 9750653 8823604 8013961 7305205 6681558 6129802
57048 6129802 5639814 5202919 4811054 4457640 4137780 3847245 3582362 3340818 3121097
57039 3121097 2920929 2737553 2569395 2416060 2276590 2149158 2032563 1926486 1830174 1742307
57029 1742307 1662268 1589950 1524231 1463349 1407010 1356359 1311466 1270654 1232850 1198760 1168987
$$ packed form
57089B0053446K941995L322170L678206L984690M215709M345618M351815M216095
57081E1109744L922673L460466K835406K081847J256008M13887m05116j176818
57073F3498097j882748k505584l029565l440811l728591l889246l928763l860877
57065C7231912l704140l480828l214843k927213k633570k345971k074389j824964
57057A5025994j599119j396537j217635j062050r27049q09643p08756o23647n51756
57048F129802m89988m36895l91865l53414l19860k90535k64883k41544k19721
57039C121097k00168j83376j68158j53335j39470j27432j16595j06077r6312q7867
57029A742307q0039p2318o5719o0882n6339n0651m4893m0812l7804l4090k9773
$$ plain form
57018 1168987 1142895 1120363 1103031 1092603 1089240 1092625 1103179 1121348 1147587 1184478 1237149 1310380
57006 1310380 1407991 1537292 1709209 1924719 2157221 2353513 2460144 2453640 2348203 2178707
56996 2178707 1979338 1774456 1580003 1405794 1255830 1129637 1025078 939793 870847 815091
56986 815091 770600 736886 713419 698725 690746 686631 681850 671115 651398 623569 590673 555586
56974 555586 520806 489044 462450 441605 426058 415383 409123 406491 407032 410927 417925 426816 436838
56961 436838 448852 464207 483419 506999 536289 571336 608016 638898 657417 660826 650019 628229
56949 628229 599885 569174 538875 510722 486283 466532 450996 438531 428865 422550 419768 420282
56937 420282 424365 432683 445349 462156 483684 511313 545955 586846 630557 670248 697138 704925
$$ packed form
57018A168987k6092k2532j7332j0428l363L385J0554J8169K6239L6891N2671P3231
57006A310380R7611J29301J71917K15510K32502J96292J06631o504j05437j69496
56996B178707j99369k04882j94453j74209j49964j26193j04559q5285o8946n5756
56986H15091m4491l3714k3467j4694p979m115m781j0735j9717k7829l2896l5087
56974E55586l4780l1762k6594k0845j5547j0675o260k632N41L895O998Q891J0022
56961D36838J2014J5355J9212K3580K9290L5047L6680L0882J8519L409j0807k1790
56949F28229k8344l0711l0299k8153k4439j9751j5536j2465r666o315k782N14
56937D20282M083Q318J2666J6807K1528K7629L4642M0891M3711L9691K6890P787
$$ plain form
56925 704925 693406 667285 632149 592489 552241 514663 481152 451527 425666 403807 385505
56914 385505 369742 356155 344948 335705 327618 320722 315595 311936 308901 306780 306726 308697 311182 313252
56900 313252 315458 318468 322211 326659 332117 338287 344311 350188 357103 366083 377355 391278 408776
56887 408776 430574 456792 486948 518927 547916 568107 576240 572798 560044 540465 517185 493883
56875 493883 473198 456016 442603 433276 427814 425680 427286 433810 445405 461026 480541 505736
56863 505736 538689 580552 632560 696497 772361 855314 935145 998652 1033917 1035192 1005560 954648
56851 954648 893225 829684 769978 718056 675376 641507 616143 599755 592330 593082 601950 620048
56839 620048 648243 686819 737083 801952 884494 986930 1110021 1249371 1390078 1507577
$$ packed form
56925G04925j1519k6121l5136l9660m0248l7578l3511k9625k5861k1859j8302
56914C85505j5763j3587j1207r243q087o896n127l659l035k121n4J971K485K070
56900C13252K206L010L743M448N458O170O024N877O915Q980J1272J3923J7498
56887D08776K1798K6218L0156L1979K8989K0191Q133l442j2754j9579k3280k3302
56875D93883k0685j7182j3413r327n462k134J606O524J1595J5621J9515K5195
56863E05736L2953M1863N2008O3937P5864Q2953P9831O3507L5265J275k9632n0912
56851I54648o1423o3541n9706n1922m2680l3869k5364j6388p425P52Q868J8098
56839F20048K8195L8576N0264O4869Q2542J02436J23091J39350J40707J17499
$$ plain form
56829 1507577 1577947 1589528 1546114 1461684 1353455 1237085 1123818 1019805 927930 849930
56819 849930 786519 736785 699045 672234 655864 649243 651824 664136 687600 723612 773461 838861
56807 838861 921119 1017949 1119694 1208879 1265999 1278965 1248600 1185396 1101935 1008807 915009
56796 915009 827855 751082 684932 628998 583593 548255 521254 501616 489917 486215 489033 497429
56784 497429 512447 535469 566799 606660 655116 708649 758039 792010 803242 790673 757820
56773 757820 710747 656599 601617 549663 502684 461735 426835 396846 370704 348352 329876
56762 329876 314529 301346 289960 280175 271578 264161 258374 253981 249889 245734 242454 240654 239521
56749 239521 238125 236562 235047 233083 230415 227663 225239 222773 220276 218579 217898 217356 216640 216514 216886
$$ packed form
56829A507577P0370J1581m3414q4430j08229j16370j13267j04013r1875p8000
56819H49930o3411m9734l7740k6811j6370o621K581J2312K3464L6012M9849O5400
56807H38861Q2258R6830J01745Q9185N7120J2966l0365o3204q3461r3128r3798
56796I15009q7154p6773o6150n5934m5405l5338k7001j9638j1699l702K818Q396
56784D97429J5018K3022L1330L9861M8456N3533M9390L3971J1232j2569l2853
56773G57820m7073n4148n4982n1954m6979m0949l4900k9989k6142k2352j8476
56762C29876j5347j3183j1386r785q597p417n787m393m092m155l280j800j133
56749B39521j396j563j515j964k668k752k424k466k497j697o81n42p16j26L72
$$ plain form
56734 216886 216188 213809 211332 210013 208823 206574 204267 203398 203342 202437 200588 198888 197611 196384 195489 195209
56718 195209 194600 192623 189842 187505 185696 183929 182696 182752 183452 183438 182439 180996 179142 176878 175258 175283
56702 175283 176188 176411 175827 175611 176262 177226 178120 179002 179727 180191 180900 182296 184039 185823 188159 191321 194443
56685 194443 196838 199323 202964 207336 211364 215018 218833 222549 225627 228386 231242 233554 234528 234488 233997
56670 233997 232702 230419 228303 227311 226447 224228 221023 218172 215599 212208 207976 203802 199696 194945 189647
56655 189647 184462 179253 173592 168169 164057 160953 157675 153978 150437 147122 143996 142041 142250 143872
56641 143872 145276 146200 147613 149780 152076 154383 157111 160101 162818 165275 167544 168944 169022 168659 168808
56626 168808 168901 167947 166384 165266 164495 163585 163369 165023 168027 170827 172901 174531 175383 175191 175074 176207
$$ packed form
56734B16886o98k379k477j319j190k249k307q69n6r05j849j700j277j227q95k80
56718A95209o09j977k781k337j809j767j233N6P00j4r99j443j854k264j620K5
56702A75283R05K23n84k16O51R64Q94Q82P25M64P09J396J743J784K336L162L122
56685A94443K395K485L641M372M028L654L815L716L078K759K856K312R74m0m91
56670B33997j295k283k116r92q64k219l205k851k573l391m232m174m106m751n298
56655A89647n185n209n661n423m112l104l278l697l541l315l126j955K09J622
56641A43872J404R24J413K167K296K307K728K990K717K457K269J400P8l63J49
56626A68808R3r54j563j118p71r10k16J654L004K800K074J630Q52j92j17J133
$$ plain form
56610 176207 177875 178729 179173 180419 181995 182481 182099 182264 183088 183621 184047 185208 186341 185827 184038 183062 183590
56593 183590 184385 184807 185532 186640 187221 187144 187256 187707 187924 188189 189294 190709 191120 190737 191098 192671 194631
56576 194631 196791 199575 202194 203146 202657 202548 203591 205072 206872 209767 213606 217362 221129 225837 230968
56561 230968 234823 237346 240439 245138 250557 255830 261027 265891 269718 272796 276015 279032 280831 282031
56547 282031 284357 287750 290349 291455 292067 292223 290447 286386 281624 277233 272696 267819 263511 260005 256366
56532 256366 252372 249017 246706 244853 243509 243364 243926 243880 243377 243708 244525 243891 241427 238859 236972 234577
56516 234577 231107 227713 225063 222413 219576 217461 215972 213759 210780 208710 208134 207717 206885 206820 207912
56501 207912 208764 208692 208876 209996 211014 211287 211626 212371 212675 212552 213275 214917 215952 216161 217275 219673 221201
$$ packed form
56610A76207J668Q54M44J246J576M86l82J65Q24N33M26J161J133n14j789r76N28
56593A83590P95M22P25J108N81p7J12M51K17K65J105J415M11l83L61J573J960
56576A94631K160K784K619R52m89j09J043J481J800K895L839L756L767M708N131
56561B30968L855K523L093M699N419N273N197M864L827L078L219L017J799J200
56547B82031K326L393K599J106O12J56j776m061m762m391m537m877m308l506l639
56532B56366l994l355k311j853j344j45N62m6n03L31Q17o34k464k568j887k395
56516B34577l470l394k650k650k837k115j489k213k979k070n76m17q32o5J092
56501B07912Q52p2J84J120J018K73L39P45L04j23P23J642J035K09J114K398J528
$$ plain form
56484 221201 220628 219696 220245 221723 223101 224909 227709 230666 233316 236744 241430 245799 248506 250397 252792
56469 252792 255533 258111 260994 264499 267963 271238 275379 280798 286351 291151 295537 299459 301942 303014
56455 303014 304066 305432 305761 304690 303812 303958 303899 302839 301786 301247 300064 297877 296305 296195 296028 294538
56439 294538 292589 290983 288854 285818 283370 282395 281507 279606 277883 277595 277999 278255 279159 281172 282830 282965
56423 282965 282506 282359 281602 279560 277543 276650 275885 274332 273119 273235 273351 271851 269276 266891 264652 262425
56407 262425 261331 261957 262920 262988 262882 263358 263427 262266 260969 260614 260469 259860 259814 261027 262185 262141 261818 262114
56389 262114 261982 260568 259234 259451 260560 261577 263229 266217 269420 271831 274363 277764 280725 282071 282846
56374 282846 284138 284878 283961 282611 282383 282693 282513 282695 284360 286698 288472 290070 292152 294078 295515 297648
$$ packed form
56484B21201n73r32N49J478J378J808K800K957K650L428M686M369K707J891K395
56469B52792K741K578K883L505L464L275M141N419N553M800M386L922K483J072
56455C03014J052J366L29j071q78J46n9j060j053n39j183k187j572j10j67j490
56439B94538j949j606k129l036k448r75q88j901j723k88M04K56R04K013J658J35
56423B82965m59j47p57k042k017q93p65j553j213J16J16j500k575k385k239k227
56407B62425j094O26R63O8j06M76O9j161j297l55j45o09m6J213J158m4l23K96
56389B62114j32j414j334K17J109J017J652K988L203K411K532L401K961J346P75
56374B82846J292P40r17j350k28L10j80J82J665K338J774J598K082J926J437K133
$$ plain form
56358 297648 300870 303337 303782 303684 304691 306079 306747 307434 308852 310008 310514 312070 315415 318336 319212 319932
56342 319932 322642 326183 328677 331083 335075 339665 343190 346600 351586 357321 362187 366919 373005 379660
56328 379660 385410 391011 397972 405936 414211 423886 435559 447045 456424 465379 476391 488517 499100
56315 499100 507808 515800 522744 527882 532294 536925 540149 540393 539300 539097 538823 536521 533245 531325 530450
56300 530450 529003 527559 527534 528044 527695 527892 530737 535200 538938 542429 547757 554791 562123 570281 580466
56285 580466 591585 602106 613416 627828 644835 662794 682647 706270 732737 760026 788912
56274 788912 821456 857236 894902 935903 982785 1035295 1092038 1154435 1225120 1304011 1390015
56263 1390015 1485095 1592442 1712025 1842043 1983271 2137734 2304479 2480923 2667012 2863688
$$ packed form
56358B97648L222K467M45r8J007J388O68O87J418J156N06J556L345K921Q76P20
56342C19932K710L541K494K406L992M590L525L410M986N735M866M732O086O655
56328C79660N750N601O961P964Q275R675J1673J1486R379Q955J1012J2126J0583
56315D99100Q708P992O944N138M412M631L224K44j093k03k74k302l276j920q75
56300E30450j447j444k5N10l49J97K845M463L738L491N328P034P332Q158J0185
56285E80466J1119J0521J1310J4412J7007J7959J9853K3623K6467K7289K8886
56274G88912L2544L5780L7666M1001M6882N2510N6743O2397P0685P8891Q6004
56263A390015R5080J07347J19583J30018J41228J54463J66745J76444J86089J96676
$$ plain form
56253 2863688 3068471 3276651 3485305 3691688 3889166 4069455 4227865 4362184 4468052
56244 4468052 4540436 4578684 4585609 4562944 4512412 4439784 4352488 4253894 4144602 4028101 3909939
56233 3909939 3792172 3673806 3555892 3440869 3327548 3212193 3094342 2976523 2858690
56224 2858690 2738207 2615141 2492512 2371429 2250882 2132048 2017817 1908187 1801060
56215 1801060 1697358 1600468 1510916 1426551 1347716 1277124 1214644 1157250 1104144 1057133 1015997
56204 1015997 978290 943607 913368 886778 861690 838866 820359 804408 787268 769535 755146
56193 755146 744536 734417 724058 715997 710545 705278 700178 697772 697994 698278 698765 702077 707978 713703
56179 713703 719325 727286 736915 745240 752998 763815 777616 790874 803215 817443 833055 846244
$$ packed form
56253B863688K04783K08180K08654K06383J97478J80289J58410J34319J05868
56244D468052P2384L8248O925k2665n0532p2628q7296r8594j09292j16501j18162
56233C909939j17767j18366j17914j15023j13321j15355j17851j17819j17833
56224B858690j20483j23066j22629j21083j20547j18834j14231j09630j07127
56215A801060j03702r6890q9552q4365p8835p0592o2480n7394n3106m7011m1136
56204A015997l7707l4683l0239k6590k5088k2824j8507j5951j7140j7733j4389
56193G55146j0610j0119j0359q061n452n267n100k406K22K84M87L312N901N725
56179G13703N622P961R629Q325P758J0817J3801J3258J2341J4228J5612J3189
$$ plain form
56167 846244 856596 867324 878566 886943 892170 897491 903070 905598 905129 905640 908043 909255 909019 911040
56153 911040 916420 922550 929463 940643 956597 974191 993276 1017386 1047117 1079743 1116293 1161931
56141 1161931 1218239 1282253 1354388 1440254 1543144 1661464 1794288 1941807 2098495 2253106
56131 2253106 2397399 2528758 2644232 2740493 2821462 2897890 2976612 3056176 3133142 3204158 3260677
56120 3260677 3291178 3292291 3271096 3234970 3186746 3130440 3071566 3008303 2930764 2832629 2716474
56109 2716474 2586104 2442743 2291837 2144721 2009402 1886767 1778090 1687765 1615723 1555683
56099 1555683 1504262 1463792 1433470 1406536 1379443 1355296 1335142 1314630 1292424 1272921 1257272
56088 1257272 1240708 1222080 1206766 1196636 1186613 1174814 1166411 1163492 1160850 1156023 1153730 1156051
$$ packed form
56167H46244J0352J0728J1242Q377N227N321N579K528m69N11K403J212k36K021
56153I11040N380O130O913J1180J5954J7594J9085K4110K9731L2626L6550M5638
56141A161931N6308O4014P2135Q5866J02890J18320J32824J47519J56688J54611
56131B253106J44293J31359J15474R6261Q0969P6428P8722P9564P6966P1016N6519
56120C260677L0501J113k1195l6126m8224n6306n8874o3263p7539r8135j16155
56109B716474j30370j43361j50906j47116j35319j22635j08677r0325p2042o0040
56099A555683n1421m0470l0322k6934k7093k4147k0154k0512k2206j9503j5649
56088A257272j6564j8628j5314j0130j0023j1799q403k919k642m827k293K321
$$ plain form
56076 1156051 1158080 1157840 1160573 1168518 1176335 1181384 1188552 1200104 1210993 1219153 1230122 1246277 1261851
56063 1261851 1273811 1287191 1304452 1320376 1332902 1347970 1367965 1386607 1401083 1417707 1439513
56052 1439513 1460050 1475933 1493582 1516673 1538993 1556930 1576911 1602963 1629024 1651296 1676079
56041 1676079 1707418 1739140 1767145 1797252 1832790 1867039 1896309 1927783 1965939 2004271 2039000
56030 2039000 2077458 2123924 2170946 2214024 2260762 2315926 2371855 2423612 2478760 2541793 2604185
56019 2604185 2660792 2720482 2789163 2858152 2921244 2987007 3061742 3136885 3206333 3279429 3363274
56008 3363274 3449363 3531693 3620479 3723347 3830863 3935689 4047538 4173595 4303403 4429655
55998 4429655 4564334 4717102 4877882 5038561 5210765 5403365 5604330 5804815 6018756
$$ packed form
56076A156051K029k40K733P945P817N049P168J1552J0889Q160J0969J6155J5574
56063A261851J1960J3380J7261J5924J2526J5068J9995J8642J4476J6624K1806
56052A439513K0537J5883J7649K3091K2320J7937J9981K6052K6061K2272K4783
56041A676079L1339L1722K8005L0107L5538L4249K9270L1474L8156L8332L4729
56030B039000L8458M6466M7022M3078M6738N5164N5929N1757N5148O3033O2392
56019B604185N6607N9690O8681O8989O3092O5763P4735P5143O9448P3096Q3845
56008C363274Q6089Q2330Q8786J02868J07516J04826J11849J26057J29808J26252
55998D429655J34679J52768J60780J60679J72204J92600K00965K00485K13941
$$ plain form
55989 6018756 6257770 6510027 6766002 7040765 7347366 7673262 8007796 8366940 8764795
55980 8764795 9187982 9626209 10099989 10628782 11201534 11810016 12479835 13234997 14065345
55971 14065345 14965460 15970830 17117088 18401935 19830403 21458243 23345637 25513358
55963 25513358 27996715 30895319 34311466 38288607 42871536 48171159 54305750 61354969
55955 61354969 69467563 78956955 90218136 103663158 119868096 139680550 164053743
55948 164053743 193923178 230296363 273739711 322544693 370879717 409569998 430106640
55941 430106640 428933689 408502783 374835710 334324859 292032633 251431516 214562408
55934 214562408 182266461 154610510 131320656 111950813 95911110 82596178 71527260
$$ packed form
55989F018756K39014K52257K55975K74763L06601L25896L34534L59144L97855
55980H764795M23187M38227M73780N28793N72752O08482O69819P55162Q30348
55971A4065345R00115J005370J146258J284847J428468J627840J887394K167721
55963B5513358K483357K898604L416147L977141M582929N299623O134591P049219
55955F1354969Q112594R489392J1261181J3445022J6204938J9812454K4373193
55948A64053743K9869435L6373185M3443348M8804982M8335024L8690281K0536642
55941D30106640j172951k0430906l3667073m0510851m2292226m0601117l6869108
55934B14562408l2295947k7655951k3289854j9369843j6039703j3314932j1068918
$$ plain form
55927 71527260 62328452 54638525 48137120 42611724 37917234 33898980 30413554 27383526
55919 27383526 24764691 22485080 20467382 18680018 17112771 15726597 14474068 13344542
55911 13344542 12343703 11449698 10630568 9884018 9220256 8624198 8071423 7563477 7112112
55902 7112112 6705342 6322390 5966164 5648950 5361180 5085017 4824402 4592007 4380080
55893 4380080 4172771 3974419 3797906 3637104 3477637 3323548 3187290 3063914 2940319
55884 2940319 2820144 2715216 2621553 2527197 2435007 2355130 2283266 2208317 2133621 2069444 2012052
55873 2012052 1950848 1889043 1837207 1793099 1747111 1701032 1662717 1628761 1590865 1553258 1526072
55862 1526072 1507488 1489399 1473982 1467048 1461058 1442450 1410819 1374665 1334067 1284440 1231906 1187590
$$ packed form
55927G1527260r198808p689927o501405n525396m694490m018254l485426l030028
55919B7383526k618835k279611k017698j787364j567247j386174j252529j129526
55911A3344542j000839q94005q19130p46550o63762n96058n52775n07946m51365
55902G112112m06770l82952l56226l17214k87770k76163k60615k32395k11927
55893D380080k07309j98352j76513j60802j59467j54089j36258j23376j23595
55884B940319j20175j04928r3663r4356r2190p9877p1864p4949p4696o4177n7392
55873B012052o1204o1805n1836m4108m5988m6079l8315l3956l7896l7607k7186
55862A526072j8584j8089j5417o934n990j8608l1631l6154m0598m9627n2534m4316
$$ plain form
55850 1187590 1150631 1112741 1075221 1045724 1022539 998090 974402 959592 952213 943882 934318 929292
55838 929292 926748 919305 907866 898955 891222 878017 860610 845581 831737 812702 790025 770856
55826 770856 755018 736858 717495 702702 690850 675247 656373 640002 625526 608033 589606
55815 589606 576604 567785 556889 544923 538125 535810 532026 527416 527685 531905 534079 534849 540036 548752
55801 548752 554489 557050 561919 568503 570329 566573 562416 558192 549001 535128 522344 511630 498614
55788 498614 483379 470997 462164 452806 443003 437029 434671 431755 428898 430236 433652 431822 423133 412422
55774 412422 401073 385885 367902 352791 341687 330555 319139 311757 308658 305316 300827 298384
55762 298384 296987 291476 281593 272539 265741 257463 247330 239735 235619 230930 224400 219082 215245 209518
$$ packed form
55850A187590l6959l7890l7520k9497k3185k4449k3688j4810p379q331r564n026
55838I29292k544p443j1439q911p733j3205j7407j5029j3844j9035k2677j9169
55826G70856j5838j8160j9363j4793j1852j5603j8874j6371j4476j7493j8427
55815E89606j3002q819j0896j1966o798k315l784m610K69M220K174P70N187Q716
55801E48752N737K561M869O584J826l756m157m224r191j3873j2784j0714j3016
55788D98614j5235j2382q833r358r803n974k358k916k857J338L416j830q689j0711
55774D12422j1349j5188j7983j5111j1104j1132j1416p382l099l342m489k443
55762B98384j397n511r883r054o798q278j0133p595m116m689o530n318l837n727
$$ plain form
55748 209518 202003 196650 193705 189305 183177 179043 176779 172077 164768 159641 157988 156105 153207 152955
55734 152955 155863 157956 158374 160743 165562 168715 169105 170294 172984 173243 169983 167000 165676 162731 157086
55719 157086 152047 148755 144323 138356 134614 134210 133701 131800 131460 133504 134806 134743 136875 142233 147431
55704 147431 151426 157555 166574 174096 177406 178784 179883 179008 176312 175502 177745 179629 179557 180479 183955
55689 183955 187303 189049 191531 195580 198160 197754 196727 196123 193665 189289 187031 188745 191309 192535 194417
55674 194417 197940 200177 199517 198685 199648 200413 199672 199751 202094 204424 205157 206120 208318 209578 209011 209354 212303
55657 212303 215769 218140 220868 224557 227036 227675 229077 232069 233532 231627 228655 226345 222902 217273
55643 217273 211666 207130 201131 192378 183658 177102 170825 163093 155609 149798 143984 137065 130973 126645
$$ packed form
55748B09518p515n353k945m400o128m134k264m702p309n127j653j883k898k52
55734A52955K908K093M18K369M819L153L90J189K690K59l260k983j324k945n645
55719A57086n039l292m432n967l742m04n09j901l40K044J302o3K132N358N198
55704A47431L995O129R019P522L310J378J099q75k696q10K243J884p2R22L476
55689A83955L348J746K482M049K580m06j027o04k458m376k258J714K564J226J882
55674A94417L523K237o60q32R63P65p41P9K343K330P33R63K198J260n67L43K949
55657B12303L466K371K728L689K479O39J402K992J463j905k972k310l443n629
55643B17273n607m536n999q753q720o556o277p732p484n811n814o919o092m328
$$ plain form
55629 126645 121623 114466 107628 103110 99174 94181 89740 87110 84324 79968 76117 74539 73490 71205
55615 71205 69062 68396 67622 65431 63504 63240 62991 61304 59668 59470 59403 58392 57839 58492 58523 57087 56322
55598 56322 57386 58086 56995 56184 57221 58149 57304 56499 57473 58673 58618 58944 60987 62762 62521 62090 63405
55581 63405 64920 64723 64196 65317 67209 68619 70900 75272 79938 83245 87108 94036 103173 112402 121955
55566 121955 132839 143946 153658 162077 169045 172450 171197 167376 162827 156195 146136 134696 124528
55553 124528 115377 106249 98432 93192 88930 83827 79084 76470 74902 72505 69999 69067 69351 69826 71113
55538 71113 73734 76130 77064 77894 80025 82416 84032 86192 89831 93064 94338 95343 97834 100228 100571
55523 100571 100338 101853 104190 105079 104777 104593 103466 99447 93000 85749 77647 68360 59634 53151 47745
$$ packed form
55629A26645n022p157o838m518l936m993m441k630k786m356l851j578j049k285
55615G1205k143o66p74k191j927k64k49j687j636j98o7j011n53O53L1j436p65
55598E6322J064P00j091q11J037R28q45q05R74J200n5L26K043J775k41m31J315
55581F3405J515j97n27J121J892J410K281M372M666L307L863O928R137R229R553
55566A21955J0884J1107R712Q419O968L405j253l821m549o632j0059j1440j0168
55553A24528r151r128p817n240m262n103m743k614j568k397k506r32K84M75J287
55538G1113K621K396R34Q30K131K391J616K160L639L233J274J005K491K394L43
55523A00571k33J515K337Q89l02j84j127m019o447p251q102r287q726o483n406
$$ plain form
55508 47745 41695 36045 32683 30989 29406 28469 29149 29998 29108 27243 25987 24547 21572 18378 17009
55493 17009 16606 15045 12749 11545 11021 9291 6381 3812 1837 -122 -1492 -1724 -2157 -3979 -5684 -5318
55477 -5318 -3854 -3477 -3965 -3727 -3039 -3195 -3676 -3118 -2039 -1756 -1879 -1553 -1810 -3714 -5628 -5346 -3758 -3302
55459 -3302 -3979 -4065 -3597 -3963 -4918 -5137 -4929 -5438 -5963 -4974 -3030 -1860 -1341 -86 1787 3096 3929 4951
55441 4951 5423 4576 3775 4553 5627 4770 2534 1198 1054 769 437 1200 2681 3805 5346 8604 12368
55424 12368 14282 14508 15016 15951 15829 14704 13985 13567 12178 10190 9159 8970 8342 7774 9050 12066 14903
55407 14903 16805 18441 19612 19424 18413 17897 17536 16014 13704 12179 11640 11287 11509 13056 14776 15021
55391 15021 14588 15416 17063 17526 16961 17427 19329 21170 22565 24401 26262 26753 26178 25895 25243 22244 17280
$$ packed form
55508D7745o050n650l362j694j583r37O80Q49q90j865j256j440k975l194j369
55493A7009m03j561k296j204n24j730k910k569A837a22j370k32m33j822j705L66
55477e318J464L77m88K38O88j56m81N58J079K83j23L26k57j904j914K82J588M56
55459c302o77q6M68l66r55k19K08n09n25R89J944J170N19h6A787J309Q33J022
55441D951M72q47q01P78J074q57k236A198j44k85l32P63J481J124J541L258L764
55424A2368J914K26N08R35j22j125p19m18j389j988j031j89o28n68J276L016K837
55407A4903J902J636J171j88j011n16l61j522k310j525n39l53K22J547J720K45
55391A5021m33Q28J647M63n65M66J902J841J395J836J861M91n75k83o52k999m964
$$ plain form
55374 17280 12963 10260 7790 5034 3088 1942 76 -2692 -4750 -5576 -6494 -8065 -9196 -9289 -8950 -8295
55358 -8295 -6798 -5012 -4155 -3892 -2790 -951 181 547 1453 2874 3335 2633 2129 2164 1689 655 254 534
55340 534 141 -1270 -2557 -3156 -3487 -3308 -2020 -426 131 275 1701 4077 5452 5629 6270 7656 8233
55323 8233 7612 7203 7522 7545 7034 6886 6914 6058 4934 5358 7004 7521 6349 5415 5462 4838 2847 1249 1266
55304 1266 1786 1774 1969 2914 3576 3197 2515 2128 1583 842 749 1312 1533 1460 2251 3698 4042 2981 2447 3546
55284 3546 4931 5136 4462 3681 2930 2643 3560 5048 5401 4444 3786 4015 3903 3000 2615 3405 4304 4704 5406
55265 5406 6528 6821 6075 5929 7185 8487 8766 8883 9728 10765 11623 13057 15119 16275 15588 14101 13032
55248 13032 12379 12175 13149 15033 16144 15768 15155 15143 14724 13116 11412 10854 11084 11231 11230 11108 10538 9944 10403
$$ packed form
55374A7280m317k703k470k756j946j146G6b692k058q26r18j571j131r3L39O55
55358h295J497J786Q57K63J102i51A81L66R06J421M61p02n04L5m75F55B54K80
55340E34A41a270j287n99l31J79J288d26A31J44J426K376J375J77O41J386N77
55323H233o21m09L19K3n11j48K8q56j124M24J646N17j172r34M7o24j991A249J7
55304A266N20j2J95R45O62l79o82l87n45p41r3N63K21p3P91J447L44j061n34J099
55284C546J385K05o74p81p51k87R17J488L53r57o58K29j12r03l85P90Q99M00P02
55265E406J122K93p46j46J256J302K79J17Q45J037Q58J434K062J156o87j487j069
55248A3032o53k04R74J884J111l76o13j2m19j608j704n58K30J47jj22n70n94M59
$$ plain form
55229 10403 11672 12107 11287 10789 11512 12315 12333 12497 13438 13925 12868 11156 10081 9550 9203 9694 11406 13277
55211 13277 14248 14674 15204 15632 15873 16644 18153 19490 20315 21621 23847 25794 26535 26891 27828 28817 28994
55194 28994 28616 28219 27534 26320 25160 24531 24133 23816 23941 24322 24181 23651 23746 24379 24199 22936 21929 21616
55176 21616 20614 18235 15784 14176 12378 9598 7102 6249 6410 6267 5709 5050 3944 2497 1997 3088
55160 3088 4569 5165 5154 5106 4621 3664 3560 5104 6983 7480 6633 5540 4822 4901 6437 9175 11569 12631
55142 12631 12930 12906 11825 9527 7538 7115 7639 8174 9048 10586 11856 12149 12280 13033 13710 13608 13509 14313
55124 14313 15592 16901 18955 22009 24536 25259 25237 26280 28403 30341 31426 31564 30528 28818 28051 29086
55108 29086 30803 31948 32868 34159 35118 35124 35131 36132 37403 37917 38195 39044 39652 38796 36974 35661 35329 35676
$$ packed form
55229A0403J269M35q20m98P23Q03J8J64R41M87j057j712j075n31l47M91J712J871
55211A3277R71M26N30M28K41P71J509J337Q25J306K226J947P41L56R37R89J77
55194B8994l78l97o85j214j160o29l98l17J25L81j41n30R5O33j80j263j007l13
55176B1616j002k379k451j608j798k780k496q53J61j43n58o59j106j447n00J091
55160C088J481N96j1m8m85r57j04J544J879M97q47j093p18P9J536K738K394J062
55142A2631K99k4j081k298j989m23N24N35Q74J538J270K93J31P53O77j02r9Q04
55124A4313J279J309K054L054K527P23k2J043K123J938J085J38j036j710p67J035
55108B9086J717J145R20J291R59OPJ001J271N14K78Q49O08q56j822j313l32L47
$$ plain form
55090 35676 36811 38638 40102 40582 41029 42331 43665 43946 43649 43595 43200 41736 40179 39981 40933 41974 43105
55073 43105 44732 46138 46521 46700 47976 50008 51517 52293 52813 52748 51613 50166 49424 49010 48083 47063 46734
55056 46734 46485 45274 43599 42685 42461 42102 41889 42646 43895 44392 44026 43461 42495 40589 38502 37513 37414 36992
55038 36992 36176 35942 36467 37088 37768 38901 39913 39782 38838 38421 38822 39002 38352 37369 36686 36607 37486 39436
55020 39436 41786 43752 45330 46731 47579 47649 47668 48269 48936 49074 49251 50077 50823 50624 50229 50971 52663 54017
55002 54017 54470 54170 52926 50762 48845 48253 48386 48041 47358 47161 47175 46575 45684 45461 45855 46302 47150 48925
54984 48925 50808 51587 51539 51732 52165 52324 52808 54368 56024 56165 55128 54640 55155 55774 56453 58083 60526
54967 60526 62623 64159 65979 68213 70294 72602 76176 80761 85042 88808 93150 98535 104577 111707
$$ packed form
55090C5676J135J827J464M80M47J302J334K81k97n4l95j464j557j98R52J041J131
55073D3105J627J406L83J79J276K032J509P76N20o5j135j447p42m14r27j020l29
55056D6734k49j211j675r14k24l59k13P57J249M97l66n65r66j906k087r89r9m22
55038C6992q16k34N25O21O80J133J012j31r44m17M01J80o50r83o83p9Q79J950
55020C9436K350J966J578J401Q48P0J9O01O67J38J77Q26P46j99l95P42J692J354
55002E4017M53l00j244k164j917n92J33l45o83j97J4o00q91k23L94M47Q48J775
54984D8925J883P79m8J93M33J59M84J560J656J41j037m88N15O19O79J630K443
54967F0526K097J536J820K234K081K308L574M585M281L766M342N385O042P130
$$ plain form
54953 111707 121160 133115 146550 161116 177470 195596 214351 232633 249380 262529 269870 271088
54941 271088 267356 259054 245813 228835 210950 193885 177288 160870 145649 132524 121340 111979
54929 111979 104818 99497 94727 89965 85982 83264 81174 79187 77730 77282 77725 78960 81062 83598 85962
54914 85962 88648 92971 99294 106710 114709 123922 134995 147930 162765 179560 197331 214123 228496
54901 228496 240018 248144 251820 250451 244319 233915 219879 203567 186624 169932 153841 139181
54889 139181 126810 116383 106863 98114 90713 84447 78465 72804 68240 64760 61709 59302 58329 58346
54875 58346 57945 56911 56335 56388 55851 54297 52974 52885 53455 53728 53524 52888 51694 50355 49698 49712 49559 49147
54857 49147 49361 50396 51232 51240 51102 51654 52875 54325 55467 55401 53529 50708 48527 47235 45672 43321 40969
$$ packed form
54953A11707R453J1955J3435J4566J6354J8126J8755J8282J6747J3149P341J218
54941B71088l732q302j3241j6978j7885j7065j6597j6418j5221j3125j1184r361
54929A11979p161n321m770m762l983k718k090j987j457m48M43J235K102K536K364
54914H5962K686M323O323P416P999R213J1073J2935J4835J6795J7771J6792J4373
54901B28496J1522Q126L676j369o132j0404j4036j6312j6943j6692j6091j4660
54889A39181j2371j0427r520q749p401o266n982n661m564l480l051k407r73J7
54875E8346m01j034n76N3n37j554j323q9N70K73k04o36j194j339o57J4j53m12
54857D9147K14J035Q36Qj38N52J221J450J142o6j872k821k181j292j563k351k352
$$ plain form
54840 40969 39102 37256 35353 34146 33795 33444 32756 32530 33204 34101 34733 35597 37033 38465 39409 40188 41164
54823 41164 42262 43623 45584 47648 48679 48604 48768 50122 52102 53746 54850 55660 56424 57706 60138 63575
54807 63575 67302 71145 75361 79564 83137 86743 91987 99398 108148 117906 129418 143026 158178 174770
54793 174770 193282 212993 231585 247099 259006 266901 269771 267246 260212 249606 235881 220218
54781 220218 204802 191102 178979 167961 158178 149647 141996 135399 130541 127225 124387 121791 120229
54768 120229 119705 119087 118079 117881 119273 121664 124652 128847 134358 140182 145989 153043 162481 174148 187866
54753 187866 204269 223491 244535 266788 290579 315301 338598 358340 373908 384675 389091 386470
54741 386470 378041 364983 347091 324693 300227 276314 253616 232014 212377 195532 180747 166989
$$ packed form
54840D0969j867j846j903j207l51l51o88k26O74Q97O32Q64J436J432R44P79R76
54823D1164J098J361J961K064J031p5J64J354J980J644J104Q10P64J282K432L437
54807F3575L727L843M216M203L573L606N244P411Q750R758J1512J3608J5152J6592
54793A74770J8512J9711J8592J5514J1907P895K870k525p034j0606j3725j5663
54781B20218j5416j3700j2123j1018r783q531p651o597m858l316k838k596j562
54768A20229n24o18j008j98J392K391K988M195N511N824N807P054R438J1667J3718
54753A87866J6403J9222K1044K2253K3791K4722K3297J9742J5568J0767M416k621
54741C86470q429j3058j7892k2398k4466k3913k2698k1602j9637j6845j4785j3758
$$ plain form
54729 166989 154666 144582 136170 128301 120932 114507 108685 103139 98664 95957 94129 91835 89105 86666
54715 86666 84410 82009 80195 79774 80063 79866 79400 79694 80623 81100 80846 80488 80238 79823 79512 79886 80778 81521
54697 81521 82038 82659 83209 83287 83099 83051 82911 82314 81706 81793 82412 82879 83089 83420 83915 84422 85115 86076 86799 86908
54677 86908 86854 87178 87665 88042 88876 90890 93920 97380 101182 105373 109506 113273 117175 121708 126485 130982
54661 130982 135371 139737 143197 144927 145518 146306 147884 150153 153131 156677 160015 162657 165365 169222 174236
54646 174236 179823 186173 194097 203899 215348 228333 242811 258515 275483 294282 314974 336432
54634 336432 357242 376349 391981 401135 401524 393544 379247 360142 337245 312451 288226 266022
54622 266022 246034 228175 212227 197513 183637 171356 161770 154931 150047 146588 144248 142326 140235
$$ packed form
54729A66989j2323j0084q412p869p369o425n822n546m475k707j828k294k730k439
54715H6666k256k401j814m21K89j97m66K94R29M77k54l58k50m15l11L74Q92P43
54697H1521N17O21N50P8j88m8j40n97o08Q7O19M67K10L31M95N07O93R61P23J09
54677H6908n4L24M87L77Q34K014L030L460L802M191M133L767L902M533M777M497
54661A30982M389M366L460J730N91P88J578K269K978L546L338K642K708L857N014
54646A74236N587O350P924R802J1449J2985J4478J5704J6968J8799K0692K1458
54634C36432K0810J9107J5632R154L89p980j4297j9105k2897k4794k4225k2204
54622B66022j9988j7859j5948j4714j3876j2281r586o839m884l459k340j922k091
$$ plain form
54609 140235 138320 137256 136989 136985 136987 136708 135443 132894 129819 126983 124144 120913 117785 115241 112620 109126
54593 109126 105248 102011 99495 97269 95512 94361 92851 89970 86218 82761 79703 76643 74257 73500
54579 73500 73625 72763 70418 67814 65870 64356 63010 61972 60979 59518 57963 57289 57571 57873 57684 57343
54563 57343 57088 56804 56746 57329 58246 58798 59098 59868 61223 62703 64287 66171 67788 68370 68380 68995 70228 71024
54545 71024 71324 72473 75243 78836 82311 85725 89263 92422 94873 97345 100957 106134 112598 119888 127573
54530 127573 135352 143249 151450 159985 168846 178111 187406 195430 200607 202149 200153 195154 188112 180211
54516 180211 171829 162223 151038 139555 129483 121123 113827 107598 102854 98968 94634 89618 84899
54503 84899 81093 78030 75752 74601 74184 73546 72567 72047 72278 72666 72916 73408 74136 74366 73684 72543 71538
$$ packed form
54609A40235j915j064k67mKk79j265k549l075k836k839l231l128k544k621l494
54593A09126l878l237k516k226j757j151j510k881l752l457l058l060k386p57
54579G3500J25q62k345k604j944j514j346j038r93j461j555o74K82L02j89l41
54563E7343k55k84n8N83R17N52L00P70J355J480J584J884J617N82J0O15J233P96
54545G1024L00J149K770L593L475L414L538L159K451K472L612N177O464P290P685
54530A27573P779P897Q201Q535Q861R265R295Q024N177J542j996m999p042p901
54516A80211q382r606j1185j1483j0072q360p296o229m744l886m334n016m719
54503H4899l806l063k278j151m17o38r79n20K31L88K50M92P28K30o82j141j005
$$ plain form
54486 71538 70986 71287 72728 74755 76283 76961 77367 77935 78558 79264 80368 81808 83150 84348 85697 87016
54470 87016 87706 87667 87359 86996 86484 86062 86113 86331 85948 84735 83020 80962 78737 77158 76986 77671 77881 77241
54452 77241 76543 76283 76063 75450 74407 72917 71200 70143 70351 70918 70372 68813 67809 68119 68869 69096 68774
54435 68774 68024 66630 64774 63218 62341 61913 61910 62527 63340 63627 63640 64292 65463 65943 65359 64818 65252 66403
54417 66403 67908 70080 72965 75763 77862 79508 80979 82048 82767 83740 85139 86388 87338 88764 91172
54402 91172 94109 97154 100576 104452 108143 111320 114575 118351 122130 125400 128569 132061 135168 136592
54388 136592 135705 132814 128701 124383 120714 117673 114501 110870 107373 104588 102308 100072 97808 95544
54374 95544 93126 90649 88624 87271 86163 84850 83372 81936 80618 79561 78924 78456 77673 76553 75579
$$ packed form
54486G1538n52L01J441K027J528O78M06N68O23P06J104J440J342J198J349J319
54470H7016O90l9l08l63n12m22N1K18l83j213j715k058k225j579j72O85K10o40
54452G7241o98k60k20o13j043j490j717j057K08N67n46j559j004L10P50K27l22
54435F8774p50j394j856j556q77m28lO17Q13K87J3O52J171M80n84n41M34J151
54417F6403J505K172K885K798K099J646J471J069P19R73J399J249R50J426K408
54402I1172K937L045L422L876L691L177L255L776L779L270L169L492L107J424
54388A36592q87k891m113m318l669l041l172l631l497k785k280k236k264k264
54374I5544k418k477k025j353j108j313j478j436j318j057o37m68p83j120r74
$$ plain form
54359 75579 75090 75145 75889 77275 78660 79611 80878 83462 86766 89062 89942 90961 93454 96962 100381 103425
54343 103425 106263 108732 110735 112664 114774 116743 118296 119630 120835 121601 121848 121857 121533 120340 118315 116274
54327 116274 114694 113220 111489 109477 106799 102821 97945 93632 90525 87576 83731 79496 76074 73737
54313 73737 71916 70306 69124 68579 68523 68338 67129 64662 62068 60775 60716 60570 59724 58763 57962 56799 55339
54296 55339 54569 54724 54688 53842 53128 53449 54330 55044 55760 56538 56469 55115 53621 53108 52903 51795 50217 49636
54278 49636 50332 51255 51836 52579 53915 55514 56800 57435 57424 57265 57695 58759 59590 59632 59485 59948 60897 61832
54260 61832 62881 64347 65810 66534 66435 65888 65043 64059 63499 63672 64016 63945 63919 64812 66545 68145 68929 68909 68348
54241 68348 67603 67220 67502 68130 68609 68814 68708 68053 66988 66433 67216 69097 71151 72796 73928 74464 74310
$$ packed form
54359G5579m89N5P44J386J385R51J267K584L304K296Q80J019K493L508L419L044
54343A03425K838K469K003J929K110J969J553J334J205P66K47Rl24j193k025k041
54327A16274j580j474j731k012k678l978m876m313l107k949l845m235l422k337
54313G3737j821j610j182n45n6j85j209k467k594j293n9j46q46r61q01j163j460
54296E5339p70J55l6q46p14L21Q81P14P16P78o9j354j494n13k05j108j578n81
54278D9636O96R23N81P43J336J599J286O35j1j59M30J064Q31M2j47M63R49R35
54260F1832J049J466J463P24r9n47q45r84n60J73L44p1k6Q93J733J600P84k0n61
54241F8348p45l83K82O28M79K05j06o55j065n55P83J881K054J645J132N36j54
$$ plain form
54224 74310 73561 72363 70871 69552 69005 69198 69481 69613 70004 70628 70659 69776 68893 68857 69244 69315 69362 70106 71363
54205 71363 72313 72713 72911 73004 72838 72595 72611 72807 72826 72440 71402 69442 66934 64990 64215 63941 63366 62797 62933
54186 62933 63465 63372 62333 61004 60093 59849 60173 60628 60585 59947 59424 59615 60218 60544 60393 59894 59123 58430 58557
54167 58557 59742 61186 62038 62391 62670 62639 61821 60456 59300 58751 58716 58924 58922 58285 57298 56829 57062 57112 56437
54148 56437 55740 55778 56137 56019 55501 55093 54786 54426 54382 54927 55596 55970 56355 56793 56361 54552 52539 51771 51975
54129 51975 51849 51130 50602 50545 50571 50648 50881 50518 48593 45520 42883 41632 41503 42000 42780 43168 42522 41266
54111 41266 40618 41291 43156 45931 49199 51940 53202 53283 53371 53973 54489 54287 53429 52426 51914 52367 53524
54094 53524 54363 54252 53663 53106 52204 50670 49305 48789 48270 46715 45008 44967 46592 48106 48638 49070 50098
$$ packed form
54224G4310p49j198j492j319n47J93K83J32L91O24L1q83q83l6L87P1M7P44J257
54205G1363R50M00J98R3j66k43J6J96J9l86j038j960k508j944p75k74n75n69J36
54186F2933N32r3j039j329r11k44L24M55m3o38n23J91O03L26j51m99p71o93J27
54167E8557J185J444Q52L53K79l1q18j365j156n49l5K08ko37r87m69K33N0o75
54148E6437o97L8L59j18n18m08l07l60m4N45O69L74L85M38m32j809k013p68K04
54129E1975j26p19n28n7K6P7K33l63j925l073k637j251j29M97P80L88o46j256
54111D1266o48O73J865K775L268K741J262Q1Q8O02N16k02q58j003n12M53J157
54094E3524Q39j11n89n57r02j534j365n16n19j555j707m1J625J514N32M32J028
$$ plain form
54077 50098 51255 52251 53598 55300 56405 56506 56517 57259 58385 59332 60261 61333 61984 61754 61121 60791 60706 60429
54059 60429 60058 60191 61249 63173 65528 67723 69404 70689 71759 72380 72333 72114 72526 73662 75006 76470
54043 76470 78554 81399 84440 87181 89729 92502 95873 100117 105134 110283 115002 119481 124220 129243
54029 129243 134307 139545 145117 150553 155272 159478 163685 167745 171356 175032 179341 183443 185822 186468
54015 186468 186949 188216 189703 190793 191711 192493 192326 190635 187881 184755 181416 177949 174650 171370 167417
54000 167417 162579 157557 153026 149070 145800 143587 142161 140351 137405 133965 131201 129495 128411 127401
53986 127401 126124 124561 123166 122505 122480 122421 122050 121814 122134 122913 123882 124781 125089 124393 123224 122766 123492 124747
53968 124747 125879 126972 128225 129382 130170 130662 130911 130830 130652 130818 131219 131238 130660 129803 128678 126975 125082
$$ packed form
54077E0098J157R96J347J702J105J01J1P42J126R47R29J072O51k30o33l30q5k77
54059F0429l71J33J058J924K355K195J681J285J070O21m7k19M12J136J344J464
54043G6470K084K845L041K741K548K773L371M244N017N149M719M479M739N023
54029A29243N064N238N572N436M719M206M207M060L611L676M309M102K379O46
54015A86468M81J267J487J090R18P82j67j691k754l126l339l467l299l280l953
54000A67417m838n022m531l956l270k213j426j810k946l440k764j706j084j010
53986A27401j277j563j395o61k5n9l71k36L20P79R69Q99L08o96j169m58P26J255
53968A24747J132J093J253J157P88M92K49q1j78J66M01J9n78q57j125j703j893
$$ plain form
53951 125082 124046 124144 124466 124385 124387 124877 125257 125012 124849 125752 127577 129619 132104 136023 141569 147591 152725
53934 152725 156550 159565 162378 164986 166770 167321 167195 167401 168069 168225 167140 165418 164370 164715 166248 168414
53918 168414 170835 173443 176449 180104 184395 189157 194396 200224 206543 213203 220366 228107 235702 241980
53904 241980 246579 250289 253912 257274 259522 259992 258685 256360 254277 253286 253024 252390 250875 248927 247027
53889 247027 245083 242800 240016 236459 231746 225887 219339 212487 205456 198447 191765 185577 180065 175650
53875 175650 172346 169155 164984 160157 156063 153258 150918 148350 145953 144197 142608 140429 137614 134592
53861 134592 131517 128287 124953 121721 118738 116076 113637 111099 108319 105688 103582 101658 99393 97164
53847 97164 95927 95801 95796 95095 93790 92283 90789 89592 89010 88919 88947 89140 89698 90173 89909 89184 88866 88952 88618
$$ packed form
53951A25082j036R8L22q1KM90L80k45j63R03J825K042K485L919N546O022N134
53934A52725L825L015K813K608J784N51j26K06O68J56j085j722j048L45J533K166
53918A68414K421K608L006L655M291M762N239N828O319O660P163P741P595O278
53904B41980M599L710L623L362K248M70j307k325k083r91k62o34j515j948j900
53889B47027j944k283k784l557m713n859o548o852p031p009o682o188n512m415
53875A75650l304l191m171m827m094k805k340k568k397j756j589k179k815l022
53861A34592l075l230l334l232k983k662k439k538k780k631k106j924k265k229
53847I7164j237j26np01j305j507j494j197n82r1K8J93N58M75k64p25l18Q6l34
$$ plain form
53828 88618 87823 87588 88399 89577 90520 91332 91872 91533 90558 90240 91106 92072 92206 92150 92905 94209 95132 95509 95875
53809 95875 96629 97966 100012 102338 104055 105021 106286 108780 112301 116250 120467 124756 128578 131985 135879
53794 135879 140590 145146 148834 152474 157110 162267 166652 169885 172462 174601 176293 177947 179878 181513
53780 181513 182168 182266 182790 183811 184504 184411 183788 182877 181698 180454 179426 178480 177178 175281 172756 169610 166098
53763 166098 162712 159574 156298 152789 149539 146756 143980 141134 139062 138234 137639 135961 133293 130837 129375
53748 129375 128908 129272 130105 130562 130025 128882 127904 127161 126264 125192 124047 122456 120179 117985 116942 116960 116932
53731 116932 116198 115068 114013 113116 112316 111536 110608 109526 108672 108365 108475 108877 109811 111269 112512 112931 112999
53714 112999 113640 114950 116306 117454 118795 120729 123336 126483 129691 132180 133598 134428 135240 136005 136670
$$ packed form
53828H8618p95k35Q11J178R43Q12N40l39r75l18Q66R66J34n6P55J304R23L77L66
53809I5875P54J337K046K326J717R66J265K494L521L949M217M289L822L407L894
53794A35879M711M556L688L640M636N157M385L233K577K139J692J654J931J635
53780A81513O55R8N24J021O93r3o23r11j179j244j028r46j302j897k525l146l512
53763A66098l386l138l276l509l250k783k776k846k072q28n95j678k668k456j462
53748A29375m67L64Q33M57n37j143r78p43q97j072j145j591k277k194j043J8k8
53731A16932p34j130j055q97q00p80r28j082q54l07J10M02R34J458J243M19O8
53714A12999O41J310J356J148J341J934K607L147L208K489J418Q30Q12P65O65
$$ plain form
53699 136670 137891 140376 143885 147594 151180 154865 158764 162814 167014 171050 174090 175718 176749 178409
53685 178409 180902 183414 185240 186301 186874 187392 188244 189313 190088 190585 191435 192612 192985 191958 190660 190464
53669 190464 191069 191225 190727 190360 190327 190083 189497 188933 188280 187123 185790 185148 185332 185688 185870 185983 185742 184664
53651 184664 183133 182216 182259 182582 182668 182712 182896 182982 182837 182592 182189 181499 180866 180823 181324 182084 183496 186204 189690
53632 189690 192342 193229 192957 192609 192706 193470 195171 197599 199797 200890 200955 200816 201198 202175 203203 203742 204050
53615 204050 205150 207725 211325 215075 218726 222416 225876 228722 231311 234438 238300 242470 246773 251389
53601 251389 256238 261063 266088 271812 278149 284418 290141 295276 299776 303658 307331 311218 315151 318815
53587 318815 322526 326815 331436 335574 338855 341423 343336 344778 346562 349316 352292 354030 354230 353933 353879
$$ packed form
53699A36670J221K485L509L709L586L685L899M050M200M036L040J628J031J660
53685A78409K493K512J826J061N73N18Q52J069P75M97Q50J177L73j027j298j96
53669A90464O05J56m98l67l3k44n86n64o53j157j333o42J84L56J82J13k41j078
53651A84664j531r17M3L23Q6M4J84Q6j45k45m03o90o33m3N01P60J412K708L486
53632A89690K652Q87k72l48R7P64J701K428K198J093O5j39L82R77J028N39L08
53615B04050J100K575L600L750L651L690L460K846K589L127L862M170M303M616
53601B51389M849M825N025N724O337O269N723N135M500L882L673L887L933L664
53587C18815L711M289M621M138L281K568J913J442J784K754K976J738K00k97n4
$$ plain form
53572 353879 353792 353424 353205 353573 354497 355912 357817 359757 361030 361629 362259 363281 364339 365141 365822 366400 366583
53555 366583 366224 365367 363837 361487 358878 356975 356172 356252 357050 358347 359367 359449 359112 359408 360335 361045 361512
53538 361512 362620 364486 366156 367311 368916 371620 374774 377703 380800 384578 388630 392360 395972 399927
53524 399927 404119 408337 413019 418822 425835 433750 442412 451737 461496 471626 482425 494107 506523
53511 506523 519532 533210 547516 562235 577362 593032 608982 624814 640910 658313 677477
53500 677477 697877 719154 741802 766267 792049 818227 844374 870472 896411 921998 947174
53489 947174 971929 996324 1020702 1045454 1070520 1095572 1120642 1145982 1171350 1196211 1220713
53478 1220713 1245644 1271259 1296929 1322117 1346894 1371285 1394969 1417910 1440496 1462697 1483868
$$ packed form
53572C53879q7l68k19L68R24J415J905J940J273N99O30J022J058Q02O81N78J83
53555C66583l59q57j530k350k609j903q03Q0P98J297J020Q2l37K96R27P10M67
53538C61512J108J866J670J155J605K704L154K929L097L778M052L730L612L955
53524C99927M192M218M682N803P013P915Q662R325R759J0130J0799J1682J2416
53511E06523J3009J3678J4306J4719J5127J5670J5950J5832J6096J7403J9164
53500F77477K0400K1277K2648K4465K5782K6178K6147K6098K5939K5587K5176
53489I47174K4755K4395K4378K4752K5066K5052K5070K5340K5368K4861K4502
53478A220713K4931K5615K5670K5188K4777K4391K3684K2941K2586K2201K1171
$$ plain form
53467 1483868 1503598 1521992 1538868 1553614 1566285 1577978 1589584 1600850 1611042 1619766 1626678 1631170
53455 1631170 1632954 1632337 1629489 1624089 1616123 1606309 1595152 1582174 1566690 1548844 1529395 1508957 1487904
53442 1487904 1466554 1444990 1423078 1400985 1379280 1358181 1337067 1314906 1290898 1264846 1237520
53431 1237520 1210564 1185336 1161850 1139596 1119059 1101198 1085607 1070746 1056209 1043196 1032245
53420 1032245 1022234 1012487 1004206 998535 994568 990803 987623 986737 988727 992541 997069 1001995 1007467 1014101
53406 1014101 1023088 1035195 1049772 1065593 1082424 1100895 1121205 1142963 1166098 1190829 1216807
53395 1216807 1243342 1270611 1299734 1331371 1365013 1399908 1436105 1474186 1514410 1556524 1600287
53384 1600287 1645898 1693751 1743763 1795163 1847286 1900408 1955263 2011661 2068270 2124008 2179008
$$ packed form
53467A483868J9730J8394J6876J4746J2671J1693J1606J1266J0192Q724O912M492
53455A631170J784o17k848n400p966r814j1157j2978j5484j7846j9449k0438k1053
53442A487904k1350k1564k1912k2093k1705k1099k1114k2161k4008k6052k7326
53431A237520k6956k5228k3486k2254k0537j7861j5591j4861j4537j3013j0951
53420A032245j0011r747q281n671l967l765l180q86J990L814M528M926N472O634
53406A014101Q987J2107J4577J5821J6831J8471K0310K1758K3135K4731K5978
53395A216807K6535K7269K9123L1637L3642L4895L6197L8081M0224M2114M3763
53384A600287M5611M7853N0012N1400N2123N3122N4855N6398N6609N5738N5000
$$ plain form
53373 2179008 2233873 2288566 2342468 2395011 2445778 2494386 2540658 2584459 2625038 2661132 2692167
53362 2692167 2718825 2742029 2761892 2778069 2790427 2798787 2802630 2801745 2796643 2787681 2774321 2756050
53350 2756050 2733598 2708446 2681244 2651320 2617501 2578902 2535226 2487010 2435529 2382158 2327938
53339 2327938 2273878 2221031 2169824 2119814 2070595 2022518 1976028 1930808 1886149 1841815 1798038
53328 1798038 1755060 1713167 1672722 1633694 1595612 1558447 1523104 1490559 1460968 1434026 1409628
53317 1409628 1387679 1367871 1350091 1334386 1320024 1305437 1289766 1273681 1257993 1242419 1226723
53306 1226723 1212082 1199966 1190259 1181802 1174397 1168858 1165287 1162693 1160389 1158668 1157979 1158489 1160464 1164013
53292 1164013 1168312 1172121 1175371 1179438 1185603 1193989 1204293 1216659 1231398 1248389 1267232 1287678
$$ packed form
53373B179008N4865N4693N3902N2543N0767M8608M6272M3801M0579L6094L1035
53362B692167K6658K3204J9863J6177J2358Q360L843q85n102q962j3360j8271
53350B756050k2452k5152k7202k9924l3819l8599m3676m8216n1481n3371n4220
53339B327938n4060n2847n1207n0010m9219m8077m6490m5220m4659m4334m3777
53328A798038m2978m1893m0445l9028l8082l7165l5343l2545k9591k6942k4398
53317A409628k1949j9808j7780j5705j4362j4587j5671j6085j5688j5574j5696
53306A226723j4641j2116r707q457p405n539l571k594k304j721o89N10J975L549
53292A164013M299L809L250M067O165Q386J0304J2366J4739J6991J8843K0446
$$ plain form
53280 1287678 1309646 1333074 1357869 1383767 1410146 1436180 1461220 1484994 1507606 1529498 1551054
53269 1551054 1572027 1591691 1609764 1626598 1642111 1655244 1665134 1672282 1677791 1681894 1684064 1684132 1682376
53256 1682376 1678721 1672775 1664579 1654546 1642781 1629229 1614300 1598437 1581109 1561147 1538224 1513261
53244 1513261 1487242 1460413 1432818 1404874 1376990 1349059 1320736 1292087 1263791 1236781 1211528
53233 1211528 1187596 1164167 1141165 1119366 1099131 1079681 1060207 1041057 1023008 1005865 988729
53222 988729 971393 954529 938677 923952 910620 898968 888594 878716 869279 860947 853855 847132
53210 847132 839859 831863 823430 814828 806141 797029 786628 774360 760871 747557 735164 723424 711986
53197 711986 700887 690040 679080 667970 657086 646515 635781 624491 612638 600148 586766
$$ packed form
53280A287678K1968K3428K4795K5898K6379K6034K5040K3774K2612K1892K1556
53269A551054K0973J9664J8073J6834J5513J3133R890P148N509M103K170O8j756
53256A682376l655n946q196j0033j1765j3552j4929j5863j7328j9962k2923k4963
53244A513261k6019k6829k7595k7944k7884k7931k8323k8649k8296k7010k5253
53233A211528k3932k3429k3002k1799k0235j9450j9474j9150j8049j7143j7136
53222I88729j7336j6864j5852j4725j3332j1652j0374r878r437q332p092o723
53210H47132p273p996q433q602q687r112j0401j2268j3489j3314j2393j1740j1438
53197G11986j1099j0847j0960j1110j0884j0571j0734j1290j1853j2490j3382
$$ plain form
53186 586766 572662 558629 545357 532849 520637 508206 495128 481352 467574 454898 443782
53175 443782 433604 423336 412492 401375 390726 381198 372906 365442 358412 351796 345635 339724 333943
53162 333943 328530 323520 318271 312142 305445 299120 293642 288794 284369 280438 276993 273875 271001 268208
53148 268208 265113 261638 258368 255771 253338 250261 246740 243778 241790 240267 238750 237306 235954 234416
53134 234416 232560 230432 227889 224859 221957 220027 219068 218363 217711 217622 218159 218515 218069 217158 216443 216140 216161
53117 216161 216404 216605 216431 216016 215917 216303 216674 216594 216264 216198 216801 218380 220981 224000 226394 227569 227709 227197
53099 227197 226149 224601 222713 220588 218211 215591 212730 209511 206058 203039 201056 199805 198326 196003
53085 196003 192849 189070 185033 181473 178906 176832 174220 170793 167180 163903 161012 158621 156908 155529
$$ packed form
53186E86766j4104j4033j3272j2508j2212j2431j3078j3776j3778j2676j1116
53175D43782j0178j0268j0844j1117j0649r528q292p464p030o616o161n911n781
53162C33943n413n010n249o129o697o325n478m848m425l931l445l118k874k793
53148B68208l095l475l270k597k433l077l521k962j988j523j517j444j352j538
53134B34416j856k128k543l030k902j930r59p05o52q9N37L56m46r11p15l03K1
53117B16161K43K01j74m15r9L86L71q0l30o6O03J579K601L019K394J175J40n12
53099B27197j048j548j888k125k377k620k861l219l453l019j983j251j479k323
53085A96003l154l779m037l560k567k074k612l427l613l277k891k391j713j379
$$ plain form
53071 155529 153909 152206 151080 150434 149373 147652 146134 145420 144996 144224 143337 142816 142497 141923 141086 140202 139167
53054 139167 137717 135844 133735 131623 129904 128910 128300 127166 125060 122624 120890 120323 120654 121272 121607 121484
53038 121484 121203 121038 120764 120083 119280 118823 118534 117907 117086 116617 116293 115298 113586 112037 111010 109888 108476
53021 108476 107718 108309 109486 109976 109474 108506 107422 106278 105320 104870 104944 105272 105481 105131 104119 103231 103639 105575
53003 105575 108148 110661 113201 115595 116821 116331 115190 114975 115929 116900 116815 115565 113744 112166 111446 111565
52987 111565 111961 112301 112817 113636 114282 114289 113894 113681 113833 114151 114486 114856 115390 116374 117993 119922 121657 123344
52969 123344 125613 128418 130863 132547 134299 137044 140656 144467 148227 151914 155300 158491 162334 167418
52955 167418 172990 177643 180773 182731 183853 184151 183751 182920 181673 179911 177917 176256 175185 174433 173463
$$ packed form
53071A55529j620j703j126o46j061j721j518p14m24p72q87n21l19n74q37q84j035
53054A39167j450j873k109k112j719r94o10j134k106k436j734n67L31O18L35j23
53038A21484k81j65k74o81q03m57k89o27q21m69l24r95j712j549j027j122j412
53021A08476p58N91J177M90n02r68j084j144r58m50P4L28K09l50j012q88M08J936
53003A05575K573K513K540K394J226m90j141k15R54R71q5j250j821j578p20J19
52987A11565L96L40N16Q19O46Pl95k13J52L18L35L70N34R84J619J929J735J687
52969A23344K269K805K445J684J752K745L612L811L760L687L386L191L843N084
52955A67418N572M653L130J958J122K98m00q31j247j762j994j661j071p52r70
$$ plain form
52940 173463 171719 168965 165717 163043 161572 160903 160278 159397 158253 156672 154655 152842 151976 151967 151964 151325 150206
52923 150206 149253 149026 149622 150658 151670 152537 153359 154028 154376 154687 155449 156498 157114 157191 157529 158552 159498 159484
52905 159484 158800 158441 158798 159463 160000 160377 160835 161812 163716 166383 169023 170999 172315 173143 173427 173342 173531
52888 173531 174348 175368 176086 176645 177298 177744 177635 177344 177533 178249 179040 179656 180078 180202 180047 180042 180575 181487 182436
52869 182436 183390 184328 184907 184965 184917 185140 185375 185327 185336 185775 186225 186076 185647 185812 186663 187379 187415 187155 187314 188226 189785
52848 189785 191719 193889 196549 200116 204481 208933 213001 216854 220483 223142 224294 224630 225306 226514 227587
52833 227587 228220 228761 229416 229969 230289 230413 230113 228939 226754 223791 220316 216635 213216 210275 207468 204444
52817 204444 201460 198871 196341 193286 189845 186715 184126 181735 179471 177721 176565 175461 173905 171943
$$ packed form
52940A73463j744k754l248k674j471o69o25q81j144j581k017j813q66rlo39j119
52923A50206r53k27N96J036J012Q67Q22O69L48L11P62J049O16P7L38J023R46j4
52905A59484o84l59L57O65N37L77M58R77J904K667K640J976J316Q28K84q5J89
52888A73531Q17J020P18N59O53M46j09k91J89P16P91O16M22J24j55nN33R12R49
52869A82436R54R38N79N8m8K23K35m8RM39M50j49m29J65Q51P16L6k60J59R12J559
52848A89785J934K170K660L567M365M452M068L853L629K659J152L36O76J208J073
52833B27587O33N41O55N53L20J24l00j174k185k963l475l681l419k941k807l024
52817B04444k984k589k530l055l441l130k589k391k264j750j156j104j556j962
$$ plain form
52803 171943 169965 168296 167033 165969 164732 163288 162058 161225 160236 158551 156598 155355 155019 154661 153277
52788 153277 150766 147964 146005 145522 146049 146334 145565 144105 142787 141873 141129 140458 139788 138649 136548 133696
52772 133696 130811 128332 126243 124502 123114 121960 120952 120164 119440 118280 116528 114743 113309 111708 109411
52757 109411 107028 105635 105232 104805 103753 102367 100958 99483 98089 97178 96735 96241 95417 94530 93831 93190
52741 93190 92367 91285 90090 89213 89122 89523 89226 87479 85123 83686 83554 83833 83771 83463 83231 83197 83527 84289
52723 84289 85000 84962 84093 82839 81405 79772 78305 77487 77090 76467 75601 74963 74435 73428 72177 71781 72641
52706 72641 73813 74336 74316 74271 74254 74262 74811 76497 79304 82757 86353 89621 92230 94304 96185 97740 98495
52689 98495 98669 99405 101509 104504 107352 109581 111253 112285 112438 111826 110939 110106 109126 107450 104748 101409
$$ packed form
52803A71943j978j669j263j064j237j444j230q33r89j685j953j243l36l58j384
52788A53277k511k802j959m83N27K85p69j460j318r14p44o71o70j139k101k852
52772A33696k885k479k089j741j388j154j008p88p24j160j752j785j434j601k297
52757A09411k383j393m03m27j052j386j409j475j394r11m43m94q24q87o99o41
52741I3190q23j082j195q77r1M01k97j747k356j437j32K79o2l08k32l4L30P62
52723H4289P11l8q69j254j434j633j467q18l97o23q66o38n28j007j251l96Q60
52706G2641J172N23k0m5j7QN49J686K807L453L596L268K609K074J881J555P55
52689I8495J74P36K104K995K848K229J672J032J53o12q87q33r80j676k702l339
$$ plain form
52673 101409 98386 96315 94897 93488 92059 91088 90622 90088 89132 87986 86832 85374 83368 81130 79232
52658 79232 77897 76892 75768 74141 72069 70222 69411 69825 70888 71785 71967 71330 70319 69714 69909 70426
52642 70426 70516 70041 69392 68773 68113 67569 67582 68456 70226 72699 75166 76451 75957 74459 73187 72365 71387 70167
52624 70167 69378 69360 69740 70235 70970 71852 72424 72545 72566 72678 72715 72701 72890 73163 73056 72538 72202 72554 73636 75254
52604 75254 76952 77975 78044 78018 78891 80237 80716 80033 79215 78874 78484 77748 77410 78118 79523 81094 82874 84815
52586 84815 86272 86887 87251 88054 89222 90375 91391 91996 91693 90741 90516 92070 94921 97848 100298 102274
52570 102274 103540 103862 103737 104075 105288 107156 109304 111309 112664 113200 113404 113973 115212 117054 119324 121678
52554 121678 123708 125328 126746 127978 128886 129716 130916 132274 132940 132580 131737 130853 129812 128727 128189 128284
$$ packed form
52673A01409l023k071j418j409j429r71m66n34r56j146j154j458k006k238j898
52658G9232j335j005j124j627k072j847q11M14J063Q97J82o37j011o05J95N17
52642G0426R0m75o49o19o60n44J3Q74J770K473K467J285m94j498j272q22r78j220
52624G0167p89j8L80M95P35Q82N72J21K1J12L7j4J89K73j07n18l36L52J082J618
52604G5254J698J023O9k6Q73J346M79o83q18l41l90p36l38P08J405J571J780J941
52586H4815J457O15L64Q03J168J153J016O05l03r52k25J554K851K927K450J976
52570A02274J266L22j25L38J213J868K148K005J355N36K04N69J239J842K270K354
52554A21678K030J620J418J232R08Q30J200J358O66l60q43q84j041j085n38R5
$$ plain form
52538 128284 128383 128488 129649 132247 134900 136144 136342 136758 137503 137703 137266 137087 137632 138454 139148 139793 140383 140691
52520 140691 140788 141032 141425 141589 141399 141131 141031 141215 141820 142682 143037 142185 140390 138546 137054 135632 134169
52503 134169 133089 132730 132907 133249 133547 133653 133423 132945 132633 132976 134219 136203 138406 140260 141563 142472 143139
52486 143139 143729 144724 146640 149187 151278 152227 152494 152908 153684 154628 155694 156741 157238 156891 156216 155925 156044
52469 156044 156235 156563 157228 157866 157888 157340 156683 155908 154692 153335 152708 153143 154092 155076 156261 157808 159283
52452 159283 160212 160848 161890 163515 165056 165700 165324 164516 163851 163369 162864 162439 162429 162900 163625 164480 165373 165832
52434 165832 165299 164090 163399 164022 165526 167033 168278 169436 170393 170764 170430 169605 168595 167753 167417 167600 167975
52417 167975 168295 168453 168041 166554 164333 162597 162040 162002 161534 160686 160142 160133 160453 161058 161962 162865 163574 164405 165579
$$ packed form
52538A28284R9J05J161K598K653J244J98M16P45K00m37j79N45Q22O94O45N90L08
52520A40691R7K44L93J64j90k68j00J84O05Q62L55q52j795j844j492j422j463
52503A34169j080l59J77L42K98J06k30m78l12L43J243J984K203J854J303R09O67
52486A43139N90R95J916K547K091R49K67M14P76R44J066J047M97l47o75k91J19
52469A56044J91L28O65O38K2n48o57p75j216j357o27M35R49R84J185J547J475
52452A59283R29O36J042J625J541O44l76q08o65m82n05m25j0M71P25Q55Q93M59
52434A65832n33j209o91O23J504J507J245J158R57L71l34q25j010q42l36J83L75
52417A67975L20J58m12j487k221j736n57l8m68q48n44rL20O05R04R03P09Q31J174
$$ plain form
52398 165579 166607 166970 166948 167094 167353 167505 167981 169195 170401 170330 168914 167421 166882 167310 168423 170131 172078
52381 172078 173703 175074 176887 179248 181176 181795 181446 181097 181027 180670 179655 178576 178577 180252 183017 185711
52365 185711 187793 189720 192084 194791 197416 199963 202758 205778 208602 210951 212950 214922 217222 220067
52351 220067 223223 226119 228573 231095 234057 236931 238889 239967 241072 242960 245695 248885 251981 254453
52337 254453 256130 257287 258152 258655 259051 260261 262880 266172 268764 270221 271326 272990 275516 278713 282035
52322 282035 284706 286425 287963 290514 294451 299235 304312 309489 314551 319214 323537 327838 332338 337328
52308 337328 343472 351231 360148 369335 378564 388267 398666 409663 421428 434229 447728 461333 475281
52295 475281 490441 506937 523833 540429 557059 574339 592384 611121 630594 650545 670229
$$ packed form
52398A65579J028L63k2J46K59J52M76J214J206p1j416j493n39M28J113J708J947
52381A72078J625J371J813K361J928O19l49l49p0l57j015j079JJ675K765K694
52365A85711K082J927K364K707K625K547K795L020K824K349J999J972K300K845
52351B20067L156K896K454K522K962K874J958J078J105J888K735L190L096K472
52337B54453J677J157Q65N03L96J210K619L292K592J457J105J664K526L197L322
52322B82035K671J719J538K551L937M784N077N177N062M663M323M301M500M990
52308C37328O144P759Q917R187R229R703J0399J0997J1765J2801J3499J3605J3948
52295D75281J5160J6496J6896J6596J6630J7280J8045J8737J9473J9951J9684
$$ plain form
52284 670229 689148 707527 725691 743349 759836 774759 788195 800535 812300 823833 835031
52273 835031 845576 855380 864434 872325 878428 882595 885199 886475 886388 885119 883115 880522 877108 872921
52259 872921 868499 864275 860214 856119 851887 847419 842761 838376 834798 832032 829782 828250 828039 829204
52245 829204 831152 833660 837435 843368 851710 862039 873486 884908 895631 906314 918441 932560
52233 932560 947506 961673 974530 986573 998305 1009706 1020304 1029348 1036186 1040810 1043854 1045867
52221 1045867 1046880 1046727 1045343 1042497 1037680 1030644 1021776 1011735 1000968 989750 978345 966833 954909
52208 954909 942110 928166 913208 897840 882933 869028 855938 843234 830932 819335 808380
52197 808380 797769 787691 778728 770956 763811 757014 751036 746415 743088 740625 738591 736548 734190 731658
$$ packed form
52284F70229J8919J8379J8164J7658J6487J4923J3436J2340J1765J1533J1198
52273H35031J0545R804R054P891O103M167K604J276q7j269k004k593l414m187
52259H72921m422m224m061m095m232m468m658m385l578k766k250j532k11J165
52245H29204J948K508L775N933Q342J0329J1447J1422J0723J0683J2127J4119
52233I32560J4946J4167J2857J2043J1732J1401J0598R044O838M624L044K013
52221A045867J013j53j384k846m817p036q868j0041j0767j1218j1405j1512j1924
52208I54909j2799j3944j4958j5368j4907j3905j3090j2704j2302j1597j0955
52197H08380j0611j0078q963p772p145o797n978m621l327k463k034k043k358k532
$$ plain form
52183 731658 729276 726869 723936 720614 717788 715961 714698 713499 712575 712238 712088 711356 709760 707531 704938
52168 704938 702180 699511 697052 694617 692019 689349 686802 684385 681972 679407 676525 673374 670445 668258
52154 668258 666724 665381 664280 663911 664075 663585 661612 658724 655995 653492 650316 645984 641195 637157 634431
52139 634431 632513 630397 627565 624388 621536 619187 617111 615195 613337 610991 607656 603871 600904 599134
52125 599134 597509 595010 591958 589354 587537 586196 585184 584613 584346 584115 584063 584647 586014 587963 590522 594163
52109 594163 599363 606122 614018 622568 631549 641090 651596 663639 677777 694156 712130 730661 749428
52096 749428 769172 790539 812968 835383 857644 880413 903792 927144 950329 973998 998254
52085 998254 1021939 1043777 1063483 1081379 1097586 1112111 1124981 1135790 1143776 1148931 1152343 1154853
$$ packed form
52183G31658k382k407k933l322k826j827j263j199r24l37j50p32j596k229k593
52168G04938k758k669k459k435k598k670k547k417k413k565k882l151k929k187
52154F68258j534j343j101l69J64m90j973k888k729k503l176m332m789m038k726
52139F34431j918k116k832l177k852k349k076j916j858k346l335l785k967j770
52125E99134j625k499l052k604j817j341j012n71k67k31n2N84J367J949K559L641
52109E94163N200O759P896Q550Q981R541J0506J2043J4138J6379J7974J8531J8767
52096G49428J9744K1367K2429K2415K2261K2769K3379K3352K3185K3669K4256
52085I98254K3685K1838J9706J7896J6207J4525J2870J0809P986N155L412K510
$$ plain form
52073 1154853 1156033 1155150 1152439 1148612 1143643 1137047 1128948 1119931 1110025 1098804 1086502 1074171 1062574
52060 1062574 1051603 1040916 1030528 1020568 1010954 1001685 993129 985778 979789 974922 970876 967678 965717
52047 965717 965335 966384 968495 971824 977099 984602 993397 1001984 1009676 1017058 1025105 1034127 1043605 1052857
52033 1052857 1061723 1070492 1079199 1087317 1094385 1100623 1106450 1111610 1115389 1117635 1118759 1118693 1116671 1112362
52019 1112362 1106481 1099770 1092024 1082633 1071547 1059130 1045498 1030623 1014861 998748 982370 965310
52007 965310 947133 927688 907087 885624 863543 840815 817490 794229 771893 750432 728855
51996 728855 706630 684480 663320 643065 623073 603216 583807 564865 546196 527898 510189
51985 510189 492942 476038 459887 444906 430565 415719 399967 384234 369868 357503 346832
$$ packed form
52073A154853J180q83k711l827m969o596q099r017r906j1221j2302j2331j1597
52060A062574j0971j0687j0388r960r614r269q556p351n989m867m046l198j961
52047I65717l82J049K111L329N275P503Q795Q587P692P382Q047R022R478R252
52033A052857Q866Q769Q707Q118P068O238N827N160L779K246J124o6k022m309
52019A112362n881o711p746r391j1086j2417j3632j4875j5762j6113j6378j7060
52007I65310j8177j9445k0601k1463k2081k2728k3325k3261k2336k1461k1577
51996G28855k2225k2150k1160k0255j9992j9857j9409j8942j8669j8298j7709
51985E10189j7247j6904j6151j4981j4341j4846j5752j5733j4366j2365j0671
$$ plain form
51974 346832 337118 327825 318907 310597 303015 296119 290013 284861 280493 276462 272526 268633 264394 259387
51960 259387 254134 249885 246947 244072 240210 236061 232980 230988 228942 226342 223797 221778 219991 218183
51946 218183 216672 215713 214923 213665 211627 208851 205630 202588 200466 199488 199064 198284 196746 194850 193313
51931 193313 192463 192088 192010 192439 193393 194018 193235 191116 188918 187569 186788 185953 185060 184344 183615 182521 180963
51914 180963 178815 175860 172546 170116 169238 169072 168360 166937 165405 163955 162461 161264 160778 160544 159710 158338
51898 158338 157318 157030 156939 156492 155619 154313 152546 150674 149217 148164 147083 145929 145064 144478 143709 142664
51882 142664 141869 141726 142089 142663 143320 143906 144250 144481 144886 145378 145543 145235 144679 144018 143270 142712 142745 143237 143524
51863 143524 143289 143033 143550 145174 147564 149990 151840 153153 154591 156683 159280 161965 164678 167467 169977
$$ packed form
51974C46832r714r293q918q310p582o896o106n152m368m031l936l893m239n007
51960B59387n253m249k938k875l862m149l081j992k046k600k545k019j787j808
51946B18183j511r59p90j258k038k776l221l042k122r78m24p80j538j896j537
51931A93313q50l75p8M29R54O25p83k119k198j349p81q35q93p16p29j094j558
51914A80963k148k955l314k430q78j66p12j423j532j450j494j197m86k34q34j372
51898A58338j020k88r1m47q73j306j767j872j457j053j081j154q65n86p69j045
51882A42664p95j43L63N74O57N86L44K31M05M92J65l08n56o61p48n58L3M92K87
51863A43524k35k56N17J624K390K426J850J313J438K092K597K685K713K789K510
$$ plain form
51848 169977 171806 173206 174805 176655 178103 178542 177911 176567 175146 174349 174296 174252 173480 172215 171225 170666 170101
51831 170101 169464 169142 169069 168578 167429 166321 166156 167231 169272 171672 173520 174000 173201 172254 172380 173882 176061
51814 176061 177867 178636 178438 177813 177182 176678 176525 177057 178076 178718 178458 177790 177428 177307 177008 176622 176387 175891
51796 175891 174658 173272 172922 173838 175006 175422 174867 173604 172197 171571 172339 173993 175503 176658 178019 179641
51780 179641 180887 181543 182165 183140 184313 185655 187353 189064 190073 190495 191356 193161 195312 197343 199695
51765 199695 202732 205842 208196 209770 211050 212352 213989 216491 220083 224314 228677 233156 237910 243007
51751 243007 248849 256199 265177 274668 283223 290183 295558 299301 301255 301530 300464 298388 295720 292986
51737 292986 290552 288507 286941 285981 285500 285268 285434 286352 287854 289342 290695 292387 294440 296058 296697 296841
$$ packed form
51848A69977J829J400J599J850J448M39o31j344j421p97n3m4p72j265r90n59n65
51831A70101o37l22p3m91j149j108j65J075K041K400J848M80p99r47J26J502K179
51814A76061J806P69j98o25o31n04j53N32J019O42k60o68l62j21k99l86k35m96
51796A75891j233j386l50R16J168M16n55j263j407o26P68J654J510J155J361J622
51780A79641J246O56O22R75J173J342J698J711J009M22Q61J805K151K031K352
51765A99695L037L110K354J574J280J302J637K502L592M231M363M479M754N097
51751B43007N842P350Q978R491Q555O960N375L743J954K75j066k076k668k734
51737B92986k434k045j566r60m81k32J66R18J502J488J353J692K053J618O39J44
$$ plain form
51721 296841 297269 298113 299078 299984 300648 300698 299980 298722 296991 294551 291582 288952 287295 286371 285717 285321 285121
51704 285121 284534 283138 281309 279480 277304 274342 271184 268991 268066 267639 267073 266585 266688 267471 268613 269788
51688 269788 270947 272405 274659 278009 282413 287655 293388 298893 303202 305766 306826 306996 306773 306470 306267
51673 306267 306118 306011 306430 308035 310708 313505 315864 318188 320791 322890 323436 322564 321472 320948 320645 319730
51657 319730 317683 314300 309417 302959 295291 287413 280551 275226 270800 266299 261597 257275 253361 248962
51643 248962 243459 237399 231842 227381 224230 222569 222101 221729 220411 218152 215613 213043 210246 207358 204942
51628 204942 203238 201876 200434 198888 197431 196174 195091 194091 193085 192137 191456 191116 190916 190689 190584 190847
51612 190847 191347 191504 190787 189265 187737 187126 187567 188176 187981 186948 185852 185348 185660 186914 189075 191501
$$ packed form
51721B96841M28Q44R65R06O64N0p18j258j731k440k969k630j657r24o54l96k00
51704B85121n87j396j829j829k176k962l158k193r25m27n66m88J03P83J142J175
51688B69788J159J458K254L350M404N242N733N505M309K564J060J70k23l03k03
51673C06267j49j07M19J605K673K797K359K324K603K099N46q72j092n24l03r15
51657C19730k047l383m883o458p668p878o862n325m426m501m702m322l914m399
51643B48962n503o060n557m461l151j661m68l72j318k259k539k570k797k888k416
51628B04942j704j362j442j546j457j257j083j000j006r48o81l40k00k27j05K63
51612A90847N00J57p17j522j528o11M41O09j95j033j096n04L12J254K161K426
$$ plain form
51596 191501 193264 194125 194762 195942 198003 201124 205370 210296 215208 220079 225568 231920 238525 244841 251009
51581 251009 257199 263049 268199 272745 276765 279975 282230 283710 284262 283314 280935 278186 275810 273315 270017
51566 270017 266273 262912 260011 257125 254219 251629 249490 248024 248005 250069 253750 257868 261706 265321 269047
51551 269047 273309 278544 284687 290998 296896 302480 307657 311393 312782 312494 312217 312804 313780 314422 314480 313852
51535 313852 312459 310574 308728 307310 306704 307546 310115 313634 316838 319207 321038 322478 323238 323266 322994 322762
51519 322762 322394 321396 319223 315621 311114 306882 303536 300264 295854 290343 284876 280046 275261 269917 264449
51504 264449 259860 256620 254293 252063 249581 247364 246196 246016 245814 244946 244045 244078 244997 245967 246578 247057 247567
51487 247567 248098 248897 250220 251769 253100 254525 256803 259985 263256 266012 268440 271015 274034 277686 282013
$$ packed form
51596A91501J763Q61O37J180K061L121M246M926M912M871N489O352O605O316O168
51581B51009O190N850N150M546M020L210K255J480N52r48k379k749k376k495l298
51566B70017l744l361k901k886k906k590k139j466j9K064L681M118L838L615L726
51551B69047M262N235O143O311N898N584N177L736J389k88k77N87R76O42N8o28
51535C13852j393j885j846j418o06Q42K569L519L204K369J831J440P60K8k72k32
51519C22762l68r98k173l602m507m232l346l272m410n511n467m830m785n344n468
51504B64449m589l240k327k230k482k217j168j80k02q68r01L3R19R70O11M79N10
51487B47567N31P99J323J549J331J425K278L182L271K756K428K575L019L652M327
$$ plain form
51472 282013 286751 291678 297023 303069 309591 316305 323571 331836 340524 348330 354699 360278 365915 371947
51458 371947 378413 385100 391251 396018 399402 402063 404148 405121 404874 404176 403688 403301 402820 402638 403310 404877
51442 404877 406941 408984 410422 410833 410320 409236 407449 404335 399649 393913 387841 381805 375866 369774 362901
51427 362901 354806 345998 337608 330250 323806 318275 313965 310707 307741 304724 302060 299902 297651 295001
51413 295001 292752 291893 292361 293343 294428 295895 298159 301441 305757 310738 315627 319893 323747 327721 331874
51398 331874 335623 338195 339033 337973 335312 331544 326867 321050 313907 305673 296825 287742 278672 269719
51384 269719 260733 251454 242020 233127 225534 219504 214793 210986 207716 204710 201757 198653 195276 191819
51370 191819 188743 186259 184010 181514 178725 175833 172773 169424 166158 163661 162216 161554 161267 160938 160028
$$ packed form
51472B82013M738M927N345O046O522O714P266Q265Q688P806O369N579N637O032
51458C71947O466O687O151M767L384K661K085R73k47o98m88l87m81j82O72J567
51442D04877K064K043J438M11n13j084j787l114m686n736o072o036n939o092o873
51427C62901q095q808q390p358o444n531m310l258k966l017k664k158k251k650
51413B95001k249q59M68R82J085J467K264L282M316M981M889M266L854L974M153
51398C31874L749K572Q38j060k661l768m677n817p143q234q848r083r070q953
51384B69719q986r279r434q893p593o030m711l807l270l006k953l104l377l457
51370A91819l076k484k249k496k789k892l060l349l266k497j445o62k87l29r10
$$ plain form
51355 160028 158293 156323 155115 155061 155725 156554 157203 157305 156651 155719 155342 155640 155837 155353 154550 154152 154395 155017
51337 155017 155735 156525 157715 159826 163018 166714 170143 173125 175863 178164 179579 180303 181297 183402 186834
51322 186834 191459 196882 202291 207020 211351 216040 220969 225055 227619 229036 229834 229995 229390 228088 225877
51307 225877 222269 217360 211980 206684 201320 195889 190923 186506 181803 176244 170459 165403 161130 157172
51293 157172 153609 151066 149874 149697 149731 149073 147389 145474 144486 144356 143768 142134 140570 140214 140425 139666 137624
51276 137624 135436 134121 133621 133210 132167 130251 128112 126886 126902 127194 126851 126301 126462 127138 127264 126454 125378
51259 125378 124729 124706 125421 126900 128590 129707 130166 130517 130907 130775 129716 127958 125838 123423 120913 118823
51243 118823 117514 116886 116761 117201 118220 119544 120879 122168 123411 124422 124943 124897 124425 123768 123164 122769 122682
$$ packed form
51355A60028j735j970j208n4O64Q29O49J02o54r32l77K98J97m84q03l98K43O22
51337A55017P18P90J190K111L192L696L429K982K738K301J415P24R94K105L432
51322A86834M625N423N409M729M331M689M929M086K564J417P98J61o05j302k211
51307B25877l608m909n380n296n364n431m966m417m703n559n785n056m273l958
51293A57172l563k543j192j77L4o58j684j915r88j30n88j634j564l56K11p59k042
51276A37624k188j315n00m11j043j916k139j226J6K92l43n50J61O76J26q10j076
51259A25378o49k3P15J479J690J117M59L51L90j32j059j758k120k415k510k090
51243A18823j309o28j25M40J019J324J335J289J243J011N21m6m72o57o04l95q7
$$ plain form
51226 122682 123007 123776 124744 125472 125755 125770 125672 125308 124560 123757 123472 124036 125401 127250 129044 130235 130736 131052
51208 131052 131694 132655 133613 134437 135278 136358 137851 139741 141600 142795 143057 142629 141783 140645 139682 139707 140922
51191 140922 142390 142986 142632 142159 142206 142707 143236 143356 142793 141628 140246 138911 137634 136622 136360 136884 137458
51174 137458 137488 137323 137622 138298 138754 138843 138910 139025 138883 138379 137721 136934 135763 134059 131892 129369 126701 124271
51156 124271 122293 120565 118920 117632 116970 116681 116433 116399 116773 117089 116696 115728 114867 114349 114027 114181 115342
51139 115342 117263 119016 120278 121680 123635 125657 127235 128661 130479 132672 134836 136722 138141 138672
51125 138672 137991 136352 134450 132895 131940 131450 130889 129615 127525 125294 123714 122855 122033 120650 118964 117872
51109 117872 117817 118093 117584 116228 115187 115309 116086 116684 117413 119228 122054 124680 126391 127730 129390 131257
$$ packed form
51226A22682L25P69R68P28K83J5r8l64p48q03k85N64J365J849J794J191N01L16
51208A31052O42R61R58Q24Q41J080J493J890J859J195K62m28q46j138r63K5J215
51191A40922J468N96l54m73M7N01N29J20n63j165j382j335j277j012k62N24N74
51174A37458L0j65K99O76M56Q9O7J15j42n04o58p87j171j704k167k523k668k430
51156A24271j978j728j645j288o62k89k48l4L74L16l93r68q61n18l22J54J161
51139A15342J921J753J262J402J955K022J578J426J818K193K164J886J419N31
51125A38672o81j639j902j555r55m90n61j274k090k231j580q59q22j383j686j092
51109A17872n5K76n09j356j041J22P77N98P29J815K826K626J711J339J660J867
$$ plain form
51093 131257 132970 134652 136492 138163 139291 140072 140931 141846 142517 142832 142667 141566 139310 136669 134943 134668
51077 134668 135280 136082 137021 138276 139565 140303 140307 139996 139877 140029 140140 139916 139373 138839 138770 139486 140901 142514
51059 142514 143782 144589 145303 146320 147649 148950 149926 150672 151726 153696 156625 159732 162024 163311 164313
51044 164313 165643 167027 167846 168161 168728 170039 171771 173215 173974 174088 173687 172706 171010 168837 167063 166767
51028 166767 168250 170589 172345 172750 172134 171379 171125 171395 171709 171580 171059 170744 171183 172319 173643 174761 175700
51011 175700 176777 178282 180209 182290 184419 186964 190370 194450 198497 202131 205574 208957 212029 214918
50997 214918 218575 223815 230347 237362 244686 252620 260933 268925 276481 284267 292751 301680 310823 320708
50983 320708 332293 346240 362675 381301 401598 423226 446413 471760 499633 530090 563477
$$ packed form
51093A31257J713J682J840J671J128P81Q59R15O71L15j65j101k256k641j726k75
51077A34668O12Q02R39J255J289P38Ml11j19J52J11k24n43n34o9P16J415J613
51059A42514J268Q07P14J017J329J301R76P46J054J970K929L107K292J287J002
51044A64313J330J384Q19L15N67J311J732J444P59J14m01r81j696k173j774k96
51028A66767J483K339J756M05o16p55k54K70L14j29n21l15M39J136J324J118R39
51011A75700J077J505J927K081K129K545L406M080M047L634L443L383L072K889
50997B14918L657N240O532P015P324P934Q313P992P556P786Q484Q929R143R885
50983C20708J1585J3947J6435J8626K0297K1628K3187K5347K7873L0457L3387
$$ plain form
50972 563477 600678 642497 689001 739692 794138 852220 913861 978691 1046098 1115604 1187062
50961 1187062 1260261 1334134 1406463 1474517 1536025 1589636 1634762 1671248 1698997 1717738 1727284
50950 1727284 1728100 1721286 1707831 1688272 1663394 1634820 1604432 1573505 1542845 1513476 1486494 1462313
50938 1462313 1440534 1420512 1401571 1382754 1362875 1340968 1316462 1289058 1258797 1226027 1190846
50927 1190846 1152709 1111142 1066733 1020916 974855 929016 883716 839380 796229 754405 714657
50916 714657 678353 646477 618891 594741 573281 554187 537406 522927 510587 500066 491171 483927
50904 483927 478235 473715 470175 467897 467032 467139 467903 469823 473341 477580 480994 483204 485160 487426 489460
50889 489460 490930 492644 495464 499112 502792 506397 510371 514803 519403 524160 529403 535280 541609 548241
$$ packed form
50972E63477L7201M1819M6504N0691N4446N8082O1641O4830O7407O9506P1458
50961A187062P3199P3873P2329O8054O1508N3611M5126L6486K7749J8741R546
50950A727284Q16o814j3455j9559k4878k8574l0388l0927l0660k9369k6982k4181
50938A462313k1779k0022j8941j8817j9879k1907k4506k7404l0261l2770l5181
50927A190846l8137m1567m4409m5817m6061m5839m5300m4336m3151m1824l9748
50916G14657l6304l1876k7586k4150k1460j9094j6781j4479j2340j0521q895p244
50904D83927n692m520l540k278q65J07P64J920L518M239L414K210J956K266K034
50889D89460J470J714K820L648L680L605L974M432M600M757N243N877O329O632
$$ plain form
50875 548241 555306 563233 572640 583963 597018 611256 626619 643770 663255 684867 708283 733976
50863 733976 763038 796284 833996 876427 924112 977690 1037766 1105111 1180819 1266090 1361774
50852 1361774 1468019 1584331 1710034 1844654 1987800 2138791 2296565 2459772 2626535
50843 2626535 2794083 2958788 3116493 3262580 3392057 3500306 3584102 3641876 3673270 3678956
50833 3678956 3660865 3621949 3565468 3494734 3413523 3326223 3237413 3151500 3072484 3003280 2944985
50822 2944985 2897142 2858606 2827507 2800511 2773262 2742219 2705618 2662442 2611256 2550597 2479816
50811 2479816 2398902 2308051 2208263 2102026 1992547 1882299 1772824 1665793 1563482 1467925
50801 1467925 1379982 1299506 1226273 1160604 1103174 1054282 1013485 980026 953472 933602 919741
$$ packed form
50875E48241P065P927R407J1323J3055J4238J5363J7151J9485K1612K3416K5693
50863G33976K9062L3246L7712M2431M7685N3578O0076O7345P5708Q5271R5684
50852A361774J06245J16312J25703J34620J43146J50991J57774J63207J66763
50843B626535J67548J64705J57705J46087J29477J08249Q3796N7774L1394N686
50833C678956j8091l8916n6481p0734q1211q7300q8810q5913p9016o9204n8295
50822B944985m7843l8536l1099k6996k7249l1043l6601m3176n1186o0659p0781
50811B479816q0914r0851r9788j06237j09479j10248j09475j07031j02311r5557
50801A467925q7943q0476p3233o5669n7430m8892m0797l3459k6554j9870j3861
$$ plain form
50790 919741 910706 905559 903988 905818 910625 918016 927789 939362 951415 962543 972123 980261 987140
50777 987140 992700 996693 998662 998049 994617 988726 981084 972343 962971 953065 942087 929260 914568 899145
50763 899145 884311 870551 857709 845801 835122 825827 817944 811763 807838 806716 808947 815190 825809
50750 825809 840413 858220 878934 902851 930116 960380 993501 1030141 1071100 1116080 1163726
50739 1163726 1213219 1265481 1322335 1384776 1452848 1527134 1609198 1699785 1797337 1899146 2003392
50728 2003392 2108918 2213419 2313362 2405918 2489708 2563191 2623481 2667459 2693202 2699742 2686424
50717 2686424 2653590 2603448 2539430 2465041 2383977 2300689 2219634 2143880 2075014 2014165 1962299
50706 1962299 1919583 1885236 1858113 1836825 1819251 1802574 1784143 1762003 1734544 1700160 1657653
$$ packed form
50790I19741r035n147j571J830M807P391R773J1573J2053J1128R580Q138O879
50777I87140N560L993J969o13l432n891p642q741r372r906j0978j2827j4692j5423
50763H99145j4834j3760j2842j1908j0679r295p883o181l925j122K231O243J0619
50750H25809J4604J7807K0714K3917K7265L0264L3121L6640M0959M4980M7646
50739A163726M9493N2262N6854O2441O8072P4286Q2064R0587R7552J01809J04246
50728B003392J05526J04501R9943R2556Q3790P3483O0290M3978K5743O540j3318
50717B686424l2834n0142o4018p4389q1064q3288q1055p5754o8866o0849n1866
50706A962299m2716l4347k7123k1288j7574j6677j8431k2140k7459l4384m2507
$$ plain form
50695 1657653 1606932 1549169 1486247 1420061 1352252 1284548 1218988 1157411 1100695 1048914 1002288
50684 1002288 961452 926682 897549 873768 855789 843940 837409 834800 835589 840447 850192 864964
50672 864964 884450 908417 936709 968778 1003295 1038380 1072546 1105470 1137519 1168424 1196977
50661 1196977 1222220 1244359 1264073 1281479 1296376 1309129 1320621 1331470 1341826 1351808 1361669 1371630
50649 1371630 1381956 1393161 1405874 1420668 1438212 1459286 1484269 1512909 1544914 1580316 1618837
50638 1618837 1659322 1700450 1741672 1782852 1823243 1861518 1896661 1928223 1955790 1978879 1997376
50627 1997376 2011555 2021562 2027334 2028989 2026980 2021958 2014948 2007624 2002008 1999826 2002320 2010288 2023797
50614 2023797 2041983 2063485 2086837 2110082 2130613 2146343 2157032 2163822 2167421 2167254 2162214 2151449
$$ packed form
50695A657653n0721n7763o2922o6186o7809o7704o5560o1577n6716n1781m6626
50684A002288m0836l4770k9133k3781j7979j1849o531k609P89M858R745J4772
50672H64964J9486K3967K8292L2069L4517L5085L4166L2924L2049L0905K8553
50661A196977K5243K2139J9714J7406J4897J2753J1492J0849J0356R982R861R961
50649A371630J0326J1205J2713J4794J7544K1074K4983K8640L2005L5402L8521
50638A618837M0485M1128M1222M1180M0391L8275L5143L1562K7567K3089J8497
50627A997376J4179J0007N772J655k009n022p010p324n616k182K494P968J3509
50614B023797J8186K1502K3352K3245K0531J5730J0689O790L599j67n040j0765
$$ plain form
50602 2151449 2134283 2109979 2077900 2037664 1989249 1933301 1871166 1804117 1732717 1657577 1580606
50591 1580606 1504736 1432187 1363511 1298359 1236594 1178485 1124450 1074900 1030031 989557 952894
50580 952894 919564 889249 861707 837091 816198 799714 787276 777817 770721 766028 763675 763445 765752
50567 765752 771483 780661 792013 804377 817940 833617 851768 872083 894377 918874 945858 975443
50555 975443 1007634 1042364 1079500 1118896 1160298 1203180 1246876 1290871 1334612 1377072 1417052
50544 1417052 1454088 1488728 1521798 1553852 1585526 1617845 1651712 1687331 1724506 1763325 1804274
50533 1804274 1847883 1894564 1944696 1998580 2056229 2117325 2181436 2248330 2318110 2390885 2466202
50522 2466202 2543031 2620460 2698086 2775260 2850174 2920240 2983229 3037537 3081495 3113293 3131747
$$ packed form
50602B151449j7166k4304l2079m0236m8415n5948o2135o7049p1400p5140p6971
50591A580606p5870p2549o8676o5152o1765n8109n4035m9550m4869m0474l6663
50580I52894l3330l0315k7542k4616k0893j6484j2438r459p096m693k353k30K307
50567G65752N731R178J1352J2364J3563J5677J8151K0315K2294K4497K6984K9585
50555I75443L2191L4730L7136L9396M1402M2882M3696M3995M3741M2460L9980
50544A417052L7036L4640L3070L2054L1674L2319L3867L5619L7175L8819M0949
50533A804274M3609M6681N0132N3884N7649O1096O4111O6894O9780P2775P5317
50522B466202P6829P7429P7626P7174P4914P0066O2989N4308M3958L1798J8454
$$ plain form
50511 3131747 3136532 3127428 3104009 3066347 3015460 2952731 2879479 2797657 2710529 2622103 2536091 2455694
50499 2455694 2383908 2323278 2275266 2240234 2217958 2207906 2209146 2220355 2240036 2266559 2298067
50488 2298067 2332513 2367736 2401245 2429809 2449251 2454930 2442972 2411637 2361628 2294949 2213741
50477 2213741 2120555 2019348 1915036 1811501 1710478 1612639 1519072 1431109 1349289 1273397
50467 1273397 1203514 1140286 1084090 1034468 990648 952273 919384 891913 869452 851365 836955
50456 836955 825573 816829 810769 807755 808025 811370 817374 825946 837408 851896 868873 887492 907392
50443 907392 928854 952163 977092 1003114 1029911 1057522 1086163 1116047 1147224 1179374 1211764
50432 1211764 1243553 1274322 1304302 1333922 1363053 1390883 1416721 1440811 1463941 1486363 1507578
$$ packed form
50511C131747M785r104k3419l7662n0887o2729p3252q1822q7128q8426q6012q0397
50499B455694p1786o0630m8012l5032k2276j0052J240J1209J9681K6523L1508
50488B298067L4446L5223L3509K8564J9442N679j1958l1335n0009o6679q1208
50477B213741r3186j01207j04312j03535j01023r7839r3567q7963q1820p5892
50467A273397o9883o3228n6196m9622m3820l8375l2889k7471k2461j8087j4410
50456H36955j1382q744o060l014K70L345O004Q572J1462J4488J6977J8619J9900
50443I07392K1462K3309K4929K6022K6797K7611K8641K9884L1177L2150L2390
50432A211764L1789L0769K9980K9620K9131K7830K5838K4090K3130K2422K1215
$$ plain form
50421 1507578 1527275 1545884 1563891 1581235 1597955 1615112 1634426 1657118 1683455 1713111 1745373
50410 1745373 1779196 1813703 1848572 1883578 1917937 1950692 1981469 2010051 2035329 2055540 2069733
50399 2069733 2078255 2081543 2078986 2069255 2051200 2024166 1987890 1942444 1888085 1825241 1755061 1679899
50387 1679899 1602620 1525364 1449583 1377270 1311159 1253209 1203600 1161643 1127148 1100426 1081588
50376 1081588 1070580 1067555 1072535 1084723 1102573 1124395 1148573 1173287 1196379 1215515 1228513 1233800
50364 1233800 1230824 1219892 1201610 1176708 1146360 1112120 1075372 1037183 998730 961320 925687
50353 925687 891815 859705 829817 802416 777092 753405 731581 712004 694414 678262 663634
50342 663634 651215 641359 633694 627715 623340 620765 619979 620629 622350 625270 630021 636996 645698 655189
$$ packed form
50421A507578J9697J8609J8007J7344J6720J7157J9314K2692K6337K9656L2262
50410A745373L3823L4507L4869L5006L4359L2755L0777K8582K5278K0211J4193
50399B069733Q522L288k557r731j8055k7034l6276m5446n4359o2844p0180p5162
50387A679899p7279p7256p5781p2313o6111n7950m9609m1957l4495k6722j8838
50376A081588j1008l025M980J2188J7850K1822K4178K4714K3092J9136J2998N287
50364A233800k976j0932j8282k4902l0348l4240l6748l8189l8453l7410l5633
50353I25687l3872l2110k9888k7401k5324k3687k1824j9577j7590j6152j4628
50342F63634j2419r856p665n979m375k575p86O50J721K920M751O975Q702R491
$$ plain form
50328 655189 665184 676248 688846 702673 717150 732090 747582 763686 780578 798598 817791 837679
50316 837679 857756 877896 898073 918119 938069 958275 978747 998730 1017285 1033965 1048654
50305 1048654 1061314 1072353 1082765 1093193 1103068 1111170 1116774 1119798 1120180 1117881 1113409 1107719 1101459
50292 1101459 1094579 1086585 1076818 1064626 1049673 1032126 1012380 990729 967405 942639 916529 889235
50280 889235 861562 834843 809874 786495 764595 744784 727299 710903 694009 676658 660377
50269 660377 646141 633477 621679 610864 601501 593740 587614 583220 580205 577682 575142 573101 572312
50256 572312 572694 573494 574282 575252 576607 578107 579345 580167 580685 580987 581037 580827 580513 580250 579903 579065 577356 574646
50238 574646 571039 566848 562609 558774 555298 551735 547863 543934 540217 536691 533356 530437 527966 525609
$$ packed form
50328F55189R995J1064J2598J3827J4477J4940J5492J6104J6892J8020J9193J9888
50316H37679K0077K0140K0177K0046J9950K0206K0472J9983J8555J6680J4689
50305A048654J2660J1039J0412J0428R875Q102N604L024L82k299m472n690o260
50292A101459o880p994r767j2192j4953j7547j9746k1651k3324k4766k6110k7294
50280H89235k7673k6719k4969k3379k1900j9811j7485j6396j6894j7351j6281
50269F60377j4236j2664j1798j0815r363p761o126m394l015k523k540k041p89
50256E72312L82Q00P88R70J355J500J238Q22N18L02N0k10l14k63l47q38j709k710
50238E74646l607m191m239l835l476l563l872l929l717l526l335k919k471k357
$$ plain form
50224 525609 523300 521631 521154 521662 522713 524509 527566 531682 535952 539810 543464 547270 551244 555220 559007
50209 559007 562301 564924 567207 569708 572483 575031 576916 577974 577977 576702 574392 571555 568155 563662 558057
50194 558057 552206 546919 542216 537882 534146 531295 529022 526606 523502 519373 514000 507683 501427 496084
50180 496084 491427 486581 481286 476127 471602 467635 464198 461801 460963 461529 462896 464675 466723 468683 469936
50165 469936 470024 468819 466205 461946 456013 448902 441419 434278 427913 422429 417574 412951 408540 404850 402295
50150 402295 400583 399019 397301 395673 394356 393288 392485 392187 392472 393040 393521 393717 393416 392404 390907 389708
50134 389708 389496 390355 392087 394670 398057 401860 405686 409593 413801 418138 422270 426387 431240 437370 444599
50119 444599 452215 459389 465467 470336 474578 478981 483711 488185 491839 494789 497566 500358 502796 504508
$$ packed form
50224E25609k309j669m77N08J051J796L057M116M270L858L654L806L974L976L787
50209E59007L294K623K283K501K775K548J885J058Lj275k310k837l400m493n605
50194E58057n851n287m703m334l736k851k273k416l104m129n373o317o256n343
50180D96084m657m846n295n159m525l967l437k397q38N66J367J779K048J960J253
50165D69936Q8j205k614m259n933p111p483p141o365n484m855m623m411l690k555
50150D02295j712j564j718j628j317j068q03k98K85N68M81J96l01j012j497j199
50134C89708k12Q59J732K583L387L803L826L907M208M337M132M117M853O130P229
50119D44599P616P174O078M869M242M403M730M474L654K950K777K792K438J712
$$ plain form
50105 504508 505674 506811 508044 508893 508986 508728 508902 509785 511064 512555 514389 516430 518199 519667 521601 524683
50089 524683 528760 533338 538340 543813 549362 554578 559823 565860 572802 580010 587047 594133 601644 609760
50075 609760 618754 629109 641002 653890 666845 679170 690667 701477 711811 721828 731740 741848
50063 741848 752182 762173 771240 779851 789387 800532 812271 823016 832253 840454 847892 854565 861077
50050 861077 868457 876765 884718 891126 896161 900874 905914 911161 916231 920956 925531 930602 937152 946115
50036 946115 958027 973006 990977 1011982 1036456 1065129 1098394 1135675 1175392 1215346 1253010
50025 1253010 1285902 1312330 1331910 1345267 1353404 1357654 1359914 1362308 1366462 1373254 1382921 1394880 1407450
50012 1407450 1418177 1424434 1423664 1413590 1393003 1362426 1323543 1278147 1227998 1175237 1122058 1069909
$$ packed form
50105E04508J166J137J233Q49R3k58J74Q83J279J491J834K041J769J468J934L082
50089E24683M077M578N002N473N549N216N245O037O942P208P037P086P511Q116
50075F09760Q994J0355J1893J2888J2955J2325J1497J0810J0334J0017R912J0108
50063G41848J0334R991R067Q611R536J1145J1739J0745R237Q201P438O673O512
50050H61077P380Q308P953O408N035M713N040N247N070M725M575N071O550Q963
50036I46115J1912J4979J7971K1005K4474K8673L3265L7281L9717L9954L7664
50025A253010L2892K6428J9580J3357Q137M250K260K394M154O792R667J1959J2570
50012A407450J0727O257p70j0074k0587l0577l8883m5396n0149n2761n3179n2149
$$ plain form
50000 1069909 1019645 972292 928868 889480 853435 820274 789919 761830 735126 709847 687025
49989 687025 666975 648486 630399 613175 598030 585091 573324 561976 551256 541664 533374 526273
49977 526273 520078 514361 508844 503752 499602 496666 494746 493281 491586 489291 486824 485151 484644 484462 483382
49962 483382 481059 478122 475286 472849 470950 469679 468778 467595 465654 463190 460981 459663 459259 459353 459647
49947 459647 460197 461102 462190 463265 464497 466269 468733 471796 475493 479986 485259 491287 498437 507219 517559
49932 517559 528875 540928 554074 568484 583766 599711 616844 635841 656833 679733 704850
49921 704850 732742 763837 798696 838285 883438 934283 990602 1052361 1119197 1189455 1260258
49910 1260258 1328584 1392012 1448843 1498264 1540616 1577144 1609440 1639278 1668545 1698633 1729831
$$ packed form
50000A069909n0264m7353m3424l9388l6045l3161l0355k8089k6704k5279k2822
49989F87025k0050j8489j8087j7224j5145j2939j1767j1348j0720r592q290p101
49977E26273o195n717n517n092m150k936j920j465j695k295k467j673n07j82j080
49962D83382k323k937k836k437j899j271r01j183j941k464k209j318m04R4K94
49947D59647N50R05J088J075J232J772K464L063L697M493N273O028P150Q782J0340
49932E17559J1316J2053J3146J4410J5282J5945J7133J8997K0992K2900K5117
49921G04850K7892L1095L4859L9589M5153N0845N6319O1759O6836P0258P0803
49910A260258O8326O3428N6831M9421M2352L6528L2296K9838K9267L0088L1198
$$ plain form
49899 1729831 1761729 1793959 1825722 1854457 1875850 1885805 1882210 1864795 1834139 1791533 1739310 1680236
49887 1680236 1616380 1548980 1479424 1409638 1341176 1274421 1209120 1145460 1084160 1025763 970470
49876 970470 918673 871026 827713 788128 751695 718618 689331 663459 639932 618109 598282
49865 598282 580929 565927 552691 540782 530067 520463 511781 503776 496289 489323 482952 477013 470960
49852 470960 464283 457083 449998 443566 437816 432485 427367 422417 417754 413544 409700 405729 401233 396503
49838 396503 392242 388654 385211 381477 377799 374969 373456 373078 373191 373031 372245 371238 370784 371161 371983 372897
49822 372897 374051 375625 377348 378855 380289 382162 384779 388105 392122 397001 402905 409737 417028 424123
49808 424123 430708 437291 444873 453992 464300 475246 486901 499860 514632 531471 550710 572903
$$ packed form
49899A729831L1898L2230L1763K8735K1393R955l595j7415l0656m2606n2223n9074
49887A680236o3856o7400o9556o9786o8462o6755o5301o3660o1300n8397n5293
49876I70470n1797m7647m3313l9585l6433l3077k9287k5872k3527k1823j9827
49865E98282j7353j5002j3236j1909j0715r604q682q005p487o966o371n939o053
49852D70960o677p200p085o432n750n331n118m950m663m210l844l971m496m730
49838C96503m261l588l443l734l678k830j513l78J13j60p86j007m54L77Q22R14
49822C72897J154J574J723J507J434J873K617L326M017M879N904O832P291P095
49808D24123O585O583P582R119J0308J0946J1655J2959J4772J6839J9239K2193
$$ plain form
49796 572903 598584 628080 661549 699085 740726 786316 835156 885700 935730 982993 1025665
49785 1025665 1062283 1091630 1113095 1127325 1136450 1143452 1150865 1159797 1170183 1181922 1195201 1209263
49773 1209263 1221317 1227540 1225191 1213171 1190726 1156858 1111648 1057425 997861 936253 875094 816625
49761 816625 762710 714098 670512 631685 597834 569037 544636 523562 505001 488511 473691
49750 473691 460129 447782 437149 428758 422466 417484 413187 409565 406739 404384 402095 400080 398895
49737 398895 398596 398728 399110 399956 401091 401790 401781 401800 402657 404157 405385 405711 405066 403515 401153 398345 395667
49720 395667 393503 391884 390593 389315 387818 386192 384803 383875 383267 382761 382361 382236 382536 383326 384531 385899
49704 385899 387196 388419 389599 390534 391116 391755 392922 394327 395231 395650 396489 398276 400432 402131 403267 404166
$$ packed form
49796E72903K5681K9496L3469L7536M1641M5590M8840N0544N0030M7263M2672
49785A025665L6618K9347K1465J4230R125P002P413Q932J0386J1739J3279J4062
49773A209263J2054O223k349j2020k2445l3868m5210n4223n9564o1608o1159n8469
49761H16625n3915m8612m3586l8827l3851k8797k4401k1074j8561j6490j4820
49750D73691j3562j2347j0633q391o292m982m297l622k826k355k289k015j185
49737C98895k99J32L82Q46J135O99rJ9Q57J500J228L26o45j551k362k808k678
49720C95667k164j619j291j278j497j626j389r28o08n06m00j25L00P90J205J368
49704C85899J297J223J180R35N82O39J167J405R04M19Q39J787K156J699J136Q99
$$ plain form
49688 404166 404964 405752 406855 408428 410105 411496 412658 413766 414695 415288 415681 416029 416332 416742 417533 418460 418791
49671 418791 418365 418038 418638 420107 422094 424544 427068 428545 428396 427709 428030 429423 430706 431307 431776 432559
49655 432559 433423 434252 435463 437241 439010 440045 440200 439806 439214 438607 438016 437438 437010 436949 437186 437389 437569 438263
49637 438263 439763 441632 443398 445161 446930 447944 447535 446322 445622 445884 446537 447202 448131 449518 451287 453616
49621 453616 456834 460609 464043 466723 469116 471761 474761 478135 481993 486121 490001 493482 497004 501039
49607 501039 505702 510938 516581 522283 528016 534667 543438 554436 566395 577953 588724 599065 609435
$$ packed form
49688D04166P98P88J103J573J677J391J162J108R29N93L93L48L03M10P91R27L31
49671D18791m26l27O00J469J987K450K524J477j49o87L21J393J283O01M69P83
49655D32559Q64Q29J211J778J769J035J55l94n92o07n91n78m28o1K37K03J80O94
49637D38263J500J869J766J763J769J014m09j213p00K62O53O65R29J387J769K329
49621D53616L218L775L434K680K393K645L000L374L858M128L880L481L522M035
49607E01039M663N236N643N702N733O651Q771J0998J1959J1558J0771J0341J0370
$$ [...]
##END NTUPLES=NMR SPECTRUM
##END=
