
##TITLE=AC1249_NSDAH12039_6945181_DXTpwpUtfk
##JCAMPDX= 6.0         $$ Bruker NMR JCAMP-DX V2.0
##DATA TYPE= NMR SPECTRUM
##DATA CLASS= NTUPLES
##ORIGIN= BRUKER
##OWNER= Administrator
$$ 1.72 TOPSPIN		Version 2.1
$$ 2012-10-18 13:45:44.333 -0700  Administrator@X
$$ Compression mode = diff/dup
##.OBSERVE FREQUENCY= 400.02188249412
##.OBSERVE NUCLEUS= ^1H
##.ACQUISITION MODE= SIMULTANEOUS (DQD)
##.ACQUISITION SCHEME= undefined
##.AVERAGES= 8
##.DIGITISER RES= 22
##SPECTROMETER/DATA SYSTEM= spect
##.PULSE SEQUENCE= zg30
##.SOLVENT NAME= COFFEE_meoh
##.SHIFT REFERENCE= INTERNAL, COFFEE_meoh, 1, 14.98509
##AUDIT TRAIL= $$ (NUMBER, WHEN, WHO, WHERE, PROCESS, VERSION, WHAT)
$$ ##TITLE= Audit trail, TOPSPIN		Version 2.1
$$ ##JCAMPDX= 5.01
$$ ##ORIGIN= Bruker BioSpin GmbH
$$ ##OWNER= Administrator
$$ $$ C:\Bruker\TOPSPIN/data/COFFEE/nmr/AC1249_NSDAH12039_6945181_DXTpwpUtfk/10/pdata/1/auditp.txt
$$ ##AUDIT TRAIL=  $$ (NUMBER, WHEN, WHO, WHERE, PROCESS, VERSION, WHAT)
(   1,<2012-10-13 19:15:52.328 -0500>,<Administrator>,<TOPSPIN>,<go>,<TOPSPIN 2.1>,
      <created by zg
	started at 2012-10-13 19:14:45.468 -0500,
	POWCHK enabled, PULCHK disabled,
       configuration hash MD5:
       6B 1B 68 BB D9 2E 58 E2 7F 35 AD 54 07 DF 0E 41
       data hash MD5: 64K
       8D 06 07 3D 1B EB 87 21 FD C0 10 BB 25 0E BE E3>)
(   2,<2012-10-13 19:15:54.984 -0500>,<Administrator>,<TOPSPIN>,<proc1d>,<TOPSPIN 2.1>,
      <Start of raw data processing
       efp LB = 0 FT_mod = 6 PKNL = 1 PHC0 = 0 PHC1 = 0 SI = 32K 
       data hash MD5: 32K
       94 E9 92 7A E6 B2 68 3B F9 49 12 88 85 39 19 A5>)
(   3,<2012-10-13 19:15:55.406 -0500>,<Administrator>,<TOPSPIN>,<proc1d>,<TOPSPIN 2.1>,
      <pk PHC0 = 182.2192 PHC1 = 0 
       data hash MD5: 32K
       94 3B 15 E5 A0 4D DF 70 8B 4B F3 F2 CD 75 21 B1>)
(   4,<2012-10-13 19:15:55.453 -0500>,<Administrator>,<TOPSPIN>,<proc1d>,<TOPSPIN 2.1>,
      <abs ABSG = 1 
       data hash MD5: 32K
       E2 38 FB 55 FB 02 B8 65 44 4F 8D A8 A5 E5 6B 52>)
(   5,<2012-10-13 19:15:55.484 -0500>,<Administrator>,<TOPSPIN>,<proc1d>,<TOPSPIN 2.1>,
      <abs ABSG = 2 
       data hash MD5: 32K
       6B 07 52 FE 73 A9 DA 06 A7 CF 5A C2 C0 32 C1 68>)
(   6,<2012-10-13 19:15:55.515 -0500>,<Administrator>,<TOPSPIN>,<proc1d>,<TOPSPIN 2.1>,
      <abs ABSG = 3 
       data hash MD5: 32K
       E1 98 D1 20 0F 38 E6 BE 0A 44 3D A4 2D C3 BC 93>)
(   7,<2012-10-13 19:15:55.546 -0500>,<Administrator>,<TOPSPIN>,<proc1d>,<TOPSPIN 2.1>,
      <abs ABSG = 4 
       data hash MD5: 32K
       A1 28 93 86 24 3B 5F 32 30 BF 2A 15 C9 36 37 90>)
(   8,<2012-10-13 19:15:55.578 -0500>,<Administrator>,<TOPSPIN>,<proc1d>,<TOPSPIN 2.1>,
      <abs ABSG = 5 
       data hash MD5: 32K
       57 CF E5 2D E2 A4 7A DB 3C BC 75 D4 9A 34 56 47>)
(   9,<2012-10-13 19:15:59.218 -0500>,<Administrator>,<TOPSPIN>,<audit>,<TOPSPIN 2.1>,
      <user comment:
       ICON-NMR User ID: COFFEE
       data hash MD5: 32K
       57 CF E5 2D E2 A4 7A DB 3C BC 75 D4 9A 34 56 47>)
$$ ##END=
$$ [...]
150 150 150 150 150 150 150 150
##$TP07= 0
##$TPNAME0= <>
##$TPNAME1= <>
##$TPNAME2= <>
##$TPNAME3= <>
##$TPNAME4= <>
##$TPNAME5= <>
##$TPNAME6= <>
##$TPNAME7= <>
##$TPOAL= (0..7)
0.5 0.5 0.5 0.5 0.5 0.5 0.5 0.5
##$TPOFFS= (0..7)
0 0 0 0 0 0 0 0
##$TUNHIN= 0
##$TUNHOUT= 0
##$TUNXOUT= 0
##$USERA1= <user>
##$USERA2= <user>
##$USERA3= <user>
##$USERA4= <user>
##$USERA5= <user>
##$V9= 5
##$VALIST= <valist>
##$VCLIST= <CCCCCCCCCCCCCCC>
##$VD= 0
##$VDLIST= <DDDDDDDDDDDDDDD>
##$VPLIST= <PPPPPPPPPPPPPPP>
##$VTLIST= <TTTTTTTTTTTTTTT>
##$WBST= 2048
##$WBSW= 25
##$XGAIN= (0..3)
0 0 0 0
##$XL= 0
##$YL= 0
##$YMAX_a= 497898
##$YMIN_a= -640413
##$ZGOPTNS= <>
##$ZL1= 120
##$ZL2= 120
##$ZL3= 120
##$ZL4= 120
##$ABSF1= 14.98509
##$ABSF2= -5.573092
##$ABSG= 5
##$ABSL= 3
##$ALPHA= 0
##$AQORDER= 0
##$ASSFAC= 0
##$ASSFACI= 0
##$ASSFACX= 0
##$ASSWID= 0
##$AUNMP= <proc_prof1d_extract_pilot.lims>
##$AXLEFT= 0
##$AXNAME= <>
##$AXNUC= <1H>
##$AXRIGHT= 0
##$AXTYPE= 0
##$AXUNIT= <>
##$AZFE= 0.1
##$AZFW= 0.1
##$BCFW= 0
##$BC_mod= 0
##$BYTORDP= 0
##$COROFFS= 0
##$CY= 15
##$DATMOD= 1
##$DC= 0
##$DFILT= <>
##$DTYPP= 0
##$F1P= 0
##$F2P= 0
##$FCOR= 0.5
##$FTSIZE= 32768
##$FT_mod= 6
##$GAMMA= 0
##$GB= 0
##$INTBC= 1
##$INTSCL= 1
##$ISEN= 128
##$LB= 0
##$LEV0= 0
##$LPBIN= 0
##$MAXI= 10000
##$MC2= 0
##$MEAN= 0
##$ME_mod= 0
##$MI= 0
##$NCOEF= 0
##$NC_proc= -8
##$NLEV= 6
##$NOISF1= 0
##$NOISF2= 0
##$NSP= 0
##$NTH_PI= 0
##$NZP= 0
##$OFFSET= 14.98509
##$PC= 1
##$PHC0= 182.2192
##$PHC1= 0
##$PH_mod= 1
##$PKNL= yes
##$PPARMOD= 0
##$PPDIAG= 0
##$PPIPTYP= 0
##$PPMPNUM= 2147483647
##$PPRESOL= 1
##$PSCAL= 4
##$PSIGN= 0
##$PYNMP= <proc.py>
##$REVERSE= no
##$SF= 400.02
##$SI= 32768
##$SIGF1= 0
##$SIGF2= 0
##$SINO= 400
##$SIOLD= 32768
##$SPECTYP= <>
##$SREGLST= <1H.CDCl3>
##$SSB= 0
##$STSI= 32768
##$STSR= 0
##$SW_p= 8223.68421052631
##$SYMM= 0
##$S_DEV= 0
##$TDeff= 65536
##$TDoff= 0
##$TI= <>
##$TILT= no
##$TM1= 0
##$TM2= 0
##$TOPLEV= 0
##$USERP1= <user>
##$USERP2= <user>
##$USERP3= <user>
##$USERP4= <user>
##$USERP5= <user>
##$WDW= 1
##$XDIM= 32768
##$YMAX_p= 450780405
##$YMIN_p= -707670
##$CURPLOT= <Network HP LaserJet P1505>
##$CURPRIN= <$Network HP LaserJet P1505>
##$DFORMAT= <normdp>
##$LAYOUT= <+/1D_H.xwp>
##$LFORMAT= <normlp>
##$PFORMAT= <normpl>
##$SURQMSG= 1
$$ End of Bruker specific parameters
$$ ---------------------------------
##NTUPLES= NMR SPECTRUM
##VAR_NAME=  FREQUENCY,     SPECTRUM/REAL,   SPECTRUM/IMAG
##SYMBOL=    X,             R,               I
##VAR_TYPE=  INDEPENDENT,   DEPENDENT,       DEPENDENT
##VAR_FORM=  AFFN,          ASDF,            ASDF
##VAR_DIM=   32768,         32768,           32768
##UNITS=     HZ,            ARBITRARY UNITS, ARBITRARY UNITS
##FACTOR=    0.250966925370066, 1,           1
##FIRST=     8223.43324360094, -182745,      -194717
##LAST=      0,             25953,           -133237
##MIN=       0,             -707670,         0
##MAX=       8223.43324360094, 450780405,    0
$$ Real data points
##PAGE= N=1
##DATA TABLE= (X++(R..R)), XYDATA
$$ [...]
19539c85308a6027m12765J84488b5322j08863E6372f4845k54830A5211a04618
19528B24895b19275R7984N9894p6281B43138a29146M2708B5534M8439B0809J11468
19517A32277b05282l0423A4715a56525B2781J7872c83555J36647G4155f4265H1663
19505b97007A11493a58228g4354j09355A0428J38799c49471J44805E683a85276
19494a28j0126k216j39674c9723D7741b63504J14990A57697L1407n0621B9211
19482A23210C9387a5443j52130I3760l513j0419b34120h653p5324b5915m89674
19471e15589b15193p452j40158I1646g2487m5530J6029B04529a94316q986i9663
19459a00496A57689E2749b13692b9173B45126I3618a03718l336D9322f8750j34944
$$ plain form
19539 -385308 -16027 -428792 -244304 -25322 -134185 56372 -64845 -319675 15211 -104618
19528 224895 -219275 -121291 -61397 -137678 243138 -129146 -86438 25534 73973 20809 132277
19517 132277 -205282 -235705 14715 -156525 22781 40653 -383555 -246908 74155 -64265 81663
19505 -297007 111493 -158228 -74354 -183709 10428 149227 -349471 -204666 5683 -185276
19494 -128 -10254 -12470 -152144 -39723 47741 -263504 -148514 157697 189104 138483 29211
19482 123210 39387 -15443 -167573 93760 90247 79828 -234120 -8653 -83977 -25915 -515589
19471 -515589 -215193 -222645 -362803 91646 -72487 -118017 -101988 204529 -194316 -203302 -99663
19459 -100496 157689 52749 -213692 -29173 245126 93618 -103718 -107054 49322 -68750 -203694
19448b03694b3707m893Q527k21818A34846o2395f5150l3341M6003q4592k39849
19437c76929J32998J605a7526l6193B48405i3919k17071G4436O7586J78710d30815
19425a53017M9396C596M6125a28505C5957b19802O0237d0299a6757m108A40558
19413a90771e9149j64669j06157D6030B0061J05956c40553G1336a44568G3668
19402a27654A06206Q1720g5154b5456C10658B1931b85643A62893a16589F08f006
19390F1653O9278a52204j16826C7866e8741l9229d2888A01804i306H767J00127
19379A08894i1767j27247N5111B8230K5809f4672b0151j95228R9064B08498f4984
19367A7017g4672q7114g1066L3063i536n08449K50539f1755l80032e6516B1352
$$ plain form
19448 -203694 -23707 -28600 -20073 -241891 134846 72451 -65150 -98491 -52488 -137080 -376929
19437 -376929 -243931 -242326 -17526 -53719 248405 -93919 -310990 74436 142022 320732 -430815
19425 -153017 -103621 3596 49721 -128505 35957 -219802 -159565 -40299 -16757 -20865 140558
19413 -190771 -59149 -223818 -329975 46030 20061 126017 -340553 71336 -144568 73668
19402 -127654 106206 187926 -75154 -25456 310658 21931 -285643 162893 -116589 608 -6006
19390 61653 130931 -152204 -269030 37866 -58741 -97970 -42888 101804 -9306 8767 108894
19379 108894 -91767 -219014 -163903 28230 54039 -64672 -20151 -215379 -116315 208498 -64984
19367 17017 -74672 -161786 -71066 -38003 -9536 -517985 -267446 -61755 -441787 -56516 21352
19355d7631n4205c503r3639k14751R5176c175B22442b7223l27860J19138N1925
19344a84020k02792a29090A41389J21019D055A122b3026G5618a02570C7093j2115
19333B4978a33592B06802H0370C998O441i132B4800N9355J2490c60527h4287c9953
19320b31697C60260F3933N3194e25996J82675d4182K1839I0569b15992A62444
19309I6467c61899A3991b91665A86401a87070D7364J39564c42293J16173i0970
19298E8987c4778l45492E3233A3550M2980a79814A34227n3998K32865d13116e5863
19286a62956O8326c1564j42146h1505j19875O8248D1371a73210f790l29642J21344
19275b15088d8380l60575a83754I357a06226q3513P6591a9332j59874b5662B65213
$$ plain form
19355 -47631 -101836 -3503 -97142 -311893 -216717 -3175 222442 -27223 -355083 -235945 -184020
19344 -184020 -386812 -129090 141389 262408 4055 1122 -23026 75618 -102570 37093 24978
19333 24978 -133592 206802 80370 3998 10439 -9132 24800 84155 96645 -360527 -84287 -39953
19320 -231697 360260 63933 117127 -525996 -343321 -44182 -22343 90569 -215992 162444
19309 96467 -361899 13991 -291665 186401 -187070 47364 186928 -342293 -226120 -90970
19298 58987 -34778 -380270 53233 13550 56530 -179814 134227 80229 313094 -413116 -55863
19286 -162956 -94630 -31564 -173710 -81505 -201380 -133132 41371 -173210 -6790 -336432 -215088
19275 -215088 -48380 -408955 -183754 9357 -106226 -189739 -113148 -19332 -179206 -25662 265213
19263b205I3170m5193a1125l4941H7171b27118A66357g5134H8266j973a08712
19251a25980I5054j1381K585b69862A23950a03082o7346B41619b51980J24532
19241a27448D5898N5599D2539A0656g3565j33833A52314F2435b14012D7435c99855
19229h4138E993M3894a31617F3611J64913a24657A61420a78545O6498G883i9126
19217C4965K26419o2774H6771b77433M6035B05468a47875j06376g610B01179n6762
19206A44417d24123A05053P8690a95469G4453J7986f1485l27924A4824b84537
19195a39555j02448i2027i458j62195A63047b72352C44717b6916j69808E4461
19184D5031h5096I8640M8297b15535f8199j71832M9983c9294B23298a3781A16493
$$ plain form
19263 -2205 93170 47977 -11125 -46066 87171 -227118 166357 -75134 88266 86293 -108712
19251 -125980 95054 83673 86258 -269862 123950 -103082 -170428 241619 -251980 -127448
19241 -127448 45898 101497 42539 10656 -73565 -207398 152314 62435 -214012 47435 -399855
19229 -84138 5993 49887 -131617 63611 228524 -124657 161420 -178545 -112047 7883 -99126
19217 34965 261384 198610 86771 -277433 -231398 205468 -147875 -254251 -7610 201179 144417
19206 144417 -424123 105053 183743 -195469 74453 92439 -61485 -389409 14824 -284537
19195 -139555 -242003 -92027 -9458 -171653 163047 -272352 344717 -26916 -196724 54461
19184 45031 -85096 98640 146937 -215535 -68199 -240031 -190048 -39294 223298 -13781 116493
19172d33402J76025C0845b15159C2126i3401B30479I5590f8437A49098J43959
19162B93057d6739B1465K85345b3997o4982r755i704j16156n7217L8848c2681
19150c8736A58001c05746a30771A65084o8935a97359B1954a51272A86821d00877
19139A63933O300b46816e2406r9903K1831G9908P3505b76073a7205r9969d1015
19127H9922a88256B27594a07510j03857d2866j81339g5997J2526C77788i6936
19116C7326a59469k4437H3017h1002A85180a08394B09367C7148M89368A48175
19105B27228b20066c2264n2035o7819i617j29070A3728a42508F6525d99619d200
19093B5579Q2616a57591G9639e5495j13032I922J05408b882k25318q5854N7354
$$ plain form
19172 -433402 -257377 30845 -215159 32126 -93401 230479 95590 -68437 149098 293057
19162 293057 -46739 21465 306810 -23997 -88979 -98734 -9704 -125860 -183077 -144229 -32681
19150 -38736 158001 -305746 -130771 165084 96149 -197359 21954 -151272 186821 -400877
19139 163933 170233 -246816 -52406 -152309 -130478 79908 153413 -276073 -17205 -117174 -41015
19127 89922 -188256 227594 -107510 -211367 -42866 -224205 -75997 -63471 377788 -96936
19116 37326 -159469 -183906 83017 -81002 185180 -108394 209367 37148 526516 148175
19105 227228 -220066 -32264 -84299 -152118 -9617 -138687 13728 -142508 66525 -499619 -4200
19093 25579 108195 -157591 79639 -55495 -168527 9922 115330 -2882 -228200 -314054 -256700
19082b56700B81260b77183F1946M0352J17534c4493P064k45851J29705A3394c2296
19070a23191A7622O1341a17770j23800M2796F9126k3434P5721a28005k32335e0787
19058H1453b63458o72A59116a94365e3003G5410a6724j13563e9411A7792L4876
19047E2668d1413H2833i3985a525j20215j22408B9459e6883r9395C2396b01494
19035f7725j45416A60738D5550b69035B07788d5157q281A73553k0189K9714i9410
19023f3238B2982J03108a9749k92656o0601D5872c77400a5523A78227l1136C1347
19011I2928b36615a06288C4902K9113b70643o5819C38404h2955A43928b64800
19000c0206j61099A35198a03874j52090P6440P7188d024B5527K42569e8974A06411
$$ plain form
19082 -256700 281260 -277183 61946 102298 219832 -34493 -27429 -273280 -143575 13394 -32296
19070 -123191 17622 78963 -117770 -241570 -198774 69126 45692 121413 -128005 -360340 -50787
19058 81453 -263458 -264130 159116 -194365 -53003 75410 -16724 -130287 -59411 17792 52668
19047 52668 -41413 82833 -93985 -1525 -121740 -244148 29459 -56883 -156278 32396 -201494
19035 -67725 -213141 160738 45550 -269035 207788 -45157 -53438 173553 153364 183078 -99410
19023 -63238 22982 126090 -19749 -312405 -373006 45872 -377400 -15523 178227 147091 31347
19011 92928 -236615 -106288 34902 64015 -270643 -336462 338404 -82955 143928 -264800
19000 -30206 -191305 135198 -103874 -255964 -179524 -102336 -4024 25527 268096 -58974 106411
18988e55966g6880j10224k8630p6121a28920A51985j9056i681j23146B4053J448
18977B5501a94230p1543a08855C7284e76337B39007c5337q2240J8154E2277b33289
18965A86683g8055K8157j26846f5529b5764m4373B9921a33844F2455N8784c36241
18953a06187j27336G3283c05774a27120j25550A40058a05169A02290H467R2599
18943A01066J10350c15801J05181A07139c26542c2523C8054J08688e8136C57242
18932a51994K1570B27531c83710B21183b80306A14173f7818j42321P4306p6574
18922b12407g7146A75482a01327A92063d7758o8829A20296b33349H1596b7759
18911B45784b14481j34787C3550J15837e3979C7439a40453J1686D748J72784f5350
$$ plain form
18988 -555966 -76880 -187104 -215734 -291855 -128920 151985 132929 -9681 -132827 24053 25501
18977 25501 -194230 -265773 -108855 37284 -576337 239007 -35337 -117577 -99423 52277 -233289
18965 186683 -78055 -49898 -176744 -65529 -25764 -70137 29921 -133844 62455 121239 -336241
18953 -106187 -233523 73283 -305774 -127120 -252670 140058 -105169 102290 8467 101066
18943 101066 211416 -315801 -210620 107139 -326542 -32523 38054 146742 -58136 357242
18932 -151994 -130424 227531 -383710 221183 -280306 114173 -67818 -210139 -135833 -212407
18922 -212407 -77146 175482 -101327 192063 -47758 -116587 120296 -233349 81596 -27759
18911 245784 -214481 -349268 33550 149387 -53979 37439 -140453 -128767 4748 177532 -65350
18899A3775i9476E3331c70228c5613B8324a95840l2623E0422b77849B9902a78166
18887b43409h2212E3568j8873J90916a38510j41140a02673A03531b81689a03305
18876b23526e585j65030f2572o8494e7063A19848a92059N4046A01979D8972J90100
18865B39072f3523j60966B3407a9895j7047k22547A7466g9962A93037B8524c08750
18853a36127A15454a72983D1734M2099m352g263A2968d43863h0735j9552d0378
18841F3723b48174i8905c7781A40339c66063f8939M222k29693A85931b50379h8018
18829b38017L8019P9918E0379a7486A18727a64384I6327A6899a05757C5979b9544
18817B32446N2590J90165C0521L89374A5220J08622i8628A75288m5316l9622J08242
$$ plain form
18899 13775 -99476 53331 -370228 -35613 28324 -195840 -228463 50422 -277849 29902 -178166
18887 -243409 -82212 53568 34695 225611 -138510 -279650 -102673 103531 -281689 -103305
18876 -223526 -5585 -170615 -62572 -131066 -57063 119848 -192059 -138013 101979 48972 239072
18865 239072 -63523 -224489 23407 -19895 -36942 -259489 17466 -79962 193037 28524 -308750
18853 -136127 115454 -172983 41734 83833 79481 -7263 12968 -443863 -80735 -100287 -40378
18841 63723 -248174 -98905 -37781 140339 -366063 -68939 -64717 -294410 185931 -250379 -88018
18829 -238017 -199998 -120080 50379 -17486 118727 -164384 96327 16899 -105757 35979 -29544
18817 232446 285036 475201 30521 419895 15220 123842 -98628 175288 129972 90350 198592
18806A98592J08716G6062c05254J31025A16894K2468C2317L83105d7900J4543
18796c3357l4354F5416b30394I0847b61717R8285c5181A97568E3073J47727n5476
18785A45324N2157d75594h7925A1878O4578c0294l6807D73304h1569j25105F7245
18773I7833c49210a37978P212A4076a23706K3751A83285b00431H968g8707n7491
18762a36198k41048B01138a32760h306k09237M8150P6856j27166M5664a4686B49289
18750g3444K8438l54825B88381h5253k17056c2019F5972a32515c7097Q803j06459
18739a34753E1377b44519k3963b6273m3243j92500l64532a23553b6695l33067
18729c59762a2376E4399j9541J24020c09838A09871A5610i2832B62747d1483m1309
$$ plain form
18806 198592 307308 76062 -305254 -174229 116894 139362 32317 415422 -47900 -33357
18796 -33357 -67711 65416 -230394 90847 -261717 -163432 -35181 197568 53073 200800 145324
18785 145324 197481 -475594 -87925 11878 76456 -30294 -67101 473304 -81569 -206674 67245
18773 97833 -349210 -137978 -130766 14076 -123706 -99955 183285 -200431 8968 -78707 -136198
18762 -136198 -377246 201138 -132760 -8306 -217543 -169393 -92537 -219703 -174039 -14686 249289
18750 -73444 -45006 -399831 288381 -85253 -302309 -32019 65972 -132515 -37097 -28294 -134753
18739 -134753 51377 -244519 -268482 -26273 -69516 -262016 -626548 -123553 -26695 -359762
18729 -359762 -12376 54399 34858 158878 -309838 109871 15610 -92832 262747 -41483 -82792
18718h2792j74962R237C8076b90852c1321I2016a94000C59372a09560B5588c7262
18706b03424j75799h5191A78448b31211C11609a9668A45756d9058A4932J0631
18696B5563f02820I1322b62217o5439f7537j13362j12668C07415c2367l48009
18686c80376C53925b32116i3917A15095f1206l4132A9140a11700I6294a64183
18675A27549a10078E0486a32486c8826j74054A08575i2228A74255p9977a84811
18664c94647d7172I28J78657a65747K5015E2491J20285o6296a77822k9217a7478
18652d5190j33167k01784f2697I7869N5134K07094c8461q9116N9338j78924F1945
18640B83837e7934m21J6030k15113K0546C7648h9598a7832r5405j5762B4976J25989
$$ plain form
18718 -82792 -257754 -248517 38076 -290852 -31321 92016 -194000 359372 -109560 25588 -37262
18706 -203424 -379223 -85191 178448 -231211 311609 -19668 145756 -49058 14932 25563
18696 25563 -602820 91322 -262217 -327656 -67537 -180899 -293567 307415 -32367 -380376
18686 -380376 353925 -232116 -93917 115095 -61206 -95338 19140 -111700 96294 -164183
18675 127549 -110078 50486 -132486 -38826 -212880 108575 -92228 174255 94278 -184811
18664 -394647 -47172 928 179585 -165747 -140732 52491 172776 106480 -177822 -207039 -17478
18652 -45190 -178357 -380141 -62697 97869 153003 360097 -38461 -127577 -68239 -247163 61945
18640 283837 -57934 -58355 -42325 -257438 -236892 37648 -89598 -17832 -113237 -128999 24976 150965
18628A50965c2123i210A78112d23826I8867a23402G9578c22841D7474K8308f3678
18616b30885m9220N9766b3176B27279A3408b71271B32210b736A34723R4033G5054
18604b1050o7542L8095j1799k59160g473B82022b10329J5212e7378B79589E6173
18592b4202j40290A01244c265k97541g988k25813h3058q4332k5972c8723G6824
18580a70066K4568k69987a45724M3633Q744c4413k47504I4564h4353a021H4178
18568b17613m6826B3806L7402A8279b34j68089A17952a64386b042m87763K30234
18557b59571A98181b2999m8544o3115q5429c8096o7831E3183J77422d6096q03
18546d6899j84544A57423K4575h3841B7596c4167j53587f5729n2587j00247g9670
$$ plain form
18628 150965 -32123 -9210 178112 -423826 98867 -123402 79578 -322841 47474 75782 -63678
18616 -230885 -280105 -220339 -23176 227279 13408 -271271 232210 -2736 134723 228756 75054
18604 -21050 -88592 -50497 -62296 -321456 -7473 282022 -210329 -195117 -57378 279589 56173
18592 -24202 -164492 101244 -3265 -300806 -7988 -233801 -83058 -167390 -193362 -38723 76824
18580 -170066 -145498 -415485 -145724 -102091 -93347 -34413 -281917 94564 -84353 -1021 84178
18568 -217613 -264439 23806 61208 18279 -234 -168323 117952 -164386 -2042 -489805 -259571
18557 -259571 198181 -22999 -71543 -134658 -220087 -38096 -105927 53183 230605 -46096 -46899
18546 -46899 -231443 157423 181998 -83841 27596 -34167 -187754 -65729 -118316 -218563 -79670
18534b71033H9898D1595f4340B0891Q2928a18870A14889J39068j26562Q0842b24592
18522i0396A09894D7039a33686I7607g7597h032b227j23955e7647C7711a45338
18510C59740e5566l30404I3187d1131D7930f7312o4045A12306d0153q7457G9392
18498g7847h772r2348k19072f966j55948l43501a26134B01501b56658J21626M889
18487a30143p60C1964c63536N4247D8758K4112b07858G3659b85054L6514B9409
18475A48224C1799J01052f3894C69093b85660b5844j49290I2240C5300h9763K6198
18464f3565k08759J00427A28734b11553M0454j23386a2352p4136k00079A6416
18453g5260I7145d03584A40145a34290K7443B17712a28547J4834j00141b697E5878
$$ plain form
18534 -271033 89898 41595 -64340 20891 103819 -118870 114889 253957 127395 208237 -224592
18522 -90396 109894 47039 -133686 97607 -77597 -8032 -2227 -126182 -57647 37711 -145338
18510 359740 -55566 -385970 93187 -41131 47930 -67312 -131357 112306 -40153 -127610 79392
18498 -77847 -8772 -101120 -320192 -6966 -162914 -506415 -126134 201501 -256658 -135032 -130143
18487 -130143 -130903 31964 -363536 -309289 48758 72870 -207858 73659 -285054 -248540 29409
18475 148224 31799 132851 -63894 369093 -285660 -25844 -175134 92240 35300 -89763 -63565
18464 -63565 -272324 -171897 128734 -211553 -171099 -294485 -12352 -86488 -286567 16416
18453 -75260 97145 -403584 140145 -134290 -106847 217712 -128547 -113713 -213854 -2697 55878
18441b4856F0697e5307b6005E6642c30916C678J7089b16894J9910M4407K6204
18430a26373k09888A25985a17761A57137P11a49295O1415O212m6025J3841A23055
18418H8813J55828a16405o3303f5780j07972c2649A76615a89507A50745c97706
18407b03395h7081j5958b4864k60124B04707C2234f1843I0906a06748m4893O8286
18396h3355L5243B38565F0138j6540j1445a31830O5305k439I6159Q0010J42956
18385C19125A0070f7691J4319I2196a81522A00324d15973b8734q3617b6867k22545
18374b49412B58637b558A72622a69261a2338A25746a30171d0317H206J74121m1384
18363A40943D1989J57150a27857d816E5453b46872A37451d3317J1498n02394J84077
$$ plain form
18441 -24856 60697 -55307 -26005 56642 -330916 3678 20767 -216894 -196984 -152577 -126373
18430 -126373 -336261 125985 -117761 157137 157848 -149295 -87880 -81668 -127693 -113852 123055
18418 88813 244641 -116405 -179708 -65780 -173752 -32649 176615 -189507 150745 -397706
18407 -203395 -87081 -103039 -24864 -284988 204707 32234 -61843 90906 -106748 -151641 -83355
18396 -83355 -48112 238565 60138 43598 32153 -131830 -66525 -68964 96159 176169 319125
18385 319125 10070 -67691 -53372 92196 -181522 100324 -415973 -28734 -112351 -26867 -249412
18374 -249412 258637 -2558 172622 -169261 -12338 125746 -130171 -40317 8206 182327 140943
18363 140943 41989 199139 -127857 -4816 55453 -246872 137451 -43317 -31819 -534213 -350136
18352c50136a21390e3931j19833A5396b99697n2803a3103l9115j75332A05503
18341D6041j3851c29771B89521E6867b44668B0309Q4181f2372C8013J83602a16205
18329D4749i2182C68167f3662a2476j98442D00212A846K8151J08055a79130I0070
18317C12776c71694B90874e1556k07979E8848b69047A4260b7983n1494A89505
18306A2370J77813I2130a6162D8167a89929G8822K4546J83098c5336o1709l44358
18295d41403H7867J92851A24398J04671i0392D1967a79237M7863c7440k54846
18285b92286D1175b22403K6841l0294G183a87989R1459k05448J26278F9875J14699
18274A84574e6000B67373j12694f1615j71459A95104a13604j97069I7739a21524
$$ plain form
18352 -350136 -121390 -53931 -173764 15396 -299697 -352500 -13103 -52218 -227550 105503
18341 46041 32190 -329771 289521 56867 -244668 20309 104490 -62372 38013 221615 -116205
18329 44749 -92182 368167 -63662 -12476 -210918 400212 1846 29997 138052 -179130 90070
18317 312776 -371694 290874 -51556 -259535 58848 -269047 14260 -27983 -79477 189505
18306 12370 190183 92130 -16162 48167 -189929 78822 103368 286466 -35336 -97045 -441403
18295 -441403 87867 280718 124398 229069 -90392 41967 -179237 -131374 -37440 -292286
18285 -292286 41175 -222403 -195562 -225856 7183 -187989 -96530 -301978 -175700 69875 184574
18274 184574 -56000 267373 154679 -61615 -233074 195104 -113604 -310673 97739 -121524
18263a85776l0255a03144k1518D27059E2315c29831A88876b00307q4699N9074
18253b25932C9044J3788a52025j62697E3901b31852b2232m5806k21274A69426
18242a14628n7851K4040f4273k40070F9561K1551a47099G9848J04442c09441A66567
18230a13573j41618O8300O2887j44784J01415P5367p1386j28793A65631f7990
18219D4758a12016A769g9131k77855i3423A19379b83378h9507A28173C2869a85494
18207b49862R4553B07160a9836A08977a127B44142c32783a9007A48930c64051
18196h8224j44009Q0515A59627a06280l2086J3726l26585b17017A10346J54427
18186B64773a54529B37470I0785A9994J73981a44529f6622F5593c28421I398a30497
$$ plain form
18263 -185776 -216031 -103144 -124662 427059 52315 -329831 188876 -200307 -285006 -225932
18253 -225932 39044 52832 -152025 -314722 53901 -231852 -22232 -68038 -289312 169426
18242 -114628 -172479 -148439 -64273 -304343 69561 91112 -147099 79848 184290 -309441 166567
18230 -113573 -255191 -186891 -124004 -268788 -167373 -92006 -163392 -292185 165631 -67990
18219 44758 -112016 1769 -79131 -356986 -93423 119379 -283378 -89507 128173 32869 -185494
18207 -249862 -155309 207160 -19836 108977 -1127 244142 -332783 -19007 148930 -364051
18196 -88224 -232233 -151718 159627 -106280 -138366 -124640 -451225 -217017 110346 264773
18186 264773 -154529 237470 90785 19994 193975 -144529 -66622 65593 -328421 9398 -130497
18174B29872b78200c2818B77522b29055E088R2117b60494e5636q1257N6833G0134
18162A19623b42000J9515l904Q6186e2955j68072A80458a07847C2280a74052A92134
18150i3766A3840P2942a0633G3R6647d56374J99962g531j59448d5068A65112c00051
18137f9102k01689i7588C2122a05243A99134k9313b61249j56332a72589j21408
18127b93997a29875j30094a17809b3000C23214B6284E267e68586m6201b44795
18116d46085O5530J84280r0525a07659B72925F9426a13350J8196A68973j4067
18106A54906i031A303b36153a13495F7106j6093a79484B72214d65B24120a45052
18094i1936j5057d0041A94599b81449J23808A42852a13375A91422J6831I0865
$$ plain form
18174 229872 -278200 -32818 277522 -229055 5088 97205 -260494 -55636 -136893 -80060 70134
18162 119623 -242000 -222485 -226389 -140203 -52955 -221027 180458 -107847 32280 -174052 192134
18150 -93766 13840 86782 -10633 73 96720 -456374 -256412 -7531 -166979 -45068 165112 -300051
18137 -69102 -270791 -97588 32122 -105243 199134 169821 -261249 -417581 -172589 -293997
18127 -293997 -129875 -259969 -117809 -23000 323214 26284 5267 -568586 -614787 -244795
18116 -446085 -380555 -196275 -286800 -107659 272925 69426 -113350 -95154 168973 154906
18106 154906 -9031 1303 -236153 -113495 67106 51013 -179484 272214 -465 224120 -145052
18094 -91936 -106993 -40041 194599 -281449 -157641 142852 -113375 191422 208253 90865
18083b30368Q623c332A9417d31438C02093A50974c13262A35247a07292k10915
18073c18207A53719K41631b50905E520Q1202H954a71724D96471a55255q9859G6402
18061i5286B06922A8091f0519I9201b89861I5057K24347a32968j99461d8288q788
18050e7076I4013d37675g3100i532A58950a6056m01284E2738L1862c14003E4390
18038e10900a58936I504R5810a39870B43404d9329q0881J540B86628F8576d4940
18026A20581b72045G143Q7966a50243k87420A11604B1796f1650j23326o817B7913
18014a17425l2449D1645M1689B7073a37128e6085j02225B85174a39787m3065C24341
18002a52650B9084a70792A87827J22336E4024a37230p806m0235f3386F0194b03304
$$ plain form
18083 -230368 -221745 -3332 19417 -431438 302093 150974 -313262 135247 -107292 -318207
18073 -318207 153719 395350 -250905 5520 86722 8954 -171724 496471 -155255 -245114 76402
18061 -95286 206922 18091 -60519 99201 -289861 95057 319404 -132968 -332429 -48288 -57076
18050 -57076 94013 -437675 -73100 -9532 158950 -16056 -417340 52738 84600 -314003 54390
18038 -510900 -158936 9504 105314 -139870 243404 -49329 -130210 -128670 286628 68576 -44940
18026 120581 -272045 7143 95109 -150243 -437663 111604 21796 -61650 -184976 -191793 27913
18014 -117425 -149874 41645 83334 27073 -137128 -56085 -158310 285174 -139787 -182852 324341
18002 -152650 29084 -170792 187827 310163 54024 -137230 -145036 -185271 -63386 60194 -203304
17990b69336J28999p4880A6337b41272Q5317A65953j3420n9322b86903b0643l9845
17979f0488m4370B359b50131E7832P682b52884i5439A11640e7375q9899k4521
17968a71795C44132b72453B0336f6433k07268K3033q8644B7548h1295j00974N2092
17957a30177b8087k32932m7994A24371i8241j17224E8340D665J96647B3784R7943
17946A21727b95036g2721n5872b6949A90129m2896F4543P0079a51471j72009c6406
17934G1802J89933n6368a33389A00389a1923C03104K6556j17918J10115A53856
17923b94266G1633a68967A71249i1274A05904b43366A47518F7835a80381H0067
17912E373c15044R2220A34728a33918B8666a70283o7076d1908j64505J9835A15043
$$ plain form
17990 -269336 -140337 -215217 16337 -241272 -155955 165953 152533 93211 -286903 -20643 -60488
17979 -60488 -104858 2359 -250131 57832 65514 -252884 -95439 111640 -57375 -147274 -171795
17968 -171795 344132 -272453 20336 -66433 -273701 -250668 -339312 27548 -81295 -182269 -130177
17957 -130177 -28087 -261019 -309013 124371 -98241 -215465 58340 4665 201312 23784 121727
17946 121727 -295036 -72721 -128593 -26949 190129 147233 64543 134622 -151471 -323480 -36406
17934 71802 261735 205367 -133389 100389 -11923 303104 329660 211742 321857 153856
17923 -294266 71633 -168967 171249 -91274 105904 -243366 147518 67835 -180381 80067
17912 5373 -315044 -222824 134728 -133918 28666 -170283 -237359 -41908 -206413 -186578 115043
17900A84266a86311A01189a1574r7642j61920d8348j53060i3139K3376j47920
17890b17683H4792c2749B07015b93036b1584C7779J65874p7330b2313q075l50404
17879c80792d0913j94344g5861A65446A1349J52228a25671C2318d4120C6510J55467
17868A91977J75070A12265p395L92247b2480B00055a85015B16141a50105A48496
17857b63983h8828m1814B34492a4797G8781a90097P1744q873B9038L4516P3155
17846A36709b52662C8133K33862J7257j22343a20525o7462A15478a99546A92495
17835H5874c90105A59881e6815k32058P3788A49293c2989C85930a35846A2408
17824a62172D0315b26231A69273f5337F8925d2279H5846k3482K0245M8311a55594
$$ plain form
17900 184266 -186311 101189 -11574 -109216 -271136 -48348 -201408 -93139 -69763 -217683
17890 -217683 84792 -32749 207015 -293036 -21584 37779 203653 126323 -22313 -30388 -380792
17879 -380792 -40913 -235257 -75861 165446 11349 163577 -125671 32318 -44120 36510 191977
17868 191977 367047 112265 104870 497117 -22480 200055 -185015 216141 -150105 148496
17857 -263983 -88828 -130642 234492 -14797 78781 -190097 -118353 -127226 29038 63554 136709
17846 136709 -252662 38133 271995 289252 166909 -120525 -187987 115478 -199546 192495
17835 85874 -390105 159881 -56815 -288873 -215085 149293 -32989 385930 -135846 12408
17824 -162172 40315 -226231 169273 -65337 68925 -42279 85846 62364 82609 130920 -155594
17812C32879p3263D8206c47556D9774a82806F9357K33052A07660l5125e7132B55105
17800G2360B7674b94155a07023j57427m8712A18354A0349J6257E999b50708B09025
17788A53117N0777d4664j71531F789J62357o7695a48708A3234K05325E2192e3214
17776I0157a77934H7388J6884j2988K0603J93171a81903B63328J03565I7158k2005
17765G5153C6976c11260b8943A7476a42862J8049C42127c43137B73824a57041
17754F1272a29066A46421b075A37969c3719J6500A38191C8114a56761k3872o0192
17743b40825G4860b61895h8167l11073i2349H8888h8662j86392R7421e8443o2967
17732a21410a6641A28089a71736P4684a9305A20264K23086A7826d892A04094l6820
$$ plain form
17812 332879 259616 48206 -347556 49774 -182806 69357 302409 107660 72535 -57132 255105
17800 72360 27674 -294155 -107023 -264450 -313162 118354 10349 26606 5999 -250708 209025
17788 153117 203894 -44664 -216195 6789 169146 101451 -148708 13234 218559 52192 -53214
17776 90157 -177934 87388 104272 91284 111887 305058 -181903 263328 366893 97158 75153
17765 75153 36976 -311260 -28943 17476 -142862 -124813 342127 -343137 273824 -157041
17754 61272 -129066 146421 -2075 137969 -33719 -17219 138191 38114 -156761 -180633 -240825
17743 -240825 74860 -261895 -88167 -399240 -92349 88888 -88662 -275054 -177633 -58443 -121410
17732 -121410 -16641 128089 -171736 -97052 -19305 120264 343350 17826 -4892 104094 67274
17721F7274C0946g5275k2618B30357e5352j68909B57382J30138a50727c9234J889
17710c7345o3946M7797C9120a65352F8908l0757L0375N1151e5420M448H5359a15975
17697f3716G8647C3198J49042K03314a51157O7539A7774Q6617J9962n3757d36477
17685A34497n5690h6825F1374a69278A33242A0049J4587L9324b09678g8824j79167
17674b57991R6690D1576b6526j06470b106F7356f2770A79590b42051i1045A80723
17662c8597A2129c5293A23976J80874G0142K59022j26086g2695r9312n7393A29245
17650E5458b39331R6795C0928f4306j26360C08955A39852C5436b0080D05787B5752
17638C94745A77645B9718J81147a45814j4698j8484M5239c4921B2605M4851d8176
$$ plain form
17721 67274 30946 -75275 -97893 230357 -55352 -224261 257382 387520 -150727 -39234 -37345
17710 -37345 -101291 -53494 39120 -165352 68908 38151 68526 119677 -55420 -50972 85359 -115975
17697 -63716 78647 33198 182240 385554 -151157 -83618 17774 104391 124353 70596 -436477
17685 134497 78807 -86825 61374 -169278 133242 10049 24636 63960 -209678 -78824 -257991
17674 -257991 -161301 41576 -26526 -132996 -2106 67356 -62770 179590 -242051 -91045 180723
17662 -38597 12129 -35293 123976 304850 70142 329164 203078 -72695 -172007 -229400 129245
17650 55458 -239331 -142536 30928 -64306 -190666 308955 139852 35436 -20080 405787 25752
17638 394745 177645 29718 210865 -145814 -160512 -178996 -133757 -34921 22605 67456 -48176
17626d414G5091a51472i843B8680a33516A10754a09978M3071l34334f3010k6493
17615h9503r4041n5938F5846M58597k55351a27462A67208k7573M5202N6576D4160
17603E447N343Q1441a62737H6602h0213A1116b58948B6562b35738B0687i1677
17591C89131h9095B46754r5360k1032R0602g3268F4279K60848c3686j29519C81445
17579a23103C1491L6515J08366k3828K3952J3460r1212G959J18837A758L04643
17568C06401H1042j5755J25421F4317M6134a02343c7393C27772a85827N0886j95223
17557c30164C6495R1138f0897A18021J42764J30419b49735Q4521j45533q2876
17547c93623h3073L4334k71844m6626J54776B97210C3850K58665R8849i5356I6980
$$ plain form
17626 -4414 75091 -151472 -9843 28680 -133516 110754 -109978 -66907 -401241 -63010 -89503
17615 -89503 -183544 -239482 65846 524443 269092 -127462 167208 139635 184837 241413 44160
17603 5447 10790 92231 -162737 86602 -80213 11116 -258948 26562 -235738 20687 -91677
17591 389131 -89095 246754 151394 130362 220964 -73268 64279 325127 -33686 -163205 381445
17579 -123103 31491 68006 176372 152544 176496 189956 98744 7959 126796 1758 306401
17568 306401 81042 65287 190708 64317 110451 -102343 -37393 327772 -185827 -134941 -330164
17557 -330164 36495 127633 -60897 118021 260785 391204 -249735 -165214 -310747 -393623
17547 -393623 -83073 -48739 -320583 -367209 -212433 297210 33850 292515 391364 -95356 96980
17535B4861i29k38999i5437H7880J9330O0313K6748n3294f6954I1028J21539C403
17522a27088Q951A16292L43636b09714e2413h103F856J11309b15894l7024b7630
17510A45994Q1170g7844k82155B29424H6657M1938J33870n0254F9067p603J3186
17499G4650B4825F106K16693a53278e4126B11532a73801A82936b73539a31464
17488D9014J90393e3151b4473C71848F1867N1089J32419L619D1377J17730N83
17477A59690P8499J90670a03459K2239D6701J74701a27345A78700o7354a30003
17466C8270b86267B37783d12112B17446a45575D02988A73273a43043A50496a6874
17455I9257R4047a4090N959B56615F8510a35232A94803L65461c23562E99642B15056
$$ plain form
17535 24861 -929 -239928 -95437 87880 107210 167523 194271 140977 -66954 91028 212567 3403
17522 -127088 -118137 116292 459928 -209714 -52413 -8103 6856 118165 -215894 -252918 -27630
17510 145994 227164 -77844 -359999 229424 86657 128595 262465 212211 69067 61464 74650
17499 74650 24825 6106 222799 -153278 -54126 211532 -173801 182936 -273539 -131464
17488 49014 239407 -53151 -24473 371848 61867 112956 245375 248994 41377 159107 159690
17477 159690 238189 428859 -103459 -81220 46701 221402 -127345 178700 111346 -130003
17466 38270 -286267 237783 -412112 217446 -145575 402988 173273 -143043 150496 -16874
17455 99257 193304 -14090 -8131 256615 68510 -135232 194803 560264 -323562 599642 215056
17443I8144J93871A40695C363K90359J74630j38182A15382K21535j18576l6423
17433A81918L1425A8486K84856J56127o0030A46902L3271m9933m1277J8881L3753
17422A41597h0449C19020j26360l2299A6814J17805n7500L10050J18A61625g3602
17410C53197m8325A41282L9104d3565B82141j9735p9811a12507C45201k2753c2133
17398A32952e5834a3327j337l2684A63237K090K1597N8060M7165d6910A22331
17386d5254H9985K1985a15634D287K27373A7271K58093q9207M0414j11233N418
17375A20756I138J76667B4971K79533b5041C18223j25729g2950F331L77614G9747
17363D34833G2254J88591J27477a6500j44018B39156h6243A25916l5782b77945
$$ plain form
17443 98144 292015 140695 3363 293722 468352 330170 115382 336917 218341 181918
17433 181918 213343 18486 303342 459469 399439 146902 180173 130240 88963 107844 141597
17422 141597 -80449 319020 192660 160361 16814 134619 77119 387169 387287 161625 -73602
17410 353197 304872 141282 180386 -43565 282141 262406 182595 -112507 345201 322448 -32133
17398 132952 -55834 -13327 -14664 -47348 163237 165327 186924 244984 292149 -46910 122331
17386 -45254 89985 111970 -115634 4287 231660 17271 275364 186157 226571 115338 120756
17375 120756 9138 185805 24971 304504 -25041 318223 192494 -72950 6331 383945 79747
17363 434833 72254 260845 388322 -16500 -160518 239156 -86243 125916 90134 -277945
17352A09785J80827b63670A09832P8479n5981M1751F5750c6367o6344A24263K3554
17341A47817Q545K84413m5919G5008R7203J63459R3435F128K49278F8342a1115
17329E11658B22872b20906D57931A37201R852P9534m9769g1768D85572D4785K97279
17318C42064A15979R598E4218J52619D446d8460I32J52762o7907J8855g6507B45703
17305B95380B7932K49480J75080k23136m7082K39258M3162D9815i7506A48108
17294A63730J41965a63875G4617j4378K25352j18199F5013M0030J25203J24468
17284C54714A11051K22997i2192A33266b65704C07974k7023d2179E92226D2311
17273B75667j19038k8553K87052A74103Q6977J58723k7613A31627d177A0162L94315
$$ plain form
17352 109785 290612 -263670 109832 188311 132330 174081 65750 -36367 -102711 124263 147817
17341 147817 156362 440775 394856 75008 172211 335670 429105 6128 255406 68342 -11115
17329 511658 222872 -220906 457931 137201 147053 226587 176818 -71768 485572 44785 342064
17318 342064 115979 125577 54218 206837 4446 -48460 932 153694 85787 104642 -76507 245703
17305 295380 27932 277412 452492 229356 182274 421532 464694 49815 -97506 148108
17294 163730 305695 -163875 74617 60239 285591 167392 65013 105043 230246 354714
17284 354714 111051 334048 -92192 133266 -265704 307974 280951 -42179 592226 42311
17273 275667 156629 128076 415128 174103 261080 419803 392190 131627 -4177 10162 404477
17262D04477a79163I6485L3097l0814O5299o0183K34345C5864J13971Q6220q7749
17251A48306n7792K83224I6512d5333A39742F0685J26619O7475A23184Q7040q8244
17240A21980o305L11762k02867I9556G874J54370G5215C1123K95346J87819j94712
17229C19576E2723g3407A58682a0898B5202M2971c8241B81927J33303a4334B79332
17217c29391J11070C24556E196K38275J69109B9084L82804B0560L8974r25P4035
17206A32644j8746M8904G7604j6843J19428p3593K56310n0232P4681n8323J37118
17195D66150F7047M75702A20005M4780G9848O5806J24270J12912L531A69620M3238
17184B12858N261m1301K3656L00252j30127k2860j0230j51983K65740l6164j1176
$$ plain form
17262 404477 -179163 96485 129582 98768 164067 103884 338229 35864 149835 236055 148306
17251 148306 90514 373738 96512 -45333 139742 60685 187304 254779 123184 210224 121980
17240 121980 115675 427437 224570 99556 7874 162244 75215 31123 326469 514288 319576
17229 319576 52723 -73407 158682 -10898 25202 68173 -38241 281927 415230 -14334 279332
17217 -329391 -218321 324556 5196 243471 412580 29084 411888 20560 59534 58609 132644
17206 132644 113898 162802 77604 60761 180189 106596 362906 312674 387355 329032 466150
17195 466150 67047 542749 120005 164785 79848 145654 269924 382836 386367 169620 212858
17184 212858 218119 176818 200474 500726 370599 347739 337509 185526 451266 415102 403926
17173D03926F3723P3821P2756N3881c5144C07858H4765L24074j3583A77700m7864
17162A29836J72403C2894K98510K50677j55319B06861J43313k0270j04692K51376
17152D76588k02222J52768a5650A37385m3010J4192L71759l3340j58984p239P364
17141B88127M52404k95852I4486N6313L47876A19236A7275L96868n694F9495K13102
17130B82597A10456J36443j03348M95962j97549p996K5776J96131k15321A34846
17119A23439K22184A788J30562J87989J54961J34597j89319l0939l7574J19929
17109D71994j63215K13177j91743A01756j3923K48927R9212J38078A89126L58969
17099E48095L5251j08285B33582p4056J15191P4246J7444F3677M48843Q9165p3550
$$ plain form
17173 403926 63723 137544 210300 264181 -35144 307858 84765 408839 395256 177700 129836
17162 129836 302239 32894 331404 582081 426762 206861 350174 329904 225212 476588
17152 476588 274366 427134 -15650 137385 94375 108567 480326 446986 288002 280763 288127
17141 288127 740531 444679 94486 150799 498675 119236 17275 414143 408449 69495 282597
17130 282597 110456 246899 143551 639513 441964 433968 459744 655875 440554 134846
17119 123439 345623 1788 132350 320339 475300 609897 420578 389639 352065 471994
17109 471994 308779 521956 330213 101756 87833 336760 435972 574050 189126 548095
17099 548095 583346 475061 233582 159526 274717 348963 366407 63677 512520 601685 528135
17088E28135k07832L24415l16822J29819j47752J06107j42079L22238k82563K8357
17078C42023M24656C67800J59812K31667k60670J6966B451O69265A70095K8752
17068A98847J72207M8034G4548L97351O4869A84066L00300q2334K29694k16556
17058D15170Q2516n6769Q9556J11986j65833K6307A52305J17669N17300k99396
17048D87878J36417j86025K52190l29151L33813j74780L4130l5667P6046J84212
17038G79063C74575N10447m15440J21785M2046Q163o0940Q4454J61623j07598
17028G19115j33531P256J20427k70444K699K45891j29344K924J2036k08737N18569
17017H86861l81435j60286L81502J16400D06249K15719j88958L34171r2454J7914
$$ plain form
17088 528135 320303 644718 327896 457715 309963 416070 273991 596229 313666 342023
17078 342023 766679 367800 527612 759279 498609 515575 2451 671716 170095 198847
17068 198847 371054 419088 74548 471899 536768 184066 484366 402032 631726 415170
17058 415170 497686 440917 530473 642459 476626 502933 152305 269974 787274 487878
17048 487878 624295 438270 690460 361309 695122 520342 554472 518805 594851 779063
17038 779063 374575 885022 469582 591367 633413 641576 580636 665090 826713 719115
17028 719115 585584 592840 713267 442823 445522 691413 562069 564993 577029 368292 886861
17017 886861 505426 345140 726642 843042 406249 621968 433010 767181 674727 692641
17007F92641q3526l7427J39945k14069J40653J64311N4810k30087j8584K52533
16997H61200Q7316l38737K72734k29536N3757K59032l84389J92146N94133D83245
16986H20001M12877m22993R0771j74584Q6202O4459J47014k17624j86736K48019
16976H67406j4512L43384n06476L3993J58782j07028K63276l30128j02273K82054
16966H88478K52790k85533M41671o06738Q3921K55165K78651k91798j85090j83616
16956F47901M96657j91829J30380J21433j00484K4926j82616J49813L2388j36288
16946I92281M0192J35399l02970L93157k37781K05049j43850J29655J14953k61409
16936A064676M28385l12249l1797J62392n7549j41875L64000k73111J49105L95070
$$ plain form
17007 692641 609115 571688 711633 497564 638217 802528 857338 627251 608667 861200
16997 861200 948516 609779 882513 652977 706734 965766 581377 773523 1367656 483245
16986 820001 1232878 809885 900656 726072 812274 876733 1023747 806123 619387 867406
16976 867406 852894 1196278 689802 723795 882577 775549 1038825 708697 606424 888478
16966 888478 1141268 855735 1297406 690668 774589 1029754 1308405 1016607 831517 647901
16956 647901 1144558 952729 1083109 1204542 1104058 1128984 946368 1096181 1128569 992281
16946 992281 1032473 1167872 864902 1258059 1020278 1225327 1081477 1211132 1326085 1064676
16936 1064676 1493061 1180812 1149015 1311407 1253858 1111983 1475983 1202872 1351977 1747047
16926A747047m14091n1207L2679r113M1075L06321k40864J04443l70303K81097
16916A427084n8727o1604N9414J59829l8736J06547j15760Q5862K03595j44515
16906A622989l6887R7679J97729R1871k03172K6639L8666Q6236m8996L4930k44864
16895A662820K1876K00785N4878Q0452J01552k05005k83856J96008N6691k9208
16885A856993J73120l7956L26693J15465m49748L26509j64693K02664l5929j9440
16875B293678J54467j98839j07872K01490Q3380K36708l68799L15912n5411L12995
16865B867709n2222N7703j31977J06612K04596j67220j67221J06042K79580j46490
16855B957112N9865j52471N26532j50436J51535K41627l08443k0107M15914k24710
$$ plain form
16926 1747047 1332956 1281749 1314428 1305315 1346390 1652711 1411847 1516290 1145987 1427084
16916 1427084 1368357 1306753 1366167 1525996 1487260 1593807 1478047 1563909 1767504 1622989
16906 1622989 1586102 1683781 1881510 1973381 1770209 1796848 1835514 1921750 1872754 1907684 1662820
16895 1662820 1684696 1885481 1940359 2020811 2122363 1917358 1633502 1829510 1886201 1856993
16885 1856993 2030113 1992157 2318850 2434315 1984567 2311076 2146383 2349047 2313118 2293678
16875 2293678 2448145 2249306 2141434 2342924 2426304 2663012 2294213 2610125 2554714 2867709
16865 2867709 2815487 2873190 2741213 2847825 3052421 2885201 2717980 2824022 3103602 2957112
16855 2957112 3016977 2864506 3391038 3240602 3392137 3633764 3325321 3305214 3721128 3496418
16845C496418J11250J68939j10272J05366p4860K86228p4042K54673k91715N28919
16835D400904l84140k6308N91369N6405j10112K27746J25669L4754O2062j45258
16825D833091K00094K49699J9212j19882J24597L15568q4994L48540R701K29127
16815F124753Q0506R4888K40215K24102l99695P51949j89458K5697J70616M34507
16805G558080j68436M02945M15913j68526N59489K796K04283M97230k57300L75506
16795I421980J36676K72912L03537P18193j70460N76964J61348K51342J65928
16786A1838420P2954O68479J72721P55375J38753K67942M35723N61621N35873
16777A5447861N37009M08572P22949L06908O51315N19056O08846P17610P09742
$$ plain form
16845 3496418 3607668 3776607 3666335 3771701 3696841 3983069 3909027 4163700 3871985 4400904
16835 4400904 4016764 3990456 4581825 4638230 4528118 4755864 4881533 4916287 4978349 4833091
16825 4833091 5033185 5282884 5302096 5182214 5306811 5622379 5537385 5885925 5895626 6124753
16815 6124753 6205259 6300147 6540362 6764464 6364769 7116718 6927260 6952957 7123573 7558080
16805 7558080 7389644 7792589 8208502 8039976 8599465 8602261 8806544 9303774 9046474 9421980
16795 9421980 9558656 9831568 10135105 10853298 10682838 11259802 11421150 11672492 11838420
16786 11838420 11911374 12579853 12752574 13507949 13646702 13914644 14350367 14911988 15447861
16777 15447861 15984870 16393442 17116391 17423299 18074614 18593670 19202516 19920126 20629868
16768B0629868Q94264O20743P64420O41561R74637J163824P30198J237243Q20532
16759B8477290J297576J466810J219848J176088J314948J672321K108357J343764
16751D0077002K004136J678819J888579K482179K287765K542187K548886L141725
16743E8651278K890081K733421L851122L232362L767799L644403M474417M304783
16735H7549666M809261M854182M931757N118171N308999N450945N636594N624588
16727A29284163N487380N652447N697902N059114M958179M149278M528068K588100
16719A67404631K566936J581670R78109l77045p69202k316144k548634l670005
16711A62850316m338614m563822n055568n760000n447496n524077o205171n328341
$$ plain form
16768 20629868 21524132 22144875 22909295 23550856 24525493 25689317 26419515 27656758 28477290
16759 28477290 29774866 31241676 32461524 33637612 34952560 36624881 38733238 40077002
16751 40077002 42081138 43759957 45648536 48130715 50418480 52960667 55509553 58651278
16743 58651278 61541359 64274780 68125902 71358264 75126063 78770466 83244883 87549666
16735 87549666 92358927 97213109 102144866 107263037 112572036 118022981 123659575 129284163
16727 129284163 134771543 140423990 146121892 151181006 156139185 160288463 164816531 167404631
16719 167404631 169971567 171553237 172531346 172154301 171385099 169068955 166520321 162850316
16711 162850316 158511702 153947880 148892312 143132312 137684816 132160739 125955568 120627227
16703A20627227n467528n714704m978503m985025m828433m708105m085063m158238
16695H1701628m434945l818232l338349l512839l207704l099822k781934k816502
16687E4691301j911333k670755k613513j632983k315900j913620j919863j790164
16679C7923170j169435j582625j591946j318935j400314j319842j252565j160925
16671B7126583p66201p00313j186485r51644q18976o65910j200681q33245o20275
16662A9382853o64104l69074p58164q75093k08134o48170n31341m33758m29553
16653A4465462o38467k38976m13939l7761n11920m11516l25112k99405m09180
16644A1179186m60435l70278m27861l30306k95735L06892n06732l38477M114k51767
$$ plain form
16703 120627227 115159699 109444995 104466492 99481467 94653034 89944929 85859866 81701628
16695 81701628 77266683 73448451 70110102 66597263 63389559 60289737 57507803 54691301
16687 54691301 52779968 50109213 47495700 45862717 43546817 41633197 39713334 37923170
16679 37923170 36753735 35171110 33579164 32260229 30859915 29540073 28287508 27126583
16671 27126583 26360382 25660069 24473584 23521940 22702964 22037054 20836373 20003128 19382853
16662 19382853 18718749 18349675 17591511 16716418 16508284 15860114 15328773 14895015 14465462
16653 14465462 13826995 13588019 13174080 13136319 12624399 12212883 11887771 11588366 11179186
16644 11179186 10718751 10348473 9920612 9590306 9294571 9601463 9094731 8756254 8760368 8508601
16634H508601k69636l84305N5585l77989M1479r3387l87850l26316J69090j58881
16624F776391k05997k02285k89806l97430R4432J10022K75651n15420j81560O1612
16614E525610p77998M60946N1542k39044j97286k6309j26187L7413j3379j38123
16604D557185m8573j37035q2889n7676j25356k918k00171p2420L44223l21250
16594C853120j3153l6925n28973K36968j12899l21854K60995L97116m63492l63408
16584B907495J79557J13J28058j52925J11509k62632j27468K50946j51852J14205
16574B997006k41553j26738j73327K24859j57980L5783K05689n05134J55927J38382
16564B552914n5031j97302k4276o6937J53751m5463j87193j41638K91692k24643
$$ plain form
16634 8508601 8238965 7854660 7910245 7532256 7573735 7480348 7092498 6766182 6935272 6776391
16624 6776391 6570394 6368109 6078303 5680873 5775305 5885327 6160978 5645558 5463998 5525610
16614 5525610 4747612 5208558 5260100 5021056 4823770 4797461 4671274 4708687 4695308 4557185
16604 4557185 4508612 4371577 4288688 4231012 4105656 4102738 3902567 3830147 4174370 3853120
16594 3853120 3839967 3803042 3274069 3511037 3398138 3076284 3337279 3734395 3270903 2907495
16584 2907495 3087052 3087165 3215223 3062298 3173807 2911175 2783707 3034653 2882801 2997006
16574 2997006 2755453 2628715 2455388 2680247 2522267 2558050 2763739 2258605 2414532 2552914
16564 2552914 2497883 2300581 2276305 2209368 2363119 2317656 2130463 1988825 2280517 2055874
16554B055874k0628J1786r5117r9557J95803k51821r7320q2706K64231k40149
16544A640396m603n4172K45595k02779P5617L35301l72969J79341l64270K9463
16534A506920M86906n38149m03562N67887R3609l42855K10980p4802K22397k28799
16524A500532R3153m02803K11085j83608J82612J80400j36250j93639J51848p3304
16514A330026J40161K4589l79353K65244Q8907k72690L84783k39344l41483L07816
16504A308656N3323j55790P4572l56709M51901k29268j07134j41424K22658j35706
16494I85079j01794J1055R3032J07690j36680J01570K7808L4664O7091J36523
16484A326038m12549n4400J05908Q542L8458k3559j02957k60304L64134k21572
$$ plain form
16554 2055874 2035246 2047032 1951915 1852358 2048161 1796340 1699020 1616314 1880545 1640396
16544 1640396 1635793 1581621 1827216 1624437 1700054 2035355 1662386 1841727 1477457 1506920
16534 1506920 1993826 1455677 1052115 1620002 1713611 1370756 1581736 1506934 1729331 1500532
16524 1500532 1593685 1190882 1401967 1218359 1400971 1581371 1445121 1251482 1403330 1330026
16514 1330026 1470187 1494776 1115423 1380667 1469574 1196884 1581667 1342323 1000840 1308656
16504 1308656 1361979 1206189 1280761 924052 1375953 1146685 1039551 898127 1120785 985079
16494 985079 883285 894340 987372 1095062 958382 1059952 1087760 1122424 1189515 1326038
16484 1326038 913489 859089 964997 973539 1011997 988438 885481 625177 989311 767739
16474G67739M69575k73450N4187m10472N5599K41634j67018J03564N6631k28985
16464F69004j5175k06023L18444O5078j16304j12400J99708P6424j49847j81376
16454E47533K07476Q463j48925K00224n5490l20644L60206j31620o1846K91411
16444H96788C30486L15910K35618k29134j6794k57880K82315j91130J18490j88379
16434C99502m9210J41224j22860K97468l9866j9646q6733J27712A90080K49607
16424D39687M30583B60706K57035k05291K87770B41397M56521j65658J624J66056
16414F99940m0478k40719J37794j23526J81984k71901L38229k05651K94553k08372
16404E61853j10913p4001n8805J56677A10758K80824r8321K81344B40640K31893
$$ plain form
16474 767739 1237314 963864 1018051 607579 663178 904812 737794 841358 897989 669004
16464 669004 653829 447806 766250 831328 715024 602624 802332 878756 728909 547533
16454 547533 755009 763472 614547 814771 759281 438637 798843 667223 605377 896788
16444 896788 330486 646396 882014 652880 636086 378206 660521 469391 587881 399502
16434 399502 350292 491516 368656 666124 626258 606612 519879 647591 190080 439687
16424 439687 870270 260706 517741 312450 600220 241397 697918 532260 533884 699940
16414 699940 659462 418743 556537 433011 614995 343094 681323 475672 770225 561853
16404 561853 450940 376939 318134 474811 110758 391582 293261 574605 240640 472533
16394D72533r0517j50956p3056J24638K42380K21290C65600J85254A93012p6915
16384A16097M29389B44603J39341H8265L02855j10399K25485M6144o1283R5152
16374E86219k24980J28495j89639P4969j57556J55869Q9330B22452M65718j64024
16364E24146A30695K66815m5386A34391J48030o4772J53778J15187b02834G09949
16353F3059N3251J05850K88857j92645M01596B12565J95931j47267M2845J10851
16343D14925p6350A37943K62550p2790J08844j74029q091p5747G4749J44757K41126
16332D60632A57635L61306k06239L0329j3195J15767A75115c238C50861L81629
16322G32490j71429n2262B36341A02684K88566K19222B80743A19692M01924j84869
$$ plain form
16394 472533 382016 231060 158004 282642 525022 746312 365600 550854 193012 116097
16384 116097 545486 244603 383944 88265 391120 280721 506206 552350 491067 586219
16374 586219 361239 489734 300095 375064 217508 373377 462707 222452 688170 524146
16364 524146 130695 397510 352124 134391 282421 217649 371427 486614 -202834 709949
16353 63059 116310 222160 511017 318372 719968 212565 408496 261229 304074 414925
16343 414925 338575 137943 400493 327703 436547 262518 254427 178680 74749 219506 460632
16332 460632 157635 518941 312702 343031 329836 445603 175115 -3238 350861 732490
16322 732490 561061 508799 236341 102684 391250 610472 280743 119692 521616 336747
16312C36747q3396R4950l5633f8836B39368A13373J04857o6945D099K09125K17331
16301D30555q6436G1125R3517Q8232a7120D22468J37142d7337A35537J41790e2617
16289D6197B464K22083q3431B4652P2074P6932M2177P7426H5375M421Q8472j5506
16277A62762L47n2695L08670B02995l5956l7551c36560A00969L37143B06541J30875
16266C37416a02638F5444j2671J31207A7981K23613j2182I0920m0999P8659a01639
16254F4809L12782J14699j36556A17264M4248q0020j1713K34612H0134K2189A1573
16242D7830b3140C49369a7871I8568J85164A07186k5983J6304J4925J35643I8498
16230C16352B1005J39271a58961J4868A47422P9193p5270d7069A89248R4407A39825
$$ plain form
16312 336747 253351 348301 312668 -68836 239368 113373 218230 151285 4099 213224 430555
16301 430555 344119 71125 164642 252874 -17120 422468 559610 -47337 135537 277327 -52617
16289 46197 2464 224547 141116 24652 96726 173658 215835 293261 85375 89796 178268 162762
16277 162762 163109 110414 419084 202995 167039 129488 -336560 100969 438112 206541 337416
16266 337416 -102638 65444 52773 183980 17981 241594 229412 90920 49921 128580 -101639
16254 64809 377591 492290 355734 117264 161512 81492 69779 304391 80134 102323 11573
16242 47830 -23140 349369 -17871 98568 283732 107186 81203 97507 112432 248075 98498
16230 316352 21005 160276 -158961 -144093 147422 226615 151345 -47069 189248 283655 139825
16218b31305B28337E6626L9402B7743a0622r6225K0805c5806B15650q1317J6852
16207A51185f1709C21537d416A14494J39267N6615M8067D2595A9725J9047J98212
16196B36984a46725D34412c6704j06833b6258A60548a22304H2427O7826n6026
16186I4227K03326O3306L5933b7556B9295c79963e4502A30615B0621P264J8210
16175D6095a29191F4210J08396d6156D06313i3690l6101B94729b0134r1407C2289
16163d2185j24077A14122C4955P8166b7207A72867J07887a9828p5820G3966Q6612
16152A60578b0113j54010B68212h2078A35971P711a85466A71751F3754c01335
16141B0837L6369a60143J2975A17128C9852a30038A1708a5911B85663c7906r9673
$$ plain form
16218 -231305 228337 56626 96028 27743 -10622 -106847 -86042 -35806 215650 134333 151185
16207 151185 -61709 321537 -4416 114494 253761 310376 358443 42595 19725 38772 236984
16196 236984 -146725 434412 -36704 -143537 -26258 160548 -122304 82427 150253 94227
16186 94227 297553 360859 396792 -27556 29295 -379963 -54502 130615 20621 27885 46095
16175 46095 -129191 64210 172606 -46156 406313 -93690 -129791 294729 -20134 -111541 32289
16163 -42185 -166262 114122 34955 113121 -27207 172867 280754 -19828 -95648 73966 160578
16152 160578 -20113 -174123 268212 -82078 135971 143682 -185466 171751 63754 -301335
16141 20837 57206 -160143 -147168 117128 39852 -130038 11708 -15911 285663 -37906 -137579
16130a37579F5985h6715A14179i466j37750k29840D6360P7421b40706A77343E5403
16118A39089a60952A42849c96762a04684j07729N7082g0700k89871D2232a9760
16107A14587g4247k28330A33467J07811b58254C01596a46364C46586j65125J85099
16097C66560k8409a35010E0578a91772B5141K17967j11938J29482b09747A7699
16086g4367A88074j6851A3153j418J28584M4019k3929i208B15423a27368r1612
16075b18980B00816J5988j01531c4768l7979A87906H1976K17375j3936a38626
16064e2364J2650A17101n8359b6640k8756j21111E7859b69245A25239m5775J0438
16053H9902b23160a09151d5326q1447f252j00308B30420a0608D5642K66305a77850
$$ plain form
16130 -137579 65985 -86715 114179 -9466 -147216 -377056 46360 123781 -240706 177343 55403
16118 139089 -160952 142849 -396762 -104684 -212413 -155331 -70700 -360571 42232 -19760
16107 114587 -74247 -302577 133467 241278 -258254 301596 -146364 346586 181461 366560
16097 366560 338151 -135010 50578 -191772 25141 243108 131170 260652 -209747 17699
16086 -74367 188074 171223 13153 11735 140319 184338 160409 -9208 215423 -127368 -218980
16075 -218980 200816 216804 115273 -34768 -72747 187906 81976 299351 285415 -138626
16064 -52364 -39714 117101 58742 -26640 -55396 -176507 57859 -269245 125239 79464 89902
16053 89902 -223160 -109151 -45326 -126773 -6252 -106560 230420 -10608 45642 311947 -177850
16041c3351j67388A16233f5151A19617a64869B57566c43564G3289c827l15461
16031c19288i5868b3718A33785j7891Q9768o8556h4767A49528C5230a52071B64902
16019a15642n18061H9843a64533r3150J342L1122A44067k7381a89033Q5196A50895
16007A25019i8470E820a47552q7440A08597a26705A012a45908N9829c3729l1487
15996f5216l06118b9985A92543e115A70908p9281a49732I8283K87026A05433J90180
15985B95613r7319E3385J24423k1437J57939a1719j02141A6687i6491D72178D238
15973e95G4000N7979k1293D7433b87172B7529M9643J6634D2795A9113L89996A65182
15960A53234b73815d7720G8270j6637K42665d44047A57739H950e4860q9947A2878
$$ plain form
16041 -33351 -200739 116233 -65151 119617 -164869 257566 -343564 73289 -3827 -319288
16031 -319288 -95868 -23718 133785 115894 205662 137106 -84767 149528 35230 -152071 264902
16019 -115642 -633703 89843 -164533 -257683 -256341 -225219 144067 116686 -189033 -103837 150895
16007 125019 -98470 5820 -147552 -234992 108597 -126705 1012 -145908 -86079 -33729 -65216
15996 -65216 -371334 -29985 192543 -5115 170908 91627 -149732 98283 385309 105433 295613
15985 295613 198294 53385 177808 156371 314310 -11719 -113860 16687 -96491 472178 4238
15973 -595 74000 131979 110686 47433 -287172 27529 77172 93806 42795 19113 409109 165182
15960 153234 -273815 -47720 78270 61633 304298 -444047 157739 8950 -54860 -144807 12878
15948g8406H9351L2278Q7333C8179i4548c52k24784Q8373f1906a0121k46795e136
15935A02843C5779c02465R6345D771J1954Q0961a15938A02138Q0194a80992K1505
15924a59487k01126J42687J8421I753g8948m7099D8575J8005b9035j34403A05722
15912b97965M3138O4493c3341B01420g093C28270F5112J79213A12761D265a00870
15900F3688a4249B67569A7068J88131c97449D8964o898c23005e1536C0662a56299
15888e6475A52586B0719j258J50883H54b28826c4977H1790K37612j20976l7301
15877A61125c55290E1615i4077G8380e6963I9430b61851G3540e8096B32968H5950
15865A1244a20189J8565l49013C37563a75134o6271a482H2986a32789a3746r3140
$$ plain form
15948 -78406 89351 121629 208962 38179 -94548 -352 -225136 -136763 -61906 -10121 -256916 -5136
15935 102843 35779 -302465 -206120 4771 16725 97686 -115938 102138 182332 -180992 -159487
15924 -159487 -360613 -217926 -199505 9753 -78948 -126047 48575 66580 -29035 -163438 105722
15912 -297965 -254827 -190334 -33341 201420 -7093 328270 65112 244325 112761 4265 -100870
15900 63688 -14249 267569 17068 205199 -397449 48964 42066 -323005 -51536 30662 -156299
15888 -56475 152586 20719 19461 170344 854 -228826 -34977 81790 319402 198426 161125
15877 161125 -355290 51615 -94077 78380 -56963 99430 -261851 73540 -58096 232968 85950
15865 11244 -120189 -101624 -450637 337563 -175134 -241405 -1482 82986 -132789 -13746 -106886
15854a06886D2924R2503a29779J2475c1983A39071k1920c11126i2542B76432h9225
15842a25640r3503J07142k1857A63255b28724j13742c5814A13393e5054m123A686
15830D1868b58584P7557l0766j87940A41462d2723A51629a65692q8947C66808
15819f1512B7962c17723H6801g1074B70125j28881a38942A13767d78496J39911
15809c38585f1885A9068g4944A00940b0220n760D14879a61081P8970A42887B4059
15797A79218N3804E2857K22703a68377b6051F9398d8006a6234B6878J430J3525
15786D1833a93852N5808B49448F3054a30284j02370J15458o1842L1280B46399
15775d99430C08417h5261j02041k58588H8153h0354R576A67715q2577a41847C04464
$$ plain form
15854 -106886 42924 135427 -129779 -117304 -31983 139071 117151 -311126 -92542 276432 -89225
15842 -125640 -219143 -112001 -133858 163255 -228724 -342466 -35814 113393 -55054 -59177 1686
15830 41868 -258584 -181027 -211793 -399733 141462 -42723 151629 -165692 -254639 366808
15819 -61512 27962 -317723 86801 -71074 270125 141244 -138942 113767 -478496 -338585
15809 -338585 -61885 19068 -74944 100940 -20220 -25980 414879 -161081 -82111 142887 24059
15797 179218 233022 52857 275560 -168377 -26051 69398 -48006 -16234 26878 28308 41833
15786 41833 -193852 -138044 249448 63054 -130284 -232654 -117196 -179038 -147758 246399
15775 -499430 308417 -85261 -187302 -445890 88153 -80354 -70778 167715 85138 -141847 304464
15763c2236j99218A98613h8676A34596Q0662r0983g4730B2148N8214k113M5491
15752A23740k2131D0970a89583L0831B04226a41835j27264e3726K5783F0079J14181
15741A74260c26670a58505n5713B48682k1284r8967b6479a1419c669j86326B29340
15729I977g7461j1003A09039i7782j9830n3870l2739O42C3134O5773g0144l783
15717g3927B77449j20286b84171A38150A0106O6219a55975C6299d2878p9479l265
15706a25622L3192C8604b50191g4949k38135a38571C00559j39882a6039H6099
15695B2917J1881J05421M5955k435c65570E7062e2837k6053B40701D5605d4324
15683i9283p505B08749a34844A9658p374Q149J42845c28965c8199A67498b57117
$$ plain form
15763 -32236 -231454 198613 -88676 134596 215258 124275 -74730 22148 80362 78249 123740
15752 123740 101609 40970 -189583 -158752 204226 -141835 -269099 -53726 -27943 60079 174260
15741 174260 -326670 -158505 -214218 248682 227398 128431 -26479 -11419 -3669 -189995 229340
15729 9977 -77461 -88464 109039 -97782 -117612 -171482 -204221 -203579 33134 98907 -70144 -73927
15717 -73927 277449 157163 -284171 138150 10106 76325 -155975 36299 -42878 -122357 -125622
15706 -125622 -92430 38604 -250191 -74949 -313084 -138571 300559 160677 -16039 86099
15695 22917 34798 140219 186174 183739 -365570 57062 -52837 -78890 240701 45605 -44324
15683 -99283 -106788 208749 -134844 19658 12284 20433 163278 -328965 -38199 167498 -257117
15671B22097o7311A7906K01784F6250b7490j52222F8196B1242a2725j66969j66849
15660c46543e4792E6469K1153a01797D998a26082L962K7369D4706m871L2549i3261
15647D2078a26231A4669J33131E7661b8764A81910A1060b97842A48408E8888a29860
15635b84929B55275b09891A0137a07938o2659O3162I8640b02567L6949N0415N3777
15624f1426B7705a57990H1339i4079c4703j90410A11691E4446J2253f1645C97070
15612c3766j12905A70926a02916d6645A99757a8825E4973a28590o6871h9469I1829
15600a38135d4260o7361d0249k69666f6579F2080b37692a03541a2964r3869j46603
15589b53436B98400j38081J67355j29666H375M97145F216K35270B155a90305Q0426
$$ plain form
15671 222097 154786 17906 219690 66250 -27490 -179712 68196 21242 -12725 -179694 -346543
15660 -346543 -54792 56469 77622 -101797 4998 -126082 -122120 -94751 44706 39835 72384 -93261
15647 42078 -126231 14669 147800 57661 -28764 181910 11060 -297842 148408 58888 -129860
15635 -284929 255275 -209891 10137 -107938 -170597 -107435 98640 -202567 -165618 -115203 -61426
15624 -61426 27705 -157990 81339 -94079 -34703 -225113 111691 54446 66699 -61645 397070
15612 -33766 -146671 170926 -102916 -46645 199757 -18825 54973 -128590 -195461 -89469 91829
15600 -138135 -44260 -111621 -40249 -309915 -66579 62080 -237692 -103541 -12964 -106833 -253436
15589 -253436 298400 160319 327674 198008 8375 505520 6216 241486 2155 -190305 -109879
15578a09879F8827i268k18969C4361f9213m1719B66530a18397A81938f2082A85747
15566e5412o7132n3107N6951B50279A14542b85017B12358H569a1182D4464d963
15554A51895g2267j66667D8389a71837A18322h3330A33287B2292b07634b764B01802
15542i7981k70068I205M6834a34349b9795D32938h5149j62597e3326B7544J41349
15531A68893b38919E9337P951C1489a5942B92036r1823h411B5534c63836B21772
15519b15834d5490A05377M7494a28963O1130G2838b14585B08056i6349b6359B48896
15507A54343k4186J66972A44203O1074a79537J3926k71314B64542e3721A1038
15496a44410A57723P7732a99185A61101b29700J651R0517j17047g2705j33905
$$ plain form
15578 -109879 68827 -9268 -228237 34361 -69213 -110932 266530 -118397 181938 -62082 185747
15566 -55412 -122544 -175651 -118700 250279 114542 -285017 212358 8569 -11182 44464 -4963
15554 151895 -72267 -238934 48389 -171837 118322 -83330 133287 22292 -207634 -2764 201802
15542 -97981 -368049 9205 56039 -134349 -29795 432938 -85149 -247746 -53326 27544 168893
15531 168893 -238919 59337 67288 31489 -15942 292036 200213 -8411 25534 -363836 221772
15519 -215834 -45490 105377 152871 -128963 -67833 72838 -214585 208056 -96349 -26359 248896
15507 154343 130157 297129 144203 205277 -179537 -165611 -436925 264542 -53721 11038
15496 -144410 157723 235455 -199185 161101 -229700 -228049 -137532 -254579 -72705 -206610
15486b06610k48274d8180k52403A11149i2105k29045C31069A22645n892K01695
15476C18448b44727g8052j36958a02703j05458A34014i9295j70005c0209A08858
15465A6894a00690C3140a82104a3869l3611H7529K70023b34771p7489a13321G4521
15453f7243c2653F1788A8612a58977d0054A91354c0183B3530a41805b5215B7360
15441F7836a78543m0285h383A31844a56753B12491a78206m1015d2975j26738A74995
15429b61254j1802A56568J0886G9809c96417a16734A77244b12087G5264N0184
15419A25448f9728C22884A25986A4462c9242q5984k6281j12699h3358r7118E4645
15407A25464a07195G5360j8976N9970a69357j03707e5392a5527B45897a84674
$$ plain form
15486 -206610 -454884 -48180 -300583 111149 -92105 -321150 331069 122645 116753 318448
15476 318448 -244727 -78052 -215010 -102703 -208161 134014 -99295 -269300 -30209 108858
15465 16894 -100690 33140 -182104 -13869 -47480 87529 357552 -234771 -312260 -113321 74521
15453 -67243 -32653 61788 18612 -158977 -40054 191354 -30183 23530 -141805 -25215 27360
15441 67836 -178543 -218828 -8383 131844 -156753 212491 -178206 -219221 -42975 -169713 174995
15429 -261254 -273056 156568 167454 79809 -396417 -116734 177244 -212087 75264 125448
15419 125448 -69728 322884 125986 14462 -39242 -125226 -151507 -264206 -83358 -180476 54645
15407 125464 -107195 75360 56384 116354 -169357 -273064 -55392 -15527 245897 -184674
15396a9966j49559P4782j65274D9602a95511A04995R519J32359b35138H8595K07833
15385B96428a54971B33890a75716e9131l611k4532c0541j53200j8552G7294b6217
15373b65425M8241B37661E9518a42558q8265O7204J8358N6987A11160e8952j19326
15362a78278h1609G8108d177r3695A72789D7558d3009Q720A32629J61846A05923
15350a77154C3771a95946A07191a23325A0131a50465K9601N2439k5449B45586
15339G7157Q6003c7388I2834a27865n3483c1828C7732e5987a3403A0509N5934
15328F6443B5109h9606B0408K9403Q276O5913J11596M0656d88843B06975M9523
15317B56498l7265k6976D0707R1036E2254J86808K71969f8402n3101C14521g9836
$$ plain form
15396 -19966 -169525 -94743 -260017 49602 -195511 104995 114514 246873 -235138 88595 296428
15385 296428 -154971 233890 -175716 -59131 -62742 -87274 -30541 -183741 -202293 77294 -26217
15373 -265425 -217184 237661 59518 -142558 -230823 -163619 -145261 -88274 111160 -58952 -178278
15362 -178278 -81609 78108 -4177 -97872 172789 47558 -43009 -34289 132629 294475 105923
15350 -177154 33771 -195946 107191 -123325 10131 -150465 -120864 -68425 -93874 245586
15339 77157 163160 -37388 92834 -127865 -181348 -31828 37732 -55987 -13403 10509 66443
15328 66443 25109 -89606 20408 49811 58087 124000 235596 276252 -488843 206975 256498
15317 256498 219233 192257 40707 131743 52254 239062 511031 -68402 -121503 314521 -79836
15305B83022b53512i0673B8772a66002j26451E6482B2597a14119D05389A56844
15294A27072B1343M0087a1202g75l2242C10633G8707d9646A11012a05078B80124
15282A83082E6956Q9601d7295B53819h3543A56733O0386E4617A3674b74494A63758
15270E6539a42371B25582C3236h0565E5245b04107A34740j921c3321B84856J88667
15259D73523a5178o0442n7720H8946J01258J2904Q3937K9322j26704L11598L03321
15248H04582L93484m05282K79448B86236K5393A02234K23935j20767a05310A39252
15237E67995B55804K6172i0655I0658b41973A3215N7908J97058B5997a19415H2999
15225b8940C37712b08062C95948H8453b41017A50738n3687A098L25349L573j20265
$$ plain form
15305 283022 -253512 -90673 28772 -166002 -292453 56482 22597 -114119 405389 156844
15294 127072 21343 61430 -11202 -775 -33017 310633 78707 -49646 111012 -105078 280124
15282 183082 56956 146557 -47295 253819 -83543 156733 217119 54617 13674 -274494 163758
15270 56539 -142371 225582 33236 -80565 55245 -204107 134740 132819 -33321 284856 473523
15259 473523 -15178 -75620 -133340 88946 190204 203108 287045 316367 189663 501261 804582
15248 804582 1198066 792784 1072232 286236 311629 102234 326169 205402 -105310 139252
15237 567995 255804 281976 -90655 90658 -241973 13215 71123 268181 25997 -119415 82999
15225 -28940 337712 -208062 395948 88453 -241017 150738 97051 1098 326447 330020 209755
15214B09755k9240a91101C1578a77447H7513J27576P291Q1951q5583R1117p8735
15203B31130a04452C2148a30032b8046B72997A00895B878c9376j04957G8400K41429
15192C19829F6644B3890J44931j9045b5226m7044G3029O3217o7485A0190k608
15181G582J67444d6419r326B00239R7101B2007J87666a06616q6387A95914H5486
15169C4430J97826a19410B51850a13341j01267j15382a0700l010C3887A5570M1027
15158E6597O7152R4388g5764D9575I057K42678e030A64392b07265B49105p7557
15147A71548k2611D1317a35119M6601A91189a07107D61841B15222m0028b37733
15136a4507B01070D3600K67806a49019a9003C31634a44584B58156m7404P7039
$$ plain form
15214 209755 180515 -191101 31578 -177447 87513 215089 222380 304331 218748 309865 231130
15203 231130 -104452 32148 -130032 -28046 272997 100895 2878 -39376 -144333 78400 319829
15192 319829 66644 23890 168821 149776 -25226 -72270 73029 136246 68761 10190 7582
15181 7582 175026 -46419 -55745 200239 297340 22007 209673 -106616 -193003 195914 85486
15169 34430 232256 -119410 251850 -113341 -214608 -329990 -10700 -13710 33887 15570 56597
15158 56597 123749 218137 -75764 49575 9057 251735 -5030 164392 -207265 249105 171548
15147 171548 148937 41317 -135119 -88518 191189 -107107 461841 215222 175194 -237733
15136 -14507 201070 43600 311406 -149019 -19003 331634 -144584 258156 210752 287791
15126B87791H742N0935a30741A0327L55085r8636E0558F961K22101I9558L2089
15115A31647F5245a15376B06256q5257K26970K1485r8586F2402K5320b88701B61962
15103B02452j6672G4675B2854J89516K5787a04320a8683B59819I189J5084K17709
15092B41982j05283b43030A05049l7008b8868B67637E650J48185O44363A21540
15081A38774J973a71306a7466A54121J83371C8452L0710K58936G9384i5773B01610
15069B51704p8366D6572L21741A10794C9960K88432o2072K6715e7217I9937b40155
15057A87086J57673j11575g7647F1621b11594A72705J24852E7599K87300F9196
15046G9051a16697E9919a28275B76597E9463K71972r2771a70670a0847A96191
$$ plain form
15126 287791 8742 59677 -130741 10327 365412 266776 50558 6961 229062 99558 131647
15115 131647 65245 -115376 206256 120999 347969 369454 270868 62402 87722 -288701 261962
15103 202452 185780 74675 22854 212370 238157 -104320 -18683 259819 9189 24273 241982
15092 241982 136699 -243030 105049 68041 -28868 267637 5650 153835 798198 121540
15081 138774 140747 -171306 -17466 154121 337492 38452 69162 328098 79384 -95773 201610
15069 251704 173338 46572 368313 110794 39960 328392 266320 293035 -57217 99937 -240155
15057 187086 344759 233184 -77647 61621 -211594 172705 297557 57599 344899 69196
15046 79051 -116697 59919 -128275 276597 59463 331435 238664 -170670 -10847 196191
15035a06957N1553q0863b3410G0306i8103j91924E7053P5157M27824A59705Q260
15024A67965p160D5798k1309K93934j43089K01452p9119j32128a13689A04997
15013B69846L0872b53983G5712k296N927L4507N4130R1221j24412J36484H4971
15001C90218A3860N3461J23089J59505A0736L7382J87619c7130B70732J11640
14991C82372j75663L83278B67519J6423R0834A36513J9723a29784A88358J97538
14981C85896I4402J20384A01095l9487K80451M8495A02240l911L82309j62080
14971C18558M379m3982j03134D6746J671j0874K19563B348J03241J71455K33727
14960E10771B54176O8884J23861k16999A6782J82149E1635M21454j92515q7381
$$ plain form
15035 -106957 -55404 -136267 -23410 70306 -98103 -290027 57053 132210 560034 159705 167965
15024 167965 160805 45798 24489 318423 175334 376786 297667 165539 -113689 104997
15013 269846 300718 -253983 75712 73416 79343 113850 167980 259201 134789 271273 84971
15001 390218 13860 67321 190410 349915 10736 48118 235737 -37130 270732 382372
14991 382372 206709 589987 267519 283942 374776 136513 156236 -129784 188358 385896
14981 385896 94402 214786 101095 61608 342059 390554 102240 98329 480638 318558
14971 318558 322937 278955 175821 46746 48417 37543 257106 2348 105589 277044 510771
14960 510771 254176 323060 446921 229922 16782 198931 51635 473089 280574 193193
14950A93193R4108J14860j20393R0741J36417F9904J99623J9026L3282H4206J5497
14939I9703L04840K18667B40961C3235K9346J81429n4240p2065l8338J21900o6242
14928A35025M12812m6795B14020Q7718I3707L34692K0416J21986k09791A73830
14917B56081M24497F9485K26935j45826J40704q8171K27914j93530J19462J94493
14907E51466B64910j29279J21057E7190J17499a60038C59807c6722E12353n6013
14897D56340Q2624J88470H9456L59791o2073A85322J09018L93529j69550A57684
14886D15258j74393J73044A94592J47964j29059Q4432j0505M15050B21605N6905
14876B78510K86574k37576J42915j40818R7520j31012m6779P0193O4013j61493
$$ plain form
14950 193193 287301 402161 281768 372509 508926 69904 269527 288553 321835 84206 99703
14939 99703 404543 623210 240961 33235 62581 244010 189770 117705 79367 201267 135025
14928 135025 547837 501042 214020 301738 93707 428399 448815 570801 361010 173830
14917 256081 680578 69485 296420 150594 291298 203127 431041 237511 356973 551466
14907 551466 264910 135631 256688 57190 174689 -160038 359807 -36722 512353 456340
14897 456340 538964 727434 89456 449247 387174 185322 294340 687869 518319 157684
14886 415258 240865 413909 194592 342556 213497 297929 287424 702474 221605 278510
14876 278510 565084 327508 470423 329605 427125 296113 249334 319527 383540 222047
14866B22047J92702O4859j2784j69359j46435O3227Q9612K07867K05499B57015
14855D92642j27432K7920L191J19507L1524K0608k56136K3287j38613M07208A32941
14843C14027L7114K237J39463j40389L7227J15222J77067L6499k6151A4377J06463
14832A20840p458b480D30668L3489J28984A28044Q5929K88623L0781J22122M7725
14821G03224k21965O6341K0766j49577K32011O5948l08962J13726j58019K09627
14811E73120J18137j06498j77336R0970j29816P2184M30501C79591K492L48656
14801G30739j86681L06037l86937q4485K10896j55177n3158J96547A99386K44703
14791D44089J82656C08680K77512Q9236r4032p6603j03890O772K517K19224m6024
$$ plain form
14866 222047 414749 479608 466824 297465 151030 214257 303869 511736 717235 257015
14855 492642 365210 393130 396321 515828 547352 567960 311824 335111 196498 603706 132941
14843 314027 351141 353378 492841 352452 389679 504901 681968 718467 692316 14377 120840
14832 120840 113382 -2480 430668 464157 593141 128044 213973 502596 533377 655499 703224
14821 703224 481259 547600 568366 418789 650800 716748 407786 521512 363493 573120
14811 573120 691257 584759 407423 498393 368577 440761 871262 379591 382083 730739
14801 730739 544058 850095 463158 378673 589569 434392 381234 577781 199386 444089
14791 444089 626745 308680 586192 675428 581396 504793 400903 407675 410192 629416 583392
14780E83392n7447j82578L01112J39505l51682j227k8457J97282J75896l80426
14770C95370K54296k64083L97333q0975M2986p2134k50729K85929k82120N6840
14760D82713J31825J09243k17239j3731j09501L40754B41469Q7827J44102J09317
14750E82715k00472J88285l3328N8954m0487J16379k52039J87964j62952K50117
14740F95136k15738K54314j78467k52757L59173k6917q9573O009J68575k74429
14730D45326Q5423M17393p8783j89269j60867P888K41591j86351N3001K89353
14720I24705k24984j83776J95906O6090j79711M33672k69372j43129J57127J33840
14710I10368p600m4729j51752J26588n6987j87215J57147P6425L8643j85810J4377
$$ plain form
14780 583392 525945 343367 644479 783984 432302 431075 402618 599900 775796 395370
14770 395370 649666 385583 782916 701941 744927 672793 422064 707993 425873 482713
14760 482713 614538 723781 506542 492811 383310 724064 241469 329296 473398 582715
14750 582715 382243 570528 537200 596154 555667 672046 420007 607971 445019 695136
14740 695136 479398 733712 555245 302488 661661 634744 545171 551180 719755 445326
14730 445326 530749 948142 869359 680090 519223 527111 768702 582351 635352 924705
14720 924705 699721 515945 711851 777941 598230 1031902 762530 619401 776528 910368
14710 910368 902768 858039 706287 832875 775888 588673 745820 822245 860888 675078 689455
14699F89455l6585K19749J86778j92723L41394j71231k84270j05309J68678J58495
14689I74431m11583M32144n6101k67753K42409J71466k04444j14291P1007K66339
14679A103624j31646n8737L9218K42J29419k93149k89074J83589N50604n29991
14669G04099K25442J14848r3491m6070J79021j16758M0155N3111q3640K03539
14659A180256o3540J31681l2059l06731L65408l82791M01392m85470J45157L9848
14649I93151k9L33806j25278j62174N6406J83814m7356l21983J44092J15955J84733
14638A355137j21738N3615m7473J9572k49398J44193M72831o36106J79959M72783
14628A643375q9230O7361m95449K83849j05611p6788N7430l41555N65090q8816
$$ plain form
14699 689455 652870 872619 1059397 866674 1208068 1036837 752567 647258 815936 974431
14689 974431 562848 994992 938891 671138 913547 1085013 880569 766278 837285 1103624
14679 1103624 971978 913241 952459 952701 1082120 788971 499897 683486 1234090 704099
14669 704099 929541 1044389 950898 904828 1083849 967091 1007246 1060357 976717 1180256
14659 1180256 1116716 1248397 1216338 909607 1275015 892224 1293616 808146 953303 993151
14649 993151 993122 1326928 1201650 1039476 1095882 1279696 1232340 910357 1054449 1170404 1355137
14638 1355137 1233399 1287014 1239541 1259113 1009715 1153908 1626739 990633 1170592 1643375
14628 1643375 1554145 1621506 1126057 1409906 1304295 1227507 1284937 943382 1508472 1419656
14618A419656K35425l30118J14651m7712j53771K44813q677m8627L9812o6023
14608A399429o0602p1707O00578k66500j53533k75563K08830k4725O3583k855
14598A416935J63816j39601j93585L54619K2038j8063J96719k61349Q4670L66204
14588A992403l44622j49047J58933M23319j24344k14606J2031J23462k1345Q0399
14578A936583K90129k63875j92450R7794L03533k38665K42000P0379R9999R9515
14568B444942j5064l07383K07928l8665M89742k22508Q7649K14449O753M72945
14558C340788k45947N68657Q8230L33699J35750L98716P98255R52666O06503J617688
14548H595005L220513O890777J1537159L751952j5796680q327762l848745k051226
$$ plain form
14618 1419656 1655081 1324963 1439614 1391902 1238131 1482944 1474267 1425640 1465452 1399429
14608 1399429 1338827 1267120 1867698 1601198 1447665 1172102 1380932 1356207 1419790 1416935
14598 1416935 1580751 1441150 1247565 1602184 1624222 1606159 1802878 1541529 1626199 1992403
14588 1992403 1647781 1498734 1657667 2080986 1956642 1742036 1754067 1877529 1856184 1936583
14578 1936583 2226712 1962837 1770387 1868181 2171714 1933049 2175049 2245428 2345427 2444942
14568 2444942 2429878 2122495 2330423 2291758 2781500 2558992 2646641 2861090 2867843 3340788
14558 3340788 3094841 3663498 3751728 4085427 4221177 4619893 5418148 6370814 6977317 8595005
14548 8595005 11815518 18706295 30243454 33995406 18198726 9870964 6022219 3970993
14540C970993o78234k31490l53593P8795N1729j56479Q6857l76736L11327l71011
14530B332158J6130K9387L5304K70247o8583K50502l04530r7821L68900l39139
14520B492555q662P1566Q6064k57261L74102j46379N6586n0669J06035J98604
14510B922541k37173J62620J3571Q8289O7782j31766M87077l28737l8499J93928
14500C199633k49619N3741J15155J3066o72956Q17647j76535L43278j88170j61488
14490C093752K47248Q4527j33491L25289k15768K32302L6035j7374P2968o1742
14480C663746K90443k18109J40995M41412m60408K95904j85610K04706L4772q8066
14470D119785J29868r3928J88403M6463Q6555j46046M62068k96879j64916O6569
$$ plain form
14540 3970993 3292759 3061269 2707676 2786471 2838200 2681721 2768578 2391842 2703169 2332158
14530 2332158 2348288 2377675 2412979 2683226 2614643 2865145 2560615 2462794 2831694 2492555
14520 2492555 2483893 2555459 2641523 2384262 2758364 2611985 2668571 2617902 2723937 2922541
14510 2922541 2685368 2847988 2861559 2949848 3017630 2885864 3372941 3044204 3005705 3199633
14500 3199633 2950014 3003755 3118910 3131976 2459020 3276667 3100132 3443410 3255240 3093752
14490 3093752 3341000 3425527 3292036 3617325 3401557 3633859 3669894 3652520 3725488 3663746
14480 3663746 3954189 3736080 3877075 4318487 3858079 4153983 3968373 4173079 4207851 4119785
14470 4119785 4249653 4155725 4344128 4390591 4477146 4331100 4793168 4496289 4331373 4397942
14460D397942J45918Q63465l67218j58607J68083R0589r6825J21124J37146o2321
14450E239296K83446l25879J41788K65934p5727K26707p8282L01603M7924l28668
14440E698142R7244N97697j47787J09327J06222j52399N58756n47581L73152p2258
14430F620515M984L21617J56007j817j44500K05598J91801k48780O70613m85577
14420G290461M68118j05777L39101P6409J92516J48243p2872K26787l6941K5118
14410H551163K36721J95334L29826M9730K19472j25355L89922K04199j01073M81897
14400A0431836J4539R227L84976J22148j20677m3124J079128q2507j53390L07182
14390A1949338K92437L32857l3104K65820R0184M13376Q8451N02040Q3109L31817
$$ plain form
14460 4397942 4543860 5407325 5040107 4881500 5049583 5140172 5043347 5164471 5301617 5239296
14450 5239296 5522742 5196863 5338651 5604585 5528858 5755565 5677283 5978886 6026810 5698142
14440 5698142 5795386 6393083 6245296 6354623 6460845 6308446 6867202 6319621 6692773 6620515
14430 6620515 6625499 6947116 7103123 7101306 6956806 7162404 7354205 7105425 7776038 7290461
14420 7290461 7758579 7652802 7991903 8068312 8260828 8409071 8336199 8562986 8526045 8551163
14410 8551163 8787884 8983218 9313044 9362774 9582246 9456891 9846813 10051012 9949939 10431836
14400 10431836 10446375 10455602 10840578 10962726 10842049 10798925 11878053 11795546 11642156 11949338
14390 11949338 12241775 12574632 12541528 12807348 12897532 13310908 13399359 13901399 13984508 14316325
14380A4316325K77298K19130M12388M84177M14483j49027N00054J93428M28644
14371A7096900K46250L19670M19266P89818L9649J72452R89173J14310J99432
14362B0386920O22303O12748K71773N47185P58032M46125M79489N89145M81911
14353B5195631O67608O75443M43677P47390R59401M52855Q44724M92732J089470
14344C1568931P21167Q40491R21453J246106Q61283R57947J305672O95361J342991
14335D0461402J121816J131558J573409J100121J605367J484923J643201J583176
14327E1704973J758579J980866J723548J753111J988453K230007K368251K630077
14319F8137865K271253K534750K432335L181692L151360L101461L366056L350329
$$ plain form
14380 14316325 14593623 14812753 15225141 15709318 16123801 15974774 16474828 16668256 17096900
14371 17096900 17343150 17662820 18082086 18871904 18911553 19084005 20073178 20187488 20386920
14362 20386920 21009223 21621971 21893744 22440929 23198961 23645086 24124575 24713720 25195631
14353 25195631 25863239 26538682 26982359 27729749 28689150 29142005 29986729 30479461 31568931
14344 31568931 32290098 33130589 34052042 35298148 36159431 37117378 38423050 39118411 40461402
14335 40461402 41583218 42714776 44288185 45388306 46993673 48478596 50121797 51704973
14327 51704973 53463552 55444418 57167966 58921077 60909530 63139537 65507788 68137865
14319 68137865 70409118 72943868 75376203 78557895 81709255 84810716 88176772 91527101
14311I1527101M135354L825063M450242M135874M506687M978793N580949N520251
14303A28660314N150403O671894N868779O882614P074069P992105P391700Q932037
14295A84623915R145874R758020J0178337J0697733J1275481J1199510J1907442
14288B58786312J2356403J1853303J2004038J1845948J2079925J1683085J2916110
14281C43525124J2507919J1628337J0375807J0107122J0277264J0017673R983951
14274D18423197R489895Q986398P558954M246627K075334n68273p174166n012734
14266D38025232n655280j0861531j3295803j4134751j4120340j3326993j4198793
14259C52431741j3223562j2051451j3420141j2396610j2197117j2605702j1920093
$$ plain form
14311 91527101 95662455 99487518 103937760 108073634 112580321 117559114 123140063 128660314
14303 128660314 133810717 140482611 146351390 153234004 160308073 168300178 175691878 184623915
14295 184623915 193769789 203527809 213706146 224403879 235679360 246878870 258786312
14288 258786312 271142715 282996018 295000056 306846004 318925929 330609014 343525124
14281 343525124 356033043 367661380 378037187 388144309 398421573 408439246 418423197
14274 418423197 427913092 436899490 444458444 448705071 450780405 450212132 443037966 438025232
14266 438025232 432369952 421508421 408212618 394077867 379957527 366630534 352431741
14259 352431741 339208179 327156728 313736587 301339977 289142860 276537158 264617065
14252B64617065j1029437j0331366j0438169j0149773r033766r727143q682336
14245A95225075q224463p837684p425409p422074o494902o217486o412233n620503
14237A39570321o096421n183140n277235n121859m450450m174747m136974m290453
14229A00839042l899791l642626l251077l348860l560375l040429k869322k668263
14221G4558299k867836k106364k467177k417984k309245j971971k051286j705874
14213E6660562j988653j770542j518551j711339j420786j537226q86195j441002
14205D4386268j594180j438680j435236r64565r67536p52317j276405j115106
14197C4842243j275989n92831j021758m61622r47608r21119o27899j072911l74163
$$ plain form
14252 264617065 253587628 243256262 232818093 222668320 213634554 203907411 195225075
14245 195225075 187000612 179162928 171737519 164315445 157820543 151603057 145190824 139570321
14237 139570321 133473900 128290760 123013525 117891666 113441216 109266469 105129495 100839042
14229 100839042 96939251 93296625 90045548 86696688 83136313 80095884 77226562 74558299
14221 74558299 71690463 69584099 67116922 64698938 62389693 60417722 58366436 56660562
14213 56660562 54671909 52901367 51382816 49671477 48250691 46713465 45827270 44386268
14205 44386268 42792088 41353408 39918172 38953607 37986071 37233754 35957349 34842243
14197 34842243 33566254 32973423 31951665 31490043 30542435 29621316 28993417 27920506 27546343
14188B7546343m85279j321549j83137m76065n29400n32145p83636o37094l3650
14179B2564388o52793k91168q63181m77068j51147m67279p36729p8901m25185
14170A8420937k44681k56120l59280l96528l21741n06084m29805p9286j85840
14161A5641572m40197l60868J89441m93281j81718n08254J9258l14138r3318j57347
14151A3301150n54605J32901k70553m30589j13812k38321j30985o7142j00120
14142A1527924k14126l28733j37259K902J9591k93349k27642j68184J49841o74559
14132I656406J6966p3898k06050m60473J26638j01714j0627k06080J17169l62518
14122H495819p1159m23080J09981j59156O1588r0893l49713p7948k481R8123j20977
$$ plain form
14188 27546343 27061064 25739515 25556378 25080313 24550913 24018768 23235132 22598038 22564388
14179 22564388 21911595 21620427 20757246 20280178 20129031 19661752 18925023 18846122 18420937
14170 18420937 18176256 17920136 17560856 17164328 16842587 16336503 15906698 15827412 15641572
14161 15641572 15201375 14840507 15029948 14536667 14354949 13846695 13865953 13551815 13458497 13301150
14151 13301150 12746545 12879446 12608893 12178304 12064492 11826171 11695186 11628044 11527924
14142 11527924 11313798 10985065 10847806 10850708 10870299 10576950 10349308 10181124 10330965 9656406
14132 9656406 9673372 9599474 9393424 8932951 9059589 8957875 8947248 8741168 8858337 8495819
14122 8495819 8424660 8001580 8111561 7952405 8013993 7923100 7573387 7495439 7492958 7591081 7470104
14111G470104l16093k00734O19742o74513N38880m04542m39604k9696k49650M20256
14101F734150j82879k27267j53610L38343o23657M59570l74293j33241J46578
14092E983694j16002Q7299k17976J7897k55085R9598j2640j45776m1971J14169
14082E513207n85397J95585K1256k48477j65709L51934l80348L89732k27297j58692
14072D705794o383J93252n174j15956l0807q4373n58709L80239r9220n3440j26940
14061D198283K3416J24169n5583q4686l49044K88100O2031q0324k38324j87968
14051C700070L15636r1472J44877j95567N2103l19097r350q3574K42241m51175
14041C304692J68511M5102L9701l48613M32473k83383R9883m55324l5081L53834
$$ plain form
14111 7470104 7154011 6953277 7573019 6898506 7437386 7032844 6593240 6563544 6313894 6734150
14101 6734150 6551271 6324004 6170394 6508737 5885080 6344650 5970357 5837116 5983694
14092 5983694 5867692 5954991 5737015 5754912 5499827 5599425 5586785 5441009 5399038 5513207
14082 5513207 4927810 5123395 5144651 4896174 4730465 5082399 4702051 5091783 4864486 4705794
14072 4705794 4699411 4892663 4887489 4771533 4740726 4656353 4097644 4477883 4378663 4325223 4198283
14061 4198283 4221699 4345868 4290285 4205599 3856555 4144655 4206686 4126362 3888038 3700070
14051 3700070 4015706 3924234 4069111 3873544 3925647 3606550 3597200 3513626 3755867 3304692
14041 3304692 3473203 3518305 3558006 3209393 3641866 3358483 3458366 3003042 2967961 3321795
14031C321795l92977M93350k4645l80872j67141M12376k52057M0404Q8447j54027
14021B984653J55180j14054J93573m92775K26265l66100J3011J78171P3470L5274
14011B886668l07176M1518J30810m42946J73562Q0009j06411L57444k71769P4371
14001B616080J89468j52344j6781L17337j50785j26621K58263j64253O65989K87315
13991C723668K06032Q08391Q42279K002966N699404J1413354R951659j3169171
13983B1478582p629851m530389k356523j354242m13288j064817O622p70649N14218
13974C879663m43833j55929M4634n29380J79297k46396o8922K80944m17853l4026
13964B488199k04904M83968k62760J28699O5760k08437j87854l42110M18442j58150
$$ plain form
14031 3321795 2928818 3422168 3397523 3016651 2849510 3261886 3009829 3050233 3138680 2984653
14021 2984653 3139833 3025779 3219352 2726577 2952842 2586742 2599753 2777924 2851394 2886668
14011 2886668 2579492 2621010 2751820 2308874 2482436 2562445 2456034 2813478 2541709 2616080
14001 2616080 2805548 2653204 2636423 2953760 2802975 2676354 2934617 2770364 3436353 3723668
13991 3723668 3929700 4738091 5580370 7583336 13282740 24696094 34647753 21478582
13983 21478582 13848731 9318342 6961819 5607577 5194289 4129472 4136094 3365445 3879663
13974 3879663 3435830 3279901 3324535 2795155 2974452 2728056 2659134 2940078 2522225 2488199
13964 2488199 2283295 2767263 2504503 2633202 2698962 2490525 2302671 1960561 2379003 2220853
13954B220853M58790j32120j61760j29059j97151P2295M4345j88129K27173k73368
13944A941869j43088j96373M41828J02549K01279p04007M12956j5625l17307Q4598
13934A808679k28580R1979J70969l52505N10843l51911M08501l05459N1809p633
13924A796692j81532J59006R7127o4705l01207L51873M110l22455L22490j96971
13914A664428m47856L16195j4127L07179Q3812o58727K41829j40648P8250N8543
13904A488878l61825L59783L06572j21024j05996j98809R7119l88462K00697K19461
13894A496394k1279j18529K36013m04449n0432J68075q3155J10157j7497J06503
13884A421801j29961j14040K62106k92711j6524m2282M1217K79978o8198k66694
$$ plain form
13954 2220853 2679643 2547523 2385763 2256704 2059553 2131848 2176193 1988064 2215237 1941869
13944 1941869 1798781 1602408 2044236 2146785 2348064 1644057 2057013 2041388 1724081 1808679
13934 1808679 1580099 1672078 1843047 1490542 2001385 1649474 2057975 1752516 1804325 1796692
13924 1796692 1615160 1774166 1871293 1806588 1505381 1857254 1861364 1538909 1861399 1664428
13914 1664428 1216572 1532767 1518640 1825819 1909631 1250904 1492733 1352085 1430335 1488878
13904 1488878 1127053 1486836 1793408 1672384 1566388 1367579 1464698 1076236 1276933 1496394
13894 1496394 1475115 1356586 1592599 1188150 1137718 1305793 1222638 1332795 1315298 1421801
13884 1421801 1291840 1177800 1439906 1147195 1130671 1088389 1129606 1409584 1341386 1074692
13874A074692J19315j32742k23091L96213j1299j47084q395K75623J39364k37276
13864A245320M92975p92367J91567L82316n81845K3884J54541K13952l11004J34315
13854A153654m572Q8129k1812j14567l4252N0112J12015p3113N021l8545l6486
13843A085584k84444J49147J22716M1160l85016L56933j01917K05613j00840K64206
13833A353142q7688k69929L34808n15891L59754k80542J16529j62377K02943k84845
13823G65904M43420l38306K85851j97175J89493l54201K93274k43311L64572j51433
13813A058088J46050l82942J71529K15433l85508L44732E79884O8415K67149k74799
13803F40649K27852R4642k26389K82462j72294j27937L30477J20196k93181j04705
$$ plain form
13874 1074692 1194007 1061265 838174 1234387 1223088 1076004 1067609 1343232 1482596 1245320
13864 1245320 1738295 945928 1137495 1519811 937966 961850 1116391 1330343 1019339 1153654
13854 1153654 1149082 1237211 1215399 1100832 1066580 1116692 1228707 1155594 1160615 1122070 1085584
13843 1085584 801140 950287 1073003 1114163 729147 1086080 984163 1189776 1088936 1353142
13833 1353142 1265454 995525 1330333 814442 1174196 893654 1010183 847806 1050749 765904
13823 765904 1209324 871018 1156869 959694 1149187 794986 1088260 844949 1209521 1058088
13813 1058088 1204138 821196 992725 1208158 822650 1167382 579884 648299 915448 640649
13803 640649 868501 963143 736754 1019216 846922 718985 1049462 1169658 876477 771772
13793G71772K07350j3914m9847k94494m0961N06079D13066L01103L32765k99654
13783G47280O1009j59317R8080M12808k61180r2887C99075r946Q1739N39456j12792
13772H97532j07188o7402J4013L00647m56307J95603J0499K40189m49080N01156
13762A079662m81611L50339m16751J24881Q1968M79993C43410J96050J49035j12316
13752E76179l6595L26914r0085J37124J54827D53656K00502k83786K63061J77915
13742H11348o594j22020p0838R2934K3115J21987l06971k5056K71333l30653o989
13731D51596J73853J83040l88620O1368L40943j31251j8469L1860P0418n8525
13721G16213j22391m4813K27271l26845j03303K67804j75004J35401q692K15297
$$ plain form
13793 771772 979122 965208 915361 620867 579906 1085985 413066 714169 1046934 747280
13783 747280 808289 648972 747052 1159860 898680 805793 399075 389129 470868 1010324 897532
13772 897532 790344 722942 736955 1037602 581295 776898 787397 1027586 578506 1079662
13762 1079662 598051 948390 531639 656520 738488 1218481 343410 539460 688495 576179
13752 576179 539584 866498 776413 913537 1068364 453656 654158 370372 633433 811348
13742 811348 804754 682734 611896 704830 727945 849932 542961 517905 789238 458585 451596
13731 451596 625449 808489 419869 481237 822180 690929 672460 704320 774738 716213
13721 716213 593822 549009 776280 449435 346132 613936 438932 574333 565641 780938
13711G80938R5139m15543M39377D10342N2088J29666K0643p2239K33304r8207
13701F75597J24761B65732L58419o7353K7810k39496J81289B06544M22352l562
13691F25334J53180l81067O5710j36962L64407j19279J53919O8719j22272O0939
13681G32628J52861k10490k4199k67340J13010K12788k91264J579L05156A73352
13670E87574K8926j63952J36563j72503O2133J08267j36675K88020l37550K78290
13660F79093j34864K27290j07579k06641q0924r7500L89625B54157L86997M4222
13650F85376B46152N85514l86654J95190O8821m4304O6868C56036n1560L11711
13640F16187K0612J75728C46806J1911L39020B69108L93548l21816B5919L27356
$$ plain form
13711 780938 876077 460534 899911 410342 462430 592096 612739 540500 773804 675597
13701 675597 800358 265732 624151 556798 584608 345112 526401 206544 628896 625334
13691 625334 778514 397447 463157 326195 690602 571323 725242 793961 671689 732628
13681 732628 885489 674999 650800 383460 496470 709258 417994 419573 724729 173352
13670 587574 616500 452548 589111 416608 478741 587008 450333 738353 400803 679093
13660 679093 544229 771519 663940 457299 376375 278875 668500 254157 641154 685376
13650 685376 246152 831666 445012 640202 709023 664719 731587 356036 304476 616187
13640 616187 636799 812527 346806 358717 697737 269108 662656 340840 25919 353275
13630C53275n1442J90245n3753r4567L17472A22582M10961A56152M4503j650L62689
13619E61694o6800o6053O1644A63595K74100j49936K56942q4530N0172j63704
13609C46639A26015R6444m1310K69950J68342K530j72844J74226l6091j31770
13599D55492j73648O2587R7201O2699B39319L49988j56978I6325Q8975J57807
13589C43107k4546O00256m10701j87748A39477P2557N02981K32145k99193A10435
13578I2932N2937L61808j42207O451E1695N28843r2675L1090k55190p1095g2120
13566B52767A02708L45546m4906j42213K09206B05551L80003B35167K74825k3835
13556D86157r0726J84450B82375M11265k26814j77152M4655q3369A10487J18564
$$ plain form
13630 353275 301833 492078 438325 343758 661230 122582 533543 156152 200655 199005 561694
13619 561694 494894 428841 490485 163595 437695 287759 544701 460171 510343 346639
13609 346639 126015 222459 181149 451099 619441 621971 449127 623353 587262 455492
13599 455492 281844 344431 441632 504331 239319 589307 432329 96325 185300 343107
13589 343107 318561 918817 508116 320368 139477 212034 715015 947160 647967 110435
13578 92932 145869 507677 365470 371921 51695 580538 487863 518953 263763 192668 -72120
13566 252767 102708 448254 403348 261135 470341 205551 585554 235167 509992 486157
13556 486157 395431 579881 282375 693640 466826 289674 334329 250960 110487 229051
13546B29051K84932F0729M92170g238B09074J18369J72090j24586j85058K02226
13536C92115J5451j34162A03928J84294K65098A13369K56151J97473B56618J6388
13526B73006J3233J13444j00523N4390j5163q8993p3898K31165B00914J54267
13516C55181j38747k8428J58492e801A16247N54190B20577K0025L42462j29194
13506D53870a2070A37392O865P8183K58274D3717K47675j3602L6064K38104k64020
13495B87938K5118l282j00189J35414P65m6223j12758K11839N4427r5778B3028
13483B46875K27729p0910j05003j08442J55091J9934l7471J41727q8410j9726
13473C61394m3661p6959R9255m0160M6139J24289A49446J27484n6012Q2715A11327
$$ plain form
13546 229051 513983 60729 552899 -7238 209074 327443 499533 374947 189889 392115
13536 392115 407566 273404 103928 288222 553320 113369 369520 566993 256618 273006
13526 273006 286239 399683 299160 353550 338387 249394 175496 406661 200914 355181
13516 355181 216434 188006 346498 -5801 116247 670437 220577 240602 583064 453870
13506 453870 -12070 137392 144257 222440 480714 43717 291392 277790 313854 551958 287938
13495 287938 313056 309774 209585 344999 345764 299541 186783 398622 453049 357271 23028
13483 246875 474604 403694 298691 190249 345340 365274 327803 469530 381120 361394
13473 361394 317733 240774 340029 299869 346008 470297 149446 276930 220918 303633 111327
13461B33659l2819Q631q6831K49991j52090n2199K97093J38755B27004K6210J2347
13450B65561q9741j6501J30640K54991B35522G125J79171L13580m6256j62914
13440B90706n8322J65436A91018K77594b4282A09374J87532A37797D0534K09440
13430B49974J62225A59793J5472J05744O1071A21502M45524A12464n3765K33353
13420B92052a8227D06931O3088A95671k1221n0962J76292a93179D16498j80906
13410B35592A0416M49370O9685B52584F5218K45653m9538a76235I3089J65084
13400B58173L2092P8817j48721o3312J0849R134k8481J13825e0375O913E56222
13388D26257B09134J62691F4928L30651K08893B58541F7106J09530b80750B78483
$$ plain form
13461 233659 200840 209471 122640 372631 220541 168342 465435 604190 227004 253214 265561
13450 265561 175820 159319 289959 544950 235522 7125 186296 499876 453620 290706
13440 290706 232384 397820 191018 468612 -24282 109374 296906 137797 40534 249974
13430 249974 412199 159793 175265 281009 342080 121502 567026 112464 58699 292052
13420 292052 -18227 406931 470019 195671 174450 123488 299780 -193179 416498 235592
13410 235592 10416 459786 529471 252584 65218 310871 261333 -176235 93089 258173
13400 258173 290265 369082 220361 157049 167898 177032 148551 262376 -50375 -43462 556222
13388 426257 209134 371825 64928 395579 604472 258541 67106 176636 -280750 278483
13377B10487I2179N1691K77908j92208m7715P2449Q9714A13940K9174J74359o7543
13366B49930H6749L02034m1299M2305A07191K30842A52201N9947M0896o6140K13559
13355D00463G9202K99774r3127A35869K60730j68902J17870J41718r5012J84867
13345E77140j76885l9689L2989j56777K32206g7864B70520m4667E6299K63492
13335C19791D1070L64048l5200E1692M1730M1011J36719N0246j44773J46074k1752
13324C00947J72228L8085j13795A55307Q2190J2076l1429J08328K45304D0166
13313E27295B56132N4024r491G2353J44141K1137j00498a12884D06257E2146J43650
13302A95796K9646n9362Q3909J79272E1982A1163P5707Q8523K38000A67881A0355
$$ plain form
13377 210487 92179 143870 421778 229570 181855 254304 344018 113940 143114 317473 249930
13366 249930 86749 388783 347484 389789 107191 338033 152201 212148 253044 186904 400463
13355 400463 79202 378976 285849 135869 396599 227697 345567 487285 392273 577140
13345 577140 400255 360566 393555 236778 468984 -77864 270520 225853 56299 319791
13335 319791 41070 405118 369918 51692 93422 134433 271152 321398 176625 322699 300947
13324 300947 473175 511260 397465 155307 237497 249573 218144 326472 571776 40166
13313 527295 256132 310156 300665 72353 216494 237631 137133 -112884 406257 52146 195796
13302 195796 225442 166080 249989 429261 51982 11163 86870 175393 413393 167881 10355
13290e3780J5250A89185O3270g397F0378C0128H419M0321K87015E1555b63423
13278a30567E9927L02440A23383e6881G2201J55562A7026a57069c0688C03763
13267A86809b02486E48602A31275c7318C53539k6889B9318d2129H3494K27317
13257C10811j09304J48378G183h4114A68805j8431K3846a4759D75358b6149B88680
13245C43762H1335B6353a06967A4910a37366B33919d8941A85621J16721J0443
13235C12785a37644h09A47445p1936a76574G0569l2344J80192k9903I3060c280
13223C12798F9814L02463j14322r8148F8586K05971g5510D880O1775K12195I7571
13211A3539N1385K26316m7447o6829M7329Q6924J76966a44057C40948A39478l7507
$$ plain form
13290 -53780 -38530 189185 252455 -7397 60378 30128 8419 48740 335755 51555 -263423
13278 -130567 59927 362367 123383 -56881 72201 227763 17026 -157069 -30688 303763
13267 186809 -202486 548602 131275 -37318 353539 326650 29318 -42129 83494 310811
13257 310811 201507 349885 7183 -84114 168805 150374 174220 -14759 475358 -26149 288680
13245 343762 81335 26353 -106967 14910 -137366 233919 -48941 185621 302342 312785
13235 312785 -137644 -809 147445 75509 -176574 70569 38225 218417 188514 93060 -3280
13223 312798 69814 372277 257955 159807 68586 274557 -75510 4880 66655 278850 97571
13211 13539 64924 291240 243793 176964 224293 311217 488183 -144057 340948 139478 101971
13200A01971L1667K9521J75503P8380m3669A37257K85265k11179h4488A20098
13189C14191J54969c9382C06222c3980o2487A90842H8432K55835D4280J71527
13179B15807j9223K3720b16428d5035A18931E2831a19215E26232a4215l57497
13169c71712a77152A66296E8032b02125B49933P7578d1733A30890B5553L1689
13159E7242L3413a15570C15558l2926a6578B56964A19021K31075D4304L50883
13149C95187a53362i280m4569B06045Q05L5120j08731A6073a29004j17585E8280
13137e114B04253c2612A30048J2794m7376O8815M6147n9114D3886L9839b3868
13125e6860B22095l7538G935e5882p9664A79104d6981A7053L85388f6491C39812
$$ plain form
13200 101971 133638 163159 338662 417042 373373 137257 422522 211343 -84488 120098
13189 314191 469160 -39382 306222 -33980 -96467 190842 88432 344267 44280 215807
13179 215807 196584 220304 -216428 -45035 118931 52831 -119215 526232 -14215 -371712
13169 -371712 -177152 166296 58032 -202125 249933 327511 -41733 130890 25553 57242
13159 57242 90655 -115570 315558 282632 -16578 256964 119021 350096 44304 395187
13149 395187 -153362 -9280 -53849 206045 206850 241970 133239 16073 -129004 -246589 58280
13137 -5114 204253 -32612 130048 142842 95466 164281 210428 151314 43886 83725 -23868
13125 -56860 222095 184557 7935 -55882 -135546 179104 -46981 17053 402441 -66491 339812
13113A14748D8196Q293K66349a48345B05914n6389j3809a9110I3363M7193J40725
13102B81281j29653E3110a0730C14782a58877A06224b95761A63312a61483C87863
13091I5427i6513A5190L21633j4482e3399C35880J10875A87084K33091j2536G5043
13079F8098K17816a12678G559O197P9066g2375A54509C4956K96556a42585c8389
13067H1614K8831f0731C91733F8620B2467J32097d620A93530c69007B84165d3240
13055d9137B95731G3256a55276A075a54044c1288D03303c3934C06163A14591e7579
13043B25166b2559C38014Q9037j51964a85324C81176H7474B1648L35617J29947
13033D87212A95720H8346M5104C7401b24449A51325J08444I7966K16533R1597
$$ plain form
13113 114748 48196 56489 322838 -148345 205914 149525 135716 -19110 93363 140556 281281
13102 281281 151628 53110 -10730 314782 -158877 106224 -295761 163312 -161483 387863
13091 95427 -96513 15190 336823 322341 -53399 335880 446755 187084 420175 407639 75043
13079 68098 285914 -112678 7559 13756 92822 -72375 154509 34956 331512 -142585 -38389
13067 81614 110445 -60731 391733 68620 22467 154564 -4620 193530 -369007 284165 -43240
13055 -49137 295731 73256 -155276 1075 -154044 -31288 403303 -33934 306163 114591 -57579
13043 225166 -22559 338014 427051 275087 -185324 381176 87474 21648 357265 487212
13033 487212 195720 88346 133450 37401 -224449 151325 259769 97966 314499 406096
13023D06096b3719j57549H3785K27194C426d001a311j5529k44189A52989e1275
13011A77217p3613k4158K64286k6718O4005A62221n6649h4525B8013q038K57501
13000B77476A4269L89250C5737a2105A30704K33619j33019j5101E2237J59226
12990B11463O0159L792a07630L9865A27878J16657I6544J16029a29467F8937b26717
12978A52425o0065J95954A07429k8692c18403C7490i3655I7167a00731C38462
12967B44637a17280A23155o0889J29228h5522l1127k3916I636a15336a5131m3359
12956e8490A54732J32717A23129i7938B1210J6043K56241h1114I1944q413J9066
12945A02597a06612D7122M44681c2203B79463B0960K45685c54937A6795c71397
$$ plain form
13023 406096 -23719 -181268 83785 310979 3426 -4001 -1311 -16840 -261029 152989 -51275
13011 177217 103604 79446 343732 317014 381019 162221 105572 -84525 28013 19975 277476
13000 277476 14269 403519 35737 -12105 130704 364323 231304 216203 52237 211463
12990 211463 271622 275414 -107630 -67765 127878 244535 96544 212573 -129467 68937 -226717
12978 152425 92360 288314 107429 78737 -318403 37490 -93655 97167 -100731 338462
12967 244637 -117280 123155 62266 191494 -85522 -116649 -140565 9636 -115336 -15131 -58490
12956 -58490 154732 287449 123129 -97938 21210 37253 293494 -81114 91944 83531 102597
12945 102597 -106612 47122 491803 -32203 279463 20960 266645 -354937 16795 -371397
12934A53844g2204C39967A68434f764F724b77711d5752B8520L205J95114L3236
12923B60075a01975I3214Q4273N3123D1510K03472N4678r6215L7089L43086c07676
12911d8A29238P7169l7166a12260k5553A46996n7032M0557P1283a68074D98024
12899a88188B56211q1171g506B60799j8675O5261f9801j13607Q9893d0822a0873
12887A15153f7168C1061a7102k04624C5897J56568g390H3378a5781k29314f2103
12875a32833A99373B3661K41360h3077B37004A01154J04515a27342G3634A6407
12864d7399E5483B2091M6392K88632b86447M2196B84978A3192a34998I0481c7165
12852f2155D8094G35b91966f2564D12544h3205h020n0221A80845C6077b33324
$$ plain form
12934 153844 -72204 339967 168434 -6764 6724 -277711 -45752 28520 31725 226839 260075
12923 260075 -101975 93214 177487 230610 41510 244982 299660 203445 240534 583620 -307676
12911 -48 129238 206407 169241 -112260 -137813 146996 89964 130521 201804 -168074 498024
12899 -188188 256211 175040 -7506 260799 242124 307385 -69801 -183408 -93515 -40822 -10873
12887 115153 -67168 31061 -17102 -221726 35897 192465 -7390 83378 -15781 -245095 -62103
12875 -132833 199373 23661 265021 -83077 237004 101154 205669 -127342 73634 16407
12864 -47399 55483 22091 68483 357115 -286447 -244251 284978 13192 -134998 90481 -37165
12852 -62155 48094 735 -291966 -62564 412544 -83205 -8020 -58241 180845 36077 -233324
12840A99828e0094m5553a345j68223H6141a32869A75048m6700J62263b3368B48938
12828F9609a4368j25283F413b12374k240f6351A07650l8720Q8308g6199C12134
12816a91433C7764a6548l83618A08360b26675I3878b94155A05285a8634A18067
12805a5113B46607I914M3769M5684a06755H4939g0440k8222J3565c8689j89296
12794b27985E4877b66556A22782A8118J36745o8474k6215J83777j6979b73473
12783B63441D3285J91907b54129A35036N8476c331H7108O3796b3930I1161O5001
12772A56162k1288L3862J00196E3860d7645H6839b3294j65985B8374M441a21077
12760A65635m9375L51116H1995k454g364a46B42390C9958c8602h580p6502H2317
$$ plain form
12840 199828 -50094 -95647 -1345 -169568 86141 -132869 175048 128348 290611 -23368 248938
12828 69609 -14368 -139651 6413 -212374 -214614 -66351 107650 68930 157238 -76199 312134
12816 -191433 37764 -16548 -400166 108360 -226675 93878 -294155 105285 -18634 118067
12805 -15113 246607 9914 53683 99367 -106755 84939 -70440 -98662 -85097 -38689 -227985
12794 -227985 54877 -266556 122782 18118 154863 86389 60174 243951 226972 -273473
12783 263441 43285 235192 -254129 135036 193512 -3331 87108 150904 -23930 91161 156162
12772 156162 134874 168736 268932 53860 -47645 86839 -23294 -189279 28374 32815 -121077
12760 165635 116260 467376 81995 79541 -7364 -146 242390 39958 -38602 -8580 -85082 82317
12747C6434f2202B2251h8515D03443A27864A0591Q6152a45718C38381m0524E9867
12735a14062B24605A03882l6070J32620J74072j02644F5751K25048J12393b5421
12724A08475J0489J4774i5726B27705K874a50607D30547j84607b53283B0942d00332
12712B688b00760H782N1370J18454K87796K574j62223a03503A21043j8950K35674
12701C37767R4671B03978g7134A69184c6313k17374i2251n1655B5439K7852J63306
12690B16597a12704q754f0366n7398A33612N5168a84723C79882A47169K73909
12680D21078A53889J5666B5895K14123j11680L8398a66467A00707a74148A28408
12669A32612J9415a86699B69401j05077b6285l5784j99329Q9572B77163A8895
$$ plain form
12747 36434 -62202 22251 -88515 403443 127864 10591 96743 -145718 338381 297857 59867
12735 -114062 224605 103882 67812 200432 374504 271860 65751 290799 403192 -25421
12724 108475 118964 133738 -95726 227705 230579 -150607 430547 245940 -253283 20942 -400332
12712 2688 -200760 8782 60152 178606 466402 468976 306753 -103503 121043 102093 337767
12701 337767 432438 203978 -77134 169184 -36313 -253687 -92251 -143906 25439 53291 216597
12690 216597 -112704 -121458 -60366 -117764 133612 188780 -184723 379882 147169 421078
12680 421078 153889 169555 25895 240018 128338 166736 -166467 100707 -174148 128408
12669 132612 152027 -186699 269401 164324 -26285 -62069 -261398 -171826 277163 18895
12658C3138J67749r6543J14112k9316G5815K08802p0163K59643a0940A9106b7255
12646A6027a55285A67088G1725a46477f8558l0602B25655J23651f6953d397A30654
12634E0824K42697L4827E3486R6724m0942J12413J65071H6270P9273n8261N6251
12623A63533D3959j3081L92847c465A53029a57176A87333J01438j01472J05944
12613B93243B3149p510Q0069J09162b11471A60285k7355d8632b1060B7675L32575
12602C60250r3455B0434R2470J55775I4107J2119O837B3955N8216b9518E3473
12590a23877C4586A0778a88619E4185K07177G4128O358g0302j19886A04003j653
12579A02350l6605J03410M2645a21725B38084A06150f4185A63559J06673g5594
$$ plain form
12658 33138 200887 104344 218456 189140 75815 284617 214454 474097 -10940 19106 -27255
12646 16027 -155285 167088 71725 -146477 -68558 -99160 225655 349306 -66953 -4397 130654
12634 50824 293521 328348 53486 150210 109268 221681 386752 86270 165543 107282 163533
12623 163533 43959 30878 423725 -3465 153029 -157176 187333 288771 187299 293243
12613 293243 23149 15639 95708 204870 -211471 160285 132930 -48632 -21060 27675 360250
12602 360250 266795 20434 112904 268679 94107 106226 113063 23955 82171 -29518 53473
12590 -123877 34586 10778 -188619 54185 261362 74128 80486 -70302 -190188 104003 102350
12579 102350 65745 169155 211800 -121725 238084 106150 -64185 163559 270232 -75594
12568d1712j69982a1089j16371A61352n5060a53512C3032a55810B69845H2144
12557H9394J02924a91163B91074C5701J60138f776j9066j27433E5834d7258A9910
12545I597L47495G1665d1061j88499I0703d0732p4740b3106I7105f2768J0307
12534e2461a4798k80683A88611e537j48914A76109b57022r8210J35821B39847
12523G6401g2B92103j8585j1698L6748c5848J725G1443C5334O9663i2802j34986
12511b27788C03126q0170G7654a43494A11771b22198A86094a05768A12630A424
12500d9698D7493i1283b9493k8080n3124G5022d2231n9478B4135a9491p5075P858
12488h6708q5873A43191i187m9125B07218f012G0589f2556F606L3750J00438j129
$$ plain form
12568 -41712 -211694 -11089 -127460 161352 106292 -153512 33032 -155810 269845 82144
12557 89394 192318 -191163 291074 35701 195839 -6776 -25842 -153275 55834 -47258 19910
12545 9597 357092 71665 -41061 -229560 90703 -40732 -115472 -23106 97105 -62768 -52461
12534 -52461 -14798 -295481 188611 -5537 -154451 176109 -257022 -355232 -219411 239847
12523 76401 -72 292103 273518 261820 298568 -35848 -34123 71443 35334 104997 -92802 -227788
12511 -227788 303126 222956 77654 -143494 111771 -222198 186094 -105768 112630 1424
12500 -49698 47493 -91283 -29493 -57573 -110697 75022 -42231 -101709 24135 -19491 -94566 -86708
12488 -86708 -172581 143191 -9187 -58312 207218 -6012 70589 -62556 6606 40356 140794 139665
12476A39665L0865J40037j23317a44350I0791J11010C3469i0870j91277A33243
12465D06627d00759J51798c273C44700G8275a61863j80062R6452Q8031i849B47927
12453f6143q1879A19537c14613E7916P0019c0491B2856a08330j5296k38933a42694
12441e3840K0071B73770a09347j21709A24789a5860B9163e4483G5518h4469o2943
12430a47412D5742K08988d02453b7018a2378F6627h3966K5859A00013R6192d09649
12418a95440C8465d4965B58026b53793A24949i3892F5205e408r447j02831B55335
12406b05575m1194J1799M7689B47528m4365l9899N6554g8109o9679A74456a80266
12394c01000g0867B4794N7823a7683m70708i196j25382d6302j86592J02744n479
$$ plain form
12476 139665 170530 310567 187250 -144350 90791 201801 33469 -90870 -282147 133243
12465 406627 -400759 -248961 -3273 344700 78275 -161863 -341925 -245473 -157442 -9849 247927
12453 -66143 -148022 119537 -314613 57916 127935 -30491 22856 -108330 -123626 -362559 -142694
12441 -53840 -33769 273770 -109347 -231056 124789 -15860 29163 -54483 75518 -84469 -147412
12430 -147412 45742 254730 -402453 -27018 -12378 66627 -83966 -58107 100013 196205 -409649
12418 -195440 38465 -44965 258026 -253793 124949 -93892 65205 -5408 -14855 -117686 255335
12406 -205575 -246769 -234970 -187281 247528 203163 163264 219818 -78109 -147788 174456 -180266
12394 -301000 -70867 24794 82617 -17683 -488391 -9196 -134578 -46302 -232894 -130150 -135629
12383a35629B56985d0968B20213n8604a64455B29757a92347D9949K967K21083
12373B73999A22880E1040O5002k5823g4411q4532G199L6291m84a1422H4150D957
12360b499o924E12268b79758b4580g271j88191b8900I8715b779r3425L0100B42685
12347C6607J36703b86010j24803A05558a5036l4609b321A94444a75984Q5018B83098
12335c33387F888J74522b83592A36193J70069f958q7335C4634M8534J12745b82918
12323C8657h6307A50620h9566f177A1230J39285a75631f1974J5947A44184F0472
12311D3832a62176A89951R3323j9589A15511e9811D07159G0516b74120r0946b7523
12299a1348E1517A7121a4896j51146c460B07168b88167a21640k4469A79026J16589
$$ plain form
12383 -135629 256985 -40968 220213 161609 -164455 229757 -192347 49949 52916 273999
12373 273999 122880 51040 116042 90219 -74411 -158943 7199 43490 43006 -11422 84150 4957
12360 -2499 -9423 512268 -279758 -24580 -7271 -195462 -28900 98715 -2779 -96204 -66104 242685
12347 36607 173310 -286010 -410813 105558 -15036 -49645 -2321 194444 -175984 -90966 283098
12335 -333387 6888 181410 -283592 136193 306262 -6958 -94293 34634 83168 195913 -282918
12323 38657 -86307 150620 -89566 -6177 11230 150515 -175631 -61974 -46027 144184 60472
12311 43832 -162176 189951 283274 263685 115511 -59811 407159 70516 -274120 -365066 -27523
12299 -11348 51517 17121 -14896 -166042 -3460 207168 -288167 -121640 -146109 179026 295615
12288B95615a43402q5648a11735G6875J81737j24326I745i8312L3739A06405J77027
12277B83432D3502A6733J42542C3410K67171j20132e7153D10277b38467A45289
12266a21973q274N3924H6624L6781K90800C3931g188A92629g7800M407C23388
12254A53302l6635q690a26961A1834b09832A82299l495C5027R4329a084k61527
12243b62611J12950M7107k2569B51391d1194j48257B7091L60747A72106c5731
12232A09986i479n9383l731A12106L65257A63933P6346I5298M53650j54156a22160
12220b00589A67476M42394H0618J46266F5662B8022P8936O1256l6434K07322q0722
12209B58380l7220i9250F9008l0195K08549m0787H1158J38099G2726R1891L8395
$$ plain form
12288 295615 -143402 -229050 -111735 76875 258612 134286 9745 -98312 -64573 106405 283432
12277 283432 43502 16733 159275 33410 300581 180449 -57153 410277 -238467 145289
12266 -121973 -130247 -76323 86624 123405 414205 33931 -7188 192629 -77800 -73393 323388
12254 153302 116667 107977 -126961 11834 -209832 182299 178804 35027 129356 -1084 -262611
12243 -262611 -149661 -102554 -125123 251391 -41194 -189451 27091 387838 172106 -35731
12232 109986 -9479 -68862 -72593 112106 477363 163933 240279 95298 548948 394792 -122160
12220 -200589 167476 609870 80618 226884 65662 28022 106958 168214 131780 339102 258380
12209 258380 221160 -99250 69008 38813 247362 206575 81158 219257 72726 164617 203012
12198B03012M8407D4939j1063J48816o6893c7134B43353q5030n6173b67007B45377
12186C59660I9868J55278j20945J7198a2451q4382A56227M7115c1481J186F5295
12174D0460K676L18803G1195L3214f0827B07309R657k415h8211E8186k7329L22296
12162C53153f4932B81014G781M3431J1370a42112N7023B8003c3633A61778f0483
12150D5573j7095b78033A20367a14023H6036J98129A11232J96471h2779K7379
12140e5400n1552I8364e6497J3622F4712O8986p154b77700D1120K23226b0477
12128b10120P2833G4204a09998j4562C83289L5388A11196L0341E4350P2375a85959
12116e4454H0430l2797L9944g3765B76724G7755k4920L0583a04476j32563D3330
$$ plain form
12198 203012 251419 44939 33876 182692 115799 -37134 243353 158323 102150 -267007 245377
12186 359660 99868 255146 134201 151399 -12451 -96833 156227 203342 -31481 -30295 65295
12174 40460 43136 361939 71195 104409 -60827 207309 216966 214551 -88211 58186 30857 353153
12162 353153 -64932 281014 7781 51212 62582 -142112 -85089 28003 -33633 161778 -60483
12150 45573 28478 -278033 120367 -114023 86036 284165 111232 307703 -82779 -55400
12140 -55400 -106952 98364 -56497 -42875 64712 133698 126544 -277700 41120 264346 -20477
12128 -210120 -137287 74204 -109998 -124560 383289 418677 111196 141537 54350 126725 -185959
12116 -54454 80430 47633 87577 -73765 276724 77755 52835 83418 -104476 -237039 43330
12104B30401c22671i9195C59954C4479H478a42986i565B30134J22265a25616A10873
12092D8202a01130B46132K15532A9861a13352A51238o6389Q742a2266j10177B27138
12080F4246K11407E3385J17978Q92946L94622F88427l4823B18737O7457A23293
12069c9706A61754c09200A82002L4270N6590Q0067A75917R0314a50287B00204
12058A39524J35339a50026C66007f0070o395C30970A16033J32109b89921j46277
12048d36198J97009A13428L4505b96468J15717j19608J40862a9266j07558m3528
12038a70352P5572I0254A9608N4777b15552c7299J488I2665J23035a07830E5156
12026A5J17845a91649P8248j7168A82354b84093D3885f3867A58451O125m0749
$$ plain form
12104 230401 -322671 -99195 359954 34479 8478 -142986 -9565 230134 352399 -125616 110873
12092 48202 -101130 246132 461664 19861 -113352 151238 84849 93591 -12266 -122443 227138
12080 64246 275653 53385 171363 1064309 1458931 688427 653604 218737 286194 123293
12069 -39706 161754 -309200 182002 216272 272862 352929 175917 266231 -150287 200204
12058 139524 274863 -150026 366007 -60070 -66465 330970 116033 248142 -289921 -436198
12048 -436198 -239189 113428 147933 -296468 -180751 -300359 -159497 -19266 -126824 -170352
12038 -170352 -94780 90254 19608 74385 -215552 -37299 -35811 92665 215700 -107830 55156
12026 15 117860 -191649 -113401 -130569 182354 -284093 43885 -63867 158451 164576 123827
12015A23827k3037C6888O7991P0062a64076c5004o4681B84855G8335K36731e4022
12003A55689K6881b95732H860a19109j78861H879i983k4750I6783d5038F1722
11991c44660a51762B9412a25273q1288h0347A79666P7310m6143o2779f4013F7476
11979E9177f4623j5526k60253a33669A13617h128H5862l6096J22673c58954g8551
11967b07682G0028J14105q6087b4423E8369a64342A63164a26118I729h9961F6869
11955a99707A85331a0654B51616a6940o7796j17101I6729b29935P6349q5273c7905
11943b0020m7097H5823C3666O3094f3257d993B70295b42042A19900D5595J50033
11932A95628E8702J35551b34268C49771A30641c8048j14501B6105K07099g0033
$$ plain form
12015 123827 100790 36888 104879 174941 -164076 -35004 -99685 284855 78335 315066 -54022
12003 155689 182570 -295732 8860 -119109 -297970 8879 -9983 -34733 96783 -45038 61722
11991 -344660 -151762 29412 -125273 -206561 -80347 179666 256976 210833 148054 -64013 67476
11979 59177 -64623 -80149 -340402 -133669 113617 -8128 85862 49766 172439 -358954 -78551
11967 -207682 70028 184133 98046 -24423 58369 -164342 163164 -126118 9729 -89961 66869
11955 -199707 185331 -10654 251616 -16940 -84736 -201837 96729 -229935 -153586 -238859 -37905
11943 -20020 -67117 85823 33666 96760 -63257 -4993 270295 -242042 119900 45595 195628
11932 195628 58702 194253 -234268 349771 130641 -38048 -152549 26105 233204 -70033
11921A15338a14914B49906j16017J22805a39074B97227a20360M6984n6009G1139
11910B48037b5323A42274m5213B3745a65825A51217b13811B21627a42389A36085
11899i5691A37120d7787E4797J02687D351d9623k34528A68656d8697F81f6895
11887d03983a87391h2125D9353d32861e2249j6118j77732C1118e27085A9106a04414
11875d5359F5287O0366P8226a53892b2564B23655a07909b5915k21552B44000a57169
11863B21292a89254I0544d04410G588K82633b00785A76352J17175j01412g4539
11852c43893E6677c05373A41257R6698b23575B5070a24283a9321A61489n7493
11842A03996a03045k6765D23721H215b79061b5149H1559a89689P1966l2418m6661
$$ plain form
11921 115338 -114914 249906 133889 256694 -139074 297227 -120360 -73376 -129385 71139
11910 248037 -25323 142274 97061 23745 -165825 151217 -213811 221627 -142389 136085
11899 -95691 137120 -47787 54797 157484 4351 -49623 -284151 168656 -48697 681 -66895
11887 -403983 -187391 -82125 49353 -432861 -52249 -68367 -246099 31118 -527085 19106 -104414
11875 -45359 65287 125653 203879 -153892 -22564 223655 -107909 -25915 -247467 244000 -157169
11863 221292 -189254 90544 -404410 7588 290221 -200785 176352 293527 192115 -74539
11852 -343893 56677 -305373 141257 237955 -223575 25070 -124283 -19321 161489 103996
11842 103996 -103045 -129810 423721 8215 -279061 -25149 81559 -189689 -117723 -150141 -196802
11831a96802A51831B2027J60401c86335D0089a83238Q7646F3819d8302C0064d28826
11819a22604B61825a58462J3721C03296R375A15866c3186j57355a891j50848o453
11808a59192C6424a37862A8325a08804e3518G1210a90955j60844J43423A07392
11797E7685c04117J20577L993B49205G3457K2960R2810b22695a06703b6351o98
11786b7049j50981D9783J73908b14052J7914l4150B8100K5097B1884a65582N5429
11775a10153N3833B57998a6380C97646a8664l1422j41663o4284Q6308A69446b9635
11763D8843e0627A43465D5923K07706o8252c876j52476E0698R4777b70767C84118
11751A44390e7315r1129R21B02470K3387f1409j81870A00658L40233B06715a51136
$$ plain form
11831 -196802 151831 22027 182428 -386335 40089 -183238 -95592 63819 -48302 30064 -428826
11819 -122604 261825 -158462 -144741 303296 312671 115866 -33186 -190541 -1891 -152739 -159192
11808 -159192 36424 -137862 18325 -108804 -53518 71210 -190955 -351799 -208376 107392
11797 57685 -304117 -183540 -179547 249205 73457 96417 189227 -222695 -106703 -26351 -27049
11786 -27049 -178030 49783 223691 -214052 -196138 -230288 28100 53197 21884 -165582 -110153
11775 -110153 -56320 257998 -16380 397646 -18664 -50086 -191749 -256033 -169725 169446 -29635
11763 48843 -50627 143465 45923 253629 185377 -3876 -156352 50698 145475 -270767 384118
11751 144390 -57315 -148444 -147523 202470 225857 -61409 -243279 100658 440891 206715 -151136
11739D5800j6207a17476l8939A79107a81154M6960J2942A53753b52144I0576N682
11728I6258j1253C5455M5439J64181B6771L6607a44248E6710a36321o1524h8115
11716A07980b11561B50399F9680a98134A0897O7154N03221A40623J20647a4754
11705b1555A45075J56718d996A28927J54708F2501a19643n1003K0599N4572d1869
11693c1106H8661a38606M7672B68432A03418K12963h5760A01049K5254F1279f3996
11681A84212m2388A2588J09931I630L71510J00733B02627M0594I145i2630A11381
11669h2928A681N9689f9667K3202k3723I6180c3828a2805B90470f2615A08464
11657C6172K80656I6166J06197n7508F0574a74041P7260A78073f94480F361K34233
$$ plain form
11739 45800 29593 -117476 -156415 179107 -181154 -134194 -121252 153753 -252144 90576 96258
11728 96258 85005 35455 80894 245075 26771 63378 -144248 56710 -136321 -197845 -88115
11716 107980 -211561 250399 69680 -198134 10897 78051 581272 140623 261270 -14754
11705 -21555 145075 301793 -4996 128927 283635 62501 -119643 -170646 -150047 -95475 -41869
11693 -31106 88661 -138606 -90934 268432 103418 316381 -85760 101049 126303 61279 -63996
11681 184212 141824 12588 122519 9630 381140 481873 202627 243221 9145 -92630 111381
11669 -82928 1681 61370 -69667 -46465 -70188 96180 -33828 -12805 290470 -62615 108464
11657 36172 316828 96166 202363 144855 60574 -174041 -96781 178073 -694480 6361 240594
11646B40594I7450M9958a23931C1413c46882c0059I0997E686L08248D3973M24540
11635D68513H0076J41740q8528p621l3283f4625o8041C77f0082H7526l8202K0374
11623F9698J07900F5268a97059a3785B66787M2715D4042i9612a0256o0899G1303
11611c86065Q6428P7402i5470F6287g9567p5478e2471F9064J35047a97163A80241
11599A45659r57G373c1356j88166B00380b63710a350r3291E3729J07752E3651
11587G9510d7547D6097J18853h5685B84957C8681K79818g6281k37571B9962h9833
11575A72283b54533A03914f618B14585r8276B8656j319J54746a09052b9490A67374
11563C67365j58680J4569I4279N1839k528a26100j34852O1861B27281B0439c1328
$$ plain form
11646 240594 97450 147408 -123931 31413 -346882 -30059 90997 5686 313934 43973 468513
11635 468513 80076 221816 133288 125667 92384 -64625 -132666 377 -60082 87526 49324 69698
11623 69698 177598 65268 -197059 -13785 266787 309502 44042 -99612 -10256 -71155 71303
11611 -386065 -299637 -222235 -95470 66287 -79567 -155045 -52471 69064 204111 -197163 180241
11599 145659 144702 7373 -31356 -219522 200380 -263710 -1350 -94641 53729 161481 53651
11587 79510 -47547 46097 164950 -85685 284957 38681 318499 -76281 -313852 29962 -89833
11575 172283 -254533 103914 -6618 214585 116309 28656 27337 182083 -109052 -29490 167374
11563 367365 208685 223254 94279 146118 143590 -126100 -260952 -199091 227281 20439 -31328
11551b49530C5927O1932J62314k0663k1597E5129G485c9774j69284A4912a78584
11539b4547k49304P9180G7177J36628b15483B02651g5753J3220B6929R4256D422
11527B63687J26399K28j67315F0608J74065o620a72827B14178a7232k54530c5487
11515c6911p4223C0545b7702B70001c8997F1491J33759n379n853e8251A40632
11503A21160M0930J57269o5101c3433D63042E017g4575F9759d5106j5141a2554
11491i723r1429A8448e4405A087K18307H2257N6641o0226J09905j6792f8093k52274
11479c20367a2024B22588J66703k3087I6265Q7639I0834L05474G5721J23410k7241
11468A71890e6716l48216A677Q1807l5611A9511K57034K9561g1789A15868K60912
$$ plain form
11551 -249530 35927 97859 260173 239510 217913 55129 7485 -39774 -209058 14912 -178584
11539 -24547 -273851 -194671 77177 213805 -215483 202651 -75753 -62533 26929 121185 4422
11527 263687 390086 390314 222999 60608 234673 228053 -172827 214178 -17232 -271762 -35487
11515 -36911 -111134 30545 -27702 270001 -38997 61491 195250 189871 184018 -58251 140632
11503 121160 162090 319359 254258 -33433 463042 5017 -74575 69759 -45106 -60247 -12554
11491 -9723 -101152 18448 -54405 1087 219394 82257 138898 78672 188577 171785 -68093 -320367
11479 -320367 -12024 222588 389291 366204 96265 183904 90834 396308 75721 199131 171890
11468 171890 -56716 -404932 1677 83484 47873 19511 276545 306106 -71789 115868 376780
11457C76780A8100L19952A45482L65440j93652j16695P6366q9057a10071B15486
11446i534A79706h4879E6155J11684m4238N611R1080I2851a08273B08360A0403
11434C5603L426K9652j3711k5150J43845d2587k0039D7641a98421C0016K01092
11423B31108f2210B67047B2637r388K79130m3700p497a47016B62848j13682D7989
11411a99038Q4971j27720a3357D15884a39985D8106B223e9968A98144K220p0273
11400A30091A4344f333j72578j07225A01654c65393A74403q1528K0484J5408Q9084
11389B17851I5392g9450c490G3371b20547Q3216a7518C00214a62739g2577C01639
11377G8659c25147e2862B584J9442K21934a57033b4861A11332d6705j19984B65842
$$ plain form
11457 376780 18100 338052 145482 510922 317270 200575 276941 187884 -110071 215486
11446 -9534 179706 -84879 56155 167839 123601 129212 220292 92851 -108273 208360 10403
11434 35603 39029 68681 54970 29820 173665 -42587 -62626 47641 -198421 30016 231108
11423 231108 -62210 267047 22637 13249 292379 248679 241182 -147016 262848 149166 47989
11411 -199038 -114067 -241787 -13357 415884 -139985 48106 2223 -59968 198144 200364 130091
11400 130091 14344 -6333 -178911 -286136 101654 -365393 174403 92875 113359 128767 217851
11389 217851 95392 -79450 -3490 73371 -220547 -137331 -17518 300214 -162739 -72577 301639
11377 78659 -325147 -52862 2584 22026 243960 -157033 -24861 111332 -46705 -166689 265842
11365F4063P055k3848P8585L90307b1864j08585E5495K13014G0315d9212A63955
11353B47182a53700M6958k7226c2978k49191Q5781I5325f1212C64820a05812A46028
11341F4372r049F494J75553b08448Q2953A43920B9552a71070b3453l2822j7181
11330g3456D6668L07866b38124A3873b67184b2672H2552a56827g7813c5484A61331
11318A47252p0096g7994c3752A85338B5656K9102B4234a58501A21983a02478j57032
11307b59510A34573J20169c79706E741e1897k39381B18935d949j18968j66457
11297b90374J13306J4979q6594a09615A19252b28913C9295R9970h9283j32209
11287b21492a7499B78637q8130D0613a57281j12042J27031B88794b02043h8272
$$ plain form
11365 64063 71118 47270 125855 516162 -21864 -130449 55495 268509 70315 -49212 163955
11353 247182 -153700 -106742 -133968 -32978 -282169 -196388 95325 -61212 364820 -105812 146028
11341 64372 55323 6494 182047 -208448 -125495 143920 29552 -171070 -23453 -56275 -73456
11330 -73456 46668 354534 -238124 13873 -267184 -22672 82552 -156827 -77813 -35484 161331
11318 147252 77156 -77994 -33752 185338 25656 54758 24234 -158501 121983 -102478 -259510
11307 -259510 134573 254742 -379706 5741 -51897 -291278 218935 -4949 -123917 -290374
11297 -290374 -177068 -162089 -248683 -109615 119252 -228913 39295 139265 -89283 -221492
11287 -221492 -17499 278637 190507 40613 -157281 -269323 -142292 288794 -202043 -88272
11276A34050b07962B3236g403A51668n8069i0114j49897R7031A3134f4659A02037
11264a00331K4050k91402a73326c9597C6562A1741c9116j18157j27767a29908
11253i8951A13685c05219g0639H9541a02795q460d713j86767g911A89432R3119
11242B82551b55841J04629B23839b7129k01000A60692J10489o3979a18029h703
11231C74209b0646p7874A25565n1615a2074n6327r8572C75726a55202A11283d06621
11219C4224b82741f6373k7939l6637M9169E3062a95442B52299a84572j1548Q1744
11208a14376n1819o8601H3210h6797j66147A38006A203b43288E1958b4788J983
11197b2805k0343Q38C484J29466e7034B03106I3914b5496k7162I464K88508a30108
$$ plain form
11276 134050 -207962 23236 -7403 151668 93599 -90114 -240011 -142980 13134 -64659 102037
11264 -100331 -76281 -367683 -173326 -39597 36562 11741 -39116 -157273 -285040 -129908
11253 -98951 113685 -305219 -70639 89541 -102795 -111255 -4713 -191480 -7911 189432 282551
11242 282551 -255841 -151212 223839 -27129 -228129 160692 271181 207202 -118029 -8703
11231 374209 -20646 -98520 125565 73950 -12074 -68401 -166973 375726 -155202 111283 -406621
11219 34224 -282741 -66373 -94312 -130949 -81780 53062 -195442 252299 -184572 -196120 -114376
11208 -114376 -166195 -234796 83210 -86797 -252944 138006 1203 -243288 51958 -24788 -22805
11197 -22805 -43148 -42310 3484 132950 -57034 203106 93914 -25496 -52658 9464 297972 -130108
11184G9240K08820f9487J1179J5177k0276D4099B0482b55735a5832j22990j0672
11173a49494A25585i2798A70616n4969l4723h6995J7749a5640j63786e7896j4788
11162g2684j68457C1743e4310E1527b6200j37973j8329K1403b5042J0963r4119
11151a08198o5114f9321A24893B8741J00632J9332d6101a6585k40041B56538K381
11140B58919A05111f8714k80309a34067b1254k50035A92377a65443A6101a39016
11129B51590q3085a29767A13485J25494j03963C985J56879c5287k30304e9210
11118A19804O3572L6147i3857C4392c04516I0872D0975L8032K9000J23130b76884
11106C28916K3875A18695f6289A99576K5827k0711m4651L06264A17029n2885J60605
$$ plain form
11184 79240 288060 -69487 -58308 -43131 -63407 44099 20482 -255735 -15832 -138822 -149494
11173 -149494 125585 -92798 170616 115647 80924 -86995 -69246 -15640 -179426 -57896 -72684
11162 -72684 -241141 31743 -54310 51527 -26200 -164173 -182502 -161099 -25042 -14079 -108198
11151 -108198 -173312 -69321 124893 28741 129373 148705 -46101 -16585 -256626 256538 258919
11140 258919 105111 -68714 -349023 -134067 -21254 -271289 192377 -165443 16101 -139016
11129 251590 168505 -129767 113485 238979 135016 3985 160864 -35287 -265591 -59210
11118 119804 183376 219523 -93857 34392 -304516 90872 40975 79007 108007 231137 -276884
11106 328916 352791 118695 -66289 199576 225403 204692 160041 466305 117029 64144 224749
11095B24749J36795n4354H9835N6096i5776G5318A7190K99028A49413F7357L41744
11084D09101j04981j45637N7793a979C03591J00325j57225J85444g9025A20631
11073F26598j66841m7359j34277q0495l9171J17522L65118j03750B38211R2258
11063C30469J97638L93674B10900J54490r5892K81539k0229j18720J95548q6422
11053E21214k8261J01518R4626K17722k38437j271N30054D26522K89570J18160
11043H34252P0698J8775m35665j6585K67768K68572m27697m8391O1903M0425J69619
11032H03674l0871m5320C63249K93661K98428m13242M70167k64797k05363L96144
11022I38247D52847J23577J26571k7449k9915j2592B66664P65526l14760C09795
$$ plain form
11095 224749 361544 307190 89835 145931 -95776 75318 17190 316218 149413 67357 409101
11084 409101 304120 158483 216276 -1979 303591 403916 246691 432135 -79025 120631
11073 626598 459757 412398 278121 197626 158455 275977 641095 537345 238211 330469
11063 330469 528107 921781 210900 365390 269498 551037 530808 412088 607636 521214
11053 521214 492953 594471 689097 906819 668382 667111 1197165 426522 716092 834252
11043 834252 904950 923725 488060 471475 739243 1007815 580118 531727 593630 634055 803674
11032 803674 772803 727483 363249 656910 955338 542096 1012263 747466 542103 938247
11022 938247 452847 576424 702995 675546 645631 633039 266664 1032190 717430 309795
11011G18410k85560l3046j05521M43330k32059J71512r6645K75601j91635k50960
11001D13427j43446N99774k24415J861J30657o4541K52336l34667j4433K23346
10991H39899j48369o6577K51448k4298M2996k26660K85899o9472L11152j25829
10981A070189P2321K50958l78081O38666l45315M34601J76429j15871N32068r1509
10971B244456J37238r8768j40214j35447k2742k8204m05812N2344k53758K89385
10961A638478j00278P8341k6654N17912r27827K72373L53857n59887l54595O78911
10951A570631m21591m58047p9603J41661l40963j39843J69198k7300A09481k5303
10941H4178L58888A95387D916M12671g9829B39145p6363J56537A58542N7520D9398
$$ plain form
11011 718410 432850 399804 294283 737613 505554 677066 580421 856022 664387 413427
11001 413427 269981 869755 645340 647201 777858 713317 965653 630986 616553 839899
10991 839899 691530 624953 876401 852103 895099 668439 954338 884866 1196018 1070189
10981 1070189 1142510 1393468 1015387 1654053 1308738 1743339 1919768 1803897 2335965 2244456
10971 2244456 2381694 2282926 2142712 2007265 1984523 1956319 1550507 1602851 1349093 1638478
10961 1638478 1538200 1616541 1589887 2107799 1179972 1452345 1806202 1246315 891720 1570631
10951 1570631 1149040 690993 611390 753051 412088 272245 441443 414143 109481 84178
10941 84178 443066 195387 4916 417587 -79829 239145 162782 319319 158542 216062 49398
10929d0710A98972r5107M21146c09150A78565J06732o3814C5641c5601A93625
10918a10466l8947K8399j19850A87489q7097h534B19144n0035a90718A2109b5051
10906I0535n64a92862C5519q424c2662A3302J49278a5953k18275a12959I6470
10894C4232j2814M952c55901f3841j649L270A6495b00320C79557a27427q6743
10883b14170f4050J6614A66397c1535C08380a6712A39344D7913i3568A7209c5770
10871G6185K23950a34871A18707J18013f3539j41833R8456o2564C66515a38293
10860a49228J8852G8600f0030n6176m1030O7116B78686a58748L3703B35410c2187
10848B073O0395K8609b40444R9947B27871b5849l11749c5541l35110A99701n593
$$ plain form
10929 -40710 198972 103865 525011 -309150 178565 285297 221483 35641 -35601 193625
10918 -110466 -149413 -121014 -240864 187489 100392 -8534 219144 169109 -190718 12109 -25051
10906 90535 89971 -192862 35519 27095 -32662 13302 162580 -15953 -234228 -112959 96470
10894 34232 21418 26370 -355901 -63841 -65490 -62220 16495 -200320 379557 -127427 -214170
10883 -214170 -64050 -47436 166397 -31535 308380 -16712 139344 47913 -93568 17209 -35770
10871 76185 300135 -134871 118707 236720 -63539 -205372 -106916 -169480 366515 -138293
10860 -149228 -130376 78600 -60030 -116206 -157236 -90120 278686 -158748 -125045 235410 -32187
10848 2073 62468 91077 -240444 -140497 227871 -25849 -337598 -35541 -370651 199701 194108
10837A94108C6077g5176k20537A61551b24792D9056K2466d2097j87693i5688j32682
10826b28370c4722A5871m157L15705b13257A25366a0579j81519A09655b30798
10815C1185b62984A06264D1273G425N6324b18999j37996a06113k09095G3911B7456
10803A12969c8345A45675d0074n3744m9808A64442m2700a88800K6537C8575A2247
10791D5084g7454B07117I6677b47866h9794C8301g6259A74313d021A04935J68293
10780B73228e5271m6565d2813o9727N2099C47302a77578A42902l313C1109K81387
10769C12496h3386B9623P3215h3574B0369a11386J0610D4898Q4189Q5361g2986
10757e535k00216r2435a23132D6787J33113a14615l0418m6627I8269Q0042b10936
$$ plain form
10837 194108 36077 -75176 -295713 161551 -224792 49056 71522 -42097 -229790 -95688 -228370
10826 -228370 -34722 15871 11714 327419 -213257 125366 -10579 -192098 109655 -230798
10815 31185 -262984 106264 41273 7425 63749 -218999 -356995 -106113 -315208 73911 27456
10803 112969 -38345 145675 -40074 -93818 -143626 164442 121742 -188800 -162263 38575 12247
10791 45084 -77454 207117 96677 -247866 -89794 38301 -76259 174313 -4021 104935 273228
10780 273228 -55271 -101836 -42813 -112540 -60441 347302 -177578 142902 139589 31109 312496
10769 312496 -83386 29623 102838 -83574 20369 -111386 -100776 44898 129087 214448 -72986
10757 -5535 -205751 -298186 -123132 46787 179900 -114615 -145033 -191660 98269 178311 -210936
10745b36077l0521J32514B18081a62127H9641c272l539k50598E4965J98155c05177
10733g3535j8286A84991g8579A95215B3146b70490A72095N99d3977p6924j5036
10722a35937c8431l17006a56007e1520m27848a62928g2454J3591B12671a87749
10711B53051b9947k20412J02050K9979C15401b5385P202l52020i6400n4162m6734
10700a97296j85306q680A08820b27411d1077I5396a06295c5316q1728j06149k2643
10689b45836h331B61862e4932n5283e0379o5903A72106a54966A10536a13162b3540
10677C7513b90819i0027n5563F8452N2071D2198J50386D4819a27315B60428o1544
10666A98884a07947E3172a28001n503k7088j93958D5622a54114E2801a6404l61995
$$ plain form
10745 -236077 -266598 -134084 218081 -162127 89641 -3272 -6811 -257409 54965 253120 -305177
10733 -73535 -91821 184991 -78579 195215 23146 -270490 172095 172694 -43977 -120901 -135937
10722 -135937 -38431 -355437 -156007 -51520 -479368 -162928 -72454 -58863 212671 -187749
10711 253051 -29947 -250359 -148309 -118330 315401 -25385 -18183 -370203 -96400 -150562 -197296
10700 -197296 -382602 -391282 108820 -227411 -41077 95396 -106295 -35316 -117044 -223193 -245836
10689 -245836 -8331 261862 -54932 -110215 -50379 -116282 172106 -154966 110536 -113162 -23540
10677 37513 -290819 -90027 -145590 68452 120523 42198 192584 44819 -127315 260428 198884
10666 198884 -107947 53172 -128001 -133504 -160592 -354550 45622 -154114 52801 -16404 -378399
10655c78399a0921B23367F7469K99037d0189j66059b4980E0157a2698B40038a75262
10643A0648h5359F2410I022a94614E201c50065C04666Q6150j35011b34637b1444
10631a49034C800c58432J07212B69817g563m6148K6693j28921C05506a41305j359
10620a42664H9399a96433f4302i004I0700a07235B66820a15624k57904B06161
10609a72873M6024M4149B20477G7169c87911a17944J2213j2380p3943d5483H8777
10597f1467A85550P5818A0489Q7640C8906d64750g0656r2213A0114b72665L2749
10586b39916a12896H113c39976F1348a00872C60505C7342c7468A17467a56974
10575H6378n311R2158a02757j58857g644k51006o1275J34236m0254I3536J719
$$ plain form
10655 -378399 -10921 223367 67469 366506 -40189 -206248 -24980 50157 -12698 240038 -175262
10643 10648 -85359 62410 9022 -194614 5201 -350065 304666 390816 255805 -234637 -21444
10631 -149034 3800 -358432 -251220 269817 -7563 -53711 -27018 -155939 305506 -141305 -142664
10620 -142664 89399 -196433 -64302 -9004 90700 -107235 266820 -115624 -373528 206161
10609 -172873 -126849 -82700 220477 77169 -387911 -117944 -105731 -118111 -192054 -45483 88777
10597 -61467 185550 261368 10489 98129 38906 -464750 -70656 -162869 10114 -272665 -239916
10586 -239916 -112896 8113 -339976 61348 -100872 360505 37342 -37468 117467 -156974
10575 86378 81067 173225 -102757 -261614 -7644 -258650 -319925 -185689 -225943 93536 95255
10564I5255K1008b19532o4331k7142J02518O8835D1769O53b23438O5855D5529
10552B73085F0861j0644j6025o844c6466k83062B0282J25938D6710j0405b33249
10540E0805j2581b46658Q7887B67986e9660A4587J03877b85611f7186B53245e8440
10528a47957j09608a15447p6915d5789B29984L0824A13679c4627A52872b11603
10517H4518d962m15751a35000o107b7330A13538i5060c7556B45987J27660j80839
10506A92808g9577A18811C2639a25962H863c34970a15706D196c75888A52486j2189
10495A40297M5284L7792g1948l4991l1834K9838A91321G6736b7399o5583G2450
10483c5873r9306D43274j46977m6106j04114L4668j8024J53569a083A82178o6222
$$ plain form
10564 95255 116263 -219532 -283863 -311005 -208487 -139652 41769 42422 -223438 -157583 45529
10552 273085 60861 50217 34192 27348 -36466 -319528 20282 146220 46710 36305 -233249
10540 50805 38224 -246658 -158771 267986 -59660 14587 118464 -285611 -67186 253245 -58440
10528 -147957 -257565 -115447 -192362 -45789 229984 260808 113679 -34627 152872 -211603
10517 84518 -4962 -420713 -135000 -141107 -27330 113538 -95060 -37556 245987 373647 192808
10506 192808 -79577 118811 32639 -125962 8863 -334970 -115706 4196 -375888 152486 140297
10495 140297 185581 223373 -71948 -106939 -138773 -108935 191321 76736 -27399 -92982 72450
10483 -35873 -135179 443274 296297 250191 146077 180745 162721 316290 -1083 182178 115956
10472A15956C9396a46090b1282k73813G6521K18687H1157A1473K57980j01433
10462A68020a61397K7589n3828m1968C51689b48772C9441d69459B70489G5528
10451H4273l1042b2392B52338I5489d9562a0294g03j83882H6233b05095B03843
10439e70A33413d61068f906m7184B15621r0445b27721H0042a06470F335a49134
10427A03975a1203m8477D9257K9125b45814F6152c2623C85807f7819F5654b3438
10415c8541m33246A23914a16554E5044j9716R6652j9225d0490Q954A86373a17409
10403b08932F0815a90868j52396E6430a13187c1752A04995B8864b75781F0072
10392B62785b53916o783A03534M783a38655a3431q5344C2109J67061m2950a19795
$$ plain form
10472 115956 39396 -146090 -21282 -295095 76521 295208 81157 11473 269453 168020
10462 168020 -161397 -133808 -187636 -229604 351689 -248772 39441 -469459 270489 75528
10451 84273 53231 -22392 252338 95489 -49562 -10294 -703 -184585 86233 -205095 203843
10439 -570 133413 -461068 -6906 -54090 215621 125176 -227721 80042 -106470 6335 -149134
10427 103975 -11203 -59680 49257 78382 -245814 66152 -32623 385807 -67819 65654 -23438
10415 -38541 -471787 123914 -116554 55044 35328 131980 112755 -40490 -31536 186373 -117409
10403 -208932 60815 -190868 -343264 56430 -113187 -31752 104995 28864 -275781 60072
10392 262785 -253916 -260699 103534 108317 -138655 -13431 -98775 32109 199170 156220 -119795
10380B63077K6375f6324l1580A89445P0485A5521M20198j79023r552e4824B93354
10368C17353A07025K23257J56843M593p1978A49047M9433l7928K23363a4454B23618
10356E5050g0462k44348A88309L07463q6104n8653J42346j69136a54121C64543
10345C44150n3329A00581R9738D0234a82351A31337J88127J4881j44332H1635
10334A58336K26228H3727J59202I7997b27330C86814e7736A31657n6102K82105
10324C57660c589C585J82759Q6166r6238A217a30889J4867C4670J80173a69840
10312b5503r4549b5754C72700b65506O1846A50819F8086a89324c2230D114J86220
10301A90334C815M9059P9103K4268E9102O7554a42683B5184P9813K9731n7419
$$ plain form
10380 263077 289452 -66324 -97904 189445 259930 15521 435719 256696 247144 -54824 293354
10368 317353 107025 330282 487125 491718 419740 149047 198480 160552 383915 -14454 223618
10356 55050 -70462 -314810 188309 495772 409668 351015 493361 324225 -154121 364543
10345 344150 290821 100581 200319 40234 -182351 131337 319464 334345 190013 81635
10334 158336 384564 83727 242929 97997 -227330 386814 -57736 131657 75555 357660
10324 357660 -3589 3585 186344 272510 176272 1217 -130889 -116022 34670 214843 -169840
10312 -25503 -120052 -25754 372700 -265506 -203660 150819 68086 -189324 -32230 4114 190334
10301 190334 3815 52874 131977 156245 59102 126656 -142683 25184 104997 134728 77309
10290G7309a94081A43184c2423l63078i3052b8282j48920h6167n1795A16149d56216
10278A28871a41468J3108E4926f7366j92653A99897E2692f8587r8042b8120B55191
10266b08003d4343k2174C6775K8691N37071A71337M2174J05563J78419k15224
10256B82269F2951i0243k3245B46024q145A7557J90823G5348N7844J07484b23565
10244a00325l9842j51770A66913J8767m278a28844D9287a62010J9936M3040j59095
10233b58129J23206m7562O0768M0867j82263g622m1339j47867j37257J26433k44332
10222d51984F6995a22511B82784E5301J23852E6292K49839a07004B50086b16374
10211B6381b86734C15310b59608f642j39028c211q0462J7005F1425a7267j24097
$$ plain form
10290 77309 -194081 143184 -32423 -395501 -93052 -28282 -177202 -86167 -137962 116149 -456216
10278 128871 -141468 -128360 54926 -67366 -260019 199897 52692 -68587 -166629 -28120 255191
10266 -208003 -44343 -66517 36775 65466 602537 171337 213511 319074 497493 282269
10256 282269 62951 -90243 -113488 246024 237879 17557 208380 75348 133192 240676 -223565
10244 -100325 -140167 -291937 166913 185680 181402 -128844 49287 -162010 -142074 -99034 -258129
10233 -258129 -134923 -182485 -121717 -80850 -263113 -7622 -48961 -196828 -334085 -207652 -451984
10222 -451984 66995 -122511 282784 55301 179153 56292 306131 -107004 250086 -216374
10211 26381 -286734 315310 -259608 -6642 -145670 -3211 -83673 -66668 61425 -17267 -141364
10200a41364b5054H1907A5935L7802P294b70460K6691Q6791B18509a47j63116
10189a63263J4888L9619m77295b42290k7313m6936f8564n6796c9899A68935a23396
10177e5850k06094C7590R238J8594C618i9167p4928N6552a1935m8512k88217j36505
10165d85169a33947G4720M1121r618b9516p4287B21164a24030F0683J02768D6944
10153B46573a9460k04350L0606A10841i0067j24438n0173F768P8027J37012a47017
10141G1140J01604m6440c29115O9075e7587j77045A09594b51G8510b63142N015
10130b58127C5849c8693B77655G719a61877c4295A83618a54804k14949b9089A20656
10118c2343l7585k03772B20615a77139k7915q7780J37810r6395O6857j31345H8121
$$ plain form
10200 -141364 -25054 81907 15935 53737 61031 -270460 -243769 -156978 218509 -147 -163263
10189 -163263 -148375 -108756 -586051 -242290 -269603 -316539 -68564 -125360 -39899 168935 -123396
10177 -55850 -261944 37590 46828 65422 3618 -99167 -174095 -117543 -11935 -60447 -348664 -485169
10165 -485169 -133947 74720 115841 106223 -29516 -103803 221164 -124030 60683 163451 46944
10153 246573 -19460 -223810 -193204 110841 -90067 -214505 -264678 6768 84795 221807 -147017
10141 71140 172744 126304 -329115 -260040 -57587 -234632 109594 -251 78510 -263142 -258127
10130 -258127 35849 -38693 277655 7719 -161877 -34295 183618 -154804 -369753 -29089 120656
10118 -32343 -69928 -273700 220615 -177139 -205054 -292834 -155024 -251419 -184562 -315907 88121
10106b82493C90025a06789i311H5760j9147b40692c8783B950K4786J55188d9286
10094C04703a30437E0765d58042J55873A2300b33500c0699j96639I0956b55658
10083g2090I6258O702a57813F5175a71401H7424d25711b09540f3458q2257e6934
10071b50218I6521m4691i012l27186B4509K53929f1882j3684B66831I3164b49612
10059e2583k7637B5772c83016c6468k59006j4706N0262J18642B1784b02821d6724
10047g3666l87933a17713f413l03251A30904k075d7610H0619l2982b69983A8120
10035b20347j7786M3280B83448a34631G4728g7244n8505A5659R2468c52631A23493
10023a93197j28922g5438p0953B62442j29349A8905e5985a0799r0111K8098k98420
$$ plain form
10106 -282493 390025 -106789 -9311 85760 66613 -240692 -38783 2950 27736 182924 -49286
10094 304703 -130437 50765 -458042 -302169 12300 -233500 -30699 -227338 90956 -255658
10083 -72090 96258 102960 -157813 65175 -171401 87424 -425711 -209540 -63458 -145715 -56934
10071 -250218 96521 51830 -9012 -336198 24509 278438 -61882 -75566 266831 93164 -249612
10059 -52583 -80220 25772 -383016 -36468 -295474 -310180 -259918 -141276 21784 -202821 -46724
10047 -73666 -461599 -117713 -6413 -309664 130904 128829 -47610 80619 47637 -269983 18120
10035 -220347 -238133 -194853 283448 -134631 74728 -77244 -135749 15659 108127 -352631 123493
10023 -193197 -322119 -75438 -146391 262442 133093 18905 -55985 -10799 -100910 -72812 -371232
10012c71232C09700A30623h8252j8537o2444j222e9443o5317l6602r480A97044
10000A97447B8584J84125c05448B22004h5744k8566C6309c25286a25572C2324
9989B4578i7325r4151n8304I5960A8480J57217b33365K5884p1460J26050A54795
9977f9767J9211C58236a12806j63196E2291b34649g9186F025a05398c2312j83330
9966b15642k96306b52347O9950P1365C7509d2938k81548g4337r845j07033k56632
9955d47847a46050N8817j4411J8494A02661b90664M9310a459q0147l24220f0280
9943h2146C8570J56760a30132m4043h4563n6262e1895j89075a498G1652a67120
9931A27653J82824b41043j9941G7889b32213g5456L3910A62844o6948c31716J40988
$$ plain form
10012 -371232 309700 130623 -88252 -106789 -169233 -170455 -59443 -124760 -161362 -170842 197044
10000 197447 28584 212709 -305448 222004 -85744 -114310 36309 -325286 -125572 32324
9989 24578 -97325 -191476 -249780 95960 18480 175697 -233365 -207481 -278941 -152891 154795
9977 -69767 -50556 358236 -112806 -276002 52291 -234649 -79186 6025 -105398 -32312 -215642
9966 -215642 -511948 -252347 -182397 -111032 37509 -42938 -324486 -74337 -84182 -191215 -447847
9955 -447847 -146050 -87233 -101644 -83150 102661 -290664 -241354 -1459 -81606 -405826 -60280
9943 -82146 38570 195330 -130132 -174175 -84563 -140825 -51895 -240970 -1498 71652 -167120
9931 127653 310477 -241043 -260984 77889 -232213 -75456 -41546 162844 95896 -331716 -190728
9920a90728c3491C7992a63814A9502L0320e5500b627j22278I2248d9025k17830
9909b66855e0804j1832k13222L3921I0040f02990K65629j12247I3901i4616A71188
9897d5916j18433A02089C1637M7247O8597K6852e84193D4591J06676C9203a51977
9885a57210C5393a89942R4115k65239n1388F0712a28182A63314a28769C21354
9874a38127B67330k1331b52330q1432f3435A21450a53938r501P7229c9704A75266
9862a18493A61192e6113B78160g6161E0836c2609l39345G5702C7769b20905h0538
9850A5428L58714a43128P1316j00012l51705K9994A32275b29082M0706E2730B1044
9838a92880G4731J11948c25837a01573K9048I3958K44860b4127j91799J05247
$$ plain form
9920 -190728 -33491 37992 -163814 19502 49822 -55500 -2627 -124905 92248 -49025 -266855
9909 -266855 -50804 -62636 -275858 -241937 90040 -602990 -337361 -449608 93901 -94616 171188
9897 -45916 -164349 102089 31637 78884 147481 174333 -584193 44591 151267 39203 -151977
9885 -157210 35393 -189942 -95827 -361066 -412454 60712 -128182 163314 -128769 321354
9874 -138127 267330 245999 -252330 -333762 -63435 121450 -153938 -163439 -86210 -39704 175266
9862 -118493 161192 -56113 278160 -76161 50836 -32609 -371954 75702 37769 -220905 -80538
9850 15428 374142 -143128 -71812 -171824 -523529 -493535 132275 -229082 -188376 52730 21044
9838 -192880 74731 186679 -325837 -101573 -72525 93958 338818 -24127 -215926 -110679
9828a10679H932J29226a19562l8592j96218J49344G8431a00561E5321a39879j82053
9817c21932c9420A00179b04001P4848N2245j03742p1195D8871g5421A0225M1836
9806E2061b74797i7301l31539a73256E1279J7189a53320N3924J1273q8555A7939
9794A2019c1508r50j51526A7081a9777q0413C25305a80378f0764j7204C7336L9210
9782G6546b55886A96627a51446j8791l2651n4138O1445R4678B14403l4087P3087
9771B53403a4020j15250A01036b4290j26118l66924J71022e3057O151Q353A96339
9759b32234H7205a28673B48878a39140j03047B30b04674K0679B31650b52515A83586
9747I4528a12092M0683L0944n3906B26891a31970B45441p0316o4933e5951j52058
$$ plain form
9828 -110679 8932 138158 -119562 -158154 -354372 -205028 78431 -100561 55321 -139879 -321932
9817 -321932 -39420 100179 -204001 -129153 -76908 -180650 -251845 48871 -75421 10225 52061
9806 52061 -274797 -97301 -428840 -173256 51279 68468 -153320 -99396 -88123 -176678 17939
9794 12019 -31508 -32458 -183984 17081 -19777 -100190 325305 -180378 -60764 -77968 37336 76546
9782 76546 -255886 196627 -151446 -170237 -202888 -257026 -195581 -100903 214403 180316 253403
9771 253403 -14020 -129270 101036 -24290 -150408 -517332 -346310 -53057 -46906 -38553 196339
9759 -232234 87205 -128673 248878 -139140 -242187 230 -204674 -183995 231650 -252515 183586
9747 94528 -112092 -71409 -40465 -94371 226891 -131970 245441 175125 110192 -55951 -208009
9736b08009I77b78896P4708g3199m1614m2943q8549J21518j5681B26779j1539
9725B15240b25215n1872O6913k94b8436F5210K1860a8663C810K52591g4342H7296
9712a09557L4611k65349a68269A73730c89624a01541F3120a44289B6460K04179
9702B30639b79422B09762a18823j16796R8271C88834f5198j60433i7682B25543
9691b08675A20952a91337L4589A23672K4276m0253a64423e6638I0269i5734j07923
9680b03657M0091c5107E5772a63040P8549C2557N8945a20277l56193F3117Q8651
9669A51768M6383a98538d0930P601j31067f9817n5090G3910A9844J929B32b37893
9656A000c38479E335g3574D3236c71988J05885H838J5017K0263c07626h8330A13720
$$ plain form
9736 -208009 977 -278896 -204188 -73199 -114813 -157756 -246305 -124787 -140468 226779 215240
9725 215240 -225215 -277087 -210174 -210468 -28436 65210 87070 -18663 3810 256401 -74342 87296
9712 -109557 -74946 -340295 -168269 173730 -389624 -101541 63120 -144289 26460 230639
9702 230639 -279422 209762 -118823 -235619 -137348 388834 -65198 -225631 -97682 225543
9691 -208675 120952 -191337 -156748 123672 147948 107695 -164423 -56638 90269 -95734 -203657
9680 -203657 -163566 -35107 55772 -163040 -84491 32557 91502 -120277 -476470 63117 151768
9669 151768 198151 -198538 -40930 -33329 -164396 -69817 -124907 73910 19844 21773 232 -237893
9656 1000 -338479 5335 -73574 43236 -371988 -266103 8838 23855 44118 -307626 -88330 113720
9643a0324j45336A71161B1433J38628b70735a4885j31145E8165P4582J08649a31113
9631A63381J33875c68910J76050F9769c37356J08111D8009K92810a26406M1830
9621h4576k311F5448b35935R9835o935O1757a08A32059a40951k0453c9753D0184
9608b24589Q5285A05264d29773e7822k95815K7903N8040A47705H102b77535A06483
9596b58556O1051j36968g5805F3248a790A53197a31329L0656F0726P462b47235
9584a9808A19435e2802B24762A06910e1593j87074R1448N3259b1248m7586j41525
9573b10359P8602A18550R8311F7926a70645J0332g6864j76439a0829J656I9284
9561F7827g6052J7588a2228l94838A16101e0810k20977j47283D7765f6893k28287
$$ plain form
9643 -10324 -155660 171161 21433 160061 -270735 -14885 -146030 58165 132747 241396 -131113
9631 163381 297256 -368910 -192860 69769 -337356 -229245 48009 340819 -126406 -84576
9621 -84576 -86887 65448 -235935 -136100 -143035 -81278 -108 132059 -140951 -161404 -39753 40184
9608 -224589 -139304 105264 -429773 -57822 -353637 -325734 -267694 147705 8102 -277535 106483
9596 -258556 -197505 -334473 -75805 63248 -1790 153197 -131329 -100673 60726 68188 -247235
9584 -19808 119435 -52802 224762 106910 -51593 -238667 -147219 -93960 -21248 -68834 -210359
9573 -210359 -131757 118550 216861 67926 -170645 -160313 -76864 -253303 -10829 -9173 99284
9561 67827 -76052 -58464 -12228 -407066 116101 -50810 -271787 -419070 47765 -66893 -295180
9550b95180a14678A77974A598b57478C3171a17016L1498e571r7539o141A07239
9538I4898J0725a84193B36984r3934K14416a06619A33336N1414M5487a96329j00426
9527b96755i5928L4922k41418a00127a2794E4484b74488g668j22795K2011F4257
9515g8327l23433f1098k02968D2390a41432A70247o3914b92227a18909o0183F0218
9503g0010E9275c04100f8704b281k77630F5369C2073c9104j36652n9865B21898
9491a65396k17003g8399A51587g2717B44389b45194B40322r6452a35648d4642
9480a06353R981B95038a09832q937M3169n7277b2573N95q3395I6973c4352D0699
9467A73060o3396g6505L8231A62668b48586A53446P4066A08780a76856F7338J22710
$$ plain form
9550 -295180 -114678 177974 1598 -257478 33171 -117016 -85518 -5571 -103110 -109251 107239
9538 94898 105623 -184193 236984 143050 357466 -106619 133336 184750 230237 -196329 -296755
9527 -296755 -95928 -61006 -302424 -100127 -12794 54484 -274488 -7668 -130463 -108452 64257
9515 -78327 -401760 -61098 -264066 42390 -141432 170247 106333 -292227 -118909 -179092 60218
9503 -70010 59275 -304100 -68704 -2281 -279911 65369 32073 -39104 -175756 -235621 221898
9491 -165396 -382399 -78399 151587 -72717 244389 -245194 240322 143870 -135648 -44642
9480 -106353 -96372 295038 -109832 -118769 -75600 -132877 -22573 -21978 -105373 96973 -34352 40699
9467 173060 109664 -76505 -38274 162668 -248586 153446 227512 108780 -176856 67338 190048
9456A90048b76274h8681B2283b68587a7676F2302c3263A55188c27242L5157C284
9444E3886a44987L1715k13762a3423E5940c87215E3086b4595k02073O9943I726
9432c27216a31944C314f3657G2896e53476A88859b11810I6011a14287B26311J04571
9421C30882C1361a96408A07180c42706F6131a51693e4463B7824a50135l72268
9411e22403A46444Q580c6699a957k82707R5331n1037A45022F0496e8762C14908
9399d25161A67178a41287A40469D8556M2362a56397G5351J15465J14148a97430
9388g6900j09516j88475a22369D2205j7631b16293F8395K75929f8322b0769l67436
9377c88205h1847a0649k67651a11573b1560o5524A77325b15875N118f9159A85714
$$ plain form
9456 190048 -276274 -88681 22283 -268587 -17676 62302 -33263 155188 -327242 -292085 3284
9444 53886 -144987 -113272 -327034 -13423 55940 -387215 53086 -24595 -226668 -156725 9726
9432 -327216 -131944 3314 -63657 72896 -553476 188859 -211810 96011 -114287 226311 330882
9421 330882 31361 -196408 107180 -342706 66131 -151693 -54463 27824 -150135 -522403
9411 -522403 146444 155024 -36699 -1957 -284664 -189333 -240370 145022 60496 -58762 314908
9399 -425161 167178 -141287 140469 48556 90918 -156397 75351 190816 304964 -197430
9388 -76900 -186416 -374891 -122369 42205 24574 -216293 68395 344324 -68322 -20769 -388205
9377 -388205 -81847 -10649 -278300 -111573 -21560 -87084 177325 -215875 -210757 -69159 185714
9365A84050d50421a43739H0182a3765C436K2172a47950A23769J38263a77628B1843
9353E168b44403E5881B1072a18238o46C64149F3500N837e59r5830p5812k41637
9341d13838E7618e2260B7136K7083Q3805e66715G0781c35536h571r3466j774A89338
9328a54967L6098A29391b35876I185m343a98445E4863M2133a98657o4246f0616
9316A19864a63441D059J19822a66625A73576F1401k7915G473g0208r2758e2059
9304b89276g3366A28963K1180b11494R9339A74501c87336e3925j96239A0264J9986
9293C0250K1816f9490q5375I5724g7080j1334E5161g5831j29059J8418h2949j65459
9281b48408J17203A31681N4728a15447B27356a95215e5156j95380A1707b07046
$$ plain form
9365 184050 -450421 -143739 80182 -13765 3436 25608 -147950 123769 262032 -177628 21843
9353 5168 -244403 55881 21072 -118238 -118884 364149 63500 69337 -559 -96389 -172201 -413838
9341 -413838 57618 -52260 27136 54219 138024 -566715 70781 -335536 -8571 -102037 -103811 189338
9328 -154967 -118869 129391 -235876 9185 4842 -198445 54863 96996 -198657 -262903 -60616
9316 119864 -163441 4059 123881 -166625 173576 61401 33486 7473 -70208 -162966 -52059
9304 -289276 -73366 128963 150143 -211494 -112155 174501 -387336 -53925 -250164 10264 30250
9293 30250 52066 -69490 -154865 95724 -77080 -88414 55161 -75831 -204890 -186472 -82949 -248408
9281 -248408 -131205 131681 186409 -115447 227356 -195215 -55156 -250536 11707 -207046
9270A43854R1321J91400j44474j23252b32061A08813a242j09530E3427j4548K097
9259D0976N1771m5952a95714B803N355a84702H6255a68196j94363C37660C5628
9247a06857C07840b28631D6837a70217b5899l15229A70318b40739a11786j71932
9237b83718c6429j970A12928h3882k8209B4826a13383B43078d4759k2047m94596
9226e61402a23528c1370q0210N2767o5209E6148k1350c38326g5577A77256G0669
9214g2817o8677o3072p6895B0140J55035H1825a02189B18655a6058A4943a93981
9202b56468J18046r5520O3865k42837a78989A21502m1646a74302c6283j68023
9192b04306e7341j78819N4091g6706j8931d1462G2627f1637n7955e3409D31878
$$ plain form
9270 143854 235175 426575 282101 158849 -232061 108813 -1242 -110772 53427 38879 40976
9259 40976 92747 46795 -195714 2803 8158 -184702 86255 -168196 -362559 337660 35628
9247 -106857 307840 -228631 46837 -170217 -25899 -341128 170318 -240739 -111786 -283718
9237 -283718 -36429 -38399 112928 -83882 -112091 24826 -113383 243078 -44759 -66806 -561402
9226 -561402 -123528 -31370 -111580 -58813 -124022 56148 34798 -338326 -75577 177256 70669
9214 -72817 -141494 -204566 -281461 20140 175175 81825 -102189 218655 -16058 14943 -193981
9202 -256468 -138422 -233942 -170077 -412914 -178989 121502 79856 -174302 -36283 -204306
9192 -204306 -57341 -236160 -182069 -76706 -95637 -41462 72627 -61637 -119592 -53409 431878
9180B25996B4190a59988C9849e1172l579k72873a08010D5900b65926A84562b47133
9168b31657e5194k17992a24252c7960I9702a01045A18833h8210A86924q1807i9509
9156b39289A64399h2126j59159g3455m6866n9220B82892a26001k44265J12369
9146b57897A86856m6657i5887F9289b8476N766d082k13904b0192j50985A47371
9134c03185J34422L0758n8078G2403d12499B20907d17523D7964b9478k4385K0376
9123c3487j85085j6468A19667a89864k6361C4747c6984G0593p072J11696D4029
9111a68608G4502a30430J1762j21021a7778A41513O2050b52706P4480B10969m876
9100B06093b5112p1274j93396D9104a19140e3685r2172d168H0392B9087d26457
$$ plain form
9180 225996 24190 -159988 39849 -51172 -54751 -327624 -108010 45900 -265926 184562 -247133
9168 -231657 -55194 -273186 -124252 -37960 99702 -101045 118833 -88210 186924 105117 -99509
9156 -239289 164399 -82126 -241285 -73455 -120321 -179541 282892 -126001 -370266 -257897
9146 -257897 186856 140199 -95887 69289 -28476 -22710 -4082 -217986 -20192 -171177 147371
9134 -303185 -168763 -138005 -196083 72403 -412499 220907 -417523 47964 -29478 -53863 -33487
9123 -33487 -218572 -235040 119667 -189864 -216225 34747 -36984 70593 63521 175217 44029
9111 -168608 74502 -130430 -118668 -239689 -17778 141513 203563 -252706 -178226 210969 206093
9100 206093 -25112 -96386 -289782 49104 -119140 -53685 -145857 -4168 80392 29087 -426457
9088c2332j18111b9421k9924b0966B00982m7966b00798C3166a2279C9288N0007
9077H9295i3999j2251G3652L22476b0499C29128a63967d9583b1103p971k00381
9066b29455f2956j61321h3635K3931A74733g4318p4277f1946l4276p2659J9985
9055a48896A3962f8099o3215B01723j00389B4808c1916k69546a0423G2195c75273
9043g7319j96750L3055J9857F520J90207b36938B04376c83932e8840A096b56713
9031H9471d4390j97456R5297B49062a6483B59675a59119f5709B4827P5641i9226
9019b471B03936M8548c00288a19219j7609r3561B23612b09370N7568A8678a55206
9007a56341A77789F9096j019g0627H0022j0067a76129a7673l15427A12981B6057
$$ plain form
9088 -32332 -150443 -29421 -59345 -20966 200982 153016 -200798 33166 -12279 39288 89295
9077 89295 -93999 -106250 73652 396128 -20499 329128 -163967 -49583 -21103 -29074 -229455
9066 -229455 -62956 -224277 -83635 -59704 174733 -74318 -148595 -61946 -96222 -168881 -148896
9055 -148896 13962 -68099 -131314 201723 101334 24808 -31916 -301462 -10423 72195 -375273
9043 -77319 -274069 -241014 -221157 6520 196727 -236938 204376 -383932 -58840 1096 -256713
9031 89471 -44390 -241846 -146549 249062 -16483 259675 -159119 -65709 24827 100468 -99226
9019 -2471 203936 252484 -300288 -119219 -136828 -230389 223612 -209370 -151802 18678 -155206
9007 -156341 177789 69096 68077 -70627 80022 69955 -176129 -17673 -333100 112981 26057
8995E36b73828C50328j3432a43443O7889r7658N0228j40703O8692A05159f5495
8983A65129a20154G7324c7232k26897F3925b72450B06106E9006K4706j9080b51133
8971a2311A05588a48656f4690C00012b2293j20428J606L7880C78811C3262M5099
8960G8361d7883B44907q4520c3494k46813J08037n4387h8991d476r1771C78004
8948b7476A8629i7745G7959J99759a6649l01134A96351E3214k0952J08652g5617
8936c4477D6890h7766C91955E2124J99875n6793K9940M7832q8243a04859E08641
8924G14341M28695J568290L007619K545219C843943j771109I78664B94391J69736
8915D64127B06798o5267R7058H5227K07805p5351q6813K68716b6832C60546c2246
$$ plain form
8995 536 -273828 350328 336896 -143443 -75554 -173212 -122984 -263687 -194995 105159 -65495
8983 165129 -120154 77324 -37232 -264129 63925 -272450 206106 59006 83712 64632 -251133
8971 -12311 105588 -148656 -64690 300012 -22293 -142721 -141115 -103235 378811 33262 78361
8960 78361 -47883 244907 160387 -33494 -280307 -172270 -226657 -88991 -4476 -96247 378004
8948 -27476 18629 -97745 77959 277718 -16649 -317783 196351 53214 32262 140914 -75617
8936 -34477 46890 -87766 391955 52124 251999 195206 225146 272978 184735 -104859 508641
8924 714341 1143036 2711326 5718945 8264164 3843943 2072834 978664 294391 464127
8915 464127 206798 141531 238589 85227 293032 217681 130868 399584 -26832 360546 -32246
8903g8185a9089o5576D7728R0356i4062j39357N9736Q841k01549J51889J9080
8892a95422P3129r3343A79132j5606b5781F3929R554e6962J2245j07883B18748
8880E6463k674d29932B03205a1653E6066i1456A35384J25555A2959K6889J65616
8869B05464a02350D1259c6585A5057K64217A23918a60140B3523J664K61201G5660
8857b35570F8240N5509M02916g665j12464p0112h1239q4372G4901g8266j05677
$$ plain form
8903 -78185 -19089 -84665 47728 138084 -94062 -233419 -173683 -164842 -366391 -214502 -195422
8892 -195422 -122293 -215636 179132 163526 -25781 63929 73483 -56962 -44717 -152600 218748
8880 56463 53789 -429932 203205 -11653 56066 -91456 135384 260939 12959 39848 205464
8869 205464 -102350 41259 -36585 15057 279274 123918 -160140 23523 25187 286388 75660
8857 -235570 68240 123749 526665 -7665 -120129 -190241 -81239 -165611 74901 -78266 -183943
$$ [...]
##END NTUPLES=NMR SPECTRUM
##END=
