
##TITLE=AC1249_NSDAH12039_6945181_DXTpwpUtfk
##JCAMPDX= 6.0         $$ Bruker NMR JCAMP-DX V2.0
##DATA TYPE= NMR SPECTRUM
##DATA CLASS= NTUPLES
##ORIGIN= BRUKER
##OWNER= Administrator
$$ 1.72 TOPSPIN		Version 2.1
$$ 2012-10-18 13:45:52.100 -0700  Administrator@X
$$ Compression mode = diff/dup
##.OBSERVE FREQUENCY= 400.02188249412
##.OBSERVE NUCLEUS= ^1H
##.ACQUISITION MODE= SIMULTANEOUS (DQD)
##.ACQUISITION SCHEME= undefined
##.AVERAGES= 64
##.DIGITISER RES= 22
##SPECTROMETER/DATA SYSTEM= spect
##.PULSE SEQUENCE= noesygpps1d.comp
##.SOLVENT NAME= COFFEE_meoh
##.SHIFT REFERENCE= INTERNAL, COFFEE_meoh, 1, 14.96092
##AUDIT TRAIL= $$ (NUMBER, WHEN, WHO, WHERE, PROCESS, VERSION, WHAT)
$$ ##TITLE= Audit trail, TOPSPIN		Version 2.1
$$ ##JCAMPDX= 5.01
$$ ##ORIGIN= Bruker BioSpin GmbH
$$ ##OWNER= Administrator
$$ $$ C:\Bruker\TOPSPIN/data/COFFEE/nmr/AC1249_NSDAH12039_6945181_DXTpwpUtfk/12/pdata/1/auditp.txt
$$ ##AUDIT TRAIL=  $$ (NUMBER, WHEN, WHO, WHERE, PROCESS, VERSION, WHAT)
(   1,<2012-10-13 19:28:59.343 -0500>,<Administrator>,<TOPSPIN>,<go>,<TOPSPIN 2.1>,
      <created by zg
	started at 2012-10-13 19:17:28.734 -0500,
	POWCHK enabled, PULCHK disabled,
       configuration hash MD5:
       6B 1B 68 BB D9 2E 58 E2 7F 35 AD 54 07 DF 0E 41
       data hash MD5: 64K
       19 BD 45 2C 95 00 98 0A FE A7 B3 C3 DE 45 09 40>)
(   2,<2012-10-13 19:29:02.109 -0500>,<Administrator>,<TOPSPIN>,<proc1d>,<TOPSPIN 2.1>,
      <Start of raw data processing
       efp LB = 0.3 FT_mod = 6 PKNL = 1 PHC0 = 0 PHC1 = 0 SI = 128K 
       data hash MD5: 128K
       4B 3A 56 75 84 6D 41 F8 E9 02 DF 8C D6 61 DF B1>)
(   3,<2012-10-13 19:29:03.265 -0500>,<Administrator>,<TOPSPIN>,<proc1d>,<TOPSPIN 2.1>,
      <pk PHC0 = 4.015503 PHC1 = 0 
       data hash MD5: 128K
       75 CC 20 35 9E 01 54 6C 9F D6 E8 46 DE F0 F8 2C>)
(   4,<2012-10-13 19:29:03.500 -0500>,<Administrator>,<TOPSPIN>,<proc1d>,<TOPSPIN 2.1>,
      <abs ABSG = 1 
       data hash MD5: 128K
       E4 38 05 F5 C2 C5 C4 97 B8 B0 1E 6E CC CA 08 82>)
(   5,<2012-10-13 19:29:03.578 -0500>,<Administrator>,<TOPSPIN>,<proc1d>,<TOPSPIN 2.1>,
      <abs ABSG = 2 
       data hash MD5: 128K
       7F B9 4B F7 85 02 B5 46 1F EF E8 F9 A6 37 A3 59>)
(   6,<2012-10-13 19:29:03.718 -0500>,<Administrator>,<TOPSPIN>,<proc1d>,<TOPSPIN 2.1>,
      <abs ABSG = 3 
       data hash MD5: 128K
       2D 91 E1 CF 4B 8A 99 DF 96 92 B0 A4 73 EF 6C F7>)
(   7,<2012-10-13 19:29:03.890 -0500>,<Administrator>,<TOPSPIN>,<proc1d>,<TOPSPIN 2.1>,
      <abs ABSG = 4 
       data hash MD5: 128K
       C6 79 EC 8C B5 4F 00 64 8F 8A F1 79 90 4E A7 64>)
(   8,<2012-10-13 19:29:03.953 -0500>,<Administrator>,<TOPSPIN>,<proc1d>,<TOPSPIN 2.1>,
      <abs ABSG = 5 
       data hash MD5: 128K
       89 B2 40 E2 C0 16 06 14 9E D5 FF 92 4D 32 B8 7D>)
(   9,<2012-10-13 19:29:04.187 -0500>,<Administrator>,<TOPSPIN>,<audit>,<TOPSPIN 2.1>,
      <user comment:
       ICON-NMR User ID: COFFEE
       data hash MD5: 128K
$$ [...]
##$TP07= 0
##$TPNAME0= <>
##$TPNAME1= <>
##$TPNAME2= <>
##$TPNAME3= <>
##$TPNAME4= <>
##$TPNAME5= <>
##$TPNAME6= <>
##$TPNAME7= <>
##$TPOAL= (0..7)
0.5 0.5 0.5 0.5 0.5 0.5 0.5 0.5
##$TPOFFS= (0..7)
0 0 0 0 0 0 0 0
##$TUNHIN= 0
##$TUNHOUT= 0
##$TUNXOUT= 0
##$USERA1= <user>
##$USERA2= <user>
##$USERA3= <user>
##$USERA4= <user>
##$USERA5= <user>
##$V9= 5
##$VALIST= <valist>
##$VCLIST= <CCCCCCCCCCCCCCC>
##$VD= 0
##$VDLIST= <DDDDDDDDDDDDDDD>
##$VPLIST= <PPPPPPPPPPPPPPP>
##$VTLIST= <TTTTTTTTTTTTTTT>
##$WBST= 2048
##$WBSW= 25
##$XGAIN= (0..3)
0 0 0 0
##$XL= 0
##$YL= 0
##$YMAX_a= 12515385
##$YMIN_a= -9212798
##$ZGOPTNS= <>
##$ZL1= 120
##$ZL2= 120
##$ZL3= 120
##$ZL4= 120
##$ABSF1= 14.96092
##$ABSF2= -5.597261
##$ABSG= 5
##$ABSL= 3
##$ALPHA= 0
##$AQORDER= 0
##$ASSFAC= 0
##$ASSFACI= 0
##$ASSFACX= 0
##$ASSWID= 0
##$AUNMP= <proc_prof1d_extract.lims>
##$AXLEFT= 0
##$AXNAME= <>
##$AXNUC= <1H>
##$AXRIGHT= 0
##$AXTYPE= 0
##$AXUNIT= <>
##$AZFE= 0.1
##$AZFW= 0.1
##$BCFW= 0
##$BC_mod= 0
##$BYTORDP= 0
##$COROFFS= 0
##$CY= 15
##$DATMOD= 1
##$DC= 0
##$DFILT= <>
##$DTYPP= 0
##$F1P= 0
##$F2P= 0
##$FCOR= 0.5
##$FTSIZE= 131072
##$FT_mod= 6
##$GAMMA= 0
##$GB= 0
##$INTBC= 1
##$INTSCL= 1
##$ISEN= 128
##$LB= 0.3
##$LEV0= 0
##$LPBIN= 0
##$MAXI= 10000
##$MC2= 0
##$MEAN= 0
##$ME_mod= 0
##$MI= 0
##$NCOEF= 0
##$NC_proc= -2
##$NLEV= 6
##$NOISF1= 0
##$NOISF2= 0
##$NSP= 0
##$NTH_PI= 0
##$NZP= 0
##$OFFSET= 14.96092
##$PC= 1
##$PHC0= 4.015503
##$PHC1= 0
##$PH_mod= 1
##$PKNL= yes
##$PPARMOD= 0
##$PPDIAG= 0
##$PPIPTYP= 0
##$PPMPNUM= 2147483647
##$PPRESOL= 1
##$PSCAL= 4
##$PSIGN= 0
##$PYNMP= <proc.py>
##$REVERSE= no
##$SF= 400.020009669575
##$SI= 131072
##$SIGF1= 0
##$SIGF2= 0
##$SINO= 400
##$SIOLD= 131072
##$SPECTYP= <>
##$SREGLST= <1H.CDCl3>
##$SSB= 0
##$STSI= 131072
##$STSR= 0
##$SW_p= 8223.68421052631
##$SYMM= 0
##$S_DEV= 0
##$TDeff= 65536
##$TDoff= 0
##$TI= <>
##$TILT= no
##$TM1= 0
##$TM2= 0
##$TOPLEV= 0
##$USERP1= <user>
##$USERP2= <user>
##$USERP3= <user>
##$USERP4= <user>
##$USERP5= <user>
##$WDW= 1
##$XDIM= 131072
##$YMAX_p= 335560968
##$YMIN_p= -11678
##$CURPLOT= <Network HP LaserJet P1505>
##$CURPRIN= <$Network HP LaserJet P1505>
##$DFORMAT= <normdp>
##$LAYOUT= <+/1D_H.xwp>
##$LFORMAT= <normlp>
##$PFORMAT= <normpl>
##$SURQMSG= 1
$$ End of Bruker specific parameters
$$ ---------------------------------
##NTUPLES= NMR SPECTRUM
##VAR_NAME=  FREQUENCY,     SPECTRUM/REAL,   SPECTRUM/IMAG
##SYMBOL=    X,             R,               I
##VAR_TYPE=  INDEPENDENT,   DEPENDENT,       DEPENDENT
##VAR_FORM=  AFFN,          ASDF,            ASDF
##VAR_DIM=   131072,        131072,          131072
##UNITS=     HZ,            ARBITRARY UNITS, ARBITRARY UNITS
##FACTOR=    0.0627417313425164, 1,          1
##FIRST=     8223.62146879497, 4545,         -59512
##LAST=      0,             5883,            -58811
##MIN=       0,             -11678,          0
##MAX=       8223.62146879497, 335560968,    0
$$ Real data points
##PAGE= N=1
##DATA TABLE= (X++(R..R)), XYDATA
$$ [...]
67953 87299 86523 85710 84661 83199 81475 80094 79533 79503 79340 78940 78833 79284 79872 80182 80386 80836 81490 82157
67935 82157 82917 83889 84864 85632 86388 87292 87871 87503 86382 85350 84841 84623 84632 85274 86596 87847 88347 88371 88718
67916 88718 89667 90820 91683 92044 91891 91303 90409 89288 88004 86791 85920 85273 84391 83130 81931 81181 80738
67899 80738 80402 80427 80998 81529 81140 79830 78593 78291 78809 79400 79445 78780 77642 76560 76093 76460 77438 78596
67881 78596 79566 80111 80174 79896 79527 79311 79433 79937 80599 81069 81242 81294 81187 80508 79055 77322 76008 75292 75044
67862 75044 75452 76819 78750 80223 80696 80675 80939 81520 81731 80963 79270 77327 75915 75284 74949 74281 73234
67845 73234 72278 71684 71283 70964 70921 71230 71569 71642 71590 71708 72033 72464 73070 73956 75028 76183 77590 79442 81518
67826 81518 83346 84817 86363 88404 90861 93266 95192 96459 97050 96993 96294 94964 93150 91306 90107
67811 90107 89974 90630 91260 91210 90404 89012 86971 84182 81129 78779 77571 76806 75365 72935 70252 68306
67795 68306 67614 68164 69579 71134 71929 71410 69862 68282 67677 68272 69392 70158 70334 70342 70544 70828 71027 71322
67777 71322 71888 72462 72696 72740 73075 73842 74731 75470 76026 76379 76488 76507 76665 76948 77239 77706 78602 79666 80210
67758 80210 79913 79184 78576 78236 78037 77903 77749 77414 76863 76330 76137 76443 77177 78002 78469 78490 78583 79293 80434
67739 80434 81279 81430 80993 79980 78146 75577 72874 70532 68613 67160 66367 66118 65892 65446 65064 64841 64279
67722 64279 63064 61754 61206 61665 62815 64320 65854 66966 67506 67903 68549 69179 69362 69292 69513 70045 70327
67705 70327 69974 69101 67976 66859 66073 65808 65847 65849 65745 65575 65178 64544 64194 64577 65275 65464 65111 64978 65377
67686 65377 65697 65414 64942 65066 65934 66961 67451 67113 66268 65747 66235 67488 68491 68595 68199 68134 68662 69394
67668 69394 69930 70234 70534 71116 72179 73736 75644 77767 79916 81670 82574 82679 82525 82382 81843 80514 78844
67651 78844 77771 77604 77676 77197 76109 74978 74299 74103 74042 73644 72627 71170 69891 69338 69486 69870 70247 70904
67633 70904 72188 73899 75422 76368 76809 76899 76617 76038 75540 75459 75689 75926 76190 76780 77743 78690 79255 79550 79985
67614 79985 80783 81741 82481 82813 82872 82890 82893 82779 82675 82975 83864 84977 85768 86123 86322 86487 86454 86201 86031 86092 86028
67593 86028 85379 84170 82810 81533 80270 79104 78461 78610 79135 79216 78491 77428 76767 76718 76799 76391 75347 74091
67575 74091 73229 73012 73095 72879 72124 71173 70484 70153 70045 70159 70514 70794 70525 69678 68748 68194 68053 68134 68190 67880
67555 67880 67020 66045 65728 66155 66463 65986 65227 65181 65999 66936 67446 67714 68095 68580 68955 69052 68757 68048 67150 66366
67535 66366 65731 65125 64693 64746 65154 65236 64500 63248 62201 61674 61343 60777 60034 59676 60155 61198 61925 61743 61006
67516 61006 60556 60724 61095 61214 61154 61228 61461 61613 61596 61627 61957 62528 62978 63003 62723 62617 62990 63654 64252 64738 65340
67495 65340 66100 66787 67276 67707 68132 68263 67789 66858 66007 65581 65400 65060 64508 64105 64101 64294 64381 64461 64836 65454
67475 65454 65978 66374 66904 67410 67235 66213 65220 65187 65932 66504 66422 66028 65877 66380 67804 69861 71326 70910
67457 70910 68775 66582 65738 66082 66535 66563 66602 67280 68579 69741 69918 69072 68148 68061 68636 68981 68845 68953 69835
67438 69835 70963 71469 71185 70604 70210 70350 71365 73198 74999 75739 75253 74233 73242 72206 71052 70296 70531
67421 70531 71528 72314 72238 71678 71502 72053 72914 73546 73757 73517 72770 71724 70982 70932 71136 70756 69567 68245 67672
67402 67672 68223 69678 71464 72921 73687 73920 74016 74100 73951 73364 72379 71297 70686 71103 72452 73837 74509 74759
67384 74759 75339 76312 77159 77834 78752 79687 79737 78720 77667 77349 77176 76274 74998 74449 74846 75262 74911 73993
67366 73993 73225 73057 73447 73997 74292 74265 74203 74246 74167 73906 73948 74755 76062 77162 77736 77941 77865 77454 76966 76979 77738
67345 77738 78768 79316 79056 78351 77930 78232 78975 79479 79469 79346 79542 79980 80414 80973 81908 83107 84311 85639
67327 85639 87320 88990 89777 89275 88085 87240 87307 88097 88970 89381 89314 89207 89338 89321 88445 86502 84126 82351
67309 82351 81943 82977 84778 86313 86916 86716 86349 86365 86973 88067 89255 90085 90507 90969 91799 92757 93444 93930
67291 93930 94500 94964 94705 93421 91426 89276 87456 86438 86592 87898 89909 92050 93798 94769 94963 94871
67275 94871 94999 95361 95768 96458 97949 100277 102816 104931 106438 107364 107704 107549 107094 106321 104989 103097 101061
67258 101061 99299 97925 96997 96763 97355 98439 99454 100160 100773 101555 102383 102800 102507 101764 101154 100957 101021 101297
67240 101297 102095 103447 104623 104815 104187 103707 104002 104894 106002 107152 108083 108367 107951 107339 107015 107024 107263 107716
67222 107716 108160 108184 107829 107822 108698 110076 111240 112172 113488 115484 117751 119675 120905 121367 121202 120787 120504
67205 120504 120431 120476 120782 121691 123230 124930 126308 127339 128352 129579 130910 131951 132213 131404 129755 128079
67189 128079 127324 127954 129719 131960 134008 135346 135719 135390 135159 135774 137262 139102 141052 143340 145857 147679
67173 147679 147938 146882 145550 144556 143804 143316 143557 144702 146163 147231 147813 148206 148540 148897 149656 151229 153466
67156 153466 155679 157292 158240 158837 159442 160227 161112 161955 162839 164000 165377 166557 167352 168146 169298 170513
67140 170513 171245 171576 172192 173481 175143 176761 178310 179938 181615 183222 184683 185866 186637 187250 188334
67125 188334 190160 192155 193564 194454 195675 197849 200765 203768 206375 208425 209980 211338 212867 214588
67111 214588 216058 216861 217072 217109 217356 218143 219838 222539 225747 228700 231008 232731 233959 234771 235514 236608
67095 236608 237946 239028 239883 241331 243907 247001 249584 251515 253563 256267 259351 262250 264672 266506
67081 266506 267676 268387 269281 271052 273891 277292 280339 282309 283236 283912 285124 286970 289078 291343 294004
67066 294004 297028 299912 302339 304685 307572 311043 314466 317167 319022 320489 322210 324565 327511 330741
67052 330741 333941 336899 339567 342188 345180 348656 352164 355208 357920 360919 364460 368145 371519 374571
67038 374571 377457 380108 382430 384676 387288 390423 393865 397355 400823 404256 407572 410680 413616 416556
67024 416556 419661 422979 426523 430382 434631 439125 443583 447910 452241 456544 460485 463915 467237 470973
67010 470973 475167 479582 484251 489359 494662 499552 503739 507509 511315 515495 520335 525918 531809 537397
66996 537397 542642 548053 553847 559596 564870 569732 574424 579063 583857 589140 594886 600653 606274 612190
66982 612190 618759 625714 632647 639579 646598 653420 659812 666151 673040 680662 688935 697888 707321 716482
66968 716482 724833 732944 741869 751720 761594 770938 780252 790231 800848 811584 822095 832293 842077
66955 842077 851355 860236 869098 878538 889159 901067 913587 925858 937785 950110 963455 977637
66943 977637 991986 1006021 1019696 1033336 1047494 1062578 1078459 1094632 1110885 1127453 1144444
66932 1144444 1161569 1178718 1196411 1215217 1234941 1254832 1274577 1294632 1315530 1337184 1359039
66921 1359039 1380642 1401937 1423132 1444466 1466046 1487803 1509606 1531478 1553679 1576539 1600230
66910 1600230 1624770 1650182 1676498 1703465 1730358 1756342 1781169 1805437 1830051 1855457 1881397
66899 1881397 1907303 1932817 1957957 1982913 2007711 2032141 2056051 2079701 2103580 2127797 2151818
66888 2151818 2174963 2197042 2218288 2238806 2258354 2276672 2293810 2310041 2325553 2340268 2353803
66877 2353803 2365674 2375660 2384066 2391488 2398253 2404103 2408441 2410866 2411551 2411109 2410022 2408109 2404607 2398850
66863 2398850 2390760 2380672 2368914 2355787 2341752 2327267 2312375 2296670 2279673 2261125 2240975
66852 2240975 2219363 2196669 2173370 2149774 2125969 2101999 2077929 2053755 2029408 2004839 1979922
66841 1979922 1954381 1928053 1901239 1874483 1848012 1821677 1795475 1769733 1744573 1719507 1693849
66830 1693849 1667452 1640829 1614731 1589747 1566093 1543492 1521325 1499130 1476977 1455232 1434088
66819 1434088 1413496 1393374 1373569 1353723 1333581 1313456 1293989 1275279 1256614 1237354 1217827
66808 1217827 1199017 1181502 1165045 1149213 1133980 1119585 1106090 1093280 1080822 1068328 1055418
66797 1055418 1041966 1028244 1014698 1001621 989143 977392 966381 955781 945043 933861 922377
66786 922377 910930 899775 889060 878892 869230 859781 850142 840153 830161 820891 812835 805618 798149
66773 798149 789620 780301 771144 762779 755189 748231 741931 736134 730288 723851 716737 709253 701861 695050
66759 695050 689115 683841 678691 673450 668351 663428 658221 652466 646638 641352 636487 631429 625968 620417
66745 620417 614974 609583 604436 600051 596651 593817 590933 587633 583744 579176 574114 569052 564403 560173
66731 560173 556129 552054 547739 542964 537780 532703 528366 524890 521747 518347 514715 511474 509057 507069
66717 507069 504636 501405 497893 494764 492015 489146 485871 482367 478926 475727 472818 470042 467025 463566
66703 463566 459936 456517 453245 449852 446561 443972 442157 440382 437974 435048 432127 429422 426827 424305
66689 424305 421844 419226 416275 413314 410954 409339 407843 405658 402564 399044 395763 392985 390451 387671
66675 387671 384301 380326 376009 371731 367781 364218 360989 358210 356136 354741 353554 352163 350723 349564
66661 349564 348403 346473 343538 340294 337510 335187 332944 330875 329414 328440 327081 324642 321373 318076
66647 318076 315173 312429 309490 306388 303432 300835 298640 296906 295768 295173 294695 293690 291709 288824 285622
66632 285622 282867 280942 279517 277860 275618 273221 271355 270137 268968 267225 264932 262682 260971 259743
66618 259743 258580 257209 255645 253850 251553 248650 245623 243151 241355 239809 238272 236911 235658 233944
66604 233944 231418 228451 225523 222512 219116 215596 212484 209831 207428 205581 204825 204801 204211 202239 199468
66589 199468 197060 195435 194099 192462 190511 188780 187780 187329 186491 184478 181569 178777 176632 174784 172857
66574 172857 171122 169987 169297 168521 167451 166385 165758 165694 165791 165344 164073 162587 161776 161657 161279 159864 157596
66557 157596 155160 153029 151448 150565 150178 149676 148634 147214 145813 144626 143673 142801 141496 139338 136863
66542 136863 135332 135147 135216 134442 133154 132309 131849 130876 129166 127464 126322 125589 125128 125181 125740 126232 126108 125282
66524 125282 123920 122337 121218 121237 122191 122997 122835 121862 120595 119165 117521 115893 114606 113698 113095 112946
66508 112946 113400 114230 114954 115294 115314 115196 114971 114412 113225 111544 110138 109710 109946 109728 108480 106764 105302
66491 105302 103987 102445 101109 100913 101928 103007 103011 101947 100689 99919 99696 99816 100170 100691 101185 101414 101326
66474 101326 101053 100640 99875 98560 96885 95342 94270 93723 93769 94530 95720 96523 96378 95669 95171 94938 94374
66457 94374 93441 93082 94017 95629 96657 96731 96530 96472 96004 94540 92518 91031 90678 91238 92273 93520 94661
66440 94661 95267 95184 94745 94421 94407 94602 94742 94470 93557 92242 91106 90429 89843 88830 87369 85870 84654 83764
66422 83764 83177 82845 82611 82387 82397 82995 84169 85451 86321 86541 86122 85231 84223 83560 83545 84205 85360 86676
66404 86676 87703 88130 88018 87597 86907 85932 85053 84842 85269 85586 85343 85102 85609 86573 86889 86042 84663 83600
66386 83600 83055 82952 83527 84958 86691 87846 88276 88664 89452 90138 89877 88412 86187 83860 82000 80950
66370 80950 80608 80477 80260 80246 80761 81446 81633 81398 81617 82784 84218 84803 84180 82905 81725 81084 81118 81644
66352 81644 82157 82211 81882 81630 81652 81629 81206 80463 79757 79258 78821 78278 77655 77127 76846 76879 77162 77463 77511 77357 77460
66331 77460 78158 79058 79342 78813 78243 78370 78908 79028 78561 78106 78064 78241 78516 79139 80051 80540 80069 79014 78123
66312 78123 77637 77421 77613 78409 79412 79942 80045 80577 82026 83783 84857 84985 84661 84260 83608 82474 81174
66295 81174 80391 80451 81007 81522 81754 81580 80683 78987 77214 76298 76149 75676 74314 72802 72018 71783 71570 71743
66277 71743 73077 75277 76979 77326 76748 76092 75755 75838 76398 77182 77649 77552 77120 76512 75633 74679 74285 74763 75671
66258 75671 76509 77347 78398 79389 79886 79930 79868 79768 79497 79239 79414 80104 80905 81413 81567 81497 81297 81037 80844 80849
66238 80849 81055 81254 81128 80560 79802 79154 78523 77596 76417 75431 74821 74254 73508 72988 73283 74384 75692 76598
66220 76598 76809 76332 75494 74844 74714 74933 75157 75339 75610 75943 76260 76738 77555 78385 78513 77563 75907 74342
66202 74342 73544 73755 74720 75903 76937 77828 78591 78882 78324 77071 75716 74713 74207 74373 75368 76877 78213
66185 78213 79096 79961 81216 82518 83098 82594 81304 79802 78638 78207 78509 79033 79189 78893 78547 78505 78792 79324
66167 79324 80070 80930 81706 82359 83089 84059 85159 86207 87173 88019 88486 88290 87461 86280 84891 83248 81493
66150 81493 80116 79550 79739 80254 80750 81149 81428 81442 81050 80370 79840 79930 80794 82142 83459 84309 84481 84044 83393
66131 83393 83100 83462 84188 84666 84546 83952 83222 82709 82724 83258 83712 83321 82083 80891 80456 80447 80061 79192 78596
66112 78596 78986 80327 81959 83151 83616 83723 84107 84875 85444 85440 85380 85942 86827 87077 86486 85984 86403 87452 88210
66093 88210 88161 87447 86515 85815 85580 85641 85677 85784 86434 87745 89154 90066 90421 90401 90019 89419 89142 89557 90261 90618
66073 90618 90705 91123 91884 92139 91311 90031 89522 90230 91412 92055 91910 91469 91223 91252 91481 91876 92155 91726 90423
66054 90423 89175 89295 91018 93195 94576 94967 94944 94931 94918 94731 94175 93164 92017 91393 91605 92229 92715 93121
66036 93121 93848 94860 95649 95900 95832 95934 96682 98341 100640 102690 103650 103549 103203 103359 104159 105355 106681
66019 106681 107944 109040 109973 110709 111079 111026 110872 111067 111675 112333 112707 112785 112751 112785 112986 113372 114052 115456 118108
66000 118108 121900 125856 128981 131185 133028 134805 136392 137806 139270 140694 141704 142372 143373 145162
65986 145162 147336 149077 149878 149689 148685 147198 145611 144050 142320 140302 138219 136378 134870 133632 132557
65971 132557 131372 129668 127319 124764 122709 121623 121561 122223 123031 123357 122904 121796 120235 118345 116478 115388
65955 115388 115732 117433 119765 122039 124014 125740 127252 128543 129745 131174 133097 135412 137640 139351
65941 139351 140564 141684 143137 145149 147685 150290 152172 152835 152682 152611 153051 153794 154751 156245 158281 160124
65925 160124 161096 161456 161978 162927 164026 165262 167077 169644 172473 175038 177439 180205 183556 187069 189972
65910 189972 191722 192422 192754 193346 194193 194779 194835 194706 194869 195317 195714 196029 196624 197578 198224 197693 195866 193451
65892 193451 191050 188434 184943 180420 175479 170932 167234 164445 162349 160446 158105 155047 151691 148893
65878 148893 147250 146622 146237 145287 143575 141625 140081 139071 138341 137869 137930 138472 138882 138651 137986 137393 136897
65861 136897 136094 134942 134076 134185 135332 136967 138430 139320 139519 139040 137942 136472 135237 134952 135813 137208
65845 137208 138323 138956 139507 140239 140928 141341 141746 142628 144026 145432 146355 146827 147271 148000 148992 150203 151887
65828 151887 154433 157823 161464 164671 167245 169530 172046 175172 178988 183128 186830 189433 190916 191801
65814 191801 192466 192691 191997 190267 187957 185698 183757 181874 179630 177014 174538 172701 171481 170546 169853
65799 169853 169692 170112 170712 171134 171506 172113 172885 173500 173825 173943 173867 173598 173430 173829 174904 176407 178416 181687
65781 181687 186902 193700 200859 207524 213944 220765 227776 233753 237600 239353 239786 239268 237462 234187 229986
65766 229986 225482 220533 214679 208309 202715 198709 195777 192999 190418 188890 188844 189807 191218 193093 195686
65751 195686 198988 202951 207910 214268 221850 229945 238030 246146 254434 262502 269529 274985 279075 282288
65737 282288 284523 284837 282273 276886 269783 262147 254433 246537 238402 230185 222024 213938 205971 198263
65723 198263 191029 184556 179082 174477 170196 165881 161916 159059 157442 156275 154614 152170 149319 146678
65709 146678 144845 144192 144596 145476 146285 146830 147013 146577 145465 144171 143341 143103 143168 143464 144205 145373 146594
65692 146594 147657 148725 149869 150860 151695 152855 154642 156576 157928 158684 159520 160955 163053 165874 169637
65677 169637 174247 179161 184067 189430 196085 204409 213988 223937 233488 242512 251626 261533 272150 282637
65663 282637 292291 301022 308810 315267 320175 323988 327217 329593 330505 330090 329244 328534 327804 326955 326472 326894
65647 326894 328225 330116 332182 333889 334514 333610 331201 327305 321680 314321 305808 296656 286650 275347
65633 275347 263042 250706 239049 228102 217696 207917 199018 191243 184745 179347 174373 169113 163559
65620 163559 158392 154208 151054 148721 147058 145827 144653 143436 142561 142375 142558 142305 141159 139438 137798
65605 137798 136541 135485 134461 133782 134025 135317 137024 138320 138966 139360 139938 140809 141946 143344 144827 145944
65589 145944 146331 146170 146122 146846 148571 151089 154061 157316 160898 164850 169133 173873 179565 186704 195178
65574 195178 204286 213493 222887 232703 242599 251775 259730 266598 272624 277613 281077 282761 282738 281049 277540
65559 277540 272215 265572 258399 251182 243759 235540 226109 215791 205685 196885 189487 182569 175413 168528
65545 168528 163007 159040 155674 152160 148901 146755 145875 145669 145567 145388 145244 145500 146565 148224 149436 149345
65529 149345 148348 147534 147171 146428 144684 142374 140241 138387 136509 134679 133365 132826 132848 132981 132771 131960 130765
65512 130765 129861 129746 130099 130022 128968 127306 125913 125367 125600 126229 127014 127878 128585 128718 128121 127188 126479 126173
65494 126173 126173 126639 128017 130428 133306 135810 137520 138651 139749 141223 143038 144841 146420 147932 149509
65479 149509 150779 151115 150347 148931 147363 145805 144292 142953 141852 140840 139728 138428 136822 134761 132289
65464 132289 129731 127480 125894 125312 125765 126641 127096 126938 126702 126660 126279 125045 123376 122208 121914 122140 122545
65447 122545 123123 123834 124435 124860 125414 126371 127559 128546 129130 129519 130073 130968 132162 133624 135508 137951 140772
65430 140772 143525 145853 147643 148845 149339 149065 148109 146616 144799 143035 141661 140580 139323 137651 135859
65415 135859 134395 133444 133042 133206 133752 134303 134766 135553 136929 138402 139115 138772 137868 137174 137317 138691 141239
65398 141239 144288 146989 149048 150788 152480 153914 154792 155269 155862 156783 157478 156996 155015 152512 151117 151567
65382 151567 153028 154139 154445 154406 154266 153607 152196 150718 150243 151193 153123 155363 157531 159440 160929 162029
65366 162029 163131 164644 166458 168027 169137 170361 172482 175645 179433 183699 188794 194818 201132 206930
65352 206930 211993 216538 220546 223692 225792 226980 227484 227552 227552 227740 227829 227033 224729 221000 216499 211860 207243
65335 207243 202356 196903 191107 185741 181574 178808 177031 175558 173792 171461 168754 166129 163852 161813
65321 161813 159846 158005 156346 154646 152599 150211 147799 145728 144299 143656 143536 143262 142346 141067 140189
65306 140189 140108 140454 140519 139899 138834 138093 138398 139693 141052 141528 141044 140283 139940 140345 141593 143528 145535
65289 145535 146827 147088 146653 145990 145252 144415 143593 143047 142945 143192 143381 143001 141861 140344 139096 138474 138426 138777
65271 138777 139343 139758 139508 138331 136526 134822 133921 134043 134746 135300 135389 135401 135836 136586 137066 137031 136974 137631 139249
65252 139249 141372 143198 144115 144008 143135 141765 140056 138231 136582 135162 133761 132439 131853 132690 134824
65237 134824 137324 139244 140239 140507 140389 140015 139196 137792 136213 135225 135062 135092 134728 134253 134223 134427 134155 133312
65219 133312 132505 132009 131472 130806 130596 131212 132090 132428 132257 132344 133212 134692 136320 137852 139326 140822 142205
65202 142205 143110 143222 142578 141479 140204 138930 137844 137069 136508 136040 135849 136308 137487 139029 140504 141622
65186 141622 142163 142064 141592 141091 140518 139642 138739 138582 139504 140895 141923 142434 142860 143531 144471 145634 146939 148102
65168 148102 148809 149076 149279 149792 150752 152166 154064 156402 158916 161217 163127 164853 166703 168677 170521
65153 170521 172234 174209 176754 179709 182795 186130 190079 194789 200203 206424 213720 222230 231903 242513
65139 242513 253376 263282 271338 277899 284178 290873 297625 303828 309335 314136 317874 320109 320798 320223
65125 320223 318653 316312 313498 310454 307171 303427 298972 293674 287676 281430 275365 269518 263612 257455
65111 257455 251061 244452 237633 230719 223869 217140 210613 204525 198985 193786 188809 184416 181003 178386
65097 178386 176104 174103 172500 170884 168645 165994 163926 163046 163043 163395 163854 164135 163883 163228 162714 162466 162065
65080 162065 161409 160926 160709 160235 159340 158619 158405 158096 157098 155757 154758 154220 154004 154283 155060 155665 155530 155104
65062 155104 155252 156038 156841 157390 157972 158723 159386 159711 159594 158968 157994 157138 156664 156282 155744 155362 155447 155613 155353
65043 155353 154956 155094 155668 155880 155372 154574 153887 153182 152232 151010 149462 147456 145121 142882 141068 139742
65027 139742 138902 138478 138264 138138 138245 138630 138950 138983 139143 139927 141034 141650 141493 140971 140433 139975 139964 140925 142719
65008 142719 144456 145520 146142 146760 147354 147775 148279 149319 151022 153112 155150 156691 157472 157691 157945 158684
64992 158684 159811 160871 161528 161768 161801 161905 162376 163550 165690 168648 171695 174011 175433 176415 177160 177299
64976 177299 176675 175911 175651 175629 175022 173478 171231 168495 165429 162540 160392 158864 157267 155234 153058 151126
64960 151126 149590 148588 148286 148584 149163 149866 150633 151133 150935 150051 148882 147650 146355 145283 144954 145474 146331
64943 146331 146934 147017 146600 146000 145815 146339 146994 146861 145903 145127 145461 146882 148662 149986 150352 149901 149392 149391 149524
64924 149524 149107 148366 148210 148738 148898 147909 146250 144843 143962 143416 143158 143202 143426 143900 145000 146747 148509
64907 148509 149814 151049 152870 155254 157634 159713 161688 163838 166347 169441 173361 178149 183533 188889
64893 188889 193422 196736 199286 201861 204633 207248 209856 213240 217572 221758 224542 225723 225824 225133 223695
64878 223695 221783 219592 216791 213078 208996 205523 202881 200330 197196 193636 190400 188171 187147 186923
64864 186923 186812 186493 186192 186040 185590 184361 182566 180830 179369 177915 176293 174530 172574 170447 168623
64849 168623 167584 166933 165596 163134 160409 158654 158252 158677 159219 159383 158810 157414 155684 154591 154898 156525
64833 156525 158622 160261 161097 161384 161553 161883 162527 163556 164861 166153 167218 168074 168792 169301 169545 169749 170381
64816 170381 171856 174308 177574 181317 185277 189472 194090 199092 204059 208486 212182 215332 218203 220781
64802 220781 222632 223183 222328 220657 218865 217001 214564 211276 207456 203612 200071 197028 194578 192523 190520
64787 190520 188511 186791 185584 184954 185107 186236 187918 189239 189825 190218 190919 191653 192052 192462 193424 194793
64771 194793 196139 197749 200435 204441 209266 214536 220259 226083 231111 234916 238236 242139 246718 251003
64757 251003 254036 255734 256835 258314 260855 264531 268757 272599 275297 276631 276864 276368 275318 273657 271192
64742 271192 267708 263248 258426 254157 250677 247024 242038 235905 230204 226295 224126 222741 221389 219802
64728 219802 217960 216191 215197 215422 216487 217685 218836 220214 221797 223142 224035 224824 225987 227693 229848
64713 229848 232310 234939 237523 239687 240842 240509 238922 237079 235800 234768 232846 229322 224603 219790
64699 219790 215811 212902 210545 207934 204789 201735 199663 198742 198329 197744 196822 195789 195041 195096 196271 198185
64683 198185 199922 200994 201876 203352 205557 208015 210499 213363 216969 221156 225588 230295 235470 240809
64669 240809 245585 249523 253155 256900 260082 261326 259917 256379 251828 247182 242971 239344 236024 232574
64655 232574 228933 225499 222682 220661 219539 219254 219339 219287 219295 220040 221521 222807 223345 223929 225838 229455 234296
64638 234296 239936 246226 252828 259217 265148 270676 275817 280556 285005 289170 292759 295578 297856 299684
64624 299684 300443 299398 296697 293169 289202 284487 278936 273266 268489 265133 263042 261616 260229 258709
64610 258709 257387 256472 255609 254431 253296 252821 252776 252122 250321 248075 246498 245965 246049 246225 246243 245924 244921
64593 244921 242894 239995 237048 234901 233528 232079 230013 227809 226272 225608 225650 226639 229022 232577 236291
64578 236291 239218 241115 242366 243661 245579 248011 250123 251313 251971 252764 253416 252885 250618 247016 242698
64563 242698 238050 233461 229281 225421 221574 217892 214846 212412 210056 207535 205031 202494 199717 197163
64549 197163 195790 195765 196198 196496 197039 198061 198798 198621 198265 198991 200936 203149 204948 206320 207095 206712 205108
64532 205108 203243 202331 202800 204087 205207 205364 204312 202443 200587 199532 199543 200208 200861 201261 201806 202972
64516 202972 204689 206456 207922 209103 210206 211559 213499 215881 217911 218987 219615 220882 223127 225817
64502 225817 228681 232111 236237 240468 244390 248356 252723 257089 260838 263927 266526 268291 268614 267433
64488 267433 265304 262811 260229 257594 254826 252059 249983 249418 250268 251357 251680 251382 251086 250805 250096 248908
64472 248908 247554 246062 244218 242170 240461 239513 239460 240325 241905 243651 245184 246859 249336 252630 256000
64457 256000 258790 260985 262937 264911 266915 268778 270459 272341 274942 278109 280956 283067 285342 288975
64443 288975 293812 298560 302610 306844 312413 319435 327305 335700 344685 354113 363615 373249 383731 395772
64429 395772 409445 424500 441179 460293 482323 506919 533704 563304 596940 635129 677585
64418 677585 724497 776966 835507 898659 963675 1028148 1090423 1149062 1202944 1251829 1295892
64407 1295892 1334529 1366148 1389157 1402606 1405908 1398757 1381613 1355716 1322214 1281531 1233757 1179339
64395 1179339 1119300 1055208 989147 923403 859786 799325 742548 689797 641214 596868 557096
64384 557096 522466 493088 468130 446245 426449 408523 392733 379289 368020 358403 349851 341988
64372 341988 334670 327871 321550 315512 309367 302900 296558 291195 287060 283317 278966 273977 269109 264860
64358 264860 261137 257867 255258 253408 252185 251628 251895 252722 253497 254143 255382 257723 260603 262986 264493
64343 264493 265412 265766 264985 262623 259090 255455 252660 250926 249752 248407 246481 244093 241648 239493 237863
64328 237863 237034 237326 238833 241162 243562 245386 246426 246798 246633 246071 245450 245181 245360 245784 246422 247472 248763
64311 248763 249460 248753 246594 243507 239999 236553 233803 232037 230650 228729 226154 223516 220988 218065 214608
64296 214608 211425 209375 208414 207954 207773 208088 208959 210081 211046 211614 211913 212528 214098 216581 219193 221352
64280 221352 223350 225789 228774 232059 235672 239777 244113 248201 252088 256265 260707 264511 266744 267321
64266 267321 266853 265898 264642 263099 261386 259809 258676 257973 257313 256496 255963 256257 256950 256675 254486 250775
64250 250775 246510 242055 237309 232617 228748 225937 223612 221234 218796 216353 213748 211228 209727 209896
64236 209896 211097 211992 211960 211432 211015 210947 211419 212663 214389 215664 215804 215126 214545 214602 215086 215371 214878 213483
64218 213483 211754 210621 210500 210854 210823 210111 209056 208021 207072 206160 205267 204353 203409 202583 202064 201836 201740 201778
64200 201778 202186 203196 204850 206977 209242 211278 213025 214892 217411 220754 224698 229059 233936 239500
64186 239500 245710 252274 258770 264753 269889 274048 277221 279306 280049 279238 276910 273306 268620 262926 256488
64171 256488 250021 244344 239593 235095 230295 225546 221562 218343 215246 212051 209292 207387 206161 205446
64157 205446 205437 205963 206111 205351 204600 205402 208175 211873 215155 217317 218291 218530 218925 220139 221900 223467 224772
64140 224772 226482 228810 230980 232181 232483 232382 231937 230877 229358 228067 227556 227795 228450 229390 230758 232570
64124 232570 234434 235895 237027 238377 240202 242130 243914 246156 249754 254766 260318 265655 270792 276059
64110 276059 281462 286679 291377 295414 298969 302512 306378 310386 314115 317546 321104 325100 329445 333850
64096 333850 337967 341507 344647 348134 352416 356721 359669 360798 360755 359929 357827 354157 349691 345417 341465
64081 341465 337491 333591 330024 326392 321936 316665 311526 307374 304215 301538 298944 296341 293891 291962
64067 291962 290925 290757 290896 290636 289729 288601 287907 287850 288091 288420 289221 290902 293121 295108 296748 298761 301729
64050 301729 305486 309627 314094 318994 324376 330441 337449 345053 352324 358871 365447 372907 381069 389206
64036 389206 397198 405330 413244 419905 424668 427733 429511 430114 429536 427843 425160 421799 418390 415418 412747
64021 412747 410038 407464 405408 403599 401255 398096 394497 390568 385896 380442 374932 370010 365714 362152
64007 362152 359873 358934 358337 357217 356149 356317 357721 359179 360044 360928 362547 364774 367244 370100 373567
63992 373567 377298 380831 384417 388799 394282 400561 407397 414975 423471 432641 442018 451337 460696 470468
63978 470468 481045 492454 504289 516228 528566 541914 556406 571550 586927 602665 619144
63967 619144 636677 655639 676454 699103 723035 748005 774698 804150 836748 872284 910696
63956 910696 952200 996814 1044411 1095367 1150692 1211455 1278516 1352867 1435668 1527683 1629062
63945 1629062 1739866 1860396 1990786 2130634 2279195 2435461 2597658 2763018 2928492
63936 2928492 3091430 3249166 3398264 3534743 3655033 3756369 3836454 3893445 3926462 3935593
63926 3935593 3921002 3882250 3818899 3731736 3623229 3496843 3356218 3205014 3047072 2886158
63916 2886158 2725253 2566282 2410645 2259997 2116438 1981996 1857899 1744206 1640141
63907 1640141 1545030 1458992 1382436 1314810 1254349 1199423 1149742 1105701 1066939 1032305 1001045
63896 1001045 973195 948641 926600 906267 887304 869401 852010 834976 818868 804213 790843
63885 790843 778412 767075 757085 748211 740218 733620 729224 727020 726235 726447 728082 731751 737606 745393
63871 745393 754749 765343 777126 790430 805411 821404 837280 852517 867426 882166 896039 908082
63859 908082 917973 925963 932172 936392 938572 939095 938397 936421 932553 926070 916612 904313 889610 872976
63845 872976 854752 835125 814231 792343 769913 747364 724880 702522 680425 658618 636750
63834 636750 614387 591724 569733 549436 531219 514852 499783 485251 470575 455678 441131
63823 441131 427490 414922 403631 394053 386100 378680 370701 362359 354702 348032 341524 334600 327932
63810 327932 322671 319100 316430 313658 310320 306597 303010 299957 297403 295002 292489 289759 286660 283018
63796 283018 278995 275103 271693 268646 265737 263089 261048 259716 258802 257844 256428 254339 251712 249034 246811
63781 246811 245194 244008 243135 242726 242980 243770 244561 244685 243735 241837 239656 238063 237536 237723 237718 236978 235914
63764 235914 235373 235563 235775 235226 233975 232821 232485 233063 234139 235179 235770 235625 234614 232950 231307 230479
63748 230479 230722 231577 232492 233394 234407 235337 235940 236557 237794 239572 241135 242173 243292 245107 247454 249872
63732 249872 252272 254674 256748 258201 259285 260444 261779 263307 265348 268066 270922 273244 275130 277130
63718 277130 279234 280870 281873 282745 283857 284932 285498 285353 284464 282892 280991 279311 278100 277080 275833
63703 275833 274278 272792 272028 272467 273873 275292 275911 275813 275677 275999 276978 278844 281687 285069 288340 291282
63687 291282 293992 296338 298141 299714 301451 302914 303142 302070 300866 300553 300975 301496 302077 303133 304714
63672 304714 306357 307569 308134 308113 307758 307265 306515 305330 304019 303228 303137 303233 303034 302539 301780 300510 298773 297234
63654 297234 296350 295516 293633 290442 286847 283977 282348 281853 282121 282722 283358 284025 284913 286114 287506 288974
63638 288974 290657 292846 295608 298561 301218 303611 306350 309914 314135 318651 323641 329661 336872 344855
63624 344855 353179 361648 370009 377965 385680 393851 403031 413178 424067 435826 448873 463500 479614
63611 479614 496707 514154 531905 550794 571659 594014 615997 635696 652114 664920 674067 679966
63599 679966 683405 684813 684045 681235 677371 673570 670176 666904 663326 658731 652005 642435 630423 616918
63585 616918 602376 586893 571048 555787 541410 527375 513384 500213 489153 480832 474754 469809
63573 469809 465187 460982 458031 457067 458037 460282 463242 466776 470882 475472 480537 486304 492991 500384 507873
63558 507873 515119 522651 531531 542254 554245 566733 579900 594748 611952 631420 653032 677116
63546 677116 703690 731412 757554 779046 793726 801163 802616 800022 794850 787929 780082 772348 765420
63533 765420 759304 753622 747874 741390 733580 724319 713641 701078 685990 668624 650024 630700 610313
63520 610313 589059 568294 549059 530823 512523 494202 476721 460481 445431 431823 419899
63509 419899 409127 398820 389275 381328 374878 368909 362887 357154 351956 347110 342769 339490 337251 335311
63495 335311 333376 332057 331805 332150 332400 332461 332562 332797 333312 334336 335584 336219 335881 335296 335430 336491 338161
63478 338161 340308 342988 346095 349463 352939 355977 357645 357620 356823 356435 356510 356137 354767 352731 350554 348492
63462 348492 346788 345813 345650 345888 346066 346102 346207 346577 347258 348095 348834 349538 350909 353827 358464 364131 370120
63445 370120 376387 383253 390905 399631 410201 423285 438396 454088 469631 486111 505347 527763
63433 527763 551672 574487 594191 609742 620895 628179 632871 636483 640156 644599 650357 657876 667398
63420 667398 679042 692990 709427 728309 749240 771423 793650 814523 832897 848021 859244
63409 859244 865925 867957 866215 862143 857014 851665 846577 841688 836247 829294 820313 809120 795351 778684
63395 778684 759610 739399 719005 698359 676974 654943 633087 612351 593315 576135 560696
63384 560696 546832 534585 524228 515954 509603 504796 501321 499208 498399 498424 498680 499150 500644 504009 509178
63369 509178 515393 522358 530598 540447 551324 562584 574661 588727 605332 624024 644172 665515
63357 665515 687859 710804 733922 756738 778484 798296 815666 830205 841005 846987 848195 846115
63345 846115 842339 837357 830998 823516 815637 807783 799668 790502 779256 765065 747903 728746 708703
63332 708703 688103 666812 645260 624550 605505 588101 572073 557666 545456 535668 528028 522184
63320 522184 517812 514121 509573 502616 492803 481008 468490 455974 443670 431790 420678 410612
63308 410612 401797 394368 388098 382325 376615 371333 367049 363515 359872 355890 352266 349492 347095 344398
63294 344398 341504 339059 337412 336427 335727 334704 332709 329852 327269 325950 325501 324766 323551 322889 323463 324525
63278 324525 324904 324556 324540 325602 327287 328556 328982 329118 329731 330833 331636 331499 330716 330187 330477 331502 333071
63261 333071 335289 338257 341728 345357 349109 353107 357207 361058 364608 368319 372752 378077 384013 390088
63247 390088 395912 401435 407076 413445 420791 428845 437342 446501 456672 467704 479092 490856 503826
63234 503826 518754 535407 552842 570401 588129 606263 624750 643315 661772 679999 697765
63223 697765 714784 731000 746712 762331 778077 794045 810496 827737 845419 862200 876566
63212 876566 888078 897429 905222 911062 913982 913284 908698 900224 888335 874062 858339 841384 823122
63199 823122 804060 785253 767466 750856 735501 721742 709878 699869 691536 684897 680281 678277
63187 678277 679433 683707 690270 698139 706939 716845 727984 740274 753682 768104 783067 798049 813057
63174 813057 828337 843554 857904 871146 883854 896434 908477 919302 928513 935628 939781 940381
63162 940381 937750 932565 924935 914422 900748 884038 864569 842730 819115 794289 768603 742556
63150 742556 717206 693668 672177 652001 632425 613575 596174 580765 567386 555900 546283 538367
63138 538367 531417 524408 517016 510135 505025 501989 500209 498781 497449 496240 494960 493397 491741 490501
63124 490501 490114 490794 492504 494886 497364 499532 501429 503449 506052 509409 513092 516269 518623 520948 524250
63109 524250 528372 532166 535074 537699 540498 542800 543746 543605 543447 543891 544824 546037 547442 548764 549583 549723
63093 549723 549286 548544 548048 548525 550202 552484 554781 557301 560533 564288 567961 571558 575696 580632 586021
63078 586021 591710 598065 605247 612753 620004 627049 634433 642620 651713 661507 671671 682065 692940
63065 692940 704687 717442 731148 745929 762088 779805 799171 820476 844065 869847 897285
63054 897285 925969 955976 987704 1021634 1058205 1097476 1138869 1181555 1225114 1269472 1314191
63043 1314191 1358269 1400831 1441698 1481195 1519789 1558021 1596403 1635045 1673588 1711554 1748480
63032 1748480 1783628 1816077 1845376 1871738 1895113 1914222 1926935 1931612 1927883 1916265 1897351 1871462
63020 1871462 1838891 1800417 1757654 1712782 1667680 1623223 1579531 1536927 1496496 1459620 1427148
63009 1427148 1399235 1375941 1357658 1344826 1337432 1335028 1337104 1343190 1352701 1365081 1380159 1398026
62997 1398026 1418493 1440942 1464741 1489396 1514241 1538582 1562461 1586730 1611875 1637127 1661242
62986 1661242 1683685 1704344 1722396 1736386 1745451 1749696 1749211 1743465 1731909 1714485 1691102 1661224
62974 1661224 1624575 1582035 1535377 1486286 1435913 1385156 1334938 1286122 1239325 1194794 1152414
62963 1152414 1112010 1073706 1037788 1004251 972816 943518 916826 892882 870955 850045 829796
62952 829796 810414 791912 773986 756629 740303 725288 711232 697650 684632 672699 661962
62941 661962 651758 641273 630449 620082 611027 603399 596646 590227 584056 578291 572922 567681 562284
62928 562284 556690 551188 546289 542369 539337 536695 534061 531532 529431 527856 526637 525659 524888 524018 522449
62913 522449 519873 516705 513619 510755 507731 504390 501109 498230 495557 492688 489555 486344 483185 480315
62899 480315 478277 477438 477408 477401 477107 476770 476449 475856 474978 474238 473784 473197 472206 471170 470440 469716 468544 467094
62881 467094 465984 465588 465874 466626 467432 467783 467696 467884 468853 470093 470736 470663 470299 469556 467865 465300 462894 461555
62863 461555 461187 461117 460947 460748 460765 461122 461678 462164 462654 463700 465566 467460 468110 467175 465606 464609 464635 465420
62845 465420 466380 466882 466634 466035 465752 465836 465723 465175 464638 464500 464583 464679 465043 465962 467274 468713 470377 472429
62827 472429 474632 476546 478053 479372 480820 482730 485348 488529 491830 495085 498613 502614 506768 510761
62813 510761 514856 519588 525120 531260 537808 544530 551057 557230 563382 569952 577079 584877 593766 603967
62799 603967 614885 625600 635937 646577 658235 671214 685693 701792 719251 737593 756833
62788 756833 777643 800661 826104 854243 885719 920969 959693 1001353 1046021 1094241 1146180
62777 1146180 1201356 1259245 1319669 1382338 1446227 1509624 1570694 1627870 1679881 1725590 1763802
62766 1763802 1793157 1812435 1821127 1819592 1808438 1787879 1757974 1719419 1673665 1622242 1566395 1507489
62754 1507489 1447263 1387233 1328090 1270063 1213750 1160137 1109812 1062538 1017755 975329 935699
62743 935699 899392 866502 836689 809653 785409 763880 744480 726636 710612 697117 685914
62732 685914 675657 665567 656465 649433 644207 639857 636443 634759 634686 635168 635852 637487 640437 644048 647952
62717 647952 652891 659577 667705 676811 687215 699257 712369 725943 740631 757711 777423 798938
62705 798938 821877 846989 875143 906347 939985 975627 1013493 1054388 1099125 1147739 1199379
62694 1199379 1253147 1308674 1365463 1422081 1476591 1527533 1573803 1613846 1645838 1668787 1682673
62683 1682673 1687335 1681972 1666155 1640764 1607418 1567356 1521383 1470613 1416597 1360637 1303402 1245460
62671 1245460 1187912 1132160 1079122 1028950 981585 937308 896528 859244 825077 793749 765188
62660 765188 739217 715577 694291 675568 659167 644248 630017 616178 602626 589250 576320
62649 576320 564584 554455 545391 536528 527722 519635 513003 508099 504660 501994 499415 496847 494783 493415
62635 493415 492271 490995 489932 489394 488873 487644 485742 483667 481470 478991 476738 475609 475727 476319 476755
62620 476755 476936 476783 476301 476292 477999 481608 485854 489525 492726 496237 500310 504717 509533 515172 521873 529529
62604 529529 537888 546619 555478 564758 575387 588214 603365 620484 639375 660166 683054 708143
62592 708143 735307 763997 793430 823121 852929 882315 909992 934694 955991 973831 987506
62581 987506 995682 997491 993157 983476 969163 950862 929438 905788 880411 853366 824773 795329
62569 795329 766290 738912 713817 690811 669248 648596 628779 610133 593089 577872 564485
62558 564485 552845 542771 533828 525455 517440 510070 503614 497903 492740 488469 485596 483930 482615 481160
62544 481160 479924 479419 479516 479660 479596 479606 480159 481516 483496 485582 487432 489317 491768 494856 498258 502069
62528 502069 506882 512799 519054 525221 532251 541516 553126 566054 579856 595361 613384 633571 655015
62515 655015 677496 701585 727829 756356 787081 819729 853631 887893 921852 955010 986475
62504 986475 1014905 1039310 1059666 1076376 1089187 1096973 1098651 1094202 1084789 1072164 1058000 1043489
62492 1043489 1029189 1015178 1001594 989187 979285 973044 970664 971464 974735 980444 988931 1000161 1013624
62479 1013624 1028945 1045951 1063738 1080120 1092739 1100695 1104578 1105012 1101794 1094499 1083020 1067103
62467 1067103 1046163 1020268 990804 959402 926566 892152 856901 822498 790041 759368 730135
62456 730135 702784 677975 655735 635707 617816 602164 588551 576553 565920 556529 548175 540841
62444 540841 535030 531359 529732 529216 528880 528614 529087 530941 534042 537475 540318 542331 543750 544498 543938 541513
62428 541513 537271 531618 524928 517663 510456 503604 496695 489287 481850 475406 470183 465178 459404 453134
62414 453134 447534 443313 440173 437468 434925 432604 430514 428587 426887 425550 424470 423261 421726 420321
62400 420321 419964 421277 424049 427476 430815 433697 435949 437462 438457 439634 441654 444411 447098 449156 450921
62385 450921 453120 455949 459025 462157 465740 470235 475580 481349 487335 493749 500877 508692 516841 524991
62371 524991 533247 542153 552150 563155 574846 587270 600743 615157 629954 645092 661637 680994
62359 680994 703726 729439 757524 787607 819447 852886 887859 924038 960403 995410 1027589
62348 1027589 1055776 1078957 1096377 1107898 1114006 1115381 1112578 1105973 1095714 1081741 1064135 1043405
62336 1043405 1020251 995165 968580 941281 914268 888219 863436 840288 819268 800547 783781
62325 783781 768458 754195 740677 727642 714947 702439 689789 676731 663427 650285 637487
62314 637487 624956 612638 600471 588254 576077 564687 554881 546581 539154 532490 526997 522546 518368
62301 518368 514260 510983 509050 507970 507166 506826 507180 507720 508050 508909 511348 515214 519403 523434 527803 532815
62285 532815 538154 543809 550539 558926 568548 578511 588363 598126 607828 617484 627288 637388 647562 657356
62271 657356 666554 675306 683915 692633 701608 710874 720439 730490 741462 753744 767387 782288 798707
62258 798707 817467 839455 864925 893352 923962 956242 989846 1024114 1057863 1089600 1117888
62247 1117888 1141682 1160582 1174784 1184551 1189673 1189633 1184270 1174006 1159302 1140188 1116447 1088150
62235 1088150 1055920 1020898 984507 948009 912104 877062 843226 811140 781230 753729 728977
62224 728977 707281 688297 671130 655448 641975 631202 621990 612323 601504 590961 582630 577109
62212 577109 573584 570971 568568 565914 562712 559077 555530 552540 550188 548360 547121 546757 547521 549484 552539
62197 552539 556318 560186 563641 566854 570559 575229 580656 586566 593205 600868 609107 617126 624856 632916
62183 632916 641430 649642 657025 664073 671485 679097 686199 692529 698342 703802 708957 714230 720392 728059
62169 728059 737673 749817 764950 782826 802695 824176 847441 872426 898410 924591 950542 975668
62157 975668 998583 1017606 1031867 1041682 1047869 1051002 1051205 1048263 1041745 1031256 1016889 999425 979925
62144 979925 959108 937209 914418 891294 868717 847586 828612 812162 798100 785878 775010
62133 775010 765463 757464 751070 746097 742306 739414 737059 735051 733563 732770 732452 732365 732844 734490 737263
62118 737263 740474 743764 747349 751049 753729 754286 752830 750498 748398 747018 746163 744887 741788 736025 728107
62103 728107 719372 710890 703125 696301 690588 686047 682851 681381 681724 683275 685354 688045 691855 696631
62089 696631 701453 705734 709850 714483 719787 725558 731869 739121 747467 756478 765542 774594 784353 795682
62075 795682 808733 822935 837785 853278 869415 885693 901481 916655 931534 946350 961116
62064 961116 975831 990515 1005199 1020086 1035376 1050549 1064161 1074908 1082703 1088209 1091469 1091698
62052 1091698 1088415 1082142 1073769 1063639 1051451 1036758 1019412 999700 978064 954592 928957 901182
62040 901182 872205 843267 814931 787190 760372 735198 711901 689976 669067 649569 632070
62029 632070 616578 602620 589788 577922 567016 557158 548441 540792 534035 528054 522667 517440 512103
62016 512103 507141 503443 501129 499167 496442 492880 489204 485883 482743 479522 476475 474293 473514 474071 475423
62001 475423 477156 479338 482193 485550 488818 491388 492907 493270 492642 491415 489898 488062 485754 483034 480054
61986 480054 476791 473214 469497 465695 461382 456063 449893 443603 437806 432748 428493 424846 421237 417311
61972 417311 413551 410784 409151 408216 407885 408309 408903 408506 406888 405175 404311 403904 403175 402275 401920 402204 402650
61955 402650 403096 403816 404873 405996 407138 408700 411226 415161 420744 427772 435552 443484 451679 460835 471529
61940 471529 483744 496906 510203 523078 535570 548027 560457 572505 584146 595975 608466
61929 608466 621268 633442 644084 652490 658227 661503 663120 663627 662875 660789 658151 655908 653924 651129
61915 651129 646980 642240 638283 636082 635930 637694 641073 645819 651783 658704 666071 673459 680889 688548
61901 688548 696168 702893 707750 709987 709152 705279 699133 691956 684677 677347 669391 660385 650594 640744
61887 640744 631259 621917 612475 603423 595591 588985 582598 575619 568280 561148 554230 547399 541200 536341
61873 536341 532576 528891 524858 521080 518198 516164 514793 514427 515578 518206 521714 525535 529534 533993
61859 533993 539397 546114 554188 563491 574023 585874 598959 613127 628518 645458 663873 683119
61847 683119 702562 722010 741451 760660 779288 797048 813507 827878 839342 847497 852322 853827
61835 853827 852102 847686 841606 834908 828281 822163 817064 813605 812265 813077 815607 819277 823828 829445
61821 829445 836282 843762 850463 854836 856049 854102 849213 841311 830191 815988 799343 781152 762196
61808 762196 742923 723455 703850 684495 666143 649405 634209 619946 606151 592914 580616
61797 580616 569457 559362 550247 542254 535654 530423 525938 521276 516026 510689 506113 502642 499997 497811
61783 497811 495869 493873 491435 488489 485459 482813 480638 478686 476614 474171 471463 469122 467847 467540
61769 467540 467159 465694 463141 460365 458243 457114 456829 456993 457200 457277 457377 457757 458468 459308 459992 460387 460659
61752 460659 461104 461704 461977 461481 460308 458797 456948 454630 452250 450541 449559 448602 447322 446296 446053 446166
61736 446166 445935 445487 445487 445995 446329 446024 445368 444888 444786 445024 445567 446315 446942 447003 446313 445249 444595 444853 445704
61717 445704 446453 446959 447718 448920 449998 450406 450341 450264 450113 449480 448227 446451 444097 441160 437994 434959 431924
61700 431924 428582 424958 421157 416950 412281 407879 404590 402214 399836 397238 395067 393472 391569 388719
61686 388719 385586 383266 381831 380398 378399 376177 374353 373063 371966 370785 369611 368692 368017 367318 366514
61671 366514 365918 365772 365804 365620 365325 365301 365411 365031 363960 362777 362072 361735 361282 360504 359482 358316 357255 356891
61653 356891 357742 359584 361494 362633 362871 362677 362613 363014 364027 365718 368008 370566 372943 374956 376824 378765
61637 378765 380531 381509 381335 380233 378772 377379 376088 374648 372825 370600 368067 365230 362104 359009 356428
61622 356428 354463 352770 351273 350532 350954 351847 351918 350712 349076 348064 347824 347757 347364 346542 345236 343227 340409
61605 340409 337070 333722 330633 327667 324631 321623 318877 316378 313946 311619 309589 307708 305547 303069
61591 303069 300841 299326 298397 297765 297385 297066 296186 294370 292093 290132 288741 287880 287770 288473 289269 289314 288747
61574 288747 288326 288116 287479 286353 285568 285637 286113 286476 286831 287334 287689 287803 288337 289943 292291 294356 295442
61557 295442 295557 295108 294621 294491 294677 294829 294953 295586 296993 298542 299340 299289 299091 299345 300015 300706 301178 301587
61539 301587 302422 304111 306477 308664 309748 309427 308181 306979 306816 308123 310315 312154 312783 312326 311428 310548
61523 310548 309901 309684 309945 310322 310312 309821 309206 308761 308297 307294 305502 303403 301998 301934 302855 303810 304208 304088
61505 304088 303578 302664 301608 301036 301203 301526 301240 300303 299280 298540 298001 297574 297401 297589 297990 298424 298932 299659
61487 299659 300566 301434 302187 303093 304434 305992 307118 307461 307404 307540 307950 308351 308740 309361 310079 310325 309813 308902
61469 308902 308108 307692 307850 308828 310493 312101 312872 312697 312087 311643 311748 312562 314009 315746 317284 318216 318386
61452 318386 317992 317459 317108 317023 317303 318183 319647 321211 322484 323685 325098 326336 326824 326863 327417 328809 330378
61435 330378 331509 332183 332447 332294 332354 333721 336523 339474 341410 342532 343518 344287 344543 344884 346253 348560
61419 348560 350757 352158 352907 353342 353692 354298 355360 356450 356941 356986 357412 358574 359850 360371 359762 358151 355959
61402 355959 353764 351920 350218 348313 346459 345353 345224 345572 345928 346305 346715 346772 346162 345251 344802 345182 346092
61385 346092 347059 348006 349262 351048 353077 354766 355830 356457 356861 357016 357052 357584 359228 361858 364683 366988
61369 366988 368597 369738 370835 372374 374602 377241 379689 381612 383253 385198 387868 391127 394384 397247
61355 397247 400097 403685 408123 412767 417296 422306 428362 434948 441020 446244 451009 455427 459121 462006
61341 462006 464539 467008 469161 470766 472040 473231 474227 474822 475053 474939 474159 472362 469701 466811 464235
61326 464235 462084 460294 459040 458632 458921 459098 458506 457637 457833 459820 462886 465791 468093 470239 472759 475884
61310 475884 479749 484413 489779 495873 503108 511818 521662 531898 542064 551930 560932 568319 573912 578218
61296 578218 581633 583999 585051 584926 584020 582605 580691 578017 574207 569157 563318 557337 551551 546055 541095
61281 541095 536944 533486 530336 527379 524779 522532 520484 518830 518118 518645 520192 522393 524958 527504 529595
61266 529595 531142 532511 534192 536582 539979 544391 549397 554568 559975 565862 571970 577636 582528 586684
61252 586684 589975 592227 593861 595648 597568 598671 598304 596869 595051 593034 590866 588937 587419 585739
61238 585739 583214 579931 576543 573519 571145 569862 569914 570805 571763 572729 574364 577057 580419 583852 587167
61223 587167 590406 593429 596026 598364 601069 604780 609659 615412 621740 628597 635870 642999 649293 654659
61209 654659 659719 665053 670545 675617 679798 682952 685191 686942 689004 692261 697222 703854 711825 720859
61195 720859 730953 742275 754802 768028 781025 792753 802361 809540 814783 819054 822830 825631 826879
61182 826879 826999 827105 827598 827592 825925 822291 817295 811780 806237 800520 794022 786447 778432 770896 763782 755991
61166 755991 746747 736468 726099 716183 706863 698121 689511 680227 670085 660089 651468 644470 638585
61153 638585 633625 629923 627690 626873 627498 629469 631919 633445 633241 631649 629434 626849 623631 619685 615501
61138 615501 611944 609682 608755 608668 608945 609554 610772 612775 615509 618921 623182 628725 636009 645148 655733
61123 655733 667198 679308 692122 705568 719469 733976 749522 766251 783935 802573 822410
61112 822410 843118 863623 883249 902455 921797 940672 957902 973294 987720 1001716 1014744
61101 1014744 1025912 1034705 1040866 1044227 1044954 1043486 1039990 1034290 1026554 1017630 1008393 999010 989085 978321
61087 978321 966895 955447 944857 935823 928397 922047 916267 911036 906645 903260 900813 899300 899124 901065
61073 901065 905665 912480 920197 927780 935365 943845 953906 965876 980088 996566 1014371 1032068 1049156
61060 1049156 1066523 1085335 1105942 1128089 1151541 1176069 1201292 1227019 1253489 1280961 1309393
61049 1309393 1338839 1369755 1402473 1436694 1471987 1508554 1546988 1587373 1629039 1671144 1713218
61038 1713218 1755413 1798574 1843798 1891430 1940697 1990786 2042010 2095352 2151069 2208438 2266771
61027 2266771 2325971 2386150 2447567 2511105 2578112 2649555 2725946 2808178 2897631 2995129 3100550
61016 3100550 3213846 3335874 3468189 3613196 3775158 3960128 4174330 4423712 4715787
61007 4715787 5060670 5469403 5952971 6524234 7198317 7988366 8903245 9951671 11138933
60998 11138933 12438571 13754535 14923489 15783881 16267146 16431147 16409625 16334596 16299992
60989 16299992 16366345 16554511 16810374 16989437 16910663 16454481 15624785 14528126 13302094
60980 13302094 12057796 10865144 9762671 8767115 7878999 7090108 6391206 5774496 5232279
60971 5232279 4757144 4343684 3987856 3684105 3424326 3199890 3003760 2830757 2677066
60962 2677066 2539961 2417322 2307080 2207429 2117319 2036078 1962626 1895681 1834475 1778445 1726337
60951 1726337 1676546 1628422 1582423 1538939 1497793 1458937 1422656 1388719 1356164 1324297 1293257
60940 1293257 1263329 1234415 1206516 1179933 1154564 1129705 1105032 1081163 1058726 1037503 1017100
60929 1017100 997830 980171 963721 947468 930997 914836 899680 885719 872647 860002 847560
60918 847560 835554 824319 813646 802931 792193 782423 774471 767980 761869 755520 749072 742920 737429
60905 737429 732855 729045 725425 721623 717812 714109 710144 705771 701633 698183 694545 689294 682353 675183
60891 675183 668985 663494 657759 651370 644497 637270 629633 621618 613480 605637 598541 592380 586846 581367
60877 581367 575602 569517 563121 556508 550089 544380 539495 535194 531406 528257 525558 522781 519771 517065
60863 517065 515265 514445 514408 515080 516260 517217 517096 515770 514027 512854 512727 513526 514822 516094 516851 516845 516235
60846 516235 515367 514353 512971 511122 509217 507800 506731 505090 502068 497775 492926 487972 482907 477843
60832 477843 473304 469714 466801 463743 459944 455551 451255 447677 445010 443081 441515 439776 437360 434273
60818 434273 431194 428843 427123 425182 422256 418193 413254 407938 403048 399382 397019 395317 393817 392663
60804 392663 391843 390613 388316 385392 382893 381209 379928 378755 377825 377071 376068 374761 373732 373392 373324 372870
60788 372870 372014 371287 370980 370873 370723 370659 370962 371649 372379 372752 372620 372169 371742 371574 371624 371647 371523 371523 372124 373422
60768 373422 374910 376062 377010 378266 379809 380918 381079 380659 380370 380407 380449 380257 379844 379147 377930 376119 374015
60751 374015 372116 370773 370048 369773 369787 370047 370419 370503 370017 369298 368991 369070 368632 366872 363908 360366 356595 352715
60733 352715 349052 345986 343525 341475 339890 338911 338267 337422 336208 334924 333792 332648 331254 329671 328241
60718 328241 327369 327291 327951 329049 330286 331448 332332 332851 333227 333755 334304 334516 334625 335530 337674 340366 342688
60701 342688 344615 346650 348746 350324 351151 351560 351833 351946 351884 351691 351251 350481 349754 349637 350201 350938 351387 351513
60683 351513 351575 351973 353115 355014 357084 358658 359584 360035 360015 359602 359368 359941 361165 362243 362661 362456 361664
60666 361664 360107 357817 355149 352396 349698 347287 345407 344024 343040 342666 343114 344013 344734 345197 345777 346515
60650 346515 347147 347905 349561 352424 355927 359359 362431 364917 366398 366726 366309 365589 364591 363188 361411 359289
60634 359289 356742 353882 351132 348876 347190 346020 345305 344856 344418 343934 343527 343271 343234 343615 344443 345310 345869
60617 345869 346463 347676 349339 350588 350888 350449 349671 348861 348464 348800 349418 349441 348773 348347 348929 350291 351782
60600 351782 353075 354081 354762 355433 356734 358936 361607 364192 366482 368417 369912 371049 371919 372237 371718
60585 371718 370946 371080 372432 374065 375094 375703 376486 377568 378897 380746 383293 386153 388867 391504 394407
60570 394407 397787 401924 407253 413828 421165 428937 437256 445887 453881 460552 466217 471316 475344 477399
60556 477399 477414 476151 474256 471971 469515 467125 464859 462849 461534 461232 461808 463210 465936 470368 476003
60541 476003 482054 488572 496233 505151 514665 524417 534966 547026 560422 573970 586161 595900 602793
60528 602793 606999 608908 609028 607951 606079 603367 599684 595418 591300 587606 583987 580137 576091 571900
60514 571900 567743 564505 563365 564470 566747 569393 572697 576944 581477 585731 590493 597214 606591 618570
60500 618570 633194 650575 670396 692301 716457 742953 771047 799804 829010 858519 887017
60489 887017 912547 934116 951769 965151 973078 974690 970106 959716 943613 922028 895764 865885
60477 865885 833443 799599 765544 732153 700038 669792 641766 615773 591612 569838 551358
60466 551358 536292 523754 512716 502573 493017 484039 476037 469265 463221 457231 451587 447277 444457
60453 444457 441968 438628 434375 429832 425372 421083 417243 414336 412649 411955 411528 410570 408886 406992 405264
60438 405264 403334 400791 398126 396195 394942 393532 391776 390456 390020 389850 389233 388376 387945 388125 388609 389152
60422 389152 389688 390164 390568 390904 390991 390624 390080 390069 390951 392402 394077 396202 399123 402589 405794 408050 409227
60405 409227 409721 410169 410980 412026 412922 413622 414448 415509 416490 417241 418207 419975 422533 425215 427340 428816
60389 428816 430143 431847 433880 435736 437240 438947 441428 444396 446991 448843 450369 452038 453921 456032
60375 456032 458619 461759 465040 467941 470441 473050 476296 480191 484157 487565 490423 493288 496361 499006
60361 499006 500599 501537 502851 504980 507526 510191 513310 517338 522322 528050 534278 540700 547038 553225
60347 553225 559154 564203 567459 568525 567819 566035 563665 561009 558203 555173 551868 548532 545370 542121
60333 542121 538440 534593 531172 528165 524967 521309 517509 513748 509844 505958 502753 500479 498570 496573
60319 496573 494912 494225 494456 495141 496242 498162 501146 505146 510145 516250 523554 532161 542128 553105 564190
60304 564190 574522 584029 593311 602677 611353 617760 620680 620139 616966 611572 603605 593014 580902 568771
60290 568771 557255 546188 535638 526118 517884 510793 504831 500041 495888 491481 486650 482164 478687
60277 478687 476124 474132 472556 471169 469647 468110 467034 466357 465343 463617 461650 459924 458313 456702
60263 456702 455445 454676 453884 452783 451971 451998 452300 451847 450535 449226 448637 448868 449804 451269 452814 453893 454346
60246 454346 454373 454152 453822 453700 454115 455019 456003 456621 456578 455823 454709 453858 453592 453643 453526 452957 451855 450437 449560
60227 449560 450433 453439 457493 461014 463334 464862 466223 467734 469582 471983 475062 478776 482958 487353
60213 487353 491805 496466 501561 506851 511690 515813 519649 523680 527912 532242 536819 541627 546150 549985
60199 549985 553471 557222 561255 565068 568364 571215 573617 575308 576006 575586 574129 572039 569931 568158 566604
60184 566604 565052 563468 561765 559699 557295 554992 553030 551069 548806 546549 544700 543013 540937 538489
60170 538489 536257 534660 533641 532947 532316 531480 530366 529147 527862 526254 524331 522796 522400 523082 524163
60155 524163 525127 525743 525741 525024 524201 524207 525284 526764 527951 528810 529671 530666 531689 532707 533927 535677 538144
60138 538144 541193 544515 548010 551913 556443 561505 566776 571857 576279 579639 581894 583278 583911 583854 583582
60123 583582 583914 585206 587058 589036 591159 593395 595269 596471 597389 598534 599795 600779 601483 602048 602185 601477
60107 601477 600058 598475 597014 595634 594306 592965 591324 589192 586717 583904 580305 575766 571160 567724
60093 567724 565843 565043 564857 565045 565215 565054 564841 565048 565502 565616 565383 565450 566133 567026 567633 567795 567378 566154
60075 566154 564137 561613 558726 555432 551840 548169 544333 540017 535166 530098 525187 520808 517342 514756
60061 514756 512347 509475 506340 503436 500507 496889 492720 488912 485897 483336 481193 480100 480327 481290 482521
60046 482521 484290 486762 489310 491359 493349 496122 499768 503716 507593 511240 514170 515795 516214 516146 515979
60031 515979 515463 514478 513506 512970 512465 511150 508825 506113 503460 500323 495751 489607 482829 476425 470618
60016 470618 465126 459868 455015 450562 446260 441969 437832 434150 431199 429017 427239 425355 423339 421779
60002 421779 421152 421234 421496 421742 421993 422076 421864 421678 421899 422350 422589 422693 423168 424151 425362 426803 428865 431506
59984 431506 433905 435307 435830 436185 436807 437520 437867 437587 436773 435665 434359 432909 431689 431210 431292 430831 428928
59967 428928 426075 423773 423067 423901 425657 427731 429627 431080 432256 433506 434897 436236 437399 438264 438518
59952 438518 438043 437386 437330 438056 439099 439991 440452 440178 439130 438003 437711 438311 438894 438566 437111 434812 432244
59935 432244 430183 429101 428710 428502 428616 429501 430889 431947 432517 433362 435031 437276 439814 442824 446306 449633
59919 449633 452164 453831 454871 455524 456205 457283 458408 458687 457920 457051 457088 458201 460252 463449 467777 472356
59903 472356 476076 478642 480454 481784 482649 483289 484193 485607 487385 489330 491438 493832 496576 499506 502266
59888 502266 504654 506875 509230 511718 514352 517665 522239 527742 533121 537867 542454 547322 552154 556406
59874 556406 559910 562620 564407 565458 566220 566560 565681 563418 560940 559455 558781 557923 556665 555736 555607 555935
59858 555935 556188 556207 556034 555687 555262 555057 555519 557165 560373 564948 570014 574503 577687 579265 579334 578506 577709
59841 577709 577486 577680 577970 578433 579213 579906 579667 577922 574828 571149 567734 564900 562296 559616 557361 556404
59825 556404 556728 557150 556523 554740 552342 549679 546796 543641 539994 535596 530731 526264 522769 519980 517391
59810 517391 514945 512685 510257 507305 504098 501275 499157 497641 496466 495243 493601 491646 489909 488471
59796 488471 486601 483712 480304 477458 475785 475279 475753 476760 477453 477165 476017 474502 472827 471188 470220
59781 470220 470426 471371 472218 472865 473848 475279 476701 477971 479442 481155 482645 483862 485540 488204 491246
59766 491246 493547 494789 495778 497504 500154 503107 505721 507998 510429 513264 516199 518820 521107 523345
59752 523345 525765 528467 531534 534981 538771 542978 547704 552710 557436 561638 565658 569823 573891 577418
59738 577418 580323 582747 584682 586184 587633 589275 590678 591166 590716 589994 589629 589824 590567 591708 592802 593278
59722 593278 592921 592039 591211 590945 591361 591924 591748 590443 588532 586818 585574 584613 583788 582979 581818 579971 577615
59705 577615 575288 573348 571869 570877 570292 569815 569238 568775 568745 569058 569353 569467 569391 568982 568154 567188 566415 565673
59687 565673 564466 562599 560349 558138 556356 555317 554965 554740 554071 552836 551089 548636 545371 541730 538235
59672 538235 534755 530771 526287 521950 518322 515491 513312 511517 509650 507430 505165 503385 502154 501196
59658 501196 500576 500614 501201 501864 502578 503850 505854 508074 510053 511929 513901 515658 516711 516944 516496 515368
59642 515368 513532 511194 508608 505714 502325 498672 495484 493359 492163 491215 490045 488850 488149 488129 488526
59627 488526 488940 488953 488039 485913 483079 480529 478651 476861 474594 472186 470322 469023 467728 466125 464441
59612 464441 463050 462264 462305 463067 464002 464678 465335 466531 468355 470306 471805 472528 472497 472145 472057 472322 472477 472438
59594 472438 472973 474694 477031 478881 479882 480311 480149 479288 478487 478931 480577 481899 481674 480322 479077 478504
59578 478504 478348 478316 478375 478449 478247 477455 476038 474495 473733 474327 475794 476914 476894 475997 475033 474596 474871 475810 477218
59559 477218 478807 480318 481570 482418 482808 482802 482457 481801 481054 480619 480601 480635 480585 481137 483207 486901 491553 496742
59541 496742 502701 509755 517976 527659 539559 554047 569911 584294 594107 597812 596044 590697 583705
59528 583705 576768 571531 568962 568420 568198 567364 566437 566036 565857 565518 565469 566083 566578 565846 563823 561000 557109
59511 557109 551610 545259 539790 535836 532199 527467 521538 515310 509691 505171 501719 498813 496036 493660
59497 493660 492171 491288 490122 488236 485895 483384 480827 478634 477283 476601 476022 475581 475902 477179 479026
59482 479026 481324 484275 487477 489948 491440 492903 495325 498770 502834 507245 511642 515467 518477 520913
59468 520913 522994 524822 526767 529120 531243 532031 531593 531570 533291 536420 539850 543181 546702 550623 555008
59453 555008 559998 565480 570852 575593 579777 583708 587432 590901 594162 597079 599240 600362 600405 599131 596191
59438 596191 591883 587327 583527 580708 578779 577778 577533 577447 577093 576645 576459 576714 577719 580044 583921 588914
59422 588914 594544 600976 608858 618810 631169 645732 661578 677592 693481 710043 728338 748663
59410 748663 769871 789021 802142 806554 802852 794118 783367 772379 762518 755200 751328 751326 755587 763360
59396 763360 770986 773177 767192 754803 739607 723818 708432 694708 683556 674223 665174 656051 647694
59383 647694 640672 634833 629944 625764 621748 617607 613899 611317 609691 608449 607648 607734 608592 609635 610566
59368 610566 611378 611953 612391 613361 615348 617874 620173 622376 625252 629086 633535 638383 643785 649919 656945
59353 656945 665078 674162 683543 692828 702326 712286 722272 731951 741750 751941 761707 770116 777472 784580
59339 784580 791044 795481 797239 796873 795039 791949 787786 782623 775917 767107 756753 746165 735775 724829
59325 724829 712898 700755 689456 679243 669726 660586 651812 643637 636426 630263 624612 618811 612904
59312 612904 607551 603149 599545 596611 594629 594018 595041 597769 602036 607557 614359 622685 631922 639985
59298 639985 644505 644636 641210 635385 627908 619493 611052 603287 596574 591277 587573 584927 582393 579586
59284 579586 576918 574777 573041 571610 570911 571603 573947 577665 582280 587533 593588 600825 609392 619093 629618
59269 629618 640484 650730 659348 666389 673089 680334 687478 693196 697026 699382 700496 700215 698714 696642
59255 696642 694474 692140 689245 685347 680315 674814 670107 666934 664879 663239 661951 661138 660390 659342 658526
59240 658526 658739 659814 660844 661393 661708 662031 662504 663463 664916 665960 665603 663989 661912 659359 655587 650541
59224 650541 645073 639622 633720 627060 620146 613590 607467 601698 596405 591617 587059 582421 577489 572108
59210 572108 566534 561610 558017 555455 553226 551366 550437 550385 550517 550568 550850 551384 551799 552187 553101 554537 555800
59193 555800 556608 557476 558734 560021 561029 562037 563334 564770 566182 567670 569244 570742 572279 574178 576255
59178 576255 577859 578779 579527 580491 581478 582342 583388 584873 586624 588441 590397 592496 594532 596495 598651
59163 598651 601033 603339 605438 607498 609403 610497 610116 608135 604935 601115 597113 592762 587473 581304
59149 581304 575427 570824 566865 562141 556491 551161 546993 543564 540276 537174 534329 531349 527998 524609
59135 524609 521506 518695 516429 515337 515566 516387 517030 517461 518103 519314 521324 524179 527497 530738 533829
59120 533829 537115 540735 544655 549195 554817 561371 568252 575304 582798 590600 598160 605295 612069 618027
59106 618027 622612 626396 630704 635837 640840 645177 649272 653013 655192 655267 654466 654160 654060 653001 650707
59091 650707 647866 645066 642591 640798 639834 639287 638659 637833 636641 634596 631563 628119 624640 620685 615933
59076 615933 611114 607090 603456 598949 593122 586921 581606 577600 574403 571243 567794 564385 561451 558900
59062 558900 556354 553938 552207 551228 550401 549332 548194 547015 545414 543416 541788 541032 540628 539782 538454
59047 538454 537199 536426 536220 536479 536904 537197 537449 537977 538710 539297 539801 540537 541221 541249 540972 541638 543678 546095
59029 546095 548078 550185 553217 556906 560663 564946 570884 578897 588424 598669 608957 618692 627544 635557
59015 635557 642757 648912 653783 657156 658564 657700 655254 652557 650182 647716 645187 643642 643907 645667 648304
59000 648304 651614 655197 658265 660805 663905 668055 672064 674582 675902 677238 678957 680545 681701 682434
58986 682434 682530 681839 680762 679819 679200 679249 680602 683110 685464 686793 687960 690403 694367 699190 704574 710529
58970 710529 716707 722895 729559 736929 744161 750590 757117 765091 774227 782955 790460 797060 802822 807201
58956 807201 810034 811670 812021 810539 807169 802355 796047 787725 777528 766479 755455 744607 733861
58943 733861 723253 712853 703007 694565 688141 683245 678847 674638 670980 667813 664588 661280 658595 657024
58929 657024 656374 656275 656495 656719 656653 656445 656495 656858 657255 657532 657599 657177 656180 655134 654571 654235 653598 652953 653220 654738
58909 654738 656975 659417 662097 665271 669192 674247 680761 688565 697168 706310 715959 725913 735785 745259
58895 745259 754085 762094 769612 777528 786562 796742 807877 820050 833173 846646 860015 873468
58883 873468 887109 900199 911710 921101 928023 931993 933139 932565 930979 927516 920959 911678 901308
58870 901308 890841 880179 869364 859125 850104 842336 835526 829188 822635 815557 808462 801988 795968
58857 795968 789782 783296 776874 770746 764907 759224 753103 745736 737289 729155 722216 715646 708372 700860
58843 700860 694257 688515 682754 676924 671661 666835 661689 656138 650614 644912 638622 632498 627874 624735
58829 624735 621801 618586 615926 614333 613226 612108 611287 611147 611793 613614 617049 621481 625366 627815 629197
58814 629197 630099 630640 630964 631380 631802 631961 632205 633158 634503 635170 634854 634251 633617 632236 629736 626912 624717
58797 624717 623129 621389 618751 614786 609549 603678 597923 592589 587808 583952 581139 578834 576758 575667
58783 575667 576123 577087 577086 576413 576695 578408 580371 581691 582653 583525 584025 584259 584749 585115 584114 581414 578027
58766 578027 574576 570522 565683 561192 558094 556036 554150 552348 551011 550146 549577 549478 550216 552032 554970
58751 554970 558596 561759 563465 564075 564866 566340 567839 568903 570022 571887 574736 578590 583285 588206 592771
58736 592771 597171 601834 606405 610272 613852 618151 623232 628354 633421 638898 644401 648968 652720 656680
58722 656680 660851 664152 666444 668900 672008 674988 677645 681002 685387 689636 693009 696283 700005 703188
58708 703188 704817 705285 705253 704325 701923 698339 693796 687469 678557 667545 655514 642944 629994 617200
58694 617200 605075 593722 583361 574459 566829 559522 552164 545499 540065 535325 530664 526242 522306
58681 522306 518643 515284 512724 510935 509185 507358 506294 506260 506362 506164 506626 508646 511865 515800 520940
58666 520940 527696 535270 542677 550053 558017 566368 574239 580886 585735 588384 589140 588815 587556 584749 580428
58651 580428 575697 571312 566977 562548 558696 555746 553014 549977 547048 544613 542427 540509 539435 539228
58637 539228 539192 539291 540344 542349 544184 545528 547406 550111 552362 553420 554230 555400 555885 555004 554054 554456
58621 554456 555841 557468 559941 563807 567788 570169 570990 571357 571630 571777 572425 574001 575749 576940 578085
58606 578085 579621 580622 580371 580063 581246 583516 585375 586466 587332 587853 587686 587530 588272 589398 589777 589502
58590 589502 589567 590296 591531 593776 597759 603297 609731 616877 624514 631768 638188 644616 651818 659177 665897
58575 665897 672414 679247 685610 690767 695794 702365 710612 719716 729718 741047 753111 765105 777674
58562 777674 792123 808535 826042 844271 863013 881142 897350 911319 922891 931031 935114 936329
58550 936329 936157 934383 930301 924962 920336 916856 913520 909683 904970 898213 888503 876872 865191 853829
58536 853829 841973 829551 817063 804178 790380 776579 764344 754065 745401 738754 734405 730940
58524 730940 726558 721461 717088 713624 710220 707060 705016 703678 701848 699655 698156 697123 695331 692832
58510 692832 690867 689636 688122 686060 684215 682796 681318 679986 679490 679622 679651 679762 680468 681048 680316 678508
58494 678508 676685 674885 672758 671386 672233 674731 677106 679241 682557 687419 692903 698907 706138 714125
58480 714125 721555 728611 736807 746478 756558 766709 777387 787703 795587 800380 803234 804749 804214
58467 804214 801394 797094 791782 785533 779387 774844 771942 769624 767909 767798 769315 771781 775745 782271
58453 782271 790374 797619 803402 809237 815571 820778 823713 824931 824829 822794 818812 814036 809192 804137
58439 804137 799234 795348 792337 789373 786805 785758 785928 785883 785612 786641 789492 793141 797081 801795 807068
58424 807068 811958 816580 821777 827050 831003 833776 836703 839603 840869 840319 839404 838388 835878 831479 826516
58409 826516 821825 817151 812894 809981 807793 804675 800731 797773 796404 795675 795577 797046 799415 800769 801213
58394 801213 802934 806638 810714 814275 818114 822226 825398 827835 831304 836030 840295 843687 847849 853432
58380 853432 859205 864897 872009 881059 890779 900697 911759 923841 935439 946285 957451 968591 978188
58367 978188 986803 996730 1008097 1018769 1028545 1039696 1052690 1065241 1076449 1088034 1100390 1111303
58355 1111303 1119844 1127892 1136507 1144431 1151367 1158989 1167388 1174368 1179650 1185935 1194306 1202582 1209843 1218503
58341 1218503 1229955 1242078 1253222 1265010 1279020 1294214 1309738 1326836 1345907 1364998 1383156
58330 1383156 1401947 1421949 1441182 1458638 1475715 1492528 1506721 1517784 1528600 1540865 1552970
58319 1552970 1564224 1576879 1591844 1606784 1620744 1636288 1654582 1672827 1689251 1706294 1726036
58308 1726036 1746750 1766931 1788494 1812944 1838425 1863498 1889788 1918055 1945906 1972390 2000540
58297 2000540 2032261 2065020 2096714 2129419 2165068 2201809 2238007 2275492 2315507 2355821 2395210
58286 2395210 2436324 2480820 2526214 2570947 2617849 2669155 2723034 2778543 2838878 2905895 2976591
58275 2976591 3048908 3125817 3209683 3298035 3389028 3485429 3588779 3695356 3802628 3913975
58265 3913975 4032354 4155262 4280967 4413586 4556488 4706606 4860725 5021330 5190642
58256 5190642 5365207 5542400 5726007 5919188 6118260 6319803 6527402 6744753 6968736
58247 6968736 7196349 7431997 7680868 7941639 8212550 8497336 8797569 9106514 9418665
58238 9418665 9738367 10071437 10416432 10772674 11148586 11552806 11985047 12444788 12940058
58229 12940058 13477604 14053388 14663342 15314271 16013069 16754715 17532318 18348788 19206371
58220 19206371 20095798 21009751 21956770 22948311 23983984 25064762 26208299 27434312 28746977
58211 28746977 30149176 31660898 33304854 35088121 37018560 39124569 41436876 43967985
58203 43967985 46735477 49790061 53196190 57007389 61294655 66181967 71823948 78376967
58195 78376967 86036006 95076167 105811924 118539690 133556178 151167293 171588030
58188 171588030 194863212 220903147 249306745 278643148 305722667 326020988 335560968
58181 335560968 332920029 319688822 299199705 274851852 249230414 224047111 200324145
58174 200324145 178545095 158833418 141145424 125370937 111360802 98971557 88105134
58167 88105134 78676247 70555639 63578657 57593000 52464878 48056132 44234905 40904807
58159 40904807 37996934 35441160 33169512 31137889 29318404 27675978 26173889 24794954
58151 24794954 23535275 22382105 21316754 20332855 19431779 18603944 17832251 17109998 16438698
58142 16438698 15811693 15215738 14645923 14104635 13588849 13092188 12616573 12168564 11746599
58133 11746599 11343773 10960058 10599727 10259694 9932262 9616975 9318637 9036245 8764767
58124 8764767 8505279 8262482 8034302 7814268 7602072 7401823 7212046 7027400 6848337
58115 6848337 6679261 6518757 6361119 6205938 6056837 5912169 5766370 5619713 5477853
58106 5477853 5342353 5209975 5080507 4956990 4838683 4721766 4606713 4497564 4394400
58097 4394400 4293753 4195773 4103768 4017199 3932297 3849123 3771104 3697907 3625609 3553691 3485255
58086 3485255 3420489 3356269 3292120 3230405 3170828 3110657 3050161 2992104 2936260 2880086 2824208
58075 2824208 2771410 2720842 2669151 2616826 2567489 2521227 2474618 2427074 2381256 2337320 2292670
58064 2292670 2247545 2205036 2165312 2125375 2084798 2046227 2009891 1973005 1935009 1898218 1862943
58053 1862943 1827158 1791344 1758439 1728468 1698340 1667498 1638735 1612762 1586999 1560527 1535366
58042 1535366 1511953 1487986 1462755 1438146 1414481 1389716 1363668 1338828 1316115 1293812 1271327
58031 1271327 1249897 1228983 1206208 1181617 1157961 1136050 1113952 1091425 1070870 1053002 1035680
58020 1035680 1017978 1001480 986643 971782 956574 942687 930072 916526 901884 888705 877787
58009 877787 866819 854586 842689 831848 820308 807377 795062 784760 775428 766232 757854 750149
57997 750149 741690 732646 725012 719151 713285 707122 702558 699908 696928 692523 687924 683226 676400 666986
57983 666986 657249 648371 638940 628513 619093 611534 603899 595090 586828 580285 573895 566351 558790 552172
57969 552172 545333 537416 529599 522720 515846 508812 503467 500722 498866 496389 493955 492084 489617 486113
57955 486113 483112 481290 478862 474556 469659 465373 460726 454986 449723 446409 444119 441546 439215 437874
57941 437874 436754 435351 435005 436783 439517 441729 443825 446760 450195 453578 457378 461669 465061 466463
57927 466463 466444 465548 462946 457969 451348 443757 434869 425027 415996 408846 402833 397380 393159 390067 386338
57912 386338 381185 376280 373122 370851 368167 365488 363585 361938 360101 359020 359354 360037 359982 359743 360100 360515
57896 360515 360272 359684 359030 357918 356780 357145 359285 361476 362740 364276 366928 369447 370795 371968 373823
57881 373823 375158 374831 373867 373537 373122 371524 369407 367805 366152 363612 360833 358580 356086 352650 349437
57866 349437 347795 347182 346498 346108 346717 347588 347775 347916 349058 350840 352527 354606 357726 361252 364399 367505
57850 367505 370755 373143 374239 375376 377419 379009 378863 378095 378206 378365 376955 374468 372610 371714 371188 371377
57834 371377 372704 373977 373753 372546 371740 371259 370278 369170 368634 367922 366117 364239 363924 364819 365448 365781 366717
57817 366717 367767 367525 365946 363951 361319 357086 351550 345832 339889 332973 325566 318852 312764 306596
57803 306596 301065 297542 295593 293414 290549 288132 286569 285060 283366 282104 281233 280019 278560 277651 277183
57788 277183 276397 275649 276220 278270 280557 282273 283738 285317 287124 289762 293953 299380 305063 310667 316228
57773 316228 321026 324186 326147 328108 330357 332437 334415 336364 337145 335557 332488 330106 329012 327860
57759 327860 325738 323146 320555 317718 314716 312212 310430 308991 307871 307345 307136 306833 306981 308442 310850
57744 310850 313003 314570 316024 317121 316969 315570 313914 312570 311424 310619 310443 310463 310034 309458 309418 309716 309924
57727 309924 310745 313046 315981 317857 318609 319597 321154 322240 322462 322532 322614 322090 321156 320870 321353 321667 321715 322452
57709 322452 323868 324540 323740 322399 321447 320730 320071 319834 319832 319058 317227 315360 314268 313611 312900 312231 311543 310359
57691 310359 308753 307473 306664 305570 303923 302467 301632 300808 299493 298229 297851 298592 300300 302790 305808
57676 305808 309455 314763 323052 334731 349616 368113 390823 417156 445928 477442 513205 552749
57664 552749 591763 623901 643792 648566 638306 615983 586031 552218 517128 483218 452798 426551
57652 426551 403338 382060 362863 346290 332342 320832 311689 304448 298249 292706 288058 284335 281199
57639 281199 278628 276867 275680 274537 273515 272986 272553 271411 269679 268190 267036 265623 264072 263135 262648
57624 262648 261562 259690 258002 256974 256036 254884 253868 252800 250908 248375 246502 245868 245661 245197 244699
57609 244699 244197 243134 241579 240401 239757 238814 237441 236695 237020 237469 237351 237156 237117 236325 234176 231361 228582
57592 228582 225518 221882 218246 215018 211810 208633 206470 205755 205508 204792 203889 203165 202018 199981 197713
57577 197713 195909 194258 192428 190973 190264 189604 188427 187390 187205 187360 187083 186677 186775 187080 186967 186623 186550
57560 186550 186561 186281 186022 186276 186845 187289 187659 188072 188239 188061 187995 188175 188033 187457 187373 188348 189570 190172 190655
57541 190655 191962 193869 195358 195985 195935 195302 194282 193535 193533 193945 194307 194692 195161 195337 195188 195447 196545 197985
57523 197985 199421 201353 203907 206046 207091 208014 209976 212466 214221 215323 216967 219548 222259 224283
57509 224283 225300 225172 224256 223729 224437 225619 225744 224454 222774 221510 220445 219062 217303 215454 213788
57494 213788 212338 210769 208743 206603 205202 204803 204832 204993 205735 207088 208052 207989 207727 208329 209451 209984 209755
57477 209755 209576 209955 210682 211423 211967 212185 212334 212983 214111 214804 214444 213606 213207 213416 214056 215307 217225 219202
57459 219202 220696 221945 223329 224779 226448 229054 232686 236121 238309 239789 241659 243959 246087 248057
57445 248057 250173 252151 253735 255567 258338 261603 264534 267249 270272 273333 275924 278509 281887 285843
57431 285843 289662 293483 297852 302351 305974 308582 310740 312502 313687 315064 317845 322072 326707 331173
57417 331173 335613 339790 343097 345691 348460 351750 355155 358532 362200 366170 370187 374535 379775 385666
57403 385666 391277 396216 400913 405744 410720 415952 421553 427135 432271 437304 442914 449034 455036 460703
57389 460703 466203 471460 476509 482135 489071 496798 504178 511026 517988 525189 532180 539020 546181 553492
57375 553492 560418 567217 574623 582447 589834 596893 604697 613524 622469 631037 639806 649111 658317 666939
57361 666939 675503 684745 694803 705561 716987 728698 739979 750652 761375 772759 784783 797166
57349 797166 809737 822323 834926 848059 862254 877175 891902 906081 920162 934585 949473
57338 949473 964998 981232 997651 1013606 1029244 1045219 1061672 1078401 1095894 1115066 1135896
57327 1135896 1157303 1178524 1199677 1220955 1242299 1264041 1286816 1310595 1334666 1358836 1383751
57316 1383751 1409734 1436213 1462732 1489817 1518433 1549101 1581689 1615503 1649417 1682585 1715259
57305 1715259 1748407 1782468 1816973 1851369 1885635 1920140 1955445 1992178 2030508 2069891 2109922
57294 2109922 2151151 2194434 2239795 2286710 2335068 2384911 2435538 2485998 2536286 2587092 2638614
57283 2638614 2690660 2743653 2798226 2853960 2909777 2965591 3022336 3080371 3139150 3198504 3258908
57272 3258908 3320236 3381488 3442071 3502221 3562019 3621155 3679867 3738918 3798365 3857555 3916581
57261 3916581 3976460 4037516 4098827 4159767 4220971 4283341 4347274 4413334 4482468 4554729 4628713
57250 4628713 4702929 4776987 4851001 4924702 4997729 5070081 5141807 5212915 5283826 5355146 5426718
57239 5426718 5497706 5567876 5637917 5708294 5778717 5849083 5920045 5992396 6066723 6143827 6224324
57228 6224324 6307551 6391848 6476245 6560807 6645114 6727636 6807216 6884179 6959536 7033999 7108180
57217 7108180 7182671 7257428 7331887 7405930 7479660 7552101 7621476 7687254 7750670 7812729 7872967
57206 7872967 7930867 7987149 8042826 8098024 8152504 8206316 8259181 8310222 8359132 8406761 8453906
57195 8453906 8500436 8546113 8591226 8635728 8678899 8720650 8762205 8804727 8848230 8892534 8938118
57184 8938118 8985067 9032192 9078182 9122771 9165972 9207261 9246721 9286265 9328592 9375327 9426881
57173 9426881 9483290 9544338 9609656 9679875 9757181 9843762 9939817 10043497 10152057 10262405 10371299
57162 10371299 10476151 10575805 10670688 10763065 10857239 10957976 11067522 11184442 11305594 11428211
57152 11428211 11549886 11668364 11782772 11894052 12002825 12107264 12203901 12289829 12363319 12423222
57142 12423222 12469116 12501826 12523024 12534503 12537798 12533366 12519355 12492043 12448436 12388249 12313646
57131 12313646 12228633 12139103 12051508 11969764 11894100 11823628 11758893 11701095 11650267 11605566 11566147
57120 11566147 11530288 11494405 11454081 11405355 11344286 11266749 11170313 11055704 10925389 10781657
57110 10781657 10627087 10465472 10300704 10135550 9972875 9817307 9674765 9551607 9455328
57101 9455328 9394449 9375771 9402447 9475716 9596808 9765550 9978985 10233942 10530596 10873128
57091 10873128 11270415 11739745 12308480 13008514 13868536 14910995 16150015 17584282 19190323
57082 19190323 20922450 22709168 24435612 25933204 27015361 27557585 27560290 27135140 26427774
57073 26427774 25547517 24553407 23481296 22367221 21247121 20146685 19078672 18048304
57065 18048304 17058455 16111561 15210991 14362879 13576175 12860218 12222173 11666066 11192494
57056 11192494 10798169 10476511 10219759 10020570 9871640 9765092 9693489 9651088 9633235 9635098
57046 9635098 9652036 9680928 9720198 9768764 9825742 9890587 9962351 10038922 10117801 10197137 10275051
57035 10275051 10348713 10415711 10476302 10533225 10589695 10648882 10714490 10789204 10871522 10955361 11033640
57024 11033640 11101844 11158883 11206645 11249572 11293072 11340957 11394517 11453980 11519652 11591309 11667806
57013 11667806 11748184 11832429 11920595 12011863 12104805 12197746 12288414 12374133 12453046 12524779 12589762
57002 12589762 12648702 12702981 12754531 12804531 12852656 12897985 12940187 12979615 13017035 13053760 13091495
56991 13091495 13131526 13174327 13220039 13268697 13319714 13371739 13423432 13474094 13523370 13570809 13615846
56980 13615846 13657788 13695705 13728884 13757587 13783032 13806588 13829264 13851713 13874127 13896158 13917534
56969 13917534 13938614 13959762 13980313 13998918 14014874 14028415 14039685 14048016 14052284 14051531 14045577 14035636
56957 14035636 14023980 14012004 13998656 13981402 13958484 13929631 13895219 13856152 13814472 13772722 13732379
56946 13732379 13693582 13656199 13620115 13584537 13548273 13510922 13472887 13434169 13394178 13352823 13310760
56935 13310760 13268487 13226127 13184162 13143313 13103490 13063613 13022128 12976573 12922927 12857222 12778351
56924 12778351 12688458 12590623 12487494 12382088 12277820 12176719 12078703 11983252 11890704 11801364
56914 11801364 11714586 11629561 11546057 11463619 11380882 11296415 11209633 11120427 11028532 10933649 10835555
56903 10835555 10734037 10629589 10524244 10420495 10318942 10217951 10115799 10012051 9906709
56894 9906709 9799578 9691162 9582916 9475874 9370189 9266706 9167710 9075117 8988820 8907538
56884 8907538 8830159 8755239 8680260 8602810 8522203 8439120 8354180 8267672 8180160 8092469 8005184
56873 8005184 7918607 7832881 7747870 7663344 7579470 7496489 7413810 7330273 7245567 7160462 7075352
56862 7075352 6989653 6903242 6817576 6734571 6654697 6576216 6495433 6407706 6309706 6201694 6087068
56851 6087068 5969559 5851695 5735742 5624089 5517664 5415271 5315500 5218319 5124158 5032842
56841 5032842 4944497 4860288 4781127 4706608 4636338 4571265 4512573 4460161 4413187 4370523 4328696
56830 4328696 4280137 4215766 4130062 4023175 3899016 3762813 3620070 3475779 3333430 3194953
56820 3194953 3061453 2933451 2810773 2693167 2581189 2476018 2378639 2289761 2210227 2140861
56810 2140861 2082039 2033868 1996498 1969598 1951388 1938140 1924283 1903219 1869402 1820837 1759627
56799 1759627 1689925 1615757 1540549 1467110 1396847 1329552 1264845 1203471 1146656 1094775 1047416
56788 1047416 1004264 965321 930746 901111 877386 860112 848967 843439 843015 845934 848359 845706
56776 845706 834817 814804 786683 752772 715768 677600 639303 602004 567106 535193 505740
56765 505740 478466 454006 432647 413403 395192 378055 362459 348206 334817 322268 310572
56754 310572 299394 288793 279488 271669 264422 257095 250254 244428 238952 233070 227275 222422 218289 214130
56740 214130 209891 205804 201547 196910 192626 189384 186700 183839 181182 179448 178196 176335 173687 170859
56726 170859 168026 165035 162398 161030 161092 161887 162697 163157 163270 163581 164704 166102 166305 165008 163869 164268
56710 164268 165375 165595 164860 164180 163895 163881 164616 166448 168373 169048 168534 167721 166655 164893 162859 161266 159664
56693 159664 157078 153723 150582 147735 144624 141637 139780 138969 138150 136965 135928 135198 134592 134578 135696 137142
56677 137142 137462 136691 136369 137339 138826 139772 139892 139356 138565 138217 138579 138866 138316 137570 137766 138642 138885 138077
56659 138077 136876 135510 133626 131622 130680 131341 133176 135775 138826 141428 142760 143418 144792 147118 149453
56644 149453 151426 153582 155945 157690 158441 158647 158533 157817 156528 155037 153299 151102 148919 147361 146078
56629 146078 144421 142842 142227 142164 141443 140066 139113 138771 138236 137496 137357 137536 136634 134354 132040 130516 129045
56612 129045 126984 125001 123935 123744 124131 125036 126068 126565 126583 126755 126971 126406 125066 124053 124060 124797 126052
56595 126052 127969 130133 131749 132931 134444 135990 136307 135231 134047 133434 132697 131598 131326 132810 135354
56580 135354 137719 139478 140720 141535 142360 143802 145623 146876 147315 147647 148221 148679 149102 150197 152106 154320
56564 154320 156945 160598 164821 168221 170557 173135 176702 180553 184166 187949 191729 194235 195014 195339 196305
56549 196305 197439 198028 198383 198799 198639 197565 196494 196270 196339 195671 194095 192001 189651 187477 186058 185237
56533 185237 184199 182876 182116 182049 181688 180670 179911 179842 179501 178276 177044 176576 176171 175045 173852 173580 173888
56516 173888 173658 172485 170739 168897 167502 166938 166674 165628 163767 162221 161458 160748 159948 160111 161473 162502
56500 162502 162062 161017 160465 159865 158350 156606 155879 156094 156463 157103 158587 160546 162011 162606 162308 160717
56484 160717 157780 154685 152903 152687 153335 154338 155453 156222 156293 155795 154848 153371 151845 151364 152286 153740
56468 153740 155064 156640 158638 160099 160267 159821 159754 159898 159619 159212 159548 160900 162897 165100 166969 167937
56452 167937 168075 168039 168039 167705 167237 167481 168450 169119 169232 169865 171517 173155 173996 174731 175972 176920 176718 175831 174937
56433 174937 173758 172171 171240 171829 173287 174687 176216 178170 179778 180388 180756 181791 182976 183333 183078 183108
56417 183108 183669 184588 185911 187329 187968 187803 188100 189445 190554 190227 189189 188770 188991 189333 190140 191775 193471
56400 193471 194488 195353 196617 197588 197760 198230 200030 202207 203285 203618 204512 205928 206916 207511 208360 209102 208934
56383 208934 208367 208792 210586 213014 215547 218064 220206 221717 222880 223698 223485 222233 221336 221776 222642 222650 221978
56366 221978 221359 220648 219808 220052 222273 225336 227524 228729 229685 230251 230194 230543 232327 234831 236802 238399
56350 238399 240320 242092 243058 243971 245674 247269 247556 247289 247962 249344 250307 251162 252980 255382 257181 258471
56334 258471 259998 261322 261812 262640 265366 269193 272017 273648 275606 278231 280494 282417 285164 288773 292040
56319 292040 294652 297398 300300 302568 304297 306292 308383 309824 311179 313875 318003 322381 326521 330794
56305 330794 334980 338550 342021 346193 350551 354270 358154 363513 369720 375201 380289 386637 394170 401168
56291 401168 407287 414002 421933 430058 437812 445859 454552 463471 472599 482238 491880 500900 510100 520799
56277 520799 532805 545071 557728 571440 585541 599190 613692 631063 650703 670148 688788
56266 688788 708198 729143 751099 774619 801211 830654 861176 892580 926560 963762 1003267
56255 1003267 1045392 1092350 1145526 1204461 1268933 1339658 1416566 1498763 1586524 1680953 1781292
56244 1781292 1884925 1990336 2097675 2206023 2312512 2414544 2510512 2597986 2673585 2735080
56234 2735080 2781440 2810784 2820917 2812249 2787569 2748614 2695426 2629381 2553909 2471484 2382541
56223 2382541 2288121 2191078 2093823 1997219 1902330 1810858 1723176 1638288 1556382 1479173 1407303
56212 1407303 1339800 1276544 1218678 1166084 1117069 1071178 1029733 992962 959172 927495 898889
56201 898889 873778 851159 830635 812779 796888 781088 765266 751267 739547 728449 717452
56190 717452 708200 701382 695415 689234 683723 679435 675475 671541 668527 666303 663471 660076 657885 657385
56176 657385 657193 656991 658056 660259 661673 661958 662993 665425 667819 670042 674026 680097 686029 690950 696798
56161 696798 704594 712698 720165 728366 737815 746836 755036 764703 777001 790111 802968 817513 835334
56148 835334 855269 876319 899880 927185 957636 991592 1031698 1079456 1133387 1192410 1257802
56137 1257802 1329751 1404914 1479322 1550789 1616896 1674220 1722012 1763613 1802133 1837520 1869455
56126 1869455 1899328 1926901 1948464 1961108 1966034 1965496 1959668 1948797 1935008 1919126 1898453 1870136
56114 1870136 1834052 1790512 1738600 1679294 1617068 1555891 1496589 1440068 1389384 1346013 1307672
56103 1307672 1272568 1242417 1218592 1198992 1181653 1167923 1158943 1152484 1146525 1142649 1142643 1144896 1147312
56090 1147312 1150621 1155704 1160950 1165418 1171383 1180511 1190773 1200253 1210591 1223421 1236934 1249362 1262381
56077 1262381 1277538 1292807 1306277 1319886 1335839 1352727 1368796 1385639 1404891 1424716 1443361
56066 1443361 1462862 1485426 1509450 1532798 1556595 1582172 1607910 1632778 1659199 1688549 1717704
56055 1717704 1744080 1770121 1798716 1828294 1856804 1886410 1919590 1954466 1988582 2023461 2060956
56044 2060956 2099166 2136562 2176012 2220063 2266522 2313375 2363520 2419711 2479516 2540449 2605243
56033 2605243 2676659 2752015 2828556 2909203 2996928 3088428 3179717 3273211 3372860 3477110 3583300
56022 3583300 3694204 3813452 3939176 4068847 4205406 4351771 4504532 4660193 4822313
56013 4822313 4995119 5175508 5358967 5547708 5745111 5948178 6153938 6367338 6594018
56004 6594018 6831288 7075137 7329567 7599153 7878810 8161312 8448919 8747440 9055576
55995 9055576 9371337 9702402 10058307 10438509 10839755 11268521 11733742 12233979 12764532
55986 12764532 13330214 13937798 14582993 15258643 15968066 16715878 17494186 18293796 19120934
55977 19120934 19986836 20890512 21829963 22820828 23884175 25024911 26242523 27552860 28977253
55968 28977253 30521100 32187772 34003222 36001398 38197808 40606495 43271225 46249952
55960 46249952 49584514 53323762 57565507 62440774 68078235 74634040 82342030 91483598
55952 91483598 102324660 115129239 130184564 147713030 167775760 190313740 215069069
55945 215069069 240995891 265510640 284669819 294750571 294152031 284000103 267109887
55938 267109887 246460485 224352675 202338810 181385203 161991666 144333669 128426675
55931 128426675 114208335 101556393 90337560 80462776 71865035 64438658 58040454
55924 58040454 52537670 47816462 43755827 40235056 37166074 34489301 32142796 30062660
55916 30062660 28207283 26552999 25068558 23717270 22479882 21351983 20321473 19369149
55908 19369149 18487683 17679103 16935464 16240573 15588372 14981719 14415059 13875330 13358451
55899 13358451 12869084 12405772 11961428 11536744 11138304 10764578 10407496 10066340 9746529
55890 9746529 9446007 9156183 8875552 8609907 8359863 8120205 7890723 7675701 7472968
55881 7472968 7274786 7079489 6891786 6712147 6536381 6365266 6204050 6052277 5903831
55872 5903831 5756996 5615057 5477205 5338440 5198822 5063786 4934977 4809246 4686739
55863 4686739 4571321 4462611 4355802 4249844 4148113 4050970 3955425 3862253 3775672 3695664
55853 3695664 3618001 3541991 3470769 3403800 3336574 3268124 3201692 3137638 3072827 3007435 2945186
55842 2945186 2886292 2827061 2767120 2710210 2657104 2604480 2551621 2501644 2455204 2409410 2363874
55831 2363874 2321444 2281973 2241655 2199699 2159540 2122239 2084701 2045735 2007957 1972127 1935323
55820 1935323 1896356 1857701 1820501 1782836 1744398 1707882 1674246 1641398 1608933 1579359 1553285
55809 1553285 1528093 1502651 1478756 1456740 1434348 1411265 1390144 1371873 1354321 1336980 1322171
55798 1322171 1310214 1297944 1283540 1268523 1253544 1236608 1217098 1197289 1178233 1158092 1136174
55787 1136174 1114644 1094700 1074873 1054580 1035426 1017455 998038 976197 954358 934250 914771
55776 914771 895448 878236 864043 851044 838316 827765 820523 814499 807221 798132 786717 771649
55764 771649 753561 735626 719661 704352 688584 673460 659608 645619 630837 616881 604860
55753 604860 593799 583116 573821 565813 556906 546049 534884 524792 515095 505369 496687 489197 481275
55740 481275 472488 464657 458668 452885 445988 438661 431339 423197 414628 407649 402472 396689 389304 382425
55726 382425 377314 371933 364429 356128 348937 342372 335298 328194 321722 315321 309035 304429 301916 299579
55712 299579 296377 294044 293963 294676 294493 294033 294017 293010 289784 285826 282971 280417 276480 271612 267223 263000
55696 263000 257780 251887 246474 241536 236437 231454 227167 223298 219527 216354 213958 211496 208689 206669
55682 206669 206079 205895 205327 205240 206362 207760 208506 209213 210486 211450 211251 210470 209663 208114 205444 202831 201150
55665 201150 199507 197115 195000 194280 194337 194227 194348 195050 195159 193693 191767 191117 191905 193446 195801 199007
55649 199007 201936 203440 203655 203007 201189 198299 195482 193171 190169 185789 181293 177764 174226 169502 164316
55634 164316 159870 155850 151632 147994 145708 143810 141181 138607 137308 136604 135050 132885 131311 130213
55620 130213 128574 126509 125044 124402 124081 124001 124116 123563 121639 118989 116574 114250 111568 109009 107091 105291
55604 105291 103227 101831 101859 102247 101580 100214 99351 98917 98067 96978 96455 96366 96025 95530 95311 95000 94153 93335
55586 93335 93160 93065 92463 92169 93116 94529 95035 94908 95507 97054 98608 99807 101131 102803 104779 107382 110767
55569 110767 114256 117298 120307 123451 125529 125529 124374 123592 122991 121278 118366 115449 113322 112028 111627 111855
55553 111855 111648 110407 109064 108484 107680 105305 102185 100403 100276 100095 98678 96493 94416 92920 92358 92608
55537 92608 92587 91485 90194 90188 91317 92178 92356 92677 93367 93562 92774 91503 90297 89270 88558 88194 87586 86119
55519 86119 84111 82314 80715 78737 76249 73441 70187 66509 63189 60896 59204 57434 55835 54949 54564
55504 54564 54378 54831 56030 56767 56118 55099 55171 55898 55918 55433 55783 56998 57863 58165 58861 60042 60679 60505
55486 60505 60444 61004 61790 62685 63945 65073 65172 64514 64254 64526 64407 63834 63871 64736 65222 64596 63682 63491 63932
55467 63932 64317 64170 63202 61470 59749 58880 58700 58566 58714 59920 61913 63480 64203 64791 65563 65919 65604
55450 65604 65276 65495 66119 66877 67578 67714 66920 65856 65559 65944 66014 65495 65038 64861 64503 64011 64020 64455 64401 63594
55430 63594 62907 63111 64170 65861 67975 69820 70633 70677 70905 71497 71860 72007 72639 73817 74829 75534 76496
55413 76496 77649 78165 77876 77495 77130 75965 73784 71531 69886 68529 67247 66571 66773 67327 67821 68347 68671
55396 68671 68136 66827 65719 65247 64820 64164 63982 64737 65857 66673 67188 67391 66851 65538 64162 63161 62205
55379 62205 61166 60648 60967 61514 61695 61817 62487 63697 64922 65627 65466 64560 63622 63171 62809 62060 61644 62665
55361 62665 64687 65973 65774 64939 64110 62911 61347 60436 60714 61425 61927 62621 63759 64571 64521 64318 64697 65113
55343 65113 64698 63715 63104 63108 63207 62995 62528 62138 62270 63030 63745 63630 62991 62864 63332 63288 62191 60913 60454 60880
55323 60880 61953 63581 65107 65452 64645 64092 64594 65238 65021 64373 64166 64253 63985 63230 62010 60102 57971
55306 57971 57072 58155 60059 61201 61450 61514 61459 61049 60780 61207 61780 61664 61315 62005 63996 66290 67991 68935
55288 68935 69145 68655 67814 67020 66221 65268 64503 64385 64818 65454 66304 67435 68429 68832 68782 68574 68070 67174 66420
55269 66420 66353 66708 66933 67070 67331 67272 66359 65088 64576 65139 66070 66759 67257 67696 67936 67886 67756 67879 68560 69919
55249 69919 71559 72664 72809 72444 72245 72326 72490 72799 73356 73813 73668 72890 71878 71063 70857 71548 72802 73624
55231 73624 73339 72293 71238 70418 69657 68875 68049 67102 66309 66337 67349 68572 69288 69780 70621 71519 71687 71102
55213 71102 70613 70837 71523 71967 71677 70765 69954 70006 70935 72087 73079 74048 74813 74648 73358 71790 70631 69493
55195 69493 67941 66659 66581 67408 68034 68092 68043 68003 67570 66785 66317 66522 67020 67365 67618 68128 69085 70308 71247
55176 71247 71396 70909 70465 70350 70154 69740 69758 70642 71705 71976 71490 71011 70945 71236 71908 72906 73824 74547 75748
55157 75748 77883 80133 81287 81394 81508 82042 82403 82147 81388 80096 78056 75754 74339 74287 74840 75143 75341
55140 75341 76148 77708 79215 79541 78204 75888 73955 73230 73451 73982 74565 75012 74805 73737 72585 72395 73350
55123 73350 74950 76963 79318 81399 82406 82415 82235 82216 81987 81392 80834 80572 80399 80240 80419 81097 81935 82513
55105 82513 82715 82610 82347 82143 82061 81921 81802 82339 83929 85848 86788 86192 84517 82436 80433 79015 78513
55088 78513 78667 79034 79698 80939 82372 83219 83357 83291 83184 82812 82482 82976 84368 85729 86356 86483 86564 86629 86738
55069 86738 87270 88274 89134 89339 89083 88748 88345 87868 87621 87676 87450 86392 84792 83443 82753 82632 82999 83867
55051 83867 84981 85780 85853 85197 84073 82803 81764 81401 82006 83423 85025 86179 86737 86937 86871 86418 85771
55034 85771 85506 85856 86330 86432 86327 86317 86130 85411 84680 84942 86395 88138 89215 89365 88720 87489 86147 85370
55016 85370 85456 86031 86511 86639 86548 86534 86802 87262 87647 87942 88434 89120 89461 89119 88536 88273 88128 87565 86721 86226
54996 86226 86172 86007 85420 84613 83769 82893 82237 82194 82752 83599 84696 86081 87239 87491 87097 87111 87935 88800 88958
54977 88958 88681 88665 89037 89399 89444 89138 88615 88151 88040 88352 88997 89936 91007 91736 91817 91686 92000 92656 92987 92913
54957 92913 93074 93685 94062 93648 92800 92178 91894 91729 91694 91947 92400 92778 92895 92697 92326 92240 92919 94336 95937
54938 95937 97250 98236 99114 100142 101501 102996 103982 104080 103843 104204 105315 106548 107489 108343 109392 110837 113162
54921 113162 116868 121689 126756 131618 136385 140813 144129 145996 146855 147008 146119 143975 141003 137709 134189
54906 134189 130483 126737 122832 118622 114770 112444 111799 111574 110647 109178 107748 106368 105062 104543 105357
54891 105357 106881 108062 108702 109294 109995 110600 111217 112219 113695 115580 118061 121205 124414 126931 128822
54876 128822 130918 133841 137490 141342 144811 147380 148767 148945 147926 145788 143035 140450 138269 135963
54862 135963 133182 130402 128172 126212 123862 121043 118185 115547 113165 111176 109603 108028 106072 103987
54848 103987 102255 100868 99557 98482 98047 98198 98509 98864 99428 100005 100066 99481 98682 98025 97413 96653 95795 95111
54830 95111 95000 95858 97613 99412 100224 99804 98823 98060 97823 98048 98506 98838 98802 98629 98889 99807 100897 101389
54812 101389 100972 100078 99474 99502 99739 99559 99001 98763 99217 99791 99661 98794 97953 97816 98445 99479 100534 101382
54794 101382 101994 102480 102954 103547 104460 105707 106742 106784 105754 104545 104063 104354 104922 105523 106235 107069 107998 109229
54776 109229 110968 113007 114896 116458 117848 119244 120797 122746 125203 127900 130443 132813 135369 138436
54762 138436 142072 146131 150277 154000 156752 158101 157779 155860 152966 149886 146803 143219 138874 134338
54748 134338 130393 127187 124415 121972 119988 118453 117284 116570 116357 116303 115976 115325 114535 113640 112659 111941 111888
54731 111888 112431 113208 114157 115522 117302 119180 121085 123490 126955 131491 136377 140601 143624 145811 147912
54716 147912 150056 151562 151835 151001 149421 147046 143745 139914 136207 132864 129780 127058 124950 123298 121496
54701 121496 119045 116010 113012 110970 110481 111106 111547 110916 109621 108618 108133 107648 106886 106165 105836 105898 106188
54684 106188 106526 106676 106536 106296 106075 105555 104348 102622 101000 99979 99799 100603 102182 103747 104526 104530 104250
54667 104250 103767 102766 101389 100392 100317 100969 101835 102589 103099 103336 103403 103377 103120 102515 101803 101346 101188 101210 101551
54648 101551 102316 102995 102836 101876 101039 101096 101985 103249 104584 105787 106620 107057 107384 107823 108255 108369 107916 106859
54630 106859 105516 104445 103883 103415 102582 101674 101390 101802 102225 102161 101854 101731 101838 102021 102292 102786 103583 104624
54612 104624 105558 105810 105197 104427 104421 105166 105775 105743 105493 105489 105469 104974 104128 103414 102974 102592 102210 102094 102476 103202 103784
54591 103784 103800 103342 102942 102892 102872 102564 102380 103012 104386 105719 106624 107493 108647 109801 110669 111390 111975 111867
54573 111867 110656 108881 107553 107053 106929 106659 106266 106174 106703 107695 108536 108711 108336 107932 107685 107288 106543 105689
54555 105689 104980 104441 104300 105103 106935 108873 109824 109746 109551 109881 110460 110682 110445 110205 110466 111341 112554 113721
54537 113721 114645 115315 115715 115800 115720 115847 116364 116928 116945 116187 115024 114026 113413 112973 112521 112269 112528 113040 112957 111702
54517 111702 109662 107795 106755 106623 107182 107992 108386 107982 107241 107041 107665 108607 109401 110118 110932 111715 112297 112727
54499 112727 113109 113508 114155 115297 116615 117263 116798 115728 114813 114172 113431 112496 111817 111988 113344 115741 118492
54482 118492 120624 121498 121199 120320 119567 119503 120245 121218 121614 121391 121455 122546 124257 125596 126267 126875 127897 128969
54464 128969 129323 128671 127464 126424 125952 125952 126109 126223 126236 126106 125867 125715 125747 125626 124868 123552 122368 121827 121685
54445 121685 121412 120963 120771 121141 121945 122903 123939 125181 126584 127609 127536 126324 125027 124920 126198 127894
54429 127894 129065 129605 129807 129681 129102 128236 127478 127201 127746 129287 131339 132754 132731 131654 130545 129836 129138
54412 129138 128136 127157 126726 126955 127567 128235 128637 128363 127180 125507 124355 124503 125749 127172 128120 128684 129142
54395 129142 129410 129348 129256 129547 130167 130814 131514 132401 133082 133022 132648 133250 135464 138395 140616 141550 141581 141334 141264
54376 141264 141514 141783 141610 141079 140917 141692 143367 145820 149125 152891 155975 157571 158136 158623 159282 159946 161019
54359 161019 163132 165859 167754 167890 166768 165539 164857 164580 164038 162445 159594 156315 153818 152440 151473
54344 151473 150322 149221 148520 147876 146668 144931 143326 142295 141684 141151 140572 139963 139309 138600 137906 137264 136607
54327 136607 135881 135168 134570 134035 133505 133243 133714 134901 135982 136045 135135 134191 133954 134295 134706 134953 134875 134029 132160
54308 132160 129950 128700 129113 130664 132268 133268 133695 133884 134111 134456 134778 134790 134329 133623 133197 133414 134124
54291 134124 134841 135257 135389 135263 134708 133744 132933 132952 133833 134887 135456 135442 135103 134695 134436 134531 134983 135484 135632
54272 135632 135224 134395 133631 133525 134251 135311 136075 136498 137016 137855 138880 140023 141310 142463 143085 143319 143680
54255 143680 144082 143740 142356 140715 139666 139132 138678 138476 139042 140369 141942 143329 144263 144458 143941 143357 143355
54238 143355 143808 144094 143961 143603 143124 142462 141725 141124 140706 140558 141004 142078 143010 142850 141539 139919 138815
54221 138815 138540 139053 139997 140697 140725 140397 140175 139756 138457 136467 134963 134819 135784 137063 138132 138843 139290
54204 139290 139839 140869 142253 143385 143832 143679 143251 142849 142707 142802 142724 142195 141642 141751 142540 143431 144153 144872
54186 144872 145446 145404 144836 144459 144471 144180 143219 142337 142342 142916 143214 143138 143192 143410 143290 142752 142426 142856 143957 145292
54166 145292 146485 147272 147596 147767 148168 148699 148819 148287 147552 147203 147268 147284 146949 146464 146222 146325 146458 146192 145391
54147 145391 144348 143546 143238 143256 143280 143298 143669 144629 145832 146636 146869 147028 147593 148368 148722 148408 147886 147849 148518
54128 148518 149380 149614 148952 148179 148495 150266 152628 154503 155646 156429 157046 157421 157726 158369 159427 160472 160994
54111 160994 160786 160031 159331 159457 160667 162413 164091 165894 168404 171556 174662 177385 180027 182831 185690
54096 185690 188612 191723 194607 196391 196840 196698 196510 195732 193600 190364 187045 184292 182119 180537 179734
54081 179734 179615 179720 179751 179888 180536 181972 184257 187200 190377 193298 195635 197271 198224 198574 198293 197176
54065 197176 195212 193042 191610 191034 190216 188074 184954 182304 180997 180509 179875 178974 178501 178943 180030 181215
54049 181215 182387 183884 185986 188600 191442 194309 197148 200061 203359 207333 211791 216037 219615 222893
54035 222893 226608 230959 235561 240203 245097 250254 255070 258852 261514 263526 265392 267363 269503 271741
54021 271741 273813 275266 275647 274808 273140 271345 269843 268475 266955 265319 263627 261471 258320 254307 250176
54006 250176 246427 242951 239553 236303 233267 230352 227571 225032 222567 219918 217410 215807 215177 214500 212872
53991 212872 210597 208565 207001 205466 203845 202598 202032 201891 201823 201824 202022 202279 202205 201579 200717 200318 200787 201749
53973 201749 202439 202600 202677 203157 204145 205717 208128 211363 214911 218442 222370 227316 233299 239867 246710 253596
53957 253596 259881 264693 267628 268831 268484 266743 264162 261595 259403 257155 254414 251486 249143 247776
53943 247776 247083 246530 245933 245658 246362 248504 251912 255831 259443 262447 265111 267825 270715 273701 276809
53928 276809 280175 283768 287356 290858 294463 298248 301972 305502 309159 313236 317389 321055 324424 328452
53914 328452 333812 340269 347152 353922 360130 365326 369349 372420 374720 376150 376600 376104 374720 372662 370652
53899 370652 369508 369080 368070 365250 360506 354520 348000 341578 335825 330751 325648 319919 313761 307645
53885 307645 301583 295452 289611 284515 279995 275560 271202 267293 263845 260483 257060 253727 250487 247178
53871 247178 243842 240605 237354 234047 231201 229395 228293 226824 224463 221794 219669 218324 217485 216847 216183
53856 216183 215308 214203 212980 211697 210398 209317 208751 208669 208664 208277 207179 205287 203039 201355 200816 200947 200787
53839 200787 200141 199713 200014 200650 200898 200464 199531 198500 197923 198301 199624 201283 202592 203246 203320 203140 203250 204105
53821 204105 205626 207240 208428 209042 209128 208840 208581 208855 209799 211119 212559 214163 216080 218464 221618 225788
53805 225788 230625 235253 239117 242528 246156 250225 254423 258357 261898 265180 268396 271508 274211 276331
53791 276331 278185 280259 282611 284919 287005 288815 289938 289838 288742 287639 287013 286097 283852 280264 276138
53776 276138 272005 267790 263370 258841 254264 249692 245468 242005 239177 236362 233295 230478 228471 227041
53762 227041 225363 222962 220161 217629 215739 214441 213466 212485 211249 209788 208445 207510 206882 206229 205442 204658
53746 204658 203928 203217 202728 202801 203312 203618 203342 202837 202567 202463 202349 202595 203685 205351 206782 207638 208237 208760
53728 208760 208988 208975 209334 210469 211988 213222 214059 214916 216127 217612 219016 220023 220633 221236 222232 223545
53712 223545 224711 225490 226171 227205 228753 230595 232300 233539 234485 235760 237681 239752 241398 243011 245566
53697 245566 249143 252673 255441 258107 261661 265917 269708 272237 273648 274396 274654 274404 273684 272628 271407
53682 271407 270180 268993 267838 266873 266445 266774 267739 269058 270463 271637 272274 272391 272343 272363 272319 272027 271566 271107
53664 271107 270732 270541 270681 271103 271555 271990 272652 273601 274552 275364 276238 277108 277319 276405 274891 273799 273558 273823
53646 273823 274193 274634 275250 276096 277218 278567 279978 281442 283217 285346 287353 288855 290278 292382 295129
53631 295129 297612 299247 300567 302593 305748 309589 313346 316517 319103 321471 323981 326686 329403 331939
53617 331939 334177 336059 337732 339577 341808 344072 345736 346638 347345 348590 350584 352915 354978 356455 357523
53602 357523 358675 360302 362442 364890 367409 369793 371871 373539 374744 375399 375527 375488 375778 376397 376717 376208
53586 376208 375040 373703 372325 370789 369285 368277 367936 368035 368366 368866 369341 369507 369413 369428 369629 369547 368770 367555
53568 367555 366600 366289 366366 366318 365930 365435 365245 365629 366659 368299 370315 372160 373263 373593 373742 374349 375657
53551 375657 377696 380485 383725 386618 388541 389797 391320 393659 396562 399444 401911 403904 405725 407974
53537 407974 411168 415375 420356 425858 431504 436744 441473 446491 452712 460005 467533 475176 483749 493563
53523 493563 503689 513187 522444 532576 543961 556029 568286 580923 594458 609233 625193 641880
53511 641880 658830 676229 694891 715126 735957 756033 775090 793923 813065 832184 850783
53500 850783 868684 885700 901608 916795 932271 948535 964919 980522 995392 1010207 1025184
53489 1025184 1039989 1054521 1069098 1083780 1098123 1111794 1125037 1138364 1152088 1166260 1180674
53478 1180674 1194791 1207938 1219732 1230186 1239461 1247823 1255732 1263372 1269985 1274308 1275946 1275795 1274677
53465 1274677 1272129 1267171 1259831 1251238 1242353 1233317 1223925 1214086 1203766 1193060 1182372 1171966 1161351
53452 1161351 1149735 1137154 1124470 1112093 1099518 1086490 1073853 1062573 1052460 1042584 1032589 1022893
53440 1022893 1013833 1005457 998134 992606 989144 987117 985645 984332 983214 982421 982229 983174 985728 989873 995216
53425 995216 1001477 1008668 1016755 1025367 1034098 1043103 1053184 1065146 1079131 1094725 1111550 1129489 1148425
53412 1148425 1168122 1188490 1209667 1231739 1254624 1278323 1302978 1328559 1354841 1381880 1410154
53401 1410154 1440021 1471390 1504230 1538959 1575837 1614232 1653035 1691690 1730361 1769324 1808723
53390 1808723 1848854 1889965 1931558 1972425 2011660 2049339 2085995 2121786 2156429 2189696 2221611
53379 2221611 2252196 2281200 2308086 2332198 2353027 2370392 2384380 2395111 2402607 2406818 2407620 2404797
53367 2404797 2398076 2387152 2371695 2351514 2326948 2298948 2268524 2236152 2201857 2165850 2128843
53356 2128843 2091730 2055055 2018737 1982251 1945323 1908603 1873411 1840495 1809277 1778622 1748040
53345 1748040 1717614 1687026 1655492 1622894 1590349 1559274 1530201 1502747 1476412 1451121 1427225
53334 1427225 1405251 1385530 1367866 1351700 1336698 1322955 1310544 1299152 1288371 1278031 1267922
53323 1267922 1257366 1245531 1232257 1218363 1205044 1193018 1182226 1172229 1162870 1154487 1147506 1141898
53311 1141898 1137232 1133245 1130114 1128039 1126768 1125823 1125114 1125152 1126628 1129903 1134929 1141447 1149128 1157584 1166476
53296 1166476 1175816 1186082 1197875 1211359 1226110 1241517 1257205 1273055 1289030 1305062 1320957
53285 1320957 1336279 1350556 1363747 1376271 1388354 1399550 1409159 1416883 1422736 1426524 1427941 1427169 1424840
53272 1424840 1421252 1415992 1408523 1398893 1387593 1374935 1360820 1345067 1327803 1309422 1290227 1270183
53260 1270183 1249250 1227928 1207155 1187365 1167865 1147501 1125853 1103514 1081359 1059959 1039546
53249 1039546 1019942 1000455 980360 959710 939312 919697 900478 881009 861319 842095 823893
53238 823893 806693 790088 773674 757333 741317 726115 712126 699463 687992 677472 667657 658448
53226 658448 649960 642231 634912 627379 619192 610246 600506 589891 578462 566515 554396 542359 530581
53213 530581 519147 508043 497367 487458 478552 470444 462772 455535 448893 442525 435712 428183 420459
53200 420459 413127 406192 399314 392359 385448 378688 372095 365632 359266 353110 347473 342457 337624 332427
53186 332427 326961 321814 317182 312673 308119 303967 300619 297908 295522 293457 291698 289938 288033 286307
53172 286307 284976 283580 281432 278422 275015 271770 269192 267712 267271 267023 265954 263824 261319 259331 258260
53157 258260 257857 257578 257169 256860 256769 256277 254575 251892 249466 248059 247235 246460 246059 246393 246788 246213 244652
53140 244652 242976 241757 240991 240722 241087 241804 242422 242966 243651 244128 243843 243057 242613 242670 242583 242202 242348 243651
53122 243651 245681 247641 249223 250377 250922 250961 251097 251663 252126 251836 250969 250177 249592 248835 247837 246993 246470 245895
53104 245895 244929 243751 242745 241996 241334 240733 240410 240441 240425 239755 238251 236422 234978 234187 233846 233704 233719 233978
53086 233978 234610 235681 236910 237604 237246 236157 235192 234726 234351 233655 232851 232354 232144 231876 231396 230767 229960 228880
53068 228880 227672 226682 226098 225818 225633 225372 224876 224071 223131 222417 222163 222291 222553 222765 222893 222992 223220 223864 225151
53049 225151 226925 228570 229484 229610 229366 229034 228528 227840 227347 227384 227726 227920 228021 228512 229442 230096 229818 228820
53031 228820 227811 227000 225912 224306 222853 222522 223411 224610 225334 225808 226650 227747 228396 228510 228924 230135
53015 230135 231354 231392 230194 228872 228364 228609 229005 229147 228996 228747 228711 229086 229771 230569 231481 232529 233345 233378
52997 233378 232547 231401 230508 230000 229749 229699 229909 230474 231493 232928 234516 236023 237506 239036 240283 240803
52981 240803 240756 240817 241233 241414 240754 239516 238536 238267 238462 238765 239294 240461 242282 244048 244981 245240 245935 247869
52963 247869 250549 252853 254374 255506 256351 256351 255219 253594 252334 251540 250616 249000 246548 243546 240653 238601
52947 238601 237632 237335 237207 237090 236916 236328 234962 232926 230727 228849 227617 227222 227555 228080 228219 227927 227722
52930 227722 228090 228960 229771 230043 229810 229482 229321 229293 229432 229968 230834 231440 231405 231182 231388 231777 231688 231332 231671 232889
52910 232889 233983 234164 233729 233110 232036 230403 229075 228859 229241 229147 228571 228402 228905 229408 229504 229607 230105 230713
52892 230713 230940 230649 230026 229448 229454 230259 231249 231482 230834 230143 230170 230900 231939 232981 233755 234158 234638 235862 237736
52873 237736 239356 240223 240886 241954 243126 243808 244177 244870 245897 246625 246739 246531 246242 245787 245263 245142 245617
52856 245617 246156 245952 244575 242046 238654 235022 231998 230030 228704 227250 225444 223697 222300 221023 219615
52841 219615 218382 217922 218380 219145 219289 218249 216215 213986 212383 211673 211571 211765 212218 212871 213427 213749 214199
52824 214199 215141 216211 216636 216259 215737 215633 215820 216005 216294 216820 217282 217405 217634 218844 221343 224515 227448
52807 227448 229618 231034 231972 232587 232617 231604 229636 227651 226558 226168 225405 223635 221366 219523 218437 217776
52791 217776 217183 216646 216280 216004 215527 214654 213520 212475 211726 211278 211233 211827 212971 214042 214533 214786 215604 217142
52773 217142 218647 219416 219582 219671 219766 219492 218692 217697 216896 216290 215620 214772 213920 213306 213027 213072 213472 214263 215343
52754 215343 216509 217617 218585 219285 219669 220060 220976 222508 224187 225653 227140 228998 230997 232594 233702
52739 233702 234723 235877 236945 237692 238133 238342 238418 238701 239580 240972 242339 243343 244046 244356 243784 242163 240181
52722 240181 238721 237845 236859 235296 233453 231965 231177 231000 231087 231035 230593 229842 229140 228854 229122 229783 230452 230743
52704 230743 230609 230499 231060 232536 234450 235898 236220 235486 234391 233697 233752 234469 235624 236991 238229 238840 238504
52687 238504 237489 236560 236287 236460 236345 235604 234694 234153 233760 232856 231463 230470 230510 231113 231352 230941 230232 229473
52669 229473 228682 228121 228258 229187 230550 232069 233701 235274 236454 237193 237784 238371 238886 239534 240820 242857
52653 242857 245137 247197 249033 250563 251246 250723 249426 248094 247017 246202 245858 246030 246003 244884 242785 240791
52637 240791 239638 239031 238421 237869 237767 238195 239005 240299 242318 244900 247391 249200 250181 250407 249819 248330
52621 248330 246247 244292 243007 242224 241353 240202 239254 239006 239266 239391 239114 238887 239360 240734 242581 244150
52605 244150 244820 244478 243620 242945 242748 242730 242442 241879 241562 242050 243401 245163 246852 248310 249552 250439 250869
52588 250869 251173 251870 252827 253116 252090 250362 249250 249422 250468 251653 252528 252864 252598 252064 251767 251696 251303
52571 251303 250448 249824 250041 250733 251164 251356 251875 252625 252724 251791 250592 250020 249936 249594 248834 248228 248137 248204 247883 247074
52551 247074 246086 245276 244830 244684 244568 244321 244233 244768 245889 246929 247324 247174 246860 246437 245748 244927 244278 243744
52533 243744 242984 242105 241834 242666 244153 245367 245876 245955 245979 246039 246147 246420 246857 247195 247236 247191 247435 247992 248523 248868
52513 248868 249329 250302 251786 253475 255201 257065 259105 261070 262559 263275 263143 262325 261213 260235 259546 258990
52497 258990 258416 257901 257567 257257 256579 255262 253435 251551 250078 249220 248920 249111 249799 250748 251309 250972 250083
52480 250083 249561 249808 250327 250657 251141 252327 253961 255230 255818 256198 256834 257656 258331 258649 258574 258365 258668 260049
52462 260049 262257 264392 265977 267422 269211 271095 272429 272920 272640 271573 269682 267325 265123 263328 261632
52447 261632 259689 257632 255978 255167 255231 255771 256262 256416 256310 256181 256160 256272 256572 257155 258060 259186 260245 260808
52429 260808 260521 259429 258033 256958 256563 256851 257647 258806 260268 261972 263768 265522 267299 269241 271176
52414 271176 272640 273548 274623 276747 280066 284154 288916 294719 301592 308962 316332 323513 329794 333558
52400 333558 333509 330113 325244 320518 316405 312753 309480 306600 304061 301849 300056 298683 297490 296168 294585
52385 294585 292935 291736 291570 292594 294316 295981 297214 298192 299336 300980 303214 305827 308445 310910 313511
52370 313511 316603 320061 323257 325623 327146 328389 330067 332504 335327 337816 339613 340977 342219 343203
52356 343203 343679 343894 344478 345772 347568 349489 351296 352835 354069 355298 357089 359796 363305 367336 371808
52341 371808 376718 381853 386908 391920 397393 403801 411075 418787 426813 435518 445095 455083 464902 474676
52327 474676 485011 496114 507786 520330 534632 550963 568309 585438 602102 618587 634558
52316 634558 649264 662782 676199 690435 705433 720629 735678 750477 764928 778965 792593
52305 792593 805746 818292 830160 841243 851242 859967 867731 875043 881923 887952 892961 897149 900459
52292 900459 902464 903144 903168 902925 901781 898856 894353 889522 885338 881711 878069 874342 871198 869506 869724
52277 869724 871647 874634 878166 882236 887170 893061 899533 906219 913315 921336 930227 939040 946876 954019
52263 954019 961679 970586 980267 989910 999403 1009046 1018660 1027662 1036055 1044704 1054328 1064463 1073724 1081025
52249 1081025 1086397 1090576 1093894 1095817 1095710 1093772 1090733 1086665 1080893 1073338 1065238 1057898 1051202 1044129
52235 1044129 1036382 1028672 1021550 1014887 1008543 1002696 997293 991904 986439 981440 977336 973922 970852 968198
52221 968198 966170 964717 963761 963512 964219 965791 967852 970028 972185 974636 978063 982780 988062 992714 996326
52206 996326 999463 1002541 1005262 1007370 1009321 1011798 1015070 1019107 1023813 1028810 1033565 1038072 1042842 1047835
52192 1047835 1052111 1055059 1057324 1059819 1062376 1064155 1064934 1065118 1064756 1063454 1061123 1057975 1053832 1048303 1041777
52177 1041777 1035425 1029978 1025094 1020189 1015318 1010863 1006823 1002907 999196 996333 994972 995147 996209 997431
52163 997431 998656 1000242 1002405 1004843 1007119 1009118 1010935 1012581 1014083 1015634 1017348 1019055 1020619 1022224
52149 1022224 1024058 1025943 1027589 1028979 1030183 1031103 1031824 1032868 1034626 1036768 1038738 1040638 1043009 1045906
52135 1045906 1048821 1051505 1054312 1057735 1062145 1067961 1075489 1084507 1094549 1105677 1118465 1133126 1149209
52122 1149209 1166285 1184375 1203446 1223072 1242933 1263249 1284258 1305544 1326256 1345844 1364268
52111 1364268 1381534 1397347 1411291 1423273 1433700 1443193 1452152 1460615 1468449 1475402 1480988 1484747 1486833
52098 1486833 1487939 1488353 1487490 1484782 1480545 1475455 1469446 1461841 1452281 1440932 1428065 1414253 1400794
52085 1400794 1388984 1378947 1369967 1361921 1355403 1350379 1345867 1341464 1338250 1337538 1339403 1342974 1347597 1353153
52071 1353153 1359710 1367414 1376341 1386081 1395940 1405876 1416643 1428539 1440581 1451478 1460927 1469474 1477607
52058 1477607 1485584 1493573 1501228 1507514 1511671 1514043 1515320 1515340 1513396 1509346 1503579 1496144 1486861 1476145
52044 1476145 1464715 1452362 1437985 1421180 1403079 1385236 1368292 1352070 1336416 1321429 1307138
52033 1307138 1293397 1280040 1266956 1254183 1241958 1230470 1219422 1208144 1196280 1184171 1172415
52022 1172415 1161217 1150260 1139122 1127728 1116479 1105908 1096170 1086980 1078111 1069644 1061483 1052969
52010 1052969 1043439 1032954 1021983 1010518 998156 985003 971747 958633 945010 930297 914893
51999 914893 899661 884912 870402 856159 842747 830722 820154 810690 801748 792585 782485 771170
51987 771170 759020 746756 734861 723328 711931 700620 689579 678970 668819 659129 649855 640700
51975 640700 631273 621645 612488 604385 597258 590813 585263 581141 578573 577332 577545 579647 583436 587750
51961 587750 591385 593959 595639 596463 596360 595546 594407 593066 591286 588746 585237 580804 575955 571610 568581
51946 568581 567089 566912 567851 569911 573207 577900 584188 592215 602053 613787 627321 641986 656634 670419
51932 670419 683228 695115 705567 713733 719047 721118 719137 712138 700046 684015 665547 645747
51920 645747 625629 606451 589089 573311 558285 543784 530440 518869 509114 501034 494599 489491
51908 489491 484974 480740 477543 476368 477022 478142 478609 478445 478244 478280 478455 478589 478288 476891 473945 469566
51892 469566 464057 457467 450020 442684 436715 432572 429699 427382 425465 424238 424068 425214 427662 430968
51878 430968 434550 438211 442194 446697 451536 456216 460131 462845 464544 466056 467907 469429 469345 467254 463933
51863 463933 460184 456149 451990 448396 445842 443962 442276 441094 441032 441937 442993 443690 444089 444205 443747 442524
51847 442524 440663 438354 435643 432476 428730 424336 419607 415257 411800 409176 407281 406432 406759 407494 407565
51832 407565 406795 405851 405157 404575 404108 404060 404332 404300 403656 402743 401836 400748 399394 398008 396484 394304 391660
51815 391660 389935 390313 392432 395066 397661 400344 402843 404483 405227 405751 406271 406128 404822 402809 400812
51800 400812 398900 396743 394482 392807 392187 392322 392401 391819 390630 389328 388141 386729 384807 382926 382179 383003
51784 383003 384631 385863 386095 385525 384736 384356 384744 385653 386441 386977 388093 390706 394665 398938 402848 406580
51768 406580 410489 414587 419009 424298 430599 436847 441438 443725 444307 443811 442008 438459 433487 427980 422476
51753 422476 416999 411648 406750 402343 398054 393797 390114 387514 385789 384412 383349 383021 383565 384601 385802
51738 385802 387278 389353 392268 396215 401218 406736 411641 414953 416649 417573 418621 420115 421888 423760
51724 423760 425745 427755 429200 429202 427375 424165 420271 415994 411612 408060 406416 406522 406832 406060 404420 402808
51708 402808 401377 399750 398333 398375 400514 403933 407217 409576 410965 411516 411302 410437 409094 407550 406382
51693 406382 406325 407652 409787 411694 412618 412363 411140 409368 407403 405209 402448 399162 396173 394455 394151
51678 394151 394540 395004 395697 397141 399407 401889 403836 405076 406247 408313 411726 416095 420713 425265 429839
51663 429839 434358 438280 440863 441498 439848 436106 431246 426700 423477 421715 421192 421954 424163 427532 431270
51648 431270 434470 436315 436093 433547 429251 424222 418952 413173 406746 400413 395291 391778 389318 387208
51634 387208 385325 384000 383392 383104 382408 380947 379230 378269 378541 379435 379966 379829 379408 378938 378204 377102 375918
51617 375918 374782 373325 371239 368823 366600 364654 362824 361294 360464 360278 360182 359802 359261 358862 358920 359950
51601 359950 362540 366775 372151 378208 384945 392423 400349 408255 415708 422036 426243 427707 426856 424817
51587 424817 422497 420259 418270 416724 415770 415628 416730 419466 423815 429547 436709 445521 455775 466730
51573 466730 477691 488402 498802 508869 518827 529107 539751 550089 559320 567363 575011 583442
51561 583442 593697 606403 621685 639358 659253 681124 704126 726599 746686 763060 775005
51550 775005 782193 784812 783595 779114 771009 758485 741691 722152 701560 680596 659234 637776
51538 637776 617017 597553 579565 563363 549593 538530 529436 521013 512492 504058 496182 488825 481483
51525 481483 473891 466446 459791 454064 448750 443331 437913 433019 428861 425017 420940 416541 412146 408028
51511 408028 404199 400635 397477 394877 392724 390619 388138 385161 382001 379188 377071 375621 374578 373729
51497 373729 372986 372333 371843 371715 372153 373129 374297 375119 375128 374265 373086 372413 372521 372813 372605 372059 371875 372093 371831
51478 371831 370455 368439 366629 365072 363178 360835 358719 357446 356867 356334 355296 353538 351159 348516 345979
51463 345979 343660 341536 339817 338854 338620 338566 338189 337506 336872 336617 337052 338494 340989 344186 347805 352086
51447 352086 357425 363693 370330 377113 384436 392641 401364 409732 417019 422897 427202 429842 431035 431439
51433 431439 431838 432631 433561 433867 432711 429670 425023 419603 414259 409389 404943 400720 396527 392196 387806
51418 387806 383937 381353 380204 379758 379211 378542 378295 378636 379117 379347 379474 379887 380819 382409 384773 387704 390555
51401 390555 392784 394526 396396 398797 401663 404747 407876 410977 414157 417868 422763 429250 437138 445776
51387 445776 454586 463609 473670 485856 500667 517767 536742 557921 582096 609438 639122 670178
51375 670178 702291 735323 768172 798614 824569 845284 861095 872159 877806 877186 870222 857614
51363 857614 840045 817801 791249 761363 729509 696851 664191 632223 601583 572639 545623
51352 545623 521108 500026 482849 468848 456545 444952 434134 424523 416097 408529 401873 396557
51340 396557 392670 389700 387131 384953 383286 381831 380120 378230 376814 376372 376736 377268 377302 376397 374520 372141
51324 372141 369909 368100 366479 364705 362630 360250 357732 355595 354390 353962 353432 352273 351071 350724 351141
51309 351141 351359 350955 350665 351313 352583 353349 353054 352289 351926 352034 351991 351530 351171 351426 351902 351684 350511 349036
51291 349036 347852 346842 345844 345395 346202 348110 350247 352202 354478 357640 361538 365588 369377 372624 374877
51276 374877 375776 375607 375280 375626 376767 378170 379195 379571 379489 379393 379730 380767 382371 383901 384541 383974 382616
51259 382616 380979 378990 376247 372892 369721 367353 365595 363837 361751 359379 356796 354062 351415 349237
51245 349237 347778 347033 346821 346813 346625 346137 345752 346115 347453 349337 351167 352742 354215 355633 356793 357558 358011
51228 358011 358123 357527 355985 354031 352701 352482 352813 352845 352372 351762 351274 350889 350661 350781 351253 351916 352771 353926
51210 353926 355235 356384 357463 358965 361020 363015 364284 364870 365337 366089 367168 368534 370196 372118 374171
51195 374171 376119 377502 377843 377193 376291 375909 376183 376770 377387 377829 377769 377064 376170 375751 375828 375792 375301 374658 374193
51176 374193 373756 373170 372707 372686 372881 372798 372509 372739 374034 376080 377933 378784 378499 377569 376658 376098 375796 375582
51158 375582 375517 375709 375941 375726 374758 373112 370984 368428 365493 362462 359819 357974 357066 356893 356970 356851 356563
51141 356563 356596 357256 358156 358665 358793 359269 360648 362634 364475 365720 366380 366610 366604 366700 367190 367999 368767 369339 369945
51122 369945 370884 372167 373491 374468 374966 375382 376441 378444 380805 382624 383668 384412 385218 385974 386654 387669
51106 387669 389367 391592 394037 396654 399379 401829 403738 405411 407285 409224 410713 411576 412044 412301 412485
51091 412485 413019 414271 415891 417167 418125 419622 422077 424824 427022 428636 430009 431029 431367 431186 430961
51076 430961 430845 430861 431531 433502 436564 439744 442603 445723 449643 453952 458003 462055 467089 473667 481587
51061 481587 490733 501719 515325 531351 548172 563505 575819 585214 592996 600396 607849 615419 623337
51048 623337 631587 639232 644827 647723 648528 648068 646261 642339 635965 627847 619386 612018 606746 603847 602698
51033 602698 601846 599443 594017 585359 574832 564516 555716 548375 541963 536607 532940 531102 530389 529994
51019 529994 529717 529946 531254 534150 538883 545250 552716 560807 569285 578007 586857 595892 605301 615111 625119
51004 625119 635132 645002 654373 662723 669842 675992 681426 686075 689904 693235 696452 699603 702612 705598
50990 705598 708666 711655 714535 717847 722334 728313 735884 745554 757867 772337 787402 801728 815160
50977 815160 828237 841374 854908 869511 885982 904786 926076 950007 976724 1006290 1038898
50966 1038898 1074892 1114269 1156363 1200401 1246150 1293583 1342199 1391213 1440293 1489433 1538044
50955 1538044 1584784 1628452 1668495 1704540 1736099 1763085 1786048 1805414 1820942 1832477 1840861
50944 1840861 1847493 1853215 1858133 1862227 1865337 1866634 1864952 1859934 1852322 1843012 1832345 1820509 1807862
50931 1807862 1794327 1778878 1760138 1737338 1710456 1679860 1646243 1610550 1573409 1534725 1494236
50920 1494236 1452273 1409573 1366600 1323661 1281538 1241356 1203772 1168782 1136354 1106706 1079853
50909 1079853 1055458 1033360 1013718 996361 980500 965450 951325 938686 927831 918777 911550 905990
50897 905990 901466 897266 893244 889724 886852 884443 882493 881415 881662 883305 886089 889697 893910 898639
50883 898639 903941 909936 916682 924206 932542 941654 951343 961387 971742 982534 993976 1006455 1020565
50870 1020565 1036750 1054813 1074048 1093975 1114818 1137111 1161025 1186376 1213246 1242272 1274108
50859 1274108 1308842 1346294 1386739 1430897 1479183 1531544 1588339 1650736 1719614 1794462 1874164
50848 1874164 1958646 2048811 2144807 2245383 2349304 2456399 2566463 2677835 2787927 2894696
50838 2894696 2996740 3092183 3178471 3253374 3315568 3364370 3399671 3422338 3434057 3436457 3430754
50827 3430754 3418284 3400908 3380765 3360084 3341294 3326615 3317020 3311758 3309125 3307426 3305063 3300145
50815 3300145 3290491 3273989 3248872 3213846 3168291 3112249 3046095 2970276 2885503 2793073 2694832
50804 2694832 2592809 2488845 2384528 2281459 2181587 2087035 1999423 1919465 1847320 1782993
50794 1782993 1726118 1675783 1631223 1592560 1560207 1533592 1511213 1492025 1476058 1463339 1452920
50783 1452920 1443486 1434477 1426154 1418853 1412524 1406615 1400098 1391975 1382212 1371829 1361639 1351246 1339800
50770 1339800 1327401 1315067 1303407 1291984 1280014 1267173 1253593 1239574 1225543 1212015 1199366
50759 1199366 1187783 1177492 1168811 1161894 1156544 1152384 1149144 1146837 1145861 1146895 1150580 1157154 1166433 1178085
50745 1178085 1191950 1208207 1227301 1249543 1274740 1302419 1332490 1365428 1401597 1440725 1482346
50734 1482346 1526559 1573874 1624298 1676907 1730398 1783882 1837191 1890695 1944846 1999620 2054159
50723 2054159 2106965 2156576 2202122 2243309 2279757 2310235 2332633 2345072 2347176 2340153 2325769 2305694
50711 2305694 2281862 2256686 2232273 2209708 2189513 2172463 2159403 2150485 2145151 2142779 2142862 2144554 2146457
50698 2146457 2146767 2143239 2133333 2115141 2088483 2054683 2015259 1971094 1922770 1871039 1816902 1761757
50686 1761757 1707618 1656572 1609778 1567339 1529321 1496373 1469040 1447049 1429689 1416661 1408207
50675 1408207 1404705 1406411 1413335 1424918 1439958 1457168 1475750 1495268 1515167 1534712 1553307 1570664
50663 1570664 1586666 1601150 1613884 1624825 1634529 1644122 1654467 1665389 1676073 1686131 1695763 1704972
50651 1704972 1713477 1721644 1730649 1741142 1752507 1764241 1777445 1793953 1814194 1836917 1861018 1886673
50639 1886673 1914395 1943849 1974102 2004482 2034671 2064319 2093074 2120914 2148066 2174673 2200766
50628 2200766 2226500 2252037 2276827 2298745 2313991 2318430 2309898 2289657 2261560 2229772 2197274 2166057
50616 2166057 2137754 2113558 2093790 2078079 2065916 2056888 2050529 2046191 2043077 2040281 2036935 2032336 2025756
50603 2025756 2015998 2001447 1980890 1954247 1922349 1886133 1846264 1803353 1758158 1711527 1664328
50592 1664328 1617411 1571449 1526806 1483707 1442560 1403916 1368117 1335181 1305081 1277939 1253812
50581 1253812 1232391 1213106 1195548 1179797 1166341 1155654 1147879 1142909 1140674 1141117 1143859 1148166 1153560
50568 1153560 1160315 1169080 1180025 1192615 1206226 1220661 1236042 1252530 1270416 1290229 1312382 1336647
50556 1336647 1362147 1387953 1413682 1439588 1466124 1493345 1520694 1547373 1572926 1597446 1621317
50545 1621317 1644949 1668724 1692912 1717571 1742848 1769481 1798685 1831241 1866892 1904970 1945363
50534 1945363 1988507 2034571 2083256 2134544 2189199 2248229 2312053 2380307 2452262 2527192 2604442
50523 2604442 2683329 2762942 2841997 2918976 2992406 3060858 3122733 3176374 3220521 3254392 3277149
50512 3277149 3287651 3285087 3269670 3242353 3203978 3155182 3097273 3032750 2964652 2895444 2826775
50501 2826775 2760275 2698298 2643654 2598584 2564011 2539794 2525428 2520345 2523678 2534217 2550744 2572000
50489 2572000 2595994 2619435 2638207 2648415 2647006 2631837 2601876 2557554 2500641 2433496 2358543
50478 2358543 2278346 2195702 2113170 2032557 1955000 1881375 1812306 1747807 1687322 1630397 1577144
50467 1577144 1527868 1482365 1440032 1400750 1365281 1334366 1307671 1284115 1263219 1245534 1231500
50456 1231500 1220516 1211716 1205321 1202362 1203081 1206275 1210559 1215705 1222383 1230976 1241193 1252631 1265103
50443 1265103 1278312 1291641 1304515 1316777 1328525 1339665 1349758 1358175 1364353 1368068 1369694 1370220
50431 1370220 1370773 1371954 1373602 1375190 1376451 1377707 1379714 1383232 1388536 1395243 1402675 1410543 1419319 1429978
50417 1429978 1443534 1460848 1482502 1508441 1537803 1569560 1603450 1639963 1679273 1720520 1762352
50406 1762352 1803832 1844474 1883697 1920777 1955249 1986909 2015245 2039187 2057542 2069427 2074191
50395 2074191 2071195 2059941 2040400 2013078 1978837 1938731 1894017 1846222 1797123 1748581 1702205
50384 1702205 1659114 1619957 1585138 1555104 1530459 1511721 1498866 1491200 1487977 1489052 1494522 1503612
50372 1503612 1514266 1524120 1531501 1535227 1533971 1526541 1512662 1492923 1467945 1438167 1404464 1368450
50360 1368450 1331897 1296177 1262299 1230990 1202492 1176584 1153097 1132170 1113869 1097881 1083750
50349 1083750 1071149 1059555 1047792 1034253 1017754 998358 977581 957698 940449 926127 914002
50338 914002 903579 895163 889194 885428 883020 881162 879532 878402 878437 880132 883216 886804 890280 893819
50324 893819 897914 902677 907794 912925 917969 923104 928634 934513 939976 944058 946608 948393 950047 951446
50310 951446 952369 953106 953893 954304 953980 953599 954282 956171 958351 960179 961948 964114 966649 969497 973089 977892
50294 977892 983737 989967 996112 1002176 1008385 1014917 1021762 1028621 1034908 1039880 1042853 1043515 1042304 1040406
50280 1040406 1039037 1038560 1038426 1037966 1037085 1036245 1036099 1037181 1039595 1042798 1045903 1048394 1050443 1052524 1054984
50265 1054984 1058139 1062452 1068244 1075272 1082871 1090612 1098725 1107944 1119041 1132328 1147290 1162680 1177288
50252 1177288 1190816 1203909 1217178 1230413 1243026 1255052 1267082 1279048 1289611 1297227 1301460 1302694
50240 1302694 1300864 1295343 1286166 1274580 1261967 1248829 1235213 1221573 1208590 1196497 1185126 1174292
50228 1174292 1163457 1151170 1135609 1115829 1092198 1065783 1037852 1009864 983155 958298 935105
50217 935105 913347 893201 875004 858996 845268 833487 822631 811603 800283 789548 780165 772183
50205 772183 765473 760072 755629 751237 746474 742083 738947 736674 734002 730443 726771 723792 721385 719078
50191 719078 716975 715482 714339 712535 709425 705563 702108 699499 697136 694458 691834 689971 688781 687508
50177 687508 685988 685056 685372 686450 687357 688016 689236 691608 694939 698729 702691 706662 710421 713886 717374
50162 717374 721488 726730 733163 740369 747829 755490 763891 773584 784567 796430 808923 822107 836026
50149 836026 850611 865954 882396 900240 919588 940524 963283 988043 1014699 1042855 1072017
50138 1072017 1101809 1132183 1163354 1195339 1227624 1259590 1291170 1322639 1353612 1382797 1409116
50127 1409116 1432552 1453204 1469712 1479452 1480522 1472978 1457947 1436325 1408950 1377478 1344044 1309974
50115 1309974 1275482 1240782 1206852 1174779 1144895 1116932 1090677 1066007 1042626 1020311 999230
50104 999230 979542 960861 942686 925321 909685 896082 883752 871937 860893 851441 843909 838050
50092 838050 833743 831169 830270 830491 831294 832635 834746 837623 840943 844452 848174 852161 856212 860067 863822
50077 863822 867856 872177 876099 878893 880632 882076 883765 885534 886939 887680 887543 886392 884534 882693 881226
50062 881226 879578 876999 873598 870268 867639 865574 863699 861917 860169 858207 856052 854470 854479 856350 859394
50047 859394 862891 866912 872027 878404 885620 893396 902103 912231 923537 935104 946286 957295 968737
50034 968737 980755 992775 1003988 1013948 1022788 1031034 1039261 1047900 1057263 1067517 1078412 1089249 1099524
50021 1099524 1109727 1121073 1134187 1148301 1161993 1174401 1185399 1194902 1202778 1209497 1216235 1223774
50009 1223774 1231535 1238056 1242271 1243837 1242241 1236259 1224832 1208305 1188297 1166306 1142842 1118025
49997 1118025 1092561 1067608 1043895 1021444 1000092 979804 960411 941559 923260 906155 890835
49986 890835 876986 863526 849541 834908 820101 805712 792179 779666 767994 756767 745736
49975 745736 735091 725359 716937 709731 703284 697226 691537 686348 681704 677642 674293 671649 669339 666924
49961 666924 664363 661934 659803 658085 657314 658304 661287 665582 670371 675485 681231 687735 694772 701890 708383
49946 708383 713451 716883 719396 721883 724439 726442 727438 727346 725869 722311 716283 708206 698848 688605 677490
49931 677490 665718 654020 643355 634352 627024 620924 615557 610653 606213 602505 599976 598863 598744 598820
49917 598820 598815 599302 600837 603037 604970 606251 607329 608838 611156 614581 619264 624771 630232 635281 640572
49902 640572 647111 655224 664323 673363 681292 687380 691568 694485 696816 698555 699005 697561 694358 690115
49888 690115 685361 679915 673260 665420 657250 649615 642476 635147 627402 619843 613019 606633 599988 593004
49874 593004 586386 580847 576506 573058 570267 568158 566920 566729 567605 569332 571562 574054 576864 580313 584753
49859 584753 590342 597021 604652 613092 622019 630849 639074 646722 654221 661676 668457 673710 677102 678862
49845 678862 679204 678093 675625 672310 668672 664682 659802 653628 646407 638986 632424 627529 624429 622397
49831 622397 620289 617420 614054 610983 608773 607494 606985 607055 607574 608702 611064 615304 621346 628360 635603
49816 635603 642983 650637 658312 665487 671894 677554 682408 686232 688927 690711 691968 692963 693493 692744 689780
49801 689780 684523 678078 671781 666053 660447 654588 648542 642373 635944 629358 623169 617916 613651 610085
49787 610085 606975 604227 601814 599719 597855 596002 594012 592083 590614 589764 589354 589281 589770 591157 593648
49772 593648 597324 602035 607230 612145 616356 619900 622827 624989 626455 627714 629115 630385 631104 631404 631706
49757 631706 631856 631015 628506 624395 619117 612974 606248 599489 593263 587655 582380 577397 573118 569772 566823
49742 566823 563345 559051 554773 551783 550685 551002 551681 551921 551571 550981 550625 550891 552051 554186 557004 559973
49726 559973 562920 566466 571497 578145 585624 593129 600569 608178 615743 622593 628196 632481 635687 638136
49712 638136 639979 640948 640529 638652 635979 633211 630331 626932 623056 619213 615717 612553 609877 608047 607114
49697 607114 606687 606403 606168 605916 605629 605628 606370 607863 609768 612133 615468 619910 624869 629727 634459 639360
49681 639360 644689 650843 658296 666970 676122 685255 694668 704663 714604 723257 729769 733904 735778 735930
49667 735930 735387 734961 734577 733756 732563 731550 730929 730429 729826 728911 726876 722447 715041 705432 695075 684989
49651 684989 675411 666106 656776 647368 638274 630191 623713 619069 616100 614252 612725 611030 609513 609005
49637 609005 609811 611243 612200 612013 610664 608489 605907 603237 600522 597462 593673 589042 583884 578787 574332
49622 574332 570853 568343 566594 565384 564578 564082 563802 563577 563126 562184 560753 559212 558081 557711 558149 559109
49606 559109 560028 560385 560156 559831 559880 560272 560611 560581 560174 559698 559731 560760 562621 564524 565932 567196 568981 571244
49588 571244 573245 574516 575302 575927 576197 575717 574557 573336 572666 572651 572905 573049 573252 574262 576774 580736 585393
49571 585393 590003 594388 598845 603745 609318 615615 622547 629901 637348 644425 650617 655644 659673 663159
49557 663159 666418 669349 671530 672524 672161 670637 668380 665838 663406 661467 660282 659767 659598 659616 659934 660573
49541 660573 661228 661610 661786 661948 662040 661933 661863 662387 663959 666796 671080 676960 684302 692660 701662 711386 722389
49524 722389 735341 750436 766951 783438 798467 811154 821009 827696 831265 832460 832441 832249 832642 834192
49510 834192 837139 841254 846073 851135 855689 858458 858259 854883 849055 841589 832993 823860 814994 806778
49496 806778 798754 790136 780748 771267 762628 755270 748970 743365 738533 734918 732721 731643 731359 731914 733415
49481 733415 735589 737940 740124 741874 742862 743107 743307 744204 745685 746961 747598 747886 748206 748592 749042 749842 751308
49464 751308 753432 755884 758195 760000 761306 762462 763656 764635 765159 765372 765279 764243 761701 758222 755055
49449 755055 752686 750598 748442 746587 745332 744449 743878 744103 745407 747399 749740 752711 756566 760881 765173
49434 765173 769704 775065 781185 787329 792866 797677 802090 806859 812936 820682 829410 838060 846146 853659
49420 853659 860217 864831 866563 865261 861644 856850 851777 846848 842519 839808 839764 842325 846401 851331 857580
49405 857580 865563 874647 884033 894023 905425 918019 930581 942335 953509 964453 975088 985444
49393 985444 995885 1006397 1016175 1024369 1030926 1036295 1040519 1042919 1042642 1039402 1033763 1026749 1019124 1011095
49379 1011095 1002730 994486 987084 980939 975888 971368 966778 961927 957348 953918 951957 950914 950190 949826
49365 949826 950027 950460 950627 950662 951004 951406 950943 949020 945741 941346 935979 930128 924602 919789 915462 911473
49349 911473 908122 905582 903543 901766 900539 900218 900671 901520 902635 904042 905553 906748 907157 906296 903827
49334 903827 899934 895374 891001 887381 884899 883850 884308 886241 889891 895647 903399 912539 922885 935019
49320 935019 949175 964104 977557 987706 993733 995517 993454 988497 981660 973338 963467 952281 940401
49307 940401 928233 915869 903787 893138 884927 879131 874835 871021 867117 863135 859690 857752 857989
49294 857989 860126 863053 865607 867364 868722 870244 871923 873167 873564 873452 873468 873664 873441 872451 871115 870047
49278 870047 869330 868767 868682 869999 873441 878825 885158 891309 896689 901547 906535 911845 916887 921090 924766
49263 924766 928684 932893 936650 939674 942843 947336 953686 962062 972734 985453 998939 1012062 1025262
49250 1025262 1039596 1054187 1065815 1071633 1071443 1066702 1058323 1046539 1032417 1018125 1005413 994501
49238 994501 984605 974997 965489 956539 949138 944191 941804 941433 942679 945442 949274 953277 957007 961016
49224 961016 966138 972556 979961 988232 997366 1006815 1015493 1022721 1028969 1035430 1042840 1050794 1058265 1064768
49210 1064768 1070859 1077392 1084559 1092005 1099765 1108549 1118991 1131038 1144309 1158644 1173960 1189886
49198 1189886 1205998 1222249 1238701 1254929 1270171 1284153 1297358 1310337 1323088 1335355 1347210
49187 1347210 1358968 1370599 1381642 1391838 1401645 1411887 1423007 1434907 1447524 1461326 1477098
49176 1477098 1495489 1516925 1541767 1570281 1602448 1637986 1676175 1715150 1751369 1780608 1800144
49165 1800144 1810050 1812464 1810018 1805070 1799635 1795084 1791820 1789693 1788740 1789175 1790839 1793271 1796360 1800349
49151 1800349 1805035 1809649 1813919 1818792 1825467 1834017 1843511 1853442 1864357 1876986 1891249 1906380 1921677
49138 1921677 1936876 1952024 1967323 1983016 1999223 2015872 2032853 2050119 2067525 2084814 2101952
49127 2101952 2119277 2137033 2154953 2172691 2190518 2209084 2228440 2247875 2267025 2286610 2307598
49116 2307598 2330064 2353550 2378533 2406743 2439755 2477822 2520566 2568675 2624469 2690564 2767488
49105 2767488 2851743 2935991 3012607 3079135 3140767 3205578 3275070 3338904 3380216 3387716 3363681
49094 3363681 3320980 3272808 3224532 3173382 3114081 3044557 2967686 2889119 2813997 2745218 2683822
49083 2683822 2630125 2584151 2545397 2512794 2485175 2461721 2441929 2425262 2410891 2397840 2385495
49072 2385495 2373992 2363914 2355478 2348229 2341641 2335661 2330331 2325220 2319759 2314024 2308626 2303819 2299234
49059 2299234 2294544 2289870 2285398 2281165 2277512 2275177 2274498 2274892 2275526 2276265 2277546 2279589 2282202 2285261 2288869
49044 2288869 2292944 2296907 2299846 2301004 2300155 2297657 2294054 2289648 2284632 2279567 2275287 2272269 2270457 2269760
49030 2269760 2270163 2271156 2271796 2271789 2271931 2272894 2274165 2274892 2275258 2276123 2277575 2278821 2279455 2279887 2280534 2281424 2282820 2285328
49012 2285328 2289066 2293420 2298003 2303186 2309278 2315745 2321820 2327493 2333390 2339887 2346713 2353321 2359317 2364621
48998 2364621 2369358 2373529 2376838 2379039 2380378 2381244 2381429 2380281 2377753 2374712 2371949 2369393 2366648 2363815
48984 2363815 2361268 2358982 2356574 2353885 2351080 2348279 2345441 2342537 2339623 2336771 2334097 2331813 2330130 2329169
48970 2329169 2328890 2328912 2328549 2327512 2326605 2327188 2329769 2333646 2338035 2342925 2348518 2354587 2360996 2368280 2376942
48955 2376942 2386571 2396421 2406673 2418334 2431942 2446992 2462752 2479027 2496099 2514397 2534300 2555757
48943 2555757 2577969 2599921 2621432 2643369 2666723 2691810 2718518 2746955 2777522 2810502 2845793
48932 2845793 2883024 2921852 2962137 3003826 3046682 3090386 3135012 3181096 3228927 3277979 3327406
48921 3327406 3376974 3427016 3477571 3528048 3577758 3626294 3673255 3718181 3761110 3802890 3844489
48910 3844489 3886006 3926545 3964979 4000778 4034219 4065998 4096588 4125906 4153578 4179481 4203897
48899 4203897 4227166 4249349 4270235 4289475 4306635 4321302 4333237 4342401 4348834 4352727 4354550 4354843
48887 4354843 4353724 4350780 4345606 4338347 4329509 4319345 4307634 4294052 4278529 4261083 4241444 4219041
48875 4219041 4193491 4164949 4133810 4100157 4063715 4024421 3982848 3939922 3896369 3852588 3808929
48864 3808929 3765834 3723680 3682663 3642937 3604790 3568581 3534422 3501981 3470761 3440669 3412171
48853 3412171 3385651 3360813 3337130 3314868 3295187 3278958 3265894 3255132 3246350 3239848 3235708 3233368
48841 3233368 3232061 3231369 3231388 3232684 3236102 3242228 3250837 3261019 3271975 3283587 3296158 3309701 3323606
48828 3323606 3337029 3349658 3362031 3374937 3388499 3402048 3414996 3427543 3440394 3454052 3468641
48817 3468641 3484121 3500248 3516487 3532369 3547922 3563418 3578727 3593285 3606748 3619441 3632081
$$ [...]
##END NTUPLES=NMR SPECTRUM
##END=
