
##TITLE=AC1249_NSDAH12039_6945181_DXTpwpUtfk
##JCAMPDX= 6.0         $$ Bruker NMR JCAMP-DX V2.0
##DATA TYPE= NMR SPECTRUM
##DATA CLASS= NTUPLES
##ORIGIN= BRUKER
##OWNER= Administrator
$$ 1.72 TOPSPIN		Version 2.1
$$ 2012-12-11 22:45:45.984 -0500  Administrator@X
$$ Compression mode = diff/dup
##.OBSERVE FREQUENCY= 400.02188249412
##.OBSERVE NUCLEUS= ^1H
##.ACQUISITION MODE= SIMULTANEOUS (DQD)
##.ACQUISITION SCHEME= undefined
##.AVERAGES= 8
##.DIGITISER RES= 22
##SPECTROMETER/DATA SYSTEM= spect
##.PULSE SEQUENCE= zg30
##.SOLVENT NAME= COFFEE_meoh
##.SHIFT REFERENCE= INTERNAL, COFFEE_meoh, 1, 14.98509
##AUDIT TRAIL= $$ (NUMBER, WHEN, WHO, WHERE, PROCESS, VERSION, WHAT)
$$ ##TITLE= Audit trail, TOPSPIN		Version 2.1
$$ ##JCAMPDX= 5.01
$$ ##ORIGIN= Bruker BioSpin GmbH
$$ ##OWNER= Administrator
$$ $$ E:\/data/COFFEE/nmr/AC1249_NSDAH12039_6945181_DXTpwpUtfk/20/pdata/1/auditp.txt
$$ ##AUDIT TRAIL=  $$ (NUMBER, WHEN, WHO, WHERE, PROCESS, VERSION, WHAT)
(   1,<2012-12-11 22:45:37.328 -0500>,<Administrator>,<X>,<go>,<TOPSPIN 2.1>,
      <created by zg
	started at 2012-12-11 22:44:30.766 -0500,
	POWCHK enabled, PULCHK disabled,
       configuration hash MD5:
       86 BA 57 50 F2 9D 5C 9B 26 00 A9 28 5F 66 2E 89
       data hash MD5: 64K
       E1 34 46 0E 73 DD D9 2A 03 82 F1 B5 51 01 FF BB>)
(   2,<2012-12-11 22:45:40.500 -0500>,<Administrator>,<X>,<proc1d>,<TOPSPIN 2.1>,
      <Start of raw data processing
       efp LB = 0 FT_mod = 6 PKNL = 1 PHC0 = 0 PHC1 = 0 SI = 32K 
       data hash MD5: 32K
       A8 4A E4 3B FB D1 C8 3C 1C 19 13 7A F8 F1 0A 3A>)
(   3,<2012-12-11 22:45:41.016 -0500>,<Administrator>,<X>,<proc1d>,<TOPSPIN 2.1>,
      <pk PHC0 = 97.09167 PHC1 = 0 
       data hash MD5: 32K
       18 43 79 1A 74 FF 61 55 8B 5B 2C C7 EE FB 3D EB>)
(   4,<2012-12-11 22:45:41.281 -0500>,<Administrator>,<X>,<proc1d>,<TOPSPIN 2.1>,
      <abs ABSG = 1 
       data hash MD5: 32K
       EA F0 47 35 3D 6E 99 73 54 A2 9C 03 87 F7 BC 04>)
(   5,<2012-12-11 22:45:41.437 -0500>,<Administrator>,<X>,<proc1d>,<TOPSPIN 2.1>,
      <abs ABSG = 2 
       data hash MD5: 32K
       15 19 8C CD 7C 1F A4 A0 FC CF 52 D8 B9 22 E7 E2>)
(   6,<2012-12-11 22:45:41.625 -0500>,<Administrator>,<X>,<proc1d>,<TOPSPIN 2.1>,
      <abs ABSG = 3 
       data hash MD5: 32K
       93 37 36 A8 F3 07 B5 08 66 62 07 2F 63 6A 29 D2>)
(   7,<2012-12-11 22:45:41.781 -0500>,<Administrator>,<X>,<proc1d>,<TOPSPIN 2.1>,
      <abs ABSG = 4 
       data hash MD5: 32K
       82 D2 02 30 7F 39 AE 7E 1E FC 57 2E 8C 56 7F D5>)
(   8,<2012-12-11 22:45:41.984 -0500>,<Administrator>,<X>,<proc1d>,<TOPSPIN 2.1>,
      <abs ABSG = 5 
       data hash MD5: 32K
       D2 4A 09 13 D0 B3 73 A7 C3 14 D8 5C 63 67 F4 39>)
$$ ##END=
$$ 
$$ $$ hash MD5
$$ $$ 05 CB 2C 7C B8 63 6E E8 AF 94 63 FA 2A DA 56 29
##$RELAX= 
##$RELAX= 
##$RELAX= 
##$RELAX= 
##$RELAX= 
##$RELAX= 
##$RELAX= 
##$RELAX= 
$$ Bruker specific parameters
$$ --------------------------
##$DU= <E:\>
##$EXPNO= 20
$$ [...]
##$TP= (0..7)
150 150 150 150 150 150 150 150
##$TP07= 0
##$TPNAME0= <>
##$TPNAME1= <>
##$TPNAME2= <>
##$TPNAME3= <>
##$TPNAME4= <>
##$TPNAME5= <>
##$TPNAME6= <>
##$TPNAME7= <>
##$TPOAL= (0..7)
0.5 0.5 0.5 0.5 0.5 0.5 0.5 0.5
##$TPOFFS= (0..7)
0 0 0 0 0 0 0 0
##$TUNHIN= 0
##$TUNHOUT= 0
##$TUNXOUT= 0
##$USERA1= <user>
##$USERA2= <user>
##$USERA3= <user>
##$USERA4= <user>
##$USERA5= <user>
##$V9= 5
##$VALIST= <valist>
##$VCLIST= <CCCCCCCCCCCCCCC>
##$VD= 0
##$VDLIST= <DDDDDDDDDDDDDDD>
##$VPLIST= <PPPPPPPPPPPPPPP>
##$VTLIST= <TTTTTTTTTTTTTTT>
##$WBST= 2048
##$WBSW= 25
##$XGAIN= (0..3)
0 0 0 0
##$XL= 0
##$YL= 0
##$YMAX_a= 642814
##$YMIN_a= -547850
##$ZGOPTNS= <>
##$ZL1= 120
##$ZL2= 120
##$ZL3= 120
##$ZL4= 120
##$ABSF1= 14.98509
##$ABSF2= -5.573092
##$ABSG= 5
##$ABSL= 3
##$ALPHA= 0
##$AQORDER= 0
##$ASSFAC= 0
##$ASSFACI= 0
##$ASSFACX= 0
##$ASSWID= 0
##$AUNMP= <proc_prof1d_extract_pilot.lims>
##$AXLEFT= 0
##$AXNAME= <>
##$AXNUC= <1H>
##$AXRIGHT= 0
##$AXTYPE= 0
##$AXUNIT= <>
##$AZFE= 0.1
##$AZFW= 0.1
##$BCFW= 0
##$BC_mod= 0
##$BYTORDP= 0
##$COROFFS= 0
##$CY= 15
##$DATMOD= 1
##$DC= 0
##$DFILT= <>
##$DTYPP= 0
##$F1P= 0
##$F2P= 0
##$FCOR= 0.5
##$FTSIZE= 32768
##$FT_mod= 6
##$GAMMA= 0
##$GB= 0
##$INTBC= 1
##$INTSCL= 1
##$ISEN= 128
##$LB= 0
##$LEV0= 0
##$LPBIN= 0
##$MAXI= 10000
##$MC2= 0
##$MEAN= 0
##$ME_mod= 0
##$MI= 0
##$NCOEF= 0
##$NC_proc= -8
##$NLEV= 6
##$NOISF1= 0
##$NOISF2= 0
##$NSP= 0
##$NTH_PI= 0
##$NZP= 0
##$OFFSET= 14.98509
##$PC= 1
##$PHC0= 97.09167
##$PHC1= 0
##$PH_mod= 1
##$PKNL= yes
##$PPARMOD= 0
##$PPDIAG= 0
##$PPIPTYP= 0
##$PPMPNUM= 2147483647
##$PPRESOL= 1
##$PSCAL= 4
##$PSIGN= 0
##$PYNMP= <proc.py>
##$REVERSE= no
##$SF= 400.02
##$SI= 32768
##$SIGF1= 0
##$SIGF2= 0
##$SINO= 400
##$SIOLD= 32768
##$SPECTYP= <>
##$SREGLST= <1H.CDCl3>
##$SSB= 0
##$STSI= 32768
##$STSR= 0
##$SW_p= 8223.68421052631
##$SYMM= 0
##$S_DEV= 0
##$TDeff= 65536
##$TDoff= 0
##$TI= <>
##$TILT= no
##$TM1= 0
##$TM2= 0
##$TOPLEV= 0
##$USERP1= <user>
##$USERP2= <user>
##$USERP3= <user>
##$USERP4= <user>
##$USERP5= <user>
##$WDW= 1
##$XDIM= 32768
##$YMAX_p= 480279210
##$YMIN_p= -836200
##$CURPLOT= <Network HP LaserJet P1505>
##$CURPRIN= <$Network HP LaserJet P1505>
##$DFORMAT= <normdp>
##$LAYOUT= <+/1D_H.xwp>
##$LFORMAT= <normlp>
##$PFORMAT= <normpl>
##$SURQMSG= 1
$$ End of Bruker specific parameters
$$ ---------------------------------
##NTUPLES= NMR SPECTRUM
##VAR_NAME=  FREQUENCY,     SPECTRUM/REAL,   SPECTRUM/IMAG
##SYMBOL=    X,             R,               I
##VAR_TYPE=  INDEPENDENT,   DEPENDENT,       DEPENDENT
##VAR_FORM=  AFFN,          ASDF,            ASDF
##VAR_DIM=   32768,         32768,           32768
##UNITS=     HZ,            ARBITRARY UNITS, ARBITRARY UNITS
##FACTOR=    0.250966925370066, 1,           1
##FIRST=     8223.43324360094, 150721,       -42499
##LAST=      0,             -157377,         1373
##MIN=       0,             -836200,         0
##MAX=       8223.43324360094, 480279210,    0
$$ Real data points
##PAGE= N=1
##DATA TABLE= (X++(R..R)), XYDATA
$$ [...]
19546a90236A54393e4291B960K19022e0054B177J50459b70760J08274a540A53909
$$ -190236 154393 -54291 2960 221982 -50054 2177 152636 -270760 -162486 -1540 153909
19534B23164a31965A6274a32765K378e7822g249k15283A54134b19135j5710f6834
$$ 223164 -131965 16274 -132765 -130387 -57822 -7249 -222532 154134 -219135 -234845 -66834
19522d2974H424b14768L4833o450G6584K63310i4653k55414b3384j86109J3522
$$ -42974 8424 -214768 -179935 -186385 76584 339894 -94653 -350067 -23384 -209493 -195971
19511a95971D05457H5063d22125a79359a6901A66755C1896i6653p2224F543b18861
$$ -195971 405457 85063 -422125 -179359 -16901 166755 31896 -96653 -168877 6543 -218861
19499c79302L2938H5125R7985a01664B13779C6603j3402i2689H8580b72533f3422
$$ -379302 -346364 85125 183110 -101664 213779 36603 23201 -92689 88580 -272533 -63422
19487A40110c65509H9597J46128c12784Q2076k6068p2614g2160A52105a06800
$$ 140110 -365509 89597 235725 -312784 -230708 -256776 -329390 -72160 152105 -106800
19476B5540a81148j63653j1219a1363j59337k870P8253b9486a4226A33207N4169
$$ 25540 -181148 -344801 -356020 -11363 -170700 -173570 -95317 -29486 -14226 133207 187376
19465A87376b44781A58964a53967j5893C12811g1698o2868K9942p717r7922O3833
$$ 187376 -244781 158964 -153967 -169860 312811 -71698 -134566 -104624 -112341 -210263 -146430
19454a46430A20988M4486d14833a7760j5459m23756A41712A0346R8202j8362a70044
$$ -146430 120988 165474 -414833 -17760 -33219 -456975 141712 10346 108548 90186 -170044
19442c16096i3642j15226f8193A97059b56931a260j51632d321C6240a56263C029
$$ -316096 -93642 -208868 -68193 197059 -256931 -1260 -152892 -4321 36240 -156263 3029
19430G2073A1133a69848q4447h8398a0347A58656B59b65796Q8161G4847B6281
$$ 72073 11133 -169848 -254295 -88398 -10347 158656 259 -265796 -177635 74847 26281
19418a46498a6860k20155B00320c48853a56563j2388n6777J06735j62284j607
$$ -146498 -16860 -237015 200320 -348853 -156563 -168951 -225728 -118993 -281277 -282884
19408b82884C27b37487C3735b04904B348a57781N1776b1898C5881e8434A71968
$$ -282884 327 -237487 33735 -204904 2348 -157781 -106005 -21898 35881 -58434 171968
19396B7117c26737J38176j82182J55600A19760h965D46044e009l1551g914C23077
$$ 27117 -326737 -188561 -370743 -215143 119760 -8965 446044 -5009 -36560 -7914 323077
19384c544j61723b7822A20369a2072l6904A15647O4503D8128L1795h8842A80875
$$ -3544 -165267 -27822 120369 -12072 -48976 115647 180150 48128 79923 -88842 180875
19372b4994k20100b6483b124D3127A2922K26820a01666j8982D59770a76714M3685
$$ -24994 -245094 -26483 -2124 43127 12922 239742 -101666 -120648 459770 -176714 -133029
19361a33029a7935k47674B0140g3202K1323A59444d61383D55462E3971K02178
$$ -133029 -17935 -265609 20140 -73202 -51879 159444 -461383 455462 53971 256149
19351B56149b00849A33071a29826a2183C3472a95681E697J66539b58239Q5979
$$ 256149 -200849 133071 -129826 -12183 33472 -195681 5697 172236 -258239 -172260
19341a72260b0542B42375b72488G7005a83544D4897i1839l3237p9665G617b7078
$$ -172260 -20542 242375 -272488 77005 -183544 44897 -91839 -125076 -204741 7617 -27078
19329A62935D1155J45245a48825L4133j01595A64315c13612f7037A25828a32176
$$ 162935 41155 186400 -148825 -114692 -216287 164315 -313612 -67037 125828 -132176
19318d9902p9206k6996O3059K1655j08904P9596K9659A2580g0815o2277j12049
$$ -49902 -129108 -156104 -93045 -71390 -180294 -100698 -71039 12580 -70815 -133092 -245141
19307b45141j82442g6899n0011B69157A8927e6075j98970M9303H5305B2301J19252
$$ -245141 -427583 -76899 -126910 269157 18927 -56075 -255045 -205742 85305 22301 141553
19296A41553d2320n6894j96155d5016A45533G706a67373j19965i2663B36442f8083
$$ 141553 -42320 -99214 -295369 -45016 145533 7706 -167373 -287338 -92663 236442 -68083
19284a13346j46502R7718F9061a55312j7712n1995l5053A2630J19548a01092o7247
$$ -113346 -259848 -162130 69061 -155312 -173024 -225019 -260072 12630 132178 -101092 -168339
19273a68339B71965h0875F7062a72808A44220b1990q4552A64617c90338a29005
$$ -168339 271965 -80875 67062 -172808 144220 -21990 -106542 164617 -390338 -129005
19262a48577O4758k52046J61158b0719m8262l00465a54318K0571J3585R354r2248
$$ -148577 -83819 -335865 -174707 -20719 -68981 -369446 -154318 -133747 -120162 -110808 -203056
19251b03056l7050h2850A63819b58197G4088A317a14836j2735C4996b01947A2912
$$ -203056 -240106 -82850 163819 -258197 74088 1317 -114836 -127571 34996 -201947 12912
19239b78070A51078a03820c3910E2803h284A38701d8946k49304a19434d8475k12196
$$ -278070 151078 -103820 -33910 52803 -8284 138701 -48946 -298250 -119434 -48475 -260671
19228b60671B38119F2647j6392a73557F8585a62174B44408e59215A93736G9469
$$ -260671 238119 62647 46255 -173557 68585 -162174 244408 -559215 193736 79469
19217a65469A1358b65604A00491c9603F0710J13715e9171C1505c39954C8057h9449
$$ -165469 11358 -265604 100491 -39603 60710 174425 -59171 31505 -339954 38057 -89449
19205a20720C745h6621H2759f1053g650a740k53597Q1563e3716k99572B98275
$$ -120720 3745 -86621 82759 -61053 -7650 -1740 -255337 -173774 -53716 -353288 298275
19193a11593B42432H5306b9436m782j9135E6059B269b77599a35288A50526a08997
$$ -111593 242432 85306 -29436 -34218 -53353 56059 2269 -277599 -135288 150526 -108997
19181d248p0632F85477a01939J0686l65904J19648a01768A14207a26150B98562
$$ -4248 -74880 685477 -101939 -91253 -457157 -337509 -101768 114207 -126150 298562
19170G7249M07379a76270P4424A11154a65481E5136a12319K30A8739b05198G172
$$ 77249 484628 -176270 -101846 111154 -165481 55136 -112319 -112089 18739 -205198 7172
19158A55693b2550B66069e9328j65197N3336D9367h6346k53033C96506b28126
$$ 155693 -22550 266069 -59328 -224525 -171189 49367 -86346 -339379 396506 -228126
19147f2189k00845a06376F8805N5269L1188d8262p4488A25324K27296a45784G4434
$$ -62189 -263034 -106376 68805 124074 155262 -48262 -122750 125324 352620 -145784 74434
19135C6291J40306D4135a83360M3500k58450J3787a39278A43402E4347L00236
$$ 36291 176597 44135 -183360 -139860 -398310 -384523 -139278 143402 54347 354583
19125C54583f6150A47768h3158K4364k30318J9443A19662a36738r5076A48685
$$ 354583 -66150 147768 -83158 -58794 -289112 -269669 119662 -136738 -231814 148685
19114b81579J28325f0034n8188F8034j0591i1461m9753c6446j32644r7474J00247
$$ -281579 -153254 -60034 -118222 68034 57443 -91461 -141214 -36446 -169090 -266564 -166317
19103a66317b9943j40616B38653J93473h5762C06756j41081b20434O7688b6157
$$ -166317 -29943 -170559 238653 432126 -85762 306756 165675 -220434 -152746 -26157
19092G1888A2533c4506A62498a4718B18098b3227k31014K8909A39597a99526Q6676
$$ 71888 12533 -34506 162498 -14718 218098 -23227 -254241 -225332 139597 -199526 -112850
19081a12850f59k29547a04220J0827b2690n6245c1510D1745a45876M8871l28118
$$ -112850 -659 -230206 -104220 -93393 -22690 -78935 -31510 41745 -145876 -97005 -425123
19070d25123J54619J02672O7183n8285A88227b12937A33327i1807G4347B8474
$$ -425123 -270504 -167832 -100649 -158934 188227 -212937 133327 -91807 74347 28474
19059D939J0200J65750j6518N2278n6719L8549b57145B02757E4838N4304d24136
$$ 4939 15139 180889 164371 216649 159930 198479 -257145 202757 54838 109142 -424136
19047C52376l1841C8728O4358C9722b10060a4173j14903l3009O3677b3861D08
$$ 352376 320535 38728 103086 39722 -210060 -14173 -129076 -162085 -98408 -23861 408
19035F0470B6705L308a29769A79532G1166J86286A14344M7447c7404B48800a79646
$$ 60470 26705 30013 -129769 179532 71166 257452 114344 161791 -37404 248800 -179646
19023c6484j8081A70606B6248A2238a50741G961a35699M6138c8502A1910b45599
$$ -36484 -54565 170606 26248 12238 -150741 7961 -135699 -89561 -38502 11910 -245599
19011E8096K488J17306J04161a22326n8945H3750a36446D4321e813o5341C5113
$$ 58096 60584 177890 282051 -122326 -181271 83750 -136446 44321 -5813 -71154 35113
18999b87367a9431q3386J1837J8800K9638B6307b95292i9756A71960F6870B6648
$$ -287367 -19431 -102817 -90980 -72180 -42542 26307 -295292 -99756 171960 66870 26648
18987A37795E0411a52034d3479j6226A88661n3037c8042j29460p116A09208a61593
$$ 137795 50411 -152034 -43479 -59705 188661 135624 -38042 -167502 -174618 109208 -161593
18975d9072M642j82246B23090e56214g2907N192K7990G7353a779F6361K06699
$$ -49072 -44430 -226676 223090 -556214 -72907 -67715 -39725 77353 -1779 66361 273060
18964B73060a74482A3663J19009f9685j49693H6927B303L8088a03363H1577c91775
$$ 273060 -174482 13663 132672 -69685 -219378 86927 2303 40391 -103363 81577 -391775
18952B60346a10718l1446O9730E7642B0671L25592b96432F6425b91269B28632
$$ 260346 -110718 -142164 -72434 57642 20671 346263 -296432 66425 -291269 228632
18941c96070a24725n0162b5003j69153i292A11193E385h1204G5930a3275j11227
$$ -396070 -124725 -174887 -25003 -194156 -9292 111193 5385 -81204 75930 -13275 -124502
18930a24502C8270c04657F8233i2955n2961D7527L0571c4267n6359F7455b01004
$$ -124502 38270 -304657 68233 -92955 -145916 47527 78098 -34267 -90626 67455 -201004
18918c03154i511H4130a98800I1299b34916A76728B2405b25803j42560B3776b71825
$$ -303154 -9511 84130 -198800 91299 -234916 176728 22405 -225803 -368363 23776 -271825
18906a88614H825a10079j27388A44846b4991j06746p1700N9045c4812A19814i1338
$$ -188614 8825 -110079 -237467 144846 -24991 -131737 -203437 -144392 -34812 119814 -91338
18894A3454K29874D6244g1125G0108a01316L1373A8224c35765a4290p7706A60164
$$ 13454 243328 46244 -71125 70108 -101316 -69943 18224 -335765 -14290 -91996 160164
18882G8188a33702f437r9727r4856A35655k6311A1616K3975I178g1976r3106D3599
$$ 78188 -133702 -6437 -106164 -201020 135655 109344 11616 35591 9178 -71976 -165082 43599
18869a35373A0263a08361j62805B06502D7334e1707B32905i7781A96208e7863
$$ -135373 10263 -108361 -271166 206502 47334 -51707 232905 -97781 196208 -57863
18858I1498N0337a27787d362G0030h2862k64052D3724K51798a3714l0136A26177
$$ 91498 141835 -127787 -4362 70030 -82862 -346914 43724 295522 -13714 -43850 126177
18846a16341d9790B072a13114d7237j55987J00877L4689p7480C725c21304a095
$$ -116341 -49790 2072 -113114 -47237 -203224 -102347 -67658 -145138 3725 -321304 -1095
18834A24102J0186c60230h4965J4571B02652a53149L4463e49l95756D84145e8973
$$ 124102 134288 -360230 -84965 -70394 202652 -153149 -118686 -549 -396305 484145 -58973
18822a05988c6471C47605j23201j09317d5781l2354p2928I3187J48044p6434L5562
$$ -105988 -36471 347605 224404 115087 -45781 -78135 -151063 93187 241231 164797 200359
18811B00359J75752H244N3782K66764j31973j3174h9295A11981d3519E6285a62344
$$ 200359 376111 8244 62026 328790 196817 183643 -89295 111981 -43519 56285 -162344
18799B18574b02753j2772C9407J63809a20409q0324N41b9931B90422j42424f041
$$ 218574 -202753 -215525 39407 203216 -120409 -200733 -200192 -29931 290422 147998 -6041
18787b96351a07970B19156a19546r284A33439L4936a19337j14960D93641B15610
$$ -296351 -107970 219156 -119546 -128830 133439 168375 -119337 -234297 493641 215610
18776a72576O2623j81270R7651P6337K3617A70939b17558j6072j51060L7523H065
$$ -172576 -109953 -291223 -193572 -117235 -93618 170939 -217558 -233630 -384690 -347167 8065
18764A10834K77568j88851a60023o1490H1020a96168m0125c4573k00467B85694
$$ 110834 388402 199551 -160023 -221513 81020 -196168 -236293 -34573 -235040 285694
18753F0715b06380j04320b7681A09562a88205N1057J1642k3967K9630B67133C9530
$$ 60715 -206380 -310700 -27681 109562 -188205 -137148 -125506 -149473 -119843 267133 39530
18741a63274p2428B96612a76775c8906l52428A45552b3956E0058c50655O1741
$$ -163274 -235702 296612 -176775 -38906 -391334 145552 -23956 50058 -350655 -288914
18731b88914C5352A3304d72166a57019j21454A1001K714d7261E3959B37f4231
$$ -288914 35352 13304 -472166 -157019 -278473 11001 13715 -47261 53959 237 -64231
18719b90379L2586C3127h4125j16171R5208J275k6616A33032E5342b145B37307
$$ -290379 -257793 33127 -84125 -200296 -105088 -103813 -130429 133032 55342 -2145 237307
18707A36623c95616a6208A59785e36927a59596L6759j62153a34344A24794J96341
$$ 136623 -395616 -16208 159785 -536927 -159596 -122837 -284990 -134344 124794 321135
18697C21135D5688c83652A0438h2098A65104a17898B60449q2407P1583b62306
$$ 321135 45688 -383652 10438 -82098 165104 -117898 260449 178042 249625 -262306
18686a67806A05151b94120b4988j35334C5126c57444i3644p4147N9579b5407j16971
$$ -167806 105151 -294120 -24988 -160322 35126 -357444 -93644 -167791 -108212 -25407 -142378
18675a42378q2897L9759f1516A77901f5065j14403N9741a4263j02268e7258B18654
$$ -142378 -225275 -185516 -61516 177901 -65065 -179468 -119727 -14263 -116531 -57258 218654
18663a34291O5280o8878A0093J61918d0807A30012a16241C1138J600Q5637n7185
$$ -134291 -69011 -137889 10093 172011 -40807 130012 -116241 31138 32738 118375 61190
18652F1190a12530k6386B11796E3818J12959e8797G5623m491b47754c9975a6886
$$ 61190 -112530 -138916 211796 53818 166777 -58797 75623 71132 -247754 -39975 -16886
18640b0936j74485n7422E066a11010j88326M3875N4265h3015C0260J53615b15072
$$ -20936 -195421 -252843 5066 -111010 -299336 -255461 -201196 -83015 30260 183875 -215072
18628g3555A67479b46368i3921F3094A929a37380C6706O5036c72291F0743a82921
$$ -73555 167479 -246368 -93921 63094 1929 -137380 36706 101742 -372291 60743 -182921
18616a13194L4197j61290J8762Q5208j37070D7932b49591c7048l5944r9448A31481
$$ -113194 -78997 -240287 -221525 -136317 -273387 47932 -249591 -37048 -72992 -172440 131481
18604a81353j22073A19657J61287J00250G1938g8082A54319c71339B371d0121
$$ -181353 -303426 119657 280944 381194 71938 -78082 154319 -371339 2371 -40121
18593b6432A68819A3728f3557k91490c2753l2883k59734a02822a1231l87168A7391
$$ -26432 168819 13728 -63557 -355047 -32753 -65636 -325370 -102822 -11231 -398399 17391
18581a18589j67020a6995k41961B75814D3592f3337m7249A7106h6927G5933b36255
$$ -118589 -285609 -16995 -258956 275814 43592 -63337 -110586 17106 -86927 75933 -236255
18569a45633j06384A5670b74830J03606m1983N0700D4125A4822J94931a05301
$$ -145633 -252017 15670 -274830 -171224 -213207 -162507 44125 14822 209753 -105301
18558g9925j21594A19368M21486A38865g0787J5687j5042k38094B6910b86321
$$ -79925 -201519 119368 540854 138865 -70787 -55100 -70142 -308236 26910 -286321
18547B67137I8887a29335J4789I5739N3741d6927j75817p2919A84972a63836j51101
$$ 267137 98887 -129335 -114546 95739 149480 -46927 -222744 -295663 184972 -163836 -314937
18536c14937C01798a46845B21982a53368L453l3967A00902R443a75952L2444J1259
$$ -314937 301798 -146845 221982 -153368 -149915 -183882 100902 110345 -175952 -143508 -132249
18525a32249A64132G2387a85847j08831b1459j67118j81782B33033d1474l260
$$ -132249 164132 72387 -185847 -294678 -21459 -188577 -370359 233033 -41474 -44734
18515d4734B34777c9064B60803A12846a79816j37666a10716A19619P0558k1224
$$ -44734 234777 -39064 260803 112846 -179816 -317482 -110716 119619 190177 168953
18505A68953A2569b80720b3286C09523a7366k64062A21949J19916Q849B3964a82058
$$ 168953 12569 -280720 -23286 309523 -17366 -281428 121949 241865 250714 23964 -182058
18493a4317j17949A91464h7106L9381R08j53060F8828l3477J14305b8022C65235
$$ -14317 -132266 191464 -87106 -47725 -46817 -199877 68828 35351 149656 -28022 365235
18481B08476J26298I0124a60103j23598A30292c22759g0052A58480D8220a27228
$$ 208476 334774 90124 -160103 -283701 130292 -322759 -70052 158480 48220 -127228
18470b61516j06117B6670b84369A6349c15850H6900i3693k0692C12979c7151K184
$$ -261516 -367633 26670 -284369 16349 -315850 86900 -93693 -114385 312979 -37151 -34967
18459c4967l25619A73647a77214b7324l0881G4410c1117q2112k06823l2329A13968
$$ -34967 -360586 173647 -177214 -27324 -58205 74410 -31117 -113229 -320052 -352381 113968
18447f335j68030C5668K56290g3588E0937i40k36786g9144k4674E7908d24279
$$ -6335 -174365 35668 291958 -73588 50937 -940 -237726 -79144 -103818 57908 -424279
18435b52402m189H2828d29427a33381B28057p105d6861N359B01901b87900a04273
$$ -252402 -256591 82828 -429427 -133381 228057 220952 -46861 -41502 201901 -287900 -104273
18423a20335O892G6003c01408F1528b52145F5943K7545b61730c3072A36697b84555
$$ -120335 -113443 76003 -301408 61528 -252145 65943 93488 -261730 -33072 136697 -284555
18411I932b61301J01040f9965C43958c5763C07386b9836m2666k31877A8998J35186
$$ 9932 -261301 -160261 -69965 343958 -35763 307386 -29836 -72502 -304379 18998 154184
18400A54184a7031A58837a04806Ii7874A6971K07740g00675E3605e3021j20488
$$ 154184 -17031 158837 -104806 9 -97874 16971 224711 -700675 53605 -53021 -173509
18389a73509B65578a4460A33881h218A24936a92713r7886A27515h7924C51336
$$ -173509 265578 -14460 133881 -8218 124936 -192713 -290599 127515 -87924 351336
18378C15971c4990j99478M415g0547n5289D9983J45167a43753j22420B70642E8696
$$ 315971 -34990 -234468 -230053 -70547 -125836 49983 195150 -143753 -266173 270642 58696
18366H5700R6784c6552B70894B3361c7058k28020F8485b39835f4770C87567A00259
$$ 85700 182484 -36552 270894 23361 -37058 -265078 68485 -239835 -64770 387567 100259
18354B98747A28118a74787g8432o4059f2783o6641A97627d6376F5798A9529a94456
$$ 298747 128118 -174787 -78432 -142491 -62783 -129424 197627 -46376 65798 19529 -194456
18342b6058l72840a1246A471a40174N4355n5768l560A12541d81180a87884Q8641
$$ -26058 -398898 -11246 1471 -140174 -85819 -141587 -145147 112541 -481180 -187884 -99243
18331i9243C09764A14470e9866A36138b4188C10319b2249l13868a5342j25790
$$ -99243 309764 114470 -59866 136138 -24188 310319 -22249 -336117 -15342 -141132
18321a41132L8667F9283l704i199B03786G1515K6423b78646O5775k8844j5140
$$ -141132 -102465 69283 65579 -9199 203786 71515 97938 -278646 -212871 -241715 -256855
18310b56855e2746o3914A85893q9181c63030I2195f4542q5114G7211b17713h3388
$$ -256855 -52746 -116660 185893 96712 -363030 92195 -64542 -149656 77211 -217713 -83388
18298h8064A59046c42187a14676C0848h4193m3447m2519g1258j18476A95764I3213
$$ -88064 159046 -342187 -114676 30848 -84193 -127640 -170159 -71258 -189734 195764 93213
18286a84350c309n8586j12678O593B3697g6928D6260a72109B12366b9530j48472
$$ -184350 -3309 -61895 -174573 -167980 23697 -76928 46260 -172109 212366 -29530 -178002
18275a78002M5559e2163l87354c8039B5935a04785k01538A6803L8919K20119i9627
$$ -178002 -132443 -52163 -439517 -38039 25935 -104785 -306323 16803 55722 275841 -99627
18263d67515A39196K01186A64380j21a12276B78203d70534J1294b01314L0487
$$ -467515 139196 340382 164380 164259 -112276 278203 -470534 -459240 -201314 -170827
18253a70827g9540k7840l58203K18892C47303I6524B0861N4514J70648k5134b0841
$$ -170827 -79540 -107380 -465583 -246691 347303 96524 20861 75375 246023 220889 -20841
18241B05328B2539a48575A25387a38240B30523q1564p2943a61763L1900A05710
$$ 205328 22539 -148575 125387 -138240 230523 148959 76016 -161763 -129863 105710
18230f5350D7274a35171p4992C08739A25000b44277B57295a36075j52380Q2849
$$ -65350 47274 -135171 -210163 308739 125000 -244277 257295 -136075 -288455 -205606
18220b05606A67938G614b08285R6493j17889a8953m2602m56o1490C8562K21621
$$ -205606 167938 7614 -208285 -111792 -229681 -18953 -61555 -62011 -123501 38562 260183
18209B60183b36194o5603J26275G6211A8130a5688C33515a00775J9957r4817l13555
$$ 260183 -236194 -301797 -175522 76211 18130 -15688 333515 -100775 -80818 -175635 -489190
18198d89190e341A48410b61539n485c5314j76635P3428F6205b59294P0383E6507
$$ -489190 -5341 148410 -261539 -267024 -35314 -211949 -138521 66205 -259294 -188911 56507
18186c36991N8374i8913A42278J4557j7007f2611l5357G9307b28396A58899b48311
$$ -336991 -278617 -98913 142278 156835 139828 -62611 -97968 79307 -228396 158899 -248311
18174B70720l056L260a01446F72b8809B3862b00286B14675A00333b77380i4256
$$ 270720 267664 270924 -101446 672 -28809 23862 -200286 214675 100333 -277380 -94256
18162a45069B50116b30864O4012H8973h7884j08397B0109a29942I8776j5055e7926
$$ -145069 250116 -230864 -166852 88973 -87884 -196281 20109 -129942 98776 83721 -57926
18150d18887J95913C01863A5027b2081G2420b69072J13323e2004A22960a58295
$$ -418887 -222974 301863 15027 -22081 72420 -269072 -155749 -52004 122960 -158295
18139A75543e4426C03995a53022j12051D38132I7778C5154L9103d6361a1459D4113
$$ 175543 -54426 303995 -153022 -265073 438132 97778 35154 74257 -46361 -11459 44113
18127a49235O7600k64028J14936f8367j93875a20837A33614K05447A43588C8784
$$ -149235 -81635 -345663 -230727 -68367 -262242 -120837 133614 339061 143588 38784
18116A88484b5259A33819N1614B3912b3490A70240L5693c50412e6376k46975f260
$$ 188484 -25259 133819 185433 23912 -23490 170240 205933 -350412 -56376 -303351 -6260
18104d7416A71367M8938j05698M6316b22310l8844i426K751A73119H2204c01778
$$ -47416 171367 220305 114607 160923 -222310 -261154 -9426 -6675 173119 82204 -301778
18092a0351k9440B24234i0722C33191E1845i8257B0113g0106A3673J99985c25058
$$ -10351 -39791 224234 -90722 333191 51845 -98257 20113 -70106 13673 213658 -325058
18080D7247M1374C8373J06012b36699A36812i6105A148a12577D7285J95222b28376
$$ 47247 88621 38373 144385 -236699 136812 -96105 1148 -112577 47285 242507 -228376
18068b9301j01713e1490M929B2267L67922i2618I5334a32013F1440a93340J0388
$$ -29301 -131014 -51490 -46561 22267 390189 -92618 95334 -132013 61440 -193340 -182952
18057a82952L7081A90624c08908H2393J03183d2345B1053b04046i5117o4515d7519
$$ -182952 -145871 190624 -308908 82393 185576 -42345 21053 -204046 -95117 -159632 -47519
18045F8598c0666k4152q0431k5859D5657L3563K60670c07256a43114I867a22079
$$ 68598 -30666 -54818 -135249 -161108 45657 79220 339890 -307256 -143114 9867 -122079
18033A1461c18298J13738L9228B14949I7424c6907m0249A50452b31548O9190N5892
$$ 11461 -318298 -204560 -165332 214949 97424 -36907 -77156 150452 -231548 -162358 -106466
18022a06466k25382a01156j7964A812J4454J80118A0425M2120b3546r1255k6884
$$ -106466 -331848 -101156 -119120 1812 16266 196384 10425 52545 -23546 -114801 -141685
18011a41685k1821K5200A40452M2239F2160L15889A72801b8307F8343K38457b66944
$$ -141685 -163506 -138306 140452 182691 62160 378049 172801 -28307 68343 306800 -266944
17999C9318N8329c2638j02308d6652C2826c9288E6332a45144j36886P7777a3141
$$ 39318 97647 -32638 -134946 -46652 32826 -39288 56332 -145144 -282030 -204253 -13141
17987b13012A28020a94477A73644c32187H0508i6713I5679a87095B73961H1575
$$ -213012 128020 -194477 173644 -332187 80508 -96713 95679 -187095 273961 81575
17976C37114C431L76302a43332o4858o696l2304A86266b0945A08619c39521J9277
$$ 337114 3431 379733 -143332 -208190 -214886 -247190 186266 -20945 108619 -339521 -320244
17965c20244i9533m2698C80807I3900C9236a48795N8417A08800N8031b21638d3733
$$ -320244 -99533 -142231 380807 93900 39236 -148795 -90378 108800 166831 -221638 -43733
17953a08040o3007h1873a3070F7590A9692M12541j92982r1954a24873n119a944
$$ -108040 -171047 -81873 -13070 67590 19692 432233 239251 147297 -124873 -129992 -1944
17941E933K01191j6680E4089O8753n2123J30920n1720n6187a16764D9043a8399
$$ 5933 207124 190444 54089 122842 70719 201639 149919 93732 -116764 49043 -18399
17929b78187A81571K46902d2350l0482F25666a36379N3987a4325j78861A42534
$$ -278187 181571 428473 -42350 -72832 625666 -136379 -82392 -14325 -193186 142534
17918h2472L6938C19587j58089E3742a13888b6984G5289b10180G7305B0687d3674
$$ -82472 -45534 319587 161498 53742 -113888 -26984 75289 -210180 77305 20687 -43674
17906A60332a52521D6564b01616e3339r3746k5577L9274o8323j31626A63584c50177
$$ 160332 -152521 46564 -201616 -53339 -147085 -172662 -133388 -201711 -333337 163584 -350177
17894a59714e2273P121j82195j03978A45331a96529M5781f5945j37245F6389J56015
$$ -159714 -52273 -45152 -227347 -331325 145331 -196529 -150748 -65945 -203190 66389 222404
17883B22404B9994K25814J34701C9758a36433A21213e3687J7816l7880C560L1365
$$ 222404 29994 255808 390509 39758 -136433 121213 -53687 -35871 -73751 3560 34925
17872C4925b6968G300B301a37930B17366b56569b736k48030D1261P9805c23410
$$ 34925 -26968 7300 2301 -137930 217366 -256569 -2736 -250766 41261 121066 -323410
17860e5987f58k48922C3392a29129B2571e8879C1427a87010A68274b51135l956
$$ -55987 -658 -249580 33392 -129129 22571 -58879 31427 -187010 168274 -251135 -255091
17849b55091E734J5454q809J78376a44311M868C6316K96992a0008A426b61730
$$ -255091 5734 21188 12379 190755 -144311 -139443 36316 333308 -10008 1426 -261730
17837G1350L0509N3109a12401j02512K0846A4868a01352I7300m718c8093A45882
$$ 71350 101859 154968 -112401 -214913 -194067 14868 -101352 97300 92582 -38093 145882
17825e04980K08260O4974d6951A51470a98731A59418D5689b34644B18578b24884
$$ -504980 -296720 -231746 -46951 151470 -198731 159418 45689 -234644 218578 -224884
17814a96072C665b58598A75464a35195K9177r236l2444o049E9190b11720c2378
$$ -196072 3665 -258598 175464 -135195 -106018 -115254 -147698 -153747 59190 -211720 -32378
17802a21624D5586b40343A73745a46937C79718h9278L2431A18323a07937A30656
$$ -121624 45586 -240343 173745 -146937 379718 -89278 -56847 118323 -107937 130656
17791b93017D466c82722G8966K6591e0994A23663i7332B05811m0775c2267A41504
$$ -293017 4466 -382722 78966 105557 -50994 123663 -97332 205811 165036 -32267 141504
17779E797g6227k82639J78075B2402M4212b71744J27655f4988b871B36070a3140
$$ 5797 -76227 -358866 -180791 22402 66614 -271744 -144089 -64988 -2871 236070 -13140
17767C21430c828j76230L4763n67J415I0217J27206c16915C22314C458J21766
$$ 321430 -3828 -180058 -145295 -145862 -144447 90217 217423 -316915 322314 3458 125224
17756A25224B4421a93660h5262j40893B28952d14982h1164m5536A45332g3891
$$ 125224 24421 -193660 -85262 -226155 228952 -414982 -81164 -126700 145332 -73891
17745A59371D979J42667g3925B88262a18414C05716B4642d19949J59589A39209
$$ 159371 4979 147646 -73925 288262 -118414 305716 24642 -419949 -260360 139209
17734c8642k5614I1934c60090I4439A9285K30300L8777B1467J00451L8564b79913
$$ -38642 -64256 91934 -360090 94439 19285 249585 288362 21467 121918 160482 -279913
17722f529D525a49697A20459M1880G4554f5167F2838P5572C4749J40070j9347
$$ -6529 4525 -149697 120459 162339 74554 -65167 62838 138410 34749 174819 155472
17711A55472Q4011j15438e2208C7106J64515I1633a90969h7210C76862j39992
$$ 155472 239483 124045 -52208 37106 201621 91633 -190969 -87210 376862 236870
17701B36870a74046A30506i6721j10662A30626a94703D05613A79089a823H9688
$$ 236870 -174046 130506 -96721 -207383 130626 -194703 405613 179089 -1823 89688
17690D7391R6238f6898A46631b47316e2161k83315B14403J134B1057K65500E8907
$$ 47391 143629 -66898 146631 -247316 -52161 -335476 214403 215537 21057 286557 58907
17678H9123a40841j12705g6042a9882B24162A4409b6325G6961a24075A69362b78163
$$ 89123 -140841 -253546 -76042 -19882 224162 14409 -26325 76961 -124075 169362 -278163
17666A71576i1247F4462N2361a16893G7139L2641a39926F9102c8529A26175J88230
$$ 171576 -91247 64462 116823 -116893 77139 109780 -139926 69102 -38529 126175 314405
17655C14405j51378e2022C13874d9495p7296C35976A7745J13487H133i1834j31194
$$ 314405 163027 -52022 313874 -49495 -126791 335976 17745 131232 8133 -91834 -223028
17644b23028O5091A49187J68612j38941a40876j74752G878a59651r4125e3721
$$ -223028 -157937 149187 317799 178858 -140876 -315628 7878 -159651 -253776 -53721
17633b99801E1081J46717a68744D2799b23715C68458D6050b02541B64378j27313
$$ -299801 51081 197798 -168744 42799 -223715 368458 46050 -202541 264378 137065
17623A37065J18540I1604R8789D9297a32452D16199I0664N787M42060e6264A09823
$$ 137065 255605 91604 190393 49297 -132452 416199 90664 96451 538511 -56264 109823
17611c3371A45608a09479A14753C8076J89631g2201a5975F2008J40835B7753K18194
$$ -33371 145608 -109479 114753 38076 227707 -72201 -15975 62008 202843 27753 245947
17600B45947R6558c76168J48732M4237F09a9782D2513O0645d8939E9328J20624
$$ 245947 342505 -376168 -227436 -183199 609 -19782 42513 103158 -48939 59328 179952
17589A79952m5090h687j30500G8386K15715a73388C44074f8959A99858i9134j47661
$$ 179952 134862 -8687 -139187 78386 294101 -173388 344074 -68959 199858 -99134 -246795
17578b46795j97333E4032L6165k7003g924B81847d1904A78649P2982F0754J7510
$$ -246795 -444128 54032 90197 63194 -7924 281847 -41904 178649 251631 60754 78264
17567G8264J53450j15642a90690K9320A92092l817l3785l8899C5380J47501o9658
$$ 78264 231714 116072 -190690 -161370 192092 188275 154490 115591 35380 182881 113223
17556A13223j3150J0004i0649E3585i6256j82160B24071a95449E0820K92980A23532
$$ 113223 100073 110077 -90649 53585 -96256 -278416 224071 -195449 50820 343800 123532
17544g1275B9388K05599H0394J89469c3134E1991R9593g373A46178j8513O0181
$$ -71275 29388 234987 80394 269863 -33134 51991 151584 -7373 146178 127665 187846
17533A87846E4349K21269b8214J1515B52625n6068J12696J05904I7282a21233
$$ 187846 54349 275618 -28214 -16699 252625 196557 309253 415157 97282 -121233
17522A41705d40A44643j0314a52457E42321a78577n4560b5410J990A02106k6718
$$ 141705 -440 144643 134329 -152457 542321 -178577 -233137 -25410 -23420 102106 75388
17511G5388J88729j19271b8134H4330Q2329a33569F2402K27869m9931A16105b09947
$$ 75388 264117 144846 -28134 84330 166659 -133569 62402 290271 240340 116105 -209947
17499C25136A08907j0627M246a34784B66965a7446C97562j81369a97599C37030
$$ 325136 108907 98280 102526 -134784 266965 -17446 397562 216193 -197599 337030
17488a00032C18002A09584J28784K18525j75583a84040d1650k3324D11948P225
$$ -100032 318002 109584 238368 456893 281310 -184040 -41650 -64974 411948 419173
17478D19173h9338B67098l6963J0256L2800E6099d0517H6013J15053n3243N1885
$$ 419173 -89338 267098 230135 240391 273191 56099 -40517 86013 201066 147823 199708
17467A99708m3181O9514C7593J78947E2669M73228a02349B4936g9288I8576a8658
$$ 199708 156527 226041 37593 216540 52669 525897 -102349 24936 -79288 98576 -18658
17455A45651B0804L32901A61242B0503b88600C56311A73399a01524B78918A00241
$$ 145651 20804 353705 161242 20503 -288600 356311 173399 -101524 278918 100241
17444A43818J87413H8328K48670j56637J0990a68973B59305J63286j97372J40703
$$ 143818 331231 88328 336998 180361 191351 -168973 259305 422591 225219 365922
17434C65922q3719R0326A28829J60056l0250j5996j11855O418K15140f3999E22959
$$ 365922 282203 372529 128829 288885 258635 242639 130784 137202 352342 -63999 522959
17422A24480J48655K2408B8314J72178C3337J80318p9534O61089B22353O7385
$$ 124480 273135 295543 28314 200492 33337 213655 134121 795210 222353 289738
17412B89738n6863N3480P8358H9820O8075g157m9870a0544C28848j29340a22257
$$ 289738 232875 286355 364713 89820 157895 -7157 -57027 -10544 328848 199508 -122257
17400A25524i4668d4727A51837A8386e3306A31562J20080J76424B11118K82534
$$ 125524 -94668 -44727 151837 18386 -53306 131562 251642 428066 211118 493652
17390D93652G6041P0227k131K87968j58140H0091L11201J29103d1923C39933a18454
$$ 493652 76041 146268 144137 432105 273965 80091 391292 520395 -41923 339933 -118454
17378d5755J147A44460Q6454d5961C04006f9168C95039n6314r3201r0575J55158
$$ -45755 -44608 144460 230914 -45961 304006 -69168 395039 338725 245524 154949 310107
17367C10107q815K08953j25632j9880i7829B41337h692j3639B64116J6068j11347
$$ 310107 301292 510245 384613 364733 -97829 241337 -8692 -22331 264116 280184 168837
17356A68837a68769B21044j2134n2601o1756J61929I7786A934J46952A3403J60010
$$ 168837 -168769 221044 208910 156309 94553 256482 97786 1934 148886 13403 173413
17345A73413J01880D4881N6494b3258G1296K84557j8809f6742k8135b9791B71837
$$ 173413 275293 44881 101375 -23258 71296 355853 337044 -66742 -94877 -29791 271837
17333b32772B54074A26298K89607a66132A0881M09678d43258a13571C16402J25357
$$ -232772 254074 126298 415905 -166132 10881 420559 -443258 -113571 316402 441759
17323D41759e8077K7960r2479n9457B58825R4380n6175F9197Q277L59911j85903
$$ 441759 -58077 -30117 -122596 -182053 258825 353205 297030 69197 77474 437385 251482
17312B51482J52503A12215K6584k4129J76034a46041B14662k2974a16383I507
$$ 251482 403985 112215 138799 114670 290704 -146041 214662 191688 -116383 9507
17301A17519A7903L9011K23800I8620C4612g8084B10018R2892E6536O2414J39411
$$ 117519 17903 56914 280714 98620 34612 -78084 210018 302910 56536 118950 258361
17290B58361H4904N7615B8881J57868J01143h6524A60000K20019q6750A43492
$$ 258361 84904 142519 28881 186749 287892 -86524 160000 380019 293269 143492
17279B20442J46465E0508a94434H2075K32919A22119m0434O5271J43262J74059
$$ 220442 366907 50508 -194434 82075 314994 122119 81685 146956 290218 464277
17269D64277B1029J84392B1863L1571b53010C14500k796A16784K16415C3354J22405
$$ 464277 21029 205421 21863 53434 -253010 314500 311704 116784 333199 33354 155759
17258A55759K98381J95118H5664K5224O1903m0449e9594B93908D3076J35766l8003
$$ 155759 454140 649258 85664 110888 172791 132342 -59594 293908 43076 178842 140839
17247A40839R2445M9647r3556r4313J37006J82076H8664k9460f4352A02791J91886
$$ 140839 233284 282931 189375 95062 232068 414144 88664 59204 -64352 102791 294677
17236B94677K04408j41250N779e402A50882J21820J11682K4098j67085A02212
$$ 294677 499085 357835 363614 -5402 150882 272702 384384 408482 241397 102212
17225A08055L44730j13930A05696J34481N0424J31479J8535j24848A05414K2086
$$ 108055 452785 338855 105696 240177 290601 422080 440615 315767 105414 127500
17215A27500M07209a24197D51196j73384J43362A97128K07590f2663A61948g2740
$$ 127500 534709 -124197 451196 277812 421174 197128 404718 -62663 161948 -72740
17204D37278K08001A71974L84371o2301B29951l0402J09047C727K45512M1522
$$ 437278 645279 171974 556345 494044 229951 199549 308596 3727 249239 290761
17194B90761p9759J12302A35825J78210K4181o5930n9601i7495A36753n4322K60647
$$ 290761 211002 323304 135825 314035 338216 272286 212685 -97495 136753 82431 343078
17183C43078F4768K70449p8511r0005O0982K87804A32786R1806O164J67800J68064
$$ 343078 64768 335217 256706 166701 227683 515487 132786 224592 230756 398556 566620
17172E66620F3322J62192n3778n077K02000j70440K5283I0510M80944k62811K91634
$$ 566620 63322 225514 171736 166659 368659 198219 223502 90510 571454 308643 600277
17161F00277k96703m9092n2904K14073N9632k08465j00850O37799l86535j01229
$$ 600277 303574 254482 201578 415651 475283 266818 165968 803767 417232 316003
17151C16003N3506M9688A76213K34576j096j47506C60M14260J60579k18294E7127
$$ 316003 369509 419197 176213 410789 409693 262187 360 414620 575199 356905 57127
17139A94927K8353J69280j82528J66825j48891a299C34216n2747J29035R0650
$$ 194927 223280 392560 210032 376857 227966 -1299 334216 281469 410504 501154
17129E01154B40076P2491M56341C47538m8771p3683K50046p2172J67596k30054
$$ 501154 240076 312567 768908 347538 298767 225084 475130 402958 570554 340500
17119C40500L76777k04657j89382J17938k14468j4713L53226n1554A71738L64023
$$ 340500 717277 512620 323238 441176 226708 211995 565221 513667 171738 535761
17109E35761j40802j39926K43191j67167Q2457A36830L68244A77456C3695K99709
$$ 535761 394959 255033 498224 331057 413514 136830 505074 177456 33695 333404
17099C33404j3965N0208p477K35125j58824R3858J18402j07356N0324k03996m7568
$$ 333404 319439 369647 362170 597295 438471 532329 650731 543375 593699 389703 342135
17088C42135K23749j15089Q5380k06409J02787j9434O4696j67570K271r081J11123
$$ 342135 565884 450795 536175 329766 432553 413119 477815 310245 312516 303435 414558
17077D14558E3743M38429j91369K91009M5573k35115M53753l67440k952R229J10592
$$ 414558 53743 492172 300803 591812 637385 402270 856023 488583 485631 494860 605452
17066F05452P0463k76385l6711J56816j16860O042j32832J52711l9588P0604K74096
$$ 605452 675915 399530 362819 519635 402775 408817 275985 428696 389108 459712 733808
17055G33808C31676L34874J50998l69879J90979B88630K60752k1709b0286H89908
$$ 733808 331676 666550 817548 447669 638648 288630 549382 527673 -20286 889908
17044F30970J1363M3627K49592l05504P5099J16922J26926D58339K11079j92829
$$ 630970 642333 685960 935552 630048 705147 822069 948995 458339 669418 476589
17034D76589J16536B63688K50921K24821K18821k48541p8635P2076l32614K67947
$$ 476589 593125 263688 514609 739430 958251 709710 631075 703151 370537 638484
17024F38484O2411J18384j85600o5708M31130k61917L4849K76910j74037C13334
$$ 638484 700895 819279 633679 567971 999101 737184 772033 1048943 874906 313334
17013G63504j21519J27634Q257r9279J485K14681k90400L19519l97078L69692
$$ 763504 641985 769619 777876 678597 680082 894763 604363 923882 526804 896496
17003H96496j74998l9199L82032m42238K25514j23731J17790P3417Q773l19250
$$ 896496 721498 682299 1064331 622093 847607 723876 841666 915083 923856 604606
16993F04606J96472m8675Q5314O5520p9559k09030K57912P6499l30110J37371
$$ 604606 801078 752403 837717 903237 823678 614648 872560 949059 618949 756320
16983G56320K66020l21395K68796l9794P0546k72359J2326L31840J17145m96526
$$ 756320 1022340 700945 969741 929947 1000493 728134 740460 1072300 1189445 692919
16973F92919K59633l37430L23200j97009M02025O848j88689K5496J33798J96766
$$ 692919 952552 615122 938322 741313 1143338 1150186 961497 986993 1120791 1317557
16963A317557l29929J81850n19994M37572R019J72580l65397R0115m772K52375
$$ 1317557 987628 1169478 649484 1087056 1096075 1268655 903258 993373 988601 1240976
16953A240976k03962L7705R5973k38992L27367l64156k3983M65906o9913j03528
$$ 1240976 1037014 1074719 1170692 931700 1259067 894911 870928 1336834 1266921 1163393
16943A163393J6712o3935J14020J17744l51990L1496L40390j7645M5480j66157
$$ 1163393 1180105 1116170 1230190 1347934 995944 1027440 1367830 1350185 1395665 1229508
16933A229508K08684k41929L08745q5361J79163j58580J43954J3108j52044K63347
$$ 1229508 1438192 1196263 1505008 1419647 1598810 1440230 1584184 1597292 1445248 1708595
16923A708595n63944O54441m29136L03881L73525n27456k52957N08411j37382
$$ 1708595 1144651 1799092 1369956 1673837 2047362 1519906 1266949 1775360 1637978
16914A637978P2998Q4504j33529K6419k84255L60725J75916l74363K05248J15578
$$ 1637978 1710976 1795480 1661951 1688370 1404115 1764840 1940756 1566393 1771641 1887219
16904A887219j78738k16627N31707l0800J59273j82828j00125J4173K51914l24545
$$ 1887219 1708481 1491854 2023561 1992761 2152034 1969206 1869081 1883254 2135168 1810623
16894A810623K31283R9201J03623l96976K18797j96882L68179p3442K59740m8337
$$ 1810623 2041906 2141107 2244730 1847754 2066551 1869669 2237848 2164406 2424146 2375809
16884B375809J7171k49410o9850K95060k8916K57194l4993j39830o7637K68432
$$ 2375809 2392980 2143570 2073720 2368780 2339864 2597058 2562065 2422235 2354598 2623030
16874B623030J09647r3683j49588m8098J37234r4228M31527k56612o9302J21346
$$ 2623030 2732677 2638994 2489406 2441308 2578542 2484314 2915841 2659229 2589927 2711273
16864B711273J96748K15507o93061J81600K65819J76851n2102Q0231m930N72980
$$ 2711273 2908021 3123528 2430467 2612067 2877886 3054737 3002635 3082866 3077936 3650916
16854C650916o82800O09386r2182k4549k18895K00038k24694L36352M46370l06579
$$ 3650916 2968116 3577502 3485320 3460771 3241876 3441914 3217220 3553572 3999942 3693363
16844C693363J85113k40031n7781L43057m8660O33273k24970N9926l53883M85345
$$ 3693363 3878476 3638445 3580664 3923721 3875061 4508334 4283364 4343290 3989407 4474752
16834D474752p9326m4676K88430m3844J89420j26778L92861k23757L59559r0563
$$ 4474752 4395426 4350750 4639180 4595336 4784756 4657978 5050839 4827082 5186641 5096078
16824E096078J77705M28296m34092L92819k14097M17656r5377L06658J87920J96291
$$ 5096078 5273783 5702079 5267987 5660806 5446709 5864365 5768988 6075646 6263566 6459857
16814F459857j74898M75702J4740j16027M21342k49890N36057p6479o9921N42563
$$ 6459857 6284959 6760661 6775401 6659374 7080716 6830826 7366883 7290404 7220483 7763046
16804G763046J08241M6105J84581K32685L13034J10111L56064j89280L57229L07463
$$ 7763046 7871287 7917392 8101973 8334658 8647692 8757803 9113867 8924587 9281816 9589279
16794I589279J96408K38337K66949K19561M18607O5767N45396O2421N18085J87030
$$ 9589279 9785687 10024024 10290973 10510534 10929141 10994908 11540304 11602725 12120810 12307840
16784A2307840M16657J37069P56586N93976j32490N28295J214651l74189O27663
$$ 12307840 12724497 12861566 13618152 14212128 14079638 14607933 15822584 15448395 16076058
16775A6076058Q39283J61380N85095N76449Q51319N00863P81579M72196R74045
$$ 16076058 16915341 17076721 17661816 18238265 19089584 19590447 20372026 20844222 21818267
16766B1818267N79262J379277Q67781M75715R38068J191738J142396J044987J264195
$$ 21818267 22397529 23776806 24644587 25120302 26058370 27250108 28392504 29437491 30701686
16757C0701686J497459J094927J897327J095420J741775J896606J681087K028486
$$ 30701686 32199145 33294072 35191399 36286819 38028594 39925200 41606287 43634773
16749D3634773K569411J750357K418092K696139K922588K896487K789913L423689
$$ 43634773 46204184 47954541 50372633 53068772 55991360 58887847 61677760 65101449
16741F5101449L948494L487794M171737M396928M511648M895651N118661N190905
$$ 65101449 69049943 72537737 76709474 81106402 85618050 90513701 95632362 100823267
16733A00823267N885280N930519O262895O321677O601686O281456O904290O498855
$$ 100823267 106708547 112639066 118901961 125223638 131825324 138106780 145011070 151509925
16725A51509925O391559N788252N502191M430083L924278L396555J776699R85561
$$ 151509925 157901484 163689736 169191927 173622010 177546288 180942843 182719542 183705103
16717A83705103J82909j299064k634651l480682l782372n098307n524002o336018
$$ 183705103 183888012 182588948 179954297 176473615 172691243 167592936 162068934 155732916
16709A55732916o269023o824438o648525o872007o442765o346788o468987n886950
$$ 155732916 149463893 142639455 135990930 129118923 122676158 116329370 109860383 103973433
16701A03973433n701435n860651m909161m910167m420525m475050l633442m418641
$$ 103973433 98271998 92411347 87502186 82592019 78171494 73696444 70063002 65644361
16693F5644361l278777l182514l132353l271734k362457k231631k543619k487382
$$ 65644361 62365584 59183070 56050717 52778983 50416526 48184895 45641276 43153894
16685D3153894j540987k235238k001109j612268j490659j690695j258094j471256
$$ 43153894 41612907 39377669 37376560 35764292 34273633 32582938 31324844 29853588
16677B9853588j088378j232862j188164q65620q91139j053264q96760p15862p46470
$$ 29853588 28765210 27532348 26344184 25478564 24587425 23534161 22637401 21921539 21175069
16668B1175069j210051q23798l02381j147882j79837n24725n72744l30861m96503
$$ 21175069 19965018 19141220 18838839 17690957 17511120 16986395 16413651 16082790 15586287
16659A5586287p95566k49036p88947n12613j15161n22147l67027l79487n05143
$$ 15586287 14790721 14541685 13752738 13240125 13124964 12602817 12235790 11856303 11351160
16650A1351160J2332n06197m90385J0270n5598n90403n26689J17949n51378L12655
$$ 11351160 11363492 10857295 10366910 10377180 10321582 9731179 9204490 9322439 8771061 9083716
16640I083716k75568k71464k5884o60298m9230j18554j88793q5398j68651o45611
$$ 9083716 8808148 8536684 8510800 7850502 7801272 7682718 7493925 7408527 7239876 6594265
16630F594265j48651J01503K84667p27760j41421j39742k81348j53155K1689J50432
$$ 6594265 6445614 6547117 6831784 6104024 5962603 5822861 5541513 5388358 5410047 5560479
16620E560479j28136m11128J92655k54703j30107J60263j29697k75859J57191
$$ 5560479 5432343 5021215 5213870 4959167 4829060 4989323 4859626 4583767 4740958
16611D740958k73225j33091J50767m12990J71686k92261l2527k62371M6011K0991
$$ 4740958 4467733 4334642 4485409 4072419 4244105 3951844 3919317 3656946 3702957 3723948
16601C723948N3148j51735q5638R7804k4061p7671m98443M16750m49301J72091
$$ 3723948 3777096 3625361 3539723 3637527 3613466 3535795 3037352 3454102 3004801 3176892
16591C176892k72443l5389K24559j49683J97148k16166r9605K82767k60038P4172
$$ 3176892 2904449 2869060 3093619 2943936 3141084 2924918 2825313 3108080 2848042 2922214
16581B922214l94827j44663J19403J25432P4672j44393j51361j99183O29123l78058
$$ 2922214 2527387 2382724 2502127 2627559 2702231 2557838 2406477 2207294 2836417 2458359
16571B458359k3048k10433J78631k84293L298J03772k33732J27291j72509K21609
$$ 2458359 2435311 2224878 2403509 2119216 2122514 2226286 1992554 2119845 1947336 2168945
16561B168945m53521M69623k99205p4290j69253L91011l68170M74981n96829K68998
$$ 2168945 1715424 2185047 1885842 1811552 1642299 2033310 1665140 2140121 1543292 1812290
16551A812290j87764J04199L59589n85766O9079K70557j27494m78938N40271l03995
$$ 1812290 1624526 1728725 2088314 1502548 1571627 1842184 1714690 1235752 1776023 1472028
16541A472028n5747K72787m61136K43625q5717L5450R1274l81362M09212r2532
$$ 1472028 1416281 1689068 1227932 1471557 1385840 1421290 1512564 1131202 1540414 1447882
16531A447882j4613r3816n9347M8261l8846j38583K66706m8407J07624J00391
$$ 1447882 1433269 1339453 1280106 1328367 1289521 1150938 1417644 1369237 1476861 1577252
16521A577252m74346K32832P8408l80751K26296k83622j14780J34528K60323j75295
$$ 1577252 1102906 1335738 1414146 1033395 1259691 976069 861289 995817 1256140 1080845
16511A080845o0335k18106N2168R0515l8854M36071j66215k73831l1712K43181
$$ 1080845 1020510 802404 854572 945087 906233 1342304 1176089 902258 870546 1113727
16501A113727j16983J2084L1266J03607m82011M34619R7012p5730L6445j48281
$$ 1113727 996744 1008828 1040094 1143701 661690 1096309 1193321 1117591 1154036 1005755
16491A005755r3109Q7101j13767R1215l04082Q220j9790J7965K64184l07920K71011
$$ 1005755 912646 999747 885980 977195 673113 681333 661543 679508 943692 635772 906783
16480I06783l5960j94q7243K18106L5318k06174j38661o327l0070L36953m39553
$$ 906783 870823 870629 783386 1001492 1036810 830636 691975 685648 655578 992531 552978
16469E52978L8842J72625j67473l3925K14301O5703j9398D08013J94098J58693
$$ 552978 591820 764445 596972 563047 777348 843051 823653 408013 602111 760804
16459G60804k86973K79613C25725M15692p7551j67748L95538K5990J429C50357
$$ 760804 473831 753444 325725 741417 663866 496118 891656 917646 919075 350357
16448F92720J73004l95608O6506K8148P724L2751j4262k73206J60280M2604L74729
$$ 692720 865724 470116 536622 564770 572494 605245 590983 317777 478057 520661 895390
16437H95390C95904L50018J58999l21764j585o0103J10876k09458L75990j35537
$$ 895390 395904 745922 904921 583157 581572 521469 632345 422887 798877 663340
16427F63340j84490R8237k82411K67616j4400m4735O3040K90868m19798j84308
$$ 663340 478850 577087 294676 562292 547892 503157 566197 857065 437267 252959
16417B52959P4157j41525K70703L7625J8123j70249I1329L15738d4372C29763
$$ 252959 327116 185591 456294 493919 512042 341793 91329 407067 -44372 329763
16406D57782j52020P2796L22136B5820N36068j76538O636M31555C82491K13688
$$ 457782 305762 378558 700694 25820 561888 385350 391986 823541 382491 596179
16396E96179k67546R0236e6491D76854c8027E27062D1061L78497j57710b2611
$$ 596179 328633 418869 -56491 476854 -38027 527062 41061 419558 261848 -22611
16385D59024K15832a10917E19739o6511P8727A98005n7986K11267Q9422a00171
$$ 459024 674856 -110917 519739 453228 531955 198005 140019 351286 440708 -100171
16374B87402N1423K72987C01329a70233C04901A40501J74242E3354k6622K56461
$$ 287402 338825 611812 301329 -170233 304901 140501 314743 53354 26732 283193
16364B83193K99887B77341N818J78050A20002L39777J19463A80426n0674l1561
$$ 283193 583080 277341 283159 461209 120002 459779 579242 180426 129752 98191
16354I8191L13353e3171E10518a55413C66076L40795A84259K12137n4798a16172
$$ 98191 411544 -53171 510518 -155413 366076 706871 184259 396396 341598 -116172
16343a16416I8510K2655R2526N7070j28151M73226B84660l7254m9441K71194p4973
$$ -116416 98510 121165 213691 270761 142610 615836 284660 247406 197965 469159 394186
16332C94186A30900a72597B17413e1441C51609A68560K75318G4054e181B0222
$$ 394186 130900 -172597 217413 -51441 351609 168560 443878 74054 -5181 20222
16321A76527J55056A6589N60749B72878l3592K1302H5144J75072R4485I9602e9655
$$ 176527 331583 16589 577338 272878 239286 260588 85144 260216 354701 99602 -59655
16309A78199k885k170D7741K34383a28110A52670G4528M17323Q0010B76288K73401
$$ 178199 175314 173144 47741 282124 -128110 152670 74528 491851 571861 276288 549689
16298E49689B29193o156J35451j78841a414D06435a05384B22987J60024a8113
$$ 549689 229193 223037 358488 179647 -1414 406435 -105384 222987 383011 -18113
16287e103A39766C0355L00683a00289b8364B12944E9297J33866a15166j3580B68562
$$ -5103 139766 30355 331038 -100289 -28364 212944 59297 193163 -115166 -128746 268562
16275b25151B96118F7483J47556M5029K14181b11279a01021a6506B76845G3540
$$ -225151 296118 67483 215039 260068 474249 -211279 -101021 -16506 276845 73540
16264A17477R4404j5010r3554a51309A42510a1708I2712R9244a6950o6769C714
$$ 117477 211881 196871 103317 -151309 142510 -11708 92712 191956 -16950 -83719 3714
16252b42993C23007B2109d13980A26695a29046B95578c773C70910j70689b23154
$$ -242993 323007 22109 -413980 126695 -129046 295578 -3773 370910 200221 -223154
16241D32983j88885j00321i4338C0479a5846B14046c4795A41496e6070A48285
$$ 432983 244098 143777 -94338 30479 -15846 214046 -34795 141496 -56070 148285
16230A44805E4126K17331f8163o0882e613B18710M1426f6372n1395q3357D03934
$$ 144805 54126 271457 -68163 -129045 -5613 218710 260136 -66372 -117767 -201124 403934
16218C0620a23049A90502a14540A58740c65674B1382d3024D47574b32459B38612
$$ 30620 -123049 190502 -114540 158740 -365674 21382 -43024 447574 -232459 238612
16207B39442b2055j37394B58867A28383R249b16890e5651B24777b06977A04444
$$ 239442 -22055 -159449 258867 128383 137632 -216890 -55651 224777 -206977 104444
16196a08957A42612J03131C409a03343k65572A48663P934d2373m0798G7767d8791
$$ -108957 142612 245743 3409 -103343 -368915 148663 156597 -42373 -83171 77767 -48791
16184d993C17423I7293a09721A87477F2434d4062m9904G4103J84999F3758A6739
$$ -4993 317423 97293 -109721 187477 62434 -44062 -93966 74103 259102 63758 16739
16172a82983Q8513D50496H097P4596a64542G0768B2320K19723C5254b6850B09792
$$ -182983 -94470 450496 8097 82693 -164542 70768 22320 242043 35254 -26850 209792
16160e3122D4098J01037K63049a353A95526c0680A43090e848j49035A99457q6386
$$ -53122 44098 145135 408184 -1353 195526 -30680 143090 -5848 -154883 199457 113071
16149A13071l7666K93135A59757I783a01721p3080B16P1213L39938A70918E0583
$$ 113071 75405 368540 159757 9783 -101721 -174801 216 71429 411367 170918 50583
16137A17896l4144J9215I159J46326A0559a7673B44078F206M5396a15115q5793
$$ 117896 83752 102967 9159 155485 10559 -17673 244078 6206 51602 -115115 -200908
16126b00908j30163A6606K9802B2659p843J37130o6997Q2476d618B85912N0577
$$ -200908 -331071 16606 46408 22659 14816 151946 84949 167425 -4618 285912 336489
16115C36489f5939j977j62354B34440I9611a25110C27557a96871d6825j46307
$$ 336489 -65939 -67916 -230270 234440 99611 -125110 327557 -196871 -46825 -193132
16105a93132R5397A0859J09023E4501N5404O2949A8768g0525l82654d3825o4260
$$ -193132 -97735 10859 119882 54501 109905 172854 18768 -70525 -453179 -43825 -108085
16094a08085j36920A97410b67236A67979h4242j03044k04444A64551f5694k62813
$$ -108085 -245005 197410 -267236 167979 -84242 -187286 -391730 164551 -65694 -328507
16084c28507B95794a72825B20500H0739a04324r8035f6896k9410k44478a12185
$$ -328507 295794 -172825 220500 80739 -104324 -202359 -66896 -96306 -340784 -112185
16073b2052B17580J61762F933c69640D9284a94932b905m6584l3589O615C83019
$$ -22052 217580 379342 6933 -369640 49284 -194932 -2905 -49489 -83078 -76463 383019
16061C0557d67857H2656e71821A7512b72587f6548l33208h8314A50094a46911
$$ 30557 -467857 82656 -571821 17512 -272587 -66548 -399756 -88314 150094 -146911
16050I0113J50224n9275p5990C252b90065a20038E2274i0103A20818a64146G0538
$$ 90113 240337 181062 105072 3252 -290065 -120038 52274 -90103 120818 -164146 70538
16038D6207M3445c61894A57350b23557B45070p7572a2850C60623A01577P5325
$$ 46207 89652 -361894 157350 -223557 245070 167498 -12850 360623 101577 176902
16028A76902j0000b34136H1784j8364M1675f9211k00046A87654M1494i6730L3911
$$ 176902 166902 -234136 81784 63420 105095 -69211 -269257 187654 229148 -96730 -62819
16017f2819q0238A12055P2610b8213k54489d344D11071a06187k29373f461j53275
$$ -62819 -143057 112055 184665 -28213 -282702 -4344 411071 -106187 -335560 -6461 -159736
16006a59736l9035K2367B68763e8397j04581b8481C93397A53801a02437R368C019
$$ -159736 -198771 -176404 268763 -58397 -162978 -28481 393397 153801 -102437 -93069 3019
15994D4629a11873l14062H1853a93707E3674G884L6561J22361P8162F563a74696
$$ 44629 -111873 -425935 81853 -193707 53674 7884 44445 166806 244968 6563 -174696
15982D29964j98801Q4466o3436J26351d33308B97081o238b06538Q8756G4561k1424
$$ 429964 231163 315629 252193 378544 -433308 297081 290843 -206538 -117782 74561 53137
15971E3137a62895l5383A40737L55574k37479I8919e8947B1603K32741d0878O756
$$ 53137 -162895 -198278 140737 496311 258832 98919 -58947 21603 254344 -40878 -34122
15960c4122j69830g2838k43614a42644B8053J64865k0297a51639o6728g2776K0314
$$ -34122 -203952 -72838 -316452 -142644 28053 192918 172621 -151639 -218367 -72776 -52462
15949e2462C7178b59651k4312e1826G1642i126A31459C0864Q7949a14911j34845
$$ -52462 37178 -259651 -283963 -51826 71642 -9126 131459 30864 118813 -114911 -249756
15938b49756k26640a00359B05883a20360n9429p6632B17354B0073a97345i6279
$$ -249756 -476396 -100359 205883 -120360 -179789 -256421 217354 20073 -197345 -96279
15927A41784a51723l9560A06754h3898k94637A62381n6388b45490J05088e1334
$$ 141784 -151723 -191283 106754 -83898 -378535 162381 105993 -245490 -140402 -51334
15916A82870a69295N194B26923b94546e9464I6i9987c7018B36543a0303j1863
$$ 182870 -169295 -164101 226923 -294546 -59464 96 -99987 -37018 236543 -10303 -22166
15905b2166A95811d18B88445E0197L7923a82910A94331p1376D1542a80920h1894
$$ -22166 195811 -418 288445 50197 88120 -182910 194331 122955 41542 -180920 -81894
15893B40735c87648A5367K76481F9668a47982A67119f8510r9586A31462h0718
$$ 240735 -387648 15367 291848 69668 -147982 167119 -68510 -168096 131462 -80718
15882C7785d601o4373C3711i1463C1318C803N9435a71930l6512R4370r0075G2396
$$ 37785 -4601 -68974 33711 -91463 31318 3803 63238 -171930 -208442 -114072 -204147 72396
15869d2060G5860a27442a228j03223r4629q528e654B30676G5297O1251a3931B7014
$$ -42060 75860 -127442 -1228 -104451 -199080 -207608 -5654 230676 75297 136548 -13931 27014
15856e16319A03870m8450e5482p493l65801b06345A88K68959B2794L7461a92429
$$ -516319 103870 55420 -55482 -62975 -428776 -206345 188 269147 22794 60255 -192429
15844a95414C89497b72105a19810e130j32061o3177g5082j91946H344R4917a84026
$$ -195414 389497 -272105 -119810 -5130 -137191 -200368 -75082 -267028 8344 103261 -184026
15832B20457b74713A65992d7943O56j32725C36848H8464P1650m8063a68378K9602
$$ 220457 -274713 165992 -47943 -47287 -180012 336848 88464 160114 112051 -168378 -138776
15821a38776H6836M5141c44156A91014b7882j43456d9248A90913l6654c08913
$$ -138776 86836 131977 -344156 191014 -27882 -171338 -49248 190913 154259 -308913
15810C0727e5629A03456a43659f8280j9541k5152J9196C3702J03543b06935k4718
$$ 30727 -55629 103456 -143659 -68280 -87821 -112973 -93777 33702 137245 -206935 -231653
15799b31653A46093a63078O6998j76664E2165K8390K75880H5014N4544a81856
$$ -231653 146093 -163078 -96080 -272744 52165 80555 356435 85014 139558 -181856
15788A57314G4579h4988p7499A85298a27874A94899f2569j29332D6744b17576
$$ 157314 74579 -84988 -162487 185298 -127874 194899 -62569 -191901 46744 -217576
15777b28131E5374b83430a3853k18417J15745N5295l41959A48794B6186b51905
$$ -228131 55374 -283430 -13853 -232270 -116525 -61230 -403189 148794 26186 -251905
15766a63603j6516A42236C7828J51547J3072m2721A6403M7413C530N5028J42199
$$ -163603 -180119 142236 37828 189375 202447 159726 16403 63816 3530 58558 200757
15755B00757J41906c8925A85097E2871i8028j50733F4036c28821B10294J14879
$$ 200757 342663 -38925 185097 52871 -98028 -248761 64036 -328821 210294 325173
15745C25173j47711c9382A63563a41953A87040L5352b51196L609B0184g3877I0532
$$ 325173 177462 -39382 163563 -141953 187040 222392 -251196 -247587 20184 -73877 90532
15733b0155j50037f451D8698b34347e2987L046B91029c5626n9278q2190M7224
$$ -20155 -170192 -6451 48698 -234347 -52987 -49941 291029 -35626 -94904 -177094 -129870
15722a29870k12517a14157A4955c6096k35748O0022a4296H7283a17008a0800B8761
$$ -129870 -342387 -114157 14955 -36096 -271844 -211822 -14296 87283 -117008 -10800 28761
15710C7989Q9442b91820j3040A6333f4612m3773k80960F2117a25128B4281M5936
$$ 37989 127431 -291820 -304860 16333 -64612 -108385 -389345 62117 -125128 24281 70217
15699G0217f4188B32526q8262c5210A3351J7705A2386J25433Q2091Q1657f0902
$$ 70217 -64188 232526 144264 -35210 13351 31056 12386 137819 219910 301567 -60902
15687H9185b08127M9018A00252a96877B3582A1076b24384K6718g996p4058H1185
$$ 89185 -208127 -159109 100252 -196877 23582 11076 -224384 -197666 -7996 -82054 81185
15675C4050J4868K26807l7428G0662a08678a6439n9451F1289J99875D9015J56632
$$ 34050 48918 275725 238297 70662 -108678 -16439 -75890 61289 261164 49015 205647
15664B05647a68654F9788f2285A15819G486h3445A52313a258j69383A06056K68513
$$ 205647 -168654 69788 -62285 115819 7486 -83445 152313 -1258 -170641 106056 374569
15653C74569H747J17791m362c5322B5012c3616B44878a75361q7300J18606C61326
$$ 374569 8747 126538 122176 -35322 25012 -33616 244878 -175361 -262661 -144055 361326
15641b57445A16182a70712A90627i8000j6854N3581A49826k2542e4230D536d81164
$$ -257445 116182 -170712 190627 -98000 -114854 -61273 149826 127284 -54230 4536 -481164
15629b35037g763B25336a17798H398i0248B03821J71528a4702p034k04312A63294
$$ -235037 -7763 225336 -117798 8398 -90248 203821 375349 -14702 -21736 -226048 163294
15617A67827a57822f6227A09717b7287C558K21937l8663b85871A99627a35741
$$ 167827 -157822 -66227 109717 -27287 3558 225495 186832 -285871 199627 -135741
15606B29757d4520k624A34793f0523j41541C6768A2486M9554a78206B32943A08964
$$ 229757 -44520 -47144 134793 -60523 -202064 36768 12486 62040 -178206 232943 108964
15594a06833b8510I5904a10390k02375a00444B23030o9242a42073B49592C5048
$$ -106833 -28510 95904 -110390 -312765 -100444 223030 153788 -142073 249592 35048
15583C18810a39985k6553h770E9863J05635F2178J85640A05045Q54J3394j8187
$$ 318810 -139985 -166538 -8770 59863 165498 62178 247818 105045 105899 119293 101106
15572A01106c72906a21872q0986N9684j17200C5865J36553e0735A63368m2130
$$ 101106 -372906 -121872 -202858 -143174 -260374 35865 172418 -50735 163368 121238
15562A21238B0378a80358k8065M9948b1696C02604q2439b29508J11233o3353J7081
$$ 121238 20378 -180358 -208423 -158475 -21696 302604 220165 -229508 -118275 -181628 -164547
15551a64547K2556E7610f8978K5487A83185A3186a51012A2550F234h6237l958
$$ -164547 -141991 57610 -68978 -43491 183185 13186 -151012 12550 6234 -86237 -90195
15540i0195B42901e3518A6323d354A1066M06226a3850D7410a59553g2548D2564
$$ -90195 242901 -53518 16323 -4354 11066 417292 -13850 47410 -159553 -72548 42564
15528a05036E7555J75009d7624j680k1066c3500o4461n0731k251d3620j33583
$$ -105036 57555 232564 -47624 -49304 -70370 -33500 -97961 -148692 -150943 -43620 -177203
15517a77203G4394C2163D682a21862c8220k21474A4049J50992a22554I2775d6256
$$ -177203 74394 32163 4682 -121862 -38220 -259694 14049 165041 -122554 92775 -46256
15505A5216K01675a69826O1642M9524j37901n3126A31174M14570p2675k22593
$$ 15216 216891 -169826 -108184 -58660 -196561 -249687 131174 545744 473069 250476
15495B50476B218K93850j10059g2159k44499J15419H302K27768f68232C42626
$$ 250476 2218 296068 186009 -72159 -316658 -201239 8302 236070 -668232 342626
15484A55415E289a2998j19697N6448j37478k33087A042b80r1182J372l2518A47935
$$ 155415 5289 -12998 -132695 -76247 -213725 -446812 1042 -280 -91462 -90090 -122608 147935
15471a53043F4233J09047o3137F623b9378B6572b94751A10702l8135b88276D6707
$$ -153043 64233 173280 110143 6623 -29378 26572 -294751 110702 72567 -288276 46707
15459F2263K02641c66529B57619B2222i9805E5565d5203G5125c8507j8629E3894
$$ 62263 264904 -366529 257619 22222 -99805 55565 -45203 75125 -38507 -57136 53894
15447c48643h272A19621P0702d0307j12827B28156e0839A3493a317F8540b74792
$$ -348643 -8272 119621 190323 -40307 -153134 228156 -50839 13493 -1317 68540 -274792
15435c2651F5758b10856a4329I594h9454D76592i6960B99043B4684b26692C9505
$$ -32651 65758 -210856 -14329 9594 -89454 476592 -96960 299043 24684 -226692 39505
15423g5632j69317D32738G8906J69244C4418a02910B68500i3520A450h7990k99452
$$ -75632 -244949 432738 78906 248150 34418 -102910 268500 -93520 1450 -87990 -387442
15412c87442c4244H0760L71352a36947C25154r4381K9385a94568d2132j7453F4034
$$ -387442 -34244 80760 452112 -136947 325154 230773 260158 -194568 -42132 -59585 64034
15400a11152A87841i9226K5652n8830p4924C80013j78678O2584d5702C16596a53560
$$ -111152 187841 -99226 -73574 -132404 -207328 380013 201335 263919 -45702 316596 -153560
15388B53353J74767b04248d2289E9538a39612d74k1096F6135a07669c6236l3429
$$ 253353 428120 -204248 -42289 59538 -139612 -474 -21570 66135 -107669 -36236 -69665
15377f9665a7377I7153O3193A3512R2309k0344b66630C73927c92237d4847K943
$$ -69665 -17377 97153 160346 13512 105821 85477 -266630 373927 -392237 -44847 -41904
15366d1904k1723E7743b30183E576b3851j52915C89680e0971A36324O8654E2800
$$ -41904 -63627 57743 -230183 5576 -23851 -176766 389680 -50971 136324 204978 52800
15354G3850k3561b45835A74447i6024j81609B61424n3242a54871B93364a81063
$$ 73850 50289 -245835 174447 -96024 -277633 261424 208182 -154871 293364 -181063
15343c57547a33353B33123i0020B73022j29932m756C3121f8643A68633C2311L33060
$$ -357547 -133353 233123 -90020 273022 143090 138334 33121 -68643 168633 32311 365371
15332C65371c122J115A18761E1438a50532m5536n5345B11766E7426J42301a50304
$$ 365371 -3122 -2007 118761 51438 -150532 -196068 -251413 211766 57426 199727 -150304
15320b94655f0861C38686A21405Q218a99355h0314B60115a64483q9298B59962
$$ -294655 -60861 338686 121405 129623 -199355 -80314 260115 -164483 -253781 259962
15309B80002F7601b87271F4232M75633C9769M4410i2494m93B62692a25939A40884
$$ 280002 67601 -287271 64232 539865 39769 84179 -92494 -92987 262692 -125939 140884
15297b7536F4322b69654F6448K22572B1225J45109j6178h3116j03350G2303a15074
$$ -27536 64322 -269654 66448 289020 21225 166334 150156 -83116 -186466 72303 -115074
15285b580I9213a61386j49136C8274A8917e423A87061H1829K04264K61485I0771
$$ -2580 99213 -161386 -310522 38274 18917 -5423 187061 81829 286093 547578 90771
15273A30424A5430K52567J99031I1489l2140J62942K33153j98567f5528J1929
$$ 130424 15430 267997 467028 91489 59349 222291 455444 256877 -65528 -53599
15263e3599A2686b12518d2109I2143P0324J78117D5584A6210a19196A5805L4046
$$ -53599 12686 -212518 -42109 92143 162467 340584 45584 16210 -119196 15805 49851
15252D9851L50669B1388J82860K69544R37247N21294q01192K33514m11368m05871
$$ 49851 400520 21388 204248 473792 1411039 1932333 1131141 1364655 953287 547416
15242E47416c21812C28423n8818c8497C6319R9576b9157B62303r7577K17654j21521
$$ 547416 -321812 328423 269605 -38497 36319 135895 -29157 262303 164726 382380 260859
15231B60859a94456b7210n0911A07405d0869C32224A64411i6595B27330D8917
$$ 260859 -194456 -27210 -78121 107405 -40869 332224 164411 -96595 227330 48917
15220a02015A05923B103J59957b03400n0953I0071J74181k0135F4695l1651c0360
$$ -102015 105923 2103 162060 -203400 -254353 90071 264252 244117 64695 33044 -30360
15208B3286a35810G3320E569J55747K77797d872q2299i876C33237F7450a02625
$$ 23286 -135810 73320 5569 161316 439113 -4872 -87171 -9876 333237 67450 -102625
15196D7641P0661Q3144h4108k89725C42715m9102c8872C23223j01265A00961B1852
$$ 47641 118302 201446 -84108 -373833 342715 293613 -38872 323223 221958 100961 21852
15184F7790L88840c22489A8755K38810G8089J89342R1570d8427B05432J07632
$$ 67790 456630 -322489 18755 257565 78089 267431 359001 -48427 205432 313064
15174C13064A30108b81627C01291H1441C2990K18731H1619M37326G5704i4971
$$ 313064 130108 -281627 301291 81441 32990 251721 81619 518945 75704 -94971
15163a54750A69488B0235J9449O6962m2295p745i568k6278D07203b2897B79354
$$ -154750 169488 20235 39684 106646 64351 56606 -9568 -35846 407203 -22897 279354
15151b1875H362M6113e4256G8318O4520j8494K44009a90921C10752b7578k69831
$$ -21875 8362 54475 -54256 78318 142838 124344 368353 -190921 310752 -27578 -297409
15140b97409d1866B04402D7821K24615I6690a57614P1305B31732I8558L80661
$$ -297409 -41866 204402 47821 272436 96690 -157614 -86309 231732 98558 479219
15130D79219f2652o6172A92250D8027K10326p1686f2404A17163b28594R78A25007
$$ 479219 -62652 -128824 192250 48027 258353 186667 -62404 117163 -228594 -227616 125007
15118B99448I7294e6956b5047B72047A6677L16417j46503o1834b0882A15782K9096
$$ 299448 97294 -56956 -25047 272047 16677 333094 186591 124757 -20882 115782 144878
15107A44878a15833B26899P2627J98198k41541f5534E0062J89169K4452B6390
$$ 144878 -115833 226899 299526 497724 256183 -65534 50062 239231 263683 26390
15096C92011G6696O7259f9945j53306I2032J35592J3724a06082d4714B31296o7514
$$ 392011 76696 143955 -69945 -223251 92032 227624 241348 -106082 -44714 231296 163782
15085A63782l5497a07968B04329G4402A8522K72172o8677q8715C5870L66650E4614
$$ 163782 128285 -107968 204329 74402 18522 290694 222017 133302 35870 402520 54614
15073i4284A62894k9954J07460N5815b42820P5544Q37D26665A47632c37810E31168
$$ -94284 162894 132940 240400 296215 -242820 -167276 -166439 426665 147632 -337810 531168
15061A28690d9107A33548L33898A00605K78265o0706N7109j29222J59757F5919
$$ 128690 -49107 133548 467446 100605 378870 318164 375273 246051 405808 65919
15050a1605C79862j06537r064Q4214r5524J12193E0367K42514M2631A19511a48976
$$ -11605 379862 273325 264261 348475 252951 365144 50367 292881 335512 119511 -148976
15038B32956q7840R3760p9036h7420l356B25403F7114J93485A26233d77614C75551
$$ 232956 145116 238876 159840 -87420 -90776 225403 67114 260599 126233 -477614 375551
15026a86334B2100L76167F3566J35654M0335q2526J98343D6215a18587C11649
$$ -186334 22100 398267 63566 199220 239555 157029 355372 46215 -118587 311649
15015A43015J31040l6880h4218D3166J61069h5527A70506J73554m0112P2435p5694
$$ 143015 274055 237175 -84218 43166 204235 -85527 170506 344060 303948 376383 300689
15004C00689j47095k4937K14482q8841L9570J09130R7240H6447A6156L43455H6303
$$ 300689 153594 128657 343139 254298 293868 402998 500238 86447 16156 359611 86303
14992A53143J33735A7123a127C03351F7073J85246J44184j45139L3551K26687
$$ 153143 286878 17123 -1127 303351 67073 252319 396503 251364 284915 511602
14982E11602j06330j78449A04480K34288j36812J96463c1149B86980m8976r3227
$$ 511602 405272 226823 104480 338768 201956 398419 -31149 286980 238004 144777
14972A44777M45447i158A47661K1744J72781a54558C41967L4763A79229H6947
$$ 144777 590224 -9158 147661 169405 342186 -154558 341967 376730 179229 86947
14961a0000A94438K15850a1644A57693a54877B60471o938p5329L44926A54561
$$ -10000 194438 410288 -11644 157693 -154877 260471 253533 178204 523130 154561
14950D69715A91818n8950L00837j46756m3332m9373G5155C4577M12176A98357
$$ 469715 191818 132868 433705 286949 243617 194244 75155 34577 446753 198357
14939D93115A54182A2027Q8068L38947j31560q6157l2260K47852k7817A7716K60067
$$ 493115 154182 12027 100095 439042 307482 221325 189065 436917 409100 17716 277783
14928B77783F8926K17944m3552n5611J3566R6874j23725B5670P1062J26291M16089
$$ 277783 68926 286870 243318 187707 201273 298147 174422 25670 96732 223023 639112
14917F39112A50265J73419m2913D8206K26788j12447N46047k53899L4775A52337
$$ 639112 150265 323684 280771 48206 274994 162547 708594 454695 489470 152337
14906A27806J05757J77637l1688m2248K96700p8968B42841K3738J04547J0184
$$ 127806 233563 411200 379512 337264 633964 554996 242841 266579 371126 381310
14896C81310j27522M1037J73914A53868J82419J48731A01472L07585j77412J56511
$$ 381310 253788 294825 468739 153868 336287 485018 101472 409057 231645 388156
14886C88156a01032E0098K56078F6697N29621k61286k1974K19389G8126O70837
$$ 388156 -101032 50098 306176 66697 596318 335032 313058 532447 78126 748963
14876G48963l18020P9740j94007j1149j01562L14770I7690J46230J68146J67736
$$ 748963 430943 510683 316676 305527 203965 518735 97690 243920 412066 579802
14866E79802j72620J36082a50951E98348B66103A21490L57275j62676n8967K45696
$$ 579802 407182 543264 -150951 598348 266103 121490 478765 316089 257122 502818
14856E02818m9597H4861N44945B94285J98336d8276D13673J04371j35889J2853
$$ 502818 453221 84861 629806 294285 492621 -48276 413673 518044 382155 395008
14846C95008A37314J63384r432M44019l56833L9927r2034K07795B09264N19435
$$ 395008 137314 300698 291266 735285 378452 418379 326345 534140 209264 728699
14836G28699j11585L580M6257n2067j68048n7378K65884L1575k49354j44721K07098
$$ 728699 617114 620694 666951 614884 446836 389458 655342 686917 437563 292842 499940
14825D99940j24476J84322k39671N55759G7763O15402A72217j7270K30345q058
$$ 499940 375464 559786 320115 875874 77763 693165 172217 154947 385292 377234
14815C77234K37295B20123K34645r9835o3999K92656k66392J19275J35116p5047
$$ 377234 614529 220123 454768 354933 290934 583590 317198 436473 571589 496542
14805D96542L626j09120J99993K29574C55046K35393k43974J68918L92511B80686
$$ 496542 500168 391048 591041 820615 355046 590439 346465 515383 907894 280686
14794E52718q2282j61697K26441j42986L86735j27614p3793k27293M6496N47294
$$ 552718 470436 308739 535180 392194 778929 651315 577522 350229 396725 944019
14784I44019B85193L68756j40906J81603J28628j51173r0163l7533L02125l44617
$$ 944019 285193 653949 513043 694646 823274 672101 581938 544405 846530 501913
14774E01913M72L08975l06914A17213J21234K38852L39506B90129K27271Q7276
$$ 501913 502385 811360 504446 117213 238447 477299 816805 290129 517400 604676
14764F04676j72405R7803K00174J54181p4097B23985L6115M89081j02736N6216
$$ 604676 432271 530074 730248 884429 810332 223985 260100 749181 646445 702661
14754G02661N08885l93521k24808q9570J16276j5992j63546K15844J32459L7760
$$ 702661 1211546 818025 593217 503647 619923 603931 440385 656229 788688 826448
14744H26448k53432J41616J15818j87796P4214r0189k08891L17595K5646k38989
$$ 826448 573016 714632 830450 642654 716868 626679 417788 735383 761029 522040
14734E22040J07827L72574l75062M13787l59373k33219N81203D14477K83365k6721
$$ 522040 629867 1002441 627379 1041166 681793 448574 1029777 414477 697842 671121
14724F71121j50481L74223m02127L09809N4094k70452k52747N38225j32553M72461
$$ 671121 520640 894863 492736 802545 856639 586187 333440 871665 739112 1211573
14714A211573m40941O0796K10713l72232J93738D00642N89516l55887O1891R9558
$$ 1211573 770632 831428 1042141 669909 863647 400642 990158 634271 696162 795720
14704G95720M53746l81094k92165L54628l80329K98526K99653j62674m10565L68375
$$ 795720 1249466 868372 576207 930835 550506 849032 1148685 986011 575446 943821
14694I43821l05800L75007l5846k00976J2055O7570Q5387M32281n34132J02206
$$ 943821 638021 1013028 977182 776206 788261 855831 941218 1373499 839367 941573
14684I41573l6203J51617j33063m37789J91318K07969K39140k82919j39163K24178
$$ 941573 905370 1056987 923924 486135 677453 885422 1124562 841643 702480 926658
14674I26658J93093k46451K7218j14239K81175j87722k6313J18591L43923m98181
$$ 926658 1119751 873300 900518 786279 1067454 879732 853419 972010 1315933 817752
14664H17752k242K351j94773J18835k0848O09823j59408J97822E88777M12256
$$ 817752 815510 817861 623088 741923 721075 1330898 1171490 1369312 588777 1001033
14654A001033K28811k44823J14371K19511J7584k74958l2075K58281k52584J86822
$$ 1001033 1229844 985021 1099392 1318903 1336487 1061529 1029454 1287735 1035151 1221973
14644A221973j65736K11453K62155o3720m8652n04194J21603J42878l18304N77020
$$ 1221973 1056237 1267690 1529845 1466125 1417473 913279 1034882 1177760 859456 1436476
14634A436476j1130j05345j45613K53611O6114k52102K5929Q9018l11586K78348
$$ 1436476 1425346 1320001 1174388 1427999 1494113 1242011 1267940 1356958 1045372 1323720
14624A323720j16268n1234M31058n34395N75145j36699l31093m0356N66091l24851
$$ 1323720 1207452 1156218 1587276 1052881 1628026 1491327 1160234 1119878 1685969 1361118
14614A361118k94053K41048k21829K57449K49797m4532k17707M21972k01111K3244
$$ 1361118 1067065 1308113 1086284 1343733 1593530 1548998 1331291 1753263 1552152 1575396
14604A575396n6733q8128j23606J60180m23036Q19753k63148J59729j95581L39495
$$ 1575396 1518663 1430535 1306929 1467109 1044073 1863826 1600678 1760407 1564826 1904321
14594A904321l70154J92296J3579m62456L37164J62427j75292J29113k01176K12337
$$ 1904321 1534167 1726463 1740042 1277586 1614750 1777177 1601885 1730998 1529822 1742159
14584A742159J11132j09503K97206L4598k27024o8520M54150k06742m48006N49960
$$ 1742159 1853291 1743788 2040994 2075592 1848568 1780048 2234198 2027456 1579450 2129410
14574B129410j58949N4536r9881K49631R3456L6815q0410j77440J65291R8141
$$ 2129410 1970461 2024997 1925116 2174747 2268203 2305018 2224608 2047168 2212459 2310600
14564B310600M25956m17603m5896M10376l08386j9219L46671L8520j13803J78715
$$ 2310600 2736556 2318953 2273057 2683433 2375047 2355828 2702499 2741019 2627216 2805931
14554B805931K31210J03401Q63665N05847Q06775J491334M465492Q972119K0001096
$$ 2805931 3037141 3140542 4004207 4510054 5316829 6808163 11273655 20245774 40246870
14545D0246870J0908866B2311410H010116C281278o97916o16079M1385j46091
$$ 40246870 51155736 22311410 8010116 3281278 2583362 1967283 2008668 1862577
14537A862577J46750j49898m5922m663r9043M5284K69286o6658K87592k10310
$$ 1862577 2009327 1859429 1813507 1808844 1709801 1755085 2024371 1957713 2245305 2034995
14527B034995R7253M7851j25080L49280k80648L13818j79849K31910o1342J37492
$$ 2034995 2132248 2180099 2055019 2404299 2123651 2437469 2257620 2489530 2428188 2565680
14517B565680r5547k75685p9499M89452j64011l04749K49560M27177n80646O33331
$$ 2565680 2470133 2194448 2114949 2604401 2440390 2135641 2385201 2812378 2231732 2865063
14507B865063k05520L65041j90428J28887k27724J38710J20455M44095m70373
$$ 2865063 2659543 3024584 2834156 2963043 2735319 2874029 2994484 3438579 2968206
14498B968206p1527L52132j7737L9674l40153P5138M13529l25895N5330L42430
$$ 2968206 2896679 3248811 3231074 3270748 2930595 3005733 3419262 3093367 3148697 3491127
14488C491127O7414K6512r9916k35871J35530J04953N1928L3168k7486J6911j30365
$$ 3491127 3558541 3585053 3485137 3249266 3384796 3489749 3541677 3574845 3547359 3564270 3433905
14477C433905J94266p6891J71296L1313l0966N26121j27436R5611q9905Q8280
$$ 3433905 3628171 3551280 3722576 3753889 3722923 4249044 4121608 4217219 4127314 4215594
14467D215594r8881K16277k33175M86805j10884o545n6720j77644O95381j74784
$$ 4215594 4116713 4332990 4099815 4586620 4475736 4469191 4412471 4234827 4930208 4755424
14457D755424J93661l36700J57485J96043L1107o1605Q1993R7445J88376l87617
$$ 4755424 4949085 4612385 4769870 4965913 4997020 4935415 5017408 5114853 5303229 4915612
14447D915612L95257M1128l3572K46740R4656k07613J36247M73654j52794k2220
$$ 4915612 5310869 5351997 5318425 5565165 5659821 5452208 5588455 6062109 5909315 5887095
14437E887095R1167M28219k17825o1457J20024L61052p9541O6996Q6428M716L35736
$$ 5887095 5978262 6406481 6188656 6127199 6247223 6608275 6528734 6595730 6682158 6686874 7022610
14426G022610K92j08967L51877j88727L23851Q5745k83290K83514N20201P2692
$$ 7022610 7022902 6913935 7265812 7077085 7400936 7486681 7203391 7486905 8007106 8079798
14416H079798R7741k01044N62347m34282L39836l4119K24798N0917N01630m25477
$$ 8079798 8177539 7976495 8538842 8104560 8444396 8410277 8635075 8685992 9187622 8762145
14406H762145L49215L21338q8746K95869J24838J15605L16552j3990J17477M89499
$$ 8762145 9111360 9432698 9343952 9639821 9764659 9880264 10196816 10182826 10300303 10789802
14396A0789802l27695M69572L71519O3024R9921L26893m17132O32284J25833J23797
$$ 10789802 10462107 10931679 11303198 11366222 11466143 11793036 11375904 12008188 12134021 12257818
14386A2257818J04181M62833p36M01754P8316P14783j2426K58731Q4517O37338
$$ 12257818 12361999 12824832 12824096 13225850 13304166 14018949 14006523 14265254 14349771 14987109
14376A4987109l50418Q55140K68845K12274O18572L4886L76486K48710L8211N86391
$$ 14987109 14636691 15491831 15760676 15972950 16591522 16626408 17002894 17251604 17289815 17876206
14366A7876206J01293O02394M68255M44006K79851N33231L69250N60035J97510
$$ 17876206 17977499 18579893 19048148 19492154 19772005 20305236 20674486 21234521 21432031
14357B1432031Q11622L20775N45677Q19430L01610N24207K91645R06851Q18616
$$ 21432031 22243653 22564428 23110105 23929535 24231145 24755352 25046997 25953848 26772464
14348B6772464R82086J85779Q43842Q14640R14331O79677M92840J112498P77622
$$ 26772464 27754550 27940329 28784171 29598811 30513142 31192819 31685659 32798157 33575779
14339C3575779Q66302J135406J066755R37111J144922R54611J833250Q36865J320632
$$ 33575779 34442081 35577487 36644242 37581353 38726275 39680886 41514136 42351001 43671633
14330D3671633J269531J305495J935148J115147K014931J186957K174791K058342
$$ 43671633 44941164 46246659 48181807 49296954 51311885 52498842 54673633 56731975
14322E6731975J887228J951137K394565K442238K120577K679126K526856L103353
$$ 56731975 58619203 60570340 62964905 65407143 67527720 70206846 72733702 75837055
14314G5837055K792090L281199L566877L262839L615879M137729M093189M703899
$$ 75837055 78629145 81910344 85477221 88740060 92355939 96493668 100586857 105290756
14306A05290756M395816N155050N431970N690414N864477O746809O683441P392960
$$ 105290756 109686572 114841622 120273592 125964006 131828483 138575292 145258733 152651693
14298A52651693P333395Q053490Q729018R683866R636384J0514260J1046226J1740148
$$ 152651693 159985088 168038578 176767596 186451462 196087846 206602106 217648332 229388480
14290B29388480J2657865J2986914J3976396J4486906J5195770J5904436J6178618
$$ 229388480 242046345 255033259 269009655 283496561 298692331 314596767 330775385
14283C30775385J6721626J6888759J6963645J6363906J5986342J5187278J4005587
$$ 330775385 347497011 364385770 381349415 397713321 413699663 428886941 442892528
14276D42892528J2747283J0912142Q661622M512871N52764j027385j513029k67967
$$ 442892528 455639811 466551953 475213575 479726446 480279210 479251825 477738796 477470829
14268D77470829r36718n027668r598747j1795956j3359833j4337741j5884795
$$ 477470829 476534111 471506443 461907696 450111740 436751907 422414166 406529371
14261D06529371j6609377j7270312j7113409j7153588j6524447j6182076j5548942
$$ 406529371 389919994 372649682 355536273 338382685 321858238 305676162 290127220
14254B90127220j4094847j4387017j3900329j2694988j2456902j1561472j0585940
$$ 290127220 276032373 261645356 247745027 235050039 222593137 211031665 200445725
14247B00445725j0385884r630459q916314q412198p872728p423569p168594o608660
$$ 200445725 190059841 180429382 171513068 163100870 155228142 147804573 140635979 134027319
14239A34027319o340980n374961n189243n547106m815311m770511m424197l594717
$$ 134027319 127686339 122311378 117122135 111575029 106759718 101989207 97565010 93970293
14231I3970293l435284l499471l826050k951756l537757l059799k627900k515923
$$ 93970293 90535009 87035538 83209488 80257732 76719975 73660176 71032276 68516353
14223F8516353k903954k065210j947134j955553k053243k239086j500385k157128
$$ 68516353 65612399 63547189 61600055 59644502 57591259 55352173 53851788 51694660
14215E1694660j327703j270627j357598j508983j762287j271148j205698j301935
$$ 51694660 50366957 49096330 47738732 46229749 44467462 43196314 41990616 40688681
14207D0688681l81820j145318j625468j264080j119959p59802o69919n45232j114616
$$ 40688681 40306861 39161543 37536075 36271995 35152036 34392234 33722315 33177083 32062467
14198C2062467j043129o46999j138228o34683l93893m00126j090224m99051j027935
$$ 32062467 31019338 30372339 29234111 28599428 28205535 27805409 26715185 26216134 25188199
14189B5188199j62858p47323n60325o25253n95263m26868k92151p43209m05280
$$ 25188199 25025341 24278018 23717693 23092440 22497177 22070309 21778158 21034949 20629669
14180B0629669k00835n76677l75074o00162k93248p03093K02355o39656l82568
$$ 20629669 20428834 19852157 19477083 18876921 18583673 17880580 18082935 17443279 17060711
14171A7060711k18229n55023k52579k92699j17513m21729l02944o0454j99814
$$ 17060711 16842482 16287459 16034880 15742181 15624668 15202939 14899995 14839541 14639727
14162A4639727l70642n08018j51341k10127m44249k8602m32050J58430k55940
$$ 14639727 14269085 13761067 13609726 13399599 12955350 12926748 12494698 12653128 12397188
14153A2397188m20654O1941k50600p09709K40036n635l03427k63266j1336m50793
$$ 12397188 11976534 12038475 11787875 11078166 11318202 11312567 11009140 10745874 10734538 10283745
14143A0283745k3561k57065k6330P7135k25079k62204k78235p440k35857q7841
$$ 10283745 10260184 10003119 9976789 10053924 9828845 9566641 9288406 9280966 9045109 8957268
14133H957268l63285n659p6637m3251k96254K40895l56623J07335l26435J27294
$$ 8957268 8593983 8588324 8511687 8468436 8172182 8413077 8056454 8163789 7837354 7964648
14123G964648j14539l30970j39744j94900L4042J49437l16244m4545R1361k04268
$$ 7964648 7850109 7519139 7379395 7184495 7218537 7367974 7051730 7007185 7098546 6894278
14113F894278p4872j50467P9353j28846L9488m62514L03058n34427L23389m77799
$$ 6894278 6819406 6668939 6748292 6619446 6658934 6196420 6499478 5965051 6288440 5810641
14103E810641K44194k82922M23646l65199j09517j84442k11890L39287j13749
$$ 5810641 6054835 5771913 6195559 5830360 5720843 5536401 5324511 5663798 5550049
14094E550049m10488J82520j01207l86511Q6418J83444q7271l2419k51482J28674
$$ 5550049 5139561 5322081 5220874 4834363 4920781 5104225 5016954 4984535 4733053 4861727
14084D861727k33656M17350o15604r2115J18723j65094P5194O2242N8813k30222
$$ 4861727 4628071 5045421 4429817 4337702 4456425 4291331 4366525 4428767 4487580 4257358
14074D257358j91442K1062J61751l40683N02249l23301j55722q3452J72162k22914
$$ 4257358 4065916 4086978 4248729 3908046 4410295 4086994 3931272 3847820 4019982 3797068
14064C797068P9503o4501K05973j08347K31606L64688k65702m56296K46346j14956
$$ 3797068 3876571 3812070 4018043 3909696 4141302 4505990 4240288 3783992 4030338 3915382
14054C915382k68125l33040M87556l71642K10370k56535J15132k47051p0961P7057
$$ 3915382 3647257 3314217 3801773 3430131 3640501 3383966 3499098 3252047 3181086 3258143
14044C258143j1137o33772K05634L45722j97090m6312K79649n9920l3113l7476
$$ 3258143 3247006 2613234 2818868 3164590 2967500 2921188 3200837 3140917 3107804 3070328
14034C070328m9851j22516k90924N37336R5162k52947j27421J84332J846m90172
$$ 3070328 3020477 2897961 2607037 3144373 3239535 2986588 2859167 3043499 3045345 2555173
14024B555173M44201l23804o5229k0278j4694O5400k64052L81492k53078j68855
$$ 2555173 2999374 2675570 2610341 2590063 2575369 2640769 2376717 2758209 2505131 2336276
14014B336276K34261m94652N66321j13044m97567K36929q2927J78207m75087K55875
$$ 2336276 2570537 2075885 2642206 2529162 2031595 2268524 2185597 2363804 1888717 2144592
14004B144592N7483k53463R776J96961k93125L43224k82194r0102R6753J25567
$$ 2144592 2202075 1948612 1958388 2155349 1862224 2205448 1923254 1833152 1929905 2055472
13994B055472l47578K18908N1802L06416N6729R11615K648447P282823J8221652
$$ 2055472 1707894 1926802 1978604 2285020 2341749 3253364 5901811 13184634 31406286
13985C1406286J9880058k3097110A1618440m512782j654769j119159o69360k11040
$$ 31406286 51286344 28189234 11618440 7105658 5450889 4331730 3662370 3451330
13977C451330n8827p22596J94498j42519R3764o23639K44591j90988q6260R282
$$ 3451330 3392503 2669907 2864405 2721886 2815650 2192011 2436602 2245614 2159354 2168636
13967B168636N1618j09388Q0156j78644N0670P2177l9897k46188Q2050m0432K59739
$$ 2168636 2220254 2110866 2191022 2012378 2063048 2135225 2095328 1849140 1931190 1890758 2150497
13956B150497n77846M68210m01618K81252Q0123l02664J92625l38200K80759k0365
$$ 2150497 1572651 2040861 1639243 1920495 2000618 1697954 1890579 1552379 1833138 1812773
13946A812773k10763R469J70172l92298J3391m2385L30177k16289K18767R5033
$$ 1812773 1602010 1611479 1781651 1389353 1402744 1360359 1690536 1474247 1693014 1788047
13936A788047l3111p2976l60662N63567k85787K40716Q2788l92533K77365k79242
$$ 1788047 1754936 1681960 1321298 1884865 1599078 1839794 1922582 1530049 1807414 1528172
13926A528172K4687O6257Q3975l81548j19115J19507L13971k72500j82592K45734
$$ 1528172 1552859 1619116 1703091 1321543 1202428 1321935 1635906 1363406 1180814 1426548
13916A426548k77633N84517k18762l19080K56123l24815L21943p685k0355j68473
$$ 1426548 1148915 1733432 1514670 1195590 1451713 1126898 1448841 1441156 1420801 1252328
13906A252328J19855j19027K62657l34419L0583K76789q7823J68182n27195N23629
$$ 1252328 1372183 1253156 1515813 1181394 1211977 1488766 1400943 1569125 1041930 1565559
13896A565559n38398K13921J90452j62076j02430J40814k94451K02552K39057
$$ 1565559 1027161 1241082 1431534 1269458 1167028 1307842 1013391 1215943 1455000
13887A455000q8482j89851M3465m5127J7518j96744r597M14528k92798j27971
$$ 1455000 1366518 1176667 1220132 1175005 1192523 995779 986182 1400710 1107912 979941
13877I79941Q6332j28274k3013L79769l1345l58473L76709o3699j67357r7664
$$ 979941 1066273 937999 914986 1294755 1263410 904937 1281646 1217947 1050590 952926
13867I52926l8945K67457j17621K11163j03144m70053L73729l3169k85728J64171
$$ 952926 913981 1181438 1063817 1274980 1171836 701783 1075512 1042343 756615 920786
13857I20786p1951L2695q0231L56519k52518j13632L43224k62389j54120N28613
$$ 920786 848835 881530 801299 1157818 905300 791668 1134892 872503 718383 1246996
13847A246996k44288L5447l01934L39857n6212r8885J79821m27728N32097m7285
$$ 1246996 1002708 1038155 736221 1076078 1019866 920981 1100802 673074 1205171 1157886
13837A157886J7972j85386J02292k07600N7739p7794J21819K20255l14343J43563
$$ 1157886 1175858 990472 1092764 885164 942903 865109 986928 1207183 892840 1036403
13827A036403K73577p3762E01006P08114k42111J2750l33814Q0992J89462P0348
$$ 1036403 1309980 1236218 501006 1209120 967009 979759 645945 726937 916399 986747
13817I86747p2647O5237r3489q9089j82998O991K59363J35870l78693R1421l1955
$$ 986747 914100 979337 885848 796759 613761 620752 880115 1015985 637292 728713 696758
13806F96758R3085n629p4423J08887C45048K64868J40967l32019J47770M0241
$$ 696758 789843 784214 709791 818678 345048 609916 750883 418864 566634 606875
13796F06875P18829o44033k02001M77333l91128K23361L8843M1958k02170j19324
$$ 606875 1325704 681671 479670 957003 565875 789236 828079 870037 667867 548543
13786E48543M2366B88974J70462K57566L8709Q4202j59732j54862K0402o7812
$$ 548543 590909 288974 459436 717002 755711 839913 680181 525319 545721 477909
13776D77909K94374k36877O61089k31275l37783J67302J68856l49072j48545K01516
$$ 477909 772283 535406 1196495 965220 627437 794739 963595 614523 465978 667494
13766F67494B89618J07424K26551R6307P961B59327P61225k06995l2319l41912
$$ 667494 289618 397042 623593 719900 727861 259327 1020552 813557 781238 439326
13756D39326L18976k77683K39572Q248j3643r6345j48602q7800R1910Q7249j13037
$$ 439326 758302 480619 720191 728439 714796 618451 469849 382049 473959 561208 448171
13745D48171M17362k82901M638J22176A25435M22649o0614K1808L03698D01801
$$ 448171 865533 582632 587270 709446 125435 548084 487470 509278 812976 401801
13734E83065p2231j39399K94519K7457k91148K3803J36018K3377r3152J59282
$$ 583065 510834 371435 665954 693411 402263 426066 562084 585461 492309 651591
13724F51591j74745J39637L12722A97678J87985r446R6279J408p4627K31404j77288
$$ 651591 476846 616483 929205 197678 385663 376217 472496 473904 399277 630681 453393
13713D53393K44066j72853j56145J41017j34382J95670m4053L4670K8566q976
$$ 453393 697459 524606 368461 509478 375096 570766 526713 561383 589949 580973
13703E80973j72563J56031j32918O4765Q7699p3135M6170J93491J55737m8101
$$ 580973 408410 564441 431523 496288 583987 510852 557022 750513 906250 858149
13693H58149C16587K04117M5743J2243j77962J46274j44286R9886M126j3050K08373
$$ 858149 316587 520704 566447 578690 400728 547002 402716 502602 506728 493678 702051
13682G02051d1551A84642L03254J25018q0487O4862F1225B6001N38987j18762
$$ 702051 -41551 184642 487896 612914 532427 597289 61225 26001 564988 446226
13672D46226K42806B49607J82435Q8840o5216K28915l25485J24318k7216m1812
$$ 446226 689032 249607 432042 520882 455666 684581 359096 483414 456198 414386
13662D14386O1946j6877j13122Q7586j06485J86334L50807m19695K18699C21935
$$ 414386 476332 459455 346333 433919 327434 513768 864575 444880 663579 321935
13651B33696m6422M80584B44739K06203j27980j4850N8570q5466J17897J75715
$$ 233696 187274 667858 244739 450942 322962 308112 366682 281216 399113 574828
13641E74828j53090L7328k26178N05254C47709P4122j56166M30149B55641O5272
$$ 574828 421738 459066 232888 738142 347709 421831 265665 695814 255641 320913
13631C20913l3858J31971J75805E637K73996O6142r3015A18355N52415j86957
$$ 320913 287055 419026 594831 5637 279633 345775 252760 118355 670770 483813
13621D83813A20736L66132j46385j5864G5752N3764K94474J22508q8039K219l6526
$$ 483813 120736 486868 340483 324619 75752 129516 423990 546498 458459 460678 424152
13610D24152p1709J21758K05966k71580L17373a81878H5357L27465j48255b4274
$$ 424152 352443 474201 680167 408587 725960 -181878 85357 412822 264567 -24274
13599C07260j01936L5335N2643j08623N9071J10583J26729P5708B11710K24267
$$ 307260 205324 240659 293302 184679 243750 354333 481062 556770 211710 435977
13589D35977q3707j31916O9966J97645l0385j72936o9915b7799E39282B21158
$$ 435977 352270 220354 290320 487965 457580 284644 214729 -27799 539282 221158
13578C04854A03191b9511B67701q5764g8569B03690D7217L64655j94284K38374
$$ 304854 103191 -29511 267701 181937 -78569 203690 47217 411872 217588 455962
13568D55962j20627p945k893K04646j83215A67831C6206M33534B33331G1058K65040
$$ 455962 335335 327390 324497 529143 345928 167831 36206 469740 233331 71058 336098
13557C36098A23565M29081B4005K58732Q1536J95711b6542B20846K96186j72934
$$ 336098 123565 552646 24005 282737 364273 559984 -26542 220846 517032 344098
13547C44098O4743j28583h2909F08567A99563n0202L57912j06609j53242L27797
$$ 344098 408841 280258 -82909 608567 199563 149361 507273 400664 247422 575219
13537E75219j63164L3131k15116J34835j60612L81436I8907J33087J64660o7206
$$ 575219 412055 445186 230070 364905 204293 585729 98907 231994 396654 329448
13527C29448a0523H8594N48893a89471C20312n4261j09319K79759f9748m9115
$$ 329448 -10523 88594 637487 -189471 320312 266051 156732 436491 -69748 -118863
13517a18863E34847A8423J64490L23827Q9193D1674b03180B14519K11564k11925
$$ -118863 534847 18423 182913 506740 595933 41674 -203180 214519 426083 214158
13507B14158K24480a2934F07443j87136A18820K16287K77002k30903A09585N30415
$$ 214158 438638 -12934 607443 420307 118820 335107 612109 381206 109585 640000
13497F40000k95722q7927O9675q2568j01921K20524j52648J93350j67443a47284
$$ 640000 344278 256351 326026 243458 141537 362061 209413 402763 235320 -147284
13486A55983F6563K7285K70337d1517F11715k35326C916K66719I7210J43769B3232
$$ 155983 66563 93848 364185 -41517 611715 376389 3916 270635 97210 240979 23232
13474A75431E4465P1464e4146E86039A64682E5022N1540J45651A22293J71929
$$ 175431 54465 125929 -54146 586039 164682 55022 106562 252213 122293 294222
13464B94222A44853L32516H5111P0668h8834A41619Q8907o5094K63653I2463J99033
$$ 294222 144853 477369 85111 155779 -88834 141619 230526 165432 429085 92463 291496
13453B91496j00203J12174K61204j01592A19436J75764J0890M64821l22772g8130
$$ 291496 191293 303467 564671 463079 119436 295200 306090 770911 448139 -78130
13442i4367A10901l0514a2987A66376G171J59875D6533J10041e7711B17415b64576
$$ -94367 110901 80387 -12987 166376 7171 167046 46533 156574 -57711 217415 -264576
13430a27326B97960A15326J10842M0636a5610C59368A54420c3824j52806D18529
$$ -127326 297960 115326 226168 266804 -15610 359368 154420 -33824 -186630 418529
13419C36355F0631J82537L7070j00565K69529a65726D6518L1086f2032I1921h079
$$ 336355 60631 243168 280238 179673 449202 -165726 46518 77604 -62032 91921 -8079
13407A51696a82359B91353j7823B9023K91847P0140I2971A7696K23449a56602
$$ 151696 -182359 291353 273530 29023 320870 391010 92971 17696 241145 -156602
13396B51517L6550M6353j896A09867a67274C02002d2990l6330D32564p9784c9969
$$ 251517 288067 334420 332524 109867 -167274 302002 -42990 -79320 432564 352780 -39969
13384D93626H9810L87474E1286R7997n8282L059L61719a9988A65021K34528a0215
$$ 493626 89810 477284 51286 149283 91001 94060 455779 -19988 165021 399549 -10215
13372B83528j09041b99887D36816A03412J03641J38836a8555C27080J18192b04010
$$ 283528 174487 -299887 436816 103412 207053 345889 -18555 327080 445272 -204010
13361H3671P5938J43059m5924a89706e8850D47957B7164a24432A48835O7094d2865
$$ 83671 159609 302668 256744 -189706 -58850 447957 27164 -124432 148835 215929 -42865
13349B18663b13989C11439j38701A5489O970L43500A36827M786E300K96675J85383
$$ 218663 -213989 311439 172738 15489 22459 365959 136827 141613 5300 301975 487358
13338D87358C9255J72977L80803m8629d6925B09329N3998D0093M20412I4079N5235
$$ 487358 39255 212232 593035 544406 -46925 209329 263327 40093 460505 94079 149314
13327A49314J25901J7342J61795A57082B5520N4414J0829m4077K04726J17088
$$ 149314 275215 292557 454352 157082 25520 79934 90763 46686 251412 368500
13317C68500j44466o8449m8579L4389g6996F8514A6359J08406K66077A14505h5246
$$ 368500 224034 155585 107006 141395 -76996 68514 16359 124765 390842 114505 -85246
13305D39845D2227K70484J71226B05679l7812p8189K75950A02369P3435k5226
$$ 439845 42227 312711 483937 205679 167867 89678 365628 102369 175804 150578
13295A50578J7123a1936D9910J40215e0304H5783K51451J86607b53470D12476
$$ 150578 167701 -11936 49910 190125 -50304 85783 337234 523841 -253470 412476
13284C3979a62055C9076K61378a25392A40564c7529A20241D4126N03900B32154
$$ 33979 -162055 39076 300454 -125392 140564 -37529 120241 44126 548026 232154
13273A2710L3237J04920N0643g2672k28854A42605J82146m4040F52c43378a61261
$$ 12710 45947 150867 201510 -72672 -301526 142605 324751 280711 652 -343378 -161261
13261B01449j4334J09606j9278c263p5959A60199J91806e8206D6177a52801C12155
$$ 201449 187115 296721 277443 -3263 -79222 160199 352005 -58206 46177 -152801 312155
13249D22725A18122b64116A07449a68611A77243J34169Q8015K1237A04046J45368
$$ 422725 118122 -264116 107449 -168611 177243 311412 399427 420664 104046 249414
13239B49414N3482a39243A48852i6533p86A46085N2880g0976B23279a76691r228
$$ 249414 302896 -139243 148852 -96533 -97319 146085 198965 -70976 223279 -176691 -185919
13228a85919F4481J53288J06356A5358K66784j15899b2447F2188J56404b23536
$$ -185919 64481 217769 324125 15358 282142 166243 -22447 62188 218592 -223536
13217B88624c18118C30425f2382B91466d4069E6606R7068a12329C78664d0710
$$ 288624 -318118 330425 -62382 291466 -44069 56606 153674 -112329 378664 -40710
13206A46329L0279G3956C4505L42879D6376d1739B63503o8275b8013B31962c03709
$$ 146329 176608 73956 34505 377384 46376 -41739 263503 195228 -28013 231962 -303709
13194E4662B4042L23880j63896H3422N2109I5a35616A69985J41801Q933A3205
$$ 54662 24042 347922 184026 83422 135531 95 -135616 169985 311786 320719 13205
13182F6784j730b60664a15394A45976K85488b71866E0883a643k1074D47610A03492
$$ 66784 65054 -260664 -115394 145976 431464 -271866 50883 -1643 -22717 447610 103492
13170A19828E9541J5789P2804Q0518a6418B18573c1798J1326F0480a63857B56779
$$ 119828 59541 75330 148134 228652 -16418 218573 -31798 -20472 60480 -163857 256779
13158B48403a92510B70254p4805a15041B0924P7367J34176b99035a47570b9083
$$ 248403 -192510 270254 195449 -115041 20924 98291 232467 -299035 -147570 -29083
13147I4663i9592m404k068L4367A5999h3178f266B71111b19371B23277i0033E1301
$$ 94663 -99592 -103996 -106064 -71697 15999 -83178 -6266 271111 -219371 223277 -90033 51301
13134F2008b40446A73244B077K58726A18662K07273A34768J23365d3413j85474
$$ 62008 -240446 173244 2077 260803 118662 325935 134768 258133 -43413 -228887
13124b28887B19501K5519b56523e5051K6043A17947d6462A80461K00563m2843
$$ -228887 219501 245020 -256523 -55051 -29008 117947 -46462 180461 381024 338181
13114C38181a62371j21675c8365A05837R6714C6705a34412K5731A07049a80192
$$ 338181 -162371 -284046 -38365 105837 202551 36705 -134412 -108681 107049 -180192
13103F9903d48671a55445F7769J44502K21354A24761J81029j17430A5623J90582
$$ 69903 -448671 -155445 67769 212271 433625 124761 305790 188360 15623 206205
13093B06205p2664l2927K09240I2438J12691J08465C7020J179Q7287J42671j4018
$$ 206205 133541 100614 309854 92438 205129 313594 37020 38199 125486 268157 254139
13082B54139J44296j02223H5884a22225A23813J56863a9373A08742J37311G2590
$$ 254139 398435 296212 85884 -122225 123813 280676 -19373 108742 246053 72590
13071A68766E6845b3505B0382a07713j27683e5621A577J01403L31643a88317H9088
$$ 168766 56845 -23505 20382 -107713 -235396 -55621 1577 102980 434623 -188317 89088
13059I4472b002A48553M3512J35032j32967a3498B26340A00064l7340j2834J17081
$$ 94472 -2002 148553 192065 327097 194130 -13498 226340 100064 62724 49890 166971
13048A66971D4144J7950j3398J2274R960b3722j19997k7221A52268b22143C39286
$$ 166971 44144 62094 48696 60970 70930 -23722 -143719 -170940 152268 -222143 339286
13036G4593k9576a79162D609a78063A57946K69279a08035b8426A88438M4977K07164
$$ 74593 45017 -179162 4609 -178063 157946 427225 -108035 -28426 188438 233415 440579
13025D40579a86389G2687J46170l3884h4765A25953N3689f9778j32766A73614
$$ 440579 -186389 72687 218857 184973 -84765 125953 179642 -69778 -202544 173614
13014E3418L4396n365d6327B29042O9998q9705g5711A05072a33209B00501a31727
$$ 53418 87814 82449 -46327 229042 299040 209335 -75711 105072 -133209 200501 -131727
13002h4365n2111d1768C64289b5969A79075G7642A2278i3974B65149n8615e63683
$$ -84365 -136476 -41768 364289 -25969 179075 77642 12278 -93974 265149 206534 -563683
12990i2802j10294I3008a32117G778M2009J51341m4860J87473I1038l3730J61145
$$ -92802 -203096 93008 -132117 7778 49787 201128 156268 343741 91038 57308 218453
12979B18453J7365G1407n37K7960f0961A8441J47720J86617a72858B7853J12390
$$ 218453 235818 71407 70870 98830 -60961 18441 166161 352778 -172858 27853 140243
12968A40243J18466A01062J08094c3088A07998K16732a72822C4338D070a25217
$$ 140243 258709 101062 209156 -33088 107998 324730 -172822 34338 4070 -125217
12957a31468B04656A00598b72852D6158J46747j0211b04216A91203B2955N3492
$$ -131468 204656 100598 -272852 46158 192905 182694 -204216 191203 22955 76447
12947G6447j0382b3737m09503i7056q013E8320J5648K45780H2237c7429a5139
$$ 76447 66065 -23737 -433240 -97056 -105069 58320 73968 319748 82237 -37429 -15139
12935a02330q8483C2010H150b56659b0084A09963P7009H7811J34863k6085O2077
$$ -102330 -190813 32010 8150 -256659 -20084 109963 186972 87811 222674 196589 258666
12924B58666A15275L0179e0940r0463B65214k1820o4420h1267n4327G2631a36631
$$ 258666 115275 145454 -50940 -141403 265214 243394 178974 -81267 -135594 72631 -136631
12912A75639K11166H7918L5256a83178g1806B77653A30470b0581B01030b89989
$$ 175639 386805 87918 123174 -183178 -71806 277653 130470 -20581 201030 -289989
12901A30046f338k16191B15575C3247L70376h0693E7315a61648m2798B25681k9768
$$ 130046 -6338 -222529 215575 33247 403623 -80693 57315 -161648 -204446 225681 195913
12890A95913q8267a14390C5242L2434A2375a45624D6432i0105B26529G2012J44474
$$ 195913 107646 -114390 35242 67676 12375 -145624 46432 -90105 226529 72012 216486
12879B16486G995a07878p1984A56836n9834l575f1270F6205a50129j73451A178
$$ 216486 7995 -107878 -179862 156836 97002 93427 -61270 66205 -150129 -323580 1178
12867G5837a03933j7899N9795A53913o7810M7309K38001h629D46396A35386E9383
$$ 75837 -103933 -121832 -62037 153913 86103 133412 371413 -8629 446396 135386 59383
12855h7778C66779G4838J49724J1965a48162C39990J0096b31932g8503L115a9315
$$ -87778 366779 74838 224562 236527 -148162 339990 350086 -231932 -78503 -75388 -19315
12843A21381a28724C5266j2808K30268a01452C40323b12436G1407J67149H4566
$$ 121381 -128724 35266 22458 252726 -101452 340323 -212436 71407 238556 84566
12832B5787c7743k85902f2075A12840a1034j07847I9015M8065b71103A25923J74103
$$ 25787 -37743 -323645 -62075 112840 -11034 -118881 99015 147080 -271103 125923 300026
12821C00026A39911g0826j83378B69070n7888a51547J1260j67534D4512b87240
$$ 300026 139911 -70826 -254204 269070 211182 -151547 -140287 -307821 44512 -287240
12810a69974j871F5919J27487a53173A93361f2879b6310A77491k2915E1889K22070
$$ -169974 -171845 65919 193406 -153173 193361 -62879 -26310 177491 154576 51889 273959
12799B73959B1885K30506J80021e079p2559J2452i213D8349J01218E041b17664
$$ 273959 21885 252391 432412 -5079 -77638 -65186 -9213 48349 149567 5041 -217664
12787g0944K6568j24110A27479d05611A9886a19339c5762j34123k3646A03822
$$ -70944 -44376 -168486 127479 -405611 19886 -119339 -35762 -169885 -193531 103822
12776A39802g3435k8766d151k23994A48977C5765M30475c33664a28434J2978r343
$$ 139802 -73435 -102201 -4151 -228145 148977 35765 466240 -333664 -128434 -115456 -124799
12765a24799A47302f1947j67108h5619j44465D7318R8799M407F9387L5924c10879
$$ -124799 147302 -61947 -229055 -85619 -230084 47318 146117 150524 69387 105311 -310879
12753A44672c19196D6012J19634k6359d3180P751A77050B1736b52588B7721i730
$$ 144672 -319196 46012 165646 139287 -43180 -35429 177050 21736 -252588 27721 -9730
12741A42568L3606a32329r2565H7182R1260J45318r010a44649C81915q0484f3654
$$ 142568 176174 -132329 -224894 87182 178442 323760 314750 -144649 381915 301431 -63654
12729G411J53913k9171h0521F124L2554a14676l0506o5960B1903J74251m0249
$$ 7411 161324 132153 -80521 6124 38678 -114676 -145182 -211142 21903 196154 155905
12718A55905A1897J30890R2148A8114b16024a02930C2010b9091A65508O8393a34395
$$ 155905 11897 142787 234935 18114 -216024 -102930 32010 -29091 165508 233901 -134395
12706g9162A22135K69412k8149m3337I7177M1055k1035a64927g8747C6071L15203
$$ -79162 122135 391547 363398 320061 97177 138232 117197 -164927 -78747 36071 351274
12695C51274O8818a80736A67883e5120B75739C716N76639A29306d83088E0229
$$ 351274 420092 -180736 167883 -55120 275739 3716 580355 129306 -483088 50229
12684A10775d3671D303R1391A342J06117A9187O5377M5360d3077A22346Q3478
$$ 110775 -43671 4303 95694 1342 107459 19187 84564 129924 -43077 122346 205824
12673B05824a29266B8441a12701A73224M5132g2028H4429a67976G8224L5296d389
$$ 205824 -129266 28441 -112701 173224 218356 -72028 84429 -167976 78224 113520 -4389
12661B59795d7323C46248H9772J95115a21188A15348M2805i8419B5655a72594
$$ 259795 -47323 346248 89772 284887 -121188 115348 158153 -98419 25655 -172594
12650a66384C21884o9760r7069C9712i5865B8103b7701A01963K4970K40620g1002
$$ -166384 321884 252124 155055 39712 -95865 28103 -27701 101963 126933 367553 -71002
12638H0937N4377a45575e3037d122j26171D5076g5820C59830A72024a9303p2689
$$ 80937 135314 -145575 -53037 -4122 -130293 45076 -75820 359830 172024 -19303 -91992
12627i1992E00643k36589I2491M4897R0866H5749b18245C66148j50812c27149
$$ -91992 500643 264054 92491 137388 228254 85749 -218245 366148 215336 -327149
12616D8283m499a58586A43094a37134H9044f0042a7194E3750a7394A5425L57727
$$ 48283 43784 -158586 143094 -137134 89044 -60042 -17194 53750 -17394 15425 373152
12605C73152D3201J32136b53947A89246K51177j14291a19674j85924e432C2991
$$ 373152 43201 175337 -253947 189246 440423 326132 -119674 -305598 -5432 32991
12594g4313j46001A93479f876n664N654a441A41029C722a11988C9530J25510a3176
$$ -74313 -220314 193479 -6876 -12540 -6886 -1441 141029 3722 -111988 39530 165040 -13176
12581A9979J76941J18484j25569P9579n8307r7965D3844Q507j9917J73037b50417
$$ 19979 196920 315404 189835 269414 211107 113142 43844 52351 32434 205471 -250417
12569C98002I9817c8168j26526j26033l6701a01195p4892D22188A92435l1842
$$ 398002 99817 -38168 -164694 -290727 -327428 -101195 -176087 422188 192435 160593
12559A60593J25834e5370H0912P4200K6415a07141j37054F7100a68317B14962
$$ 160593 286427 -55370 80912 155112 181527 -107141 -244195 67100 -168317 214962
12548G0529J15914c79384J88254c7482H2410C7385J39372A5168b38381B81510
$$ 70529 186443 -379384 -191130 -37482 82410 37385 176757 15168 -238381 281510
12537B6601a65166D4900Q8800i4002A86449J04123l2327E021N7183M2847C4416
$$ 26601 -165166 44900 133700 -94002 186449 290572 258245 5021 62204 105051 34416
12525B10477i3111I2363J67177D0927P4514P2421l8501L8880D1402J53275J3019
$$ 210477 -93111 92363 259540 40927 115441 187862 149361 188241 41402 194677 207696
12514B07696f3074I1725a85685j667c4978j07467H6514J21689F0962J47030d59074
$$ 207696 -63074 91725 -185685 -187352 -34978 -142445 86514 208203 60962 207992 -459074
12502a1879B57965i1703j22140f8904j91014O622E8895L2006d9247B42600g9024
$$ -11879 257965 -91703 -213843 -68904 -259918 -253296 58895 90901 -49247 242600 -79024
12490a37478A04823b26250B24340b4174a0244j41792B44895b98536a6596A60048
$$ -137478 104823 -226250 224340 -24174 -10244 -152036 244895 -298536 -16596 160048
12479G5261J13045C9766J66056b3992m96957b17572H6200a74226E5468N2599b04873
$$ 75261 188306 39766 205822 -23992 -520949 -217572 86200 -174226 55468 108067 -204873
12467A88466b77525J18875B98613a77409P7181B52871L492b12041C18171a16194
$$ 188466 -277525 -158650 298613 -177409 -100228 252871 256363 -212041 318171 -116194
12456f4701c1756A44635f5779b5030q2686a3253l47175A00568l2093b19354A94915
$$ -64701 -31756 144635 -65779 -25030 -107716 -13253 -360428 100568 68475 -219354 194915
12444a6388k39890o9531J47766L0793b0840A90513p1856b8089C3392A0154b36502
$$ -16388 -256278 -325809 -178043 -147250 -20840 190513 118657 -28089 33392 10154 -236502
12432a56475j32994C3193d37122A72050k1178B0917i243k58662A03192J41937
$$ -156475 -289469 33193 -437122 172050 150872 20917 -9243 -267905 103192 245129
12422B45129a84317C9031g6400k06839D2357c27040A21431c32296A81156a36506
$$ 245129 -184317 39031 -76400 -283239 42357 -327040 121431 -332296 181156 -136506
12411b19467f42l4331j85726M5100j03794d625k0620A87107a85635c3868e396
$$ -219467 -642 -34973 -220699 -175599 -279393 -4625 -25245 187107 -185635 -33868 -5396
12399i8763B43095b89159i1824A45284c5117F5654J20744C5899C502f4952O69
$$ -98763 243095 -289159 -91824 145284 -35117 65654 186398 35899 3502 -64952 -64283
12388f4283k45019a00691M8494j67007N0675A74964J5302H0700b38826B30196
$$ -64283 -309302 -100691 -52197 -219204 -168529 174964 190266 80700 -238826 230196
12377b12656a5024F9227J78897a71136A86918a56342A27854A9341b00217h9870
$$ -212656 -15024 69227 248124 -171136 186918 -156342 127854 19341 -200217 -89870
12366B95640a22504b9442A14114d8757a3590A24053N1791D2276J37636J02854
$$ 295640 -122504 -29442 114114 -48757 -13590 124053 175844 42276 179912 282766
12356B82766f0311C2532N3315i3055d998k9903j96971c7312A77464P4944F4434
$$ 282766 -60311 32532 85847 -93055 -4998 -34901 -231872 -37312 177464 252408 64434
12344A07729b69867b8381A34741a74462A03136B1932K31270a57419q1340i0621
$$ 107729 -269867 -28381 134741 -174462 103136 21932 253202 -157419 -238759 -90621
12333B7633A1130J09801b02896A58236d77118K07717C21424l7345j18997O4426
$$ 27633 11130 120931 -202896 158236 -477118 -269401 321424 284079 165082 229508
12323B29508a61813B87397p9872e4198B17085a98362A78872a68456a3287p2803
$$ 229508 -161813 287397 207525 -54198 217085 -198362 178872 -168456 -13287 -86090
12313h6090A98431a26383N9867c1794j72436g4814D4898J40990H3580c5941A04268
$$ -86090 198431 -126383 -66516 -31794 -204230 -74814 44898 185888 83580 -35941 104268
12301c1719l74454C81714G3381L7437N3418j3448b6956j05426B14274k4267c2615
$$ -31719 -406173 381714 73381 110818 164236 150788 -26956 -132382 214274 190007 -32615
12289a01921r3855A44036K7078D0606J68362H0974K44186a15557B29232g1384
$$ -101921 -195776 144036 171114 40606 208968 80974 325160 -115557 229232 -71384
12278A18985K20470A59278R1905j2692q2534J0779J76692d8130H8110L25608c4461
$$ 118985 339455 159278 251183 238491 155957 166736 343428 -48130 88110 413718 -34461
12266f0807F6849e4972Q699H4034J3770L7429J86543E9718L67553E9918b55697
$$ -60807 66849 -54972 -46273 84034 97804 135233 321776 59718 427271 59918 -255697
12254A60954j3522a31747A23055a74018B37595c8624A11508R5480J29537C0313
$$ 160954 147432 -131747 123055 -174018 237595 -38624 111508 206988 336525 30313
12243G0566N5964l8196N9544a3598B79467a06121M2161k7351A57394j6161E4813
$$ 70566 126530 88334 147878 -13598 279467 -106121 -63960 -91311 157394 141233 54813
12231D90542B31832k8929H2295R5235o5121K037J48989B9204L84828A83761J26237
$$ 490542 231832 202903 82295 177530 112409 114446 263435 29204 414032 183761 309998
12220C09998K02559a95485B11073N8757G8308K41J49967l7026q6488O70J48090
$$ 309998 512557 -195485 211073 269830 78308 78549 228516 191490 105002 105672 253762
12209B53762a83480C3237b43025F2725L6321J65136K8535K2713m4991J11513j87608
$$ 253762 -183480 33237 -243025 62725 99046 264182 292717 315430 270439 381952 194344
12198A94344K03238A61382k6513h4835C21179r1891H2981J538N5942i0451C09086
$$ 194344 397582 161382 134869 -84835 321179 229288 82981 84519 140461 -90451 309086
12186E66461c04610b9613H5559b8210a3048A73987o7632M37753j95567g848o6845
$$ 566461 -304610 -29613 85559 -28210 -13048 173987 106355 544108 348541 -7848 -74693
12175g4693B53656A5224f4849B1406K1325c6242d829E83879k72176A06193L7709
$$ -74693 253656 15224 -64849 21406 42731 -36242 -4829 583879 311703 106193 143902
12164A43902J84653d9741B09286J2550K5962j05069A3601J6739r199b64630F7271
$$ 143902 328555 -49741 209286 221836 247798 142729 13601 30340 21141 -264630 67271
12152a58987A46683P8380o947P9935j33670f0852n1892A96174a65764M595C3064
$$ -158987 146683 225063 218116 298051 164381 -60852 -112744 196174 -165764 -161169 33064
12140b4158A46656c39050a62426A04978c1919B72658D512R5423m4992j7610K05218
$$ -24158 146656 -339050 -162426 104978 -31919 272658 4512 99935 54943 37333 242551
12129B42551H782K1943f5992j16785f3346A47957a04773H8166R5299a25780L4780
$$ 242551 8782 30725 -65992 -182777 -63346 147957 -104773 88166 183465 -125780 -91000
12118i1000b7330A23691a20796d7766d047j88918c6817C92189h671p2206D0074
$$ -91000 -27330 123691 -120796 -47766 -4047 -192965 -36817 392189 -8671 -80877 40074
12106B3013R8780b90497a02061k22799G8234c8821D1438J67707b00221i5493A75500
$$ 23013 121793 -290497 -102061 -324860 78234 -38821 41438 209145 -200221 -95493 175500
12094A00045b69975E137J49971m0027a66345K7450E8306a49138c6261o6646D9785
$$ 100045 -269975 5137 155108 115081 -166345 -138895 58306 -149138 -36261 -102907 49785
12082B7958Q1285L09277A88105R5552L24206J117118N93441B92990E7243L06714
$$ 27958 109243 418520 188105 283657 607863 1724981 2318422 292990 57243 363957
12072C63957A1920K25312c42684i1498L223I7716b23542C12015j44307K7391o9386
$$ 363957 11920 237232 -342684 -91498 -88275 97716 -223542 312015 167708 195099 125713
12061A25713b14573A01594L80104G3279B8096P2768a24363B82909h7208q7718
$$ 125713 -214573 101594 481698 73279 28096 100864 -124363 282909 -87208 -174926
12051a74926L0758I4396j3220A7801R9742O5428c91625a33879A42364b97394g6264
$$ -174926 -144168 94396 81176 17801 117543 182971 -391625 -133879 142364 -297394 -76264
12039A70019a90396A11446C3835c3673A17353a17315b7087k4394A26296a019m4327
$$ 170019 -190396 111446 33835 -33673 117353 -117315 -27087 -51481 126296 -1019 -45346
12028d5346l13935E4822J5779K5276b74642b0251F44c5513C18059A21562D4264
$$ -45346 -359281 54822 70601 95877 -274642 -20251 644 -35513 318059 121562 44264
12016i9750k3821b3909B8828O4278c8965H0473b71900c1356p538L901I9436a84807
$$ -99750 -123571 -23909 28828 93106 -38965 80473 -271900 -31356 -38894 -34993 99436 -184807
12003G7348c9760p5619C738J92746j3868L7576E3852h2345G0619h3381L3792m2044
$$ 77348 -39760 -115379 3738 196484 182616 220192 53852 -82345 70619 -83381 -49589 -91633
11991i1633b6947r5000k0303C5354b8508j73390D6746c20462a04188J871k71671
$$ -91633 -26947 -121947 -142250 35354 -28508 -201898 46746 -320462 -104188 -102317 -373988
11980c73988a42283I0874i5884A35929n8742g9425L9665A8749a54875I184a73581
$$ -373988 -142283 90874 -95884 135929 77187 -79425 -39760 18749 -154875 9184 -173581
11968c22415a9665j46732D27896b08332n4025C00574b53882a16927k2865B01709
$$ -322415 -19665 -166397 427896 -208332 -262357 300574 -253882 -116927 -139792 201709
11957e9527l2720G139J49522n1641a81245m819a5181C3210a64023c2027p1469
$$ -59527 -92247 7139 156661 105020 -181245 -186064 -15181 33210 -164023 -32027 -103496
11946a03496K4658A37473b51103g822k63733a19829n9694H5400J04511a22968
$$ -103496 -78838 137473 -251103 -7822 -271555 -119829 -179523 85400 189911 -122968
11935A25917a81044p0442B8267K05913a51260E6392b79411g0986A37210l5077
$$ 125917 -181044 -251486 28267 234180 -151260 56392 -279411 -70986 137210 102133
11925A02133e1315k35989N7080P7289B27878O1839J11375G3082L1587c09677A42448
$$ 102133 -51315 -287304 -230224 -152935 227878 289717 401092 73082 104669 -309677 142448
11913H5424d9297h869o9853q4610d006l3481l4861C0615a08411D96741g8093I5227
$$ 85424 -49297 -8869 -78722 -163332 -4006 -37487 -72348 30615 -108411 496741 -78093 95227
11900a43490M343k4087O3252G324c93753G2217J00476N1108c88299c5342A07527
$$ -143490 -139147 -163234 -99982 7324 -393753 72217 172693 223801 -388299 -35342 107527
11888a6736A57743C29h5657j5091j74968d25k0252B92451H2347a88079j9555A41962
$$ -16736 157743 329 -85657 -100748 -275716 -425 -20677 292451 82347 -188079 -207634 141962
11875A11932a66164b829k3848A44062C4464J90001a87319I7501a7700A72376b19537
$$ 111932 -166164 -2829 -26677 144062 34464 224465 -187319 97501 -17700 172376 -219537
11863B00910A184c03559A83802D0068K58202j09036J02508f0296K8606j09135
$$ 200910 1184 -303559 183802 40068 298270 189234 291742 -60296 -31690 -140825
11853a40825A62273d4671J3538l0853n9584k8670B2475i8258k13706C2563K74417
$$ -140825 162273 -44671 -31133 -61986 -121570 -150240 22475 -98258 -311964 32563 306980
11842C06980a40957D5105n942P2275d383D54250a04112G8537a10815D25777g54407
$$ 306980 -140957 45105 39163 111438 -4383 454250 -104112 78537 -110815 425777 -754407
11830C6180J10769f9362L1440j5616J6666G5993b34787h784k30048H2231B4345
$$ 36180 146949 -69362 -37922 -53538 -36872 75993 -234787 -8784 -238832 82231 24345
11818f52j24866A78709g6418I2557J1180a82583J7092H061c86196J22305A91130
$$ -652 -125518 178709 -76418 92557 103737 -182583 -165491 8061 -386196 -263891 191130
11806e8469J4360q7440r2469A3586J33304j2517b01363G7910g0945A23777M559
$$ -58469 -44109 -131549 -224018 13586 146890 134373 -201363 77910 -70945 123777 128336
11795A28336M4416p5000B1474n101a73524o4883B50003j04673b29549J06985q1917
$$ 128336 172752 97752 21474 16373 -173524 -238407 250003 145330 -229549 -122564 -204481
11784b04481h6267q2257A12348A021J26074b28790N2928F9035M8859b97990a28300
$$ -204481 -86267 -168524 112348 1021 127095 -228790 -175862 69035 117894 -297990 -128300
11772A08673c3190A6900c8305J1264j65739m5699E1598b72280A30003b44780C59299
$$ 108673 -33190 16900 -38305 -27041 -192780 -238479 51598 -272280 130003 -244780 359299
11760B95415a22864L3814m0692M2120q2535F024d7866l4176A62560a84548N4172
$$ 295415 -122864 -89050 -129742 -87622 -170157 6024 -47866 -82042 162560 -184548 -130376
11749a30376j6317K2393R890b2333G4908O6890A5873a71821A24549J66544b24980
$$ -130376 -146693 -124300 -114410 -22333 74908 141798 15873 -171821 124549 291093 -224980
11737C2057h4884J3045G3144d4675A17821A1018f6472n952A67261E486a57194
$$ 32057 -84884 -71839 73144 -44675 117821 11018 -66472 -72424 167261 5486 -157194
11725B0586b4339j12230j36745o8559A69913G1903b3543l3080A56417a12653o880
$$ 20586 -24339 -136569 -273314 -341873 169913 71903 -23543 -56623 156417 -112653 -119533
11714a19533B98670f5241B11811i7857k83960A76622K32085a20787A80315F6874
$$ -119533 298670 -65241 211811 -97857 -381817 176622 408707 -120787 180315 66874
11703e4881H5891L84904F4282J17915J36390J89460A45638d1372E4737c122B45259
$$ -54881 85891 470795 64282 182197 318587 508047 145638 -41372 54737 -3122 245259
11691h6111j44722A7760Q0962D2426i9621G5726L1129b3870m3641A32411i011
$$ -86111 -230833 17760 98722 42426 -99621 75726 106855 -23870 -67511 132411 -9011
11679A63473A7705Q1273g5299a0037B04286k728c6408p8139C08180A2448K2818
$$ 163473 17705 98978 -75299 -10037 204286 201558 -36408 -114547 308180 12448 35266
11668C5266J5473N1482J76146a94787C59463A13866J70585m3513L9931A16891
$$ 35266 50739 102221 278367 -194787 359463 113866 284451 240938 280869 116891
11657g5062C0843b83869H3000K5077h8044B13055E0754b0806A00838c59160H997
$$ -75062 30843 -283869 83000 108077 -88044 213055 50754 -20806 100838 -359160 8997
11645A89472P7039b7496F1993a18961A01693a44902H4429a40244B31354a5181
$$ 189472 266511 -27496 61993 -118961 101693 -144902 84429 -140244 231354 -15181
11634A17111m6562J49226a05008F8883K71682f3653I8773J90156H1482b46381
$$ 117111 70549 219775 -105008 68883 340565 -63653 98773 288929 81482 -246381
11623f6390C02056b86113C29553p5908j451f9701k64836a03428j6806M0946r6629
$$ -66390 302056 -286113 329553 253645 252194 -69701 -334537 -103428 -120234 -79288 -175917
11612a75917A4554L11228N9980e5036A39252i2290p8308C25511j04355D5565A1552
$$ -175917 14554 325782 385762 -55036 139252 -92290 -170598 325511 221156 45565 11552
11600d22451a06531a5947I4896a25514G762K10454b23956B70165F0349K24403
$$ -422451 -106531 -15947 94896 -125514 7762 218216 -223956 270165 60349 284752
11590B84752j02735a48423A08355l87g9941c4917A88603d4474D06428f007A94064
$$ 284752 182017 -148423 108355 107968 -79941 -34917 188603 -44474 406428 -6007 194064
11578b38933J18290D64a52919E3285B2423J01602B288J70289c7429F8483R7743
$$ -238933 -120643 464 -152919 53285 22423 124025 2288 172577 -37429 68483 166226
11567A66226b7300C15765c8516A22535K96997a20981b1032B82675j3209b02881
$$ 166226 -27300 315765 -38516 122535 419532 -120981 -21032 282675 269466 -202881
11556B43017G1971l2838d0240A16315k8038K71722A19779d471j07013A86688I76
$$ 243017 71971 39133 -40240 116315 88277 359999 119779 -4471 -111484 186688 976
11544F5196g876o5972E7454a41996j16963A24565A3388L52523j53651a94985R0984
$$ 65196 -7876 -73848 57454 -141996 -258959 124565 13388 365911 212260 -194985 -104001
11533a04001r475B7056L77506A43756o539d5652A8779K29145L7217A37883J38646
$$ -104001 -113476 27056 404562 143756 137217 -45652 18779 247924 285141 137883 276529
11522B76529j03869a0469j52785O6150A19071R7870c4998A9941N9982f3387B63084
$$ 276529 172660 -10469 -163254 -97104 119071 216941 -34998 19941 79923 -63387 263084
11510a23910j36112F2293g3962C28094H3731B3552P965K34826A19126l7285K07259
$$ -123910 -260022 62293 -73962 328094 83731 23552 31517 266343 119126 81841 289100
11499B89100G0526a31028j2962C89887j84672A7759J7638K60115a9898A68048
$$ 289100 70526 -131028 -143990 389887 205215 17759 35397 295512 -19898 168048
11488A28852a74407f6077A53141K01898q0816Q6003D9468J94980C3568J05498
$$ 128852 -174407 -66077 153141 355039 274223 360226 49468 244448 33568 139066
11478A39066R2842E5451J2588L79694A50465M14320C4009a0641l3494D2150a529
$$ 139066 231908 55451 68039 447733 150465 564785 34009 -10641 -44135 42150 -1529
11466F2590J10208F6575K62336o2455q8763L9936C0397a4180F4214e187j69521
$$ 62590 172798 66575 328911 266456 177693 217629 30397 -14180 64214 -5187 -174708
11455a74708A54465O5600j2744b29446a09382h911A60528f7541C8973a6178B27245
$$ -174708 154465 220065 207321 -229446 -109382 -8911 160528 -67541 38973 -16178 227245
11443A58419m13D8000K88815k1069A01254O2898L3297r8257d5348I8668G376K07009
$$ 158419 158006 48000 336815 315746 101254 164152 197449 99192 -45348 98668 7376 214385
11431B14385a89112f3908A73882c02428b4840q6935L5940A03593K03333b64975
$$ 214385 -189112 -63908 173882 -302428 -24840 -111775 -75835 103593 306926 -264975
11420B9376O7524J9293J30471B2693L75129j7631i7664A96391p609d45343A7756
$$ 29376 96900 116193 246664 22693 397822 380191 -97664 196391 188782 -445343 17756
11408b79997e9481l19144A42761M5682a9933A06656J90359a29558B11431D7711
$$ -279997 -59481 -378625 142761 188443 -19933 106656 297015 -129558 211431 47711
11397b7748A5030a19303I9824c22030c7009R195E3097J41988b320k86862H5854
$$ -27748 15030 -119303 99824 -322030 -37009 -27814 53097 195085 -2320 -289182 85854
11385a40135A06548g4948C26357b11919Q4744g91l55663B74925a4743k59430A75679
$$ -140135 106548 -74948 326357 -211919 -127175 -791 -356454 274925 -14743 -274173 175679
11373i3708A11862e4001o0131F8503J324N8005b48340f4220a4943j05792r5612
$$ -93708 111862 -54001 -114132 68503 69827 127832 -248340 -64220 -14943 -120735 -216347
11362b16347m9650i9620b0432j5389B932J1950c70839a46877n8130C40099H5744
$$ -216347 -265997 -99620 -20432 -35821 2932 14882 -370839 -146877 -205007 340099 85744
11350a10538C04065a98605j02562J07800d9983b3471k01380G445a28015I828K29265
$$ -110538 304065 -198605 -301167 -193367 -49983 -23471 -224851 7445 -128015 9828 239093
11339B39093e6296H7118q780J36076b65147b784B80946F5352a87278j0678A92124
$$ 239093 -56296 87118 78338 214414 -265147 -2784 280946 65352 -187278 -197956 192124
11327E7524a33907B94767F6918k5653J08234b5183A55587g1095I1398a4332B16265
$$ 57524 -133907 294767 66918 41265 149499 -25183 155587 -71095 91398 -14332 216265
11315a16487p8892E4014a51012B78104g7120A55216K59489i8274B2281a12954
$$ -116487 -195379 54014 -151012 278104 -77120 155216 414705 -98274 22281 -112954
11304b28533b4559D141c8062O296A59614a5081j6480k40324D826a95477C042a19874
$$ -228533 -24559 4141 -38062 -31766 159614 -15081 -31561 -271885 4826 -195477 3042 -119874
11291d06926a21267M3511A43567c92822N528D7275P1464b35345J12745j26729
$$ -406926 -121267 -77756 143567 -392822 -387294 47275 118739 -235345 -122600 -249329
11281b49329N7144m0442P2147I647i8353k21605O7191O5483f1441A29382p081
$$ -249329 -192185 -232627 -160480 9647 -98353 -319958 -252767 -187284 -61441 129382 122301
11270A22301h0547C0306f6093c0642B60527a18050k0595p9225R4162H7321h5492
$$ 122301 -80547 30306 -66093 -30642 260527 -118050 -138645 -217870 -123708 87321 -85492
11258A22457J36664a1456o0740I2853B3839a6313B61074m6690b36864D3230b7235
$$ 122457 259121 -11456 -72196 92853 23839 -16313 261074 214384 -236864 43230 -27235
11246a20962F5625K9739d09915J29894G0845b62870B56960b808m59413B98465
$$ -120962 65625 95364 -409915 -280021 70845 -262870 256960 -2808 -462221 298465
11235a28473I9647k2357c32075e4345C07561j19822a87095D2438a43246o0525
$$ -128473 99647 77290 -332075 -54345 307561 187739 -187095 42438 -143246 -203771
11225b03771K8503k61510b4828E6808a26482B78382a15752A88918E178e6714a7630
$$ -203771 -175268 -436778 -24828 56808 -126482 278382 -115752 188918 5178 -56714 -17630
11213b54495G9780L7734c54907J37702A1922J09996a49175d5080k51268R8373
$$ -254495 79780 117514 -354907 -217205 11922 121918 -149175 -45080 -296348 -197975
11203a97975e931A6797J07404a06130H8424d501j82682e8724j78816A29220l0553
$$ -197975 -5931 16797 124201 -106130 88424 -4501 -187183 -58724 -237540 129220 98667
11192I8667Q391a37654j97503B752J06408K1234G341J88610a54896k9573n6879
$$ 98667 107058 -137654 -335157 2752 109160 130394 7341 195951 -154896 -184469 -241348
11181b41348q3615C48600a19421B23434b39662A97991d1734j50394p6067G2491
$$ -241348 -324963 348600 -119421 223434 -239662 197991 -41734 -192128 -268195 72491
11170c08654a43895A1883K19508E2659a12178L5839E7953b0921r5392N5729k23466
$$ -308654 -143895 11883 231391 52659 -112178 -76339 57953 -20921 -116313 -60584 -284050
11159b84050f5201A61713n0232m7755J8538d21429B34915a4044A12985i8394k48570
$$ -284050 -65201 161713 111481 63726 82264 -421429 234915 -14044 112985 -98394 -346964
11148c46964D04393d8684a1369E2023r258M0729c26664A05226D8782p376G942
$$ -346964 404393 -48684 -11369 52023 42765 83494 -326664 105226 48782 41406 7942
11136a45766A78888n7672f4009F5346b37976A5292L53324h3730F2969O4866a08141
$$ -145766 178888 121216 -64009 65346 -237976 15292 368616 -83730 62969 127835 -108141
11124a39663e2697A80635a03751D2769a34168B11999J93336j14211A22618a10732
$$ -139663 -52697 180635 -103751 42769 -134168 211999 405335 291124 122618 -110732
11113c11081I8306d7107A46480j2883b39764g1566A20291L44860m8587l2624A16296
$$ -311081 98306 -47107 146480 133597 -239764 -71566 120291 465151 416564 383940 116296
11101B7062J65435l3067B4533J6763J46543J97661a27765D48594F6846J42824
$$ 27062 192497 159430 24533 41296 187839 385500 -127765 448594 66846 209670
11091B09670J77674j12312j8676l0289j7796p6484K93151j91840n9737H85M0087
$$ 209670 387344 275032 256356 226067 208271 131787 424938 233098 173361 885 40972
11080D0972J95137K04162q8088J6995i6694C37872j48529P8198r0303P7476j6903
$$ 40972 236109 440271 352183 369178 -96694 337872 189343 267541 177238 254714 237811
11069B37811L68224k38004J45433A50314J67094J93109H6574L49362k2904k782
$$ 237811 606035 368031 513464 150314 317408 510517 86574 435936 413032 410250
11059D10250L7656L43090l31362j60139K58434k03788L81864j70008P9994j08713
$$ 410250 447906 790996 459634 299495 557929 354141 736005 565997 645991 537278
11049E37278M58691j97570O0736m3230j48762M8958p7151q7630K529n7685M69672
$$ 537278 995969 798399 859135 815905 667143 716101 638950 551320 553849 496164 965836
11038I65836j7637j82473M3239o7075q1702K84508m46242K95686j13095j43454
$$ 965836 948199 765726 808965 741890 660188 944696 498454 794140 681045 537591
11028E37591O81262n20800J88495k79576k90436P6292R8462J93699j16831B43772
$$ 537591 1218853 698053 886548 606972 316536 392828 491290 684989 568158 243772
11017E15232J70206J46721j84222n0747k96227O7420L8147N2460p8129M79384
$$ 515232 685438 832159 647937 597190 300963 368383 406530 458990 380861 860245
11007H60245j48377J03003k87976J39313K63278l67828M84916n18794L44579K1133
$$ 860245 711868 814871 526895 666208 929486 561658 1046574 527780 872359 893492
10997H93492l82234A29265N13574K24902n2707l05756K63171n3589j21880L3751
$$ 893492 511258 129265 642839 867741 815034 509278 772449 718860 596980 630731
10987F30731N25519k36236k40051J38097l14547M93251p2747L39343K74140j88072
$$ 630731 1156250 920014 679963 818060 503513 996764 924017 1263360 1537500 1349428
10977A349428M3611K47587L02009L2021M29495O4426L52765K56159j632n99293
$$ 1349428 1393039 1640626 1942635 1974656 2404151 2468577 2821342 3077501 3075869 2476576
10967B476576p6282j40042N0778o81939J00530O5987k84181K53039K36473m45277
$$ 2476576 2400294 2260252 2311030 1629091 1729621 1795608 1511427 1764466 2000939 1555662
10957A555662P56868o44806m1339j05986L2693p8183m59041K2787m12567j43327
$$ 1555662 2312530 1667724 1626385 1520399 1553092 1474909 1015868 1038655 626088 482761
10947D82761Q6842k18750j57147J03561A07537L1114A9242L67947q9105A01262
$$ 482761 569603 350853 193706 297267 107537 138651 19242 387189 298084 101262
10936B51613L3082j20028e4153C3611O6107J03514K30346B03489b56390A35060
$$ 251613 284695 164667 -54153 33611 99718 203232 433578 203489 -256390 135060
10925a22292B82100f015k16163A30890D2388d05201e5781F4802a58652A15871
$$ -122292 282100 -6015 -222178 130890 42388 -405201 -55781 64802 -158652 115871
10914B96736a42912m0925B57293b06411A94514i7007E4280c90944B35510m2577
$$ 296736 -142912 -183837 257293 -206411 194514 -97007 54280 -390944 235510 192933
10904A92933c1655L046D4022a4818A27666a90861C6092j5084r986c2864l3924
$$ 192933 -31655 -28609 44022 -14818 127666 -190861 36092 21008 11022 -32864 -66788
10893f6788C804d0988A94194P693g6361j37666A6099F322J970L22618e0700n7208
$$ -66788 3804 -40988 194194 201887 -76361 -214027 16099 6322 8292 330910 -50700 -107908
10881a07908A76237P1385c50041C46624a25312D5014a39983E1507J35377C6014
$$ -107908 176237 247622 -350041 346624 -125312 45014 -139983 51507 186884 36014
10870a36402A29922i1667M761A59356b0041j0214B0470d41j44569F2938f5744
$$ -136402 129922 -91667 -86906 159356 -20041 -30255 20470 -441 -145010 62938 -65744
10858B87736a5033E9090O656b60986A13465a35642j18063d7041j55839p7696f6514
$$ 287736 -15033 59090 65746 -260986 113465 -135642 -253705 -47041 -202880 -280576 -66514
10846A83387a99766F5836J78751I8539M5777a48399D3092Q4556L7306b71549A94922
$$ 183387 -199766 65836 244587 98539 144316 -148399 43092 127648 164954 -271549 194922
10834F0952h7616A5810e4576a3042j29718A56745a46645A45255K4856a04345D9096
$$ 60952 -87616 15810 -54576 -13042 -142760 156745 -146645 145255 170111 -104345 49096
10822a17776M2875b0064F0492e1270D8629c2740I6192P0809f9602k2752c5364
$$ -117776 -74901 -20064 60492 -51270 48629 -32740 96192 167001 -69602 -92354 -35364
10810b42306k6708k23366e3240H4044J93906d06182e5790B94007a4248H1136J3894
$$ -242306 -269014 -492380 -53240 84044 277950 -406182 -55790 294007 -14248 81136 95030
10799I5030p359d8213k2610j11125F7022a57854B58109a66703N4778B93604a99211
$$ 95030 87671 -48213 -70823 -181948 67022 -157854 258109 -166703 -111925 293604 -199211
10787d33082J95000D50108a03123B6109a91506E686f9713l7206A6713c9960j54781
$$ -433082 -238082 450108 -103123 26109 -191506 5686 -69713 -106919 16713 -39960 -194741
10776a94741A96734b27186A07326f5489j50825A85980b73649D96554a83430A37283
$$ -194741 196734 -227186 107326 -65489 -216314 185980 -273649 496554 -183430 137283
10765C1074a65188A70212b46588d4998m3923H7837c60553a49050e8748b6284j4350
$$ 31074 -165188 170212 -246588 -44998 -88921 87837 -360553 -149050 -58748 -26284 -40634
10754d0634k96485J42081A7240b11696D3249f451I1472f2716A46888D8642m592
$$ -40634 -337119 -195038 17240 -211696 43249 -6451 91472 -62716 146888 48642 44050
10743D4050i6679l66653d9500k3120H5013a48089B13170I8122D2240a30845I6165
$$ 44050 -96679 -463332 -49500 -72620 85013 -148089 213170 98122 42240 -130845 96165
10731G3580b07663H9985h8928k6109F1379J59995f0053m84693a53578D3755a4894
$$ 73580 -207663 89985 -88928 -115037 61379 221374 -60053 -544746 -153578 43755 -14894
10719c16077f5515j06342B73943b06725j13647C7817b75580D185J43512k5217
$$ -316077 -65515 -171857 273943 -206725 -320372 37817 -275580 4185 147697 122480
10709A22480Q3285h792B18363b03918B01156c3887B1746d3317a4840G5468c61014
$$ 122480 205765 -8792 218363 -203918 201156 -33887 21746 -43317 -14840 75468 -361014
10697a13715A73015a65030R695F4917a46004l34600c1196l24716J43760b8870
$$ -113715 173015 -165030 -155335 64917 -146004 -480604 -31196 -355912 -212152 -28870
10686C95137C0585a36485c1202H0626a86110A49822L2087g6728F5683c41741F1752
$$ 395137 30585 -136485 -31202 80626 -186110 149822 181909 -76728 65683 -341741 61752
10674D823R7080a64688A02752j1382c64716h0354I4825b16332E3069a61724F1680
$$ 4823 101903 -164688 102752 91370 -364716 -80354 94825 -216332 53069 -161724 61680
10662b8883k6950l5026j93710C76594b2105j90869B75711c0459l0904j93951C3168
$$ -28883 -55833 -90859 -284569 376594 -22105 -212974 275711 -30459 -61363 -255314 33168
10650c6073C0760M0301a40219D5404c94366J69125c8615l21116P8539e9002D9220
$$ -36073 30760 71061 -140219 45404 -394366 -225241 -38615 -359731 -281192 -59002 49220
10638a39061q7983A76369i0568B45383b17233R9422k60900J22459J02906C3146
$$ -139061 -227044 176369 -90568 245383 -217233 -117811 -378711 -256252 -153346 33146
10627a8943A20382h7176j76836B06256c37631C89246d09916B12795c8642j10004
$$ -18943 120382 -87176 -264012 206256 -337631 389246 -409916 212795 -38642 -148646
10617a48646a8037k17912h1228j14769c5535O009o54B41075a40407I7983m1021
$$ -148646 -18037 -235949 -81228 -195997 -35535 -29526 -30180 241075 -140407 97983 56962
10606E6962a14689m7399K5740b07j40641c1021B0155J39404F341J03510e830j43527
$$ 56962 -114689 -162088 -136348 -207 -140848 -31021 20155 159559 6341 109851 -5830 -149357
10594a49357k3443B40323a84808h2850l23432B69951a95412k25659a85411a4292
$$ -149357 -172800 240323 -184808 -82850 -406282 269951 -195412 -421071 -185411 -14292
10583A15345I366L12881A46985a49259L4059A35885a32567A91085b33267J15898
$$ 115345 9366 322247 146985 -149259 -115200 135885 -132567 191085 -233267 -117369
10573a17369p2627l6917N9305D0189h0074q3221A37140a05011j8348A85931b73622
$$ -117369 -189996 -226913 -167608 40189 -80074 -163295 137140 -105011 -123359 185931 -273622
10561a96978k6726I7061a8896A93891J9445I4415J18427g5974A06873k2231L1855
$$ -196978 -223704 97061 -18896 193891 213336 94415 212842 -75974 106873 84642 116497
10550A16497a90963A21577a96035A32962a61496a0314j90600B9781a09761a7140
$$ 116497 -190963 121577 -196035 132962 -161496 -10314 -200914 29781 -109761 -17140
10539a05521C5066K4982L64191c59239a70985I9575f0663F6870K170L06123A82715
$$ -105521 35066 60048 424239 -359239 -170985 99575 -60663 66870 69040 375163 182715
10527b353j07869M6938G8502j9167b70342j4669A76394K70645G9163R66a41076
$$ -2353 -110222 -63284 78502 59335 -270342 -285011 176394 447039 79163 80129 -141076
10515f0873B29228I7843A0383M602M3883d72677C544N6330a13260A87131b6403
$$ -60873 229228 97843 10383 14985 58868 -472677 3544 59874 -113260 187131 -26403
10503b09220i4824L1566b1510o0600b9788A36187d6956A321K01462d40266A85314
$$ -209220 -94824 -63258 -21510 -82110 -29788 136187 -46956 1321 202783 -440266 185314
10491b71974F233b00779B85718e7993o3249d0887r9808l18627A20467Q6539I6580
$$ -271974 6233 -200779 285718 -57993 -121242 -40887 -140695 -459322 120467 207006 96580
10479B07711J83933j0585l0113j11483b57235N190F622O713J23785D3141e4758
$$ 207711 391644 381059 350946 239463 -257235 -252045 6622 13335 137120 43141 -54758
10467a26898A94247e9792q8148p0840a04589K0341A23163Q227d30085I260e691
$$ -126898 194247 -59792 -147940 -218780 -104589 -84248 123163 131390 -430085 9260 -5691
10455A01488J03994b00537j51535A32326a82734B5935b8426A9830a26311L6717
$$ 101488 205482 -200537 -352072 132326 -182734 25935 -28426 19830 -126311 -89594
10445h9594H0405b22045l4702M7463G4519a04256H2655e49714a83698N6033C0383
$$ -89594 80405 -222045 -256747 -209284 74519 -104256 82655 -549714 -183698 -127665 30383
10433e3676n3214B64134b84657B29989c6086p1534A68236f8743f434I3579a10954
$$ -53676 -106890 264134 -284657 229989 -36086 -107620 168236 -68743 -6434 93579 -110954
10421b16370A68730Q8000p1309c8301r9155A40865L9139c9329l1969o981A35577
$$ -216370 168730 256730 185421 -38301 -137456 140865 180004 -39329 -71298 -78279 135577
10409a27795B62623a21012B62035f8073D3341K2372j6695a47903D4120K37766
$$ -127795 262623 -121012 262035 -68073 43341 65713 49018 -147903 44120 281886
10399B81886A22357j0514L4137c960C75162a45400B03857M1721A22651K57320
$$ 281886 122357 111843 145980 -3960 375162 -145400 203857 245578 122651 379971
10389C79971a94197B62642J38881H4619N7778a39811I6553c06085B71857a26313
$$ 379971 -194197 262642 401523 84619 142397 -139811 96553 -306085 271857 -126313
10378a82243j0827H1550a01342I2621G43L43834C762M32734P3442j31671d2409
$$ -182243 -193070 81550 -101342 92621 743 344577 3762 436496 509938 378267 -42409
10366C05774R1403K68902k82138j9786A31487K19356A46287J14923G8507M42000
$$ 305774 397177 666079 383941 364155 131487 350843 146287 261210 78507 520507
10356E20507A48234L29532k14001P8575j25780J56346K33802K93981a07193A76413
$$ 520507 148234 477766 263765 342340 216560 372906 606708 900689 -107193 176413
10345G8642J91461r4780j486N2959K78657A37600j3991k8969L9917l4444L10552
$$ 78642 270103 175323 173837 226796 505453 137600 123609 94640 134557 100113 410665
10334D10665F3563M68742A18740J86557a45448j81023J32272j36229B21035J20583
$$ 410665 63563 532305 118740 305297 -145448 -326471 -194199 -330428 221035 341618
10324C41618I6570J92535A02391N8967j4394o3383K99054J68892A70636m575K5343
$$ 341618 96570 289105 102391 161358 146964 83581 382635 551527 170636 166061 191404
10313A91404A7767O2818a90070F4930a34114A74164f2957j47290j84769J64622
$$ 191404 17767 80585 -190070 64930 -134114 174164 -62957 -210247 -395016 -230394
10303b30394A95040N2101F9081a65315C13294A3341d435l9555n6928A67105M5479
$$ -230394 195040 247141 69081 -165315 313294 13341 -4435 -43990 -100918 167105 212584
10292B12584a86757g5722J9767A49988a82953m6448A61471b11823j77168B36094
$$ 212584 -186757 -75722 -55955 149988 -182953 -229401 161471 -211823 -388991 236094
10281C03211d04110i436o3263q9145p3604B17736a16604F4417b170j28413b8824
$$ 303211 -404110 -9436 -72699 -161844 -235448 217736 -116604 64417 -2170 -130583 -28824
10269a44393f3481B4205l916a84471B8248J41277a1109B23136r1959J1501R5693
$$ -144393 -63481 24205 20289 -184471 28248 169525 -11109 223136 131177 142678 238371
10258B38371N546J02902j20011J33441j30491a194j68963A27209b80364B35667
$$ 238371 243917 346819 226808 360249 229758 -1194 -170157 127209 -280364 235667
10247b49106p5402E6823a25241n7506j73994B2968J35942o4367a45805k07145
$$ -249106 -324508 56823 -125241 -182747 -356741 22968 158910 94543 -145805 -352950
10237c52950C2491L862c94250B502c3245k22702J27203m1970M1348j89476J51086
$$ -352950 32491 36353 -394250 2502 -33245 -255947 -128744 -170714 -129366 -318842 -167756
10226a67756d1122j50147I9733a25094m9612J4081C66667A40463b20756N4610
$$ -167756 -41122 -191269 99733 -125094 -174706 -160625 366667 140463 -220756 -166146
10216a66146B8106a59167B11236a36108J8392K5209m8760E8239a91904c4318k1355
$$ -166146 28106 -159167 211236 -136108 -117716 -92507 -141267 58239 -191904 -34318 -55673
10205e5673B43150G0442c10824J058J18986C4659N259J3694Q1764M1202G225a69330
$$ -55673 243150 70442 -310824 -309766 -190780 34659 39918 53612 135376 176578 7225 -169330
10192B19023a0872k0832j06003B29488A02204J35139o4066c29473G4625b39302
$$ 219023 -10872 -31704 -137707 229488 102204 237343 173277 -329473 74625 -239302
10181A28006n4783a12218A22015a16561A47369a96638a292A36526a4619j66153
$$ 128006 73223 -112218 122015 -116561 147369 -196638 -1292 136526 -14619 -180772
10171a80772A08897a12133J1033C6623j1009f786A14117b54238A61588b72068
$$ -180772 108897 -112133 -101100 36623 25614 -6786 114117 -254238 161588 -272068
10160b09123A29498e930I1977j4073c3750I8892a57159p0783r708m2952c8496
$$ -209123 129498 -5930 91977 77904 -33750 98892 -157159 -227942 -237650 -280602 -38496
10148b51353A24574c3548q8705o0286O9276l02519J62852A14582a40531f8437
$$ -251353 124574 -33548 -122253 -182539 -113263 -415782 -252930 114582 -140531 -68437
10137g5478n5615l463B48883a83608B58669n9138a12392R56J0596c9890j35271
$$ -75478 -131093 -134556 248883 -183608 258669 199531 -112392 -111436 -100840 -39890 -175161
10126a75161A9314J02383a70502B65032d19017J97366k8120R1229A02167d93135
$$ -175161 19314 121697 -170502 265032 -419017 -221651 -249771 -158542 102167 -493135
10115b45391b7977l72163g5082E6381b34438b9106j4433j12705A97767b5280B0755
$$ -245391 -27977 -400140 -75082 56381 -234438 -29106 -43539 -156244 197767 -25280 20755
10103c28854Q4491F577K11044b40537j70801J95641R091A98965b80484J12614
$$ -328854 -244363 6577 217621 -240537 -411338 -215697 -206606 198965 -280484 -167870
10093a67870i747D2701a75332h1059G6411o967J26770b29789j3959i0872n8465
$$ -167870 -9747 42701 -175332 -81059 76411 69444 196214 -229789 -243748 -90872 -149337
10082a49337C12022A3795b5663k03831A75028a99451j29109d4713l23568f0671
$$ -149337 312022 13795 -25663 -229494 175028 -199451 -328560 -44713 -368281 -60671
10071H6067c23616A73894C141b26277q671c4576N059j5780B10004n3286n9189
$$ 86067 -323616 173894 3141 -226277 -234948 -34576 -29517 -45297 210004 156718 97529
10060I7529b4622A72838C9174L7713C1633J62042c29821d6236B65786d96030a50644
$$ 97529 -24622 172838 39174 76887 31633 193675 -329821 -46236 265786 -496030 -150644
10048C3330o570J74517C3761a04839C6391I915b5712j3918j73655H8852a15694
$$ 33330 26760 201277 33761 -104839 36391 9915 -25712 -39630 -213285 88852 -115694
10036H2789K4434a41762A76890o9357N1227K3262L7682F3697d51637B1881N7807
$$ 82789 107223 -141762 176890 107533 158760 182022 219704 63697 -451637 21881 79688
10025G9688a66173i756o1395q7891A23270n0917a54755H5300m592a89796B46874
$$ 79688 -166173 -9756 -71151 -159042 123270 72353 -154755 85300 80708 -189796 246874
10013d752j53282G3472a66903r6545Q0055m1469A12389c10969A36057a66020A65755
$$ -4752 -158034 73472 -166903 -263448 -183393 -224862 112389 -310969 136057 -166020 165755
10001C36506g8772k57612C7787J977a01478k39391Q6990l2077a36831j05569c5002
$$ 336506 -78772 -336384 37787 39764 -101478 -340869 -253879 -285956 -136831 -242400 -35002
9989a43646G199a43142f1467A64564b06363J8167r8399A08837a48986N3945B39282
$$ -143646 7199 -143142 -61467 164564 -206363 -188196 -286595 108837 -148986 -95041 239282
9977D4466K24284b00525H359J86408r2428i297j9089A20877h6382A36613b31225
$$ 44466 268750 -200525 8359 194767 102339 -9297 -28386 120877 -86382 136613 -231225
9965b8413k51630i1594E3393E282b25841A86860c94106D6006b73313h2787l24553
$$ -28413 -280043 -91594 53393 5282 -225841 186860 -394106 46006 -273313 -82787 -407340
9954d07340K00876k4060L7309A0427d41714B49568c42879d5964j25515p5136f0882
$$ -407340 -206464 -230524 -193215 10427 -441714 249568 -342879 -45964 -171479 -246615 -60882
9942B30J8849c06649a49262C9254N2612g966m07967A78094H7413M2036a6452j87868
$$ 230 19079 -306649 -149262 39254 91866 -7966 -415933 178094 87413 129449 -16452 -204320
9930b04320g8444L7015D8906a57879P6443B5273c12561n8723g1074j95360B0734
$$ -204320 -78444 -41429 48906 -157879 -81436 25273 -312561 -371284 -71074 -266434 20734
9918a1891I2569J10186g7389L7910p7405E9419c85385B5411g541B32203C3843
$$ -11891 92569 202755 -77389 -39479 -116884 59419 -385385 25411 -7541 232203 33843
9906b87514f4429j32134D11776H2880B2563b58794a00136A27194E93Q7625a04768
$$ -287514 -64429 -196563 411776 82880 22563 -258794 -100136 127194 593 88218 -104768
9894F8434a17762D6364i8687A89198b27774A16502m656a52095J4424K9276m45072
$$ 68434 -117762 46364 -98687 189198 -227774 116502 111846 -152095 -137671 -108395 -553467
9883e53467A87159a8924g108k38333R4705J1210a1314k8483a0382m81916h117
$$ -553467 187159 -18924 -7108 -245441 -150736 -139526 -11314 -39797 -10382 -492298 -8117
9871b05956f8632D7871N3449N0120a16101A6298a87537f560k14981A93412r2894
$$ -205956 -68632 47871 101320 151440 -116101 16298 -187537 -6560 -221541 193412 100518
9860A00518c87059O1372i3610j54950J1905R4000m8464m2291J00393r8848Q6065
$$ 100518 -387059 -325687 -93610 -248560 -236655 -142655 -191119 -233410 -133017 -231865 -145800
9849a45800k56583E5013K17918i261k6886j53548j93156a06151L6111k44682A81805
$$ -145800 -402383 55013 272931 -9261 -36147 -189695 -382851 -106151 -70040 -314722 181805
9837A23873a14348k7895o9766o8009A46796d8721n2748k13863A20160a76372G6268
$$ 123873 -114348 -142243 -212009 -280018 146796 -48721 -101469 -315332 120160 -176372 76268
9825B12190a18476m6926c7642a7609A39200m3203l8841a12813e3818A69090a75597
$$ 212190 -118476 -165402 -37642 -17609 139200 95997 57156 -112813 -53818 169090 -175597
9813b73398f5097k61916A5653R6076B2012J18285c19858J35311K3571j34367r8198
$$ -273398 -65097 -327013 15653 111729 22012 140297 -319858 -184547 -160976 -295343 -393541
9802c93541a37165f581F6200b87529q3920N0216D841O9274c45132J02254b0168
$$ -393541 -137165 -6581 66200 -287529 -371449 -321233 4841 74115 -345132 -242878 -20168
9790A36774e8987A80444f149l076A68575N2534b9869j44289a2688k84142A54684
$$ 136774 -58987 180444 -6149 -9225 168575 221109 -29869 -174158 -12688 -296830 154684
9778d2536k85164B8816d9039B5704Q0319a33098A0835b46503A38368b4938H6974
$$ -42536 -327700 28816 -49039 25704 106023 -133098 10835 -246503 138368 -24938 86974
9766A37106a58k31042P469j01248C6534a5867k42906h2265a6799d750k32293O9316
$$ 137106 -158 -231200 -223731 -324979 36534 -15867 -258773 -82265 -16799 -4750 -237043 -167727
9754a67727B5996K4374c6259A04074b45823e0986j19196A45386k4893L543E1269
$$ -167727 25996 50370 -36259 104074 -245823 -50986 -170182 145386 120493 124036 51269
9742A94331p3983A581Q1912a01814o8792e2693m40390B09451b95100A27250A0441
$$ 194331 120348 1581 83493 -101814 -170606 -52693 -493083 209451 -295100 127250 10441
9730b20235g1589I0793a56541F1650a46866G290b60135b9811l995q8257A62001
$$ -220235 -71589 90793 -156541 61650 -146866 7290 -260135 -29811 -33806 -122063 162001
9718e6706k668n437C3507J4278a70906M2953o5728f5465o8907d4192q7127r273
$$ -56706 -59374 -64811 33507 47785 -170906 -127953 -193681 -65465 -134372 -44192 -131319 -140592
9706a40592A53950b22343A0197e1493k2551c1949k70172d8677I8605D6659J38199
$$ -140592 153950 -222343 10197 -51493 -74044 -31949 -302121 -48677 98605 46659 184858
9695A84858G2545a42715j41455L9622M6758E3629a45060o6303e3371j23619L2850
$$ 184858 72545 -142715 -284170 -244548 -197790 53629 -145060 -211363 -53371 -176990 -144140
9684a44140C2400i5055A84731a85543a6719q4942k88091i2751L7885A17551j2345
$$ -144140 32400 -95055 184731 -185543 -16719 -101661 -389752 -92751 -54866 117551 105206
9673A05206a8485B55258a88216d9075o2934e1183A98923F3896M0546a62924A66235
$$ 105206 -18485 255258 -188216 -49075 -112009 -51183 198923 63896 104442 -162924 166235
9661d211E0946a84401B41522c384A07524a03930H5937J8901D405J38874C9284
$$ -4211 50946 -184401 241522 -3384 107524 -103930 85937 104838 4405 143279 39284
9649B15413I0816e07033D4427i9796j79967A51595h7645F0960f9113m9144r613
$$ 215413 90816 -507033 44427 -99796 -279763 151595 -87645 60960 -69113 -118257 -127870
9638a27870j12754A26841b69339A69665b40305j37411A0507b09727A818d45380
$$ -127870 -240624 126841 -269339 169665 -240305 -377716 10507 -209727 1818 -445380
9627a03221c368j06465B12775a5975m2235K2560j1402F7499K27956A4820b04439
$$ -103221 -3368 -109833 212775 -15975 -58210 -35650 -47052 67499 295455 14820 -204439
9615b9382p5251D1195a98733Q7779D0722b44105B15188I3519M5309A8838c19616
$$ -29382 -104633 41195 -198733 -110954 40722 -244105 215188 93519 138828 18838 -319616
9603c4034j58952j9761j18428A12035b55587D3159J9280a27135j61586a41644
$$ -34034 -192986 -212747 -331175 112035 -255587 43159 62439 -127135 -288721 -141644
9592a31782q942j9515G9552C2910a83345E2642c28244a56295I9892b30466O8774
$$ -131782 -140724 -160239 79552 32910 -183345 52642 -328244 -156295 99892 -230466 -161692
9581a61692b9569j50466r1990a4512F8959J77386b95054g7045D01116a09997J989
$$ -161692 -29569 -180035 -272025 -14512 68959 246345 -295054 -77045 401116 -109997 -108008
9570a08008A26062a67607B44985a154j40171A93972a62453L0841L2770C72534
$$ -108008 126062 -167607 244985 -1154 -141325 193972 -162453 -131612 -98842 372534
9559C002J13214K8202g0179L0676k65315e9404j2639k31204P0407B78633i0680
$$ 3002 116216 144418 -70179 -39503 -304818 -59404 -72043 -303247 -232840 278633 -90680
9547b34816J07168j86447e4612k29931A1249f7959k45331C07814e2260c598j41504
$$ -234816 -127648 -314095 -54612 -284543 11249 -67959 -313290 307814 -52260 -3598 -145102
9536a45102D6653b43025A73473J247a45312D0407c7244j54878H7607l8874c4033
$$ -145102 46653 -243025 173473 174720 -145312 40407 -37244 -192122 87607 48733 -34033
9524d98889A03840a00324G1572j7040J5076b1453k95071b4396j83386k013h7415
$$ -498889 103840 -100324 71572 54532 69608 -21453 -316524 -24396 -207782 -209795 -87415
9512a69028p5351A41784n9367k592j7364c08216C78229a36233A60345b12018c540
$$ -169028 -244379 141784 82417 79825 62461 -308216 378229 -136233 160345 -212018 -3540
9500a83808g9192A63016d36184E9938K163a61720j30476a37752a338m23454C46863
$$ -183808 -79192 163016 -436184 59938 62101 -161720 -292196 -137752 -1338 -424792 346863
9488a30181a6565j22509L9428I0713O7161m4831a23302B6472L1083f5891q442
$$ -130181 -16565 -139074 -99646 90713 157874 113043 -123302 26472 57555 -65891 -74333
9477g4333I0986A8715c2800k44061A38029b27019K7525k17898J58008a01648k10443
$$ -74333 90986 18715 -32800 -276861 138029 -227019 -199494 -417392 -259384 -101648 -312091
9466c12091N9190l4979J12690K4519A93394o9999J66670a55756L204D7901a96757
$$ -312091 -252901 -287880 -175190 -150671 193394 123395 290065 -155756 -152552 47901 -196757
9454c45145e1582C3625a03477E0398i099B23840C3186a78589j29273P1257A045
$$ -345145 -51582 33625 -103477 50398 -9099 223840 33186 -178589 -307862 -236605 1045
9442C18273a91194K8193B81789b1470j3134l39022D0221a79306r0859A61586c06044
$$ 318273 -191194 -163001 281789 -21470 -34604 -373626 40221 -179306 -270165 161586 -306044
9430c28874i4504k32679J48509n5892J16798F3928N2553a29088c6308j99332o9905
$$ -328874 -94504 -327183 -178674 -234566 -117768 63928 116481 -129088 -36308 -235640 -305545
9419c05545A41955b92576g7458j17180F9747O3676a6978o1502q1805N3758r679
$$ -305545 141955 -292576 -77458 -194638 69747 133423 -16978 -78480 -160285 -106527 -116206
9408a16206I0591f0738k32133a18894H3568P0527b50205J24624j14227k86259
$$ -116206 90591 -60738 -292871 -118894 83568 154095 -250205 -125581 -239808 -526067
9398e26067b21137B8827M0153g7910D3021c46069E95587a10872o6576N8941c1487
$$ -526067 -221137 28827 68980 -77910 43021 -346069 595587 -110872 -177448 -118507 -31487
9386c0423k08972L6700J00012a7153a857j68047C330a1142A31979a6242k21342
$$ -30423 -239395 -202695 -102683 -17153 -1857 -169904 3330 -11142 131979 -16242 -237584
9375b37584J0365L7539K0120a225j74929L1369j66992a148m1731F2029L9581a11563
$$ -237584 -227219 -189680 -169560 -1225 -176154 -144785 -311777 -1148 -42879 62029 101610 -111563
9362E1365O3426i8648A28397c0015k90877B72087O6400I9294M3701c8625E5603
$$ 51365 114791 -98648 128397 -30015 -320892 272087 338487 99294 142995 -38625 55603
9350a4757j48617o5721A4816e3827p8069O5570B63609F7774d7261M44K2923B31353
$$ -14757 -163374 -229095 14816 -53827 -131896 -66326 263609 67774 -47261 -46817 -23894 231353
9337A0488f9743A08338a5112o950j33799A16433D4838a04573F6268J68032A11055
$$ 10488 -69743 108338 -15112 -22062 -155861 116433 44838 -104573 66268 234300 111055
9325g9619a0206j02555a1739j66780A8570h6635c6888j7806p2577B6100K18626
$$ -79619 -10206 -112761 -11739 -178519 18570 -86635 -36888 -54694 -127271 26100 244726
9314B44726a99461j14591J06078O5314B3747J9793J92066d6527r7591n2292f9665
$$ 244726 -199461 -314052 -207974 -142660 23747 43540 235606 -46527 -144118 -196410 -69665
9302F6627K33680a91113o6879O6348G6472b15505l9313a9576j57541b3771m24414
$$ 66627 300307 -191113 -257992 -191644 76472 -215505 -254818 -19576 -177117 -23771 -448185
9291d48185A25504a15317C60905b42642h427B73352b49806R4969r1424M3984l4344
$$ -448185 125504 -115317 360905 -242642 -8427 273352 -249806 -154837 -246261 -202277 -236621
9280b36621f2260k61021g5502k84502a69758A7016a91044C251c71246j568a76945
$$ -236621 -62260 -323281 -75502 -360004 -169758 17016 -191044 3251 -371246 -372814 -176945
9268a7837A68018b11266a04479C256b5775q4803E5698k7216a12727l9535A69112
$$ -17837 168018 -211266 -104479 3256 -25775 -110578 55698 28482 -112727 -152262 169112
9256C8691b01518g7520j32557D1324b72196A14083J62497c6923m419D97494f8061
$$ 38691 -201518 -77520 -210077 41324 -272196 114083 276580 -36923 -41342 497494 -68061
9244c20970j28412e9384j010C28877f7025m939k1010F7692a53736j07463a17816
$$ -320970 -449382 -59384 -60394 328877 -67025 -71964 -92974 67692 -153736 -261199 -117816
9232B03790c622D8594J7929g9133M909k23632N8340A67877c1117m19159C7888
$$ 203790 -3622 48594 66523 -79133 -74224 -297856 -239516 167877 -31117 -450276 37888
9220F6614b90371J19543a9091r9233H1901a19868q7053C4896a48727m9387C36438
$$ 66614 -290371 -170828 -19091 -118324 81901 -119868 -206921 34896 -148727 -198114 336438
9208B16233n3092c02390A01880b19526O8729O1853A5306c37952J18603O0108j2374
$$ 216233 163141 -302390 101880 -219526 -150797 -88944 15306 -337952 -219349 -159241 -171615
9197a71615f0630j76050E7535b8162C23221a71233Q2956L7309a3928k33780F6429
$$ -171615 -60630 -236680 57535 -28162 323221 -171233 -88277 -50968 -13928 -247708 66429
9185H7688a34480b755j0955q0590G6627J52934d9715p7824e3415A75759f8851
$$ 87688 -134480 -2755 -13710 -94300 76627 229561 -49715 -127539 -53415 175759 -68851
9173a05237B02540E3921a26568E8419a66640B1257c63283A38139J5805b14330
$$ -105237 202540 53921 -126568 58419 -166640 21257 -363283 138139 153944 -214330
9162b79395A18495d55218J63580M8279A40328d3079E224c83494a5102A19289d3616
$$ -279395 118495 -455218 -291638 -243359 140328 -43079 5224 -383494 -15102 119289 -43616
9150c00262N5828A09475a49747f2017j21944F9027J63771F0162a8789A28536a56138
$$ -300262 -244434 109475 -149747 -62017 -183961 69027 232798 60162 -18789 128536 -156138
9138A04730c3850k4048j87766G5320M9178n7029i7877I2780N4239J56233A03640
$$ 104730 -33850 -57898 -245664 75320 124498 67469 -97877 92780 147019 303252 103640
9126c21363q3734g0903I9180d0643a679j99057J6136e9126C68392c01353a3752
$$ -321363 -405097 -70903 99180 -40643 -1679 -200736 -184600 -59126 368392 -301353 -13752
9114b65588k16124G4517a78029j3121n0909F9340h8593o8281E012g9009H4556
$$ -265588 -481712 74517 -178029 -191150 -242059 69340 -88593 -156874 5012 -79009 84556
9102B37615d5422A88104a20922L2417B618a89410C8746b3559j65704d6289m3298
$$ 237615 -45422 188104 -120922 -88505 2618 -189410 38746 -23559 -189263 -46289 -89587
9091h9587b4984q5781F2858a11586l13028C55676b59762B15090b1668k56192P6450
$$ -89587 -24984 -110765 62858 -111586 -424614 355676 -259762 215090 -21668 -277860 -201410
9080b01410L9255L9958n1470f3213K1586l76475a97879A90458b24792c5971k47938
$$ -201410 -162155 -122197 -173667 -63213 -41627 -418102 -197879 190458 -224792 -35971 -283909
9069b83909J20063M9186j49757J18384d9587E5395d1021j54878B24999B4439P2597
$$ -283909 -163846 -114660 -264417 -146033 -49587 55395 -41021 -195899 224999 24439 97036
9058I7036A0055M4139b53503A5234L4354g5496o3484H1474b69199A6325i7200
$$ 97036 10055 54194 -253503 15234 49588 -75496 -138980 81474 -269199 16325 -97200
9046c05307a37107k01411B3226J89863a21907A1123L12446d2453B76303j36080
$$ -305307 -137107 -338518 23226 213089 -121907 11123 323569 -42453 276303 140223
9036A40223a44620A30453c60170a33004e9917H6715b57223l8016c4441C42327
$$ 140223 -144620 130453 -360170 -133004 -59917 86715 -257223 -295239 -34441 342327
9025A6951a26815h340m67343B4308b94268A71352B7646c44569e661l5380C3067
$$ 16951 -126815 -8340 -475683 24308 -294268 171352 27646 -344569 -5661 -41041 33067
9013A31276d0719J4993r3023k61282J12642M1292A14153K5171f5414A17823c6664
$$ 131276 -40719 -25726 -118749 -380031 -267389 -226097 114153 139324 -65414 117823 -36664
9001A02361J54489b11308J5244B84923j36800a88085J7937b9333k36533B49238
$$ 102361 256850 -211308 -196064 284923 148123 -188085 -170148 -29333 -265866 249238
8990a30679o1844A13970b42373A1725b65380J16764M9431A26165c09864D223c08392
$$ -130679 -192523 113970 -242373 11725 -265380 -148616 -99185 126165 -309864 4223 -308392
8978b99407A33177k014N9628e4797B06297B7043a77750B40424f2316p3694f0983
$$ -299407 133177 131163 190791 -54797 206297 27043 -177750 240424 -62316 -136010 -60983
8966b87343O0331H4869K03773D3613d564a117j00721n6427P0094B3042R3112d3134
$$ -287343 -227012 84869 288642 43613 -4564 -1117 -101838 -158265 -88171 23042 116154 -43134
8953a90407d7970b0900k0649A2014P6238a78549A13462C6735J11012b65576k4265
$$ -190407 -47970 -20900 -41549 12014 88252 -178549 113462 36735 147747 -265576 -289841
8942b89841J43097A32782a06884j66136f1653k50831G8362J03879m6939J79577
$$ -289841 -146744 132782 -106884 -273020 -61653 -312484 78362 182241 135302 314879
8932C14879b23004N0059A6790a62057A7829K2777p237J98829L10421N72989J927086
$$ 314879 -223004 -172945 16790 -162057 17829 40606 33369 232198 542619 1115608 3042694
8921C042694N953925C925615E75444A10954a00650E2351k406N3562J18575A6829
$$ 3042694 8996619 3925615 575444 110954 -100650 52351 49945 103507 222082 16829
8910a80503d0651j23364D29307q7705c082l6353A28515N3000b7954q3171D7700
$$ -180503 -40651 -164015 429307 341602 -3082 -39435 128515 181515 -27954 -111125 47700
8898A1577g8799C43628a78818d7513A34678a63811g059k15807I699M2325K31615
$$ 11577 -78799 343628 -178818 -47513 134678 -163811 -7059 -222866 9699 52024 283639
8887B83639b83726a23540b1794l30560I0332b24201C9225b35140c9043J0719o4693
$$ 283639 -283726 -123540 -21794 -352354 90332 -224201 39225 -235140 -39043 -28324 -93017
8876i3017j63709a07906k20180I2575a74133B30902b38847G3040c38842A5307
$$ -93017 -256726 -107906 -328086 92575 -174133 230902 -238847 73040 -338842 15307
8865a30245j4680M7992A39833a56231H1764J12771I3633L731a46765e3204K1923
$$ -130245 -144925 -96933 139833 -156231 81764 194535 93633 97364 -146765 -53204 -31281
$$ [...]
##END NTUPLES=NMR SPECTRUM
##END=
