
##TITLE=AC1249_NSDAH12039_6945181_DXTpwpUtfk
##JCAMPDX= 6.0         $$ Bruker NMR JCAMP-DX V2.0
##DATA TYPE= NMR SPECTRUM
##DATA CLASS= NTUPLES
##ORIGIN= BRUKER
##OWNER= Administrator
$$ 1.72 TOPSPIN		Version 2.1
$$ 2012-12-11 22:58:50.314 -0500  Administrator@X
$$ Compression mode = diff/dup
##.OBSERVE FREQUENCY= 400.02188249412
##.OBSERVE NUCLEUS= ^1H
##.ACQUISITION MODE= SIMULTANEOUS (DQD)
##.ACQUISITION SCHEME= undefined
##.AVERAGES= 64
##.DIGITISER RES= 22
##SPECTROMETER/DATA SYSTEM= spect
##.PULSE SEQUENCE= noesygpps1d.comp
##.SOLVENT NAME= COFFEE_meoh
##.SHIFT REFERENCE= INTERNAL, COFFEE_meoh, 1, 14.96128
##AUDIT TRAIL= $$ (NUMBER, WHEN, WHO, WHERE, PROCESS, VERSION, WHAT)
$$ ##TITLE= Audit trail, TOPSPIN		Version 2.1
$$ ##JCAMPDX= 5.01
$$ ##ORIGIN= Bruker BioSpin GmbH
$$ ##OWNER= Administrator
$$ $$ E:\/data/COFFEE/nmr/AC1249_NSDAH12039_6945181_DXTpwpUtfk/22/pdata/1/auditp.txt
$$ ##AUDIT TRAIL=  $$ (NUMBER, WHEN, WHO, WHERE, PROCESS, VERSION, WHAT)
(   1,<2012-12-11 22:58:44.064 -0500>,<Administrator>,<X>,<go>,<TOPSPIN 2.1>,
      <created by zg
	started at 2012-12-11 22:47:13.937 -0500,
	POWCHK enabled, PULCHK disabled,
       configuration hash MD5:
       86 BA 57 50 F2 9D 5C 9B 26 00 A9 28 5F 66 2E 89
       data hash MD5: 64K
       16 A9 23 A6 69 9B 72 D4 39 F3 5D 6A 56 C6 45 D2>)
(   2,<2012-12-11 22:58:47.299 -0500>,<Administrator>,<X>,<proc1d>,<TOPSPIN 2.1>,
      <Start of raw data processing
       efp LB = 0.3 FT_mod = 6 PKNL = 1 PHC0 = 0 PHC1 = 0 SI = 128K 
       data hash MD5: 128K
       E2 59 3F 89 92 01 05 13 1C 1A F9 8A 92 5C 97 EF>)
(   3,<2012-12-11 22:58:48.439 -0500>,<Administrator>,<X>,<proc1d>,<TOPSPIN 2.1>,
      <pk PHC0 = -80.68909 PHC1 = 0 
       data hash MD5: 128K
       4E A7 6B 44 76 19 01 0E EF D8 50 B3 E5 F6 65 A4>)
(   4,<2012-12-11 22:58:49.189 -0500>,<Administrator>,<X>,<proc1d>,<TOPSPIN 2.1>,
      <abs ABSG = 1 
       data hash MD5: 128K
       00 40 E6 19 E7 E3 D7 A0 71 AC 83 AC 73 97 3E 6F>)
(   5,<2012-12-11 22:58:49.439 -0500>,<Administrator>,<X>,<proc1d>,<TOPSPIN 2.1>,
      <abs ABSG = 2 
       data hash MD5: 128K
       F1 D7 9F CC B2 B8 15 15 F5 6B DB C8 F5 C7 A1 1D>)
(   6,<2012-12-11 22:58:49.595 -0500>,<Administrator>,<X>,<proc1d>,<TOPSPIN 2.1>,
      <abs ABSG = 3 
       data hash MD5: 128K
       F7 60 9F 9A 13 53 2B 02 18 5B 93 46 DF D6 E0 F0>)
(   7,<2012-12-11 22:58:49.767 -0500>,<Administrator>,<X>,<proc1d>,<TOPSPIN 2.1>,
      <abs ABSG = 4 
       data hash MD5: 128K
       B6 CD 9D C9 8B 05 60 C5 99 C0 4F E6 DF 3F 76 16>)
(   8,<2012-12-11 22:58:49.939 -0500>,<Administrator>,<X>,<proc1d>,<TOPSPIN 2.1>,
      <abs ABSG = 5 
       data hash MD5: 128K
       82 18 CB 2B 7F D2 CC 6B 6F AF 74 DD C5 B6 7B 6C>)
$$ ##END=
$$ 
$$ $$ hash MD5
$$ $$ 52 12 BF 64 0D 37 1B FD 7B 2C ED D8 D7 25 09 B5
##$RELAX= 
##$RELAX= 
##$RELAX= 
##$RELAX= 
##$RELAX= 
##$RELAX= 
##$RELAX= 
##$RELAX= 
##$RELAX= 
$$ Bruker specific parameters
$$ --------------------------
##$DU= <E:\>
##$EXPNO= 22
$$ [...]
##$TP07= 0
##$TPNAME0= <>
##$TPNAME1= <>
##$TPNAME2= <>
##$TPNAME3= <>
##$TPNAME4= <>
##$TPNAME5= <>
##$TPNAME6= <>
##$TPNAME7= <>
##$TPOAL= (0..7)
0.5 0.5 0.5 0.5 0.5 0.5 0.5 0.5
##$TPOFFS= (0..7)
0 0 0 0 0 0 0 0
##$TUNHIN= 0
##$TUNHOUT= 0
##$TUNXOUT= 0
##$USERA1= <user>
##$USERA2= <user>
##$USERA3= <user>
##$USERA4= <user>
##$USERA5= <user>
##$V9= 5
##$VALIST= <valist>
##$VCLIST= <CCCCCCCCCCCCCCC>
##$VD= 0
##$VDLIST= <DDDDDDDDDDDDDDD>
##$VPLIST= <PPPPPPPPPPPPPPP>
##$VTLIST= <TTTTTTTTTTTTTTT>
##$WBST= 2048
##$WBSW= 25
##$XGAIN= (0..3)
0 0 0 0
##$XL= 0
##$YL= 0
##$YMAX_a= 5855993
##$YMIN_a= -12611504
##$ZGOPTNS= <>
##$ZL1= 120
##$ZL2= 120
##$ZL3= 120
##$ZL4= 120
##$ABSF1= 14.96128
##$ABSF2= -5.596902
##$ABSG= 5
##$ABSL= 3
##$ALPHA= 0
##$AQORDER= 0
##$ASSFAC= 0
##$ASSFACI= 0
##$ASSFACX= 0
##$ASSWID= 0
##$AUNMP= <proc_prof1d_extract.lims>
##$AXLEFT= 0
##$AXNAME= <>
##$AXNUC= <1H>
##$AXRIGHT= 0
##$AXTYPE= 0
##$AXUNIT= <>
##$AZFE= 0.1
##$AZFW= 0.1
##$BCFW= 0
##$BC_mod= 0
##$BYTORDP= 0
##$COROFFS= 0
##$CY= 15
##$DATMOD= 1
##$DC= 0
##$DFILT= <>
##$DTYPP= 0
##$F1P= 0
##$F2P= 0
##$FCOR= 0.5
##$FTSIZE= 131072
##$FT_mod= 6
##$GAMMA= 0
##$GB= 0
##$INTBC= 1
##$INTSCL= 1
##$ISEN= 128
##$LB= 0.3
##$LEV0= 0
##$LPBIN= 0
##$MAXI= 10000
##$MC2= 0
##$MEAN= 0
##$ME_mod= 0
##$MI= 0
##$NCOEF= 0
##$NC_proc= -2
##$NLEV= 6
##$NOISF1= 0
##$NOISF2= 0
##$NSP= 0
##$NTH_PI= 0
##$NZP= 0
##$OFFSET= 14.96128
##$PC= 1
##$PHC0= -80.68909
##$PHC1= 0
##$PH_mod= 1
##$PKNL= yes
##$PPARMOD= 0
##$PPDIAG= 0
##$PPIPTYP= 0
##$PPMPNUM= 2147483647
##$PPRESOL= 1
##$PSCAL= 4
##$PSIGN= 0
##$PYNMP= <proc.py>
##$REVERSE= no
##$SF= 400.020009525465
##$SI= 131072
##$SIGF1= 0
##$SIGF2= 0
##$SINO= 400
##$SIOLD= 131072
##$SPECTYP= <>
##$SREGLST= <1H.CDCl3>
##$SSB= 0
##$STSI= 131072
##$STSR= 0
##$SW_p= 8223.68421052631
##$SYMM= 0
##$S_DEV= 0
##$TDeff= 65536
##$TDoff= 0
##$TI= <>
##$TILT= no
##$TM1= 0
##$TM2= 0
##$TOPLEV= 0
##$USERP1= <user>
##$USERP2= <user>
##$USERP3= <user>
##$USERP4= <user>
##$USERP5= <user>
##$WDW= 1
##$XDIM= 131072
##$YMAX_p= 450787761
##$YMIN_p= -144467
##$CURPLOT= <Network HP LaserJet P1505>
##$CURPRIN= <$Network HP LaserJet P1505>
##$DFORMAT= <normdp>
##$LAYOUT= <+/1D_H.xwp>
##$LFORMAT= <normlp>
##$PFORMAT= <normpl>
##$SURQMSG= 1
$$ End of Bruker specific parameters
$$ ---------------------------------
##NTUPLES= NMR SPECTRUM
##VAR_NAME=  FREQUENCY,     SPECTRUM/REAL,   SPECTRUM/IMAG
##SYMBOL=    X,             R,               I
##VAR_TYPE=  INDEPENDENT,   DEPENDENT,       DEPENDENT
##VAR_FORM=  AFFN,          ASDF,            ASDF
##VAR_DIM=   131072,        131072,          131072
##UNITS=     HZ,            ARBITRARY UNITS, ARBITRARY UNITS
##FACTOR=    0.0627417313425164, 1,          1
##FIRST=     8223.62146879497, -1745,        -60872
##LAST=      0,             697,             -61514
##MIN=       0,             -144467,         0
##MAX=       8223.62146879497, 450787761,    0
$$ Real data points
##PAGE= N=1
##DATA TABLE= (X++(R..R)), XYDATA
$$ [...]
65283 148087 146581 144936 143515 142815 142901 143200 142945 141830 140227 138807 137933 137488 137254 137202 137187 136706 135452
65266 135452 133975 133233 133465 134011 134301 134456 134772 135255 135949 137150 138878 140590 141812 142692 143577 144405 144900
65249 144900 144958 144393 142729 139881 136775 134682 133999 134135 134420 134578 134436 133854 133121 132922 133662 135025 136335
65232 136335 137178 137631 138048 138637 139124 138880 137576 135664 134060 133387 133630 134341 134940 134946 134241 133139 132044 131091
65214 131091 130293 129907 130352 131737 133649 135436 136614 137055 136949 136661 136495 136533 136543 136084 134902 133401 132522
65197 132522 132775 133608 134153 134422 135091 136212 136979 137020 137005 137477 137923 137728 137392 137877 139193 140617 142011 143933
65179 143933 146421 148646 149933 150343 150093 149158 147743 146465 145674 145091 144467 144091 144251 144661 144864 144960 145467
65162 145467 146634 148207 149763 151041 152075 153241 155032 157579 160507 163432 166426 169806 173695 178115
65148 178115 183406 190108 198310 207403 216692 226146 236289 247447 259334 271494 283785 296140 308002
65135 308002 318483 327249 334940 342519 350375 358129 364990 370098 372852 373320 372177 369940 366462 361505
65121 361505 355559 349556 343836 337781 330493 321441 310528 298072 284899 272029 260032 248894 238516
65108 238516 228962 220136 211692 203537 196049 189508 183613 177897 172423 167701 164028 161239 159034 157261
65094 157261 155909 155068 154882 155306 155927 156279 156343 156499 156906 157244 157252 157210 157566 158184 158382 157773 156700 155662 154673
65075 154673 153537 152548 152453 153671 155857 158228 160035 160739 160211 158963 157870 157405 157301 157096 156733 156444 156351
65058 156351 156474 156960 157984 159470 161051 162225 162477 161556 159811 158058 156880 156211 155693 155113 154310 153099
65042 153099 151650 150569 150150 149867 149078 147886 146753 145551 143787 141614 139808 138641 137524 135985 134336
65027 134336 133058 132107 131265 130739 130948 131957 133412 134782 135472 135069 133864 132903 133133 134582 136584 138554
65011 138554 140251 141552 142459 143303 144523 146154 147818 149260 150609 152043 153477 154764 156027 157528 159244
64996 159244 160767 161693 161996 161972 161930 162077 162608 163723 165491 167813 170554 173615 176860 180117 183278 186207
64980 186207 188512 189641 189401 188213 186680 185066 183343 181459 179262 176390 172684 168694 165324 162933
64966 162933 161119 159463 158065 157156 156542 155811 154929 154241 153865 153399 152421 151092 150016 149500 149181 148505 147395
64949 147395 146279 145579 145397 145596 145860 145715 144845 143497 142284 141522 141067 140849 141111 141944 143032 144166 145532
64932 145532 147099 148129 147846 146371 144484 142664 140845 138966 137240 135937 135320 135694 136955 138213 138453
64917 138453 137695 137017 137301 138427 139832 141343 143158 145253 147155 148279 148482 148392 149103 151257 154412 157603
64901 157603 160577 164187 169433 176277 183585 190222 196183 202576 210287 218756 226347 231967 235869 238813
64887 238813 241155 243113 245129 247142 248057 246856 243942 240451 236512 231298 224807 218406 213301 209401
64873 209401 206121 203388 201311 199545 197683 195899 194705 194307 194476 194730 194438 193237 191554 190234 189319
64858 189319 187729 184458 179699 174484 169677 165623 162310 159476 156912 154871 153751 153240 152466 151328 150860
64843 150860 151656 152678 152481 151101 149835 149506 149913 150775 152120 153606 154447 154412 154219 154538 155146 155482 155600
64826 155600 156070 157170 158690 160440 162506 164956 167671 170626 174043 178024 182289 186587 191176 196395
64812 196395 201842 206715 211198 216740 224279 232698 239836 244709 247844 249655 249644 247432 243547 238696 233026
64797 233026 226668 220264 214368 208849 203561 199093 196114 194231 192288 189691 186895 184625 183145 182349
64783 182349 182096 182280 182710 183121 183379 183822 185258 188236 192252 196080 199049 201587 204438 207955 212382 218111
64767 218111 225064 232288 238766 244383 249611 254625 259294 263708 268091 272324 276163 279828 283847 288362
64753 288362 293034 297557 301783 305336 307551 307892 306231 302713 297592 291173 283807 276008 268532 261932
64739 261932 255867 249359 242110 235112 229523 225390 222009 219150 217174 216186 215802 215811 216450 217925 220082 222575
64723 222575 225041 227184 229050 231145 233890 237083 240301 243692 247803 252597 257143 260440 262267 263106
64709 263106 263451 263210 261689 258210 252834 246343 239457 232381 225230 218375 212063 206162 200696 196168 192792
64694 192792 189900 186760 183703 181714 181131 181492 182466 184161 186482 188920 191113 193141 195292 197969 201711
64679 201711 206680 212229 217552 222766 228755 235974 244001 252152 259856 266404 271077 273751 274790 274247
64665 274247 271784 267526 262310 256799 250916 244501 238064 232514 228346 225336 222843 220312 217698 215434
64651 215434 213839 212767 212066 212070 213121 214906 216964 219609 223579 228844 234667 240922 248459 257916 268906
64636 268906 280625 292457 303742 313684 322017 329072 334777 338268 339027 337838 335954 333636 330109 324772
64622 324772 317989 310848 304415 299079 294373 289609 284778 280594 277601 275627 274202 273014 271772 270144
64608 270144 268129 266176 264710 263842 263544 263538 262959 260885 257495 254029 251199 248283 244304 239498 234983 231431
64592 231431 228713 226505 224605 222920 221721 221739 223493 226648 230444 234540 239014 243779 248515 253081 257488
64577 257488 261571 265084 268076 270737 272908 274090 273982 272780 270946 268765 266085 262394 257322 251141
64563 251141 244570 238042 231496 224979 218998 214012 209952 206524 203615 201160 198987 197139 195898 195180
64549 195180 194359 193166 192330 192738 194212 195704 196526 196895 197413 198515 200374 202900 205708 208310 210234 210892
64533 210892 209755 206988 203617 200640 198233 196113 194302 193074 192458 192307 192616 193383 194432 195799 197870
64518 197870 200545 202746 203535 203430 203808 205152 206769 208147 209655 211703 214076 216438 218938 222015 226063
64503 226063 231412 238144 245692 253083 259756 265797 271339 276242 280358 283496 284990 283983 280448 275402
64489 275402 269845 264046 258163 252913 249058 246606 245002 243852 243098 242767 242856 243225 243367 242662 241142 239512
64473 239512 238039 235974 232675 228839 225821 223929 222316 220548 219406 219801 221596 224003 226677 229818
64459 229818 233394 236856 239653 241686 243038 243497 242636 240405 237488 234868 233063 231959 231436 231869 233679
64444 233679 236534 239421 241679 243674 246247 249749 253874 258351 263456 269759 277469 286135 295032 303981
64430 303981 313870 326157 341651 359874 379939 401990 427456 457917 494208 536870 587014 646177
64418 646177 715368 794589 883074 979423 1081275 1185166 1287057 1383226 1471042 1549351 1618158
64407 1618158 1677493 1726288 1762405 1783721 1788934 1777502 1749538 1706291 1650356 1584668 1510976
64396 1510976 1429381 1339332 1241089 1136613 1029629 924926 827095 739285 662718 597159 541763
64385 541763 495597 457615 426420 400353 378031 358855 342858 330039 319971 311960 305329 299473
64373 299473 293935 288634 283815 279584 275665 271759 267920 264256 260400 255680 249892 243708 238179 233926
64359 233926 230779 228116 225570 223495 222705 223657 225921 228522 230794 232874 235468 239218 244180 249701 254781
64344 254781 258600 260778 261269 260279 258259 255684 252612 248675 243763 238603 234348 231620 230095 229047 228103
64329 228103 227449 227497 228463 230234 232527 235086 237732 240361 243098 246284 249990 253530 255794 256320 255763 255141
64313 255141 254806 254366 253360 251667 249356 246501 243147 239286 234802 229645 224076 218595 213645 209427 205935
64298 205935 203077 200780 199067 197975 197385 197075 196975 197214 197834 198637 199465 200477 202014 204321 207492 211454
64282 211454 215824 219992 223631 227089 231095 236097 241965 248159 254097 259551 264832 270373 275997 280799
64268 280799 283990 285605 286137 285747 284256 281821 279228 277387 276756 277166 278013 278653 278811 278588 277933 276271
64252 276271 272859 267487 260691 253452 246795 241417 237293 233681 229794 225443 220967 216795 213387 211293
64238 211293 210729 211092 211348 210966 210205 209568 209337 209648 210541 211789 213014 214081 215093 215905 216047 215387 214586
64221 214586 214513 215301 216229 216449 215579 213623 210724 207237 203811 200960 198511 195845 192922 190732 190305 191428
64205 191428 192858 193774 194432 195307 196288 197114 198059 199528 201304 202889 204482 207046 211298 217056 223653 230671
64189 230671 238243 246982 257583 270166 283845 297171 309071 319207 327422 333083 335147 332785 326043
64176 326043 316053 304603 293285 282860 273265 264049 254861 245785 237354 230112 224131 219161 215150
64163 215150 212218 210112 208298 206762 206085 206359 206695 206415 206216 207410 210239 213653 216540 218588 220091
64148 220091 221608 223757 226731 229969 232706 234756 236337 237424 237913 238201 238837 239600 239628 238441 236277 233552
64132 233552 230718 228558 227655 227455 226687 225017 223561 223544 225144 227874 231269 234819 237971 240742 243828
64117 243828 247696 252129 256989 262771 269916 278172 287148 296914 307314 317133 324766 329617 332276 333502
64103 333502 333677 333289 333431 335488 340288 347432 355390 362541 368381 373600 378921 384126 388274 390530 390590
64088 390590 388742 385771 382498 379181 375576 371570 367252 362320 356184 349035 342126 336498 331973 327893
64074 327893 324169 320867 317381 313062 308404 304638 302153 300185 298081 296038 294333 292589 290285 287577
64060 287577 285210 283830 283627 284463 286137 288534 291544 294868 298145 301485 305609 311066 317483 324068 330715
64045 330715 338111 346753 356460 366984 378556 391491 405584 420187 434627 448347 460926 472178
64033 472178 482067 490254 495945 498426 497645 494078 488265 480786 472507 464390 456953 450177 443960 438335
64019 438335 433067 427463 420937 413627 406060 398348 390166 381546 373159 365565 358682 352332 346823 342418
64005 342418 338537 334236 329471 325218 322264 320460 319348 318857 319056 319765 320861 322560 324918 327422 329639
63990 329639 332001 335370 339899 344925 349995 355412 361539 368073 374505 381053 388643 397766 407699 417180
63976 417180 425801 434458 444310 455653 468000 480943 494547 509093 524988 542914 563456 586347
63964 586347 610439 634603 658385 681776 704918 728384 753298 780849 811949 847578 889058
63953 889058 937655 994356 1060440 1137788 1228059 1331808 1449067 1580604 1727972 1892263
63943 1892263 2073215 2269531 2479542 2701460 2933308 3172683 3416311 3659868 3898508
63934 3898508 4127453 4341730 4535619 4703113 4839189 4940385 5004291 5029270 5014978 4962568
63924 4962568 4873860 4750650 4595369 4412145 4206647 3984801 3752000 3513354 3273935 3038281
63914 3038281 2809895 2591497 2385575 2194309 2019039 1860054 1716969 1589049 1475318
63905 1475318 1374737 1286383 1209235 1141829 1082569 1030524 985431 946709 912973 882888 855964
63894 855964 831976 810124 789562 770389 753161 737555 722476 707501 693196 679780 666610
63883 666610 653506 641636 632312 625572 620714 617682 617131 619508 624872 633330 644862 658819 674302
63870 674302 691028 709333 729384 750923 773694 797608 822470 847936 873680 899233 923786
63859 923786 946515 966953 984785 999593 1011334 1020719 1028394 1033841 1035706 1033185 1026507 1016119 1002142
63846 1002142 984819 964865 943060 919812 895218 869163 841355 811752 781118 750605 720615
63835 720615 690539 659873 629222 599857 572608 547500 524222 502592 482612 464299 447493
63824 447493 431828 416982 402941 389840 377607 366056 355359 346057 338413 331941 325776 319428
63812 319428 313075 307247 302334 298341 295043 292274 289943 287834 285662 283443 281476 279740 277641 274745
63798 274745 271482 268653 266396 264144 261567 258967 256675 254502 251996 248914 245337 241621 238334 235932
63784 235932 234424 233558 233251 233452 233637 232995 231314 229296 227763 226879 226366 226083 226050 226147 226165 226099 226147 226428 226846
63765 226846 227191 227288 227153 227044 227254 227726 227938 227304 225763 223977 222880 222870 223400 223519 222936 222327 222440 223132
63747 223132 223649 223711 223873 224812 226607 228889 231426 234344 237771 241322 244062 245214 244997 244536 244778 245722
63731 245722 246894 248166 249742 251655 253827 256495 260075 264650 269990 275897 282051 287691 292107 295451
63717 295451 298468 301360 303633 305162 306606 308280 309215 308024 304502 299856 295377 291352 287411 283647
63703 283647 280994 280260 280968 281658 281556 281431 282355 284093 285520 286400 287792 290556 294356 298494 302847 307391
63687 307391 311413 314077 315505 316610 317914 319028 319333 318731 317651 316635 316023 315784 315558 314979 314053 313167
63671 313167 312682 312629 312810 313156 313797 314710 315495 315815 316004 316775 318158 319168 318889 317443 315400 312642 308578
63654 308578 303287 297654 292332 287359 282981 280011 278824 278523 277692 275874 273953 273198 274115 276102 278069
63639 278069 279462 280664 282279 284280 286217 288100 290470 293546 296882 300100 303529 307891 313656 320805
63625 320805 328869 337165 345410 354184 364356 376017 388508 401549 415631 431166 447980 466061
63613 466061 486078 508617 533332 559428 586629 615211 645353 676764 708542 739012 766093
63602 766093 788361 805514 817495 823649 823377 817411 807856 796969 786156 775876 766007 756299 746667
63589 746667 736927 726152 712763 695673 675133 652206 627796 602587 577485 553519 531419 511673
63577 511673 494721 480645 468869 458726 450213 443817 439813 438203 439070 442340 447236 452590 457858
63564 457858 463423 469869 477376 485842 495050 504515 513576 522031 530557 540372 552527 567587 585771
63551 585771 607211 632041 660287 691735 726034 762961 802366 843541 884406 921282 949713
63540 949713 966223 970041 963337 949614 931808 911970 892173 874658 860752 850185 841776 834326
63528 834326 826634 817294 805057 789182 769229 744990 717020 686778 655791 624919 594706 565918
63516 565918 539226 514770 492464 472322 454091 437035 420780 405976 393459 383072 373956 365710
63504 365710 358562 352693 348117 345041 343495 342623 341121 338510 335438 332743 330804 329681 329139 328448 326859
63489 326859 324511 322338 320971 320293 320200 321098 323306 326418 329620 332420 334872 337368 340348 343980 347974
63474 347974 351853 355321 358150 359932 360421 360019 359353 358365 356395 353280 349803 346808 344291 341670 338575
63459 338575 335129 331683 328588 326090 324328 323478 323764 325113 326982 328930 331312 334953 340105 346193 352672
63444 352672 359702 367843 377495 388856 402107 417435 435033 455175 478109 503914 532623 564155
63432 564155 597527 630145 658536 680176 694441 702065 704392 703439 701926 702526 707015 716175 730151
63419 730151 748656 771168 797317 827045 860217 896094 933035 968524 999597 1023793 1039934
63408 1039934 1047960 1048291 1041843 1030473 1016613 1002091 987646 973586 960237 947395 933904 918299
63396 918299 899639 877496 851584 821863 788856 753619 717530 682152 648864 618286 590315
63385 590315 564926 542621 523902 508681 496471 486769 478979 472404 466832 462848 461208 462073 465141
63372 465141 470139 476760 484476 492999 502807 514733 529080 545530 563734 583551 604791 627311
63360 627311 651363 677440 705735 736171 768886 804064 840994 877724 911989 942308 967937
63349 967937 988071 1001605 1007817 1007105 1000894 990873 978385 964508 950430 937274 925318 913558
63337 913558 900363 884589 865974 844618 820463 793417 763776 732352 700338 669042 639637
63326 639637 612955 589565 570047 555008 544673 538616 536030 536107 537750 538933 536840 529136 515217
63313 515217 496230 474211 451443 430221 412307 398147 386829 377124 368495 361079 355050 350309
63301 350309 346576 343471 340636 338009 335893 334460 333342 331947 330055 327870 325694 323830 322596 321956
63287 321956 321211 319524 316797 313758 311195 309431 308431 307931 307502 306963 306778 307534 308944 309940 309949 309523 309444
63270 309444 309790 310272 310943 311913 312776 313029 312990 313608 315282 317402 319283 321037 323189 325778 328313 330560
63254 330560 332914 335870 339370 342903 346087 348968 351879 355306 359805 365654 372433 379341 386178 393712
63240 393712 402799 413443 425128 437774 451794 467321 483945 501340 519649 539031 559244 579966
63228 579966 601336 623892 647923 672878 697435 720410 741820 762779 784026 804919 824487
63217 824487 843221 862824 884074 905817 926501 945879 964453 981804 996348 1006661 1012324 1013396
63205 1013396 1009615 1000388 985332 964659 939190 910137 878868 846889 815862 787278 761889 739557
63193 739557 719798 702382 687407 675133 665986 660471 658731 660272 664400 670986 680616 693841 710285
63180 710285 728608 747510 766843 787485 809930 833247 855823 876961 897237 917300 936951
63169 936951 955591 973016 989404 1004873 1019331 1032424 1043229 1050324 1052540 1049583 1041696 1028914
63157 1028914 1010969 987790 959898 928395 894688 860003 825051 790336 756793 725639 697426
63146 697426 671723 647995 626331 606922 589403 573304 558789 546224 535269 525187 515974 508453
63134 508453 503087 499370 496556 494440 493146 492691 493110 494539 496707 498706 499865 500726 502630 506217 510751
63119 510751 515053 518749 522274 525965 529599 532867 535841 538775 541653 544253 546487 548406 549938 550904
63105 550904 551318 551387 551203 550660 549714 548538 547357 546336 545618 545204 544734 543648 541741 539411 537316 535928
63089 535928 535381 535459 535754 536132 537092 539245 542360 545377 547660 549845 553106 557853 563445 568969 573943 578432
63073 578432 582896 587903 593679 599878 605966 611869 618140 625541 634526 645110 657186 670883 686500
63060 686500 703988 722827 742734 764302 788486 815537 845026 876895 911783 950090 991387
63049 991387 1035195 1081773 1131575 1184242 1238642 1293711 1348854 1403780 1458349 1512379 1565238
63038 1565238 1615897 1663850 1709819 1755175 1800762 1846622 1892519 1938120 1982669 2024976 2063808
63027 2063808 2097967 2125951 2145901 2156051 2155168 2142665 2118596 2083559 2038510 1984678 1923639 1857240
63015 1857240 1787405 1716270 1646453 1580571 1520167 1465531 1416891 1375242 1341510 1315427 1296030
63004 1296030 1283019 1276927 1278085 1286123 1300412 1320293 1344796 1372802 1403662 1437171 1472804 1509529
62992 1509529 1546545 1583673 1620805 1657445 1693154 1728046 1762435 1796131 1828377 1858283 1884996
62981 1884996 1907452 1924205 1933681 1934697 1926846 1910353 1885497 1852241 1810526 1760856 1704462 1642980
62969 1642980 1578162 1511715 1445139 1379605 1316095 1255523 1198583 1145584 1096649 1051975 1011659
62958 1011659 975350 942314 911862 883549 857127 832524 809789 788786 768992 749821 731134
62947 731134 713237 696444 680813 666201 652333 638893 625782 613319 602025 592216 583830 576504
62935 576504 569739 563172 556864 551133 546086 541572 537679 534840 533211 532313 531607 531022 530564 529821 528403
62920 528403 526585 524976 523771 522803 522049 521494 520645 518850 516085 512926 509777 506640 503573 500807 498347
62905 498347 495960 493600 491431 489407 487292 485194 483652 483141 483780 485432 487622 489431 490029 489497 488782
62890 488782 488762 489574 490733 491482 491153 489751 488158 487291 487108 486924 486655 486990 488263 489829 490871 491234 491145
62873 491145 490635 489694 488685 488149 488293 488827 489184 488872 487854 486679 486015 485994 486245 486501 486859 487481 488391 489645
62855 489645 491357 493467 495704 497744 499232 499911 500091 500685 502253 504231 505695 506625 507635 508674 509015
62840 509015 508603 508373 508913 509676 509931 509658 509075 508109 506945 506328 506546 506736 505953 504536 503619 503629 504119 504866
62822 504866 506299 508718 511749 514781 517481 519776 521724 523573 525683 528219 531020 533817 536454 538876
62808 538876 541059 543111 545448 548694 553135 558211 562817 566455 569876 574247 579852 586029 592302 599011
62794 599011 606832 616219 627426 640570 655507 672128 690939 712938 738826 768785 802988 841689
62782 841689 884660 931332 981837 1037242 1098360 1164911 1236264 1312242 1392536 1475908 1560656
62771 1560656 1645523 1729389 1810369 1885946 1953943 2012835 2061174 2097211 2119064 2125010 2113973
62760 2113973 2086276 2043908 1989646 1925935 1854703 1777788 1696920 1613483 1528743 1444218 1361503
62749 1361503 1281891 1206530 1136570 1072603 1014162 960305 910580 865010 823442 785587 751554
62738 751554 721634 695525 672505 652377 635555 621882 610075 598841 588190 579157 572405 567520
62726 567520 563619 560245 557531 555717 554748 554437 554849 556333 559160 563348 568893 575947 584573 594467 605105
62711 605105 616169 627870 641032 656815 675961 698211 722780 749533 779287 812814 850138
62700 850138 891201 936569 986783 1041408 1099550 1161234 1227443 1298678 1374067 1451963 1530737
62689 1530737 1608745 1684062 1754607 1818229 1872446 1914581 1942589 1955625 1953624 1936649 1905042
62678 1905042 1860016 1803639 1738211 1665927 1589043 1509876 1430320 1351567 1274555 1200536 1130844
62667 1130844 1066127 1006224 950931 900566 855486 815370 779398 746959 717779 691503 667766
62656 667766 646653 628468 612817 598487 584576 571296 559288 548532 538428 528622 519243 510469
62644 510469 502387 495277 489576 485462 482682 480845 479604 478614 477622 476678 476069 475874 475646 474655 472494 469461
62628 469461 466309 463581 461311 459407 458050 457393 457130 456876 456957 458209 460901 464338 467689 470706 473493
62613 473493 476174 479103 482796 487189 491467 495103 498642 503040 508693 515662 524267 534642 546081 557769
62599 557769 570192 585064 603707 625992 650929 677793 706623 738042 772700 810563 850742
62588 850742 892263 934719 977676 1019605 1058109 1091327 1118567 1139467 1153121 1158415 1154919 1143149
62576 1143149 1124153 1098999 1068541 1033573 995246 955228 915190 876101 838186 801467 766140
62565 766140 732527 700921 671494 644160 618688 595187 574280 556480 541517 528645 517415
62554 517415 507766 499465 492034 485283 479472 474800 471039 467798 464863 462220 459990 458412 457629 457491 457719
62539 457719 458227 458974 459563 459405 458370 457028 456154 456181 457153 458940 461369 464307 467739 471771 476665 482943
62523 482943 491238 501820 514375 528474 544137 561768 581739 604219 629252 656768 686741 719586
62511 719586 756079 796497 840041 885477 932039 979266 1026267 1071729 1114430 1153083 1185872
62500 1185872 1211013 1228001 1237676 1240876 1237621 1227966 1213139 1195394 1176876 1158825 1141689 1125833
62488 1125833 1112259 1102660 1098561 1100421 1107721 1119840 1136472 1157162 1180813 1205703 1229706 1250498
62476 1250498 1265938 1274606 1276084 1270878 1259999 1244146 1222791 1194365 1157839 1114049 1065179 1013303
62464 1013303 960032 907134 856420 808784 764141 722609 685114 652506 624663 600846 580504
62453 580504 563411 549423 538470 530417 524638 520035 515830 512143 509511 508141 507907 508841 511190 515035
62439 515035 520155 526287 533387 541493 550267 558701 565520 570076 572680 573816 573289 570562 565707 559452
62425 559452 552352 544449 535781 526618 517070 507063 497010 487964 480665 474770 469368 464012 458941 454497
62411 454497 450673 447189 443805 440562 437759 435665 434262 433371 432886 432690 432439 431771 430728 429744 429295 429751
62395 429751 431384 434110 437323 440369 443064 445443 447282 448454 449530 451326 453962 457053 460764 465774
62381 465774 472061 478656 484966 491606 499388 508078 516636 524252 530769 536591 542604 549855 558873 569539
62367 569539 581744 595652 611082 627330 644146 662463 683629 708325 736776 769603 807675
62356 807675 851157 899203 950606 1004357 1059587 1115246 1169820 1221175 1266882 1304985 1334473
62345 1334473 1355006 1366580 1369692 1365515 1355439 1340394 1320695 1296344 1267374 1234177 1197700 1159143
62333 1159143 1119354 1078802 1038300 999412 963862 932614 905532 881618 859571 838568 818664
62322 818664 800122 782422 764523 746166 728117 710831 693702 676240 659208 643713 629625
62311 629625 615850 601987 588890 577607 568578 561975 558029 556645 557179 559080 562522 568027 575520
62298 575520 583951 591951 598764 604517 609694 614595 619310 623906 628233 631701 633730 634406 634322 633717 632226
62283 632226 629548 625873 621510 616538 611109 605723 600944 597103 594411 592986 592652 593123 594510 597183 601014
62268 601014 605395 610324 616877 626171 638342 653019 670358 691091 715864 744964 778451 816182
62256 816182 857954 903868 954185 1008599 1066027 1125287 1185290 1244210 1299182 1347475 1387493
62245 1387493 1418196 1438378 1447542 1447002 1439017 1424820 1404165 1376561 1342077 1301034 1253872 1201696
62233 1201696 1146468 1090348 1035016 981543 930606 882923 839605 801721 769214 740761 715252
62222 715252 692975 674633 659686 646599 634505 623649 614149 605326 596587 588224 580906 574777 569406
62209 569406 564345 559563 555485 552556 550607 548909 547159 546142 546868 549317 552636 556333 560530 565130
62195 565130 569573 573627 577808 582824 589070 596680 605478 614783 623861 632768 642273 652837 664190 675937
62181 675937 687945 699964 711503 722335 732629 742274 750596 757085 762063 766483 771506 778446 788561
62168 788561 802444 819942 840972 866063 895858 930425 969289 1011598 1055803 1099557 1140513
62157 1140513 1177082 1208066 1231970 1247444 1254455 1254452 1249115 1239272 1225118 1206955 1185207 1159893 1130631
62144 1130631 1097392 1061039 1023001 984742 947727 913477 883018 856299 832652 811964 794852
62133 794852 781557 771205 762493 754685 747586 741064 735153 730324 727035 725096 723861 722885 722105 721805
62119 721805 722906 726830 734230 743947 753900 762918 771030 778076 782963 784598 782917 778671 772686 765749
62105 765749 758743 752461 747178 742448 737215 730378 721689 712178 703435 696516 691785 689445 689579 691744
62091 691744 695197 699630 705206 711831 718944 726096 733206 740086 746368 752171 758462 766397 776423 788092
62077 788092 800541 813258 826674 841874 859340 878182 897109 915871 935029 954607 973990
62066 973990 993260 1013529 1035540 1058812 1082639 1107139 1132680 1158826 1184375 1207956 1228102
62055 1228102 1243350 1252917 1256996 1256011 1250076 1239660 1226133 1210782 1193482 1172982 1148323 1119429
62043 1119429 1086623 1050375 1011643 971839 932261 893756 856847 821815 788702 757552 728651
62032 728651 702254 678246 656420 636935 620099 605745 593238 582102 572232 563457 555286 547273
62020 547273 539373 531767 524527 517533 510550 503310 495739 488278 481840 477092 473705 470492 466514 462021
62006 462021 458205 456088 455869 457284 460141 464217 469006 474008 479125 484338 489138 492780 495096 496533
61992 496533 497339 497247 496091 494184 491694 488110 482799 475897 468278 460738 453498 446436 439429 432433 425437
61977 425437 418542 412071 406515 402199 398932 396139 393498 391265 389774 388870 388104 387317 386636 386091 385705 385850
61961 385850 386878 388403 389539 390036 390678 392364 395204 398652 402150 405466 408818 412833 418024 424264 431137
61946 431137 438741 447527 457350 467522 478016 489755 503287 518021 533432 550158 568913 588807
61934 588807 607800 624725 639982 654276 667629 679867 691313 702388 712820 721615 727778 730908
61922 730908 731209 729096 724939 719226 712764 706274 699659 692143 683538 675164 669139 666853 668350 672942
61908 672942 679978 689076 700060 712894 727473 743256 759074 773291 784389 791672 795484 796452 794505
61895 794505 788913 779371 766603 751748 735615 718814 702153 686310 671325 656847 642829 629626
61883 629626 617546 606609 596637 587280 578098 568941 560186 552271 545056 537886 530301 522569 515649 510712
61869 510712 508373 508172 508985 510157 511913 514523 517580 520630 524147 529225 536414 545393 555786 567699
61855 567699 581420 597064 614669 634308 655995 679794 705933 734409 764378 794396 823485
61844 823485 851654 879165 905574 929736 950531 967277 979506 986668 988224 984102 975120 962950
61832 962950 949548 936465 924608 914532 906831 902208 901283 904375 911444 922148 935788 951097 966282
61819 966282 979591 989924 996740 999354 996678 987859 972970 952827 928362 900451 870229 839149
61807 839149 808598 779597 752804 728476 706299 685529 665662 646991 630328 616152 604202
61796 604202 593947 585145 577645 570916 564345 558059 552872 549092 545856 542097 537791 533720 530310 527392
61782 527392 524903 522983 521280 518910 515455 511536 508055 505307 503060 501173 499755 498920 498573 498348 497752
61767 497752 496652 495589 495281 495827 496763 497823 499102 500549 501888 503137 504583 506146 507397 508333 509380
61752 509380 510417 510610 509630 508293 507423 506770 505542 503419 500452 496593 492113 487990 485097 483246 481669
61737 481669 480107 478805 477741 476663 475707 475261 475285 475353 475285 475258 475406 475830 476839 478640 480879 482971 484739
61720 484739 486276 487389 487774 487638 487572 487836 488314 489047 490217 491567 492447 492567 492197 491468 489914 486970 482680
61703 482680 477715 472788 468140 463474 458346 452684 446936 441790 437826 435299 433877 432622 430708 428181
61689 428181 425575 422788 419098 414505 410196 407213 405316 403670 401921 399982 397557 394760 392538 391533
61675 391533 390953 389589 387569 386081 385603 385452 384973 384129 382946 381361 379774 378875 378772 378922 378970 379015 379077 379045
61657 379045 379137 379659 380328 380606 380690 381351 382729 384161 385274 386481 388249 390711 394044 398336 402895 406595
61641 406595 409204 411561 414163 416411 417581 417758 417413 416784 416063 415456 414636 412820 409812 406335 403024 399783
61625 399783 396518 393688 391618 389965 388426 387258 386531 385643 384289 383179 382897 382640 381173 378733 376914
61610 376914 376688 377386 377691 376819 374593 371070 366489 361246 355688 350138 345157 341441 339260 338136 337138
61595 337138 335470 332943 330100 327860 326732 326278 325416 323345 320225 317023 314694 313377 312386 311112 309773
61580 309773 309038 309048 309260 309256 309143 308970 308323 306915 305204 303962 303445 303434 303896 305041 306724 308224 308898 308806
61562 308806 308510 308403 308464 308612 308999 309735 310528 310975 311220 311913 313337 314970 316240 317375 319042 321334 323589
61545 323589 325172 326053 326647 327418 328564 329826 330721 331278 332277 334315 336965 339389 341516 343858 346356 348280
61529 348280 349306 349833 350079 349672 348453 346913 345468 343893 341873 339551 337140 334560 331910 329786 328673
61514 328673 328326 328214 328221 328591 329446 330691 332118 333344 333928 333831 333514 333412 333572 333848 334025 333635 332170 329703
61496 329703 326932 324495 322696 321879 322298 323406 324145 324430 325556 328491 332409 335620 337437 338354 338903 339227
61480 339227 339572 340295 341346 342398 343439 344657 345830 346467 346637 347041 348068 349250 349855 349690 349079 348298
61464 348298 347267 345794 344025 342547 341864 341758 341436 340472 339372 338912 339172 339527 339510 339324 339455 340067 340889
61447 340889 341635 342351 343283 344424 345411 345993 346412 347063 347999 349107 350615 352916 355943 359141 362081 364699
61431 364699 366942 368753 370441 372498 374853 376830 378017 378752 379609 380869 382600 384741 386973 388955 390806
61416 390806 392826 394775 396097 396905 397918 399271 400315 400811 401285 401749 401202 399131 396542 394585 392990
61401 392990 390872 388330 386093 384057 381452 378289 375557 373944 373215 372858 372619 372391 372296 372774 373919 374836
61385 374836 374447 372971 371877 372249 373857 375951 378316 381265 385036 389436 393845 397472 399903 401426 402681
61370 402681 404097 405918 408445 411754 415334 418474 420945 422967 424677 426104 427514 429200 430966 432336
61356 432336 433324 434664 437198 441353 447118 454147 461831 469538 476832 483360 488809 493200 496928 500221
61342 500221 502860 504769 506513 508708 511179 513228 514567 515491 516315 517065 517586 517474 516081 513082 508937
61327 508937 504409 499782 495002 490375 486580 484067 482853 482827 483895 485977 489145 493482 498497 503142 506942
61312 506942 510752 515817 522396 529944 538258 547694 558520 570750 584389 599060 613604 626842 638575
61299 638575 649035 657570 662913 664776 664204 662195 658807 653837 647477 639998 631582 622849 614821 607882
61285 607882 601277 594102 586380 578826 571984 565959 560726 556309 552792 550321 549043 549011 550233 552647 555845
61270 555845 559074 561856 564369 566852 569034 570763 572821 576295 581307 587220 594001 602381 612530 623467
61256 623467 634056 643778 652190 658439 661913 662987 662724 662076 661440 660518 658445 654549 649159 643257 637351
61241 637351 631276 625126 619534 614762 610281 605710 601607 598749 597008 595385 593047 590177 588027 588117 590957
61226 590957 595459 600077 604464 609470 615564 622186 628838 635872 643659 651776 659638 667394 675545 684104
61212 684104 692677 700916 708321 714032 717621 719923 722403 725690 729245 732535 736026 740855 747767 756597
61198 756597 766750 778049 790983 806054 823051 841197 859845 878603 896754 913026 926187
61187 926187 935745 942060 945989 948367 949543 949361 947777 945195 941844 937131 930290 921564 912051 902306
61173 902306 891779 879771 866401 852465 838850 826140 814236 802252 789317 775484 761344
61162 761344 746969 732075 717108 703102 690311 678147 666803 657698 651713 648032 645583 644607 645801
61149 645801 648674 651978 655314 659111 663069 665674 665447 662130 656552 649837 642807 635868 629427 624360
61135 624360 621660 621447 622885 625430 629557 635771 643575 652167 661719 673128 686718 702035 718783
61122 718783 737155 757186 778474 800781 824413 849714 876484 904100 932114 960578 989800
61111 989800 1019719 1049604 1078500 1105859 1131448 1154866 1175793 1194665 1212297 1228530 1241914
61100 1241914 1251104 1255944 1256875 1254049 1247627 1238228 1226376 1212035 1195428 1177839 1160802 1144812 1129538
61087 1129538 1114917 1101254 1088527 1076455 1065193 1055346 1047322 1041154 1036765 1033922 1032222 1031692 1033053
61074 1033053 1036810 1042386 1048819 1055907 1063937 1072602 1081095 1089088 1096871 1104656 1112467 1120422 1128337 1135336
61060 1135336 1140766 1145284 1150094 1155303 1160114 1164371 1168715 1173208 1177211 1180872 1185444 1191594 1198531 1205372
61046 1205372 1212321 1219904 1228001 1236409 1245501 1255584 1266296 1277430 1289659 1303650 1319008 1334879
61034 1334879 1351117 1368071 1385725 1403946 1423208 1444230 1467107 1491595 1517978 1546786 1577727
61023 1577727 1609735 1642136 1675200 1709768 1747135 1789305 1838566 1896588 1964374 2042976 2133556
61012 2133556 2236978 2354370 2488565 2644658 2829304 3050344 3317051 3639697 4028806
61003 4028806 4496109 5056718 5729682 6537378 7507342 8674486 10074029 11721582 13592317
60994 13592317 15612751 17661727 19571074 21138252 22179100 22616087 22540606 22184375 21808852
60985 21808852 21594609 21598445 21767890 21962850 21973745 21571636 20601180 19061841 17110092
60976 17110092 14980015 12886409 10971811 9305060 7902053 6745783 5802518 5035365
60968 5035365 4411832 3904451 3489547 3147921 2865376 2630691 2433371 2264072 2116322
60959 2116322 1986371 1871391 1768636 1676098 1592881 1518584 1452795 1395177 1345364 1302450 1264972
60948 1264972 1231555 1201171 1172647 1144403 1115101 1084439 1053144 1022296 992677 964466 937322
60937 937322 910874 885286 861269 839430 819643 801118 783056 765326 748588 733654 720585
60926 720585 708584 696998 686186 676962 669275 662011 654328 646725 640454 636025 632643 629093 624999
60913 624999 621106 618343 616763 615580 614172 612665 611426 610451 609653 609291 609518 609796 609421 608444 607287 605580
60897 605580 602307 597303 591724 586588 581555 575585 568323 560344 552531 545681 540325 536331 532807 528792
60883 528792 524033 518968 514214 510149 506643 503052 498803 494056 489422 485023 480530 476188 472959 471253
60869 471253 470291 469324 468729 469196 470516 472080 474054 477044 480845 484592 488111 492187 497228 502461 506766
60854 506766 509781 511894 513594 515211 517032 519292 521936 524492 526325 527173 527450 527719 527852 527079 524974
60839 524974 521907 518239 513585 507342 499581 490941 482000 473280 465567 459531 455071 451474 448148 444834
60825 444834 441324 437478 433499 429775 426531 423862 421820 420080 417823 414525 410677 407222 404415 401687
60811 401687 398446 394497 389931 385234 381344 378914 377536 376242 374712 373451 372866 372865 373339 374337 375599 376562
60795 376562 377039 377337 377591 377574 377449 378096 380178 383191 385871 387453 388260 389162 390675 392586 394328 395599
60779 395599 396508 397168 397431 397141 396379 395283 393942 392685 392085 392265 392512 392094 391236 390836 391437 392865 394620
60762 394620 396059 396488 395733 394486 393505 392642 391311 389720 388819 388986 389531 389631 389112 388194 387176 386611 387172
60745 387172 388945 391199 393072 394190 394599 394508 394122 393245 391072 386964 381459 375922 371042 366327 361255
60730 361255 356320 352540 350447 349850 350183 350739 350976 350930 351065 351563 352103 352547 353384 355184 357926 361079 364064
60713 364064 366418 367846 368402 368428 368154 367595 366918 366592 366973 367990 369321 370595 371395 371445 370955 370435 370068 369585
60695 369585 368838 368044 367349 366607 365800 365201 364898 364560 364001 363634 363995 365057 366301 367270 367863 368287 368941 370205
60677 370205 372208 374869 378090 381626 384884 387343 389171 390904 392392 392669 391163 388492 385701 383132
60663 383132 380499 377658 374856 372452 370775 369998 369813 369558 369091 369259 370920 373679 376195 377727 378858
60648 378858 380569 383121 386059 388875 391221 392746 393144 392439 390978 389072 386824 384284 381573 378804 376123
60633 376123 373888 372522 371992 371714 371246 370828 370873 371223 371411 371440 371657 371956 371883 371529 371478 371716 371517 370738 370265
60614 370265 370626 371113 370933 370335 369719 368612 366700 365188 365689 368019 370368 371589 372126 372749 373568 374433 375208
60597 375208 375419 374606 373248 372506 372890 373977 375470 377531 379939 381976 383466 384997 386847 388592 390001
60582 390001 391373 392643 393189 393035 393277 394793 397258 399899 402432 404824 406996 409326 412624 417147 422396
60567 422396 428292 435578 444474 454004 463473 473590 485124 497263 508422 517965 525906 531468 533417
60554 533417 531740 527831 522870 517013 510303 503515 497702 493472 490894 489739 489718 490822 493463 497973 504028
60539 504028 510943 518446 526917 537002 549308 564296 582001 601822 622742 643681 663489 680952
60527 680952 695127 705531 711830 713702 711279 705347 696785 686160 674252 662494 652190 643390 635129
60514 635129 626771 618694 611639 605891 601342 598113 596687 597314 599426 602046 604957 609167 615905 625571
60500 625571 638198 654561 675850 702271 732934 767377 806232 849934 897536 947356 998120
60489 998120 1048856 1098198 1144382 1185597 1219917 1245360 1260588 1265318 1259824 1244417 1219589 1186016
60477 1186016 1144157 1094614 1039320 981618 924483 869263 816601 767759 724065 685622 651571
60466 651571 621435 595432 573650 555600 540443 527119 514557 502357 491100 481497 473502 466635
60454 466635 460721 455688 451027 446125 440940 435804 430878 426323 422676 420411 419323 418821 418549 418289 417663
60439 417663 416504 415192 414109 413190 412488 412640 414030 415855 416760 416111 414084 411013 407405 404218 402247
60424 402247 401410 401251 401766 403051 404634 406093 407955 410954 414556 417284 418529 419153 420213 421834 423426
60409 423426 424360 424419 424102 424422 425858 427717 429060 429929 430938 432081 432933 433825 435698 438730 442027 444825
60393 444825 447188 449402 451492 453520 455629 457589 458993 460160 462206 465873 470655 475277 478719 480775
60379 480775 482076 483612 485935 488817 491861 495101 498633 502092 505125 508023 511220 514499 517421 520161
60365 520161 523032 525555 527117 528421 531117 535821 541393 546327 550036 552740 555135 558410 563668 570923
60351 570923 579285 588312 598426 609781 621542 632582 642160 649563 653788 654119 650688 644238 635743
60338 635743 626301 616745 607111 597086 587119 578478 571901 566771 561938 556930 552048 547682 543862 540222
60324 540222 536216 531589 526710 522314 519002 517177 517018 518055 519213 520020 521509 525142 531155 538876 548337
60309 548337 560307 574575 589449 603426 616441 629033 641125 652222 662192 671292 679728 687474
60297 687474 694020 698148 698536 694890 688028 678745 667121 653077 636989 619584 601828 585105 570788
60284 570788 559300 549978 542014 535047 528834 523059 517686 512919 508652 504465 500261 496350 492922 490028
60270 490028 487968 486869 485971 484312 482153 480649 479938 478740 476290 473523 471709 470886 470402 470129 470297 470727
60254 470727 471075 471500 472436 473987 475959 478136 480151 481505 482118 482530 483298 484526 486061 487559 488261 487451
60238 487451 485417 483302 481757 480461 479159 478276 478150 478582 479603 481745 485006 488419 491357 494381 498075
60223 498075 501865 504924 507535 510642 514560 519072 524264 530245 536381 541779 546400 550961 555925 561358
60209 561358 567525 574747 582638 590246 597031 603242 609288 615219 620792 625715 629865 633557 637403 641604
60195 641604 645547 648373 649703 649549 647909 644848 640701 635811 630317 624460 618747 613450 608366 603385
60181 603385 598912 595245 591987 588602 585231 582373 580046 577799 575416 573152 571459 570826 571588 573358 574867
60166 574867 574918 573513 571678 570260 569252 568195 566902 565762 565412 566042 567055 567675 567843 568102 568608 568920
60150 568920 568918 569218 570290 571794 573298 575044 577460 580371 583345 586424 589870 593531 597088 600737 605007
60135 605007 610045 615589 621549 628038 634882 641569 647763 653485 658719 663066 665976 667301 667630 667927 668661
60120 668661 669388 669454 668917 668388 668145 668001 667945 668113 668131 667342 665864 664593 663817 662669 660377 657314 654284 651422
60102 651422 648298 644579 640124 635010 629892 625737 622745 620105 617230 614623 613072 612642 612927 613608 614316
60087 614316 614658 614891 615808 617412 618566 618632 618541 619396 620817 621605 621351 620384 618674 615849 611849 606725 600246
60070 600246 592603 584949 578286 572281 566137 560066 554786 549991 544636 538610 532962 528464 524957 522054
60056 522054 519571 517240 514876 512869 511838 511824 512476 513791 515945 518632 521432 524608 528707 533545 538414
60041 538414 543101 547843 552472 556543 560103 563350 565707 566337 565564 564649 564037 562860 560316 556550 551941
60026 551941 546550 540644 534834 529224 523134 516069 508342 500414 492248 483710 475112 467032 459963 454302
60012 454302 450210 447269 444761 442418 440526 439224 438249 437447 437014 437060 437361 437705 438087 438537 439131 440139 441749
59995 441749 443700 445600 447479 449545 451586 453276 454901 457068 459695 462078 463984 465883 467972 469715
59981 469715 470619 470809 470556 469831 468632 467195 465543 463310 460324 457019 454015 451629 449946 448983 448530 448183
59965 448183 447800 447762 448623 450656 453731 457431 461281 465085 468967 472850 476085 477927 478283 477663 476589 475445
59949 475445 474678 474555 474719 474515 473822 473172 472953 472807 471863 469408 465453 460873 456877 454086 452310 451236
59933 451236 450935 451485 452674 454524 457492 461652 466212 470539 475065 480328 485560 489253 490922 491368 491315
59918 491315 490718 489445 487739 485828 483760 481830 480677 480802 482342 485177 488895 492866 496762 500764 504841
59903 504841 508339 510824 512768 514678 516148 516641 516643 516977 517428 517263 516779 517080 518509 520555 523209 527056
59887 527056 531968 536977 541672 546559 551870 557111 562055 567101 572475 578057 584134 591109 598259 604043
59873 604043 607979 611057 613893 615809 616315 616192 616215 615819 614056 611146 608147 605670 603667 602074 600865
59858 600865 599793 598649 597608 596922 596559 596409 596507 596901 597676 599203 601928 605822 610635 616613 624180 632697
59842 632697 640310 645359 647407 646880 644593 641847 640100 639957 640978 642618 644721 646976 648715 649525 649278
59827 649278 647445 643374 637606 631881 627259 623027 618029 612254 606494 601111 595816 590253 584289 578158
59813 578158 572605 568398 565420 562819 560173 557711 555271 552054 547896 543820 540718 538303 536015 534127
59799 534127 533114 532515 531233 528705 525234 521493 518125 515425 513067 510488 507803 505786 504745 503999 502799
59784 502799 501144 499417 497837 496567 495757 495241 494748 494525 495049 496123 497125 498230 500239 503017 505364
59769 505364 506875 508634 511540 515227 519325 524387 530614 536880 542190 547032 552128 556860 560321 563132
59755 563132 566800 571784 577456 583489 589989 596597 602784 608843 615469 622503 629099 635008 640714 646321
59741 646321 651269 655168 658130 660324 661904 663285 664786 666034 666325 665499 663960 662101 660286 659053 658676
59726 658676 658715 658627 658549 658856 659267 659172 658617 658270 658471 658976 659470 659742 659524 658761 657928 657522 657374 656958 656173 655320
59706 655320 654586 654067 654025 654490 654868 654585 653935 653662 653847 653810 653097 651973 650985 650460 650395 650496 650379 649951 649341
59687 649341 648307 646211 642954 639480 636836 635082 633497 631400 628361 624193 619325 614660 610431 605705
59673 605705 599713 593168 587397 582588 577828 572642 567525 563035 559264 556282 554298 553148 552201 551032
59659 551032 549827 549028 548893 549471 550719 552543 554876 557668 560814 564224 567872 571463 574175 575315 575240
59644 575240 574927 574540 573211 570421 566661 562357 557218 551320 545888 542081 539672 537808 536437 536086 536767
59629 536767 538022 539580 541067 541471 539894 536667 532934 529359 525825 522075 517901 513118 508072 503856
59615 503856 501224 499579 497717 495316 493015 491440 490861 491450 493074 495105 497093 499361 502249 505172 507180
59600 507180 508117 508600 509226 510411 512451 514979 516906 517759 518570 520565 523502 526260 528491 530526 532083
59585 532083 532426 531670 530705 529797 528337 526015 523263 520465 517606 514765 512165 509714 507206 504923 503286
59570 503286 502072 500775 499606 499281 499900 500837 501663 502422 503136 503902 505341 508002 511278 513722 514551 514186
59554 514186 513391 512652 512344 512686 513407 514076 514752 515793 517240 518991 521386 524854 529182 533897 539314 546494
59538 546494 556267 568914 584665 603675 625261 647350 666530 678796 681482 675491 665124 654895
59526 654895 646778 640790 636891 635023 634243 633524 633098 633647 634564 634378 632534 629338 624515 617476 608844 600118
59510 600118 591729 582902 573561 564852 557556 551391 546145 542075 538780 535037 530309 525418 521342 518376
59496 518376 516679 516444 517111 517451 516936 516155 515579 514845 513595 512197 511320 511531 513329 516669 520426 523371
59480 523371 525755 528892 533140 537469 541115 544372 547594 550755 554300 559087 564895 570239 574229 577546
59466 577546 581060 584584 587548 589843 591421 592090 592354 593500 596188 599824 603857 608760 615016 622066 629036
59451 629036 635778 642440 648630 653787 657913 661339 664074 665843 666372 665351 662525 658034 652264 645316
59437 645316 637262 628938 621708 616242 612237 609388 607823 607406 607545 608060 609537 612546 617140 623251 630891
59422 630891 639868 650046 661930 676187 692585 710269 729065 749594 772126 796290 821787 848262
59410 848262 874494 898710 919422 934560 940373 933541 915218 891370 868437 849888 837072 831013
59398 831013 831895 838183 847531 857509 864549 863803 851987 830154 802795 774705 749099 727406 709405
59385 709405 693939 680374 669122 660436 653590 647854 643399 640565 639070 638562 639048 640056 640302 639038
59371 639038 636993 635322 634407 634318 635487 638102 641608 645551 650141 655371 660533 665367 670785 677675 685907
59356 685907 695241 706126 718678 731902 745080 759029 774805 791922 809043 825800 842744 859995
59344 859995 876991 893150 907812 920021 929257 935922 940220 941153 937633 930080 919834 907386 892279
59331 892279 874498 854952 834625 814059 793615 773643 754461 736542 720411 705999 692519
59320 692519 679415 666970 655674 645617 636921 629951 624495 619435 613888 608137 602913 598434 594718
59307 594718 592100 590815 590718 591947 595117 600301 606688 613945 623036 634935 649268 664856 680557 694602
59293 694602 704037 706217 700683 689006 673447 656443 640461 627134 616735 609014 603968 601375 600571
59280 600571 601487 604982 611315 619205 627357 636024 646077 657463 669739 683198 698124 713561 728140
59267 728140 741659 754660 766905 777480 786055 792951 798155 801218 801881 800116 795945 789896 783071
59254 783071 776030 768247 759376 750278 742009 734678 728208 723347 720809 720208 720846 722773 725967 729396 732158
59239 732158 734758 737969 741232 743580 745377 747513 749412 749431 746893 742350 736189 728471 719908 711510 703277
59224 703277 694378 684491 673897 662596 650524 638454 627563 618291 610576 604710 600840 598003 594947
59211 594947 591684 589162 587766 587163 587129 587319 586740 584744 582171 580335 579282 578325 577724 578413 580446 583143
59195 583143 586383 590269 593847 595756 596042 595906 595787 595134 593897 592771 591981 591233 590829 591473 592980 594454
59179 594454 595692 597157 598771 600084 601526 603999 607298 610344 612978 616086 619937 623826 627513 631606
59165 631606 636324 641118 645656 649985 653712 656208 657571 658132 657234 653975 649018 643993 639051 632692 624267
59150 624267 614994 606119 597683 589605 582469 576468 570788 564723 558478 552467 546794 541736 537708 534454
59136 534454 531215 527902 525090 522852 520719 518842 517950 518016 518272 518714 520287 523349 527312 532003 537966
59121 537966 545052 552146 558806 565861 573887 582424 591266 601193 612670 624905 636897 648426 659439
59108 659439 669492 678491 687120 695875 704378 712062 718772 724293 728156 730294 731100 730527 727949 723251
59094 723251 717241 710715 703984 697528 692189 688345 685675 683932 683108 682726 681905 680323 678282 675702 671965
59079 671965 666758 660106 651752 641756 631663 623595 617908 613070 608074 603492 599799 596241 592134 587960
59065 587960 584366 581143 577945 575073 572788 570699 568428 566137 563970 561765 559662 558161 557221 556165
59051 556165 554781 553562 552612 551395 549912 549042 549242 549944 550629 551408 552077 551732 550019 547885 546446 545883
59035 545883 545940 546681 548216 550324 552858 555965 559721 564136 569562 576396 584379 593047 602734 614149 627001
59020 627001 640175 653148 665984 677972 687733 694811 699733 702320 701492 697196 691064 684661 678391
59007 678391 672553 667988 665034 663103 662007 662492 664958 668787 673532 679555 686880 694491 701384 707314
58993 707314 712143 715537 717807 719896 722093 723753 724582 724961 724750 723070 719755 715761 711798 707826 704212
58978 704212 701968 701434 702121 704171 708473 715058 723012 732372 744257 758533 773208 786917 800256
58965 800256 813847 826975 839148 851222 863715 875554 885644 894208 901372 905861 906417 903267 897126
58952 897126 887963 875848 861709 846168 828881 810042 791166 773340 756067 739040 723662 711461
58940 711461 702158 694473 687757 681784 676216 671385 668403 667396 666858 665784 664999 665304 665898 666001 666404 667751
58924 667751 668679 667478 664522 661393 658638 656025 653992 653010 652266 650688 648713 647592 647522 647818 648344 649444
58908 649444 651069 653218 656707 662387 670084 679188 689574 701146 713351 725993 739544 753914 768113
58895 768113 781984 796837 813288 830001 845855 861922 879777 899214 919209 939795 961248
58884 961248 982491 1002006 1019378 1034431 1045962 1053074 1056700 1058038 1056404 1050354 1039975 1026351
58872 1026351 1009755 990375 970024 951124 934427 919363 905956 894657 884938 875927 867942 861694
58860 861694 856427 850510 843442 835745 827455 818305 808869 799837 790659 780490 770049 760958 753549 746827
58846 746827 740094 733193 725608 716864 707494 698285 689016 679132 669048 659494 650317 641276 633216 627015
58832 627015 622101 617466 613297 610185 607711 605445 604312 605137 606765 607566 607995 609615 612390 615085 617777
58817 617777 621679 626834 632041 636831 641539 645716 648471 650264 652429 655017 656899 657851 658733 659712 659978
58802 659978 659134 657345 654388 650054 645130 640431 635326 628857 621649 614927 608310 600732 593001 587145
58788 587145 583463 580421 577429 575548 575344 576136 577560 580009 583247 586300 588895 591523 594122 596212 598112
58773 598112 600341 602050 601793 599601 596536 592518 586644 579471 572877 567560 562590 557547 553192 549918
58759 549918 547329 545543 545257 546460 548558 551538 555363 558658 560027 560357 561760 564424 566677 568030 569785
58744 569785 572546 575548 578707 582995 588329 593310 597660 602830 609580 616865 623753 630617 637813 644932
58730 644932 651972 659611 667767 675406 682141 688481 694245 698479 701283 704017 707268 710311 712973 716346
58716 716346 721167 727063 733818 741787 750551 758633 765015 769719 772720 773585 772292 769046 763343 754616
58702 754616 743550 731149 716806 699231 679093 658760 639479 620888 603267 587997 575409
58691 575409 564298 553950 544803 536896 529655 523409 519031 515790 511684 506287 501247 497642 494897 492711
58677 492711 491819 492218 492623 492378 492242 492888 494385 497304 502413 509086 516064 523940 534672 548378 562943
58662 562943 577093 591324 605212 616369 623027 625537 624588 620143 612963 604931 596884 588054 578441
58649 578441 569675 562690 556588 550698 545772 542250 539249 536196 533802 532694 532715 534028 537012 540634 542972
58634 542972 543904 545273 547913 550611 552419 553732 554535 553988 552409 551345 551010 549877 547375 544549 541471
58619 541471 536683 530141 524167 520467 518645 518458 520875 525756 531057 535556 540007 544586 547775 548941
58605 548941 549457 550028 549531 547757 546619 547086 547485 546369 544594 543032 540818 537614 535127 534523 534583 534245
58589 534245 534750 537446 541627 546452 552926 562078 573037 584647 597156 610628 623621 635079 645770
58576 645770 656307 665639 673015 679584 686571 693801 701376 710753 722659 736013 750343 767172 787563
58563 787563 810521 835238 862566 892574 922860 950961 976296 998290 1015046 1025656 1031477 1033416
58551 1033416 1030341 1021992 1010917 999602 988070 976216 965890 958263 951404 942774 932110 919875
58539 919875 905226 887736 868914 849797 829212 806618 784418 765190 748784 734319 722654
58528 722654 714394 707751 700938 694725 690237 686424 682158 678652 677179 676431 674685 672519 670811 668260
58514 668260 663681 658780 655808 654193 652132 649688 647659 645267 641738 638505 637171 636932 636403 636082 636547
58499 636547 636262 633955 631256 630177 629854 628525 626875 626580 627340 628229 630217 634523 640097 645482 651467
58484 651467 659249 667868 676251 685884 698580 713417 728704 744941 762780 780005 793755 804033
58472 804033 811960 816359 815290 809335 800345 788619 774367 760104 748396 738815 730097 723411 720398
58459 720398 719967 720388 722646 728315 735993 743536 752091 764141 778853 792774 803875 811655 814833 812437
58445 812437 806024 797757 787633 775319 762818 752272 743143 734585 728268 725507 724038 721378 719082
58432 719082 719794 722458 724516 726627 730909 736588 741772 747602 756174 766098 774490 781561 788904 795108
58418 795108 797586 796947 795077 790883 782648 772619 764266 756826 747671 738179 731728 727411 721444 713729
58404 713729 707426 702947 697976 692808 690207 690271 690587 691058 693691 698043 701723 704857 709343 714447 717875
58389 717875 720313 724065 728152 729801 729728 730812 732639 732732 732116 734045 738029 740829 742652 746688 753152
58374 753152 759487 765832 774421 784150 791694 797636 805608 815714 824739 832498 841828 852540 861578 869181
58360 869181 878751 890521 901321 910604 920624 930634 937108 939953 942513 945310 945800 944250 943699 944120
58346 944120 942905 941098 942702 947783 952700 957134 964317 974400 984436 994926 1009320 1026869 1043081
58333 1043081 1057397 1073185 1090035 1103743 1114285 1125889 1138477 1147085 1150775 1154116 1158569 1160413
58321 1160413 1158822 1158036 1159783 1161180 1161874 1165647 1173108 1180272 1186050 1193711 1203523 1211757 1218459 1228267
58307 1228267 1241811 1254307 1264323 1275831 1289932 1302844 1313882 1326967 1342369 1355466 1365675
58296 1365675 1377897 1393162 1406730 1417612 1430880 1448146 1464934 1479943 1497693 1519316 1539948
58285 1539948 1557987 1577766 1600537 1622205 1642398 1666036 1693504 1719366 1743245 1771376 1804740
58274 1804740 1836713 1865413 1896980 1933334 1968516 2000891 2036997 2079053 2120709 2159702 2202576
58263 2202576 2252077 2302099 2350153 2402449 2461343 2520147 2575739 2633637 2695174 2752841 2804238
58252 2804238 2857447 2916584 2975583 3032368 3094986 3167001 3241098 3314126 3393908 3484019 3576877
58241 3576877 3669517 3770777 3884911 4003782 4123399 4251993 4393325 4538972 4686182 4846072
58231 4846072 5024801 5214340 5411285 5625994 5863173 6113154 6373039 6655995 6968565
58222 6968565 7300451 7648562 8028341 8448734 8900215 9381342 9911752 10504164 11150562
58213 11150562 11852054 12633877 13513821 14486699 15559363 16769098 18147598 19702849 21460444
58204 21460444 23486572 25847721 28591803 31799085 35607681 40159131 45571747 52005649
58196 52005649 59700269 68913131 79897406 92999436 108714117 127605116 150280110
58189 150280110 177480574 209916196 247620859 289324226 332432814 373373369 407685929
58182 407685929 430191683 436264311 424083682 396016963 357590307 314835901 272227386
58175 272227386 232333583 196463612 165200826 138604873 116380595 98068871 83131301
58168 83131301 70979039 61059254 52934386 46257817 40720858 36070287 32138643 28806730
58160 28806730 25956388 23487730 21347169 19498762 17888874 16465957 15208291 14102132
58152 14102132 13114365 12212939 11392552 10654586 9981436 9354329 8777147 8258953 7789755
58143 7789755 7355038 6957636 6604120 6284698 5986488 5712372 5467762 5242269 5022646
58134 5022646 4811108 4613790 4423896 4233308 4048920 3880720 3724691 3573067 3430438
58125 3430438 3303880 3187385 3071551 2959427 2858196 2764190 2670402 2580267 2500159 2426267
58115 2426267 2352147 2281423 2220135 2164073 2106245 2049514 1999652 1953119 1903932 1855664 1814558
58104 1814558 1777208 1736845 1695572 1658837 1623807 1584834 1544947 1510528 1479653 1446639 1413346
58093 1413346 1385225 1360613 1334364 1308026 1286421 1268003 1248139 1228195 1212263 1198651 1183328
58082 1183328 1167840 1155222 1142199 1124126 1103572 1085435 1067723 1045971 1022709 1003500 987125
58071 987125 968685 949146 933014 919520 904773 889959 878945 870270 859724 848452 840475 834485
58059 834485 826101 816084 808446 802364 793723 782959 773898 766363 757162 746923 738952 732718 725182
58046 725182 717108 711536 707565 702096 696089 692540 689880 683959 675213 667453 660860 652568 642981 635256
58032 635256 629477 623243 616987 612878 609604 603978 596602 590360 584589 576507 567208 560379 556026 551118
58018 551118 545523 541715 539471 536357 532743 531003 530476 528359 524782 521988 519493 515124 509862 506493
58004 506493 504458 501135 497127 495114 494561 492831 490443 489763 489500 486221 480626 476625 474563 471122 465803
57989 465803 462034 461646 463466 467443 474863 484086 491073 494817 497795 500769 501643 499759 496800 493116 487440
57974 487440 480577 475191 471656 468113 464660 463388 464193 464679 464301 464591 465323 464632 462945 462646 463701 463736
57958 463736 462517 462270 463334 463601 462488 461495 460530 457738 453328 449714 447497 445031 442252 441174 442271
57943 442271 443936 445770 448862 452788 456007 459294 465070 473240 481377 488957 497632 507365 516249 524191
57929 524191 532701 540855 545579 546224 544874 541850 535180 524991 514227 504269 493799 482653 472726
57916 472726 464206 454933 444562 435638 429539 424922 420992 418624 417426 415513 413182 413078 415655 418055
57902 418055 418593 418672 419120 418376 415801 413339 412305 411574 410314 409543 409778 410115 410720 413246 417681 421747 424404
57885 424404 427004 430176 432810 434984 438548 443700 448282 451491 454867 458461 459669 457464 454399 452702
57871 452702 451516 449686 448128 447515 446515 444315 442378 441939 442155 442200 442714 443791 444091 443417 443657 445777
57855 445777 448384 450506 453169 456873 460231 462541 465042 468186 470391 470901 471124 471635 470752 467819 465076
57840 465076 464268 464024 462578 460675 459717 459391 459118 459739 461739 463774 464792 465724 467465 469219 470391 471967
57824 471967 474384 476178 476466 476661 477973 479295 479320 478704 478349 477564 475718 473742 472167 469555 464650 458255
57808 458255 451268 442782 432035 420423 409741 400054 390935 383079 376991 371752 366746 362890 360654
57795 360654 358687 356009 353696 352771 352347 351614 351705 353656 356372 358520 360699 363798 366929 369037 371005
57780 371005 374203 378378 382817 388097 394830 402144 409186 416619 424795 432025 436636 439297 441453 442863
57766 442863 442667 441459 440259 438649 435859 432554 429735 427065 424039 421555 420549 420259 419614 419143 419815
57751 419815 421215 422446 423419 423563 420869 414331 406062 398987 393661 389228 386062 385078 385525 385798 385753 386198
57735 386198 386848 386836 386607 387322 388881 390196 390866 391036 390367 388719 387148 386762 387267 387971 389229 391434 393676
57718 393676 394960 395856 397382 399200 400452 401383 402603 403710 404166 404552 405496 406401 406712 407223 408592 409849
57702 409849 410108 410549 412840 416681 420691 424635 428933 433123 436636 439970 443181 444374 441766 436272 430044
57687 430044 423535 416092 408343 401653 395971 390461 385573 382396 380685 379763 380686 385292 393587 404231
57673 404231 417163 433736 454707 480094 510636 547446 590676 640176 696591 759349 823700
57662 823700 881335 923573 942958 934125 896899 838591 770501 701478 635967 576764 526285 484993
57650 484993 451423 424501 403929 388236 374783 362230 351181 342167 334737 328742 324575 321810
57638 321810 319246 316583 314526 313202 312086 311473 312292 314329 316261 317572 318882 320310 321141 321236 321245 321282 320759
57621 320759 319593 318218 316552 314334 312268 311315 311081 310374 309090 307971 306890 305129 303066 301781 301173
57606 301173 300360 299679 300287 301801 302359 301191 299305 297527 295744 294251 293896 294476 294647 293810 292599 291376
57590 291376 289773 287827 285985 283934 280969 277510 274632 272174 269044 265288 261980 259185 256031 252868
57576 252868 251180 251099 251033 250180 249341 248790 247393 244578 241362 238705 236457 234575 233704 233879 234103 233839 233544
57559 233544 233337 232607 231356 230411 229908 229073 227822 226994 226636 225760 224243 223278 223439 223838 223694 223231 222644 221808
57541 221808 221352 222307 224279 225745 226536 228058 230501 231918 230915 228356 225481 222231 218528 215453 213811
57526 213811 212957 212217 212256 213990 217357 222035 228183 235579 243297 251070 259784 269847 280338 290496
57512 290496 300719 311209 320965 329008 335405 340285 343125 343958 344039 344353 344480 343658 341825 338962 334752
57497 334752 329731 325464 322602 319864 315840 310725 305518 300722 296617 293658 291648 289586 287101 284968
57483 284968 283559 282053 279961 278071 276995 276019 274401 272653 271546 270932 270478 270513 271147 271547 270952 269558
57467 269558 267750 265473 262968 261027 259873 258996 258606 259797 262513 264908 265703 265764 266379 267389 268169 269017
57451 269017 270293 271361 271657 271801 272525 273531 274392 275465 276917 278021 278438 278973 279962 280254 279045 277457
57435 277457 277006 277566 278174 278687 279370 279896 280102 280679 281913 282788 282597 282248 282638 282986 282312 281395 281548 282420
57417 282420 282755 282507 282528 282882 283138 283656 284921 286165 286320 285877 286263 287719 289269 290418 291493 292604 293522
57400 293522 294328 295048 295152 294516 294325 295764 298287 300366 301481 302195 302824 303301 303932 305062 306308 307133 307757
57383 307757 308582 309336 309718 310222 311346 312702 313926 315566 317959 320163 321210 321516 321873 322062 321789 321821 322675
57366 322675 323350 323095 323304 325555 328711 330236 329807 329298 329563 329635 329120 329141 330464 332452 334299 335860 337100
57349 337100 338057 339362 341534 343872 345364 346352 347827 349505 350368 350784 352132 354407 356229 357344 359055
57334 359055 361787 364181 365293 365986 367391 369375 371222 372592 373211 372765 371668 370919 370813 370792 370750 371324 372615
57317 372615 373907 374974 376488 378702 380896 382597 384242 386149 387831 388879 389620 390488 391519 392761 394362
57302 394362 395970 396867 396968 396933 397189 397651 398423 399781 401248 401655 400430 398089 395325 392357 389247 386081
57286 386081 382770 379372 376539 374895 374146 373589 373209 373398 374010 374834 376601 380156 384850 389103 392446 395745
57270 395745 399576 403863 408982 415603 423323 431003 438599 447123 456561 465474 473024 479861 486540 492512
57256 492512 497241 500943 503691 505143 505667 506515 508294 510450 512643 515333 518600 521753 524630 527930 531716
57241 531716 534984 537371 539890 543273 546944 550419 554305 558959 563445 566936 570052 573733 577729 581275
57227 581275 584497 588115 592359 596949 601567 605694 608771 611182 614359 619219 625187 631231 637061 642774
57213 642774 648227 653479 659030 665032 671008 676827 683031 689714 696144 702102 708540 716123 724139 731662
57199 731662 738830 746113 753269 759987 766766 774229 782188 790196 798307 806565 814489 821816 829046 836601
57185 836601 844197 851721 859809 868810 878120 887324 897094 908060 919703 931320 943237 956132 969976
57172 969976 984626 1000594 1018143 1036378 1054285 1072022 1090241 1108953 1128079 1148244 1169852
57161 1169852 1192098 1214090 1236276 1259645 1284279 1309842 1336678 1365075 1394210 1423364 1453575
57150 1453575 1486503 1522086 1558810 1595870 1633610 1672284 1712064 1754003 1799225 1847178 1896276
57139 1896276 1946328 1998865 2055048 2114682 2177321 2242812 2310689 2380573 2453378 2530677 2612760
57128 2612760 2698911 2789852 2888197 2996022 3113510 3240445 3377331 3524299 3680447 3845133
57118 3845133 4018691 4201195 4391878 4590607 4798767 5018082 5249945 5496494 5760690
57109 5760690 6044501 6348603 6674985 7028463 7415064 7841068 8315021 8848837 9455834
57100 9455834 10150318 10951360 11885156 12982014 14273661 15795551 17587749 19688468 22127392
57091 22127392 24926742 28103015 31660165 35582320 39837292 44380934 49149296 54057312
57083 54057312 59030840 64043817 69089443 74075973 78747134 82729346 85677123 87385681
57075 87385681 87791975 86910578 84789864 81511293 77200953 72033165 66228457 60042424
57067 60042424 53737247 47546506 41654806 36195514 31252857 26863609 23025649 19712420
57059 19712420 16882538 14482923 12454598 10742283 9298265 8078603 7041629 6152832
57051 6152832 5387855 4728637 4159190 3666195 3240054 2872541 2554944 2279693 2041531
57042 2041531 1835547 1655969 1498100 1359479 1237912 1130336 1034761 951306 880038 819679
57032 819679 769604 730976 704508 689139 684567 693145 717174 755651 805246 862664 923240 977418
57020 977418 1010908 1009741 966543 884316 775637 656954 541472 436234 344226 266571 202095
57009 202095 147478 100021 59374 25655 -2571 -27137 -48486 -66500 -81895 -95372 -106535 -115098
56997 -115098 -122232 -129318 -136117 -141339 -144214 -144467 -141699 -135901 -127772 -117560 -104469 -88000 -68684
56984 -68684 -46644 -20907 8398 38236 64173 82859 92258 91196 80438 63108 42496 20193
56971 -2530 -23018 -38744 -49707 -57670 -63624 -67344 -68493 -66584 -60569 -49895 -35370 -17750 3633
56957 29519 58902 89953 121483 151624 175970 189167 188334 173890 148101 114638 78690 45111
56945 45111 16117 -8062 -26856 -39235 -45451 -47051 -45156 -40000 -31784 -20423 -4528 17891 47530
56932 47530 83417 124094 167933 212422 253915 287679 307842 308925 289468 253898 209587 162406
56920 162406 115802 72544 34976 3781 -21807 -42619 -59379 -73276 -85150 -94580 -101144 -106012
56908 -106012 -110938 -116252 -121250 -125784 -129887 -132698 -133592 -133818 -135192 -137649 -139814 -141318 -142584 -142891 -140803
56893 -140803 -136239 -130061 -121768 -109648 -93089 -72701 -48203 -18363 16597 54259 91682 126125
56881 126125 154122 172124 178880 175970 165909 151147 134783 120136 108978 101456 97879 99107
56869 99107 105133 114945 128196 145667 168007 195479 229185 271080 322383 382802 450915 523635
56857 523635 595081 657244 702083 722921 715705 681571 627984 565285 501701 442426 391689 352488
56845 352488 324568 305745 295793 296757 309346 331855 363294 405085 458896 525296 605298 700379
56833 700379 809151 925558 1041060 1146203 1228888 1274449 1271615 1219477 1128202 1013727 891904
56822 891904 775185 671455 584393 514749 461395 422132 395076 379699 375975 382918 399258
56811 399258 425261 462406 511401 571826 643110 723467 807440 885975 948992 986748 990402 955536
56799 955536 886813 796998 699974 605445 519372 445648 385510 337583 300367 273517 256094
56788 256094 245767 241054 242678 251641 267694 290675 321333 359310 401782 445179 486444 521290
56776 521290 543137 545979 527939 491513 441798 385417 329189 277675 232070 191944 157047 127152
56764 127152 101780 80956 64948 52687 41985 31941 23521 17239 12079 7358 3594 709 -2542
56750 -6305 -8885 -9478 -9591 -10539 -11614 -12116 -13030 -15043 -16849 -17240 -17065 -17411 -17615 -16881 -16200 -16698 -17620 -17831
56732 -17831 -17849 -18530 -19171 -18874 -18472 -19136 -20238 -20484 -20010 -19567 -18827 -17359 -16168 -16311 -16892 -16230 -14143 -11490
56714 -11490 -8471 -5025 -1868 504 2846 5618 7671 8131 8337 10046 12816 15034 16451 17765 18793
56699 18793 19120 19653 21473 23865 25401 26209 27343 28717 29614 30439 31942 33333 33170 31705 30571 30530
56683 30530 31164 32220 33630 34733 34998 34983 35279 35337 34737 34487 35401 36256 35413 33312 31475 30133 28861
56666 28861 28539 30387 33719 36857 39634 42881 46157 48308 49753 51870 54486 56338 57731 60397 64676
56651 64676 69098 72871 76712 80936 84605 86933 88081 88375 88072 87827 88061 88093 87169 85929 85437 85303 84254
56634 84254 82074 79378 76109 71976 67783 64451 61299 57187 52853 50030 48663 47089 44759 42643
56620 42643 41100 39419 37507 36119 35275 34309 33501 33874 35297 36480 36949 37386 38001 38217 38064 38348 39351
56603 39351 40685 42258 44027 45106 44681 43513 43054 43383 43584 43707 44621 46251 47712 48951 50543 52196
56587 52196 53170 53874 55345 57375 58888 59804 60813 61692 61654 61008 60669 60416 59482 58485 58862 60668 62780
56570 62780 64793 66873 68352 68615 68872 70880 74353 77806 81377 86316 92195 97403 102303 109131 118475
56555 118475 128249 136350 142078 144984 144890 143358 142744 143415 143900 143754 143920 144338 143834 142573 142020 142116 141054
56538 141054 138285 135202 132419 128951 124714 121271 119300 117630 115524 113681 112253 110219 107480 105428
56524 105428 104574 103765 102449 101621 101824 102307 102898 104541 107087 108654 108068 106176 104033 101715 99509 98218
56508 98218 97535 96033 93447 91146 89838 88810 87907 88092 89374 90306 90271 90290 90962 91633 92158 93362 95112
56491 95112 96044 95826 95637 95881 95663 95041 95416 96986 98199 98445 98932 100113 100700 100143 99735 100240 100661 100306
56473 100306 99859 99601 98916 98300 99354 101899 103693 104005 104728 106768 108177 107463 106132 106167 107253 108273
56457 108273 109417 110984 111987 111668 110839 110388 110126 110158 111402 113554 114573 113517 111988 111546 111660 111402
56441 111402 111150 111343 111455 111395 111981 113055 113219 112403 112393 113807 114992 115063 115447 117059 118567 118966 119303 120292
56423 120292 120746 120107 119999 121460 123132 124021 125557 128818 132107 133493 133610 133826 133761 132836 132252 133117 134369
56406 134369 134660 134622 135370 136471 137300 138639 141075 143572 145349 147370 150280 152842 154190 155576 158019
56391 158019 160268 161027 161223 162132 163221 163727 164342 165342 165080 162251 157655 151853 143426 131765 119518
56376 119518 109952 103702 99985 98817 99842 101239 102153 104171 108202 112172 114209 115854 119416 124137
56362 124137 127710 129765 131284 132324 132862 134194 137048 139940 141590 143091 145537 147726 148588 149591 152090
56347 152090 154547 155218 155427 157218 159821 161495 162910 165489 168252 169531 170224 172150 174652 175914 176275
56332 176275 177318 179029 180727 183308 187732 192704 196572 200008 204173 207986 210064 211570 214178 216968
56318 216968 218345 219198 221042 222871 223156 223185 224997 227630 228892 229318 230883 233219 234605 235407 237179 239604
56302 239604 241646 244312 248999 254531 259177 264026 270858 278285 283721 287718 292532 297798 301588 304590
56288 304590 309209 315476 321651 327935 335819 344651 352604 360172 369079 378646 386943 394612 403801 414292
56274 414292 424372 434584 446788 460462 473815 487647 504180 522975 541956 561590 584031
56263 584031 608943 634321 660793 691093 725928 764369 807588 857948 914973 976486 1043343
56252 1043343 1118966 1204579 1299042 1402927 1518505 1645774 1782495 1927861 2082234 2243547
56242 2243547 2407896 2573259 2738723 2900470 3052561 3191219 3314368 3417676 3495505 3545472
56232 3545472 3567967 3561886 3525507 3461252 3374961 3270518 3149481 3015533 2874353 2728972
56222 2728972 2579833 2429475 2282519 2140874 2003556 1871499 1747950 1633762 1526811
56213 1526811 1426551 1334831 1251806 1175306 1104649 1040985 983668 930489 881612 839059 802241
56202 802241 768226 736331 708103 682920 658252 634254 613494 596106 579844 564807 553227
56191 553227 544577 535834 526729 519765 514910 509366 502841 497879 494685 490747 486003 483151 482399 481078
56177 481078 478869 478211 479078 478665 476798 476349 477805 478708 478934 480987 484646 486979 488213 491774 497790 502538
56161 502538 505253 509528 516897 524908 532660 542334 553992 564870 575149 588610 606201 624744 643347
56148 643347 665134 691360 719871 750898 788376 834032 886130 945435 1016248 1099973 1193700
56137 1193700 1296360 1409637 1531031 1652480 1767674 1874658 1970194 2049080 2111409 2163783
56127 2163783 2211009 2252884 2290460 2327609 2363489 2390634 2403749 2404304 2394398 2373241 2342209 2305864
56115 2305864 2264562 2212540 2146099 2067093 1976267 1871120 1753762 1633472 1517849 1408166
56105 1408166 1306167 1217470 1144357 1082572 1029185 986595 955225 929783 906805 888735 876655
56094 876655 866323 855391 847231 843539 840410 835749 833133 834338 835603 835345 837808 844794 851594 855481
56080 855481 860363 868639 876591 882394 890369 902487 913982 922311 932010 945683 958915 969333 981771
56067 981771 998766 1014959 1026929 1039642 1056854 1074045 1087399 1100915 1117848 1133805 1145254
56056 1145254 1156292 1170097 1182309 1189778 1197254 1208474 1219473 1227610 1238058 1254170 1270734 1284143
56044 1284143 1299737 1321425 1343816 1362597 1382920 1409141 1436069 1458987 1482608 1511433 1541057
56033 1541057 1567774 1596725 1631578 1666405 1696902 1729186 1768206 1808243 1844405 1882327 1926560
56022 1926560 1970944 2010860 2053228 2103462 2154648 2201032 2249885 2307999 2368795 2425365 2483953
56011 2483953 2551556 2622584 2690886 2762376 2842456 2924037 3001802 3084782 3180625 3281456 3380035
56000 3380035 3485126 3605310 3732806 3859755 3994774 4145979 4303754 4458786 4620905
55991 4620905 4801023 4991339 5183514 5388929 5619546 5866529 6120128 6392460 6697208
55982 6697208 7025836 7368633 7739529 8153981 8602933 9076407 9591643 10168899 10802140
55973 10802140 11484815 12240696 13095942 14046248 15088014 16255624 17589822 19099121 20796153
55964 20796153 22742952 25016411 27665638 30757715 34430983 38846873 44130389 50424590
55956 50424590 57962055 67013933 77827951 90714761 106150729 124710976 146991560
55949 146991560 173714901 205711337 243362486 285825202 330783878 374737552 413126385
55942 413126385 440347786 450787761 441226253 412923931 371320318 323469131 275383983
55935 275383983 230952268 192159603 159601678 132918169 111278117 93808635 79738151
55928 79738151 68359271 59060450 51401095 45071468 39795308 35330581 31523497 28280464
55920 28280464 25498526 23074501 20954769 19116270 17513383 16090240 14825433 13716891
55912 13716891 12737834 11849943 11044300 10328505 9687024 9092141 8540962 8045221 7596058
55903 7596058 7172898 6776141 6418434 6093560 5784705 5493955 5233960 4999101 4773132
55894 4773132 4557136 4362758 4185553 4011367 3842118 3690016 3552727 3418461 3289427
55885 3289427 3176672 3077241 2979052 2883203 2799586 2725341 2648815 2570224 2497842 2428228 2350600
55874 2350600 2267237 2190122 2120595 2050727 1981304 1920000 1864740 1806735 1747560 1696323 1652481
55863 1652481 1607873 1563072 1525419 1493227 1457882 1419559 1385502 1354897 1320620 1284009 1253001
55852 1253001 1227306 1199835 1171127 1148025 1129506 1107799 1082376 1059289 1037971 1012203 983194
55841 983194 958462 938457 916978 894038 875693 861759 846043 828310 814057 802956 789351
55830 789351 773779 762338 754970 745815 734786 727377 723202 716051 705380 696657 690163 680432 667198
55817 667198 656174 648211 638105 625015 614119 607027 600072 592820 588970 588223 586399 584125 586376
55804 586376 592979 598541 602186 608365 617608 625448 631011 637770 645104 647923 645448 641772 637086 627015
55790 627015 611578 596351 583637 570695 557553 548289 543332 538440 532467 528394 525669 519413 508566
55777 508566 497488 488449 479884 472915 471970 477603 485812 495457 509223 526322 541334 551110 555887
55764 555887 553307 539221 515635 490423 467795 445901 424404 406644 393019 379847 366542 356811
55752 356811 351326 346275 340605 337448 336874 334605 329740 326568 326688 326362 323755 321791 321607 320120 316589
55737 316589 314902 316644 318124 316787 314453 311915 306711 298914 292952 290779 288896 284783 280644 278155
55723 278155 275132 270223 265611 262372 258262 252639 248579 247662 247627 247365 249251 254244 259722 264390 270405
55708 270405 278441 285588 290259 294168 297482 297263 292934 288118 284753 280492 274122 268202 263838 258208
55694 258208 250081 242650 238022 233867 228501 224439 223724 224291 224101 224578 226966 229455 230842 232998 236935
55679 236935 240486 242528 245452 250777 256379 260553 264566 268553 269315 265267 259633 255760 253004 249896
55665 249896 247438 246401 245197 243240 242806 244885 246948 247360 248135 250745 253194 254088 255555 259112 262472
55650 262472 263508 263657 264387 263976 260985 257305 254573 250995 244899 238025 232173 226019 218451 211662 207474
55635 207474 203797 198208 192044 187584 184001 179560 175156 172336 170247 167700 165885 166067 166886 166757 166528
55620 166528 167187 167497 166557 166053 167240 168293 167335 165460 164133 162335 159024 155638 153348 150564 146051
55605 146051 141750 139604 138309 136188 134540 134958 135953 135530 134673 135058 135596 134504 132671 131818 131442 130563
55589 130563 130330 131833 133460 133527 133459 135326 138253 140349 142074 144593 146797 147299 147566 149913 153974 158203
55573 158203 163127 170030 178069 185814 194141 204559 216067 226578 236047 245260 252844 256425 255671 251725
55559 251725 244942 235727 226144 217993 210493 202223 193973 187278 181670 175886 170393 166262 162958 159613
55545 159613 157083 156343 156337 155764 155422 156457 157842 157965 157229 156810 156445 155684 155555 156634 157323 156365 155189 155327
55527 155327 155579 154384 152883 152702 152588 150396 146717 143501 140663 137081 133437 130916 128445 124237 118877
55512 118877 114020 109317 103525 97246 91639 85732 78066 69835 63410 58913 55121 52592 52804 55214
55498 55214 58048 61040 64650 67735 68903 69127 70209 71744 72365 72717 74232 76210 77138 77715 79452 81438
55482 81438 81791 81236 81930 83623 84363 84270 85195 87174 88474 88711 88847 88640 87228 85768 86271 88249 89530
55465 89530 89990 91296 93381 94376 93902 93316 92777 91163 88869 87747 88124 88535 88356 88096 87362 85278 82829
55448 82829 81987 82635 82974 82733 83198 84281 84530 83998 84284 85619 86606 86895 87445 88111 87691 86468 86064 86643
55430 86643 86802 86273 86176 86631 86722 86824 88236 90443 91521 91457 92396 95303 98900 102163 105312 108204 110325
55413 110325 112625 116756 122170 126456 128754 130300 131436 130820 128055 124476 120763 116265 111204 107129
55399 107129 104565 102452 100309 98728 97430 95251 92496 90986 91313 92234 93026 94081 94976 94525 93194
55384 93194 92915 94046 94961 95076 95633 96876 97250 96235 95364 95445 95222 93893 92574 92126 91703 90660 89868
55367 89868 89999 90302 90092 89671 88991 87272 84782 83126 82890 82848 82295 82222 83264 84405 84742 84800 85147 85440
55349 85440 85727 86932 89025 90342 89805 88373 87375 86842 86318 85902 85638 85131 84453 84195 84176 83532 82428 82077
55331 82077 82649 82902 82372 82114 82651 83038 82777 82860 83993 85400 86298 87048 87934 88259 87596 86611 85778 84590
55313 84590 82837 81475 81392 82299 83401 84185 84246 83500 82880 83553 85211 86393 86620 86789 87317 87557 87267 87023
55295 87023 86869 86209 85326 85359 86396 87249 87430 87679 88254 88466 88244 88364 88734 88277 86890 85718 85139 84312
55277 84312 83047 82156 81627 80517 79060 78658 79283 79167 77753 76673 76984 77756 78329 79589 81839 83620
55261 83620 84064 84383 85590 86618 86199 84978 84360 84646 85556 87110 88820 89408 88463 87141 86410 86042 86037 87164
55243 87164 89157 90237 89575 88503 88196 87956 86983 85965 85494 84648 82729 80833 80154 80082 79505 78670 78334
55226 78334 78330 78348 78952 80481 82058 82908 83438 83979 83798 82597 81609 81897 82867 83646 84584 86028 86971 86497 85419
55207 85419 85057 85402 85770 86248 87146 88036 88610 89499 91097 92544 93019 93052 93463 94014 94092 93730 93016 91722 90358
55188 90358 90195 91225 91589 90217 88516 88123 88535 88445 87992 87965 88097 87906 88111 89420 90829 90890 89958 89558
55170 89558 90178 91163 92197 93363 94265 94414 94132 94093 94469 95315 96942 99055 100471 100646 100504 100855 101099 100525
55152 100525 99649 99103 98394 97061 95946 95975 96685 97220 97661 98122 97754 96083 94226 93276 92536 90936 89108
55135 89108 88437 88959 89852 91153 93284 95594 97053 97834 98656 99104 98146 95838 93180 90705 88479 86972
55119 86972 86666 87234 88076 89083 89959 89754 88206 86666 86464 87235 87978 88770 90152 91787 93100 94297 95452
55102 95452 95613 94241 92531 91861 91924 91836 91951 92931 94144 94805 95629 97449 99186 99311 98502 98649 99818 100448
55084 100448 100110 99897 100279 100739 101416 103068 105240 106379 106010 105216 104811 104552 104272 104295 104514 104362 103864 103584
55066 103584 103523 103141 102371 101512 100459 99150 98404 98982 100147 100505 100023 99823 100196 100251 99467 98315 97366 96895
55048 96895 97180 98135 98898 98810 98407 98386 98256 97320 96325 96544 97662 98222 97923 97836 98479 99303 100047 101071 102222
55029 102222 102745 102468 101926 101389 100884 100992 102274 103979 104577 103606 101960 100525 99640 99620 100487 101337 101148 100111
55011 100111 99109 98228 97027 95919 95887 96978 98322 99462 100471 101084 101041 100991 101756 102914 103431 103406 103829
54994 103829 104824 105520 105464 104846 103678 102112 101253 102115 103946 105069 105100 104849 104403 103091 101243 100156 100186
54977 100186 100502 100877 102144 104622 107546 110273 112754 114689 115534 115442 115034 114312 113048 112005 112264 113475
54961 113475 114358 114843 116047 118116 119776 120188 119695 118641 117061 115727 115745 116802 117337 116729 115773 114855 113392
54944 113392 111482 110378 110667 111492 112136 112948 114136 115040 115267 115360 115762 116198 116511 117029 117805 118636 120018 122849
54926 122849 126948 131184 135317 140331 146673 153548 160238 166695 172543 177043 180449 183851 187111 188445
54912 188445 186704 182701 177711 172044 165808 159649 153846 147842 141494 135836 131858 129460 128085 127401
54898 127401 126884 125860 124531 124025 124886 126414 127769 128709 129011 128411 127547 127716 129230 131101 132675 134363
54882 134363 136518 138950 141990 146574 152711 159273 165832 173169 181219 188026 191804 192840 192418 190973
54868 190973 188243 184207 178975 172595 165746 159686 154826 150247 145229 140310 136202 132757 129691 127263
54854 127263 125504 123807 122008 120858 120667 120488 119465 118011 116870 115944 114862 113776 112791 111441 109519
54839 109519 107651 106359 105392 104598 104502 105332 106404 107194 108118 109488 110657 111030 111065 111375 111652 111309 110501 109750
54821 109750 109180 108776 108694 108763 108409 107583 106913 106480 105529 103983 103082 103662 104894 105702 106399 107817 109663 110968
54803 110968 111588 112183 113119 114290 115592 116814 117429 117202 116627 116255 116138 116311 117098 118361 119196 119058 118529
54786 118529 118423 118826 119567 120811 122479 123839 124379 124446 124526 124632 124929 126065 128206 130619 132939 135951 140342
54769 140342 145532 150663 155989 162320 169676 177363 184879 191910 197850 202010 204043 203809 201427 197701
54755 197701 193671 189331 183683 176548 169292 163219 158272 153938 150296 147326 144258 140669 137348 135145
54741 135145 133789 132778 132495 133382 134776 135696 136159 136725 137343 137696 138122 139221 141004 143253 146187 149975
54725 149975 154185 158512 163460 169491 176031 182054 187065 190839 192929 193187 192123 190054 186584 181503
54711 181503 175345 168535 161130 154012 148931 146208 143832 140236 136670 135127 135031 134089 131809 129984 129735
54696 129735 129981 129194 127240 125040 123449 122738 122371 121223 118731 115745 113627 112782 112732 113113 113711 113983 113625
54679 113625 113337 114000 115362 116443 116936 117192 117148 116385 115152 114245 113912 113698 113313 112864 112329 111612 110994 110838
54661 110838 111009 111221 111634 112375 112834 112276 110923 109717 109268 109777 111484 114220 116832 118021 117729 116895 116086
54644 116086 115190 114237 113637 113624 114134 115095 116278 117093 117190 116995 117068 117307 117371 117408 117602 117498 116611 115353 114563 114425
54624 114425 114590 114928 115350 115323 114466 113287 112467 111843 110921 110010 109804 110185 110434 110439 110739 111528 112489 113432 114296
54605 114296 114721 114512 114301 114930 116261 117344 117597 117194 116538 116039 116127 116780 117312 117226 116909 116915 117149 117449 118299
54586 118299 119975 121559 121880 121068 120220 119891 119869 119968 119976 119200 117191 114693 112917 112139 111955 112489 114118 116289
54568 116289 117848 118548 119210 120381 121791 123078 124136 124742 124648 124048 123322 122479 121483 120800 120943 121771 122886
54551 122886 124253 125754 126734 126883 126974 127852 129261 130564 131864 133385 134520 134806 135104 136373 137893 138198
54535 138198 137301 136355 135613 134380 132786 131787 131475 131044 130461 130526 131075 130780 129083 126959 125388 124422 124021
54518 124021 124444 125331 125578 124670 123300 122401 122365 123196 124480 125223 124740 123683 123159 123085 122633 122034 122364 123566
54500 123566 124354 124308 124480 125472 126483 126817 126929 127294 127503 127273 127280 128164 129485 130371 130580 130449 130324 130286 129929
54481 129929 128419 125495 122317 120409 119970 120198 121027 123108 126097 128563 129929 131084 132639 133985 134628
54466 134628 135151 136127 137258 138243 139454 141017 142179 142274 141568 140603 139561 138770 138893 139989 141096 141275 140465
54449 140465 139060 137456 136335 136380 137251 137685 137092 136211 135805 135657 135345 135070 135063 134890 134075 132883 131955 131631
54431 131631 131918 132640 133372 133764 134068 134762 135613 135836 135249 134498 134099 134064 134507 135641 137063 137969 138191 138162 137877
54412 137877 136950 135705 135017 134941 134727 134355 134723 136066 137507 138588 139910 141717 143165 143620 143576 143650 143755
54395 143755 143817 144227 144979 145449 145561 146074 147115 147642 147049 146245 146319 147166 148186 149317 150549 151333 151346 151080
54377 151080 150929 150477 149423 148435 148327 149117 150576 152958 156429 160424 164268 167897 171470 174850 177961
54362 177961 181029 184070 186728 188893 190728 191873 191603 190028 188194 186646 184910 182688 180430 178315
54348 178315 175804 172650 169276 165782 161877 158152 155945 155349 154812 153426 152074 151510 150926 149570 148235
54333 148235 147714 147100 145190 142576 140874 140586 141082 141967 143173 144285 144956 145505 146187 146514 146165 145813 146069
54316 146069 146464 146489 146715 147735 148778 148700 147706 146890 146627 146498 146265 145797 144619 142655 140946 140566 141270 142107
54298 142107 142764 143378 143726 143691 143917 144908 146053 146576 146840 147654 148897 149913 150665 151348 151534 150903 150295 150740
54280 150740 151878 152528 152357 151856 151181 150272 149739 150312 151676 152975 154164 155715 157304 158048 157905 157777 158344
54263 158344 159697 161834 164496 166839 168214 169075 170214 171529 172419 172872 173119 172735 171279 169426 168306
54248 168306 168025 167930 167850 167847 167200 165084 162044 159507 157987 157068 156895 158171 160590 162629 163221 162656 161683 160618
54230 160618 159421 157882 155826 153826 153278 154864 157369 159104 160021 161153 162485 162998 162660 162667 163470 164077
54214 164077 163686 162694 161648 160411 158886 157571 156876 156655 156709 157002 157164 156662 155671 154957 154708 154325 153574 153064
54196 153064 153246 153667 153599 152902 152011 151497 151689 152270 152323 151280 149694 148516 147895 147362 146841 146655 146745 146795 147037
54177 147037 148025 149717 151543 153301 155172 157037 158589 159906 161098 161640 161026 159819 159027 158644 157919 156852
54161 156852 156249 156278 156184 155517 154633 153922 153503 153658 154541 155497 155705 155486 155850 156798 157286 156908 156346 155989 155423
54142 155423 154581 154197 154634 155294 155551 155370 154764 153668 152619 152490 153192 153669 153510 153554 154521 156109 157879 159932
54124 159932 162129 163598 163816 163544 164076 166024 169151 172752 175870 177777 178615 179118 179669 180271 181362 183677
54108 183677 187134 190846 194496 198766 204122 210229 216886 224434 232543 239528 243650 244560 243001 239787
54094 239787 235611 231259 227348 224150 221891 220746 220285 219530 217848 215268 211889 207693 203129 199030 195583
54079 195583 192147 188465 185307 183474 182766 182456 182177 181905 181553 181029 180420 179836 179334 179034 178973 178861 178442 177998
54061 177998 177993 178401 178979 179904 181297 182411 182357 181540 181262 181912 182706 183323 184490 186638 189168 191486 193763
54044 193763 196269 198931 201888 205464 209280 212519 215456 219555 225518 232335 238844 245108 251563 257952
54030 257952 263932 269822 275869 281595 286610 291283 295790 299284 300894 300953 300510 300227 300390 301252 302549 303267
54014 303267 302691 301227 299542 297438 294314 290215 285648 280728 275209 269135 262959 257264 252606 249131
54000 249131 246068 242248 237476 232818 229224 226582 224469 222891 221733 220321 218312 216285 214803 213526
53986 213526 211946 210311 209143 208454 208149 208541 209687 210766 210976 210588 210382 210453 210332 209941 209767 210389 212298
53969 212298 215821 220776 226661 233500 241908 251915 262508 272801 282732 291878 298539 301027 299258
53956 299258 294281 286951 278078 269127 261479 255310 250197 246380 244303 243344 242309 241148 240941 242098 243706
53941 243706 244892 245947 247695 250455 253969 257851 261809 265736 269747 273869 277758 281018 283751 286462
53927 286462 289529 293029 296963 301299 305880 310576 315407 320371 325362 330411 335701 341161 346469 351715
53913 351715 357627 364805 373094 382011 391346 400948 410318 418739 425526 429955 431522 430650 428554 426064
53899 426064 423072 419483 415930 412950 410070 406400 401715 396297 390214 383372 375993 368412 360682 352796
53885 352796 344877 336775 328032 318793 310208 303347 298130 293804 289874 286006 281793 277342 273495 270586
53871 270586 267573 263299 258126 253393 249688 246623 243920 241551 239083 236013 232808 230587 229600 228804 227123
53856 227123 224484 221561 219075 217354 216043 214295 211765 209267 207838 207350 206762 205645 204643 204351 204534
53841 204534 204722 204982 205695 206878 208010 208400 207721 206348 205148 204812 205458 206845 208652 210414 211622 212211
53825 212211 212616 213151 213715 214291 215111 215957 215964 214786 213475 213527 215321 218016 220583 222386 223150 223118 223143 224090
53807 224090 226198 229275 233119 237373 241508 245453 249830 255060 260695 266178 271730 277816 284186 290163
53793 290163 295557 300604 305290 309382 312836 315643 317594 318742 319661 320696 321358 321092 320163 319088 317641
53778 317641 315173 311541 307027 301767 296009 290504 285833 281582 276902 271564 265899 260182 254778 250381
53764 250381 247239 244513 241230 237463 233843 230438 227040 224094 222279 221463 220920 220295 219533 218315 216537
53749 216537 214946 214290 214218 213924 213457 213340 213390 213100 212755 212914 213123 212459 211144 210304 210303 210591 210967 211568 211798
53730 211798 210851 209376 209062 210358 212105 213630 215641 218466 220951 221929 221717 221427 221690 222663 224392 226565
53714 226565 228603 230421 232467 234738 236576 237689 238554 239607 240915 242798 245717 249232 252196 254370
53700 254370 256811 260224 264063 267798 271926 276906 282086 286539 290204 293339 295541 296270 295894 295428 295437 295739
53684 295739 295912 295685 295144 294840 295313 296252 296606 295771 294196 292685 291719 291584 292379 293503 293942 293507 293167 293703
53666 293703 294675 295202 295141 294976 295011 295190 295310 295094 294408 293638 293304 293170 292456 291191 290494 291051 292039 292204 291410
53647 291410 290561 290457 291264 292656 293985 294731 295170 296226 298341 300978 303517 305952 308345 310312 311680
53632 311680 313030 314979 317404 319941 322705 325928 329350 332643 336073 340068 344448 348701 352708 356618
53618 356618 360240 363204 365543 367565 369280 370453 371123 371651 372355 373458 375273 378047 381649 385681 389794
53603 389794 393705 397136 400014 402568 404987 407134 408809 410099 411245 412348 413398 414351 415039 415142 414479
53588 414479 413203 411641 410046 408537 407117 405801 404776 404246 403896 402875 400790 398422 396810 395815 394367
53573 394367 391989 389272 386784 384404 381922 379524 377357 375298 373462 372312 371974 372018 372094 372260 372590 373088
53557 373088 373999 375399 376442 376073 374710 374150 375307 377103 378108 378292 378380 378500 378413 378447 379233 380957 383519
53540 383519 386869 390491 393258 394669 395798 398134 401897 406294 411003 416412 422624 429210 435935 442992
53526 442992 450540 458591 467338 477014 487532 498719 510712 523638 537084 550512 564057 578350
53514 578350 593606 609433 625525 642062 659500 678364 699203 722227 746883 772059 796805
53503 796805 820827 844474 868419 893012 917676 941184 962851 983195 1003208 1023348 1043557
53492 1043557 1063827 1084198 1104448 1124280 1143631 1162450 1180458 1197575 1214335 1231361 1248596
53481 1248596 1265554 1282200 1299055 1316459 1334213 1351975 1369623 1387030 1403723 1418916 1431786
53470 1431786 1441763 1448688 1452779 1454471 1454257 1452419 1448685 1442282 1432731 1420576 1406974 1392634 1377624
53457 1377624 1362146 1346872 1332293 1318187 1303897 1288702 1271859 1252909 1232260 1211035 1190082
53446 1190082 1169457 1148932 1128469 1108092 1087900 1068411 1050314 1033700 1018119 1003651 991221
53435 991221 981555 974410 969184 965664 963789 963260 963746 965018 966647 968175 969845 972454 976244 980695 985737
53420 985737 992298 1001219 1012403 1025474 1040373 1056753 1073740 1091125 1109978 1131301 1154715 1179251
53408 1179251 1204638 1231015 1258089 1285602 1314081 1344183 1375846 1408977 1444393 1483002 1524508
53397 1524508 1567928 1613050 1660307 1709600 1760310 1812308 1865897 1920876 1976595 2032858 2089836
53386 2089836 2147094 2203622 2258861 2312934 2365839 2417133 2466427 2513545 2558204 2600136 2639425
53375 2639425 2676169 2709895 2739855 2765638 2786921 2802986 2813315 2818458 2819408 2816104 2807303 2791936
53363 2791936 2769868 2741386 2706732 2666351 2621061 2571851 2519775 2465959 2411279 2356250 2301563
53352 2301563 2248299 2197022 2147056 2097434 2048272 2000555 1954892 1911263 1869615 1829746 1790758
53341 1790758 1751601 1712159 1672997 1634194 1595411 1557122 1520766 1487424 1457062 1429154 1403329
53330 1403329 1379305 1356995 1336920 1319871 1305927 1294189 1283481 1272747 1260946 1247385 1232347
53319 1232347 1216790 1201355 1186202 1171668 1158282 1146124 1135011 1125375 1118033 1112781 1108165 1103183
53307 1103183 1098609 1096098 1096409 1098945 1102627 1106699 1110926 1115553 1121194 1128592 1138304 1150481 1164866 1181170
53293 1181170 1199527 1220354 1243552 1268188 1293221 1318344 1343857 1370030 1396819 1423774 1449867
53282 1449867 1473932 1495774 1516431 1536846 1556617 1574457 1589369 1600837 1608569 1612835 1614567 1614312
53270 1614312 1611497 1605387 1596228 1584655 1570632 1553983 1535373 1515574 1494219 1470559 1445073 1419006
53258 1419006 1392520 1364691 1335325 1305467 1276003 1246951 1218219 1189925 1161832 1133598 1105725
53247 1105725 1079179 1054021 1029493 1005390 982107 959253 935694 911220 886870 863269 839960
53236 839960 816759 794485 773843 754770 737250 721465 706715 691676 676475 663183 653354 646217
53224 646217 640091 634333 628868 622986 615841 607368 597674 586319 573258 559714 546934 534621 521590
53211 521590 507468 492846 478310 464331 451698 441041 432195 424700 418434 413089 407727 401834 396172
53198 396172 391555 387273 381930 375355 368404 361204 353087 344350 336622 330986 326766 322682 318335 314016
53184 314016 309746 305215 300387 295670 291634 288728 286982 285757 283976 280932 276842 272614 269114 266573
53170 266573 264500 262162 259331 256529 254455 253306 252815 252709 252796 252746 252217 251289 250441 249987 249720 249233 248436
53153 248436 247593 246875 246085 244946 243589 242572 242337 242785 243412 243695 243312 242361 241544 241729 242963 244202 244471
53136 244471 243954 243486 243328 243187 243180 243875 245276 246558 247062 246984 246907 247222 248163 249802 251775 253539 255053 256723
53118 256723 258535 259941 260802 261790 263447 265404 266907 267696 268011 268133 268247 268462 268597 268153 266694 264187
53102 264187 261062 258138 256235 255330 254366 252505 250377 249304 249453 249687 249184 248159 246898 245261 243476
53087 243476 242352 242155 242187 241963 241914 242408 243008 243312 243631 244127 244152 243258 242131 241650 241559 240893 239282 237143 235059
53068 235059 233592 233222 233792 234439 234646 234822 235344 235742 235567 235321 235643 236118 235850 234831 233849 233362 233341 233876
53050 233876 234994 236149 236727 236948 237469 238331 239089 239772 240870 242389 243714 244422 244614 244484 244170 243996 244313
53033 244313 245102 246169 247492 248930 249917 250092 249965 250288 250959 251245 250893 250302 249688 248835 247691 246596 245852
53016 245852 245621 246119 247339 248651 249320 249446 249731 250325 250556 249967 248986 248284 247946 247605 247095 246612 246306 246016
52998 246016 245550 245150 245385 246285 246898 246254 244716 243632 243560 243697 243359 243072 243559 244531 245374 246365 248163 250534
52980 250534 252595 254077 255345 256415 256988 257378 258375 260014 261366 261826 261919 262572 264131 266276 268435 270062
52964 270062 270915 271249 271534 272014 272691 273505 274189 274230 273397 272088 270752 269284 267446 265532 264001 262776 261493
52947 261493 260158 258939 257631 256114 254982 254815 255069 254648 253514 252724 252805 253071 252795 252151 251672 251456 251280
52930 251280 250938 250172 248871 247594 247352 248502 250271 251606 252185 252366 252532 252746 252808 252495 251885 251439 251580
52913 251580 252253 253135 254059 254898 255311 255048 254362 253629 252806 251734 250690 249990 249288 248069 246681 246014 246168
52896 246168 246285 245892 245621 246343 248212 250762 253340 255227 256001 256078 256385 257198 257778 257397 256263 255109 254307
52879 254307 253731 253223 252861 252822 253104 253348 253115 252581 252693 254210 256792 259535 262168 265039 268068 270514 271933
52862 271933 272663 273130 273246 272684 271300 269097 266260 263390 261220 259877 258719 256969 254188 250303 245740
52847 245740 241527 238586 236849 235614 234755 234803 235702 236355 235873 234647 233669 233256 232885 231948 230276 228242 226681
52830 226681 226476 227878 230328 233019 235400 237143 238042 238128 237600 236532 234973 233341 232288 232101 232547 233413
52814 233413 234760 236533 238382 240050 241630 243332 245296 247630 250210 252363 253167 252213 249834 246590 242916
52799 242916 239194 235698 232387 229199 226490 224763 223953 223529 223252 223282 223564 223846 224378 225828 228172 230328
52783 230328 231264 230995 230183 229259 228332 227554 227240 227733 229303 231841 234595 236598 237509 237748 237797 237795 237712 237417 236548
52764 236548 234857 232743 230887 229387 227910 226657 226343 227043 227958 228643 229644 231476 233705 235630 237212
52749 237212 238690 239750 239840 239121 238587 239218 241252 244088 246752 248715 250346 252303 254533 256329 257320 257792
52733 257792 257938 257575 256870 256629 257386 258749 260021 260905 261255 260728 259256 257380 255665 254163 252820 251935
52717 251935 251641 251409 250633 249451 248483 247978 247779 247881 248498 249562 250581 251102 251195 251457 252453 253987 255052
52700 255052 254832 253695 252738 252414 252197 251660 251169 251257 251890 252678 253388 253919 254210 254351 254405 254083 253121 251991 251498
52681 251498 251535 251051 249546 247791 246699 246276 246216 246675 247725 248640 248512 247311 245824 244817 244658 245373 246661
52664 246661 248119 249653 251329 252780 253519 253942 255150 257449 259923 261884 263738 265866 267763 269087 270523
52649 270523 272529 274101 273934 272278 270489 269252 268294 267363 266376 264975 263022 261226 260256 259644 258619 257625
52633 257625 257740 258915 260179 261404 263369 265996 268065 269054 269863 271093 271832 271021 269082 267275 266012
52618 266012 264648 262563 259817 256959 254721 253658 253645 253933 254017 254272 255366 257247 259034 259828 259424 258266
52602 258266 256957 255910 255414 255837 257454 259986 262582 264502 265575 265872 265395 264516 264263 265412 267417 268946
52586 268946 269436 269515 269834 270198 270096 269504 268854 268623 269166 270563 272321 273554 273768 273261 272559 271720 270541 269190
52568 269190 268220 267901 267870 267601 267088 266825 267118 267683 268031 268042 267885 267518 266686 265401 264000 262607 260949 258891
52550 258891 256829 255392 254981 255689 257234 258847 259695 259665 259313 258936 258223 257080 256120 255888 256154 256490 257018
52533 257018 258009 259211 260221 261144 262287 263518 264543 265412 266129 266190 265242 263917 263253 263555 264506 265955 267721
52516 267721 268964 268954 268383 268797 270557 272394 273331 274079 275972 279225 282816 285622 287185 287624 287284 286434
52500 286434 285132 283386 281323 279009 276311 273315 270669 269051 268435 268357 268699 269530 270312 270037 268354 265985
52484 265985 263939 262800 262770 263716 265015 265970 266646 267762 269580 271423 272521 272867 272987 273305 273972 274930 275945
52467 275945 276860 277956 279730 282249 285140 288229 291697 295468 298932 301455 302735 302590 300893 297964 294522
52452 294522 291024 287424 283751 280395 277595 275111 272755 270806 269540 268719 267919 267103 266488 266069 265603 264917
52436 264917 264006 262992 262216 262188 263106 264501 265533 265666 265042 264276 263942 264161 264674 265306 266198 267484 268947
52419 268947 270270 271390 272306 272782 272714 272678 273596 275828 279029 282898 287601 293433 300519 308971 318950 330364
52403 330364 342708 355139 366450 375169 380221 381450 379131 373216 363782 352114 340416 330205 321596
52390 321596 314339 308719 305012 302774 301324 300503 300430 300788 300815 299852 297728 294964 292887 292988 295515 298875
52374 298875 301018 301462 301695 303577 307676 313136 318828 324320 329701 334745 338635 340649 340810 339551 337147
52359 337147 334002 331258 330270 331297 333248 334945 336142 337168 338177 339177 340381 342067 344242 346658
52345 346658 348971 350828 352114 353210 354630 356294 357642 358713 360527 363976 368703 373617 378292 383339
52331 383339 389449 396562 404080 411654 419583 428543 438991 450883 463915 477857 492468 507304 521952
52318 521952 536415 550960 565595 580100 594630 609844 626274 643782 661860 680220 698965
52307 698965 718306 738161 758023 777331 796076 814772 833552 851683 868465 884258 899896
52296 899896 915177 928763 939599 947704 953404 956635 957387 956171 953552 949660 944523 938455 931755 924446
52282 924446 916724 909306 902948 897827 893632 890005 886690 883606 881048 879517 879195 879926 881836 885481 891073
52267 891073 897983 905370 912991 921111 929937 939454 949559 960097 970993 982568 995395 1009659 1024884
52254 1024884 1040457 1056111 1071808 1087497 1103104 1118305 1132206 1143729 1152553 1159223 1164189 1167234
52242 1167234 1168050 1166795 1163777 1159127 1153163 1146558 1139781 1132777 1125471 1117953 1109859 1100336 1089250 1077842
52228 1077842 1067437 1057929 1048257 1037991 1027726 1018180 1009738 1002765 997587 993962 991085 988281 985482
52215 985482 983098 981710 981748 983035 984768 986290 987928 990777 995629 1002170 1009036 1014577 1017910 1019556 1020936
52200 1020936 1023135 1026380 1030645 1036117 1042766 1050060 1057586 1065518 1073929 1082026 1088671 1093478 1096884 1099339
52186 1099339 1100906 1101497 1100984 1099120 1095701 1090775 1084546 1077281 1069490 1061792 1054296 1046521 1038247 1030048
52172 1030048 1022631 1016138 1010620 1006586 1004349 1003169 1001905 1000375 999372 999432 1000341 1001805 1003910 1006692 1009768
52157 1009768 1012581 1014705 1015919 1016324 1016323 1016187 1015724 1014739 1013661 1013311 1014065 1015628 1017568 1019692 1021999 1024529
52141 1024529 1027144 1029223 1029840 1028659 1026462 1024358 1022656 1020928 1019037 1017645 1017765 1020133 1024848 1031296
52127 1031296 1038682 1046966 1057045 1069665 1084591 1101285 1119863 1140660 1163188 1186370 1209606 1232865
52115 1232865 1255898 1278172 1299539 1320241 1340278 1359515 1378326 1397295 1416213 1434212 1450968
52104 1450968 1466991 1482559 1497300 1511096 1524558 1538022 1550707 1561356 1569259 1574210 1575957 1574145
52092 1574145 1568552 1559148 1546283 1531047 1514933 1498757 1482287 1465248 1448242 1432287 1417842 1404773
52080 1404773 1393000 1382663 1373769 1366075 1359298 1353288 1348132 1344285 1342343 1342458 1344194 1347171 1351545 1357564
52066 1357564 1364998 1373442 1383037 1394330 1407424 1421716 1436531 1451676 1467149 1482707 1498005 1512979
52054 1512979 1527692 1541792 1554427 1564819 1572673 1577917 1580336 1579773 1576492 1570960 1563299 1553427 1541725
52041 1541725 1529067 1516054 1502686 1488994 1475430 1462220 1448825 1434612 1419761 1404957 1390441
52030 1390441 1375953 1361398 1346893 1332160 1316536 1299751 1282315 1265045 1248594 1233394 1219544
52019 1219544 1206634 1194080 1181803 1170250 1159689 1149904 1140641 1131922 1123741 1115757 1107538 1098827 1089421
52006 1089421 1078992 1067201 1053824 1038735 1022000 1004039 985510 966987 948928 931875 916389
51995 916389 902731 890752 880072 870079 859894 848698 836142 822260 807168 791191 775182 760080
51983 760080 745995 732109 717539 702024 685743 668941 651892 634981 618721 603893 591498
51972 591498 582040 574897 568953 564033 561203 561423 564422 569172 574940 581429 588242 594752 600453 605112
51958 605112 608565 610557 610739 608760 604553 598694 592313 586495 581802 578349 576142 575301 576174 579327 585179
51943 585179 593607 604215 617135 633270 653500 677769 705120 734394 764679 795087 824254 850072
51931 850072 869965 881661 883895 876553 860358 836699 807609 775460 742370 709865 678968 650284
51919 650284 623988 600048 578600 559904 543909 530130 518099 507726 499143 492430 487666 485046
51907 485046 484657 486166 488922 492389 496389 500883 505561 509760 512818 514390 514239 511846 506578 498402 488157
51892 488157 476956 465565 454410 443910 434499 426622 420951 418241 418600 421151 424774 429017 434026
51879 434026 439977 447064 455689 465991 477284 488453 498793 507997 515484 520379 522172 520988 517301
51866 517301 511864 505720 499618 493475 486992 480726 475868 472924 471347 470620 471012 473007 476509 480846 485057
51851 485057 487960 488427 486013 481197 474947 468217 461629 455125 448006 439887 431606 424601 419424 415468
51837 415468 412163 409709 408515 408605 409756 411617 413545 415000 416242 417961 420047 421505 421778 421308 420470
51822 420470 418866 416233 413302 411134 410148 410325 411729 414185 416990 419565 421989 424322 425944 426212 425364
51807 425364 424083 422485 420203 417275 414335 412039 410713 410370 410737 411478 412736 415042 418292 421250 422570
51792 422570 422033 420357 418268 416289 415016 414815 415397 416157 416730 416861 416218 414959 414059 414233 414898 415045 414921
51775 414921 415811 418200 421193 424052 427343 432063 438313 445447 453076 461238 469687 477512 483543 486957
51761 486957 487499 485350 480914 474669 467083 458484 449093 439332 430070 422216 415981 410785 405991 401381
51747 401381 396886 392447 388520 386193 386166 387871 390155 392644 395858 400144 405162 410466 415992 421800 427768
51732 427768 433690 439343 444258 447755 449454 449671 449197 448797 448906 449667 451116 453197 455424 456602 455327
51717 455327 451147 445103 438909 433755 430092 428083 427648 428102 428388 427915 426915 425970 425534 426051 428118 432061
51701 432061 437286 442227 445115 445012 442340 438572 435402 433988 434627 436882 440075 443795 447816 451384 453026
51686 453026 451644 447735 442933 438308 433711 428847 424192 420484 417932 416476 416272 417355 419191 421133
51672 421133 423085 425231 427470 429641 432069 435385 439993 446097 453852 462833 471606 478537 482937 484970
51658 484970 484642 481656 476176 469144 461765 455268 451091 450520 453827 460120 468136 476725 484516 489733 490797
51643 490797 487058 479018 468248 457002 447288 439802 433934 428905 424719 421845 420270 419141 417368 414509
51629 414509 411059 407870 405347 403352 401749 400592 399615 398094 395618 392565 389400 385907 381709 377213
51615 377213 373292 370179 367396 364693 362369 360677 359584 359133 359338 359654 359335 358543 358419 359768 362311 365544
51599 365544 369653 375140 382104 390435 400278 411738 424419 437654 450728 462252 469788 471129 466280
51586 466280 457728 448541 440515 434122 429573 427360 427876 431010 436336 443664 453289 465691 480990 498621
51572 498621 517450 536206 553966 570515 586303 601879 617090 630809 641704 649586 656111 664094
51560 664094 676022 693205 716125 745089 779987 819466 860638 899802 933470 959121 975665
51549 975665 983434 983373 975984 961273 939755 913006 882855 850337 815827 780000 744283 710445
51537 710445 679970 653648 631425 612639 596568 582603 569889 557271 544048 530629 518070
51526 518070 507018 497385 488804 480951 473475 466052 458689 451779 445749 440687 436293 432202 428361 425036
51512 425036 422287 419652 416739 414015 412328 411570 410522 408262 405045 401411 397280 392666 388592 386394
51498 386394 386325 387565 389314 391185 392833 394045 395069 396201 397153 397508 397566 398081 399259 400673 401942 402778
51482 402778 402609 401077 398851 397024 395733 394232 392289 390469 388886 386720 383386 379338 375255 371222
51468 371222 367154 363362 360116 357180 354300 351769 350067 349259 349014 348925 348615 347969 347432 347638 348546 349453 350008
51451 350008 350730 352372 355357 360001 366563 374794 384087 394445 406582 420673 435711 450601 465120
51438 465120 479090 491339 500448 506207 509473 510891 510548 508667 505601 501031 493977 483929 471464
51425 471464 457645 443329 429280 416389 405382 396526 389866 385491 383274 382502 382091 381264 379992 378825
51411 378825 378394 379007 380505 382340 383883 384870 385647 386828 388629 390709 392789 395170 398341 402252 406384
51396 406384 410479 414822 419722 425148 430961 437205 443963 451230 459182 468471 480036 494549 512016
51383 512016 531899 553779 577998 605567 637383 673832 715225 761999 813952 869589 926717
51372 926717 983181 1036254 1081762 1115245 1134543 1140619 1135661 1121093 1097569 1065826 1026777 981296
51360 981296 930656 876934 822440 768960 717857 670528 628150 591099 558957 531098 507065
51349 507065 486553 469269 454768 442423 431782 422938 416198 411327 407558 404431 402119 400724 399832
51336 399832 399122 398889 399493 400524 401059 400539 399070 396974 394422 391516 388479 385612 383011 380362 377254
51321 377254 373923 371347 370209 369981 369582 368697 367779 366977 366047 365395 366122 368604 371814 374502 376288 377127
51305 377127 376579 374379 371226 368278 366172 364970 364608 364855 365206 365302 365150 364659 363530 361995 361018 361242 362314
51288 362314 363791 365940 368961 372083 374412 376163 378188 380762 383806 387867 393687 400872 407964 413793
51274 413793 417863 419615 418552 415388 412045 410020 409343 409335 409709 410512 411636 412886 414159 415232 415598 414788
51258 414788 412723 409684 406132 402509 398920 395122 391066 387285 384297 381795 379011 375829 372961 370991
51244 370991 369821 369134 368846 368955 369451 370568 372684 375741 379125 382237 384789 386447 386699 385422 383274
51229 383274 381259 380043 379698 379754 379358 377825 375303 372725 370949 370207 370366 371273 372560 373600 374098 374564
51213 374564 375746 377717 379809 381447 382719 384150 386189 389028 392599 396511 400154 403202 406012 409227
51199 409227 412859 416054 418013 418977 419932 421395 422842 423261 421951 418835 414469 409896 406086 403303 401287
51184 401287 400069 400114 401486 403421 405107 406484 407917 409452 410843 412034 413131 414032 414438 414122 412947
51169 412947 410840 407994 404937 402163 399973 398697 398599 399310 399893 399892 399853 400372 401151 401516 401307 400653 399328 397163
51151 397163 394754 392880 391378 389386 386681 384052 382354 381794 382129 382915 383522 383474 382916 382399 382319 382858 384135
51134 384135 385898 387351 387953 388077 388302 388441 388164 388154 389481 391969 394390 396282 398325 400659 402226 402397
51118 402397 402140 402724 404151 405702 407266 409181 411254 412962 414403 416200 418528 420923 423042 425047 427205
51103 427205 429586 432150 434731 436925 438418 439489 440812 442578 444086 444488 443850 443183 443340 444019 444090 442893
51087 442893 440980 439509 439165 439859 441121 442389 443077 442852 441923 440829 439946 439404 439313 439786 440798 442291 444288
51070 444288 446715 449351 452278 456085 461228 467523 474772 483531 494552 507707 522337 538629 557778
51057 557778 580484 605770 631301 654319 672504 685004 693067 699081 704674 710157 715607 721391 727220
51044 727220 731606 733060 731375 727317 721520 714148 705141 694350 681860 668687 656768 647627 641095
51031 641095 635509 628859 619602 607052 591682 575023 558979 545268 535316 529924 528561 529499 531206
51018 531206 533454 536915 542145 549357 558650 569879 582527 596105 610446 625264 639757 653020
51006 653020 664628 674454 682336 688335 692955 696539 698707 698857 696970 693489 688703 682793 676307 670006
50992 670006 664350 659624 656428 655420 656508 658863 661859 665692 670951 677995 686936 697999 711521 727487
50978 727487 745115 763062 780286 796731 813070 829954 847890 867832 891223 919097 951477
50967 951477 987929 1028324 1072745 1121052 1173045 1228752 1288056 1350206 1414208 1479543 1545977
50956 1545977 1612618 1677636 1739015 1795380 1846034 1890548 1928538 1959815 1984689 2004012 2018789
50945 2018789 2029798 2037761 2043696 2048640 2052976 2056542 2059476 2062200 2064179 2063384 2057824 2047427 2033819
50932 2033819 2018407 2001286 1981865 1959823 1935116 1907444 1876115 1840411 1800015 1755114 1706145
50921 1706145 1653581 1598116 1540902 1483239 1426033 1369981 1316215 1266118 1220276 1178246 1139679
50910 1139679 1105048 1074723 1047958 1023484 1000750 979906 960943 943566 927739 913615 901030
50899 901030 889656 879524 870853 863506 857194 852002 848062 844947 842149 839989 839166 839458 839801 839751 839911
50884 839911 840699 841655 842478 843847 846573 850590 855429 861166 868160 876295 885192 894928 905842 917763
50870 917763 930125 942858 956588 971880 988744 1006975 1026526 1047417 1069745 1093982 1120961
50859 1120961 1151296 1185040 1222221 1263494 1310017 1362792 1422449 1489553 1564733 1648302 1740081
50848 1740081 1839841 1947811 2064446 2189672 2322552 2461666 2605518 2752478 2900581 3047681
50838 3047681 3191621 3329856 3458778 3573872 3671056 3748127 3804891 3842030 3860242 3860743 3846276
50827 3846276 3820981 3789039 3753667 3717419 3682927 3652951 3629928 3615700 3611123 3615295 3625302 3637215
50815 3637215 3647198 3651322 3644952 3623700 3585370 3530251 3459228 3372404 3269942 3153382 3025424
50804 3025424 2889013 2747375 2604460 2464300 2329821 2202764 2084627 1977064 1881260 1797314
50794 1797314 1724371 1661271 1607298 1562556 1527363 1501067 1481859 1468107 1459334 1455334 1454838 1455967
50782 1455967 1457744 1460232 1463116 1465139 1465219 1463383 1460208 1455959 1450619 1444233 1436696 1427562 1416493 1403704
50768 1403704 1389604 1374187 1357103 1338134 1317333 1294903 1271299 1247389 1224166 1202249 1181796
50757 1181796 1162854 1145566 1130093 1116502 1104825 1095142 1087629 1082689 1081031 1083349 1089757 1099669 1112461
50744 1112461 1128254 1147730 1171158 1197935 1227352 1259554 1295357 1335286 1379299 1427336 1479544
50733 1479544 1535818 1595648 1658682 1724938 1794165 1865504 1938214 2012283 2087643 2162986 2236034
50722 2236034 2305090 2369845 2430489 2486267 2534968 2573590 2599501 2611210 2608396 2591625 2562480
50711 2562480 2523880 2479690 2433581 2388487 2347129 2312292 2285982 2268652 2259755 2258597 2264079 2274052
50699 2274052 2285804 2297070 2305782 2309028 2303291 2286021 2256345 2214179 2159610 2093685 2019099 1939404
50687 1939404 1857750 1776702 1698798 1626560 1561883 1505674 1458046 1418662 1387034 1362793 1345776
50676 1345776 1335910 1333160 1337582 1349164 1367447 1391463 1420087 1452295 1486996 1522899 1558709 1593325
50664 1593325 1625742 1655011 1680522 1702248 1720551 1735846 1748595 1759617 1770114 1781201 1793258
50653 1793258 1805720 1817575 1828168 1837649 1846786 1856560 1867856 1881310 1897223 1915694 1936855 1960901
50641 1960901 1987928 2018004 2051397 2088392 2128759 2171651 2216128 2261449 2306746 2350925 2393312
50630 2393312 2434161 2474263 2514322 2554807 2595812 2636380 2674027 2704996 2724583 2727393 2708928
50619 2708928 2668686 2611770 2546573 2480690 2419186 2365641 2322844 2291880 2271635 2259967 2255052
50608 2255052 2255474 2259845 2266805 2274926 2282254 2286375 2285106 2276778 2259786 2232652 2194912 2147480 2091774
50595 2091774 2028969 1960380 1888026 1814227 1740847 1669195 1600286 1534863 1473328 1415919 1362806
50584 1362806 1313981 1269336 1228955 1192945 1160965 1132413 1107232 1086097 1069650 1057922 1050551
50573 1050551 1046924 1045974 1046663 1049113 1054580 1063762 1075607 1088371 1101429 1115451 1131164 1148648 1167697
50560 1167697 1188256 1210466 1234600 1260842 1288908 1318127 1348195 1379489 1412304 1446125 1480139
50549 1480139 1514149 1548413 1582779 1616545 1649003 1679634 1707926 1733783 1758290 1783548 1811446
50538 1811446 1842729 1877275 1914949 1956132 2001682 2052479 2108903 2170719 2237643 2309927 2388304
50527 2388304 2473558 2566391 2667402 2776591 2892768 3013769 3137336 3261517 3384209 3502710
50517 3502710 3613995 3715263 3804125 3878373 3935755 3974036 3991456 3987337 3962253 3917464 3854220
50506 3854220 3773825 3678340 3570968 3455706 3336889 3219112 3107133 3005306 2916938 2844246
50496 2844246 2788838 2751930 2734032 2734656 2752509 2785764 2831857 2887111 2946856 3005910 3058664 3098967
50484 3098967 3120798 3119784 3093973 3043132 2967959 2870687 2755993 2630276 2499633 2368738 2241276
50473 2241276 2120297 2007640 1903534 1807233 1717905 1634896 1557820 1486836 1422501 1364999 1313793
50462 1313793 1268312 1228594 1194943 1167350 1145594 1129530 1118779 1112412 1109468 1109661 1113156 1119849
50450 1119849 1129268 1141007 1154749 1169953 1186113 1203395 1222496 1243722 1266535 1290134 1313996
50439 1313996 1337526 1359456 1378024 1391849 1400526 1404552 1404940 1402906 1399537 1395441 1390716 1385483 1380434
50426 1380434 1376599 1374536 1374043 1374816 1377090 1381340 1387796 1396691 1408773 1424836 1444815 1468096 1494985
50413 1494985 1527192 1566391 1612702 1664940 1721942 1783087 1847823 1915304 1984484 2054111 2122512
50402 2122512 2187824 2248555 2303770 2352635 2394005 2426617 2449513 2462057 2463522 2452833 2428947
50391 2428947 2391443 2340746 2278069 2205700 2127337 2047340 1968992 1893763 1822668 1757807 1701711
50380 1701711 1655567 1619113 1592239 1575510 1568869 1570996 1580538 1597070 1619967 1647006 1674866 1700560
50368 1700560 1721535 1734865 1737563 1727939 1706183 1673652 1632273 1584728 1534466 1484841 1438030 1394804
50356 1394804 1355302 1320008 1289831 1265032 1244191 1224556 1203456 1179065 1150152 1116155 1077981
50345 1077981 1038086 999113 962715 929848 901419 877959 859153 844389 833461 826206 821871 819587
50333 819587 819177 820801 824041 828021 832322 837124 842536 848373 854462 860646 866605 872246 878117 884907
50319 884907 892666 901043 910039 919769 929665 938680 946259 952422 956984 959545 960385 960606 961177 962385 964274
50304 964274 966882 969855 972549 974881 977531 980977 984885 988809 993063 998469 1005481 1013815 1022655 1031002
50290 1031002 1038053 1043432 1046901 1047958 1046087 1041447 1034907 1027369 1019450 1011847 1005435 1000799 998097 997492
50276 997492 999261 1003288 1008937 1015705 1023626 1032825 1043042 1053839 1064992 1076448 1088194 1100332 1113022
50263 1113022 1126342 1140518 1156266 1174364 1194811 1216906 1240180 1264521 1289174 1312426 1332918
50252 1332918 1350744 1366778 1381410 1394572 1406524 1417769 1428216 1436937 1442695 1444343 1440903 1431863
50240 1431863 1417497 1398728 1376843 1353608 1331277 1311840 1296249 1284659 1277061 1272967 1270462 1266318
50228 1266318 1257407 1241866 1219165 1189911 1156002 1120316 1085504 1052916 1022716 994646 968418
50217 968418 943813 921026 900823 883828 869573 856712 844304 832495 821817 812239 803255 794527
50205 794527 785901 777041 767694 758392 750325 744268 739934 736558 733682 731161 728814 726546 724546 722898
50191 722898 721138 718652 715459 712153 709044 705784 701974 697824 694023 691156 689369 688439 687989 687758 687813
50176 687813 688538 690373 693475 697485 701600 705069 707738 710034 712350 714700 717029 719475 722091 724627
50162 724627 727026 729866 733845 739018 745025 751947 760375 770662 782735 796817 813670 833767 856554
50149 856554 880909 906157 932431 960279 990264 1022784 1058027 1095987 1136559 1179493 1224156
50138 1224156 1269419 1313962 1356887 1398186 1438700 1479514 1521229 1563619 1605645 1645340 1679674
50127 1679674 1705152 1719090 1720316 1708715 1684631 1649090 1604078 1552035 1495267 1436226 1377719
50116 1377719 1321979 1269705 1220832 1176119 1137041 1104069 1075935 1050845 1027681 1005774 984384
50105 984384 963044 942032 922059 903719 887326 872720 859016 845126 830970 817719 806534
50094 806534 797541 790319 784764 780881 778208 776150 774702 774257 774851 776084 777738 780049 783323 787575 792564
50079 792564 797978 803670 809805 816655 824214 832233 840666 849680 859083 868123 876167 883173 889263 894207
50065 894207 897788 900287 902136 903237 903086 901484 898790 895579 892284 889005 885392 880907 875581 870339
50051 870339 866260 863633 862021 861033 860606 860704 861277 862660 865667 871127 879402 890261 903015 916841 931265
50036 931265 946434 962885 981024 1000763 1021500 1042439 1063223 1084341 1106670 1130536 1155515
50025 1155515 1181223 1207727 1234926 1262125 1288746 1315011 1341228 1366582 1389324 1408108 1422696
50014 1422696 1433544 1441414 1447485 1453029 1458510 1463157 1465485 1463866 1456512 1441571 1417903 1385828 1346997
50001 1346997 1303657 1258144 1212735 1169505 1130101 1095587 1066282 1041560 1019986 1000089 981245
49990 981245 963732 947825 933005 918241 902961 887409 871926 856256 839924 823145 806890
49979 806890 792025 778729 766781 755944 745922 736345 727225 719174 712831 708100 704195 700365 696414
49966 696414 692631 689434 687026 685243 683757 682495 681710 681637 682304 683895 687044 692487 700479 710651 722306
49951 722306 734672 747006 758670 769084 777568 783491 786750 788004 788206 787951 787299 785995 783640 779777
49937 779777 774052 766337 756767 745799 734082 721838 708401 693017 676438 661117 649185 640492
49925 640492 633180 626047 619711 615512 613912 614232 615506 617181 619145 621446 624133 627264 630837 634584
49911 634584 637981 640793 643630 647669 653688 661605 671032 681865 694120 707447 721119 734314 746312
49898 746312 756726 765727 773721 780596 785590 788139 788394 786630 782590 775879 766588 755106 741798 727459
49884 727459 713651 701650 691212 681085 670670 660386 650491 640459 629901 619396 610016 602457
49872 602457 596897 593242 591124 590033 589763 590521 592371 594940 597952 601759 606952 613632 621457 630328 640608
49857 640608 652525 665635 679161 692790 706806 721152 734579 745179 751950 755555 757352 758056
49845 758056 757540 755517 751824 746202 738342 728220 716162 702697 688685 675382 663834 654246 646310
49832 646310 640027 635689 633125 631601 630564 630016 630103 630886 632628 635703 640052 645282 651511 659508 669636
49817 669636 681200 693267 705556 717956 729635 739447 747142 753568 759581 765215 769922 773147 774461
49804 774461 773413 769582 762793 753349 742146 730504 719616 709984 701382 693311 685461 677856 670761
49791 670761 664486 659192 654817 651233 648428 646477 645303 644559 643797 642812 641797 641114 640954 641327 642360 644302
49775 644302 647046 649911 652346 654820 658651 664805 673018 682097 690718 697890 703101 706415 708317 709231
49761 709231 709223 708268 706552 704235 701088 696663 690753 683450 674869 665154 654780 644468 634608 625081 615917
49746 615917 607835 601713 597561 594443 591513 588780 586732 585588 585203 585365 585694 585501 584399 583111 583073 585025
49730 585025 588478 592781 598037 604472 611443 617966 624120 631200 640282 651161 662825 674429 685484
49717 685484 695506 704011 710830 716121 720040 722507 723301 722229 719175 714044 706778 697545 686963 675972
49703 675972 665385 655644 647071 640138 635220 632150 630328 629303 629053 629702 631276 633841 637613 642681
49689 642681 648692 655017 661281 667605 674354 681712 689609 697924 706598 715511 724539 733933 744462 756834
49675 756834 771032 786460 802513 818442 832660 842989 848090 848367 845255 840090 834073 828604 824728
49662 824728 822326 820452 818543 816788 815314 813467 809946 803316 792615 778025 761085 743803 727449
49649 727449 712405 698980 687713 678878 672265 667617 664797 663401 662815 662924 664286 667157 670715 673679
49635 673679 675502 676519 676998 676437 673939 669167 662812 656124 649982 644498 639420 634618 630003 625345 620640
49620 620640 616480 613552 611760 610255 608347 605934 603113 599964 596932 594898 594483 595531 597444 599741
49606 599741 602112 604288 606137 607673 608834 609494 609837 610432 611653 613261 614701 615599 615910 615854 615805 615912 615762
49589 615762 614814 613318 612333 612577 613649 614664 615195 615177 614399 612793 611049 610221 610646 611731 612867 614121
49573 614121 615874 618152 620656 623338 626766 631816 638959 647798 657387 667108 677148 688040 699821
49560 699821 711773 722846 732144 739107 743550 745629 745608 743595 739650 734154 727869 721480 715259 709370
49546 709370 704430 701407 700758 701810 703235 704085 704244 704037 703773 703705 704026 704725 705722 707324 710245 714887 720928
49529 720928 727910 736019 745925 758142 772945 790670 811504 835043 860522 887331 914588 940105
49517 940105 960543 973244 977907 976551 972181 967522 964334 963317 964520 967821 972788 978079 981553 981385
49503 981385 976992 968743 957058 942204 924866 906563 889146 873818 860640 849053 838772 829958
49491 829958 822570 816079 810090 804842 800659 797267 794235 791863 790941 791649 793317 795333 797672 800450 803482
49476 803482 806481 809254 811603 813468 815253 817517 820238 822876 825218 827617 830290 832948 835301 837400
49462 837400 839315 841005 842657 844528 846212 846695 845473 843121 840445 837647 834632 831594 828845 826509
49448 826509 824733 823735 823291 822719 821732 820876 820735 821229 822086 823438 825473 827962 830640 833599 836861 840088
49432 840088 843273 847221 852763 859903 868284 877977 889025 900696 912023 922799 933195 942579 949568
49419 949568 953209 953350 949896 942616 932027 919862 908308 898988 892725 889861 890469 894359 901003 909559
49405 909559 919311 930337 943464 959223 976948 995180 1012805 1029689 1046442 1063712 1081384 1098330
49393 1098330 1113396 1126718 1139423 1151799 1162590 1170610 1176133 1179807 1180985 1178304 1171555 1161864 1150250
49380 1150250 1137112 1123070 1109184 1096078 1083659 1071883 1061094 1051552 1043434 1037379 1034237 1034026
49368 1034026 1035759 1038536 1042144 1046451 1050876 1054791 1057936 1060255 1061673 1062080 1061096 1057994 1052502 1045587
49354 1045587 1038680 1032184 1025585 1019050 1013785 1010497 1008479 1006691 1004866 1003021 1000806 998073 995302 992648
49340 992648 989191 984021 977590 971058 964695 957992 951181 945602 942348 941474 942846 947082 955151 967505
49326 967505 984007 1004254 1027435 1051988 1075848 1096930 1113056 1121763 1121176 1111699 1096389 1078946
49314 1078946 1061314 1043652 1026231 1010299 996615 984146 971164 957350 944080 932855 924235
49303 924235 918148 914280 911936 910343 909518 910276 912992 916839 920665 924197 927835 931530 934517 936170 936687
49288 936687 936668 936255 934919 932150 928093 923273 917812 911438 904550 898763 895733 895656 897512 900683 905593
49273 905593 912654 921361 930821 940675 951018 961758 972425 982425 991214 998444 1004188 1008864 1012807
49260 1012807 1016187 1019520 1023910 1030557 1040267 1053614 1071054 1092329 1115914 1139594 1161606 1180845
49248 1180845 1195938 1204657 1204739 1195342 1177589 1153749 1126123 1096804 1068051 1042115 1020280 1002288
49236 1002288 987038 973743 962323 953059 946381 942746 942161 943855 946860 951000 956867 964830 974524
49223 974524 985339 996932 1009123 1021717 1034597 1047558 1059913 1070674 1079323 1086141 1091695 1096322
49211 1096322 1100205 1103523 1106391 1109065 1112397 1117656 1125676 1136451 1149687 1165270 1182961 1202080 1221816
49198 1221816 1241602 1261008 1279642 1297359 1314183 1329782 1343467 1355060 1365392 1375483 1385502
49187 1385502 1394913 1403363 1411006 1418086 1424638 1430647 1436347 1442501 1450496 1461918 1477809 1498489 1524184
49174 1524184 1555476 1592998 1637020 1687476 1743715 1803546 1862659 1915471 1956754 1982770 1991956
49163 1991956 1985684 1968414 1946148 1923923 1904375 1888198 1875283 1865216 1857208 1850251 1843760 1838078
49151 1838078 1834185 1832732 1833470 1835796 1839725 1845890 1854566 1865141 1876763 1889140 1902441 1916726 1931778
49138 1931778 1947259 1962751 1977871 1992627 2007561 2023266 2039828 2056825 2073730 2090212 2106253
49127 2106253 2122110 2137993 2153756 2169190 2184579 2200628 2217797 2236205 2256238 2278594 2303416
49116 2303416 2330081 2358352 2389258 2424394 2464882 2511713 2566676 2632159 2710091 2801435 2906126
49105 2906126 3022363 3145699 3269485 3386901 3493338 3588040 3673783 3753039 3821779 3866760
49095 3866760 3871698 3829129 3747293 3645098 3539716 3437699 3335715 3227970 3113221 2996626
49085 2996626 2886589 2790099 2710157 2646276 2596333 2557833 2528252 2505279 2487137 2472648 2460944
49074 2460944 2451219 2442674 2434537 2426153 2417227 2408073 2399519 2392399 2387006 2382946 2379449 2375846 2371875 2367710
49060 2367710 2363759 2360356 2357482 2354778 2351902 2348888 2346101 2343945 2342738 2342723 2343977 2346315 2349579 2354038
49046 2354038 2360146 2367796 2376009 2383405 2388669 2390582 2388247 2381762 2372407 2361819 2351172 2341425 2333911
49033 2333911 2329964 2329937 2333071 2338359 2345167 2352981 2361057 2368634 2375308 2381019 2385786 2389498 2391901 2392812 2392582
49018 2392582 2392324 2393403 2396438 2400900 2405734 2410311 2414717 2419297 2424213 2429524 2435490 2442506 2450654 2459517
49004 2459517 2468583 2477691 2486907 2496145 2505203 2514084 2522864 2531209 2538407 2543944 2547729 2549725 2549890 2548643
48990 2548643 2546885 2545184 2543259 2540522 2536775 2532148 2526848 2521329 2516214 2511521 2506389 2500142 2493205 2486285
48976 2486285 2479035 2470492 2460712 2450920 2441891 2433084 2423778 2414253 2405301 2397157 2389641 2383039 2378182 2375634
48962 2375634 2375240 2376494 2379069 2382928 2388168 2394825 2402785 2411916 2422280 2434066 2447198 2461178 2475482
48949 2475482 2490103 2505493 2521992 2539399 2557146 2574813 2592421 2610205 2628259 2646645 2665902
48938 2665902 2687158 2711441 2738915 2769059 2801529 2836574 2874533 2915221 2958021 3002427 3048367
48927 3048367 3096061 3145726 3197401 3250996 3306446 3363875 3423548 3485645 3549983 3615832 3682041
48916 3682041 3747500 3811632 3874416 3935928 3996008 4054431 4111231 4166693 4221032 4274097 4325257
48905 4325257 4373658 4418915 4461702 4503368 4544737 4585510 4624928 4662528 4697764 4729274 4755366
48894 4755366 4775425 4790443 4802041 4811307 4818615 4824058 4827721 4829749 4830342 4829553 4827004 4822042 4814355 4804232
48880 4804232 4792020 4777474 4759868 4738668 4713941 4686023 4654899 4619935 4580302 4535666 4486441
48869 4486441 4433404 4377348 4319211 4260202 4201268 4142491 4083537 4024829 3967841 3913901 3862995
48858 3862995 3814064 3766290 3719750 3674871 3631657 3589680 3548713 3509260 3472352 3438825 3408807
48847 3408807 3382007 3358413 3338437 3322316 3309618 3299650 3292204 3287622 3286066 3287011 3289594 3293364 3298595
48834 3298595 3305922 3315729 3327807 3341490 3356216 3371981 3389166 3407899 3427749 3448158 3468959 3490200
48822 3490200 3511682 3533015 3554074 3574986 3595687 3616007 3636299 3657304 3678973 3700033 3719378
48811 3719378 3737555 3756131 3775859 3796271 3816949 3838169 3860024 3881872 3903320 3925177 3948764
48800 3948764 3974611 4002324 4031345 4061176 4090988 4119629 4146173 4170227 4191817 4211322 4229377
48789 4229377 4246479 4262687 4277984 4292763 4307497 4321915 4334846 4344947 4351256 4353058 4349720 4341072
48777 4341072 4327806 4311138 4291863 4269845 4244606 4216379 4186315 4155432 4123456 4089098 4051394
48766 4051394 4010462 3966992 3921500 3874337 3825945 3776766 3727160 3677675 3629097 3581909 3536002
48755 3536002 3491254 3448102 3407172 3368621 3332254 3298003 3265745 3234786 3204149 3173502 3143465
48744 3143465 3114998 3088799 3065222 3044364 3026144 3010560 2997918 2988538 2982222 2978234 2975758 2974200
48732 2974200 2973108 2972172 2971345 2970748 2970465 2970594 2971457 2973512 2977036 2981957 2987931 2994503 3001414 3008840 3016985
48717 3016985 3025233 3032151 3036814 3039850 3042622 3045635 3048369 3050550 3052801 3055821 3059513 3063230 3066507 3069283
48703 3069283 3071745 3074265 3077314 3081230 3086076 3091743 3097970 3104252 3110009 3114988 3119421 3123792 3128563 3134024
48689 3134024 3140016 3145760 3150247 3153064 3154753 3156299 3158360 3161072 3164395 3168426 3173215 3178347 3182962 3186430
48675 3186430 3188825 3190438 3190924 3189536 3186283 3182202 3178108 3173680 3168321 3162354 3156513 3150429 3142508 3131369
48661 3131369 3116770 3099042 3078289 3054378 3027180 2996505 2962118 2924109 2883160 2840431 2797434
48650 2797434 2755877 2717214 2682189 2651005 2623716 2599934 2578309 2557053 2535326 2513621 2492491
48639 2492491 2471425 2449462 2426569 2403817 2382239 2361944 2342398 2323144 2303927 2284337 2263761
48628 2263761 2241973 2219551 2197375 2175785 2154555 2133733 2113995 2095900 2079216 2063421 2048598
48617 2048598 2035403 2024322 2015391 2008574 2003933 2001421 2000859 2002036 2004467 2007047 2008330 2007337 2003960 1998744
48603 1998744 1992562 1986390 1980973 1976560 1973094 1970575 1968992 1968014 1966998 1965332 1962597 1958545 1953094 1946198
48589 1946198 1937579 1926860 1914234 1900705 1887308 1874277 1861304 1848342 1835740 1823785 1812508
48578 1812508 1801848 1791742 1782275 1773978 1767602 1763244 1760145 1757805 1756850 1758212 1761831 1766798 1772392 1778298
48564 1778298 1784088 1789210 1793169 1795072 1793358 1786927 1776324 1762992 1747750 1730990 1714006 1698731
48552 1698731 1686062 1675564 1666888 1660101 1654294 1647294 1637541 1625466 1612390 1598911 1585003 1570833
48540 1570833 1556636 1542382 1528300 1515268 1503941 1493875 1484270 1475361 1468392 1464228 1462436 1461823 1461682
48527 1461682 1462597 1466166 1473802 1485781 1501567 1520801 1543303 1567929 1591931 1611582 1623167 1623667
48515 1623667 1611762 1589103 1560228 1530487 1503728 1481748 1465210 1454450 1449547 1450082 1454985 1462767
48503 1462767 1472223 1483073 1495720 1510327 1526419 1543477 1561556 1580939 1600954 1618877 1630076
48492 1630076 1629975 1616775 1592433 1560935 1525929 1490134 1455870 1424743 1396867 1371500 1348561 1328707
48480 1328707 1312029 1297800 1285706 1276244 1269476 1264268 1259331 1254376 1249816 1245949 1242831 1240421 1238435
48467 1238435 1236470 1234562 1233213 1232752 1233168 1234657 1237668 1242184 1247532 1253094 1258686 1264087 1268806 1272446
48453 1272446 1274669 1274750 1271966 1266681 1260316 1253943 1247519 1240711 1233732 1226987 1220487 1213943 1206970 1199024
48439 1199024 1189644 1178921 1167310 1155096 1142647 1130946 1120928 1112303 1103976 1095628 1087881 1080896
48427 1080896 1074013 1067026 1060561 1054839 1049250 1043585 1038554 1034410 1030157 1024863 1018899 1013158 1007853 1002767
48413 1002767 997965 993478 988844 983636 978096 972819 968142 964026 960118 955859 951133 946813 943948 942424
48399 942424 941251 940047 939289 939203 939545 940480 942383 944646 945927 945772 944813 943329 941076 938641 937339 937371
48383 937371 937608 937610 938324 940338 943044 946048 949794 954168 958051 960923 963492 966198 968703 971370 975484
48368 975484 981346 987856 994665 1003014 1013847 1026987 1042809 1062491 1085665 1109870 1133272 1155698
48356 1155698 1175912 1190457 1196989 1196971 1193626 1189156 1185341 1184648 1188723 1197135 1209020 1224515 1243615
48343 1243615 1265486 1289950 1317841 1349184 1383353 1421605 1466680 1519075 1576911 1640392 1712912
48332 1712912 1796694 1891394 1998505 2122938 2268729 2438077 2636815 2875831 3164835 3510305
48322 3510305 3922236 4416882 5010369 5717596 6561871 7578298 8805072 10283200 12068450
48313 12068450 14220495 16752748 19586877 22552010 25396729 27774607 29258309 29471130
48305 29471130 28291871 25953195 22927005 19699774 16620940 13884252 11568949 9674183
48297 9674183 8148786 6927066 5951860 5174340 4549617 4041724 3626683 3285980 3001985
48288 3001985 2762003 2560156 2391280 2247326 2122117 2014695 1924876 1849315 1784338 1728878
48278 1728878 1682042 1641030 1603835 1571318 1544596 1522730 1504515 1490135 1479554 1471449 1464979 1460562
48266 1460562 1457937 1455655 1453377 1452525 1453857 1456631 1460806 1467725 1477682 1489096 1501005 1514036 1527789
48253 1527789 1539293 1545296 1544414 1536406 1521477 1501446 1479722 1458849 1439348 1421447 1406078 1393368
48241 1393368 1382063 1371493 1362415 1355052 1348050 1340484 1333296 1327604 1323061 1318979 1315633 1313192 1310598
48228 1310598 1306708 1301633 1295923 1289351 1281470 1272570 1263227 1253510 1243081 1231292 1216926 1198956 1177999
48215 1177999 1155900 1133478 1109872 1084646 1059095 1034656 1011234 988080 965370 943890 923863
48204 923863 904910 886705 869115 852223 836524 822431 809402 796406 783521 772062 762745 754744
48192 754744 747026 739684 733326 727966 723134 718437 713652 708847 704598 701398 698749 695653 692056 688799
48178 688799 686115 683377 680520 678412 677387 676619 675502 674473 673881 673104 671488 669289 667079 665083 663559
48163 663559 662906 662879 662617 661960 661800 662587 663404 663120 661668 659694 657841 656787 657025 658013 658492 658188 658274 659629
48145 659629 661667 663506 665210 667090 668751 669742 670354 670926 671138 670802 670571 671042 671774 672059 672062 672421 673330 674772
48127 674772 677040 680198 683478 685971 687575 688713 689625 690528 691877 693773 695642 697094 698608 700770 703331
48112 703331 705753 708198 711368 715732 721413 728339 736036 743854 751921 761232 772183 783699 794512
48099 794512 804703 815199 826356 837922 849964 862872 876673 891070 905931 921120 936184
48088 936184 950844 965524 980735 996230 1011432 1026370 1041464 1056563 1070898 1084010 1096116
48077 1096116 1107596 1118537 1128785 1138172 1146783 1155173 1164089 1173786 1183931 1194299 1205106 1216469
48065 1216469 1228124 1239946 1252143 1264475 1275872 1285350 1292847 1298787 1303366 1306726 1309185 1310691 1310546
48052 1310546 1308222 1303933 1297937 1289950 1279936 1268841 1257693 1246441 1234526 1222132 1209928 1197811
48040 1197811 1184806 1170201 1154062 1136736 1118551 1099972 1081504 1063370 1045582 1028099 1010623
48029 1010623 992638 974146 955964 938719 921935 904763 887237 870186 854231 839522 826095
48018 826095 813686 801482 788872 776305 764714 754300 744622 735604 727524 720120 712710 705365 699070
48005 699070 694396 690652 686656 681920 676869 672291 668702 666000 663702 661779 660968 661785 663475 664628 664755
47990 664755 664505 664366 663978 663003 661868 661118 660518 659324 657267 654882 652964 651918 651523 651166 650320 648903
47974 648903 647152 645276 643379 641603 640094 638867 637863 637093 636531 636012 635475 635178 635364 635740 635629 634657
47958 634657 633065 631417 630231 629892 630611 632337 634777 637529 640283 643102 646551 651209 656860 662518 667619
47943 667619 672908 679682 688308 697893 707313 716128 724553 733038 741959 751369 760846 769815 778082 785855
47929 785855 793248 800049 805957 810753 814126 815703 815474 813986 811865 809257 806006 802245 798418 794626
47915 794626 790347 785100 779121 772922 766357 758758 750131 741553 734035 727507 721415 715781 711048 707204
47901 707204 703835 700859 698507 696713 695258 694450 694911 696680 699232 702361 706224 710471 714263 717406 720663
47886 720663 724713 729561 735216 742039 749952 758110 765839 773319 780907 788495 795899 803147 809916 815425
47872 815425 819423 822610 825576 827916 828907 828369 826382 822893 818171 812912 807355 801007 793773 786379 778987
47857 778987 770488 760182 749253 739333 730344 721059 711239 701801 693245 685292 677943 671604 666244 661630
47843 661630 658372 657495 658759 660509 661447 661746 662277 663619 666040 669605 674010 678903 684439 690869 697603
47828 697603 703522 708341 712900 717990 723627 729606 735947 742502 748833 754846 761095 768216 776497 786051
47814 786051 796898 808756 821293 834729 849771 866888 886037 907017 929524 952874 976221
47803 976221 999072 1021070 1041369 1058835 1072857 1083394 1090281 1093168 1092119 1087604 1079836 1068768
47791 1068768 1054775 1038783 1021689 1004222 987293 971747 957726 944875 933125 922657 913338
47780 913338 905050 898459 894396 892350 890618 888172 885477 883172 880909 877963 874160 869741 864943 860067
47766 860067 855284 850019 843276 834957 826131 817664 809381 801002 792995 785831 779160 772584 766693 762470
47752 762470 759989 758478 757445 757029 757331 757992 758586 759246 760824 764416 770403 777952 785862 793927 802941
47737 802941 813313 824420 835631 847182 859590 872849 886760 901492 917131 933039 948328
47726 948328 962675 976223 988964 1000725 1011409 1020655 1027566 1031429 1032677 1032611 1032139 1031060 1028434 1023422
47712 1023422 1015882 1006442 995826 984004 970365 954852 938470 922358 906902 892234 878996 867842
47700 867842 858452 849829 841485 833760 827119 821788 818074 816336 816464 817909 820420 824355 830034 837150
47686 837150 845066 853517 862812 873440 885548 898759 912478 926459 940948 956166 971717 986737
47674 986737 1000620 1013436 1025659 1037595 1049029 1059294 1067707 1074007 1078366 1080939 1081609 1080191 1076671
47661 1076671 1071067 1063295 1053426 1041962 1029599 1016758 1003600 990438 977778 965777 953857 941179
47649 941179 927605 914068 901836 891480 882642 874738 867584 861364 856413 853219 852260 853439 856000
47636 856000 859383 863951 870433 878907 888922 900411 913783 929160 946232 965006 985956 1009175
47624 1009175 1034009 1059850 1086716 1114645 1142977 1170632 1196629 1219901 1238983 1252485 1259809
47613 1259809 1261171 1257111 1248124 1234406 1215649 1191421 1162070 1128964 1093552 1056568 1018518 980509
47601 980509 943996 909829 878039 848458 821209 796646 775142 756832 741224 727205 713822
47590 713822 701045 689515 679641 671258 664041 657771 652109 646510 640635 634770 629661 625892 623431 621714
47576 621714 620130 618375 616356 613974 611286 608724 606780 605361 603799 601615 599016 596463 594037 591448
47562 591448 588463 585120 581634 578258 575155 572363 569936 568028 566555 564933 562587 559741 557174 555087
47548 555087 552781 549798 546808 544849 543971 543203 541792 540044 538916 539013 540034 541058 541402 541156 540797 540448
47532 540448 539895 539239 538904 538835 538307 536946 535477 534931 535440 536318 537085 537882 538973 540354 541897 543529 545249
47515 545249 547138 549266 551304 552484 552288 551140 550047 549598 549618 549810 550297 551360 552952 554688 556267 557653
47499 557653 558923 560105 561249 562456 563631 564297 564029 563150 562631 563084 564183 565331 566508 567997 569660
47484 569660 571143 572599 574477 576684 578685 580392 582243 584396 586689 589450 593423 598607 604028 608961
47470 608961 613484 617522 620491 622566 625199 629362 633975 637204 638781 639969 641564 643051 643677 643428 642822
47455 642822 642423 642616 643325 644042 644588 645617 647762 650638 653479 656592 661277 668286 677165 687245 698491
47440 698491 711161 725329 741018 758268 776789 795974 815439 835166 854998 874484 893295
47429 893295 911233 927594 941099 950914 957383 961355 963052 962072 958331 952506 945387 937133 927480 916565
47415 916565 905195 894057 882921 871006 858084 844751 831656 818982 806864 795649 785341
47404 785341 775392 765547 756388 748453 741330 734343 727661 721784 716278 710170 703664 698377 695578 694983
47390 694983 695618 696978 698867 700846 702614 704630 707778 712570 719013 726932 735954 745338 754324 762749
47376 762749 771088 779886 789195 798475 806849 813595 818596 822283 825049 826710 826669 824605 820876 816138 810571
47361 810571 803633 794704 783886 771897 759305 746275 733070 720183 707652 694805 681229 667625
47349 667625 655121 644014 633803 624203 615352 607127 599102 591446 585128 580762 577704 574658 570943
47336 570943 566916 563407 561046 559955 559837 560367 561500 563317 565649 568141 570700 573570 576870 580378 583856
47321 583856 587320 590757 593816 596005 597196 597816 598496 599519 600582 601144 600997 600297 599066 597040 594224
47306 594224 591187 588436 585833 583092 580627 579210 578869 578751 578222 577664 577985 579726 582749 586454 590138
47291 590138 593499 596967 601401 607369 614892 623809 634043 645513 658087 671746 686594 702726 720270
47278 720270 739483 760469 782805 805618 827772 847573 862564 870452 870645 864766 855558 845474
47266 845474 836007 827651 820184 813257 806857 801134 795971 791138 786672 782616 778484 773572 767796 761568
47252 761568 754884 747260 738800 730611 723785 718501 714418 711318 708905 706536 703749 700818 698359 696577
47238 696577 695308 694581 694685 695845 698078 701234 704943 708765 712661 717145 722691 729145 735958 742808 749717
47223 749717 756797 764262 772634 782588 794423 807643 821039 833231 843476 852061 859697 866456 871561
47210 871561 874360 875118 874563 872913 869717 864517 857360 848756 839392 829897 820661 811794 803294 795202 787569
47195 787569 780412 773793 767835 762650 758397 755483 754452 755532 758407 762525 767483 773077 779243 786167
47181 786167 794208 803484 813663 824469 836339 850235 866660 885045 904291 923797 943658 963849
47169 963849 983606 1001994 1018878 1034800 1049888 1063468 1074944 1084508 1092572 1098891 1102776 1103869
47157 1103869 1102220 1097894 1091075 1082433 1072815 1062599 1051760 1040425 1028919 1017455 1006269 995828
47145 995828 986330 977182 967711 958254 949795 942669 936490 931390 928293 927649 928723 930482 932552 935016
47131 935016 938092 942346 948456 956241 964552 972563 980497 988580 996025 1001797 1005867 1008929 1011180 1012029
47117 1012029 1010713 1006702 999812 990546 980059 969245 958088 946329 934358 922774 911367 899338
47105 899338 886494 873626 861651 850868 841038 831714 822456 813117 803980 795332 786971 778482 769910
47092 769910 761832 754697 748408 742585 737053 732096 728318 726126 725294 725262 725952 727842 731043 734816 738457
47077 738457 742268 747008 752596 757968 762224 765488 768626 772465 777189 782143 786246 788915 790549 791946
47063 791946 793415 794687 795434 795513 794980 794226 793883 794126 794326 793913 793407 793943 795851 798339 800679 803141 806599
47046 806599 811643 818270 826010 834093 841754 848658 855046 861448 868330 875845 883719 891438 898727 905705
47032 905705 912403 918562 924310 930620 938384 947150 955506 962771 969615 976922 984784 992891 1001222 1009785
47018 1009785 1018098 1025431 1031351 1035672 1038160 1038719 1037688 1035552 1032559 1028901 1025011 1021086 1016487 1010339
47004 1010339 1002919 995843 990505 986721 983295 979558 975734 972052 968386 965020 963011 963124 964738 966441
46990 966441 967591 968782 970848 974068 978398 983833 990160 996870 1003706 1011005 1019166 1028148 1037874 1048791
46976 1048791 1061385 1075269 1089298 1102720 1115701 1128572 1140936 1151981 1161528 1170441 1179802 1189811
46964 1189811 1199621 1208256 1215426 1221345 1226103 1229594 1231946 1233521 1234439 1234618 1234423 1234736 1235952 1237299 1237633
46949 1237633 1236716 1235357 1234484 1234522 1235526 1237403 1239945 1242956 1246467 1250590 1255183 1259904 1264635 1269648 1275283
46934 1275283 1281657 1288782 1296846 1306170 1316809 1328199 1339352 1349561 1358872 1367777 1376585 1385346 1394137
46921 1394137 1402869 1410780 1416721 1420161 1421481 1420994 1418202 1412435 1403837 1393161 1380864 1366914 1351453
46908 1351453 1335156 1318918 1303504 1289455 1277025 1266145 1256620 1248382 1241541 1236424 1233668 1233962 1237422
46895 1237422 1243429 1251375 1261379 1273988 1289361 1307104 1326793 1348312 1371581 1396096 1420793 1444466
46883 1444466 1466529 1487333 1507406 1526415 1543285 1557396 1569050 1578675 1586228 1591731 1595728 1598723
46871 1598723 1600772 1602188 1604046 1607210 1611279 1615277 1619129 1623716 1629718 1637199 1646182 1656805 1668853
46858 1668853 1681844 1695650 1710529 1726479 1743064 1759840 1776436 1792256 1806622 1819260 1830190
46847 1830190 1839223 1846017 1850518 1852887 1853060 1850967 1847020 1841775 1835229 1827072 1817611 1807732 1797921 1788007
46833 1788007 1778005 1768574 1760502 1754228 1749927 1747501 1746467 1746540 1748417 1753313 1761453 1771669 1782742 1794619
46819 1794619 1808052 1823543 1840843 1858956 1876458 1892359 1906906 1921017 1934674 1946535 1955455
46808 1955455 1961711 1966193 1968914 1969033 1966106 1960696 1953777 1945948 1937225 1927350 1916300 1904613 1893137
46795 1893137 1882329 1871935 1861428 1850673 1840158 1830702 1822878 1816465 1810603 1804728 1799290 1795236 1792984
46782 1792984 1792321 1793071 1795173 1798109 1800985 1803439 1805927 1808904 1812181 1815301 1818087 1820632 1823106 1825719
46768 1825719 1828525 1831302 1834090 1837774 1843359 1850618 1858241 1865513 1872994 1881268 1890120 1899564 1910711 1924571
46754 1924571 1940548 1957102 1973580 1990409 2007718 2024817 2041215 2057294 2073542 2089574 2104270
46743 2104270 2116689 2126660 2134671 2141327 2146883 2151240 2154323 2156323 2157521 2158088 2158151 2157877 2157403 2156919 2156835 2157642
46727 2157642 2159562 2162632 2167079 2173125 2180338 2187798 2195170 2203059 2211908 2221120 2229717 2237405 2244421 2250722
46713 2250722 2255903 2259630 2261549 2261073 2257864 2252356 2245119 2235815 2223478 2207837 2189769 2170324 2149829
46700 2149829 2128052 2104724 2079682 2052966 2025049 1996680 1968300 1939882 1911518 1883823 1857484
46689 1857484 1832581 1808712 1785631 1763443 1742223 1721836 1702340 1684283 1668184 1653758 1640029
46678 1640029 1626407 1613367 1601734 1591488 1581672 1571541 1561446 1552509 1545622 1540798 1537276 1534224
46666 1534224 1531573 1530177 1530971 1534033 1538774 1544914 1552751 1562379 1573199 1584497 1596118 1608211 1620538
46653 1620538 1632386 1643107 1652589 1661252 1669552 1677301 1683474 1686998 1687713 1686332 1683602 1680040 1676312 1673152
46639 1673152 1670684 1668470 1666550 1665867 1667377 1671313 1677678 1686824 1698997 1713847 1730975 1750573 1772866
46626 1772866 1797195 1822266 1847139 1871483 1895008 1917112 1937009 1953849 1966860 1975747 1980751 1982103
46614 1982103 1979676 1973451 1963844 1951135 1935022 1915343 1892966 1869419 1845787 1822377 1799166 1776033
46602 1776033 1752874 1730086 1708665 1689288 1671533 1654694 1639021 1625372 1613814 1603391 1593254
46591 1593254 1583238 1573371 1563685 1554645 1546918 1540370 1533927 1526683 1518676 1510367 1502026 1493918 1486481 1479891
46577 1479891 1473782 1467702 1461517 1455216 1448804 1442639 1437388 1433296 1429886 1426727 1424144 1422739 1422530 1423022
46563 1423022 1423894 1425145 1426654 1428086 1429284 1430425 1431652 1432790 1433602 1434247 1435309 1437294 1440157 1443425 1446821
46548 1446821 1450602 1455275 1461184 1468423 1476811 1485664 1493963 1501261 1508366 1516651 1526714 1538067 1550072
46535 1550072 1562653 1576078 1590618 1606631 1624459 1643994 1664699 1686343 1709336 1734007 1759915
46524 1759915 1786330 1813258 1841584 1872145 1904804 1938366 1971300 2002677 2032605 2061681 2089977
46513 2089977 2116691 2140794 2161777 2179633 2194438 2206224 2215181 2221693 2226190 2229044 2230468 2230487 2229152
46500 2229152 2226907 2224496 2222270 2219783 2216305 2211644 2206246 2200608 2194851 2188780 2182102 2174545 2166001 2156543
46486 2156543 2146147 2134410 2120760 2104930 2087073 2067390 2045858 2022392 1997010 1969694 1940303
46475 1940303 1908818 1875594 1841222 1806211 1770981 1736057 1702034 1669398 1638615 1610327 1585128
46464 1585128 1563019 1543389 1525808 1510673 1498882 1490980 1486851 1486056 1488178 1492836 1499716 1508726 1519990
46451 1519990 1533654 1549741 1568009 1587687 1607466 1626086 1643014 1658355 1672147 1684100 1694002
$$ [...]
##END NTUPLES=NMR SPECTRUM
##END=
