
##TITLE=AC1250_VIERS11068_6528270_Fyvpdd1UNC
##JCAMPDX= 6.0         $$ Bruker NMR JCAMP-DX V2.0
##DATA TYPE= NMR SPECTRUM
##DATA CLASS= NTUPLES
##ORIGIN= BRUKER
##OWNER= Administrator
$$ 1.72 TOPSPIN		Version 2.1
$$ 2012-07-15 12:23:07.156 -0500  Administrator@TOPSPIN
$$ Compression mode = diff/dup
##.OBSERVE FREQUENCY= 400.02188249412
##.OBSERVE NUCLEUS= ^1H
##.ACQUISITION MODE= SIMULTANEOUS (DQD)
##.ACQUISITION SCHEME= undefined
##.AVERAGES= 8
##.DIGITISER RES= 22
##SPECTROMETER/DATA SYSTEM= spect
##.PULSE SEQUENCE= zg30
##.SOLVENT NAME= COFFEE_meoh
##.SHIFT REFERENCE= INTERNAL, COFFEE_meoh, 1, 14.98509
##AUDIT TRAIL= $$ (NUMBER, WHEN, WHO, WHERE, PROCESS, VERSION, WHAT)
$$ ##TITLE= Audit trail, TOPSPIN		Version 2.1
$$ ##JCAMPDX= 5.01
$$ ##ORIGIN= Bruker BioSpin GmbH
$$ ##OWNER= Administrator
$$ $$ C:\Bruker\TOPSPIN/data/COFFEE/nmr/AC1250_VIERS11068_6528270_Fyvpdd1UNC/10/pdata/1/auditp.txt
$$ ##AUDIT TRAIL=  $$ (NUMBER, WHEN, WHO, WHERE, PROCESS, VERSION, WHAT)
(   1,<2012-07-15 12:23:00.031 -0500>,<Administrator>,<TOPSPIN>,<go>,<TOPSPIN 2.1>,
      <created by zg
	started at 2012-07-15 12:21:53.484 -0500,
	POWCHK enabled, PULCHK disabled,
       configuration hash MD5:
       6B 1B 68 BB D9 2E 58 E2 7F 35 AD 54 07 DF 0E 41
       data hash MD5: 64K
       99 DA C6 FB C6 64 DF 12 D6 65 5E DE AD E6 AD 07>)
(   2,<2012-07-15 12:23:02.890 -0500>,<Administrator>,<TOPSPIN>,<proc1d>,<TOPSPIN 2.1>,
      <Start of raw data processing
       efp LB = 0 FT_mod = 6 PKNL = 1 PHC0 = 0 PHC1 = 0 SI = 32K 
       data hash MD5: 32K
       2D 1A 37 32 C9 4A B6 9B 54 F9 65 D7 49 02 6A 53>)
(   3,<2012-07-15 12:23:03.265 -0500>,<Administrator>,<TOPSPIN>,<proc1d>,<TOPSPIN 2.1>,
      <pk PHC0 = 174.0289 PHC1 = 0 
       data hash MD5: 32K
       BC AB B5 A1 FB EC 17 A4 B4 44 F3 5C CA E7 5C 7A>)
(   4,<2012-07-15 12:23:03.312 -0500>,<Administrator>,<TOPSPIN>,<proc1d>,<TOPSPIN 2.1>,
      <abs ABSG = 1 
       data hash MD5: 32K
       36 EC D6 97 1E FE 93 EF 41 CD C3 87 C0 38 5C 9E>)
(   5,<2012-07-15 12:23:03.343 -0500>,<Administrator>,<TOPSPIN>,<proc1d>,<TOPSPIN 2.1>,
      <abs ABSG = 2 
       data hash MD5: 32K
       58 55 7A 6C 4A 61 5A 42 1C 7D B0 3E 6C 89 63 A8>)
(   6,<2012-07-15 12:23:03.375 -0500>,<Administrator>,<TOPSPIN>,<proc1d>,<TOPSPIN 2.1>,
      <abs ABSG = 3 
       data hash MD5: 32K
       E0 DC CE AF E2 92 CE 67 59 E3 C7 CE 9F 8E EA B4>)
(   7,<2012-07-15 12:23:03.406 -0500>,<Administrator>,<TOPSPIN>,<proc1d>,<TOPSPIN 2.1>,
      <abs ABSG = 4 
       data hash MD5: 32K
       1B 9E 66 9D 90 97 16 71 50 55 FD DA 50 61 7A 53>)
(   8,<2012-07-15 12:23:03.437 -0500>,<Administrator>,<TOPSPIN>,<proc1d>,<TOPSPIN 2.1>,
      <abs ABSG = 5 
       data hash MD5: 32K
       32 56 28 25 19 3C 0B 84 B2 F8 A5 0F C5 F2 9C 9A>)
$$ ##END=
$$ 
$$ $$ hash MD5
$$ $$ 61 25 09 3F 94 00 91 A6 F2 9C 10 E8 35 5A 7C 93
##$RELAX= 
##$RELAX= 
##$RELAX= 
##$RELAX= 
##$RELAX= 
##$RELAX= 
##$RELAX= 
$$ Bruker specific parameters
$$ --------------------------
$$ [...]
150 150 150 150 150 150 150 150
##$TP07= 0
##$TPNAME0= <>
##$TPNAME1= <>
##$TPNAME2= <>
##$TPNAME3= <>
##$TPNAME4= <>
##$TPNAME5= <>
##$TPNAME6= <>
##$TPNAME7= <>
##$TPOAL= (0..7)
0.5 0.5 0.5 0.5 0.5 0.5 0.5 0.5
##$TPOFFS= (0..7)
0 0 0 0 0 0 0 0
##$TUNHIN= 0
##$TUNHOUT= 0
##$TUNXOUT= 0
##$USERA1= <user>
##$USERA2= <user>
##$USERA3= <user>
##$USERA4= <user>
##$USERA5= <user>
##$V9= 5
##$VALIST= <valist>
##$VCLIST= <CCCCCCCCCCCCCCC>
##$VD= 0
##$VDLIST= <DDDDDDDDDDDDDDD>
##$VPLIST= <PPPPPPPPPPPPPPP>
##$VTLIST= <TTTTTTTTTTTTTTT>
##$WBST= 2048
##$WBSW= 25
##$XGAIN= (0..3)
0 0 0 0
##$XL= 0
##$YL= 0
##$YMAX_a= 514801
##$YMIN_a= -647148
##$ZGOPTNS= <>
##$ZL1= 120
##$ZL2= 120
##$ZL3= 120
##$ZL4= 120
##$ABSF1= 14.98509
##$ABSF2= -5.573092
##$ABSG= 5
##$ABSL= 3
##$ALPHA= 0
##$AQORDER= 0
##$ASSFAC= 0
##$ASSFACI= 0
##$ASSFACX= 0
##$ASSWID= 0
##$AUNMP= <proc_prof1d_extract_pilot.lims>
##$AXLEFT= 0
##$AXNAME= <>
##$AXNUC= <1H>
##$AXRIGHT= 0
##$AXTYPE= 0
##$AXUNIT= <>
##$AZFE= 0.1
##$AZFW= 0.1
##$BCFW= 0
##$BC_mod= 0
##$BYTORDP= 0
##$COROFFS= 0
##$CY= 15
##$DATMOD= 1
##$DC= 0
##$DFILT= <>
##$DTYPP= 0
##$F1P= 0
##$F2P= 0
##$FCOR= 0.5
##$FTSIZE= 32768
##$FT_mod= 6
##$GAMMA= 0
##$GB= 0
##$INTBC= 1
##$INTSCL= 1
##$ISEN= 128
##$LB= 0
##$LEV0= 0
##$LPBIN= 0
##$MAXI= 10000
##$MC2= 0
##$MEAN= 0
##$ME_mod= 0
##$MI= 0
##$NCOEF= 0
##$NC_proc= -8
##$NLEV= 6
##$NOISF1= 0
##$NOISF2= 0
##$NSP= 0
##$NTH_PI= 0
##$NZP= 0
##$OFFSET= 14.98509
##$PC= 1
##$PHC0= 174.0289
##$PHC1= 0
##$PH_mod= 1
##$PKNL= yes
##$PPARMOD= 0
##$PPDIAG= 0
##$PPIPTYP= 0
##$PPMPNUM= 2147483647
##$PPRESOL= 1
##$PSCAL= 4
##$PSIGN= 0
##$PYNMP= <proc.py>
##$REVERSE= no
##$SF= 400.02
##$SI= 32768
##$SIGF1= 0
##$SIGF2= 0
##$SINO= 400
##$SIOLD= 32768
##$SPECTYP= <>
##$SREGLST= <1H.CDCl3>
##$SSB= 0
##$STSI= 32768
##$STSR= 0
##$SW_p= 8223.68421052631
##$SYMM= 0
##$S_DEV= 0
##$TDeff= 65536
##$TDoff= 0
##$TI= <>
##$TILT= no
##$TM1= 0
##$TM2= 0
##$TOPLEV= 0
##$USERP1= <user>
##$USERP2= <user>
##$USERP3= <user>
##$USERP4= <user>
##$USERP5= <user>
##$WDW= 1
##$XDIM= 32768
##$YMAX_p= 474384778
##$YMIN_p= -696574
##$CURPLOT= <Network HP LaserJet P1505>
##$CURPRIN= <$Network HP LaserJet P1505>
##$DFORMAT= <normdp>
##$LAYOUT= <+/1D_H.xwp>
##$LFORMAT= <normlp>
##$PFORMAT= <normpl>
##$SURQMSG= 1
$$ End of Bruker specific parameters
$$ ---------------------------------
##NTUPLES= NMR SPECTRUM
##VAR_NAME=  FREQUENCY,     SPECTRUM/REAL,   SPECTRUM/IMAG
##SYMBOL=    X,             R,               I
##VAR_TYPE=  INDEPENDENT,   DEPENDENT,       DEPENDENT
##VAR_FORM=  AFFN,          ASDF,            ASDF
##VAR_DIM=   32768,         32768,           32768
##UNITS=     HZ,            ARBITRARY UNITS, ARBITRARY UNITS
##FACTOR=    0.250966925370066, 1,           1
##FIRST=     8223.43324360094, -1118,        -146308
##LAST=      0,             -30225,          -158738
##MIN=       0,             -696574,         0
##MAX=       8223.43324360094, 474384778,    0
$$ Real data points
##PAGE= N=1
##DATA TABLE= (X++(R..R)), XYDATA
$$ [...]
23816 -152672 182810 85974 -137468 -155886 -179407 57556 -14370 104738 -102394 -60674 139968
23804 -176486 -67889 6547 -274702 235064 25784 320615 -18967 -48496 53194 -78447 159469
23792 226878 91653 -207718 -137621 286053 -401281 -107358 -163649 4717 -300375 -372245 -71365
23780 -341705 3708 282530 150529 -118237 -119873 -44118 243201 -167489 218610 -167114
23769 -124797 -3127 125242 264868 -170991 -194104 166904 -166430 -56415 118436 105562
23759 105562 -201893 97753 29252 34788 -92421 -118652 18889 313034 40329 84765 115269
23748 115269 -62359 -129657 -12544 73371 146040 -66767 -78155 -226810 -216408 45054 -116995
23736 -50110 86393 7310 -44005 89062 2852 -132504 -47204 -5073 94280 -309275 -146211 273459
23723 26444 56052 -32325 -7985 97504 -216561 259207 54680 -188943 92667 26143 -280691
23711 -8270 6351 208847 -80047 -7946 334240 -230379 43679 433 254834 21067 26574 -156519
23698 -208463 -44153 133649 31503 -56825 -169604 81723 -204438 -307564 211453 112005
23688 112005 -229132 -169813 -103030 143780 35328 134982 -117222 -43952 -213463 -195907 99480
23676 202252 85563 -212520 52828 203003 75899 140186 -52860 145683 11334 -68830 -3372
23664 227405 89572 160940 -52272 -173269 -53181 -187332 -91878 100445 -2370 -114459 96931
23652 -12406 -28137 -17009 305457 293208 -59638 133870 58851 -59805 40490 -141771 -212182
23641 -212182 -98541 -150534 246225 207401 -118616 -58462 -405847 14489 -29770 -256393 -13504
23629 -442077 -276838 -77571 -63958 -79645 67524 46183 -8787 57965 2817 107538 -67800
23617 -28389 -299125 -16394 -194180 -153901 25029 115754 -13666 -416876 -73397 29690 -57268
23605 -13158 55000 -234315 -255475 -275697 166200 -53159 -5259 93691 -95556 14795 290370
23594 290370 66101 -55446 26478 -45103 -21676 -207979 8122 -193470 -225357 315968 -75781
23582 82774 76107 35779 111600 270002 -74052 -126475 -73358 -173047 7681 -179283 101711
23570 -5965 -242738 297891 -25048 -91227 46600 -78738 102334 -421637 157111 199424 52352
23558 54631 -190567 68526 -89692 -98305 108198 -117098 116183 92699 95693 17406 -22320
23546 -88091 126551 69459 21201 38696 86347 -16787 149467 -305271 176787 -91706 143429
23534 117013 -38882 30935 -235348 310960 32575 195010 190274 -194253 -186440 31662 -116718
23522 30004 17881 -253198 -29430 -95180 -78745 -62723 -185923 -102745 -128596 -144098 57905
23510 -48167 64867 28900 139594 60562 -305389 110478 136718 25762 -63271 -234546 63555
23498 232646 -212797 72185 170968 -18923 198819 12315 -34381 188425 -14379 -14789 288815
23486 48886 -29573 -42380 990 -7926 324509 -28151 -122016 -294377 69563 -72077 55386 4048
23473 361245 -99971 149462 276181 -64906 328792 -33665 -111882 -216438 -6030 66094 201680
23462 201680 -245522 -75081 -210644 -87263 80871 -80589 -55262 -44504 -39552 -199669 -83694
23450 71156 -101665 -195001 151304 73162 121017 19033 158344 -225416 -235924 -131034 -89707
23439 -89707 144220 -124665 5077 -306879 175917 263177 -122986 308924 31976 254379
23429 254379 -187700 184513 -101560 -245451 250265 -93145 -16227 -86289 104663 -86432
23418 233430 -194586 -202800 -157858 -258123 119948 -146540 -33403 -238892 -69871 -195484
23408 -195484 85728 -182749 84745 -155371 229804 -9864 50309 -270727 -87659 -10008 -26206
23397 -26206 -147952 173635 -107974 -147552 -155344 -75082 -39063 -79048 113622 -35604 329232
23385 -101089 -152698 -65455 28538 60422 87780 -159898 24550 108376 317018 -262608 -92110
23373 -73255 169245 123430 -408644 -226932 68789 -46306 44748 -43573 -66278 -22720 -201642
23362 -201642 -99555 60792 238822 -98485 -247766 -101349 -8226 98948 -112752 -6776 -55512
23351 -55512 -30214 -55761 -209171 -137927 593 168171 392116 -22343 -204580 -94969 -139748
23340 -139748 -341620 -84196 -180964 336003 111709 -67954 101652 333790 -13170 -213273
23330 -213273 96481 532939 22511 -135172 -184750 -5426 137659 24561 -212063 -282298 -183017
23319 -183017 -23836 -360059 -194911 299775 6172 -116116 66740 83411 -171350 68257 106834
23308 106834 -249984 -48838 -171261 114663 -96108 -346693 -278623 368239 -146390 -25669
23297 -221340 -226505 186520 -101403 -65961 23515 117434 93566 23340 103931 169821 52552
23285 -73432 -439129 24472 276034 -37303 -97801 -174817 376532 -9713 -376751 117743 -313549
23273 1722 59768 327199 318937 -365984 17035 206865 -24056 21943 310315 188368 -336702
23261 -160385 54358 112130 -175222 135540 117552 6921 -12387 -241588 -172232 -97241 89533
23249 -55314 -161566 -222815 153647 -162462 62595 -24295 -136679 43023 -318217 179785
23238 -17848 -20551 -3395 1307 322231 -77179 231347 -48091 -98593 -49928 17198 -18207 -186708
23226 -186708 -86885 165862 140590 -111967 -250756 33156 -97706 -155783 -290990 206636
23215 -165496 237519 69079 158425 4112 -115684 24743 74660 -293419 189973 109850 -225673
23203 35908 -139115 -91383 -23148 143076 -136354 -53877 123574 -21847 -54500 -177205 -205296
23192 -205296 -141314 150738 -105012 -102799 20663 -278880 174190 117572 -351140 164839
23181 -111540 -48327 -173383 109667 -203210 -188353 150611 -7803 157552 -15262 -243525
23171 -243525 -273176 81255 317101 -192730 -25735 -56866 -241634 83478 -185425 -363086
23161 -363086 426224 -225254 152684 -344228 -312793 155043 -199873 183363 -233180 -121393
23151 -121393 -1187 126693 83421 185056 137352 -323582 -218506 -99462 -312011 107990
23140 -117190 -268178 201698 39330 -46877 -165122 21521 -306662 121069 434000 -115448
23129 -94344 -241518 203611 126607 -335011 -14198 -346575 168937 138084 178973 -29398 109810
23117 -108442 -86985 -257902 -307409 137298 -114037 -182381 -57356 -279308 330119 -90201
23106 156848 -71593 73706 67600 220079 -45272 -281089 -159449 -1308 193441 172639 13000
23094 -203361 140290 -29220 153518 -264422 6148 53827 -58556 231904 -7470 -351044 -387773
23083 -387773 26825 267520 -101473 -173285 -89746 371201 -241385 -83099 -300675 -264611
23073 -264611 -36336 38770 -188515 -5058 -58542 -233957 -208956 106837 -72471 -118427 -203479
23062 -203479 -148635 -282 103455 73814 -38341 49612 -40151 212077 160359 -1636 75988 434372
23050 434372 -33237 -172793 253910 196961 66938 -17515 -94673 73357 239827 32925 -95865
23038 179831 -777 -96853 -259709 257838 23730 -254221 -248849 -82520 -3900 -202129 -149879
23027 -149879 -214554 163072 57733 -156611 133174 -5827 75636 358586 -137012 204993
23016 52041 176936 121556 -10236 -70958 80903 -29007 -317017 -108836 -357982 -42072 94314
23004 -134502 105738 24836 41491 -47017 111152 107233 293526 136625 100886 -32379 291572
22992 -69479 177832 -378406 -61033 -55058 -71194 -73122 -473134 81295 -74236 77638 235321
22981 235321 32110 193078 -136286 -164542 -529064 -93066 -369394 -163836 188533 -288692
22970 -126231 124070 242887 -34566 14940 -142461 -257290 -124690 -53938 -124795 288488
22959 192967 -142540 -240089 172811 -156930 -125397 -7678 -353030 -130472 19938 288050
22949 288050 -150241 -262461 247686 24136 -41058 -85941 61073 -15259 393415 -232792
22938 -315366 171191 113709 147458 80824 -62505 -106565 -36906 143916 56882 89017 5991
22926 -67550 -69666 -194620 232569 -93150 -17732 -80826 33284 -21138 57294 -394654 -126212
22914 -117402 16206 201841 36663 145653 -257821 -258662 -8494 129567 135653 -80807 -275606
22903 -275606 -27423 43269 -334375 -207627 -205359 134829 -168256 -81667 -79715 49805 30130
22892 30130 82268 -46266 129245 290319 -33540 146049 82056 -416625 89861 -104704 44280
22880 -96560 28672 46674 -68280 -347931 -6454 -24621 24024 -43161 -211053 76080 28722
22868 68347 -170946 -309872 80559 -127110 -237431 -103958 207818 -126275 -119408 -114870 345612
22856 181303 -22269 -189539 -163450 84773 -58754 -23579 -165570 -16885 -241797 -232499 -158442
22845 -158442 -102698 -14062 -64358 -100065 -127204 82907 156304 -63671 22704 -27762 36747
22833 -139339 -290960 -116125 -106875 -36672 302811 -1858 -141362 -332258 -88964 112725 11930
22821 -144866 -318562 34257 -259365 -100355 -180063 125467 -4359 -21396 81256 -60437 120558
22809 251905 -17103 -97973 102800 -62724 -252680 -12635 -33020 157015 155768 -94304 -251045
22798 -251045 41761 10042 984 -111154 -339229 -116315 357213 -218826 28953 -55413 329395
22786 -3175 25588 -94280 45648 118102 4296 -214472 31257 -144347 46768 -192650 133986
22774 -169208 2190 -160316 -10749 152091 259648 -250187 -113090 -12284 -110235 -250759
22764 -250759 123837 90540 -84048 -215418 -191439 -380077 159880 -115937 -271143 -321174
22754 -321174 -118135 -133707 -3669 -45667 -97573 342640 -82100 -324605 -175509 35054 -82494
22742 48599 -149876 -269419 6710 204851 -253100 4471 12980 -126761 -83893 -7457 -29623
22731 -29623 -315237 283293 -263685 -2840 -263017 299530 -41153 -75573 -279232 -72721 2786
22719 92944 -74966 80046 -221427 -168905 192171 -141051 -196404 -150114 -60786 -185047 -167012
22708 -167012 -245621 -128853 34930 -425060 -49863 29817 255167 -137901 -240562 -112865
22697 158273 -108381 2135 395453 22902 -216703 100172 -150274 -563211 320875 -262124
22686 -12159 98581 -62247 -11642 112998 185926 -359452 -124718 -14844 51822 114201 451652
22675 451652 -31689 26391 77833 97297 145471 171218 272203 -172756 -55379 367296 -339932
22663 231190 -229230 -23333 -134407 50371 35017 -243468 -183969 95723 43842 -134747 -22346
22651 -134851 378373 -305776 151482 -182399 50843 -94542 94730 478055 16781 -110503
22640 -187278 -84758 5345 40674 -135679 121021 -58510 -2959 -294482 -188749 25019 -33515
22628 -216623 -110521 -130465 -330044 21921 218405 8110 335172 123501 -166024 -122893
22618 -122893 56523 165951 14305 -23183 1094 112655 110088 -17579 -57025 -195798 89282
22606 34786 105370 -160803 -242628 -164240 79427 -276491 -107878 324900 -84276 -178108 147863
22594 167321 -85548 -315585 73073 134969 291115 125212 -219376 50857 -77577 -201659
22584 -201659 -132913 -82495 -263073 67814 462045 -61341 -55290 -125963 -448315 -97105 -55580
22573 -55580 12411 160378 169727 134795 203318 -83810 249239 -48634 24539 55212 7970 102625
22561 102625 -44253 183904 -192794 -69409 -103823 144036 -172152 -56653 49585 -28758 201434
22549 91534 176602 -38676 -17292 -175736 71002 -207412 168721 -277324 -169324 -55981 152214
22537 61938 -157764 119848 -97744 -176364 -68489 126602 80529 73342 -436364 -246425 -49535
22525 -325311 -197176 -77037 195 -151418 130578 -121028 -22183 245478 -18464 26731 178626
22514 178626 191542 -235197 -185333 26721 -337773 -35179 -26350 -214252 -3148 -79095 159783
22502 -245556 -106819 173612 235795 -68486 -166714 -108429 1238 121761 -88684 -260914 -245889
22491 -245889 -33915 -239125 315452 -150136 -155466 -50403 -31523 81618 -211239 169508 33718
22479 58614 -42912 -96194 158974 -157751 -252908 192278 45225 280197 195469 202173 -338892
22467 72203 -147766 -148179 -110064 187134 -67402 275910 -172016 -216527 14592 206270 -147382
22455 -6478 -70456 157320 -192422 -2600 -195938 -47286 246913 -161055 -153632 -204841 -41697
22443 121164 -150541 -103271 -75996 194729 -17156 -138405 -38671 4295 -23643 429061 135479
22431 -35251 -271220 35843 -124121 -35737 -47599 -170045 233860 -138346 120964 123606 -397439
22419 -14178 -29784 67272 -183276 214254 -117939 -195551 70669 290220 195362 144344 90215
22408 90215 70948 -80819 -8279 -186256 -28626 120994 -158577 32275 -186101 -94734 -163795
22397 -163795 -193348 -22932 71118 245791 -74508 -175214 53698 -126680 -31267 318989 302357
22386 302357 104428 -51687 -2459 79213 -257905 12879 141378 27694 224028 122026 142419
22375 142419 122775 -213167 -241009 -78804 -48306 68434 125231 -132608 -169470 29418 146303
22364 146303 41944 -445154 -69888 -52858 -224371 -51501 -417164 -114435 -200345 -211633 -271058
22353 -271058 -35294 50545 55526 -146934 8183 -219072 -106803 192329 -66981 -191418 -46748
22341 73197 186102 -7034 -49280 224747 -49971 85837 116442 45452 154051 -74314 -185767
22330 -185767 129188 -134350 -33359 -217297 -88423 16044 -87827 -235136 -189878 58993 -164772
22318 -13441 74724 -230760 -58369 153167 81085 -145308 66210 -39805 -156115 -214340 -90304
22306 -157669 222088 -139191 23706 243574 -148715 -163171 129229 176871 -163932 -254428
22296 -254428 -272400 -62012 68572 40990 -71919 219035 142232 309248 145770 -200283 9741
22284 -78039 -315022 -108616 -86595 -178958 149104 -110454 46197 56354 347867 -121116
22273 -66791 213514 -25907 140739 145391 -114172 -159509 -254393 -166634 22406 21177 -29816
22261 -88802 2193 -145229 162582 -3557 -399250 243264 -384366 14818 -91478 -42148 -209818
22250 -209818 148819 -208030 -38474 -50512 93491 9868 163226 -198903 9565 -90290 22986
22238 30151 -54364 -152688 118847 -83391 74759 -208763 -149694 -63689 -165478 -316329 -89117
22226 368203 85620 19995 54503 259650 -38631 102225 32879 -206832 -201827 212581 2929
22214 59404 126919 -61546 79851 -223293 -129488 -145426 142320 -279401 312046 -106540 178488
22202 -212202 -199930 153513 83962 -382904 -255165 78901 -87543 -73763 -163663 -118448 493278
22190 43659 -103884 -115183 -173118 240322 -82109 -236650 2616 -234262 48462 -209526 -225360
22179 -225360 -134477 2171 322500 -235420 -128725 17903 73027 -118722 -278166 -190890 134422
22167 -44746 6795 -70167 -89266 -184934 -102040 -374807 -155039 -224070 -191163 -11798 85348
22155 213516 110601 350386 -136023 -149338 -33186 -281883 -115318 32871 65246 -78271
22144 330534 39238 25139 -87176 -166416 -554459 8713 -101070 272612 -264591 43391 -122923
22132 204934 -188578 -11640 -100304 -18034 -287302 176923 -59207 -61953 13529 -23960 -220485
22121 -220485 -73049 -126575 -101132 107524 -1555 316808 -252603 -7336 6881 -129419 -304001
22110 -304001 97073 83558 201108 -221982 25520 -117780 -96068 -113860 -139313 27497 -508937
22098 -38847 -70984 -4735 323931 -12199 -41029 -190071 -281290 188821 458873 -260898 172657
22086 33122 239150 5949 -61627 181551 38812 -52057 -346014 53624 -3670 126816 39022
22074 111732 273741 165472 -121380 38700 67000 -103607 136098 -53280 210220 -240325
22063 -324535 39342 -163553 -268381 69406 -142848 -109542 -30687 117617 -262137 -212152
22053 -212152 -230418 64760 30402 -123456 -151119 71877 -347358 -137178 201771 161807 -27333
22041 -191224 168307 6849 -368608 -279035 196874 36044 -14791 -142873 -181014 -21913 -137357
22030 -137357 -388238 26416 24005 -251626 138414 68482 -53024 91036 168825 30162 -42676
22018 20006 -339630 239586 -6238 -63947 -202569 35473 21871 76176 31815 10888 222735
22007 222735 -26152 -30591 -1942 29966 -72638 172234 -163661 -218178 24263 -94979 -85542 200955
21994 196037 -529919 -67955 -37506 -318266 -8879 271649 -79771 2671 -213761 69645 -184196
21982 -105072 6136 -27369 -151361 -13694 -129568 -203583 111934 -131558 16899 -226286 -286819
21971 -286819 -420319 -358604 -110969 341637 -103272 -189594 186061 -4847 -9847 24319 87854
21960 87854 -106434 -122559 -129817 -99577 217434 -118842 240062 20946 -219486 -226672 197866
21948 -302081 -136654 315301 -71515 30884 110749 94775 -232644 -62671 -27712 231799 -55740
21936 -53131 229590 127773 -112231 -99507 -17785 27938 85678 -87001 -232762 -116281 78338
21924 72768 -116671 -188229 -404886 215828 281426 -271171 -288553 -247871 -200554 139593 67712
21912 141965 295492 -77927 -296269 245609 46292 61426 -162328 165890 -149944 -308689
21902 -308689 108467 -295822 116049 136397 -407390 -202487 -81664 -39928 -26196 69445
21891 -294337 112280 147338 -62973 61815 547350 -154051 61806 31144 58536 -38049 -52345
21880 -52345 -304529 -206674 -50935 38936 -277688 -90734 237301 -10266 244417 -63200 -257859
21869 -257859 -250961 -139940 159028 -355742 -226507 -39761 -22429 -13825 -147678 -339776 -91935
21857 34960 -153681 -381564 -62211 -61744 -62669 -227692 8585 117577 -57650 -385900 -96971 131255
21844 4101 319381 -88597 31139 55737 144159 -130978 -5147 460971 224611 -22265 -163400
21833 -163400 49065 326281 294648 -89468 -17006 -85982 285895 135426 -47543 -192212 -17042
21821 -233649 -97868 -80308 -97390 58443 -323430 -185945 110482 -169085 71323 154733 34748
21809 -127574 -150200 191927 169166 -250440 -140454 49717 -81577 -190559 -36922 -215984
21799 -215984 158929 109200 5337 353669 -37216 47680 -311423 99066 271587 -144596 -188088
21788 -188088 -70750 -23213 24755 -56546 47022 -233938 119418 164785 133207 -164853 115842
21776 -107656 -30485 -43727 -87622 -207502 -329583 303177 234430 126512 -42149 -151858
21766 -151858 -170262 107295 -127776 160264 59263 -42005 26363 4857 92580 -35925 -228938
21755 -228938 -148186 26871 -49204 146376 -307949 -1631 120430 -357095 -80971 491504 95284
21743 -179327 -307720 -334663 106728 199360 -281270 -106497 -255875 42550 -42017 107608
21732 22658 -95002 20508 -157743 204736 165552 -40457 268473 -243718 -7028 -143896 -219072
21721 -219072 205752 264093 95494 -1928 50397 -224879 245859 40449 -149736 58266 54651
21710 54651 10571 22243 -236811 -189787 -58111 -24699 299950 -86915 -107716 -167212 -37531
21698 43498 -34825 -95787 -73378 -11597 -91846 106677 -298983 -128197 -110399 -248249 135722
21686 138820 -42247 -38751 -179928 -8922 -207751 50993 -83088 -35246 -47548 86701 584 -17894
21673 -37008 376631 -26307 -55353 -322811 -173737 -17126 -444865 63947 -219432 -108243
21662 136284 100707 -115929 -203453 214261 -115324 117620 -308830 -243273 -20300 28851
21651 -90151 -186942 -292678 140120 -295304 89980 111633 83129 -5946 -66618 298624 -198040
21639 -104348 -66975 -139739 -5374 257166 394573 -292394 211046 -21801 -217099 7026 -101948
21627 -88257 209826 214925 -33460 -175223 3702 -262270 -255947 -299707 299110 38972 -260704
21615 -73187 -121881 887 175364 43867 -137638 -14023 68028 -10259 -32893 -317162 -207698
21604 -207698 -170493 -45399 -171236 -6716 136287 -306868 -165312 151675 82497 -75424 -153102
21593 -153102 -44253 -1827 -120203 -224454 -139678 119560 212481 -1114 -42126 55205 111193
21582 111193 -137808 4843 -260673 16273 -43807 -1949 -69081 176034 -8010 51334 -363016
21570 -390453 49095 -368304 49457 63177 -383872 131100 88407 225207 -319341 -133507
21559 -312252 9812 -50073 12345 -64249 15883 -41299 -124442 102587 -32170 -39375 221990
21547 -31428 -82125 -364839 167182 -14077 76766 110239 -202683 72394 63574 -166803 -144196
21536 -144196 -468248 119893 277392 -179495 243635 -120206 -115370 205668 101251 164038
21526 164038 -29501 253115 272614 -20182 -31534 252485 -46939 -77018 -416646 -91142 -127202
21515 -127202 -37133 82898 -163763 -50314 102266 -72150 -113844 123243 266498 62126 179588
21504 179588 40097 -152528 -56045 -230487 84699 -238442 -226699 -124340 213903 -312999
21493 139202 285463 -218438 -17832 160951 -21881 -12591 -219197 147691 -61922 -102222 -130345
21482 -130345 214751 -20256 85085 -169603 63003 150901 247455 -139583 -44283 298422 243773
21471 243773 237735 -24511 50994 -254334 -206392 371780 143138 -141562 -209815 -88356 -429498
21460 -429498 -7765 -24830 -205110 -154973 8403 149747 -74625 233777 -118740 116014 29116
21448 45392 126223 -31543 95408 87569 -210134 226375 -203867 1241 -102968 148048 170185
21437 170185 3619 115384 272733 356256 442906 343100 373023 -52671 317555 45713 -116385
21425 -58609 -341892 81096 305710 291 197783 61553 -146363 -177613 -53777 -113702 -150663
21414 -150663 57159 -100544 -168992 -339420 247242 -177230 152015 347153 -66506 58706
21403 5910 -83649 59560 -161919 108717 -66481 34367 29494 -83530 34576 135364 126791 -65034
21390 -143973 -72758 -126750 -376027 80015 -56419 -58744 -109072 -43441 -145167 -149989 162685
21378 -21836 -179639 -169448 5778 40301 -88588 -208283 43602 -175899 35561 -82419 -379339
21367 -379339 39561 -173186 57218 -21894 -64581 177475 63551 -192761 -118816 -293585 268097
21355 113999 -170903 76482 -381735 -45499 134490 104975 -198788 9606 -11513 -233996 -172196
21344 -172196 87765 149981 -93423 -107647 -163518 -169815 12553 -245210 -113204 -72623 -193827
21333 -193827 207963 233031 -192842 -30341 74984 46191 -17543 -143442 -57794 -114219 -118981
21322 -118981 83082 -43313 -53359 -85517 128550 16072 -165794 -141346 132538 -109306 -376583
21311 -376583 -65355 -13940 -69294 378977 52372 -45034 9224 7338 -309161 129670 270747
21300 270747 -50103 -228878 59489 -67289 -41534 -91922 33392 17570 14933 -148502 -10852
21288 990 -78220 -248342 322243 9142 -73560 -303582 -239683 207631 -216208 -185462 -196402
21277 -196402 -170770 -246541 -131728 155007 242967 28405 -182258 -575703 -28357 254316
21266 73295 -258459 260025 290316 -199755 -328504 -132244 -100490 10650 5091 -81219 -65397
21255 -65397 133510 -433343 -25546 -226755 -107643 204711 -176256 217356 -270937 -161702
21245 -161702 -258491 -215181 115232 -117246 -86954 -38135 -121579 -257684 54839 -291485 -223774
21234 -223774 -344742 -394868 -304416 -281138 57082 217057 -521403 -15369 -132265 70200 -125403
21222 -27233 111174 -273621 121109 56708 -135921 55650 192850 -175694 -76048 -132351
21212 -132351 -44531 -285129 86495 45022 -71180 78933 34937 -154233 135653 110472 247239
21201 247239 -41122 236486 44973 102660 69070 28514 -83461 -22960 -8872 -141780 69077
21189 -101103 -14752 118885 126705 -28940 -73528 259236 -217408 45988 90448 -73122 -131690
21178 -131690 -53735 -204371 -183347 67346 -125180 32469 -263131 -202386 -45362 -245367 -162416
21167 -162416 107242 -227414 -242247 -404335 151946 183335 -276954 161378 -143449 76804
21156 -42003 -38423 -43696 30431 -61749 -218268 -57099 -342608 -25703 -6936 -56558 207883 259448
21144 259448 -184376 -332911 -83418 161500 11385 96931 -352129 -112969 -39041 364619
21133 -46299 -226914 -122769 113584 -123932 -68648 216946 -28894 -51266 -91985 -47692 -310986
21122 -310986 -392145 162628 -25100 -188747 235121 -157238 -121360 74972 -11901 -537772
21112 -537772 185119 -162648 -30730 86904 39365 328856 113574 137925 -46475 -64244 -50168
21101 -50168 -210738 -254182 -21730 -205091 -278117 -3855 230173 125483 -19983 41967 110339
21090 110339 -179893 -108474 -100257 191612 118326 176123 -28924 138616 56536 152037 -254590
21078 56597 -143010 292723 138824 -306033 104660 -133061 -119866 -47635 227407 -424040
21067 -258871 -122373 87757 68090 -224685 308048 -199886 17153 129050 190546 141848
21057 141848 -158249 -20827 121108 -322836 -226066 -178249 -19214 -113605 -94558 123958 76263
21046 76263 -29652 -82437 -25345 -8480 -84065 17691 271387 224958 144047 207015 58407 -59675
21033 -498738 -260114 -290141 -24940 -82598 135555 296495 -20692 1350 123980 -34185 162146
21021 -111846 -224310 -252612 38201 -131607 209772 -7121 170028 -53136 -67572 376863 107698
21009 295639 -267475 -155096 48821 -154583 37464 49621 141168 191136 -98786 -73968 278578
20997 12654 149360 -4998 -205954 -40602 -71648 153933 -74214 -65792 -199863 -79047 -136527
20986 -136527 -64186 -467858 -35330 -65446 12418 -53070 153619 26515 -356287 -19673 -123682
20975 -123682 -316468 -96173 -122276 -177433 -29713 -45255 -54848 -199954 232182 122806 -35594
20963 -217324 -97275 126595 100299 120554 -309480 235866 56065 183952 -104992 -122441
20953 -122441 73646 -127419 74068 -233574 -200430 -160016 -114126 -438188 68294 -96229 -196455
20942 -196455 -140194 -224641 26724 -398962 34037 -298350 -71494 -183216 224007 77516 212198
20931 212198 -88438 -20546 -561308 -60625 -211983 415199 5301 35776 74618 35230 202814
20920 202814 -19914 -135641 -29408 183465 26412 -35508 10658 3041 -191623 -23916 94467
20908 26461 -89716 -94340 -185563 196999 280135 -109312 -155772 -252063 -145795 340515 94213
20896 -187169 267085 69240 -18255 -104483 -28211 -247534 139910 205073 -373333 -161155
20885 -320234 36531 152524 8775 46722 -28781 104017 -342939 86222 -510428 -442942 -205756
20873 -128783 -14964 246553 58632 61009 -80475 -123490 -54009 -230692 1841 -239583 271538
20861 -464382 -24404 -132831 163904 21068 -250863 160491 76146 -290487 -38514 266059
20850 97742 -62028 -19063 6899 -440209 24288 -152616 -6071 50649 -38505 200814 -36499
20838 82875 -185505 -200721 335511 -71991 36342 224506 307780 169710 188772 -17085 105119
20826 -235849 73362 153978 -18431 -138145 -448357 -309872 -222454 180867 90003 52263 6428
20814 -11039 4911 173908 -399351 188143 33450 -120597 285277 -67890 -53522 -93954 -168175
20803 -168175 -328455 -152439 -354537 -51055 102620 242709 -278352 -81382 -180717 -239976
20793 -239976 80233 -221236 -307873 -150674 17768 80910 -49938 -65574 -143794 86033 206890
20782 206890 -434093 -40125 -229462 -259755 53046 -207203 112304 13846 -180918 409099
20771 135487 -148656 -21257 -31941 96472 -73628 -124135 -258499 110792 -216293 -52979 -326531
20760 -326531 154791 -39394 -213444 -25395 -133110 44394 -119250 -319336 -251586 -270150
20750 -270150 181028 245857 39886 -277843 -15809 -47847 6628 -120781 313294 -173018 -32334
20738 -56176 -31216 175885 -214086 -234362 -84692 -190584 -232123 -303762 191116 163479 -13790
20726 -150469 -81438 -500157 -137362 -22483 352870 -239581 -197152 385395 -303280 -292348
20716 -292348 -221424 121461 -73598 -71045 136094 -416494 -2232 -302392 231791 -199011 -182293
20705 -182293 58675 323880 -331669 -97210 249168 -14261 -151320 -270634 -78097 196186
20694 -188923 60594 117608 115389 -261876 152739 6784 66029 -199246 65083 -59770 -69296
20683 -69296 100191 -210894 -121845 -285393 -49940 159949 -174912 157001 -5736 39540 60839
20672 60839 -76254 35726 -72046 253014 115271 -55803 -39036 -339300 -136552 -358384 -254678
20661 -254678 -116225 -119787 -206517 -124601 1424 117385 -151659 -108536 -137750 -22785 179787
20649 32233 -7876 183789 -47903 73542 -63876 109028 -92394 -176439 163735 -171851 -112305
20638 -112305 -326752 12650 108779 45424 -268686 -117593 63750 -195567 -341573 -35530
20627 83749 109862 279760 -2020 -186589 186692 3490 252875 -56577 -133646 -44490 -148602
20616 -148602 153877 -40647 -244596 44996 -28025 142610 -232160 -39849 14466 26244 15829
20605 15829 44518 122331 -15451 -128720 -53276 110708 108881 -2558 -129871 90084 200220
20594 200220 -36777 -294950 -96160 193932 -64891 -35295 -17316 -480476 -10987 -66425 -53863
20583 -53863 -25008 -240642 126088 -37936 17822 -87052 -262351 139896 50390 -105428 -120490
20572 -120490 8040 -123633 107636 19513 -285142 297085 57953 109203 100093 200038 -71528
20560 -372060 222610 -140563 201877 -110155 45100 96387 -143145 -188822 -310402 -213363
20550 -213363 98322 -144942 430375 236154 -240443 -98092 -375392 -20925 -69298 101061
20539 -20186 -241842 -148220 -68702 -150847 195377 -98383 -184005 -57157 -75605 -84225 -55460
20528 -55460 161414 -227736 306920 -35008 -209981 -38900 -105103 -143223 -115277 -270257 12028
20516 -118682 6418 -87622 -93102 321440 9308 6354 -12037 254252 -318097 269771 -97395
20504 -77484 -323476 -133205 -227736 23629 -251491 -205202 -80970 71021 -116445 -58699 -133799
20493 -133799 -40183 293322 -9269 -231987 73883 -104244 -57506 -179354 -220530 -45070 159558
20481 -6931 -87233 -216893 15599 -305783 -144308 -15601 -72913 164443 -195326 74334 79252
20470 79252 -51288 52994 -206500 -284652 -41291 -119179 103556 5730 197274 226911 92422
20458 -21182 -27291 24101 -43270 252633 -59526 -77976 141771 -107124 -5999 -80718 62844
20446 -255797 -198501 204518 2200 17325 30113 207168 -225207 -52636 167115 -289446 -251301
20435 -251301 -209879 -229457 -80052 55214 -46340 143850 -198931 -40004 156807 125174 -34469
20423 -20791 -95358 -91635 -91736 -86447 -417088 228945 135379 -55221 -376056 -497 130893 108754
20411 108754 -372207 -106372 52774 -205107 -108499 96490 -129541 -155700 -8453 -325508 -82234
20399 157449 9905 -182630 -117677 -102964 148315 -126035 -194442 -258381 340301 -39103 181999
20387 17456 23173 -55168 90447 -105062 189330 -231184 -292028 -224924 24395 197748 -292466
20375 -6937 -86166 219674 -177638 53714 79370 -73467 -327143 -614 307220 -285438 -19105
20363 -306723 57485 -285196 35311 -226233 138471 43377 -119444 73406 59191 -223644
20352 -66688 -254311 -311708 -94431 -269079 112853 -311052 -169942 69174 111866 -151950
20341 -58814 -299189 -256493 -141874 -218271 -212470 13860 26681 38715 103714 -79950 123488
20329 -146579 -69869 66796 -110558 -27878 131510 65334 -435456 -15161 -104046 -79746 114113
20317 112988 53944 -450994 38018 -137734 -6334 -283069 -74989 -139285 224986 246817 -219999
20305 -168842 249006 -102892 284644 186102 29919 -244384 -135711 -8763 -56653 -137667 79408
20293 -9709 -63281 -25052 -46230 -99846 44837 59819 -24619 134149 -1584 -78972 -27291 96044
20280 -52492 -277990 -211660 -253903 -298100 212232 96962 -30852 54708 167377 -340180 53204
20268 -238535 280916 -279807 -39422 -82840 -29070 -124556 96145 102244 -132553 -281340 -204266
20257 -204266 -227526 27691 37852 -201364 51908 216373 62576 -295792 329700 -87996 -68401
20246 -68401 -3499 245995 -29311 115488 -127233 -204706 -80983 -401013 -11682 47776 -86410
20234 -66914 16847 170897 -117824 -73912 204645 -65279 -60145 -208866 -40170 74817 55276
20223 55276 -64889 -35765 109659 -113243 -100539 -31116 -28443 39593 -60158 252281 84547
20211 178125 -58475 -260205 -5602 -184027 142784 -24604 61290 -215716 94097 -208334 -157862
20200 -157862 -209675 -222733 156606 -354 -405773 334887 405670 -296391 -52531 79553 -63144
20188 30778 5965 23266 -107612 124306 -178937 -157769 -184475 200774 200757 101046 -319176
20176 362351 24742 -344244 181760 -290855 -275280 -197263 -405039 -179999 26124 -264073
20165 141868 120759 189235 -234294 111129 29467 -2707 -98882 -46968 -129200 34062 -155777
20153 -216857 -416288 160635 418364 -272970 26830 -124024 -327301 -100593 -268208 77354
20142 288328 12355 338415 91245 -204616 -116543 50384 182946 23666 126878 -85819 -93271
20131 -93271 -18886 326523 -124122 -69841 298972 75618 -455274 -35380 208259 -117905
20120 -204078 -150945 -10785 -12752 -262339 -92114 -90871 -310931 46450 -113031 -176141 -23537
20108 -18291 156434 -285438 -96659 -303271 -528580 148045 -77596 206234 -195551 190779
20097 -387016 78204 -287078 -93674 57014 -82623 87638 -52762 -222025 -321180 -41813 80867
20085 -210355 -96063 101871 -121869 11429 54311 78543 -191892 80540 88872 -265690 58237
20073 -92500 -6658 277022 154737 -23024 -164306 194349 335320 -160484 139188 -97943
20062 131690 162463 -54291 -172216 -54955 -199277 -25228 -111747 54432 -72326 -117804 123838
20050 -38110 65976 -279708 76703 94639 -7779 219624 268570 86790 -128540 62546 56570
20039 56570 98341 -192934 -160635 46181 163369 -164621 -313704 -135356 86097 -60908 -151804
20028 -151804 23393 -24080 -23904 205807 -16968 38597 -113714 121130 -341183 87997 -214295
20016 -220217 -97727 517070 60222 -155148 119746 -93014 -202138 114586 136880 -159428
20005 -39995 -404418 72721 -199586 -143348 -44048 -79333 3774 -86651 77575 -147355 447466
19993 62197 -28371 -252084 -73728 292521 -39428 119886 -25999 -120084 -163909 22563 488141
19982 488141 -497282 -48130 -250156 -3279 -82282 91299 -192260 55977 -63553 3826 -136588
19970 -151233 -200987 224904 92706 47633 -143975 -126573 233741 -82078 103259 173287 45086
19958 77194 138589 42914 261106 2952 14398 55559 136220 -36925 13009 256997 -112835
19946 55390 -354939 76822 -259867 -64120 -219509 36479 -18340 -60308 -294412 110492 -28905
19934 -104410 -5637 -276961 -419418 -155340 -81562 -180780 -262694 74168 95712 -27483 -16610
19923 -16610 100111 -125963 -256138 315064 -193720 39902 -279591 106063 -53591 -165593
19913 -165593 -159750 -455163 -104344 -329354 292387 354461 -282043 -164862 437 67662 -232815
19901 64160 -116350 67869 -327076 113287 -99387 -188916 -95283 161807 -256338 -129589
19891 -129589 66992 -216504 -132646 70853 -300779 -19262 -282435 -109127 -69891 -392619
19881 -392619 -72464 185642 9297 105482 -25525 -39147 92529 -91933 9128 -329117 122949
19869 113020 28463 -566621 35978 79770 52064 -20934 -153011 -48655 -201293 61920 137818
19858 137818 288257 120139 -241009 74887 -122866 -228221 -101759 -121873 -127001 -102947
19848 -102947 -329479 170278 -458215 -92545 52684 64298 -33361 -142119 -38109 -200984
19838 -200984 129919 -75734 -187651 -79939 384855 -362913 25970 283181 62723 -46396
19827 178229 -109309 -79043 44777 -42553 311833 -87726 -127008 -233910 -4801 -74037 -68017
19816 -68017 33319 -170566 -1942 -25187 199747 31258 -337323 -186526 -49791 -83030 -78241
19805 -78241 3169 -293320 -162098 -64990 -268668 -181468 235363 186656 115218 -107253 -57476
19794 -57476 -144355 -15114 100887 210159 115723 -127000 26922 -180157 -262368 -88575 -134585
19783 -134585 93754 45812 -90132 -300077 -25991 -297948 -373885 139522 91186 43666 -124013
19771 -412957 -153553 -70308 -170981 74654 -303546 67462 88271 -115782 -158770 100825
19760 -25098 105074 -282202 -84249 -152527 63859 -80639 334689 60911 -72424 -64495 -188355
19749 -188355 -92514 -213650 169018 -199704 3856 -315498 -270666 69592 -399384 -105410
19738 -98881 -35884 -76246 195501 226171 -17849 229653 87773 -754 37036 142102 -34253
19726 29637 -120665 -68760 -113060 -240517 -196337 222452 -27319 154927 20071 -215828 -54031
19714 -37467 130253 33344 -105352 -308003 127835 467862 -15439 -153983 -1260 134258
19703 -147066 -31781 58446 161431 -229185 -199039 -29307 188697 -115930 -358827 -110239
19692 83223 -270011 -172267 -78252 17510 -232669 -132018 17577 49331 253757 175780 101539
19681 101539 -73545 114919 67361 181923 -78145 138165 26504 -148949 -257878 111869
19670 32393 146614 -217192 -319279 55284 -270091 -175463 124869 -218143 75521 82189 -366090
19658 -226334 -342539 339683 -144049 6304 -249479 -534404 -187727 16996 -827 -124696 87394
19646 42888 98443 350803 -168910 113973 95486 -161180 28992 -300873 120506 116730 -216069
19634 -21460 -139258 10762 -119769 110429 -102206 -351636 -329351 -103469 21721 -106184
19623 -284094 289913 -67126 -33943 -24884 89421 33091 29469 -194405 207263 -165323 -458509
19612 -458509 -275002 -78509 53139 -210717 -143593 129577 47306 -56186 120464 52225 85760
19601 85760 42673 -359933 228818 59196 689 -110489 -42812 -69198 -97156 -34803 -93607
19590 -93607 -261324 -121478 -15227 -171663 -184674 112348 -322558 121149 -48705 -67733
19580 -67733 -57352 188854 -48686 -204852 -9253 208141 227738 -90308 327695 -143886 313121
19568 -127023 -82026 -196907 1390 -247059 -163551 25335 107779 -35134 -48591 -116449 -99823
19557 -99823 136436 -381051 -162556 102565 -178563 -49838 -234537 -190945 -51796 28049
19546 -659 -250041 -110036 117983 14336 -36142 296443 -103519 12254 -1448 -135552 -28269
19534 -1985 160289 -25455 -293954 -110683 66842 -157551 -57217 -178988 -148562 408068 257896
19523 257896 -130478 -171305 186519 -103243 -129601 -130595 -306957 111487 59284 -254535 -99740
19511 -410817 187589 -154413 16293 65769 132025 201971 -199487 -32627 46298 166471 -212353
19499 56554 -15334 -103226 -54805 213792 -124500 1313 -10559 121509 -123641 58996 25969
19487 -180052 34133 -368891 92273 140933 -191299 77477 66395 -200905 -93071 -22625 -191947
19476 -191947 49989 250611 106532 -27922 -101162 170378 -35870 37085 -7425 26814 -21766
19464 84382 -156819 -15565 85653 -516333 26133 153296 -138931 152010 370441 -439803
19453 97358 180775 3355 -62040 173127 46271 -160211 39837 -118425 130859 110611 115655
19442 115655 -4329 -270665 -77067 -76049 -167643 -390827 -240449 154875 -271654 -135527 32053
19430 123081 -172126 -234108 -383668 -60230 -343996 20760 -44394 -10578 178274 138901 -164020
19418 -13925 -102093 -220680 -95665 52755 -367308 29329 144203 -207521 63651 -157079 -162065
19407 -162065 97707 187996 -235189 22104 -156298 -213408 48589 -53524 -291408 -112780 -257795
19396 -257795 206305 -541252 27461 8291 -122605 -45932 293368 -188965 -163349 -127249 11221
19384 129682 -332994 -348973 -133717 -176623 -143252 -57356 -344039 -208920 -409550 -162451
19373 -191861 -62141 -262375 83149 -74049 -75917 106965 5585 136258 -125921 -68736 118354
19361 253379 -122261 20777 60527 -38303 -118069 6384 -75644 62944 -98271 23210 -60193
19349 -120650 287707 -5383 -73913 -311214 -91756 1242 -10107 65541 56082 -204191 -169657
19338 -169657 -18602 305266 176864 -316484 -64076 120582 -297175 128833 230183 -103656
19327 -211812 110291 13416 -99979 87548 72099 -149958 110748 -87595 261336 35928 -266669
19315 -99928 66041 -14815 -282834 -216629 -315403 86353 -361063 -161222 -311393 -265784 -7695
19303 14481 -284736 -219516 113309 -301532 102986 61899 -375130 -5439 -173909 -71961 -540496
19292 -540496 -90181 -271218 -105297 -70696 35101 182526 166786 -75543 36445 -301774 -198116
19281 -198116 -36229 -117644 -64402 -168299 -44039 -60505 -41851 -266670 130228 -157141 100388
19269 -100312 -267994 141645 -233392 -148505 150006 -243195 217454 137063 -212935 107186
19258 371630 107917 -102607 -160941 -106096 -165425 -136610 266617 -173503 -283727 92600
19247 11416 171976 -110872 -99173 -64538 -231512 -458045 183084 59813 12 -131233 -174624
19236 -174624 -16714 27168 2339 -383380 -18990 36808 -68661 24568 -56225 -170603 44259
19224 -170061 -107668 -416066 -139273 -218233 -310471 261590 5243 -18406 17847 -96995 -35315
19212 -143715 -127897 71958 -106668 -11811 165263 111214 -107900 -157758 -134722 -24645 -14261
19201 -14261 151196 -301265 391374 121139 -254528 75297 -14474 -196216 -30214 122657
19190 -19301 -371672 -31061 292187 -170381 -144800 -159312 2321 117585 151507 65769 61447
19179 61447 -332803 44392 57036 -326696 -146264 92023 -52255 -10663 -36397 34697 -67385
19167 -238486 -100458 -120900 -274795 -307032 -35842 -303245 -363456 64217 247614 167717 17620
19155 54786 -226183 112876 -34184 30830 -83365 -23970 130524 126100 -209768 -30166 -120743
19144 -120743 -33329 -77879 -151841 83452 -143277 32332 -39957 -230528 -59067 344591 14758
19132 29970 -8387 280094 -30899 -198865 -352000 -232824 -378442 -15435 -104512 -289157 -126519
19120 -165907 28268 164598 -176127 -524673 -39236 29859 139206 -236412 -102951 -266426
19110 -266426 -67428 -150541 36045 386991 28547 -22011 -102556 18330 34305 156899 -259983
19098 -265775 11795 50247 385573 -107116 74306 -288023 -84394 -89324 96100 190940 5445
19086 -235900 -266104 321047 -43970 -230813 94094 258708 69718 100425 -19872 116123 -186299
19074 -153017 49787 41711 86326 -241815 142502 -126197 297995 -110097 130334 -99059
19063 -241847 117801 -16865 55099 -171592 -72268 -47223 -221970 -139996 -193324 257957 -120645
19051 221924 -35468 -353482 -148989 61974 -49237 83301 -99403 -135125 -254397 -51074 -75716
19040 -75716 -402312 16651 -207634 445928 -142730 -56300 3659 -199907 -156365 148979 12296
19028 189204 -177340 -169815 -81180 198771 -189933 163578 -21098 242603 -365572 -111844
19017 -58347 -284884 -137734 384857 -27541 -126650 -81493 13901 -464561 24851 -319280 -64081
19005 -207666 -114293 -80789 18225 -274972 258075 255513 39044 -59172 -358980 -96106 -63967
18994 -63967 -86406 41788 172524 24850 -102715 -75788 181957 21542 -109970 279888 -5450
18982 111829 -270427 153216 99883 -46600 184853 -68020 72533 -235615 -336369 -324172
18972 -324172 -204955 -238386 -209046 18917 20509 164245 6036 150566 69755 -166710 -28645
18960 -96817 -9586 -465222 -24999 -77394 107613 86433 289108 -364634 -98033 106328 -127885
18948 125622 -284735 -220543 -26169 -234254 -144135 -242605 291639 -230007 -91031 -129249 88537
18936 224796 155648 -182227 244267 -273250 -30072 -39817 102992 -242647 170368 -198250
18925 105287 215001 -202775 -30853 -155563 -369156 -114059 -105281 15630 -51926 -161253
18915 -161253 -184301 -5063 -106620 -230988 -60224 130220 -225250 -132785 -373996 424 -77376
18903 -175155 -168789 294603 -73915 -65165 171680 -80332 -234210 22943 -89374 -297946 -297124
18892 -297124 894 -251607 -239510 -281257 -147780 114256 -163577 42348 -49343 41079 -68547
18880 -404330 -17099 -80357 20467 139838 27919 -319187 -11858 50739 -305929 112882 38069
18868 314589 -564529 -48330 47211 -55483 51382 -141680 -156039 7785 84285 -114384 -91732
18857 -91732 -41539 155637 56895 79341 -380941 -36516 120454 138216 -54300 -209788 -106196
18846 -106196 -36860 -136120 -272832 -145424 193732 -285114 71799 -44239 -168453 -66505
18835 17834 101256 285836 234203 42035 -18341 164060 44033 1497 -226384 -126039 -349166
18824 -349166 -192811 296730 -293061 56756 135062 -289877 -138982 911 -271025 49774 50560
18813 50560 -29367 -77933 148376 -54608 10100 65834 106003 -279757 1986 132389 -162047
18801 9210 -155626 -55355 -267474 341896 -60180 -399429 161172 -197973 -153507 -106354 -24887
18789 -63373 126543 80523 -47157 87633 156551 164114 60480 149102 74245 -90586 225499
18777 -271142 25580 232905 -249070 -79632 110769 27225 161601 291654 -92507 -86391 -164775
18766 -164775 -222067 -309275 34368 95045 35959 93224 -64573 -185576 -176851 -342707 95455
18754 39407 52710 240183 -327633 12388 131611 -427766 324752 198892 -280077 -25177
18743 -58310 -89391 200937 -53988 -147883 -186824 -107385 181218 -150743 -401417 -120798 152709
18731 -34651 -144538 -62284 -30321 196318 -148909 29166 -83891 109 61416 141562 -149066
18719 -448456 -139161 36668 -35250 245930 -180887 -38645 -104131 90172 115918 1130 -83015
18707 38666 171372 -35111 -181336 -22056 -66398 -403603 93729 -81764 55027 -184023 -121030
18696 -121030 450619 -149947 -36136 -326483 173213 -34319 -390107 120505 100991 -25980
18685 93942 -252242 191547 59732 -194538 84902 -406808 -101330 -253932 -34810 -73204
18675 -73204 -6163 156325 -74266 -35963 41093 -74161 -24303 31055 -117885 -506861 -221956
18663 -32150 94031 47984 -157560 40589 107947 -115981 -151013 53795 17689 -78625 -181375
18652 -181375 -122148 236480 -353451 38609 -256836 -94634 -71870 -69157 -24042 16485 -283747
18640 12519 -6027 -256330 -88448 -119527 -140699 223025 -96876 -109648 330694 16057 -126605
18628 159011 -205560 84635 -4118 -50114 -65734 -66685 -347953 -204243 -274895 -82606 -118888
18617 -118888 245114 -194204 -496606 -60610 -40603 -53703 -89432 120199 -128463 -191086
18607 -191086 -81365 25057 151165 -411761 74146 -426363 132182 -28167 -162592 -324695
18597 -324695 32881 -55612 263474 48899 11579 -213393 262875 -3999 89198 -24817 -300225
18586 -300225 -17963 148643 147259 -62358 233785 -119366 122800 -190550 39199 -159992
18575 -20773 -147079 -177339 -176321 -283265 -70082 174392 12712 -117879 485991 -295852 367576
18563 -182170 -350885 -121202 48309 -297458 60779 -92224 23560 -66677 -36771 -111604 52424
18551 -129031 -79148 -302706 63089 -241568 -63269 40386 44179 204175 49267 144600 240686
18540 240686 -131499 -62865 -248023 -167566 -189216 -114072 49180 -5787 -107384 186118 111442
18529 111442 -112980 -17618 215445 -99448 -216563 -63224 -188400 -5133 -155458 -360541
18519 -360541 -66249 -151955 -98738 146001 172556 22259 -57704 -138927 -207802 351636 -233837
18507 -75368 -150044 26824 187908 181758 105816 -225257 96108 77873 -198550 -370609 128500
18495 -46351 86018 129119 -31009 -93787 -18477 19699 -59317 -129616 7891 -172097 -143551 -218619
18483 -218619 -36841 -448163 -2707 -12540 -159317 -176925 100352 -206019 -114217 140075 56254
18471 -311455 -64007 67550 -115122 -212056 39669 -235550 -34672 128568 -95641 311964 48526
18459 64983 324799 -180284 -8219 -150607 302845 -92573 51341 -276874 -8670 -41921 -232552
18448 -232552 -139654 -388353 -35515 -132139 -63619 -57752 -170772 145642 -19093 -424713 -90555
18436 77875 -1638 -140992 -50312 -446132 -114640 -210656 -148698 276846 392545 -110581 -39348
18424 180188 -256174 99431 44856 -166627 368632 52067 -87787 32067 240176 -83524 -143304
18413 -143304 -479967 -80223 -149862 147051 -95760 474374 149705 -58202 -130049 160729
18402 7790 -124415 -68289 -250973 -35195 -185482 -17026 -335643 74164 129688 -164142 -195241
18391 -195241 234060 -101822 -202225 -52257 -258501 199829 254245 -99639 -8956 23896 -42876
18379 -294125 62562 8143 -78679 146443 -5559 -3326 110325 148855 -365297 -47737 460328
18367 -147064 189478 -67913 -200144 -49043 -46769 -132131 -17846 -58748 -201324 -280238 302592
18355 -181198 -207987 -134179 98308 111836 -155624 -133543 -186322 -200573 93359 43093 85680
18344 85680 119876 -98743 64111 -151010 26187 131151 -93378 -352370 26442 -244173 -30390
18332 -160748 -54709 -51992 206625 -178971 -10701 -78019 110026 -109016 194524 -45731 -22416
18320 -98335 -213916 -123956 -249636 -140853 94717 61183 -99363 86913 -146893 -96208 -100377
18309 -100377 133275 -181877 -20631 15766 -350111 -96450 70380 96025 -364168 3311 11673
18298 11673 -80972 -71460 45319 -56467 -108216 161626 -100753 -60172 -282781 162263 -133723
18286 -390033 21809 -121944 150360 181684 -86211 -299971 27682 213992 -49131 -229518
18276 -229518 217051 234180 119024 -127421 -30095 36364 72194 -16430 7308 12071 118467
18265 118467 -52513 -106403 16461 24546 17624 258567 145114 -242628 -460734 200004 -79165
18253 -29475 138418 -245029 25570 -61170 -134518 -212224 -131631 -69535 288000 249120 -56744
18241 -77959 -255227 11143 -54556 -133017 -143424 -243636 41483 -64293 59246 -263651 10657
18229 -190209 -38961 -263873 -16912 11415 86893 150624 118201 -182416 39740 -178249 -30105
18217 -35931 69305 -15927 37240 -291974 32498 -403989 237532 -293112 -25249 -463588 -12208
18205 7295 -81142 -24988 80380 -87233 379741 22917 -77489 -283221 -41402 -344928 -278389
18194 -278389 14828 65658 106683 64608 155376 -42182 204440 -187380 -156299 -284455 259598
18182 124511 -335435 -71200 -125361 -89319 -68239 480628 1109 41411 295 100948 185192
18171 185192 39523 -419790 -218325 -3126 1765 3317 77908 -231205 108653 -21710 219262
18159 202191 2813 -184792 256452 210406 -227807 -207560 256366 -295153 -20014 -11797 -132323
18148 -132323 -103364 227364 75921 162460 -75977 -185824 -214488 -88622 110428 238857 112712
18136 153263 93126 307006 28641 -66514 -12518 451194 177614 -124053 353259 -91746
18125 -129127 44129 -1405 48820 168614 -246207 44483 258752 -88319 -190400 -76952 -70458
18114 -70458 -104033 59732 176653 -113160 -292784 -261335 140840 -195219 -403632 -163669
18103 33450 -5114 -241533 -268232 370762 -37161 150651 -125847 -5636 189943 155441 -249227
18091 -82332 91004 -220293 106635 -51793 36226 163718 29769 -9647 77483 118692 -399264
18079 89099 12285 121387 121102 -286265 61605 22592 323898 -192375 -13435 -237712 130661
18067 -8271 -51817 -362093 -210564 -10622 87211 -199683 -213595 -377478 15209 -56910 -184835
18056 -184835 28032 270313 -455476 -191321 -132003 -76322 -245701 168189 91308 100226 -142433
18044 79262 -71607 294166 -227294 -299031 -116380 40815 -121827 18351 208794 -121029
18033 -131411 -165365 -26802 51245 85379 -17336 -240118 -519435 -85336 369969 7026 62206
18022 62206 -7232 -2681 59366 286372 119188 187063 74958 -26379 98157 -110231 -77349
18011 -77349 113548 -75949 -87538 -60998 238057 438469 -127841 141909 -47721 -11526 -153928
18000 -153928 -269179 -41131 -280316 274571 -213817 325077 -388231 -17694 406290 192315
17989 5659 -251754 153240 -193359 -124987 256753 -2665 -124295 -139377 390082 -2182 -135207
17978 -135207 -78693 -161513 31186 59914 -108449 -470636 -87713 -189895 -81755 126855 -36338
17966 60000 274738 -244653 122199 113638 125836 -250459 136112 -174264 -58848 -146593 94738
17954 -100067 -78105 34097 -239502 -337499 -4083 -81244 -327322 -191425 200654 76305 -113540
17942 219906 -41835 -22198 -69452 313185 -220285 -187199 -24141 -64179 173730 85936 84400
17931 84400 -465498 98606 -142130 67284 -121032 119558 -93703 172454 356161 59418
17920 189197 -110936 -1258 -315424 -30827 -154372 -218493 106906 -297967 255194 -21527
17909 -236816 353948 90493 153547 -1974 25748 -3822 -24956 -174830 -157193 146968 61496
17897 96587 92655 161646 -254444 -89048 67941 180545 187347 -102537 54485 379551 -36057
17885 -97261 -141513 -37681 -181454 -298417 -97158 241566 -161011 45583 -136215 -141034 -55028
17873 251358 -205822 16055 -6402 -63268 150932 -85944 -173674 332922 -184264 31067 -215249
17861 170068 12837 -118118 -274379 -86203 -167656 104865 34609 282442 -209651 -155810
17851 -155810 107003 -411354 93801 9045 -41490 -78203 -77563 -107463 -334979 -138164 -270082
17840 -270082 122869 305046 53976 132945 3007 -4275 154005 -185348 -18992 90614 26310
17828 79745 -78732 103154 -120250 99730 303628 -137456 -257457 -170643 369192 140740
17817 -73586 -240781 35086 -51432 -122502 66900 -131457 -151090 -251916 -31539 170638 -96766
17805 -155846 43213 -13928 -210296 -132575 -9393 -2128 59514 -103366 -58103 215107 223285
17794 223285 -169334 54986 263164 -61551 -192930 -121401 -50976 -303465 340702 112929
17783 -74067 404993 291985 257529 -11049 205856 -78212 -301973 -31303 38993 246801 66288
17771 -205998 -13186 -38940 -60280 237784 -144203 205982 124568 -314274 83625 -101600
17760 -141366 -163510 -222148 1448 155493 122278 375954 144042 292401 -51060 -30693 -14238
17748 -232 240091 191700 -122882 350558 206283 -151939 -217123 330711 -265319 251469
17737 -269607 -29896 -125442 -154122 46750 395383 409226 98783 6046 -137473 -332902 -195511
17726 -195511 71524 -93865 -174202 -266413 -65731 241452 11725 -219563 281471 -127260 -22723
17714 -89281 97310 38368 -40667 129372 -151298 147428 117362 69305 205945 173395 41577
17702 -211913 329450 -119457 69922 195082 40248 210364 -188548 -402490 -44300 219030
17691 -105907 141926 186592 163524 -145470 112908 324731 102945 103025 -93090 -193624 -94180
17679 19202 -71172 -235444 52540 -295407 -200962 110962 -214984 -127262 68532 -248560 135608
17667 144319 -196336 36831 121526 -187839 143637 -103159 150505 57730 -259152 -2724
17656 -14765 -36306 -35252 252840 235629 171731 404246 60847 63067 96651 -197051 -73552
17644 24161 2705 -66542 89032 -127768 -63061 8961 132673 254103 193926 -155811 -1737
17632 51068 379524 -110519 95957 94272 283194 -80939 -106037 -12144 25460 -144448 -98833
17621 -98833 -371326 169019 -110930 66684 -62458 -111539 87046 41058 -14952 -17716 28833
17609 20407 -130303 -207665 -15517 -92386 379477 -110073 27419 88905 165601 -12480 -163373
17598 -163373 -49938 52206 -64725 50349 -211822 5673 -26668 7175 -409510 -25314 64440
17586 323078 -175390 -4599 86003 72649 23151 47324 149174 132759 82447 -14101 251134
17574 -200558 -17243 -244588 251236 -94841 -49900 155155 -23444 -221345 -76707 203324
17563 262950 159141 -88688 300698 120684 23438 -283997 75402 -322137 -148520 219587
17552 251000 365138 -4245 11274 112163 6267 -300923 -77110 61759 125833 373860 63648
17540 211185 256340 259950 108744 256740 -180195 -47785 102389 -7781 184992 -84281 313200
17528 361305 -77620 144214 1446 -223511 -252715 269764 113493 39874 128349 -384083 333335
17516 60855 -83143 -103977 212546 -102084 287010 421934 355537 -8019 209480 -108143 74538
17504 72150 106018 218225 44107 237201 168099 259840 232131 -168597 -97360 -86157 -189449
17493 -189449 -136930 106011 58403 193450 -81491 -38925 -76463 58023 54480 -46979 -105462
17482 -105462 -43998 223607 -43408 -158258 30057 -150365 202901 285155 84853 282623
17472 282623 -78560 349803 384647 139009 277223 43517 -96240 129602 311392 -60819
17461 -48531 240195 65297 48316 319943 -48924 -41893 142182 159032 252177 474668 296201
17450 296201 172568 192371 20328 121088 245506 334364 645602 191092 333337 366143
17440 366143 184121 -195689 108484 121265 242604 554272 329722 663938 263896 258936
17430 258936 159505 291857 269885 231521 66534 382864 154304 392504 463292 202597
17419 142992 195343 423500 187453 51866 232842 35840 121795 27660 15999 398955 -5464
17407 46945 437329 30392 382350 64793 7343 233070 92362 44224 -33728 349488 -40052
17395 189457 -85582 -195092 140084 365735 222419 -56273 317164 190762 354173 137431
17384 304672 183641 116586 10392 200562 101233 113319 -146239 182639 296925 72011
17373 -342495 270504 -153050 -198173 103235 19227 -273212 232764 144422 503277 501155
17363 501155 9451 238006 -157316 493574 355002 77414 243175 107707 -142926 191116
17352 395969 -12951 -110243 182841 325939 283106 54653 162571 -303477 99857 64320 138201
17341 138201 162813 68356 150398 -156418 -136243 334665 -95149 30043 251772 -67887 358716
17329 251774 357671 36737 32562 82859 291064 393373 107366 -88081 -82935 162989 218847
17318 218847 217269 119221 290623 134026 -35850 133583 47475 109681 -20467 411800 129972
17306 68782 263789 -134769 149329 93994 510590 33138 283982 276495 92268 -146053 388872
17294 163524 163702 174784 186144 103353 135425 267713 -427772 113567 287265 42203 361989
17283 361989 648437 234909 209007 40014 498186 273620 34011 -202987 175691 286315
17273 286315 17959 192066 -18914 -104228 197006 -432 166090 223670 17822 -131379 401457
17261 252102 495924 84607 292396 397674 278524 262085 363053 -10978 145686 -3892
17250 7799 156963 245575 259538 58605 503550 209707 -11952 289617 14871 210333 475626
17239 475626 -65854 340418 341390 117875 80931 173935 232598 404257 49698 85744 346670
17228 346670 301061 -144115 423432 122952 595228 449184 181325 408663 -73829 -339358
17218 -339358 373032 210492 -22124 258952 74865 297852 201122 215909 444114 382746
17208 382746 -292792 -112780 222040 287456 528924 521305 450678 456431 286124 97020 495712
17197 495712 232668 547786 159892 429656 93454 367813 -42894 197232 -28747 325553
17186 460623 465695 102347 185587 689017 414448 223318 159999 126806 322502 224027 390237
17175 390237 -70514 194530 -23981 29032 58822 -4236 449898 279980 377655 198151 181184
17164 181184 401863 163438 443535 -93360 709196 132185 450638 448761 189154 229018
17154 229018 246724 261063 272190 7043 366071 607760 327887 271872 64099 234342 397587
17143 397587 390025 425303 253109 350245 507067 340522 300376 356253 37244 357353 374284
17132 374284 504787 289727 142074 420097 240783 623242 123350 397532 180266 260844
17122 260844 498490 233705 207920 264403 434726 550329 251950 383962 196425 781281
17112 781281 332237 328035 553457 288315 419525 477448 120276 320838 430155 78494
17101 318597 285163 50807 606299 242945 496280 688168 135757 259319 271041 398279
17091 398279 421708 558163 166609 182432 394103 198437 397746 383043 350421 378004
17081 378004 651598 343842 428948 594119 297491 703801 507692 235213 696463 228543
17070 462007 185881 383057 231173 398788 582946 351742 483613 514682 609052 734246
17060 734246 632319 751335 685230 353152 776836 303864 650552 477842 524811 713226
17050 713226 452616 251156 484293 479032 789695 750139 507027 830041 907758 439334
17039 345907 445479 505844 741533 356192 728577 318433 854480 340301 725401 617927
17029 617927 920586 295137 563237 583195 678286 560884 942043 550700 455762 491209
17019 491209 898896 799438 823180 853289 907885 555200 691775 989034 329228 572231
17009 572231 556177 908273 597776 468366 864470 691101 873440 597056 789828 895248
16999 895248 738351 830460 570063 791036 750458 800584 616741 898665 719718 697829
16989 697829 1041053 824704 1023367 857098 770776 900287 983758 863874 908135 757690
16979 757690 933567 653888 904177 919346 813168 868116 868323 823027 812634 897952 1013780
16968 1013780 732830 1114450 875275 557452 1066993 943588 1454486 848674 977275
16959 977275 1019521 1057157 994311 1039296 892950 901964 1104352 1321766 1067489 1161963 816678
16948 816678 1072345 817333 1061857 1073765 1124944 1171139 1355964 1199797 1168910 1204549
16938 1204549 1287236 1038603 1413511 1216475 1480200 1536860 1199754 1206579 1360984 1358476
16928 1358476 1138586 1280345 1402213 1466484 1372754 1238487 1245594 1506787 1284933 1455407
16918 1455407 1322493 1169447 1250927 1261548 1457606 1596999 1364485 1385963 1669784 1516905
16908 1516905 1497903 1691071 1618406 1565209 1711659 1644321 1638007 1909158 1905800 2022519 1678568
16897 1678568 1598884 1720338 1768941 1778059 1870676 2114378 2229048 2024584 1975508 1906924 1982702
16886 1982702 2263026 2046927 2201424 2097590 2165234 1789803 1997507 2258474 2471164 2285159
16876 2285159 2245270 2395279 2354173 2495172 2738031 2186168 2801126 2636658 2428440 2413472
16866 2413472 2775970 2621647 2728872 3060316 2973235 3015780 3144801 3094422 3220783 3178337
16856 3178337 3220577 3055896 2833585 3126909 2977495 3609615 3098921 3588495 3478289 3378539
16846 3378539 3519661 3584995 3261644 3776602 3640778 4038810 4016263 3834617 3657487 4006419
16836 4006419 4459119 4146095 4114366 4783495 4489833 4515737 4618687 4669480 4254573 4458731
16826 4458731 4979029 5130796 4862700 5303438 5257915 5455806 5675749 5482258 5813656 5684099
16816 5684099 6000441 5994247 6056049 6091866 6241219 6653932 6930247 6775803 6675421 7176873
16806 7176873 7106884 7274609 7674550 7596886 7974589 7793110 8472428 8408700 8507836 8719343
16796 8719343 8964428 9076987 9593798 9810587 9755957 10269416 10041725 10826538 11175071 11121111
16786 11121111 11223688 12095149 12315411 12767963 12778155 13348475 13713634 13934893 14809086
16777 14809086 15045542 15381198 15900040 16617564 16888117 17680659 18044999 18866509 19240123
16768 19240123 20199058 20784232 21544065 22325401 23162344 24360865 25198714 26141431 26838692
16759 26838692 27975281 29251822 30440941 31782816 33440678 34845418 36350238 37969819
16751 37969819 39692633 41678742 43483368 45903581 48497560 51087203 53453374 56384896
16743 56384896 59418710 62969357 66397203 70422182 74442669 79017685 83535443 89220061
16735 89220061 94650934 100429416 106955067 113680868 120993368 128818221 136848025 145746321
16727 145746321 154552522 163862451 173223391 182432229 191361884 199082863 206783938 212867660
16719 212867660 218044096 221449398 223205783 222659607 220753185 217140020 212026546 205038138
16711 205038138 196933441 188323581 179000646 169133137 159333247 150303022 140759448 131769711
16703 131769711 123112535 115091216 107620395 100571961 94234865 87951159 82474968 77435770
16695 77435770 72255516 68148608 63967924 60121509 56742701 53218750 50430233 47550186
16687 47550186 45186817 42463082 40120310 38455232 36332474 34547384 33202117 31518820
16679 31518820 29820969 28647694 27471012 26162719 25010340 23870930 23040844 21713718
16671 21713718 21151633 20594406 19785808 18696172 18202484 17350552 16901663 16188263 15428814
16662 15428814 15140735 14651213 14471307 13603416 13082658 12855009 12239853 11862822 11468650
16653 11468650 10882883 10754372 10359915 10094947 10155869 9524471 9540521 8896002 8924286 8759198
16643 8759198 8498879 7929093 8113356 7586619 7473873 7386598 7219853 7054241 6991957 6776634
16633 6776634 6201930 6228471 6471121 5625678 5949019 5610688 5820195 5512799 4948651 5050688
16623 5050688 5052196 4652059 4933844 4579447 4603597 4389423 4616710 4457254 4395897 4039494
16613 4039494 4100194 4271518 4012694 3928569 3744280 3723134 3586492 3762802 3577235 3630266
16603 3630266 3450492 3416591 3039886 3195316 3244424 3137280 2908892 2933658 2944230 2728487
16593 2728487 2960911 2896109 2487618 2532470 2790907 2683877 2809233 2745492 2655291 2223307
16583 2223307 2156600 2522944 2359304 2100921 2231815 2165291 2202169 2563330 2425676 2131505
16573 2131505 2209660 2265357 2004903 2274332 1914638 1876761 2056656 1724229 1800424 2018529
16563 2018529 1574239 1774986 1779526 2412182 1524273 1852963 1804800 1774472 1508280 1785570
16553 1785570 1639972 1066900 1511504 1774772 1782733 1423063 1602564 1399972 1416858 1577212
16543 1577212 1630676 1309282 1581892 1134470 1282421 951707 1091868 1003477 1446453 1527151
16533 1527151 1154373 1017450 1071957 1149707 1203971 1001764 1169911 1375732 1155452 981438
16523 981438 1206787 1248691 797302 768004 508109 1167039 818591 1210023 855235 1073493
16513 1073493 1024773 906296 968288 1003687 691284 729365 980269 959527 877422 1097077
16503 1097077 818320 1150902 741204 692275 726364 1018904 745454 850700 719290 750639
16493 750639 659692 764539 686318 1094124 725382 642783 728741 470159 725495 780768
16483 780768 783981 593686 351066 242137 636659 623897 574953 910124 892635 549622
16473 549622 719661 560005 999209 170957 766379 644070 638861 779990 587698 479164
16463 479164 506789 599495 729343 365372 626148 411657 201092 697213 256643 488463
16453 488463 556744 498764 306890 620896 723465 321006 440173 631161 311559 576768
16443 576768 574185 557639 437395 607205 429909 513426 694043 576890 364084 682081
16433 682081 711105 343300 790507 836452 689638 454176 614424 501773 439415 498390
16423 498390 446716 491031 461947 387644 598971 680021 533761 187950 512197 -108807
16412 46012 641089 111316 428668 395000 681266 616541 540093 234388 184854 331536
16402 331536 429756 365094 531713 495174 159471 295873 429433 281219 542750 463234
16392 463234 308039 452227 371366 515986 167229 199150 306344 355722 276957 382409
16382 382409 214925 557311 290824 -106169 524877 506145 552579 340188 109676 396781
16372 396781 385037 70679 341018 154269 283483 381944 389517 479636 366693 138022 18816
16360 332462 279425 252215 736310 390294 233763 321781 151853 -10700 -49600 193400
16349 87949 190645 147599 337323 46313 276745 234283 512714 241049 335150 -117073
16338 177477 338558 374493 139335 535992 174485 151900 310513 187819 546165 87867
16327 166098 582678 -9789 160845 330247 206951 123248 85313 287975 252213 96637 243598
16316 243598 245283 204265 76518 99008 287262 210338 342977 47620 132149 14335 304668
16305 304668 71295 218244 75540 61846 94997 198669 201890 222010 103873 177165 48113
16293 199807 396945 194126 190348 271526 270048 64587 -88985 -58874 10547 152154 18409
16281 9218 18782 466704 198048 114706 318743 477722 175417 317917 188735 20629 -19539
16269 304485 -83018 172504 373060 -55310 123766 131370 332801 153748 327658 247539
16259 247539 117926 525116 35876 509057 -161478 -224648 147599 20893 -347189 160149
16248 -16340 83629 -262201 -163958 -316276 -70899 190252 35957 -19589 344817 -32643 198400
16236 160695 139913 166450 137989 -20999 307213 108650 -199121 34478 289748 303919 22699
16224 228313 -598 335648 -207668 -298254 44769 -13805 220333 26377 84039 38816 444497
16213 444497 269285 60812 238806 84957 289471 109500 253723 -65693 79344 56658
16203 56658 -195502 -58888 181945 113871 14832 244256 322775 -7127 -38626 148877 53095
16191 136105 17762 -252257 347419 -45466 -182151 69559 -23373 103711 -360719 207134
16180 81556 347700 119656 -128834 321861 27316 250333 -191742 255161 -165343 13735
16169 -113734 67349 -80595 288403 -262825 159941 -66820 76682 -11429 103358 109063 -45534
16157 169574 176380 156378 239040 -12052 -15826 205627 -71439 97595 -115 -276607 -127276 -343245
16145 -343245 -24344 -323156 -42181 90644 112196 82067 -123645 125832 84119 205372 114072
16134 114072 110889 109679 122911 -13209 4959 -75759 147717 116286 165073 -30577 176730 25994
16121 162222 33141 -216443 123338 182967 -272693 -146908 -293044 46444 156802 335529
16111 335529 -225426 -89522 168860 16481 119521 -75356 -86821 56800 171614 -26769 183200
16099 -19885 75134 45145 -35223 -341369 68372 -77787 206377 -19974 -195884 110043 -107713
16087 -122212 -400647 100418 72768 -254069 79880 -153597 259888 -178976 -153349 214631
16076 135275 -285290 79644 202983 79204 179652 -84498 -35880 -290998 161307 157644 77684
16064 -5160 21207 112504 -127193 263863 40732 -217807 -59549 -100592 -52007 -84029 -171434
16053 -171434 -125499 -162737 39921 40498 -219962 -177349 -315219 36804 -203152 111091 303674
16042 303674 63528 -80876 -39587 -75156 102156 -60069 -435597 391532 -108406 -152193 -228474
16031 -228474 -279032 -224011 148064 -17982 362845 -365835 69585 -224631 253447 -226514
16020 -160460 93781 79896 -134185 -107875 -427581 -167802 -105917 -235223 164584 54792
16009 227949 -291316 -455670 176372 112545 175058 153500 -95521 -114736 -150267 -356227 72695
15997 219878 -94500 412 -156963 10113 -391298 -145558 49020 181934 -429587 -134928 24022
15985 334827 -83118 153278 40444 -145799 172258 97445 -167314 131352 234349 -99403
15974 -59954 -80724 74571 -31029 -134493 8637 217861 -150654 103780 -18974 -69440 144301
15962 65686 343299 -260281 9624 -150310 120815 -165310 -172658 28579 -146846 247530 -231806
15950 75755 -284010 80853 58558 -226408 -466742 -214914 -226387 280462 -206509 -7998 -46596
15939 -46596 54628 -101852 90970 104567 -153464 133484 -368747 -160270 30332 214381
15929 214381 178913 -258000 -242527 -87081 -254350 -61403 -311397 -140436 -233573 171577
15918 -202083 12949 74554 -91885 -96583 -69824 112337 -220805 -22250 -27393 98536 -212622
15906 -143924 -23440 -382678 -27222 45927 -311159 -175422 68261 154807 -20085 -291269 -116609
15894 259668 -70312 87447 130515 41906 21793 45501 293077 21790 42093 155618 -87443
15882 116159 344111 289897 -145464 40990 81044 -156689 -53910 -60535 40893 155393 -117620
15870 239207 59224 -83577 121153 69715 60528 -132297 84982 -85889 300074 -250629 87804
15858 -79610 101163 -248406 -99466 164516 -109578 102957 106607 94636 142860 19296 39373
15847 39373 -185397 253634 -412466 240970 129410 -305150 -164484 -169627 47509 -114190
15836 -148766 92481 225551 203855 63071 -236742 -127956 -125099 35390 -198381 223049 -33985
15824 -18943 -123657 24754 96276 71547 -99716 -261736 65712 162822 134777 -21114 -70422
15813 -70422 208464 16932 -534600 -104972 54803 -456695 24199 177680 20408 218249
15803 218249 -441544 -95586 39112 -56084 -183080 8043 172480 193731 -32232 245474 -125837
15791 -323022 33072 15268 136843 81795 -223305 105546 -91121 -280918 91400 -174259
15780 116332 153045 -179935 -104324 -75812 -260444 -199142 -101997 157223 393826 230944
15770 230944 130574 3486 242162 -61805 -134520 -170750 -72525 30582 -50294 44039 116841
15759 116841 -352739 -52833 246837 -77624 71860 -141320 -930 1393 -122221 18721 74831
15748 74831 130967 -148138 117295 111569 -17542 249505 -73223 -1272 -45686 52360 -254026
15736 -183302 -92296 -205152 -67142 -262416 -187413 -5724 -382080 -324655 268081 -317866 -66132
15724 -78634 -175809 -191896 -224386 -254390 -33869 -124807 -107658 -4006 -63357 199490 -207151
15712 -241716 -153764 93405 85973 -37601 115847 -48652 32231 -110228 99873 -83613 -696574
15701 -696574 148080 -149462 64458 -82540 98211 -396627 17696 -16188 -58207 -117384 -4445
15689 137398 -85625 47245 -335574 -242911 443290 -394975 135002 -159856 190225 341097
15679 341097 123346 3878 194622 -144571 114021 -213350 154211 -93600 -106824 -47570
15668 -97307 -300923 121737 -26862 -126084 -58472 299833 -330984 -150047 -21326 -853 79400
15656 40387 -145867 23964 116326 -94816 -2237 26925 -325097 -136536 75633 -354899 131216
15644 -124386 36476 -145016 -123379 220868 -295939 128189 16892 45605 337770 -152559
15633 47819 40964 156368 1414 -220610 110110 -113220 302599 -51879 -37356 -255820 -10762
15621 109323 -97263 -273441 242422 -250892 -73872 86046 333826 -107474 279030 -119181
15610 57548 6713 -468478 -194882 -24254 153055 260730 -179103 -10019 -17947 86793 -81985
15598 -179709 67061 12621 -220717 -59980 89696 -42448 197426 -136986 -122808 48442 65398
15587 65398 59753 -86047 -240971 2517 -63494 145570 73514 -31753 13026 13609 5951 -192492
15574 -90156 -319566 8386 -177686 94620 -290467 104235 133234 -10232 288380 122148 -377284
15562 112963 74673 -49560 -61630 2697 86308 -103107 -90269 236438 81143 -85452 77756
15550 -120909 -80633 49811 -140267 -326906 -70116 103595 -114593 -103417 117329 349191
15540 349191 209504 3568 -147457 258463 -217451 -19647 196759 -71794 -94469 -129468 -218439
15529 -218439 144257 -55195 101260 -40945 -100585 -191325 99909 90100 -271896 -179452 -51321
15517 32013 96920 89955 -222941 108654 -7959 182656 224665 34484 -312906 -94665 176831
15505 224711 -16565 49293 -36356 268034 -35973 6438 52382 -165857 -407372 -410427 -265502
15494 -265502 -336094 -89905 -110398 179007 -73728 -70087 -61687 123536 189259 -146598 -31879
15482 113639 -246876 274775 -27462 203590 -126291 65502 428702 -64799 -56471 -77513 -509307
15471 -509307 420595 146948 -108180 -192814 -13115 83465 -133164 14534 -62602 -56357 81808
15459 96781 -116053 22368 151276 65458 266689 -37688 -152219 -116202 97627 55108 -73085
15447 73688 128895 253034 14294 134315 -470224 -74414 -216053 -246055 91959 -280672 -102775
15435 240172 153373 193755 188918 -106072 -132528 296373 286785 3153 127039 165033 352120
15424 352120 112786 -127835 2215 -100180 -137854 -311725 -136163 192512 -166050 211068
15413 -14601 -100934 -11623 -78259 -28637 25283 23836 33358 190896 -64724 479142 57865 -68850
15400 152737 242507 157965 16913 167964 -225830 -118661 108448 -157299 -214636 -477030
15390 -477030 -55553 412988 -132708 122583 202807 -44930 -255921 31612 -314520 11884
15379 -71147 316819 -140714 13854 -111181 -192324 -26323 -251734 77728 -283401 -201452 89871
15367 -157577 -38808 200141 171540 13556 -182078 35372 -243671 9390 19178 175686 -154339
15355 39810 233444 182282 124791 13708 -108624 42831 84637 162664 165102 -132639 -111839
15344 -111839 38133 94725 191069 173377 406116 -58791 397853 40149 53797 27665 -58093
15332 -406261 157093 -65046 -109126 51436 12109 43458 1559 -231822 129715 -91085 -158955
15321 -158955 -28566 -116418 82569 163839 -53169 63967 172823 246411 149484 135217 80562
15310 80562 -54034 200322 96698 200226 -106879 -114235 -227555 -31079 35545 118646 -84345
15298 -250816 177462 -63774 233697 97754 333016 343204 54970 168069 138629 224972 120268
15287 120268 -182623 254173 -137652 104325 30624 394548 41338 308114 -51402 -60610
15277 -60610 145722 143359 357418 57919 -136018 168582 86089 5960 157262 171574 -106118
15265 182460 -2656 68095 -122641 -29005 137735 284896 8858 -31107 361427 242449 -168166
15253 -206966 286722 428438 281574 324649 423863 448107 490541 1326600 2984822 2130914
15243 2130914 2008930 2356926 1000478 342855 422435 -97063 62105 -60993 369647 537979
15233 537979 201632 189472 54304 185538 133550 -92930 339105 -57851 20624 249529 -205297
15221 347218 219414 246626 -282897 173905 170445 -30996 82634 341902 133214 -12909 85193
15209 -203854 103376 154015 133098 119344 39594 302004 517221 155859 -4856 46028 -281594
15197 -18834 -194391 200997 -390283 -135630 280612 32196 138928 178901 354212 4111
15186 188318 345531 153637 -16602 -37382 20754 221688 439890 362733 162325 -81489
15175 -40484 -26278 376580 -33160 -131786 -155143 123769 128128 32291 316681 -187270 7617
15163 45860 -90118 293555 267494 221010 315693 144837 174319 223471 309902 183480 113220
15152 113220 -160625 349275 258484 273570 89313 -177457 286556 21992 286123 182495
15142 182495 115013 44722 82074 47358 13750 120126 167451 -36575 -33301 277295 193671
15131 193671 -1444 365393 346369 -24954 -103659 412352 245454 -45021 1735 46823 76511
15120 76511 41138 212293 123012 126398 148105 184278 27023 52556 183687 546081 424666
15109 424666 102673 209525 -33969 62794 156936 235198 84734 -148247 119023 169257 154667
15098 154667 158752 -82230 15361 236407 81275 267070 60333 363797 -83877 143126 146394
15087 146394 80681 377140 476979 303180 -40822 165056 156386 397478 134732 219120 329771
15076 329771 451673 -88781 -6545 246135 46361 67625 -54244 108494 53997 417806 19033
15064 82076 -10172 285028 259224 -13550 -157806 -205244 262829 337356 284602 150179 358059
15053 358059 50512 50335 261155 -14308 523937 358649 196539 503225 326636 -144582
15042 218277 -239475 98493 64627 480186 145498 324617 425136 238323 -46421 -86568
15032 -86568 136613 108639 252783 223839 515653 341981 301242 366160 70509 276921 -186323
15020 449439 142327 183941 406699 243693 179942 186407 367466 261666 456048 125639
15009 98401 282571 291614 382837 462123 236263 275995 158940 422221 371780 142202 322756
14998 322756 138511 30657 -42956 135466 216161 37636 38864 172449 253800 179402 189226
14987 189226 249531 211024 -31084 537596 366202 482205 501392 166906 286595 -25031
14976 128025 -30155 267294 394922 97814 369154 382872 50946 -26596 312328 592490
14966 592490 398261 244601 142109 15415 377880 -30118 214267 508750 417123 436867
14956 436867 274625 229936 420865 351549 196800 343061 198124 242454 130785 552824
14946 552824 313330 508413 39181 216042 219458 144532 300533 72712 328478 -113952
14935 430958 385612 259960 185407 528048 227335 231869 544449 215624 -242764 291488
14924 468651 408871 418783 418725 53874 227983 546744 271239 416722 311882 441948 223901
14913 223901 380459 99818 339027 287867 744422 120712 400797 518510 383007 423689
14903 423689 -72498 -181201 177840 565715 404115 299295 -18327 165796 504499 289994
14893 289994 317639 456561 369498 213987 615326 357203 -141106 314562 457812 328575
14883 328575 238460 549944 293020 371999 303321 166830 653929 529071 413804 264701
14873 264701 353165 399741 358667 443834 214370 413490 328522 565545 492454 463032 536288
14862 536288 538367 594586 445327 524516 468726 710436 512439 602780 668053 464057 611605
14851 611605 620600 559555 542031 464568 509302 696550 411264 538863 315386 656467 829394
14840 829394 350366 186592 313817 424717 206952 442941 435415 473655 570689 724222
14830 724222 673286 450791 255947 339919 449756 275838 355533 907596 807755 112772
14819 715452 249059 640420 702293 658636 586767 732535 675554 494639 521418 394189
14809 394189 679697 413468 693613 746436 476157 642524 703431 452144 763860 699275
14799 699275 698816 469174 336903 410465 556495 513297 384690 743810 570966 53529 293062
14788 293062 705894 311654 644002 655993 487288 757895 622551 685852 706765 794175
14778 794175 559319 705576 856553 683794 675927 614517 531528 577120 776931 601993
14768 601993 876640 703613 622514 413433 546911 1097099 425345 637672 519315 878034
14758 878034 572103 989246 917908 545003 970504 571169 753103 791245 889313 624932
14748 624932 666455 871756 474484 534448 582230 499706 961262 704766 623816 808115
14738 808115 982654 945090 1034728 812165 879133 1133739 850636 615495 738588 1119546
14728 1119546 940336 650919 911859 680898 862676 715066 973548 781966 827414 633246
14718 633246 938531 1206976 856519 728525 726219 1011451 1319925 760592 866441 1055684
14708 1055684 685925 931435 1198531 917076 1052751 806285 1195283 1088835 980524
14699 980524 1056815 1093536 1078201 851281 1263310 947519 1075628 1035088 1056221 1025668 1306451
14688 1306451 1046619 594020 969765 978524 965510 978645 1352071 854398 860533 1217183
14678 1217183 1300907 1041042 1014492 1000229 1241359 1229333 1333612 1050390 1203317 1395023
14668 1395023 1304699 1660959 984512 1189411 1280131 1525900 1239513 1127649 1384685 1085312
14658 1085312 1308233 1132205 1195516 1177483 1359989 1298304 1522335 1409857 1569886 1376001
14648 1376001 1072390 1120246 1008719 1397542 1610535 1177587 1453051 1102122 1548384 1616321
14638 1616321 1183376 1557779 1373623 1607395 1447148 1689834 1259214 1589611 1664843 1564673
14628 1564673 1500816 1557503 1779488 1647073 1652414 1480444 1750788 1560244 1569144 1870558
14618 1870558 1687007 1449982 1856278 1765343 1806303 1503208 1655482 1728997 1306363 1631229
14608 1631229 1670014 1764580 2174110 1873509 2102008 1786563 2154326 1625780 1789693 2343618
14598 2343618 2122898 2151149 1966100 2097578 1994062 2134599 1818045 1961992 2254684 2021045
14588 2021045 2220266 2391495 2270146 1846083 2379778 2250085 1818697 2287128 2465857
14579 2465857 2501146 2275987 2670784 2269399 2480492 2200599 2398165 2477783 2580415 2532258
14569 2532258 2546955 2727418 2516187 2633242 2737641 2922225 2819930 3305140 3072790 3158691
14559 3158691 3326993 3162330 3692393 3922857 3932538 4084355 4818943 5104347 5541902 6949684
14549 6949684 8311855 12203932 20685166 36986262 44904975 23980051 9919688 6773567
14541 6773567 6871548 7461603 3824506 2875150 2962991 2229133 2603282 2231627 2446139 2613119
14531 2613119 2442989 2576483 2377420 2714337 2611351 2676742 2554456 2936327 2924758 2778981
14521 2778981 2946586 2983900 2634029 2940231 3279678 2917897 2796155 3448012 3211654 3313467
14511 3313467 3337332 3202217 3665267 3648164 3396361 3405399 3435635 3527005 3813478 3276374
14501 3276374 3760470 3636565 3861332 3736014 3814601 3728693 4241077 3722661 3706163 3879789
14491 3879789 3790262 4247158 4241620 4347777 4346164 4385716 4191333 4210712 3963034 4363506 4260903
14480 4260903 4954378 4674866 4575942 4733946 4785218 4847968 4765339 5087949 5022165 5109761
14470 5109761 4677526 5452601 5333418 4988245 5418488 5418531 5312867 5486517 5282338 5486226
14460 5486226 5472573 5495986 5562689 5893336 5979688 5924085 5994679 6338759 6477224 6028326
14450 6028326 6315471 6564172 6207523 6425571 6874018 6740081 6739768 6968731 7101693 7343129
14440 7343129 7200632 7448901 7200722 7536792 7628113 7834141 7734719 8067864 8267085 8107394
14430 8107394 8043451 8213003 8428973 8757576 9002508 8621552 9395997 9247658 9103118 9160690
14420 9160690 9462682 9323275 9926726 9946613 9916390 10273238 10565428 10218598 10650540 10929141
14410 10929141 10670934 11182097 11320014 11566685 11671364 11736437 12028941 12193184 12074031
14401 12074031 12458963 12928773 12780062 13227025 13290211 13218658 13467277 13687723 14262825 14337856
14391 14337856 14821044 14976533 15373780 15324328 15802909 15798718 16077217 16286448 16644747 17160455
14381 17160455 17391031 17678628 18224788 18507434 18681944 19363518 19569074 19742488 20050435
14372 20050435 20742396 21234829 21387082 21942271 22232646 22946864 23358889 23879868 24173569
14363 24173569 24742180 25311982 25750283 26635005 26993284 27780473 28354718 28831104 29353266
14354 29353266 30173185 31037684 31497539 32307536 33323966 33812927 34712066 35775213 36508301
14345 36508301 37340155 38466228 39315793 40403924 41757872 42648596 43766719 44784301
14337 44784301 46140686 47539776 49049143 50583869 51784991 53503407 55409360 56759720
14329 56759720 58474856 60524153 62432246 64678513 66527292 68586847 70831318 73121780
14321 73121780 75612663 78505138 80957992 83974197 87106191 90049257 93588572 96998918
14313 96998918 100672112 104799968 108713449 113113858 117753990 122565217 127425885 132711481
14305 132711481 138236994 144190623 150670622 157058904 163963907 171308355 178812058 186573162
14297 186573162 195225004 204395716 213600304 223497542 234162335 244816410 256258861
14290 256258861 268355877 280837489 293478610 307031094 320570244 334558102 348621385
14283 348621385 363072003 377412562 391731655 405558137 418846627 431095765 442867000
14276 442867000 453036740 461749838 468786908 473076037 474384778 472464276 468735743 467316673
14268 467316673 463345372 456974810 448189664 437535686 424947382 411021282 396367183
14261 396367183 381450185 365867587 350100549 334846662 319566042 304526451 290330634
14254 290330634 275937792 262691395 249879035 239371099 228010919 216888490 206270771
14247 206270771 196488042 187171386 178262019 170412944 162415860 155076154 148090381 141547190
14239 141547190 135476321 129821695 124420176 119097405 113995440 109256304 104820325 100715377
14231 100715377 97553376 93633661 89860716 86152521 83223635 80045980 77448723 74687387
14223 74687387 72094961 69518189 67308760 65141069 63179883 61200250 58767198 57295234
14215 57295234 55152843 53947589 52451568 50686096 49261322 47710526 46218007 45324613
14207 45324613 44284886 43292749 41731449 39987476 39276676 38357435 37342027 36778300 35711636
14198 35711636 34753160 33670164 33060031 32131628 31708726 30821569 29945344 28859467 28500600
14189 28500600 27739141 26973606 26787803 25750590 25430505 24873727 24208668 23740078 23284772
14180 23284772 22972445 21992619 21564181 21367296 20964890 20563083 20152080 19587256 19371347
14171 19371347 19081203 18835039 18249221 18013481 17764223 17390543 17247926 16810266 15977989
14162 15977989 15805594 15674324 15532721 15131845 14800423 14661112 14344597 14065542 13954110
14153 13954110 14014739 13775295 13440200 13181031 13115555 12665696 12176198 12471301 11908334 11811416
14143 11811416 11646851 11242300 11533681 11267204 11301976 11122095 10933893 10626453 10546451 10403658
14133 10403658 10009710 10017325 9737790 10130857 9390278 9396414 9133300 9175044 9220473 8872584
14123 8872584 8815108 8441716 8358966 8375520 8503584 8435383 8182384 8467877 7864290 7845462
14113 7845462 8029417 7509584 7537708 7499616 7354999 7557084 7110397 7373586 7119857 6942995
14103 6942995 6831360 7000904 6792239 6640402 6565740 6242386 6282030 6328650 6268995 6117298
14093 6117298 6206463 5944138 6004462 5495900 6054251 5731498 5790630 5562726 5813030 5650627
14083 5650627 5491220 5695564 5592627 5478633 5414502 5155124 5094391 5307700 4930260 4919814
14073 4919814 5166141 5069897 5248922 4852025 4969192 4919417 4659319 4660217 4409084 4279627
14063 4279627 4175600 4425237 4375404 4784434 4398337 4445641 4155743 4379103 4251238 4236613
14053 4236613 3824257 4204534 4191550 4172224 3921669 4319079 3886999 3816810 3917603 3611353
14043 3611353 3437869 3608604 3534104 3450756 3417728 3284113 3597253 3411878 3681706 3661652
14033 3661652 3234856 3415919 3661633 3571394 3087598 3145240 3500747 2990080 3247527 3018446
14023 3018446 3154096 2956175 2871399 2888241 3038581 3046422 2925890 3095850 2935531 2834270
14013 2834270 2825380 2643788 3016834 2843981 2665700 2491150 2645126 2921606 2731519 3004478
14003 3004478 2624704 2706483 2329642 2634738 2649326 2399788 2629720 2876627 2591977 2162922
13993 2162922 2752848 2742846 3007593 3687622 4391745 7467615 13899257 30283452 44721662
13984 44721662 29611149 14877204 8704689 6658837 5004859 4423292 4165734 3902258
13976 3902258 3570419 3507710 3242387 2811526 2637417 3111626 2689136 2683118 2747178 2292356
13966 2292356 2573899 2801925 2356662 2477578 2602201 2410009 2174135 2415538 2287010
13957 2287010 2202416 2037870 2379753 2171479 2340949 2197307 2271008 2235167 1995541 2107640
13947 2107640 2204142 2330352 2028513 2219766 1999218 2049305 1811246 2065983 1969436 2053801
13937 2053801 1881985 1777013 1745101 1542706 1806791 2106921 1946616 1825444 1864881 1899919
13927 1899919 1846262 1717550 1788367 1309714 2082144 1348614 1775827 1704051 1802061 1913343
13917 1913343 1580853 1539188 1705758 1568268 1660591 1569410 1559698 1817919 1781282 1372969
13907 1372969 1579899 1523455 1247093 1435395 1377675 1366451 1326439 1408333 1695492 1579136
13897 1579136 1442393 1846339 1700370 1517058 1341186 1336685 1487351 1371513 1127637 1270644
13887 1270644 1520498 1230310 1491142 1405935 1397465 1187945 1241632 1457771 1689122 1359029
13877 1359029 1239855 1133217 1149858 1436295 985265 1257861 1205639 1226601 1326805 1431329
13867 1431329 1218176 1180823 1302641 1443799 1660672 1101831 1200232 1234133 1063148 1368263
13857 1368263 1322971 1203941 981109 1272212 1334924 1178125 946178 1520490 815997 1083618
13847 1083618 1453178 1244398 1255077 1125711 1222726 939942 1171342 1316858 1024776 1278494
13837 1278494 1132265 1220110 1037163 1342501 959304 1537634 1060615 1149557 1399147 998222
13827 998222 998966 889013 1009443 1220576 847413 1279511 861417 908723 940891 1015751 840045
13816 840045 1031013 734647 946796 807336 860709 720475 1000808 929022 1212905 744088
13806 744088 931619 1062292 908844 735577 715532 854316 965217 857192 894912 764158
13796 764158 1217824 1079408 835233 788806 987200 939140 942903 1089515 1002759 990820 985539
13785 985539 856330 510480 1179059 801255 465360 777724 872156 900300 884897 645764
13775 645764 770286 660582 1152929 955600 650315 355518 893898 699903 731799 801871
13765 801871 642798 952006 713766 968616 726539 951750 718721 684941 420938 426964
13755 426964 617228 703728 694665 539183 282032 789400 1002345 985761 726844 882799
13745 882799 769742 849846 774294 751364 698351 672694 565747 556677 774332 876504 589589
13734 589589 560273 582823 851815 747328 955698 760006 741269 612269 421162 663849
13724 663849 793503 1071865 636105 610935 576256 710330 818972 514544 850129 467846
13714 467846 761354 667769 333836 568277 583136 756386 880889 797306 197142 640522
13704 640522 758648 724202 294464 467054 655175 724485 349182 585381 493550 511212
13694 511212 627570 542609 632376 303058 739138 302457 620410 754382 476489 536660
13684 536660 721954 450170 769146 410191 579498 274232 388890 641291 455819 878678
13674 878678 789739 487519 387861 584146 478516 355078 847600 475935 483461 433826
13664 433826 555314 529641 421897 456000 455723 682663 459459 725332 444557 558308
13654 558308 589965 518264 161739 190118 550909 536089 641396 469511 582643 265029
13643 399398 584446 557471 478270 762333 584899 772155 170189 223783 341078 510121
13633 510121 302611 566097 794716 645860 825679 52616 472680 711773 356380 74405
13622 245450 687123 581099 368901 378409 675108 654504 533846 425267 505644 500485 480599
13611 480599 470646 467464 908669 589761 435562 492231 363788 415194 231609 307548 735890
13600 735890 446476 444257 282106 605639 233378 416750 253577 585351 670722 271158
13589 521903 421250 406166 296788 591949 324502 86655 527072 304607 433280 -13041
13578 181538 165043 429825 250624 245229 576776 558337 333582 44181 839886 218294
13567 167258 470434 576553 587880 282314 499194 242185 286448 310258 399972 235120
13557 235120 425682 607522 414965 341625 68797 276183 332772 498253 325152 338952
13547 338952 459546 367508 343791 609026 -5911 311610 288770 237696 195231 393791 351730
13536 351730 327346 472584 333681 199239 302039 704565 417649 451541 358755 232403
13526 232403 398545 89357 329870 152430 102071 686569 150794 460774 35691 114977
13516 114977 436116 404555 341097 395183 438553 418626 210848 340846 384024 227461 601107
13505 601107 481306 450858 346698 330253 478312 56748 124911 203943 56545 238014 113564
13493 259281 428871 337698 294900 290793 285983 356596 139926 236096 225208 217629 342397
13482 342397 109191 365841 -27271 275710 -53194 311169 298352 489863 260557 496137
13472 496137 420922 239991 289175 -107113 468619 464822 359961 87879 17036 459125 352359
13461 352359 145534 667610 349958 329489 369465 181107 271189 96400 296480 297542 425513
13450 425513 512413 276928 320236 88387 161059 47544 371488 183661 206635 250035 27172
13438 227690 100059 422170 150265 456791 354798 191435 -202656 367560 42501 -142083
13427 215994 401474 207517 486486 -98422 365309 53388 74576 635437 620663 242538
13416 329787 635656 197740 150671 420834 313170 125186 345916 526245 376989 442738
13406 442738 344536 281424 406147 278108 398415 392242 381732 310466 120821 34472 130726
13395 130726 302075 -65249 157005 241129 -37496 248331 306310 425772 108142 -45385
13384 69078 282659 169148 528183 266264 158006 292660 77473 389593 170468 562270
13374 562270 352216 625923 91996 293439 250356 322659 321813 -359820 343163 424233 135496
13362 135202 621539 341719 4898 277210 254913 217983 -163910 286636 317651 226985 192424
13351 192424 249482 363428 183456 188628 258526 452641 150866 194915 202374 257529 374229
13340 374229 195115 416127 330109 314715 127699 -2436 63782 121904 35408 269471 60899
13328 135490 124652 146249 481559 10374 346072 -5222 285977 227966 18388 159721 288137
13317 288137 -56502 -68525 81245 172479 20519 187378 113466 -75470 154835 4868 134334
13306 134334 55934 190900 323645 94426 227377 144397 229922 43223 163813 246297 225781
13295 225781 -68257 -76144 231627 379524 461288 204389 261809 117395 395064 204546
13285 204546 97425 -5781 240039 262486 46277 112731 378565 49591 341936 178778 25881
13273 -135399 85394 -76232 -84832 303183 274874 26784 208182 -13394 361333 293273 184739
13262 184739 434058 399325 184185 173770 -17198 -53761 210440 22458 331919 242652 -13036
13250 220874 -56332 1003 -176968 374356 90477 26283 256865 307599 54650 183844 385304
13239 385304 312952 124765 97061 287335 171294 364448 -135308 273928 82480 230644
13229 230644 244470 203533 433071 55841 307932 -3158 135381 170862 -2323 39665 -128965
13217 395737 26618 17787 329758 -26065 -55948 89122 241392 -125659 226661 262980 336226
13206 336226 -155760 131131 181958 522972 408129 275258 114963 61828 234178 105177
13195 6113 196030 31007 -94331 80208 -216460 146554 -73873 318957 324591 60166 125631
13184 125631 245573 65966 151464 21857 246216 -1795 -107404 148798 148575 441945 234234
13173 234234 152426 -5891 137505 -156291 149000 171549 276287 -40553 84634 -228028 28798
13161 159275 93781 -123623 352093 215511 162401 43157 321640 152336 -135363 211814
13150 237771 16805 -131290 140929 153163 -83196 281186 77071 -57298 287494 139474
13139 202863 232481 -18474 269076 -78548 289176 259590 84948 -119686 -259765 204373
13128 263555 449947 62444 -74111 212383 -100189 298390 -154648 104830 243342 290043
13118 290043 -154017 -163805 280184 -7370 50884 187408 -44686 254196 238181 15857 -53672
13106 377970 -47059 168070 -86695 19153 1493 205424 -116222 -174973 305752 -64820 122458
13094 217897 -170547 -98944 183517 274500 300625 130969 -167822 -240715 204904 158563
13084 158563 200476 377055 11493 77313 134870 -20612 -266401 226381 -130499 -158387 14377
13072 127325 218826 22308 52767 -114303 217395 300414 -91799 43125 303625 155929 273772
13061 273772 -4029 168811 356305 74251 37285 283110 -174450 90006 -178861 237258
13050 -321130 -45465 -26636 49385 -315957 195354 -933 388098 -155109 -52213 -196524 197445
13038 -84108 211755 -97103 170002 109468 185431 128261 416983 119470 120845 -92208 -75114
13027 -75114 -73987 88860 -194291 100238 722493 51356 -2510 101009 222969 -146585 89236
13015 -42770 102039 251863 224427 -218 -15352 -21122 -24212 414263 -62402 125013 344341
13004 344341 281942 134420 -45867 141700 116357 205080 44680 -150152 -53083 -3630 220007
12992 260799 -205496 -24884 -94084 -87270 211215 -193165 287400 269723 -84706 274997 119759
12980 -191750 21887 -86145 103981 284025 -37078 -88009 454660 54930 -69803 41565 27018
12969 27018 324364 26892 173946 -17449 300668 21272 184066 304391 396831 398141 -214519
12957 465450 67738 -68680 -53810 208289 -102322 -85470 246727 -176200 68068 244428
12947 244428 74586 -191131 200295 -314666 496929 -127591 251407 90933 193147 111183
12937 111183 -6929 176431 251157 148216 -80072 -153438 217627 -24767 249771 -58702 -141010
12926 -141010 382382 133214 89075 119436 64733 477522 187701 101013 -146352 244349
12915 -115869 -287474 -23999 201188 262205 234823 319352 244907 -114140 176131 86915 309057
12904 309057 -75217 -136755 49391 177240 -82724 292208 -210753 -118680 134158 -72663 -90842
12893 -90842 76770 -209131 28661 81561 54661 558358 -136153 303312 74041 -107468 36574
12881 23511 173964 126594 -59885 -157977 -64825 -27522 -24734 -153929 -302623 -131043 10834
12869 133728 244037 -222468 -61678 -403654 128414 110176 -33190 312682 -120045 -184717
12859 -184717 72198 134843 -234320 382676 -19123 -83974 124272 -216645 24719 266797
12849 266797 -17322 13365 -261859 253835 156963 -3264 -25200 170752 -20589 114176 292690
12838 292690 -14363 -35968 -138996 -7166 -13416 157773 -104546 -189435 -41350 -13336 -8783
12827 -8783 -203996 -247789 177338 -234941 320869 91904 131655 19957 158129 -108397 64533
12815 29227 -87641 68465 -76466 305623 -86275 222130 -103572 231088 -334230 -226983
12805 -226983 348194 -123825 -6197 18617 158695 -162989 -130358 123725 323350 254944
12795 254944 306992 -182196 174866 375793 135433 -282040 -219959 141228 259167 -169363
12784 163623 411889 242988 -118690 97479 87133 90711 292430 103102 233676 12225
12773 -51473 208723 -194701 269117 -178014 208682 138485 153246 168306 164522 43353 117669
12762 117669 46593 -37190 -119743 -96655 -13449 218326 213971 365097 -139260 251808 241526
12751 241526 -404878 -143054 -117765 195204 84232 386098 290355 84298 286535 370694
12741 370694 261486 233070 89356 152231 -146280 258739 -173605 -27870 17416 11794 72770
12730 72770 -25480 546357 10160 166234 -105416 117495 34884 297902 13536 -54152 118787
12718 -37204 -246864 257813 -43378 -120475 -56842 -26714 186125 200167 -95882 137752 90206
12707 90206 153500 220894 -526851 261228 204637 66399 346713 124959 72012 78103 261555
12696 261555 -5592 149458 -83184 134988 -135042 349652 14561 62349 11858 -306296 -37081
12684 37943 -360081 -134729 -129511 289278 -262167 -220399 -15357 -104315 -104865 -192426 -12138
12672 275461 51944 -144086 2777 20183 230327 -142009 75089 984 412615 -5177 333216
12660 130135 9082 108437 -233702 -65863 231432 -66696 -75052 221780 -36347 459360 105130
12648 211140 -112414 371206 115472 -116536 -283072 -164633 19659 156888 317898 -258608
12637 -50790 325200 -63215 135587 277387 -435495 485023 572928 168886 432953 373391
12627 373391 85514 273850 268287 298606 545508 -23112 -4082 10594 348851 128797 118381
12616 118381 122400 -68336 3785 289368 22236 349184 84949 86744 -15829 -94460 212385
12604 347194 11976 18845 359678 236750 28856 344339 237096 218702 -142999 133887
12593 392072 114806 45303 29718 -78570 78439 61755 410312 38325 128941 21239 62868
12582 62868 158329 -284796 240398 2690 198863 -290177 -40707 120654 295506 88907 -79406
12570 141129 247142 2922 -131267 43722 -243877 -96038 8476 10905 -28638 -192071 159133
12558 -114740 323697 190849 144546 146182 -15609 152115 53600 127118 -345304 -367269 -158303
12546 -161858 -269539 131824 -138891 205479 143867 -67612 4142 77510 -167742 -73127 137914
12534 279841 -156602 -9210 293622 63350 327288 -170066 216540 -37762 374565 36887
12523 5931 206248 180403 222495 -147934 -63651 185754 127519 58953 271456 175938 -63596
12511 32065 -14191 -11344 -99662 24819 -174750 -12270 -244328 158842 79977 31688 245002
12500 245002 81808 -184981 91817 15474 -113964 -147887 -183139 200470 184831 365110 146972
12488 119621 -252043 88260 184561 -66178 100888 -85249 78615 -21980 165023 117174 -221126
12476 251276 523 -261908 402591 315235 90573 304610 -102505 -25452 32647 -80821 140208
12464 -128512 -463595 -19939 112360 -120919 -174383 -114556 82119 65501 -61936 322974 8490
12452 -48830 282612 -369009 264913 340620 -25201 -66457 -190164 185585 -56166 -284424
12442 -284424 114201 -33126 163595 197608 226994 227033 193997 50422 26153 163376 155667 55475
12429 -174395 286744 -413600 -288046 46786 64758 -52077 -132270 91906 -37858 78680 19117
12417 -117431 -155314 -130985 78147 -126187 -122020 98947 151999 156591 43590 340743 228292
12406 228292 254085 -79295 39838 -109411 23465 -239372 -32585 -118137 123700 45797 -276885
12394 -61687 167704 -107646 -166450 -34450 180128 -137921 -88965 246652 187578 -381069
12383 -441226 -97147 10352 9194 75452 95288 57835 -229555 201683 243697 265542 71268
12371 149926 16591 -154375 -80227 118794 52914 -66169 -268092 -196033 462994 -27147 -41758
12360 -41758 -292536 281805 -1061 -97187 73334 134715 216478 150715 -8960 -104060 328131
12348 -263703 132888 74861 -180138 -147618 -17744 -166026 -214554 -128121 -381053 38267 -109174
12336 -262508 12942 94534 -15042 217580 -6009 200938 230471 -364086 -92740 210978 255806
12325 255806 -152802 -79147 118108 -246598 75996 -154343 -336684 57728 238861 142996
12315 142996 88216 -85307 318191 -366728 -183012 -85676 -134725 11628 263605 -7714 -23056
12304 -23056 44330 -294188 211958 -5867 -7310 197222 -70900 30485 64922 -7305 123357
12292 378861 -94966 63497 122281 162648 -174475 302163 215712 -53014 343577 -62180 -14842
12280 76828 103378 193741 -321558 59203 -405950 22446 316501 239002 -146570 -279384 14210
12268 -209764 -144179 159097 -32485 -332352 163266 -14517 198449 -218694 52088 296502
12258 296502 -258700 -148119 68665 52798 90404 -128679 41829 83831 -122273 205133
12247 40761 384165 354217 247036 83247 -20113 -4930 121030 320593 246722 -109423 48716
12235 13374 12249 -96987 123714 -56721 52463 -72270 153364 116576 -165478 -48234 41040
12223 70707 -1755 157743 146540 -46810 101579 118352 158868 59780 241657 -26301 355717
12211 123812 113192 13564 262793 225779 128609 -27972 274271 130446 14262 401019 109978
12199 434723 17052 -150279 384696 261885 83151 67579 302570 39163 42393 9673 370623
12188 370623 294110 -43842 160630 101691 323058 244021 -25139 181693 348731 142221
12177 207178 501581 235100 16101 259393 301642 143411 -22189 -32447 169754 175371 99699
12166 99699 133647 305826 237423 171959 74142 -41246 51600 -4554 -206194 254418 269318
12155 269318 326047 284966 105860 207617 4551 58663 -109502 76659 -94797 -155952 11210
12143 -1618 138023 -267058 279276 -211034 -24594 260659 58558 -128841 -324213 230761
12132 85834 -202296 193332 52352 213141 -189351 -203100 213390 -20297 139065 -189964
12121 -115702 -118031 196360 126299 268457 -13533 24318 -8708 -331202 -128844 -77188 -306377
12110 -306377 143475 140500 23484 4567 65090 -23630 203276 -58820 -185162 59413 -30442
12098 -205622 9024 155742 177720 29111 65067 48561 -28246 -222650 253978 243084 46944
12086 75506 86549 132198 186203 72086 44373 -343936 178865 6997 223265 33288 -172566
12074 104823 -25158 -68782 138672 -97136 271478 -134117 6426 -63049 -157042 292316 -160895
12062 60979 367497 -22280 93226 -87903 -18723 -13634 38907 69756 315824 310889 762820
12051 762820 1159557 571739 176406 138646 368928 81696 115337 283024 -323513 234474
12040 87730 -310806 -57155 -91270 -136675 -70270 27518 160390 1495 87532 188367 -120912
12028 204909 -119437 -202587 -8920 57706 116465 -216016 -122628 137575 21960 -63719 51483
12016 -155810 5721 -144042 -54059 112325 98864 -49259 -34756 -194184 -15751 -48525 -138692
12005 -138692 -167235 227233 70512 -229849 -60220 -140833 71990 -231147 157062 518629
11995 518629 122356 -200279 -166130 -131306 -269590 -55866 196647 -111622 -80932 -82461 28312
11983 -38901 -24987 -147628 89743 -59632 136069 308008 -54674 50660 -3488 8405 -101830
11971 -64268 -35811 -152167 398635 12501 218252 87692 19942 -100114 -185123 -215101 -140952
11960 -140952 283590 -27732 89129 265336 61280 -66089 -109568 -1140 57989 144758 4196
11948 -65964 -213731 62455 -32431 -48461 -4589 -81457 4081 -223103 84742 -194132 86391
11936 -11210 177195 162451 203958 -378919 118478 -41395 76472 201698 -181550 -242884 7151
11924 -32753 -15099 209083 -121104 111756 -47485 -373779 -125717 -221428 330582 -201287
11913 -29167 151217 99761 174521 -32032 222871 -138585 188455 109290 -34953 71042 81498
11902 81498 266235 -366900 471802 -3424 77362 193993 321158 -5396 -228626 -203346 172507
11890 9467 -129102 -223451 57535 -13562 -235923 -317100 -263175 -206674 54337 288062 -7683
11878 83047 -185287 80072 -27382 501063 -96901 -188070 16585 100657 -158038 27252 -21465
11866 7628 -69104 24898 -95219 170358 21590 -196015 101273 60028 108026 141061 -300457
11854 96462 -268238 -342563 324653 -304947 87209 -28463 -199035 74229 -138640 1514 -35724
11842 -226917 -17451 -361172 60998 -71650 53002 288188 -169473 81875 231791 -86816 -98201
11831 -98201 -42526 72502 -82817 -194981 -198003 3339 -356366 -156536 127476 53755 -451104
11819 78927 -135396 247457 -348299 -199504 -297811 -130017 -109312 -281702 -116345 63968
11808 -47171 344554 -24283 306030 143712 129620 -362429 29947 -141789 -367027 129354
11797 111135 239554 -17834 144609 -107190 -179769 71123 -135652 213442 13102 -374380
11786 -5338 -38530 -118403 -316215 -60523 -262438 -63648 222111 -358193 192685 -234164 234736
11774 69361 243032 -530469 124471 309781 -329815 -279588 -154204 85402 -310364 314159
11763 290404 -290456 150170 8704 -166074 -4158 200130 74686 -554771 -13581 -97332 -50069
11752 -50069 123283 -199947 -72473 -59239 -130546 -268068 -145131 -227997 124171 81617 304785
11741 304785 263062 194540 156575 126513 46126 -265399 123567 -217052 209766 254903 179669
11730 179669 -203318 -78576 247134 -165202 98719 -40486 105839 -70741 223845 359341
11720 359341 42631 2343 -127823 -101928 77589 57610 334928 -83589 154455 -23647 -37032
11709 -37032 -95820 -150812 424568 -2726 -30511 253738 -182369 255377 -124445 -6563 14132
11697 -343380 -143327 32222 130062 132334 101057 -135546 49376 -254068 -136702 156595 -272080
11685 -83910 -157697 -105656 -59008 131812 -43391 -21859 -203396 -12478 -27536 122330 -87076
11673 -37796 -213691 203875 -108787 -324351 -375830 14412 -3172 124675 -36958 3946 54233
11662 54233 11361 -55441 -349981 -16407 -156646 29174 -47717 -48254 -195425 -95763 -40763
11650 6788 -287980 118590 50625 88910 -149188 32853 -567084 -182610 -150532 -55748 -168651
11639 -168651 -140094 -49180 289439 134697 54787 163932 59471 -159029 41200 219884
11629 219884 75825 334289 -60635 -112434 43039 -126705 -278947 -57915 144866 128906 -441551
11617 -91438 -60442 -230953 -197288 -178670 -87835 -41828 222411 -92841 231261 57543 -65795
11605 -444629 10534 -152639 72533 51461 18198 95424 -81094 68920 38622 -270215 10769
11593 185610 -315049 -76828 1708 -277603 -464943 -414053 37051 -57794 -37205 155298 -87625
11581 250270 -110386 -236314 -45969 -276732 30596 56386 -186245 -82268 16074 -86082 -66796
11570 -66796 -32196 106332 -304435 82006 -38725 -36705 -84728 -130593 -143144 -46033 -474946
11559 -474946 -401210 -53368 274827 100061 156230 43614 250582 -315261 -177967 -66480
11548 -1504 195038 135416 -228141 -420491 -138909 266472 98506 130726 286297 -5953 66418
11536 9708 230656 299 -22122 -78079 21742 75983 -39223 -152436 -176412 -386957 23804 241041
11524 241041 235030 129674 -294162 198055 80544 -29033 205312 104570 -140022 222891
11513 177876 -242442 -13058 198815 126657 -303780 154134 122588 66855 191224 -43707
11502 375468 173207 227074 -14134 -91547 191156 268701 131953 228121 307001 -37201 -193738
11491 -193738 246467 269548 456078 183365 113672 100578 335217 -142996 186012 209843
11481 209843 79428 -111300 -73360 173197 376364 332948 -28976 4254 -240557 393383 136651
11469 469686 -85100 252599 -26172 420188 -421082 160397 70859 23733 182049 304799
11459 304799 106032 111947 35704 -66231 42589 64897 34463 275956 263855 76119 -80432
11447 -186055 141137 195040 -89548 -117122 141526 56877 175794 184940 -66062 212582 -71901
11435 306146 178827 -267134 40224 187548 -157419 268614 -485005 289684 194232 386826
11425 386826 122795 212765 119866 43392 -20066 -159765 62585 188430 179403 -328669 273542
11413 28144 -304289 -78413 -86648 54176 -10550 -134650 -378388 116187 171544 -5221 -10672
11402 -10672 102561 -218133 -212151 298917 38645 88190 -286470 58060 -22905 -194649 -240233
11391 -240233 -78686 67708 -223275 -72870 -28500 36411 -3541 -262148 -194648 -240596 -21628
11379 -395360 66595 -55262 -77987 -111782 203845 -230190 -122467 -84092 -106449 -302030 95324
11367 -270380 -46499 31822 -173929 27513 57633 181399 -106930 -352678 6506 -135058 110364
11355 146608 286826 78588 -207072 -159790 -66475 51234 -107871 -93096 2544 -211050 -370415
11344 -370415 237358 -248888 143275 69791 -114252 139754 -56313 239063 -366943 -378541
11334 -378541 -122312 -98877 173290 117585 28228 -44679 139703 38069 -32158 -29779 -5786
11322 -134495 -78597 -250386 -170695 26208 -123338 264419 -349807 30020 -3748 128035 452786
11311 452786 3053 -14964 -1388 124078 -366179 -265697 -36827 -94176 148692 357191 222763
11300 222763 -54730 72343 -122827 82966 102716 186848 53724 -148943 133515 -29067 -44922
11289 -44922 -218144 9650 -9720 -159441 -91138 -171169 -4818 -265081 -38897 -115401 -258065
11278 -258065 -64606 -15025 -13257 -81876 -24058 -197594 -201371 -260354 -83467 3754 -283533 -135090
11265 -9672 -113189 367233 -149866 383288 132897 -20302 -54440 -89913 267427 -136637
11254 -16458 73049 70311 36373 -160847 -55295 7950 137614 -238480 -166302 -349107 -118242
11242 106443 -78156 97459 32665 -146702 -162081 85474 -337941 45628 -180920 584376 209922
11230 -166862 42436 -79647 -40609 -316713 -273989 139556 -356997 -55290 33413 145327 -192891
11218 -212825 12319 159983 -93569 82687 -161202 53493 311845 215625 -169392 -73277 213439
11206 -5875 128234 30123 17927 175827 -74034 -130213 105173 60834 -26283 -167649 166433
11194 -213003 138290 -191183 -223922 -111363 -181875 88725 -154660 -180509 -61206 -14145 165514
11182 -264690 145950 -124507 -231713 1517 33800 -277514 -95018 -108664 -241543 155465
11171 -94792 -234056 162084 -216799 385920 -80385 189340 61519 8837 269613 -68030 -78864
11160 -78864 162024 127454 -99434 452643 44464 148565 -143312 54937 21257 154013 154518
11149 154518 -45318 130228 185810 157147 83207 209031 -167395 184020 -10056 118703
11138 -87921 152495 214551 22470 129563 -123523 -137724 169928 23894 339095 -154774
11127 89702 -100398 -6066 117090 264463 60671 -201302 -281962 -119275 -131612 159152 56695
11115 -73134 127976 107600 263997 -67194 314493 -189581 -136111 -268781 -199222 51243 280303
11104 280303 179164 185314 220279 -5503 117075 234103 24123 402865 25765 337179 418543
11093 418543 -20999 15907 307692 -197373 31569 -35074 249169 370048 39813 271134
11083 271134 241871 -56540 225211 85919 212013 49457 492252 147722 119973 247453
11073 247453 189840 49398 -30392 164051 361348 318557 295963 390294 617428 323647 272779
11062 272779 508245 472198 509830 661116 361252 275977 210022 567839 306979 296897
11052 296897 882339 623677 472312 567872 508022 825780 777730 496888 808657 512744
11042 512744 568413 574421 383668 569567 687630 711210 670895 456382 729954 776612 625702
11031 625702 468790 797457 615275 816860 629622 661295 885762 819998 664892 602957
11021 602957 497524 424568 608372 544470 252783 446798 623775 385513 290234 632505
11011 632505 670248 395286 456398 566517 249918 715960 586743 473769 538837 832746
11001 832746 476389 402230 466742 827398 582086 337016 653394 568778 703926 654936
10991 654936 691108 668843 841516 473751 346475 633657 796688 849746 752280 993748
10981 993748 1081124 1074577 841220 1292395 1595827 1802116 1544727 2546526 2577346 2340687
10971 2340687 2734945 2379406 2306154 2421812 2104277 1964527 1333298 1511037 1141207 1098598
10961 1098598 778517 540535 871834 790179 986732 831625 984393 561466 603665 180083
10950 357697 -33102 477116 125294 461775 191264 -155767 -33821 -74069 275338 294293
10940 294293 -62536 133727 99735 199519 112975 429756 -193407 95817 -7012 255778 -13687
10928 147880 -65197 -127740 -94407 -171242 -246139 234998 152608 567079 92097 57152 74095
10917 74095 -74641 -42751 -170118 221423 240312 470668 -64104 -46499 53005 -161152 -335039
10906 -335039 -23326 -257177 140101 187393 185009 263393 948 -28357 -255152 -121794 13436
10894 -219596 180049 7935 -212723 302650 -289141 102389 -63264 -47109 -277290 34251
10883 72977 33061 -16579 -267203 -8870 -133945 -35042 45833 285 -118766 -105245 -57076 -85761
10871 -85761 55701 59191 -17835 -182732 188555 144407 -50503 -231553 -89048 179245 39073
10859 -9237 142525 134132 112106 66322 -64191 -205055 266461 99969 14704 -380119 93145
10847 28713 -108902 -13682 327255 -34874 210996 -363624 101013 -33077 -60175 277014
10836 193641 159146 189755 -34394 189876 -94787 -166946 -153896 114105 -30717 -52665 -292388
10825 -292388 137090 -53807 212940 -142476 -76944 46512 -63273 95936 -459242 -258557
10815 -258557 -39976 65791 82586 35858 -76009 -90304 325676 -249928 -18031 -200028 49075
10803 -267662 461638 -187682 -471887 186606 -51936 87277 -159191 -106212 -265968 170034
10792 -228413 -5003 27298 -167308 -5339 -144522 189955 -239498 -131361 222108 -197005
10781 140342 -150909 236597 -524407 155972 102336 -246040 113427 24624 -64385 -60932
10771 -60932 196271 -16144 -990 150651 202947 -25304 -107535 436248 -117667 -289091 -117603
10759 -264594 -69694 44993 -231060 115413 78281 105693 53070 -37879 -135582 -183849 48600
10747 -296156 58204 117201 59069 -112809 366701 49366 -86634 -118739 161993 248905 -128254
10735 -214630 114943 -134858 -145903 26451 -149275 -235220 -120680 -149251 83984 51932 371697
10724 371697 98742 178286 72037 -131446 -102067 -94566 -125158 206157 254278 -85484 190804
10712 -310555 -362971 -237485 343287 35220 -127530 -78836 -211016 -285773 -412710 -75187
10701 9619 -180099 9051 66716 -161799 345252 -135684 -2181 102760 110955 -348165 134138
10689 -67858 -161117 -62226 -31228 -449337 -133156 -157370 -121677 -41806 7518 -105877 -196429
10678 -196429 -189619 -163185 10615 -25500 -27471 -304467 45583 192963 5446 -176087 -99698
10667 -99698 -298941 308745 -56655 -78734 26386 41849 -175389 -143230 84684 -357309 71486
10655 -72502 180860 -206048 254341 -110788 -221458 -19171 45730 154210 -56476 -9894 -16736
10644 -16736 -109988 -137179 -29477 -148123 -119813 -184844 14780 -3392 -90455 271887 152571
10633 152571 -255663 -100367 -201581 -150258 -161347 -99367 -222914 -248892 -109166 152572
10622 -226737 61379 -122297 -225064 -183758 -81369 -282145 133620 284410 17699 -60018
10611 -28391 30979 -70798 -64484 -117716 -73202 -473422 -517162 -50440 342162 -4095 -79754 -242824
10599 -242824 -195670 83042 -288595 -315045 44116 -247862 -210692 375540 132246 170695 -304858
10587 -180094 -63429 51742 97698 238157 84467 97558 20513 213899 59636 -83146 -390901
10576 -390901 -59455 -68371 14893 -231973 -99112 -49305 -87025 -214514 -41011 192650 290428
10565 290428 -147482 39657 13351 252985 -78592 -181429 -269645 -16303 131520 213816 -13918
10553 -49393 181340 306267 -458414 43943 -95859 -42717 -175500 -102627 -167162 -89986 89133
10541 267115 -48187 -55089 221148 33884 175609 -42578 -45870 -293867 45140 -43421 -330061
10530 -330061 19114 -90960 -179878 22375 6060 274022 -160569 -54862 -82920 220998 139710
10519 139710 193989 -69372 -353279 25139 144751 -85756 -93121 54583 -22211 -588720 -57195
10507 -284410 -203285 33317 -82540 -110700 404817 -39152 -14382 47636 17014 -198600 -149093
10496 -149093 -313982 -71225 -234031 171362 -55251 149742 113261 -3374 111745 -45335 -30111
10485 -30111 411108 -118469 -46743 34904 -15596 -238813 -266454 -26160 -22593 -69185 -147735
10474 -147735 50640 -53617 77612 288377 -280562 -333800 84559 -218498 -30811 -129051 -142693
10463 -142693 -48785 357168 -537624 -11285 -228164 60658 -56922 -115625 80450 -67003 -119580
10452 -119580 201581 -274727 -138012 -150256 28795 448737 -168124 -191765 263293 61431
10441 -33398 -118520 75905 -25932 -216282 146080 177224 -244222 -22259 -30885 -255003 150580
10429 -71525 -5085 232707 -369577 274262 -26266 -113561 65104 -42686 -20281 -96384 -51331
10418 -51331 -185975 -24501 -103584 109245 42501 -230829 -31304 97902 141312 -283738 100909
10406 -320578 -167451 12279 79217 278046 358809 -139748 65811 227970 -157128 -123429
10396 -123429 601833 167276 175815 -89711 194931 31763 90121 375603 -198842 158407
10385 -32088 379332 219670 13503 193766 91697 210727 427813 126034 250706 436095
10375 436095 415634 232663 207278 -84575 138305 311591 220667 359172 519455 787457
10365 787457 426977 464245 372122 485977 425038 242611 254988 339826 -128751 461053
10354 463913 -94633 601744 416997 118407 349723 277955 273115 17760 348683 -57310 -23674
10342 440348 120522 337665 -183305 -1881 -82086 219968 136491 346564 40806 -147095
10331 259391 138661 171004 -73251 8759 180993 46277 -210579 -123710 -18124 403642 160755
10319 -36573 377554 -20240 101866 -159025 160182 293273 -68796 -75399 -237049 -240886 -92244
10307 199220 -336195 192208 -229647 78758 -156792 123086 144905 -276788 -119125 343400
10296 91785 142345 138665 -69435 -235536 71053 -6513 -72393 -260695 32168 -134415 98695
10284 -101640 -55822 -21531 -178171 -70111 -303008 -30500 -94910 -43813 405095 -16573 -67748
10273 -67748 -253816 -180323 -41581 67049 54906 -283403 150805 1955 -21231 57432 119590
10262 119590 233878 214585 189343 -47361 -115584 278090 119690 26355 154302 -79267 66006
10250 189867 -249217 198519 59918 -83693 1869 181357 -95631 -125910 100945 -316108 -245113
10239 -245113 -93908 -92138 -132288 -13932 4235 368399 -235587 27985 54245 -67996 71423
10227 25522 166335 114198 182771 251930 48685 206012 97753 21915 347452 213966 136842
10216 136842 23867 -82602 -2264 -267660 125922 -309470 -327227 -212676 14275 357799 -383206
10204 -70043 156989 -377789 147317 -1818 -320337 -133551 -140594 -197906 184665 -61411 228429
10192 -208087 307158 -198330 -84295 -120714 -101860 389149 -417491 -329067 87467 -56635 -71520
10181 -71520 131633 -279766 28136 355030 -136129 -378112 -45536 -225358 133054 -146878
10170 112841 4444 -208087 25182 31139 -84777 -227002 201548 542460 145770 -154201 229920
10158 -171486 -59516 -246231 -311237 -57042 -281461 -217165 -323375 13233 -170595 -9258 68614
10146 86692 -81109 -198985 -19623 -68646 -317852 -221219 23459 40102 -150438 102901 -69681
10134 -39019 -262138 110712 -103099 49665 -59073 -71672 -234825 149747 74432 -276126
10123 -361088 115295 -278356 123662 -67246 174614 -269930 -17872 -43929 243916 -11275
10112 -149626 50409 -180192 -113103 43486 -224605 84409 -201877 -109497 -178076 85218 12948
10100 9589 -186617 -117176 127278 -171714 -3786 73124 -113909 16491 -30220 88484 391023
10089 391023 -179162 17703 -64129 119666 -87546 -462811 6537 153884 206251 -125119 -113842
10078 -113842 -47215 287092 21485 -61543 -31255 -19781 156984 221745 24068 15616 -25746
10066 -228866 -361984 142657 37418 -209220 107905 -67360 -192746 95566 35888 -91563
10055 48034 123585 -12253 -188830 -44491 -147022 -280636 -161018 151789 212680 -276829
10044 -236977 -300161 -123329 -53258 136704 8223 58213 -3406 -48268 -48069 -9015 159130 37948
10031 -208149 37839 -65502 228710 86564 -335693 -335584 144916 43799 68875 155956 -62027
10019 -6407 -99688 222335 -206800 -63789 -262868 447405 -225000 -24458 12166 -250867 -103202
10007 -522558 -1227 -39652 -19806 257905 -153324 -95626 -205041 -12436 -28921 6555 -91201
9995 -489052 -217877 132295 -152536 -159676 280255 116052 -72524 -95079 -136062 -136133 420025
9983 -25931 -102027 -1719 -25147 -197932 280145 4872 -216905 -179398 -237036 -174993 44533 -17022
9970 111381 298051 -126736 -248810 -102659 166971 -357846 43115 -260940 112769 17442
9959 -95843 -57602 -211035 -48751 -18197 -123222 54367 -94331 135555 29967 278345 58795
9947 -120908 33765 -97008 -12974 192247 -470091 76731 -206251 -72632 -395193 -223007 204414
9935 -441372 -36909 -213446 -525255 -82046 -30592 -134089 -34238 -400487 232216 -56592 -38658
9924 -38658 43137 -4940 -331938 82034 183389 55956 -234145 34898 78519 -248519 31830
9912 -174037 -131954 -80300 -300805 -82662 60402 200085 -201157 -166158 -82335 -113552 10765
9900 -443271 -179779 72869 23750 -4825 61533 96883 -16043 78742 -28862 -16899 5577 -121831
9887 -249710 -203096 -491074 295998 -227950 414597 -3319 186059 -307254 151214 90097
9877 90097 28873 -225176 5967 -16836 -462049 -186716 -496899 31440 7837 -198518 -118894
9866 -118894 -107002 6563 -5384 -16616 68872 71125 -48436 305566 44119 65481 144287 -151568
9853 -321694 -69482 -118491 62759 -66641 -98020 44510 -169300 -1726 -109137 -111019 -13457 -349945
9841 -349945 -181329 -220966 -66981 -78904 -380918 -5647 -135158 323464 -142591 32001 -52423
9829 -88521 4271 -125905 147592 240801 -123523 153243 -91623 88808 -24624 -76844 133766
9817 -36270 70130 102544 -151315 -146744 53580 -45338 28860 -195919 -40062 211429 11129
9805 -137960 -248949 -49222 96747 -49915 -293428 -295541 -215511 -4591 203316 -426413 61904
9793 -41580 -241585 -152536 -193901 2464 176 -36420 160718 24910 143727 -271733 -100150
9781 -193394 -225361 -49544 45940 15298 -178646 -207239 201688 162247 -103460 -188593 108028
9769 81512 -174713 -34232 6848 2538 -349948 -192394 -203467 -1389 -23574 8822 -106881 95836
9756 -140601 206978 138296 -41902 -206566 16958 6364 149387 -155144 -285123 -118630 -105210
9745 -105210 4800 105007 -240430 83056 119721 -165315 -3963 15082 56002 -76816 -46316
9734 -46316 146179 481 45543 85813 -356760 -119510 173823 -241222 153967 -105736 2538
9722 85089 197481 -23745 -120403 -207177 86475 215581 4243 -29269 -91556 -247090 -62057
9710 -48663 -3073 44115 55962 74325 -274320 44499 -202738 -156548 -107500 5123 54063 -169646
9697 147388 -262937 -159686 139379 -29335 -8370 -3373 -190048 -269046 -126200 105743 -37918
9685 -78397 19316 -349916 -74719 -47919 -27957 -7892 -5411 -161020 -462404 22432 17939 44977
9673 44977 14837 71264 59279 -223111 37042 -188639 90453 -46710 61009 62497 108923 -118897
9660 -31554 -346266 -243064 -231316 179587 50050 -173969 -203719 67334 -60939 112267 -258074
9648 -158003 34448 -89246 -75634 -27465 269047 263006 160515 -240291 3426 -140499 -219387
9637 -219387 -70309 -140257 250768 162891 -11152 39036 -308865 135132 169783 -41479 -169976
9626 -169976 -126673 40328 -143796 -62513 -354653 -122872 -274469 -148678 294191 -410068
9615 -53325 211225 -43090 77949 -78059 -30014 -121321 268028 36624 14741 -207181 -287339
9604 -287339 -13812 134369 -107120 58460 -71896 54217 -230422 -1198 -178207 236591 -79138
9592 -178152 -225938 16798 -51345 -73811 -39549 -79482 -10418 -366071 -179463 246565 -206932
9580 -163038 -109085 -66449 -186677 142808 -328547 -172643 -217593 11888 -78736 -123326 139768
9568 55464 -126678 262929 324782 -235240 -46871 -302636 -126903 -163362 -196899 -56005 -202668
9557 -202668 253742 -81131 32850 -270144 -44948 -153040 305683 -130121 26865 -115558
9546 -82203 -252872 -444205 -44986 -242430 -100491 -252597 40732 -33971 -59662 89839 178122
9535 178122 -221079 150391 -172976 5141 55769 -539607 32508 -4394 20219 -14934 109708
9523 170310 -48739 -285516 -23261 70762 -13547 50299 32190 -12282 -257484 -163090 -20287
9511 104503 48729 -76734 119699 -198700 -271858 -55798 56014 -341085 166170 262153 -43546
9499 143878 -20428 21252 -116751 -148952 -88879 -68878 -47715 -330 -637877 69990 -190016
9487 -208086 11313 88476 -65859 -201922 -125179 -288695 -34382 61549 -26495 84989 -93322
9475 -94664 -77136 -159129 11937 -120640 -310640 128090 -55504 287511 31083 -2200 -47428
9464 -47428 -15208 122180 177104 -46156 -239570 -6019 211416 51365 -335287 -452366 152796
9452 -11133 -4773 -239192 -278007 108233 -23074 117651 -208964 -154484 -69510 -31359 -230965
9441 -230965 155992 -137624 -533687 69609 120609 -34160 227436 65750 87153 44109 -319823
9429 -197371 98470 -238818 -226620 -78511 -96608 -226473 152483 38208 -115182 -289971 -53276
9417 -401615 -108981 -154073 219686 114877 48722 21924 -212836 -5551 40679 -173125 -11554
9405 145212 -93346 82145 -64803 -146157 359993 -162626 -247719 -239858 -131629 -163340 -163930 -40606
9392 100011 425830 206820 106824 93006 -12247 53046 -268733 -57033 127632 161390 -99311
9380 -118144 -297115 228080 26899 -123849 -415843 -43108 81425 29768 -41606 -133798 -198192
9369 -198192 -166718 -16453 -169020 -222111 96288 -143710 -197229 -3679 -193861 29899 -263656
9357 -87803 -155497 205823 159208 113896 -237577 -105150 33423 17006 -87753 -98157 -63598
9346 -63598 164205 -35562 112025 -198573 91102 61884 -244853 -81646 -1726 -186816 -541343
9335 -541343 -267355 98 -100829 -141031 -21879 -185242 118510 -204461 -85324 -186626 105483
9323 -140475 -15128 -183526 -117739 -220078 -287716 -25299 -177172 13202 76888 -242185 -24791
9311 -114711 -170200 -307849 340 -111295 -212959 -126442 -165175 -12125 -210367 -15523 -114798
9300 -114798 59996 -198386 -98946 -3440 206578 100290 187053 -12783 -9180 126049 -165003
9288 -69215 -149048 -64657 53485 83125 213297 -174326 213357 -258343 -507601 21489 36274
9277 36274 328813 -64666 93821 -30582 -152344 -10717 -147642 -181189 -35297 -174871 -219133
9266 -219133 116268 -14271 136672 18809 -192405 -319637 -4604 40218 146798 176563 222339
9255 222339 43742 210099 -234228 -35360 -69733 -1028 -67080 -271246 -74554 166368 -187451
9243 -201126 404548 -180937 13420 -123417 -31538 -128342 164293 -136616 -106049 -81217 9545
9231 85013 128500 -383871 121581 -129822 -28826 98742 -47938 -420329 -105496 -108445 -98678
9220 -98678 351707 -12101 162632 -116627 40851 -152892 182347 -156327 -211009 -219886 -86100
9208 25894 -306883 -216313 -350280 241814 -107754 77525 -56779 161303 -67634 116932 177844
9197 177844 -483710 45083 22603 -177204 -357894 -255468 -242088 92168 -231766 98045 -83210
9185 181768 -53362 -80086 296242 -85397 -252451 247749 161411 -240426 -21791 -148373 -41818
9173 -134522 -122511 -57241 89695 41953 221323 -89447 85578 -84335 -231735 92502 39356
9161 135928 -180796 -190708 44293 266869 26049 141715 -93430 130081 129483 -32045 86147
9149 -34055 51708 -261125 88292 -91597 157043 -541742 -326439 -595151 97912 -29146 50449
9137 -173366 156116 -67015 329610 -248908 -37801 14264 -234045 66990 165082 -86375 -66799
9126 -66799 -123739 -219041 76829 127251 -180450 -37190 -257320 4877 -238878 109873 -119184
9114 -25810 85756 -409624 197552 326864 -151887 80379 98050 108058 -265453 -58031 164699
9102 6814 -88047 -15017 -220100 331647 -194171 -67762 58228 178443 -175841 -70008 -317510
9091 -317510 186377 -27120 32492 148 -14875 210131 -6917 2695 122333 -369837 -159678
9079 399017 -134962 18694 -114437 197425 181712 11850 -232686 -83592 -144396 265801 -162068
9067 -168889 -352246 -104077 -126935 11924 -277851 -1503 141429 44928 -469832 82475 -61019
9055 -252159 -905 -124690 239667 -334733 -41237 -239221 -88195 183059 -22428 -335286 14002
9043 -263273 -97342 179325 385792 75911 109923 49898 106202 226907 11190 -149501 -139411
9032 -139411 -396932 205110 167725 -15746 17218 26420 -183676 121725 115156 -178555 -91700
9021 -91700 56504 -112223 -59902 136361 105146 101238 -141847 -653272 253135 -252789 -21339
9009 -39200 -68169 -125634 91590 323338 -115150 208941 82332 184189 -17082 58651 -145389
8997 -155558 -6383 133415 -143248 -285033 138579 -305160 -86376 -358158 -81120 -185821
8987 -185821 -122215 -14489 -175690 -31832 79569 37457 -253959 -229650 118457 250666 -4813
8975 4436 -196531 -46676 -213425 149192 -53273 -97753 111796 210725 -368077 81231 -336993
8963 -240579 -148129 115442 -164597 -348969 -46085 -6527 -343013 89659 -176849 -115132 -247429
8952 -247429 -182262 98572 106309 -162921 -210169 -29854 30156 214660 51684 -141147 -271190
8941 -271190 138950 -64504 71792 -91418 168495 -16379 722 276240 458753 198619 -175618
8929 315733 -55942 50398 291537 196323 299969 666652 1351037 4876449 9390921 2702525
8918 310768 17179 262803 98492 312367 327649 -117601 935 -183490 201949 -34445 163786
8906 395588 -283 168928 -321737 -202500 -69200 -108218 181924 -188069 -184942 -124492 -295853
8895 -295853 -96293 -87728 -55260 -94966 -169478 4666 -3272 52163 112838 -349783 241123 -31538
8882 164281 157391 -147768 163905 -156728 -42197 -195964 115323 -240278 -60763 -230782
8872 -230782 -310448 -237531 -46188 -113945 111053 74549 -369347 -37930 -54392 -152834 212067
8860 243140 -195174 96917 86747 -19880 22023 33133 -213844 -140326 206607 42655 -139220
8848 46692 53215 191754 -297233 26505 -9234 -222620 60001 148098 22669 -119670 -246821
8837 -246821 -43153 40357 -159414 -8209 -50190 151897 122148 122103 84603 -355379 -36736 70915
8824 -163430 -74726 -186609 -105860 71068 186814 228571 -25128 -47104 268264 -156904 -153654
8813 -153654 -550 7610 -121929 48239 -300820 139897 -82789 -73854 -12351 62373 -85364 -148809
8801 -148809 -162158 427041 103439 -297028 116544 -56799 317645 -157226 7088 211231
8791 211231 -307297 283441 30285 267521 56467 -32062 -138607 -273063 -200326 -50929 151509
8779 -8966 -275451 -124939 -256586 -182463 -99658 21078 -190208 -87240 -73869 -259749 21993
8767 241875 -25798 -23323 90313 11253 73031 -24519 -255979 -51555 -277099 -11683 -58824
8756 -58824 157560 -336577 236762 107722 -126268 -85539 161453 -215311 -288312 -244899
8746 -244899 -92558 -33671 47314 -262305 -132184 144277 -20283 -110239 204340 303964 191715
8735 191715 -38733 74499 -323030 81387 4498 -218436 -449178 -43105 64246 -112899 99871
8723 -2032 -78548 168165 226612 -29706 -12303 25847 15422 -38914 -135572 -146834 -201185 256377
8710 -89353 55434 -12624 -130762 184202 -423761 -116859 -374739 89021 -311886 -48324 49314
8698 -4618 126068 81989 -179752 164997 71352 258320 246170 -38363 52653 -65456 -146720
8687 -146720 8149 -160878 394377 4634 -226186 -390206 44755 -241700 -267653 -57775 -44490
8676 -44490 -16396 -182990 184676 144221 -156885 -114463 51744 -153814 -3593 -84341 -98912
8665 -98912 8947 -35287 3862 -6801 -89973 -39815 15773 -79289 -319596 -199265 -9549 -250366
8653 -250366 -157233 166877 -330504 -863 -65082 -434356 198998 -142502 -69875 162974 104076
8642 104076 -137293 10083 -249247 -343098 -110324 67786 28178 35960 -241795 -198727 -146807
8631 -146807 -101422 150998 157425 178224 84324 -182661 -166027 -208967 -246284 -328930 -194830
8620 -194830 -44053 235455 183948 47637 350194 46014 -46435 -72946 -320421 -92083 30053
8608 -222247 -447601 161360 124582 -123239 -264054 305032 -87305 -87430 -128070 208371 -406825
8596 -374971 163833 -307206 -210711 144014 -104223 -147443 -149200 10015 189132 -184517 54946
8584 237598 7468 -296101 100484 -6252 248649 -22018 -21703 -498334 -30070 -92806 -197471
8573 -197471 112853 75545 283061 -297633 -145590 -90216 -22680 70993 143522 28393 225429
8562 225429 -87977 -14579 -67720 -104820 74981 -47802 17245 -36804 5140 -31000 -137593 205586
8549 470879 57089 129223 -39926 -58253 -52836 -99646 100604 170980 -158416 -68289 -139054
8538 -139054 105427 22696 147630 -241474 243965 -231871 3829 212732 -134594 -420457
8528 -420457 -424573 -4188 147567 -135614 256312 -4179 -148424 211718 -136315 -137934 -110430
8517 -110430 -160893 -92296 -93271 -155200 -132483 79345 123303 -422224 39485 461106 29577 -400775
8504 -251869 -240083 -32073 -37790 112944 -237851 6574 149649 -897 -58608 -309859 -80257 143415
8491 64590 116314 -103772 114846 -107744 10979 -303540 -110186 -29313 45580 -7938 389452
8479 -79013 -134644 -124758 413 360206 72531 -220366 -107386 -170678 105452 -2535 -245377 -307595
8467 -307595 -61395 -146182 -53707 -170512 -343863 -245891 -232148 -80123 -262974 45583 -232434
8455 196245 -243863 22465 -260417 -13213 -79537 -318485 -233097 -292987 42941 -255329 -201155
8444 -201155 28558 55391 -33608 66710 97182 -112455 73120 -126428 188549 -120825 -333827
8433 -333827 -181948 -200217 142674 138322 88522 -151331 -67162 -272903 -148300 -363338 -57607
8421 -2693 44313 -97737 43425 -58906 -22745 -21006 -148117 -125532 -48186 168410 -179007 -148147
8409 -148147 -30283 -276371 -15418 -323551 -161318 -275908 54057 -361804 -146189 27030
8398 5219 -209787 -359937 -446918 276199 -182165 -69945 -61503 -101639 79279 -388516 1313
8386 -134848 -54455 183318 58495 -87178 13728 -22835 12198 -256453 68487 -170104 -211656
8375 -211656 -76252 -343147 -23434 -207603 172760 -86138 -222135 205868 -17515 -20212 -18478
8364 -18478 355387 -10022 125563 -145531 17676 -169391 -307641 -173808 -58165 209254
8353 -4804 1506 -384200 72959 -57125 -132372 -11684 -305328 194840 -104752 317183 77467
8341 -147249 -225519 317710 46897 362224 -30770 -321809 282691 124239 -42528 -377855
8331 -377855 184688 -184903 -225943 61216 -37801 51667 -420820 97122 4250 220617 5242
8319 -288270 1358 -293872 -82611 62969 -259112 -57698 -150200 -203248 -299813 66860 20600
8307 -58455 -236962 45340 -146419 41150 99603 -509 105945 -412684 -127446 -2465 4201 65491
8295 65491 -212915 -173098 21556 34173 156491 250297 -181331 -485259 231784 -233097 -450747
8284 -450747 -39887 20768 -3881 188368 6958 256187 -48152 -376775 -96812 30999 -328151
8272 -216979 66624 -42474 45472 -348993 68438 145750 -18070 -172016 -187101 -29390 98857
8260 170149 -208505 -325026 -61189 -34407 -24135 -44765 -120930 -130806 8027 -68572 -281551
8249 -281551 263960 -446576 75725 -37022 -218012 -106847 206471 105684 -39945 -166918
8239 -166918 134554 152786 228325 11981 392164 209464 -76563 -155941 -24211 39881 25542
8228 25542 110945 103936 -27744 109365 -263706 -157522 -164076 24907 -11170 -33038 -60095 -28857
8215 3901 24879 89341 -178506 -17097 -56604 -229778 -50061 -229831 124455 75112 72442
8204 72442 -192043 -444761 -64494 -103110 -87645 -41629 -329129 -202866 26943 -156952 -106632
8193 -106632 -5284 -54428 29659 259065 -136705 -101561 -232127 -142406 350307 -128310 -168867
8182 -168867 215273 32945 -13564 123644 -283393 198150 -120923 7134 -198961 -19239 -75625
8171 -75625 -175359 -20901 -79698 59802 -460421 65063 101176 70601 -202557 -115242 225007
8159 114628 126301 -120831 -252133 118658 -55488 -197883 -94967 -217944 -173229 -42179 -200137
8148 -200137 33734 -294707 161126 -561957 100926 85851 -1579 -46114 -31425 -49720 -94740
8137 -94740 226070 160198 -72695 61185 -73256 -240441 -219291 28649 -248207 -413583 -284341
8126 -284341 -192991 -169036 -242744 154080 221005 89014 203566 142091 227784 337694 -11331
8114 -200423 -352296 -224258 13968 19566 -79974 97135 -223328 -163248 -14140 194136 -164522
8102 35178 -360362 -91554 22465 50305 -75607 -24931 -813 -278631 -121719 210369 -104089
8090 -27053 -175002 -343614 -129081 -291092 -133820 110367 303048 -81762 -74448 -147639 48667
8078 -228130 -123666 -243113 411605 -168040 -141480 194207 -35360 -233905 -276514 121779
8067 29349 166395 -24451 -192034 -240385 -77251 -129248 -147842 -271494 -55039 -301247 -222180
8056 -222180 -232948 -26069 74327 80359 -21466 233857 4926 231761 -26327 -14076 -56309 -4830
8043 163815 -159309 -179216 70335 -125969 -131900 171377 58159 291502 12902 -151151 3375
8031 -259723 203985 -124184 -156484 -277046 326909 332877 47027 811 -303505 -21239 -108172
8020 -108172 -130095 303384 -74708 -144336 -53829 119534 44312 149780 -142079 8533 73052
8009 73052 35104 -172455 -81965 46667 -12776 -11603 -193384 -73124 92051 17382 325904
7998 325904 -440500 -153667 99498 -97959 165725 164154 -180139 -136949 -255385 -245046 314293
7986 -92828 -145824 34264 -197337 -167995 187205 270177 -22738 -19373 105300 15954 19481 152859
7974 152859 210941 7756 -253648 -418992 -23028 -85623 -315887 148859 -235845 42721 -1038
7962 -143278 -194668 -11981 -1126 13855 -28158 -203129 -296788 67415 23897 -16150 61444 -277599
7949 -198652 134754 187002 239390 186988 193063 -23012 110001 108866 -65757 229614 135825
7938 135825 -195458 122096 -223215 382986 -307777 -164429 339943 -369523 35977 -86735
7927 75985 -26413 -44321 156345 -46503 267013 -163592 -100566 -247828 167642 121711 -108098
7915 -158818 -295797 -11125 2883 -211519 -54210 154820 -74261 -90010 -552 -284370 -202002
7904 -202002 -72993 -568700 14647 225678 -201205 -250855 -84984 -211147 -45829 -453380 -4208
7892 -17069 44186 132785 39166 -274505 -170098 317030 -323533 -16980 -117973 -80110 -268852
7881 -268852 -5684 -76948 199992 119602 -216025 -235204 61098 -105934 99874 62992 -165859
7869 169900 -55373 239500 55358 -63410 -21827 -256777 183067 -47467 -236170 194278 -224598
7857 -121927 -75809 241860 -248445 -54155 -166922 176284 -237242 174285 85358 -296963
7846 -98330 32774 94011 52501 -321685 159698 85330 82502 -99534 244078 -20061 -94851
7835 -94851 38136 -217699 185202 137660 -161152 -93365 -216857 -267454 85905 -141959 92407
7823 -135752 -303546 186488 -152052 151914 247510 111447 -109998 -253333 125886 -166097
7812 103967 -175356 -16233 -105832 -12365 23270 -82986 -137009 -368874 -16195 -140911 238985
7800 252634 -119467 -249648 -180952 -232482 551606 -502379 27045 -264325 54524 158684
7790 158684 67833 -42982 54839 132495 -43741 -97173 -24665 207731 -23770 -426445 86965
7778 -420348 -78821 -122086 -120176 -213592 -222812 13031 80856 -73308 204888 23450 233697 8808
7765 -121766 -141775 22780 -278692 150121 -99846 -86235 -158158 -180658 -136108 -54454 -24429
7753 396450 -19665 131569 -489825 -116679 112442 -7474 116403 -457392 -110906 114511
7742 -429767 214897 13530 -60517 158428 67997 33354 270760 154159 -73821 -23045 135302
7730 -155357 -5636 88479 117859 190758 -263364 -179487 -245154 190961 -38323 -185157 -171110
7719 -171110 397278 -282344 -40199 -163838 140880 -61134 210615 118366 -118258 56444
7708 166963 -25688 84297 141761 -192459 -6262 -78899 474873 -43490 -241049 -142117 -360609
7697 -360609 139246 -129973 -70546 -256012 24179 120665 44978 -177652 192878 -55887 -208773
7686 -208773 -93531 -66696 -360858 82711 -150053 -163021 -38594 -182038 -7064 -45076 215725
7674 -439742 20009 105659 -210105 328379 -55284 46188 -197255 63983 67402 -84232 -164541
7663 -164541 -381552 144961 -88861 95879 -150456 -5134 72662 224816 133501 -98474 26340
7651 138065 -288555 -335797 -861 69386 -77784 -109437 -397273 130761 -150393 -27860 -321499
7640 -321499 -347367 -298336 -199113 148169 55148 -198276 44650 -314358 -534778 -259534 55484
7628 -270523 -154752 194094 31 174222 -262960 -183882 -85787 106498 -213274 -72652 -13042
7616 165763 -124758 137726 16926 -74348 -239587 -323252 -22943 40436 138804 123695 -152097
7604 110190 17206 -62400 -228708 -24830 -280766 51987 -6290 -100302 159853 186033 -118600
7592 -97953 92916 -288005 56385 33545 -128943 67241 -84628 -71299 58002 118739 -65431
7580 -259943 -31257 48688 233401 66679 -240754 298 156462 178243 197555 313888 -71514
7568 69390 -258603 27526 -151126 16316 44175 -375022 -103323 108699 -392028 103588
7557 152530 -85449 60051 128782 -242236 53361 3959 -46846 8083 60263 -99176 291546 11435
7544 -265879 168959 260738 -321091 229606 -40411 285003 117110 166029 -202638 -110668
7534 -110668 -60699 -78443 -204142 110947 -298180 -173804 -325237 37365 -70073 -64966 -270118
7523 -270118 8825 262517 -23319 60066 -78400 -133941 424390 101309 54467 -130438 13774
7511 -176902 89761 -222574 188125 -89375 -141588 37703 -164079 -95553 62083 -41611 -53371
7500 -53371 158789 -292516 158725 9124 -160423 149329 -345892 -205587 -209132 -201076 -96090
7488 147834 279693 -202570 -9951 -7376 -561955 11715 133474 141817 -266291 94028 4023
7476 -219889 -132490 21353 -100745 93450 -216039 202817 -13557 32440 361 -121887 31531
7464 -283901 278435 82206 13057 -2431 213527 158586 -158922 -43230 -46407 -74578 -210142
7453 -210142 -115260 182303 2997 136627 -196324 19176 254746 -186466 189395 77453 -126874
7441 -36378 -82785 -35302 69646 130072 247671 157927 -34422 -178269 -253065 -103953 -116748
7430 -116748 -55872 25085 234176 -257313 90537 -127378 -140164 -49963 43204 -10181 -319340
7419 -319340 246435 87227 51829 121934 -186165 -128414 51676 9415 162195 -29310 -116085
7408 -116085 54725 -140796 -12384 443342 -92825 -126308 -192133 160590 136298 -325471 103515
7396 111456 49380 -247132 -156349 127059 35235 -188444 106830 -197473 164079 -238565
7385 159807 50206 19224 -1459 -237459 -50156 -317870 96267 12608 -34577 -164941 246632
7373 492293 -10342 216468 -105194 -5065 -79389 131744 82032 -251126 -49558 -18452 -101758
7362 -101758 -227701 68954 -186698 -272345 114617 -14833 18124 -149680 -241852 81839 -79687
7350 -112921 116304 -345432 -74431 185047 -108586 -316165 -449367 -217148 171236 -120620
7339 -194853 -182448 -89769 147519 121208 63074 22276 -416679 -53562 -307143 -357816 108169
7327 -107352 194413 29046 104664 83335 -1391 14654 -161388 -9325 273612 -2001 -375510
7316 -375510 120810 114402 -137306 -63307 -402488 -74399 -185273 135741 -196742 52624 12761
7304 25636 107727 115729 -131489 -290182 -104167 142064 192214 241628 -126394 48717 -244194
7292 -179158 -119782 9618 -22117 -119443 -35476 -152323 -45531 -68654 -269869 -70400 -136945
7281 -136945 -121451 -196377 -46160 -202041 22751 130750 298801 79234 -163025 -83421 -6708
7269 -8767 -170927 -65476 -205633 -28411 41983 -329264 98063 168429 -85288 81429 191947
7258 191947 4263 185711 -140216 81469 161084 -3008 -32083 -81268 -206799 -313717 -376371
7247 -376371 -76026 -53211 76665 -36852 63475 195651 -27477 100086 57373 -62004 66046
7235 29225 -149860 183506 39313 -255448 -90012 -151182 54642 198 195641 -54799 -101185
7224 -101185 133533 172860 -175506 118708 162187 57043 -144064 117124 177483 -91794 -128540
7213 -128540 -104529 57782 -81734 151545 -187557 144050 218942 -78657 139938 -93964 -420800
7202 -420800 338286 -161163 -42926 101497 -275182 -245471 143639 23976 -277606 174663
7191 -190358 74649 -94032 -386971 75372 -5836 -57148 -80117 -68254 -52541 -193997 1422 -156309
7178 -79969 -4534 -186026 253937 -102353 -222214 -257298 49731 -192366 150608 -287600 -197974
7167 -197974 -38267 -240556 -229004 239568 129816 -201158 -93106 136945 -178886 149213
7156 -62534 -232373 -64545 -53075 -430698 104809 -38789 -17656 379649 -157245 -240938 -48798
7144 133562 -99327 -47353 -7306 -68128 -20271 -53234 226623 258270 -45000 -59740 332586
7132 -209745 -209774 -11814 47327 -122244 252687 70962 126044 255340 227779 145197 -22182 -173567
7120 -173567 -205238 -190935 -234306 -219021 329796 242178 9007 -177557 -140303 26644 32442 -47214
7107 122039 259120 27441 152331 -67345 146919 84196 -152142 68712 159718 83816 198005
7096 198005 12650 -407771 9842 -224476 -173623 -111648 -178464 -55918 22168 -116653 -180107
7085 -180107 110056 235314 304049 170269 -302052 -81347 70396 -183108 -101826 13327 -143639
7073 241725 130166 117312 169933 -100871 -67309 -7095 324322 -236505 -215337 -151151 247782
7061 -208611 -295535 -377007 -250848 -25284 69239 19605 232210 -102472 56303 -114101 201789
7049 -215135 -381940 -73525 -55981 238829 -217009 -20003 45795 105687 -16123 -366 -74402
7038 -74402 -418000 102622 3877 133767 -124657 23502 -4184 -25282 -116381 -97195 -507348
7027 -507348 135398 -245321 -223033 13768 270863 -248755 224928 78013 109416 -144236
7016 426445 256128 28647 -109328 -182339 119342 -200994 -164173 133794 -233264 11444
7005 108848 -313456 -57111 10312 47818 -328181 -154554 -79615 6297 6366 -22771 183736 249
6992 -18773 -128639 107610 99607 -125925 275544 -83159 -47987 -133857 -109107 -333073 -283498
6981 -283498 73575 229461 29041 39542 -115023 -121889 -157201 -25409 -30822 -128917 -336800
6970 -336800 113719 128914 -38525 -16498 116599 -254821 -86520 137135 -197333 160640
6959 -53232 -167318 -294589 15132 -11969 150402 -200248 234467 73546 -27459 98160 155243
6948 155243 -336131 -171655 -10348 236071 56832 115730 -286940 33974 58154 -213160 8617
6936 -256666 37921 286513 -69905 -7856 122794 -200026 -134271 284727 -211122 93572 106063
6925 106063 106687 144855 -227122 -311447 -27105 -169556 362809 20749 143586 -13267 -62113
6914 -62113 -86036 6418 8051 195663 86243 -119153 -497273 -25448 -159974 250123 31998
6902 -37877 -422912 54757 -31577 72681 124789 -49382 182695 53732 84422 130645 -24977
6890 109740 217669 -9244 223622 199049 -75901 278311 74645 155254 -7483 -2752 -272944
6879 -272944 -105973 -215286 311243 177840 -145634 118244 110890 -265174 299029 67609
6868 98383 39271 24180 -198749 -95144 -150971 -175944 -214775 -15240 67134 54920 197309
6857 197309 39270 357295 -271891 -130796 68226 -290327 13714 224 40881 27515 133618
6846 133618 -47292 -519001 -44001 -313307 227810 37981 46104 -81624 -40945 186329 165772
6835 165772 256402 61678 59105 -344041 -192304 -74254 71266 -45782 17256 56842 -41194
6823 54788 -185536 -139367 -85628 192037 132845 -74182 8510 71273 -18275 -129437 31685
6811 34402 -101943 149590 -71306 -79883 47402 207840 33090 95998 128367 -197511 -226752
6800 -226752 -111610 37621 -228978 68415 240065 259523 -83413 121223 146891 -68584 307624
6788 -139814 249859 -17295 -294692 306925 221153 5017 -2641 -57162 45173 146114 136297
6777 136297 -434503 -258403 -91740 252365 -112387 109434 -134357 -194272 -210542 -87663
6766 88907 -84069 -117077 206284 -173711 189347 -307160 47589 -25390 -47609 89557 75195
6755 75195 106395 -23669 40404 138188 -126074 -22898 -199972 186448 144859 -22880 43173
6743 -282820 -110638 48462 70563 -71721 -288528 -44252 -150424 -41832 -9802 -134752 137578
6731 5658 94278 57842 -194227 -56015 46052 -122518 186401 110347 21420 -62491 -173306
6720 -173306 -213324 -140517 57166 117580 -71009 -125773 135347 -151839 -86382 -189778 302294
6708 -123017 112016 -11861 21415 76091 7651 49277 -69747 135660 -45543 -17619 -303344
6697 -303344 2501 -21509 -599672 211404 -2907 -339235 66033 -116048 -86950 -89650 75841
6685 -15370 -152162 -165165 -181048 -15688 -85238 -75859 -91342 -75047 -68785 166961 78941 195827
6673 195827 339686 98037 13258 119416 -157736 -203126 -164001 234667 12722 -90480 289991
6661 -207932 123768 30939 -136007 56971 -253996 -39185 85500 177902 105947 -227543 -116747
6650 -116747 3716 -76380 -197957 82172 -328972 558539 304814 -70675 -73158 -128741 -143285
6639 -143285 -44902 233376 -422874 147402 76323 8025 186132 -58717 49938 -282857 -235458
6628 -235458 -198884 -138444 112421 168772 13598 46902 -69592 188185 125761 251735 350902
6617 350902 -51742 -106549 -280459 182875 58805 14452 -272782 -167685 6209 37713 -93992
6605 -48550 -102250 -360674 148867 -251603 139068 -150601 5843 -9092 -111908 -161635 -34597
6593 -331754 -128216 38007 58050 -56357 -83995 -1761 -18968 53047 -240572 -108305 233325
6581 136169 296169 3939 341554 -225814 164225 103155 262591 32553 76296 -114668 -4954
6569 -224307 -6211 -25790 129323 -441630 -106828 62579 -101227 -44208 21362 -85935 51366
6557 -486023 -55756 -14600 216213 -16102 38320 269964 -49327 88851 181484 111745 -431582
6545 -139890 24005 34611 -64042 -91593 246460 -137495 -141143 28436 124610 -47661 -101339
6534 -101339 69472 82426 -309364 85786 286437 -102221 4925 303335 -169165 330565 110742
6522 192426 -192931 54835 122825 -66683 -431403 201926 142623 -48794 -293659 -105536 -149447
6511 -149447 -45749 -360573 -84596 -196237 -86952 142107 -86458 -175469 -118363 120330 132046
6500 132046 -19675 -121492 -4962 123141 -34482 -97238 157866 -163899 90041 -13549 -76088
6489 -76088 234761 26436 134632 -120762 -153295 355133 27036 -3348 -89870 45992 -135141
6477 -78570 -162794 -239370 332333 71846 -23149 -234917 50346 -297949 -181750 231688 68949
6465 -347690 230720 -287397 27954 11945 -91152 -179640 -252389 -272980 89063 -94999 194063
6453 -75949 -366985 -212542 95822 66308 -36778 -116537 -136461 129282 284928 -106613 -202028
6442 -202028 -95740 -167514 159889 -106477 -20910 140833 108035 -74827 230515 -326536 137003
6430 282097 58984 31557 -148219 -12174 -190039 -61495 -176348 -143396 69876 -34974 108334
6418 -123582 -65661 163694 -200319 410998 -24817 166974 -7478 -53732 -12307 -13225 17293
6406 -13044 107855 178005 -286382 104959 333931 -43011 28772 14521 -179034 117538 266720
6395 266720 -55556 156013 116482 138405 287351 -79419 186884 82277 -159546 -50267 -213392
6384 -213392 -64858 115980 -332298 147721 -12113 -103859 -92093 -14007 -364374 -14975 -155406
6373 -155406 1784 17436 19627 -72369 -25590 -54338 -210023 -51520 -273908 -7063 13871 2843
6360 -39160 -163557 -103271 75380 -302185 -100534 -517642 199459 -4983 -147568 20397 -28529
6348 108633 -79465 232944 -16167 -125076 -218880 169309 154024 -136824 224641 -222016
6337 72066 35910 139160 -207080 73590 261126 134990 -317216 129657 -139771 46563
6326 -46822 -9879 20084 95847 261648 -132232 -37243 -188627 -128194 98347 -77266 100357
6314 111690 134776 48210 220036 -38840 -131130 95746 39681 -283091 -51260 437005 -116467
6302 -424990 -216144 -76735 18554 -201674 -117444 -47875 -438502 -218125 289153 -219353
6291 50773 118483 -187000 402110 123796 -47501 -8618 -435358 -67489 -79030 -33978 322044
6279 -49643 74997 5892 419765 263865 13734 -110839 -90764 86429 209716 -75649 -220855
6268 -220855 -297835 -301780 134097 249798 78967 -76782 -64926 -283777 -73779 -12967 22684
6256 -101713 133095 256008 44969 22380 -108624 48010 -104743 -226472 -291298 215429
6245 -232435 49346 20463 -108001 -11443 26522 270746 259784 133439 531895 143819 -297682
6233 168230 125742 5024 151620 116509 -18596 -168102 -8652 -302742 143132 -112116 -125472
6222 -125472 -464011 112604 -124125 23312 140535 47350 -122881 -164834 204619 -52368
6211 -344700 278460 -214478 -58195 255653 -327206 -299304 -68934 -248689 129807 147791
6201 147791 -158313 246505 -171032 279910 -340667 -189879 243373 -281719 110209 22953
6190 -6214 78919 -55398 226039 72817 241818 -55131 -191721 -8036 -79863 41897 -52608 135919
6177 -240970 -24528 2673 -116449 89687 -191600 -144053 222093 79939 -300661 219419 -45586
6165 -308630 163925 -83693 224226 -63229 -202597 -84245 39099 305992 -354953 -22873 -134679
6154 -134679 7645 -74706 226659 -78648 80059 56465 -59418 -24046 156309 195710 183911
6143 183911 108059 -199072 168442 -100187 169944 -62347 -21525 42337 3474 271581 404264
6132 404264 -157630 -192226 224590 82156 131809 351767 -29318 61065 -35293 131395 115449
6121 115449 5543 -72390 -10004 -71905 -137537 70376 -294337 -12890 -43721 331130 56244
6109 -87422 -253732 180414 -268868 315729 -124599 379054 159790 -191959 26956 -52850
6098 -66090 90154 -114129 30821 -182336 -214759 54938 41443 143837 -318941 -460027 -346705
6087 -346705 168839 -77273 -276295 -120076 -48867 207699 39196 139703 207954 26938 264132
6076 264132 -6789 -98772 119498 275623 -390456 -177806 -147622 -18163 246210 202542 50953
6064 -130134 150543 -22218 -113345 -5471 -215686 35909 266950 -329344 441633 -107112 -212359
6053 -212359 179209 90285 -47678 63927 -22515 -63741 -41577 -216417 -356143 117282 -75672
6041 -85850 -38053 -163045 23663 -256866 180502 61726 -74018 68754 19168 -310023 -99117
6029 217984 63914 -299649 25757 365161 33676 59443 -134193 -73700 131019 -221177 -101656
6017 -272622 -73468 -153069 -87543 -39465 68419 -249447 76950 77277 80804 -240477 -83337 130580
6004 -43555 -263163 -210622 53178 248966 -15406 8052 101978 -43664 -296708 12473 -301650
5992 300433 -147418 166294 -200310 162545 -201232 149622 6205 -117396 143337 79785
5982 79785 105941 -25522 -65016 41059 216833 59245 12694 -100620 -84638 -97645 125277
5970 137799 -251475 86648 180817 11533 100861 -180804 -158477 198148 152235 -57425 -17313
5958 239624 77330 269046 -127702 -389963 -130336 -343051 36054 154172 -32197 108391
5947 267192 -111888 -55360 -305826 -138261 -154656 -8144 -151175 64288 22981 -192152 -130540
5936 -130540 93684 -106823 99162 12965 -1705 119778 -115792 -406303 -26447 -112795 -70755
5925 -70755 -44816 -260043 -15667 129641 414637 444951 70162 -292058 -297602 99334 13824
5913 -132193 -175047 281300 -161682 187532 41061 -144883 10580 -110997 69832 -207207
5902 71272 -74067 176337 120250 -356447 -67824 167196 -30069 -79945 -102403 77573 -58972
5890 153883 40517 -123376 22264 150725 -257537 -209167 -82129 -388247 -35425 68933 -41008
5878 282759 132600 -302254 1145 255990 91165 98889 38662 203713 -146695 119653 87837
5867 87837 30799 257362 295905 212612 60602 -248785 31571 71970 -120252 248333 55752
5855 31176 349082 -157742 95202 -26214 136878 -94786 349798 -54379 -22809 109166 -149627
5843 184535 58469 -12710 -114700 51388 -140629 -238296 10342 -149752 -212260 -195674 -1860
5831 -252269 -256052 -467339 104864 154413 3477 200574 -40007 -32810 55438 -5294 62975 -54981
5818 -43460 -226007 137188 115285 -2581 148719 -142949 -56130 79401 -290690 -32459 -146872
5807 -146872 116196 -257139 187954 -156442 -209069 160618 -198602 179560 190369 -73965
5796 -19266 -94518 199995 -66227 192952 -9056 6184 -34006 39341 263844 -251515 309271
5784 82890 168070 -13127 -100586 -128290 -128946 183343 -62426 -29270 -194882 258128 58603 -36877
5771 -59636 -205430 -74098 -86018 -146574 -158712 176333 -228668 4708 -92439 306480 101326
5759 68124 -155127 279580 3217 -286 -266825 -38507 144917 -99658 68753 -179094 -188613 -63834
5746 -125473 51218 42173 276881 3483 160283 -63437 272445 -143261 -76425 -109190 -102253
5735 -102253 199220 76330 -37617 -376026 259692 35378 11561 -211972 285846 -317900
5724 -90795 110646 110928 -50407 -36942 114756 -199443 -60402 33793 53848 222858 -23731
5712 -117989 195768 -248406 -25934 144386 54948 -39929 -354898 179290 -150991 -120797
5702 -120797 65332 13548 -91898 89561 88732 325720 144341 -34028 -102349 270527 -283401
5690 154223 102894 185455 467072 198454 230611 -37190 -189468 -162248 -241516 59654 -167658
5678 -15840 134898 284300 16675 45397 31173 37804 -87181 -32490 -212980 9527 -148746
5666 -86383 -122386 205422 101044 63408 31578 -173378 135740 5008 129241 -181213 28651
5654 350976 2294 89970 -34902 -165767 200447 -123455 -13720 -2297 6162 138381 197952
5643 197952 -296241 242242 -227031 451883 -6386 -260953 54230 -17475 200249 -113341
5632 161102 -65159 -284041 -65894 249401 162633 -104926 -100783 -300734 -109579 -206389 19647
5620 35536 -78388 -57923 -81610 -169318 237356 244509 441644 -368968 148441 -32400 -133964
5609 -133964 -14158 -111113 -60170 -162886 -63219 -184640 -482871 -25301 178787 -64703 89672
5597 -236477 52311 15938 227271 -175976 177356 -48185 -326469 -989 -21780 362698 -252385
5585 162664 99439 -210725 114216 -325709 -55201 -112908 -230480 219698 -167998 -21839
5574 274048 49734 261496 43567 -47059 -147446 121754 -198131 -117772 105394 -170611
5563 -359749 -427338 -7438 196722 100326 -272114 21533 361075 -199181 154499 235461 -73291
5551 169730 -124427 -45797 77186 163579 -42945 -171211 -154876 250668 410220 100433 -56844
5539 -103326 -199269 294426 12257 -6570 -46863 107404 -71681 2248 140994 155933 -224893
5527 122144 11734 -35620 -203362 -170264 -180285 62545 -113915 314597 49078 -45314 -160241
5516 -160241 -155967 -7928 -24625 -166436 272597 -190237 24991 -86796 -66383 65328 77587
5505 77587 -155394 -56517 -151295 125619 32929 -75120 141769 -403581 -141536 -27908 -92703
5494 -92703 -287896 -64950 121382 507989 -92673 -346936 -100550 66553 -145805 96074 145783
5483 145783 -118446 -112492 221670 50352 211792 535 -129028 -28919 97463 136635 13269
5471 -11111 188834 -169705 -301746 175025 172606 -305291 5502 258901 362522 87485 -148352
5459 -180806 4978 -107186 60860 -70013 197457 229509 116277 109989 41481 -83898 219199
5447 7557 -232455 23834 341223 183677 54985 -322798 20063 -64292 19150 -261193 -207280
5436 -207280 77215 -75536 227937 121176 -192110 108352 -44889 -63238 150542 134704 -249860
5424 158182 91506 -182685 -181211 15818 -52100 -19192 -164913 -6740 134135 -22352 -158315
5413 -158315 17048 -247034 -48068 297749 49198 95426 -396736 -53780 190043 110086 136982
5402 136982 76733 -639811 -210606 -132019 -273658 -68823 -184106 139888 57869 -33845 -15107
5390 14646 56698 -220196 76594 -171223 -23847 -130412 -249885 -227679 -19610 459007 34430
5378 -169118 113716 208486 -110580 83035 -184067 35283 -50010 -208404 47896 -303843 178308
5366 -136459 -288411 -78575 3903 129643 318833 -39670 -109995 170205 206193 174931 -102337
5354 44678 -42272 -52175 369836 -40022 -127754 211501 485487 24399 -12608 33267 -103252
5342 109157 1917 229931 324730 114031 355809 -96794 5538 15909 -137376 116812 57279
5330 -5656 -192187 285961 153091 -147181 58335 -249294 -16860 -6699 121784 278579 -57243
5318 -156523 -134631 -25880 199379 52455 -7072 223873 -171632 -96929 53008 326755 71052
5306 -56068 288829 -221097 211974 29901 301187 -401755 -18060 -126930 171564 885 -154229
5294 -359146 173298 -31661 -321096 -83298 481218 -152042 124634 -68807 -185038 -163015
5284 -163015 -67055 -71307 -111181 236277 39630 -127851 -232693 343593 176535 107552 -84220
5272 -58780 16726 -179524 59674 -153139 -5402 144979 -122381 -78650 -84808 133558 -250788
5260 -105492 1762 226268 -147325 -35340 57241 158334 -26373 -65930 -238348 248019 -84679
5248 -248277 64720 -536193 190321 230715 294074 -17208 -173591 112737 -63935 -1630 -118871
5237 -118871 -79074 30687 189346 -125778 -155458 -110217 -18470 -238822 108918 -41035 64626
5225 18160 212409 -171304 46109 -110059 -43063 -162617 55163 -165462 76387 134966 124061
5214 124061 -168265 -17174 -215364 150510 29445 -87888 -186899 -3817 251574 55937 159018
5203 159018 138290 -52146 280392 -175242 -8749 -354611 -152227 -172489 120678 -296400 -52955
5191 99102 -92728 -32916 35818 294112 88745 -72674 -203858 -407897 86119 136603 11666
5179 107032 -100627 -269622 50510 -81019 29539 98963 87623 90160 563655 91606 -34505
5167 76064 44595 52045 -220283 -59075 137336 127571 -97218 15275 -112574 -57230 -57388 34170
5154 29129 48474 21806 -82095 337286 -180586 -87145 -57312 479871 60629 -100034 112014
5142 76031 -128853 203317 124013 -125037 -44865 23962 146708 -341544 -144271 68412 244338
5131 244338 357714 -119384 -280361 12153 -46121 -132202 -116275 -91548 51984 197793 -89722
5119 90935 123259 -27115 16690 3776 -217442 -92212 -59342 -154805 -494301 -38170 -315323
5108 -315323 21790 259937 -171453 -179581 132514 -95623 -41491 170872 167157 99240 29726
5096 152263 425919 -352478 -25136 -208437 134771 -44094 -105731 91206 102812 300262 170005
5085 170005 56592 64776 91616 400993 -138346 74776 -193622 -26508 -201401 -312638 279915
5073 206561 -144182 124749 -104200 -176058 134732 -282116 8353 11985 -221825 -162807 14280
5061 -28153 -145196 24320 -207226 202372 -55120 -5395 -98809 -107961 73152 315701 58595
5049 28560 95715 8037 -226678 -476400 -114057 -144884 -51852 -134278 -294523 -69737 98431
5037 146832 199511 330883 57126 1448 63196 -125415 -291658 1919 116178 26095 151266
5026 151266 -71637 230384 -72720 171676 -64184 -65003 96377 251151 -283245 -204378 -181163
5015 -181163 103638 93483 372867 187765 247656 150860 -89001 252798 -36448 -85481 -87225
5004 -87225 59650 -118828 -130690 -160640 -184177 320474 105505 285904 156946 144379 171769
4993 171769 158227 -115639 -166991 183226 129372 -82767 -152664 -214930 -247638 -74276 -33478
4981 -31408 43725 46895 -80104 119489 -330810 190082 -31019 -25172 -61279 2021 43685 261848
4969 261848 -141064 -64303 -19457 111108 114804 -388292 140709 -67119 -183509 96509 -77696
4957 -85404 -105063 733361 -271221 -218445 365285 -21805 -320431 284863 -60002 236878 -94332
4945 45333 93634 131167 -28070 5062 89910 36092 36798 -39943 -352678 161148 27674 -336064
4932 25549 -258518 -5222 227250 315751 337759 -197489 35155 -232444 -118927 -91408 240017
4920 -169248 -47819 250350 -63518 354228 1218 199197 -326539 137702 174554 -76298 174829
4908 -11015 -236557 76450 248200 68077 123866 366527 -10243 -309597 -82415 -3696 -72648
4897 -72648 -427009 21488 172719 43114 144400 -9940 150585 31794 186397 -95312 14646
4885 -110041 6387 -282352 -329707 -16812 439500 61142 -23332 -142691 -155154 62884 -237160
4873 222676 -109724 -140085 86898 85526 92039 123278 -21140 177356 -44953 -275827 -9932 157683
4860 183488 226955 232861 -118592 -1582 107579 129496 75203 236552 -144663 35765 -72363
4848 -142922 -306097 11311 -409917 118321 -126544 74893 239569 -50757 -89829 -14831 -216376
4837 -216376 -56330 -151352 287843 51296 -59877 90415 -226411 -71917 84434 -291488 11698
4825 -161888 -121562 -288576 -181357 -90861 81626 -190547 -131561 -17937 -228568 -133263 55086
4813 64461 -365623 112134 2454 220837 122622 -71716 -107487 -152843 -169063 78871 363194
4802 363194 172758 -110384 -87866 116123 353278 75024 1393 -201438 162122 155590 42646
4790 -70016 138861 -121431 213219 34329 -141761 -64172 -78209 107152 -159564 -142023 192643
4778 -489377 77435 232578 93687 -133759 -132722 326211 57720 -18506 -131242 311154 -87160
4766 -274718 -44691 -62566 -70918 53935 157933 212310 -51331 160702 -23306 -218763 -70277
4754 -295230 -141553 193106 49740 118278 200316 246584 -56753 41304 259144 2012 103465
4743 103465 -417948 -163966 432350 -129748 -91723 97264 280189 -95284 285789 -38980
4732 -181088 5112 -284038 64594 -72050 -193253 -374725 217903 -21951 -1070 -213766 -422484
4721 -422484 -6201 -55250 229324 182800 85593 113952 233763 -179896 122409 136598 -242760
4709 101964 103708 -126651 309599 -178838 46260 -347585 199048 54980 -184254 1163 155479
4698 155479 -120550 -157069 -79578 4937 -143101 -42784 -176170 76020 45074 -103969 301620
4686 62458 247605 -24697 62677 152411 -117715 -47663 116526 110043 -2084 -93902 50485 106775
4674 106775 -5576 -4575 -16186 186006 72549 12759 604075 172802 17707 50682 152168
4663 152168 -204464 333322 149258 150066 212594 27077 -209997 -62279 -204386 -306458 -113997
4651 -247275 257809 29991 100128 163774 299243 136068 -111583 204352 -7724 -31304 70336
4639 78735 225176 18560 -117515 -77681 275364 -40310 170275 205222 -162283 40245 -9217
4627 154239 203650 -130848 -76227 -48660 -132586 175855 41956 -239969 -169185 142376 4510
4615 -62673 -9553 -238829 99553 34241 -131816 105654 87762 -135836 -236544 -61970 -340972
4604 -340972 -163145 153715 -149930 -47004 296643 39446 328933 -227056 -178635 -149436
4594 -149436 96978 70045 -11314 14351 58407 352643 128292 179228 174216 147022 -21078
4582 -109292 -322791 -236035 -348482 24203 118704 174799 -89397 -201789 2534 -55090 92043
4570 -12333 251783 45110 204013 -174994 -208409 -152341 39337 -160353 47715 28623 92056
4559 92056 375650 341414 -115388 -9617 56837 -58893 45097 301310 -234230 1059 100132
4548 100132 -106132 -220088 -42611 100687 -182485 -143980 -252743 -170408 265603 -51174
4537 6901 -105414 77631 -99704 -48465 207364 -283901 199051 17893 -164342 169448 186767
4526 186767 -12078 182650 35757 -255973 38655 275368 233025 51521 -268344 83608 -321502
$$ [...]
##END NTUPLES=NMR SPECTRUM
##END=
