
##TITLE=AC1250_VIERS11068_6528270_Fyvpdd1UNC
##JCAMPDX= 6.0         $$ Bruker NMR JCAMP-DX V2.0
##DATA TYPE= NMR SPECTRUM
##DATA CLASS= NTUPLES
##ORIGIN= BRUKER
##OWNER= Administrator
$$ 1.72 TOPSPIN		Version 2.1
$$ 2012-07-17 15:33:39.343 -0500  Administrator@TOPSPIN
$$ Compression mode = diff/dup
##.OBSERVE FREQUENCY= 400.02188249412
##.OBSERVE NUCLEUS= ^1H
##.ACQUISITION MODE= SIMULTANEOUS (DQD)
##.ACQUISITION SCHEME= undefined
##.AVERAGES= 64
##.DIGITISER RES= 22
##SPECTROMETER/DATA SYSTEM= spect
##.PULSE SEQUENCE= noesygpps1d.comp
##.SOLVENT NAME= COFFEE_meoh
##.SHIFT REFERENCE= INTERNAL, COFFEE_meoh, 1, 14.96108
##AUDIT TRAIL= $$ (NUMBER, WHEN, WHO, WHERE, PROCESS, VERSION, WHAT)
$$ ##TITLE= Audit trail, TOPSPIN		Version 2.1
$$ ##JCAMPDX= 5.01
$$ ##ORIGIN= Bruker BioSpin GmbH
$$ ##OWNER= Administrator
$$ $$ C:\Bruker\TOPSPIN/data/COFFEE/nmr/AC1250_VIERS11068_6528270_Fyvpdd1UNC/12/pdata/1/auditp.txt
$$ ##AUDIT TRAIL=  $$ (NUMBER, WHEN, WHO, WHERE, PROCESS, VERSION, WHAT)
(   1,<2012-07-15 12:36:05.171 -0500>,<Administrator>,<TOPSPIN>,<go>,<TOPSPIN 2.1>,
      <created by zg
	started at 2012-07-15 12:24:34.906 -0500,
	POWCHK enabled, PULCHK disabled,
       configuration hash MD5:
       6B 1B 68 BB D9 2E 58 E2 7F 35 AD 54 07 DF 0E 41
       data hash MD5: 64K
       4B 66 DC 5E AD 6C 6B 37 37 C1 5C 92 35 1D 6C 5C>)
(   2,<2012-07-15 12:36:08.093 -0500>,<Administrator>,<TOPSPIN>,<proc1d>,<TOPSPIN 2.1>,
      <Start of raw data processing
       efp LB = 0.3 FT_mod = 6 PKNL = 1 PHC0 = 0 PHC1 = 0 SI = 128K 
       data hash MD5: 128K
       53 64 F0 82 BD B9 B4 11 3D 45 7C 28 13 98 B1 75>)
(   3,<2012-07-15 12:36:09.156 -0500>,<Administrator>,<TOPSPIN>,<proc1d>,<TOPSPIN 2.1>,
      <pk PHC0 = -3.433228 PHC1 = 0 
       data hash MD5: 128K
       51 E0 42 E4 E9 F5 96 00 3A 10 52 B7 ED AA 00 A8>)
(   4,<2012-07-15 12:36:09.656 -0500>,<Administrator>,<TOPSPIN>,<proc1d>,<TOPSPIN 2.1>,
      <abs ABSG = 1 
       data hash MD5: 128K
       BB C1 91 FA D3 95 CF 1A 78 49 AE FC CB 72 1D 50>)
(   5,<2012-07-15 12:36:09.734 -0500>,<Administrator>,<TOPSPIN>,<proc1d>,<TOPSPIN 2.1>,
      <abs ABSG = 2 
       data hash MD5: 128K
       D8 06 13 00 70 CD CC 9B 7B 00 7B 00 8A 9C 7A 79>)
(   6,<2012-07-15 12:36:09.796 -0500>,<Administrator>,<TOPSPIN>,<proc1d>,<TOPSPIN 2.1>,
      <abs ABSG = 3 
       data hash MD5: 128K
       90 59 EF 9E 6F 68 52 CD BA 3E 88 CB 39 86 61 40>)
(   7,<2012-07-15 12:36:09.843 -0500>,<Administrator>,<TOPSPIN>,<proc1d>,<TOPSPIN 2.1>,
      <abs ABSG = 4 
       data hash MD5: 128K
       AF 74 B4 54 01 C0 73 91 A4 3C C5 5E 7C 9B 15 FE>)
(   8,<2012-07-15 12:36:09.890 -0500>,<Administrator>,<TOPSPIN>,<proc1d>,<TOPSPIN 2.1>,
      <abs ABSG = 5 
       data hash MD5: 128K
       1C 52 7D 63 BB D4 21 C4 04 45 56 1C AA B9 E2 2E>)
(   9,<2012-07-15 12:36:12.421 -0500>,<Administrator>,<TOPSPIN>,<audit>,<TOPSPIN 2.1>,
      <user comment:
       ICON-NMR User ID: COFFEE
       data hash MD5: 128K
$$ [...]
##$TP07= 0
##$TPNAME0= <>
##$TPNAME1= <>
##$TPNAME2= <>
##$TPNAME3= <>
##$TPNAME4= <>
##$TPNAME5= <>
##$TPNAME6= <>
##$TPNAME7= <>
##$TPOAL= (0..7)
0.5 0.5 0.5 0.5 0.5 0.5 0.5 0.5
##$TPOFFS= (0..7)
0 0 0 0 0 0 0 0
##$TUNHIN= 0
##$TUNHOUT= 0
##$TUNXOUT= 0
##$USERA1= <user>
##$USERA2= <user>
##$USERA3= <user>
##$USERA4= <user>
##$USERA5= <user>
##$V9= 5
##$VALIST= <valist>
##$VCLIST= <CCCCCCCCCCCCCCC>
##$VD= 0
##$VDLIST= <DDDDDDDDDDDDDDD>
##$VPLIST= <PPPPPPPPPPPPPPP>
##$VTLIST= <TTTTTTTTTTTTTTT>
##$WBST= 2048
##$WBSW= 25
##$XGAIN= (0..3)
0 0 0 0
##$XL= 0
##$YL= 0
##$YMAX_a= 11413841
##$YMIN_a= -8605463
##$ZGOPTNS= <>
##$ZL1= 120
##$ZL2= 120
##$ZL3= 120
##$ZL4= 120
##$ABSF1= 14.96108
##$ABSF2= -5.597102
##$ABSG= 5
##$ABSL= 3
##$ALPHA= 0
##$AQORDER= 0
##$ASSFAC= 0
##$ASSFACI= 0
##$ASSFACX= 0
##$ASSWID= 0
##$AUNMP= <proc_prof1d_extract.lims>
##$AXLEFT= 0
##$AXNAME= <>
##$AXNUC= <1H>
##$AXRIGHT= 0
##$AXTYPE= 0
##$AXUNIT= <>
##$AZFE= 0.1
##$AZFW= 0.1
##$BCFW= 0
##$BC_mod= 0
##$BYTORDP= 0
##$COROFFS= 0
##$CY= 15
##$DATMOD= 1
##$DC= 0
##$DFILT= <>
##$DTYPP= 0
##$F1P= 0
##$F2P= 0
##$FCOR= 0.5
##$FTSIZE= 131072
##$FT_mod= 6
##$GAMMA= 0
##$GB= 0
##$INTBC= 1
##$INTSCL= 1
##$ISEN= 128
##$LB= 0.3
##$LEV0= 0
##$LPBIN= 0
##$MAXI= 10000
##$MC2= 0
##$MEAN= 0
##$ME_mod= 0
##$MI= 0
##$NCOEF= 0
##$NC_proc= -2
##$NLEV= 6
##$NOISF1= 0
##$NOISF2= 0
##$NSP= 0
##$NTH_PI= 0
##$NZP= 0
##$OFFSET= 14.96108
##$PC= 1
##$PHC0= -3.433228
##$PHC1= 0
##$PH_mod= 1
##$PKNL= yes
##$PPARMOD= 0
##$PPDIAG= 0
##$PPIPTYP= 0
##$PPMPNUM= 2147483647
##$PPRESOL= 1
##$PSCAL= 4
##$PSIGN= 0
##$PYNMP= <proc.py>
##$REVERSE= no
##$SF= 400.020009605853
##$SI= 131072
##$SIGF1= 0
##$SIGF2= 0
##$SINO= 400
##$SIOLD= 131072
##$SPECTYP= <>
##$SREGLST= <1H.CDCl3>
##$SSB= 0
##$STSI= 131072
##$STSR= 0
##$SW_p= 8223.68421052631
##$SYMM= 0
##$S_DEV= 0
##$TDeff= 65536
##$TDoff= 0
##$TI= <>
##$TILT= no
##$TM1= 0
##$TM2= 0
##$TOPLEV= 0
##$USERP1= <user>
##$USERP2= <user>
##$USERP3= <user>
##$USERP4= <user>
##$USERP5= <user>
##$WDW= 1
##$XDIM= 131072
##$YMAX_p= 410068349
##$YMIN_p= -12700
##$CURPLOT= <Network HP LaserJet P1505>
##$CURPRIN= <$Network HP LaserJet P1505>
##$DFORMAT= <normdp>
##$LAYOUT= <+/1D_H.xwp>
##$LFORMAT= <normlp>
##$PFORMAT= <normpl>
##$SURQMSG= 1
$$ End of Bruker specific parameters
$$ ---------------------------------
##NTUPLES= NMR SPECTRUM
##VAR_NAME=  FREQUENCY,     SPECTRUM/REAL,   SPECTRUM/IMAG
##SYMBOL=    X,             R,               I
##VAR_TYPE=  INDEPENDENT,   DEPENDENT,       DEPENDENT
##VAR_FORM=  AFFN,          ASDF,            ASDF
##VAR_DIM=   131072,        131072,          131072
##UNITS=     HZ,            ARBITRARY UNITS, ARBITRARY UNITS
##FACTOR=    0.0627417313425164, 1,          1
##FIRST=     8223.62146879497, -1310,        -53136
##LAST=      0,             886,             -53771
##MIN=       0,             -12700,          0
##MAX=       8223.62146879497, 410068349,    0
$$ Real data points
##PAGE= N=1
##DATA TABLE= (X++(R..R)), XYDATA
$$ [...]
67814 162792 163443 164033 165162 167107 169338 170890 171192 170428 169133 167649 166041 164369 162716 160923 158522
67799 158522 155239 151584 148606 146897 146039 145253 144367 143748 143474 143116 142481 142002 142060 142347 142296 141912 141693 141864
67781 141864 142170 142401 142640 142859 142731 142118 141427 141152 141264 141403 141540 142034 143048 144276 145382 146381 147424
67764 147424 148512 149732 151501 154189 157527 160771 163421 165456 166954 167980 168977 170774 173860 177904
67750 177904 182187 186194 189501 191549 192024 191332 190198 188926 187422 185745 184143 182614 181042 179797 179630
67735 179630 180799 182791 185056 187437 189532 190220 188492 184615 179960 175705 172070 168774 165748 163241
67721 163241 161482 160464 159972 159652 159143 158222 156909 155415 154022 152981 152468 152563 153150 153806 153940 153262 152131
67704 152131 151314 151296 151945 152834 153713 154533 155173 155395 155125 154620 154261 154220 154421 154814 155503 156512 157494 157932 157665
67685 157665 157076 156722 156944 157854 159396 161225 162734 163455 163369 162695 161620 160394 159459 159140 159413 160250 161942
67668 161942 164617 167601 169810 170803 170983 170767 170175 169363 168940 169299 170035 170484 170616 170980 171904 173171 174432
67651 174432 175543 176390 176739 176564 176369 176850 178113 179462 180191 180411 180756 181328 181480 180813 179866 179366 179214 178845
67633 178845 178373 178639 180091 182271 184562 186816 188992 190736 191807 192561 193588 195001 196430 197572 198510
67618 198510 199532 200810 202206 203313 203802 203783 203681 203739 203791 203490 202541 200806 198546 196594 195814 196236 197015
67601 197015 197389 197363 197338 197463 197637 197880 198373 199192 200128 200709 200465 199490 198656 198840 199825 200388 199662 198066 196744
67582 196744 196453 197169 198339 199247 199453 199156 198892 198790 198533 198083 197845 197934 197969 197943 198608 200377 202404 203448
67564 203448 203289 202683 202295 202367 203058 204277 205294 205375 204811 204613 205150 205836 206275 206927 208283 209995 211300 211848
67546 211848 211694 210834 209368 207978 207634 208614 210130 211194 211707 212412 213808 215434 216360 216176 215310 214550 214588
67529 214588 215811 218055 220477 222053 222369 221791 220921 220213 219956 220088 220058 219477 218989 219781 222079 224801 226961
67512 226961 228608 230004 230807 230752 230394 230344 230331 229836 229165 228966 229107 228973 228584 228480 228673 228675 228402 228112 227637 226744
67492 226744 226213 227365 230264 233448 235744 237361 238781 239686 239669 239222 239192 239754 240600 241623 242772 243604 243776
67475 243776 243775 244496 246080 247668 248299 247712 246326 244826 243766 243230 242827 242232 241728 241930 242924 243960 244284
67458 244284 244197 244931 247292 250619 253448 255084 256096 257186 258226 258714 258700 258693 259032 259914 261691 264426 267272
67441 267272 268996 269158 268258 266883 265348 264066 263505 263664 264196 265094 266571 268276 269460 270117 271167 273172
67425 273172 275611 277700 279245 280298 280699 280506 280254 280241 280087 279495 278976 279147 279717 279804 279073 278068 277581 278028
67407 278028 279244 280516 281040 280607 279652 278617 277750 277612 278925 281383 283366 283613 282748 282333 282801 283184 282719
67390 282719 281831 281402 281786 282777 284069 285542 287302 289491 291908 293983 295372 296274 296904 297025 296512 296031
67374 296031 296421 297516 298277 298081 297277 296416 295589 294754 294204 294374 295428 297202 299340 301364 302881 303874 304699
67357 304699 305822 307545 309772 311848 312935 312890 312528 312612 312895 312652 311928 311516 311826 312498 313208 314093 315148
67340 315148 315907 316138 316298 316865 317666 318298 318851 319725 320931 322132 323272 324726 326723 328900 330575 331333
67324 331333 331375 331411 332249 334336 337476 340884 343597 345093 345700 346229 347032 347574 347219 346210 345449 345359 345466 345191
67306 345191 344577 344025 343760 343864 344473 345521 346528 347025 347123 347375 348183 349632 351712 354300 356902 358873 360079
67289 360079 361065 362365 363857 364999 365598 366044 366818 367950 369032 369616 369521 368851 367838 366691 365537 364487
67273 364487 363693 363208 362831 362310 361819 361985 363178 364918 366354 367287 368369 370203 372624 374981 376843 378197
67257 378197 379225 380099 380837 381216 381016 380494 380257 380431 380320 379310 377830 376972 377261 378250 379197 379697 379703 379433
67239 379433 379342 379765 380497 381078 381517 382328 383730 385242 386232 386529 386316 385795 385246 385064 385410 386004 386511 386978
67221 386978 387633 388404 388953 389147 389303 389924 391237 392886 394091 394298 393782 393416 393711 394301 394522 394253 393919 393880
67203 393880 394132 394558 395133 395853 396661 397540 398581 399942 401672 403461 404614 404617 403893 403646 404604 406160 407097
67186 407097 406968 406318 405791 405639 406045 407139 408444 408949 408209 406925 406002 405461 404837 404259 404372 405307 406465
67169 406465 407443 408487 409785 410900 411356 411430 411870 412966 414250 415036 415014 414392 413691 413375 413530 413942 414496 415267
67151 415267 416182 416892 417195 417286 417347 417224 416813 416486 416660 417212 417790 418521 419761 421202 421918 421462 420410 419590
67133 419590 419261 419305 419741 420617 421671 422479 422879 423040 423268 423841 424852 426078 427159 427975 428641 429110 429136 428742
67115 428742 428382 428414 428710 428996 429284 429753 430496 431556 432930 434278 435006 434937 434655 434886 435789 437045 438301 439202
67097 439202 439353 438720 437833 437220 436873 436625 436720 437475 438629 439517 439809 439584 438893 437844 437028 437218 438536 440352
67079 440352 442037 443417 444443 444951 444889 444432 443755 443001 442494 442608 443369 444494 445828 447399 449024 450319
67063 450319 451170 451821 452400 452764 452936 453282 454030 454906 455478 455692 455906 456555 457835 459569 461373 463053 464711
67046 464711 466277 467226 467150 466443 465916 465896 466254 467111 468734 470722 472187 473012 474092 475918 477726 478655 479080
67029 479080 479996 481552 483058 484230 485587 487541 489754 491616 492915 493859 494716 495629 496605 497596 498619 499740
67013 499740 500935 502180 503720 505934 508682 511156 512726 513723 514961 516735 518733 520731 522779 524753
66999 524753 526344 527646 529212 531258 533306 534982 536772 539460 543026 546645 549786 552797 556177 559750
66985 559750 563002 566036 569572 573904 578317 581879 584521 586916 589476 591952 594058 596058 598556 601933
66971 601933 606122 610730 615293 619623 623914 628348 632636 636301 639440 642803 646957 651718 656563 661241
66957 661241 665797 670418 675533 681638 688642 695748 702439 709293 717325 726702 736578 746062 754866 763176
66943 763176 771516 780663 791040 802022 812452 822078 831954 843073 855077 866785 877710 888546
66931 888546 900241 913111 926934 941480 956646 972224 987922 1003726 1020088 1037619 1056599
66920 1056599 1076861 1098004 1119568 1141042 1162115 1183100 1204863 1228039 1252434 1277459 1302972
66909 1302972 1329313 1356527 1384046 1411351 1438679 1466835 1496483 1527890 1561228 1596758 1634537
66898 1634537 1674050 1714344 1754673 1795063 1836237 1878998 1923642 1969903 2017311 2065547 2114578
66887 2114578 2164561 2215512 2267024 2318435 2369429 2420371 2471827 2523786 2575565 2626459 2676269
66876 2676269 2725129 2773071 2819845 2865110 2908579 2950014 2989114 3025478 3058751 3088858 3115990
66865 3115990 3140159 3160776 3176890 3187912 3193955 3195415 3192521 3185500 3174950 3161533 3145211 3125187
66853 3125187 3100887 3072776 3041824 3008234 2971167 2929884 2884846 2837417 2788715 2739038 2688127
66842 2688127 2635581 2581119 2524986 2468155 2411755 2356157 2300946 2245849 2191210 2137425 2084427
66831 2084427 2032053 1980481 1929875 1880016 1830761 1782581 1735996 1690713 1645975 1601698 1558621
66820 1558621 1517264 1477398 1438728 1401418 1365612 1330896 1296671 1262764 1229375 1196743 1165177
66809 1165177 1135100 1106624 1079288 1052599 1026616 1001626 977430 953465 929609 906377 884205
66798 884205 862969 842416 822735 804369 787330 770942 754342 737269 720321 704336 689509
66787 689509 675260 661114 647373 634602 622630 610604 598073 585515 573604 562453 551884
66776 551884 542028 533116 524886 516692 508205 499599 491067 482534 473952 465468 457162 448924 440801 433200
66762 433200 426480 420460 414624 408715 402901 397354 391910 386241 380269 374277 368628 363398 358345 353253
66748 353253 348226 343528 339203 334990 330647 326195 321796 317540 313417 309362 305255 301032 296861 293066
66734 293066 289763 286700 283554 280203 276638 272800 268728 264718 261062 257740 254567 251584 248991 246688
66720 246688 244149 240882 236945 232939 229550 227081 225320 223812 222245 220579 218849 216966 214730 211924
66706 211924 208456 204587 200957 198099 195894 193835 191812 190210 189132 188101 186780 185380 183976 182053
66692 182053 179306 176368 173915 171529 168427 165071 162953 162704 163414 164008 164311 164407 163953 162763 161364 160337
66676 160337 159603 158887 158362 158237 158107 157340 155848 154011 152157 150543 149428 148635 147428 145426 143345 142140
66660 142140 141675 140989 139742 138616 138247 138475 138860 139326 139940 140408 140151 138741 136225 133203 130573 128914
66644 128914 128028 127245 126158 124867 123586 122388 121319 120453 119729 118974 118157 117462 117042 116854 116750 116646 116610
66627 116610 116840 117419 118036 118156 117628 116854 116203 115558 114701 113832 113293 113080 113006 113066 113164 112808 111703 110469 110028
66608 110028 110379 110695 110630 110689 111143 111414 110973 110130 109391 108563 107210 105624 104665 104651 104951 104735 103765 102356 100915
66589 100915 99665 98689 98038 97709 97497 96997 95925 94490 93250 92567 92332 92217 92018 91735 91576 91950 93186
66572 93186 94998 96474 96818 96090 95040 94260 93631 92635 91082 89420 88259 87686 87237 86555 85823 85386 85285
66555 85285 85431 85962 86945 87893 88185 87963 88052 88810 89559 89420 88273 86652 85106 84079 83995 84894 86074 86612
66537 86612 86323 85933 86183 87025 87769 87885 87528 87326 87767 88751 89684 89935 89239 87850 86379 85355 84748 83996
66519 83996 82661 80895 79084 77284 75452 74074 73953 75161 76684 77353 76873 75707 74387 73281 72739
66504 72739 72947 73664 74423 74977 75339 75481 75347 75148 75260 75665 75741 74936 73538 72468 72217 72307 72064 71686 71974
66485 71974 73017 73813 73577 72864 72769 73291 73321 72233 70769 70110 70608 71684 72511 72491 71473 69868 68414 67617
66467 67617 67568 68216 69335 70193 69897 68473 67087 66754 67244 67723 68016 68592 69558 70448 71043 71691 72603 73311
66449 73311 73226 72484 71905 72126 72992 73817 74180 74280 74520 74919 75166 75124 74931 74619 74078 73488 73366 73923 74777 75559
66429 75559 76423 77507 78313 78209 77368 76645 76524 76718 76857 77074 77692 78646 79456 79645 79082 78021 76861 75827
66411 75827 74886 74026 73477 73494 74026 74777 75472 75912 75888 75372 74705 74342 74395 74571 74514 74057 73275 72509 72253 72761
66391 72761 73818 75028 76156 76987 77138 76421 75266 74384 74085 74287 75060 76617 78716 80590 81698 82154
66375 82154 82302 82239 82003 81830 81890 81994 81897 81743 81976 82894 84456 86332 87938 88588 87985 86601 85342 84715
66357 84715 84433 83851 82741 81561 81006 81290 81920 82145 81565 80290 78659 77067 75975 75741 76257 76974 77493
66340 77493 78011 78966 80349 81556 81952 81407 80293 79116 78207 77612 77207 76956 77002 77389 77719 77399 76366 75347
66322 75347 75112 75608 76134 76301 76382 76669 76967 77003 76948 77206 77927 79123 80909 83167 85171 86156 86216 86039 85822
66303 85822 85134 83932 82925 82576 82442 82028 81711 82161 83201 83960 83954 83431 82784 82258 82149 82620 83180 82874 81292
66284 81292 79129 77647 77757 79485 81946 83796 84160 83328 82367 82034 82296 82837 83618 84800 86417 88223
66268 88223 89690 90209 89603 88449 87525 86929 86145 85032 84225 84311 85051 85750 86063 86088 85913 85488 84824 84001 83107
66249 83107 82372 82247 83022 84465 86057 87512 88789 89732 90080 89869 89487 89258 89190 89173 89135 88883 88111 86818
66231 86818 85546 84900 84895 85039 85048 85162 85728 86730 87907 89078 90141 90956 91526 92144 93017 93789 93846 93173 92544
66212 92544 92673 93426 94087 94181 93823 93466 93517 94064 94720 94869 94285 93450 93068 93316 93757 93896 93645 93288 93162 93389
66192 93389 93806 94176 94485 94919 95541 96191 96743 97197 97426 97200 96636 96252 96274 96227 95607 94674 94152 94353 95051 95983
66172 95983 97008 97884 98474 99134 100364 102048 103520 104437 105106 105852 106548 106903 106857 106553 106240 106269 106847 107696
66154 107696 108307 108566 108760 108919 108623 107622 106304 105368 105318 106311 108091 109917 110949 110953 110407 109939 109939 110625 111929
66135 111929 113223 113706 113292 112689 112472 112569 112754 113031 113274 113150 112765 112853 113867 115372 116703 117674 118206 117961
66117 117961 117034 116489 117336 119195 120738 121221 120881 120091 119018 118132 118191 119424 121258 123081 124798 126498
66101 126498 128001 128974 129195 128651 127688 127072 127467 128725 130046 130879 131298 131473 131262 130534 129524 128624 128101
66084 128101 128172 129049 130663 132572 134313 135774 137133 138556 139961 140938 141013 140231 139385 139282 139784 140012 139459
66067 139459 138456 137467 136534 135661 135200 135433 136113 136820 137524 138403 139319 139838 139657 138757 137347 135959 135350 135930
66049 135930 137308 138692 139583 139862 139524 138830 138520 139234 140676 141846 142239 142364 142901 143816 144555 144847 145004
66032 145004 145632 147198 149619 152121 153748 154216 154027 153630 152956 152071 151771 152890 155280 158073 160741 163244
66016 163244 165285 166375 166841 167864 169988 172210 173230 173164 173282 174316 175745 176713 177007 177026 177305 178238 179852
65999 179852 181673 183056 183839 184472 185574 187597 190792 195097 200030 205063 210063 214974 219255 222378 224944
65984 224944 228415 233256 238067 241185 242572 243381 244063 243898 242322 239817 237211 234762 232315 229868 227574
65969 227574 225383 222993 220116 216634 212619 208297 203987 200019 196725 194330 192651 191065 189095 187000
65955 187000 185470 184749 184431 184127 183922 183989 184154 184157 184073 184197 184704 185757 187775 191241 196140 201845 207636 213246
65937 213246 218925 225065 231719 238326 243961 247998 250569 252342 253931 255610 257442 259356 261116 262518
65923 262518 263799 265555 268045 270765 273063 274996 277173 279754 282114 283735 284993 286663 288923 291367
65909 291367 293835 296660 300030 303682 307431 311490 315838 319666 321962 322545 322111 321338 320379 319252 318277
65894 318277 317858 317999 318265 318200 317748 317254 317005 316691 315451 312573 308095 302620 296696 290593 284467 278353
65878 278353 272004 265141 257971 251168 245181 239792 234512 229150 223848 218844 214494 211295 209445 208369
65864 208369 207066 205144 203354 202877 204123 206306 208178 209031 209042 208794 208618 208342 207549 206104 204467 203455
65848 203455 203542 204426 205472 206590 208416 211478 215457 219481 222926 225619 227420 228089 227696 226846 226314 226603
65832 226603 227875 229998 232408 234144 234394 233120 231070 229144 227831 227164 227046 227458 228451 230121 232696
65817 232696 236463 241416 247020 252635 258223 264310 271064 277725 283304 287613 291109 293805 294936 293914
65803 293914 291170 287727 284189 280500 276460 272056 267346 262390 257468 253135 249828 247461 245524 243619
65789 243619 241803 240286 238879 236953 234146 230887 228016 226000 224896 224986 226848 230535 235121 239549 243725
65774 243725 248354 253836 259883 266275 273473 282166 292494 304032 316321 329079 341885 353902 363971
65761 363971 370885 373692 372044 366386 357676 346806 334366 321031 307991 296756 288433 283180 280291
65748 280291 278816 278253 278872 281380 286217 293244 302211 313352 327215 343925 362957 383713 405990
65735 405990 429680 454221 478512 501182 520788 536098 546578 552488 554252 551821 544857 533315
65723 533315 517509 497873 475186 450874 426466 402635 379228 356306 334605 314856 297180
65712 297180 281452 267742 256029 245901 236926 229080 222458 216923 212332 208729 205890 203090 199878
65699 199878 196734 194373 192663 190910 188981 187338 186099 185010 184399 185073 186895 188352 188261 187224 186715
65684 186715 187206 187994 188490 188818 189194 189564 190002 190903 192597 195193 198852 203698 209339 214969 220243 225728
65668 225728 232318 240536 250591 262691 276901 292899 310219 328772 348974 371452 396602 424129
65656 424129 452817 481008 507544 532121 554636 574506 590918 603467 612156 616979 617993 615830
65644 615830 611765 607163 602989 599805 597904 597412 598468 601226 605383 609763 612702 612975 610085 603732 593447
65629 593447 578937 560428 538470 513679 486849 458930 430586 402035 373675 346584 321946
65618 321946 300075 280466 262759 247207 234117 223283 214223 206653 200475 195440 191122 187182 183499
65605 183499 180102 177066 174414 172001 169625 167357 165676 165020 165245 165706 165869 165622 164997 163946 162639 161759
65589 161759 162124 163928 166467 168629 169640 169509 169067 169485 171445 174574 177844 180584 182982 185683 189222
65574 189222 193955 200127 207714 216379 225868 236341 248203 261860 277885 297010 319384 343964
65562 343964 369191 394291 419448 444628 468757 490263 507965 521180 529455 532694 531376 526126
65550 526126 517014 503540 485401 463130 438007 411488 384785 358782 334128 311224 290173 270975
65538 270975 253860 239212 227003 216534 207117 198806 192059 186817 182472 178784 176203 175025 174707
65525 174707 174357 173564 172422 171078 169599 168065 166442 164552 162410 160357 158552 156586 153968 150872 148053
65510 148053 146119 145184 145104 145665 146573 147539 148432 149233 149899 150431 150961 151610 152356 153144 153963 154712 155217 155483 155652
65491 155652 155516 154504 152490 150325 149128 149214 150077 151197 152463 154005 156117 159261 163673 168913 174127
65476 174127 178710 182442 185219 187052 188182 188796 188690 187685 186215 184929 183774 182025 179338 176286 173685
65461 173685 171748 170023 167876 164960 161597 158673 156841 155798 154653 152989 151192 149787 148919 148482 148256
65446 148256 147811 146755 145227 143831 143055 143112 144213 146349 148773 150408 151074 151732 153240 155390 157484 159323
65430 159323 161158 163164 165454 168269 171598 174824 177217 178642 179442 179795 179642 179124 178654 178437 178217 177508
65414 177508 175969 173623 170965 168839 167944 168329 169391 170458 171455 172953 175328 177824 178909 177972 176360
65399 176360 176052 177425 179025 179620 179586 179865 180419 180485 179933 179555 180079 181548 183731 186575 190039 193771 197194
65382 197194 199860 201647 202647 202935 202500 201409 199847 197890 195446 192727 190471 189205 188449 187353 186054
65367 186054 185598 186308 187140 187167 186980 187906 190350 193658 197231 200975 204755 208277 211676 215672 220911 227423
65351 227423 234812 242717 250966 259458 267990 276181 283590 289873 294669 297482 298074 296983 295106 292686
65337 292686 289310 285113 281186 278209 275321 271173 265685 259968 254694 249402 243425 236804 230131 223962
65323 223962 218460 213270 207802 201980 196599 192599 190192 189105 189285 190651 192373 193243 192864 191806 190578
65308 190578 189151 187544 186036 184459 182004 178234 173814 169755 166338 163219 160281 157838 156031 154492
65294 154492 152779 150980 149735 149634 150640 152262 154261 156867 160127 163445 166157 168300 170247 171785
65280 171785 172192 171208 169352 167241 165193 163604 163002 163407 164135 164578 164830 165266 165887 166467 167057 167991 169522
65263 169522 171638 174037 176163 177549 178330 179196 180620 182345 183768 184622 185093 185550 186386 187972 190536 194061
65247 194061 198239 202350 205319 206328 205429 203203 199873 195233 189549 183815 178758 174153 169577 165386
65233 165386 162291 160283 158609 156772 155030 153933 153795 154568 155810 156799 157099 157105 157668 159114 160914 162385
65217 162385 163295 163629 163174 161750 159694 157753 156438 155668 155026 154230 153318 152583 152377 152850 153741 154553 155081
65200 155081 155598 156339 156945 156853 156211 155896 156332 156825 156483 155479 154759 154695 154717 154319 153745 153374 153046 152448 151811
65181 151811 151736 152475 153757 155242 156815 158486 160301 162336 164488 166226 166830 166058 164484 163030 162159 161622
65165 161622 160959 160118 159423 159035 158701 158133 157428 156919 156785 156959 157302 157639 157768 157680 157635 157759 157764 157442 157282 158061
65145 158061 159808 161761 163514 165714 169315 174436 180305 186083 191464 196564 201529 206329 210949 215649
65131 215649 220823 226408 231780 236636 241678 247744 254430 260376 265026 269226 273692 277804 280674 282770
65117 282770 285555 289734 294633 299203 302918 305643 307281 307801 307231 305491 302489 298404 293541 287876 281091
65102 281091 273068 264050 254272 243871 233260 223282 214718 207782 202149 197287 192706 188146 183674 179500
65088 179500 175663 172093 168993 166853 165848 165431 164814 163820 163060 163208 164242 165432 166001 165759 165177 164958
65072 164958 165492 166573 167541 167752 167034 165704 164205 162854 161999 162141 163518 165599 167391 168470 169428 171061
65056 171061 173253 174982 175396 174701 173896 173838 174650 175945 177380 178786 179869 180144 179411 178090 176769 175504
65040 175504 173895 171850 169904 168666 168225 168214 168211 168013 167768 167900 168684 169802 170582 170670 170104 168744 166225 162753
65022 162753 159399 157136 155840 154664 153078 151165 149216 147565 146713 147047 148377 150096 151761 153241 154464
65007 154464 155463 156674 158656 161394 164183 166405 168208 170305 173292 177206 181601 185964 190161 194412
64993 194412 198808 203007 206572 209386 211429 212424 212179 211212 210476 210323 210151 209309 208066 207430 208230 210603
64977 210603 214222 218768 224127 230136 236163 241091 243972 244689 243784 241707 238502 234206 229167 223854 218615
64962 218615 213785 209721 206495 203732 200941 197904 194619 191148 187741 184919 183074 182027 181244 180515 180162
64947 180162 180508 181373 182199 182538 182227 181227 179584 177658 176126 175410 175101 174208 172188 169546 167259 165802
64931 165802 164984 164546 164489 164767 165063 165149 165227 165650 166490 167564 168714 169769 170358 170133 169265 168418 168081 168101 168003
64912 168003 167600 167100 166721 166463 166319 166505 167275 168503 169631 170197 170416 171071 172698 175026 177428 179849 182898
64895 182898 186883 191236 195305 199485 204957 212239 220505 228585 236205 243876 251848 259779 267430 275271
64881 275271 284126 294344 305419 316373 326428 335277 342735 348312 351402 351836 349889 345689 339020
64868 339020 330011 319679 309418 300157 292296 286101 281592 278216 275230 272460 270214 268516 266892 264894
64854 264894 262300 258731 253755 247613 241348 235801 230783 225474 219373 212605 205661 199154 193683 189600
64840 189600 186869 185161 183980 182838 181637 180827 180807 181211 181248 180764 180425 180756 181549 182316 182703 182346 181083
64823 181083 179672 179537 181214 183626 185412 186422 187348 188538 189951 191762 194039 196149 197382 198088 199321
64808 199321 201388 203563 205338 207130 209549 212593 215926 219467 223463 228214 233854 240037 245769 249890
64794 249890 251875 251988 250755 248611 245973 243160 240188 236963 233662 230580 227733 225072 223032 222278 222805
64779 222805 223769 224385 224576 224696 225062 225874 227149 228516 229497 230149 231047 232483 234104 235574 237160 239342
64763 239342 242187 245460 249165 253615 259031 265251 271807 278191 284187 290000 295961 302104 308222 314318
64749 314318 320730 327754 335340 343173 350809 357776 363934 369856 376454 383938 391262 396776 399307 398583
64735 398583 394837 388299 379096 367584 354698 341774 329886 319436 310445 303010 297259 293116 290394
64722 290394 288906 288207 287508 286287 284755 283274 281672 279780 278365 278660 281051 285039 290472 297811 306917
64707 306917 316602 325856 334706 343306 350968 356831 360861 363409 364180 362456 358032 351192 342001 330458
64693 330458 317306 303961 291497 280218 270179 261513 254065 247302 240930 235336 231153 228512 226866
64680 226866 225408 223647 221693 220050 219059 218642 218690 219441 221180 223699 226480 229389 232785 236904 241471
64665 241471 246106 250784 255651 260588 265219 269258 272659 275389 277149 277378 275617 272031 267545 263270
64651 263270 259638 256279 252810 249537 247119 245677 244624 243434 242270 241683 241964 243082 245060 248017 251834
64636 251834 256063 260292 264445 268754 273570 279139 285309 291530 297515 303840 311457 320553 330357 340126
64622 340126 349666 358607 365806 370018 370817 368404 362983 354861 344814 333723 322075 310307 299232
64609 299232 289431 280542 271978 264166 258224 254428 251855 249646 247828 246713 246286 246376 246756 246800 245720 243462
64593 243462 240836 238547 236625 234963 233692 232733 231720 230793 230865 232688 236119 240579 245625 250733 255318
64578 255318 259516 264414 270957 279163 288834 300290 313665 328121 342597 356908 371228 384905
64566 384905 396844 406941 416140 424909 432387 437206 438533 436116 429974 420475 408490 395223 381839
64553 381839 369154 357433 346545 336517 327831 320930 315665 311474 307912 304703 301566 298455 295781
64540 295781 293899 292519 291127 289896 289597 290569 292335 294370 296737 299609 302495 304295 304090 301724 297642
64525 297642 292334 286032 278952 271624 264716 258610 253451 249587 247427 246686 246262 245236 243643 242011 240570
64510 240570 239411 238974 239661 241120 242449 243105 243169 242891 242499 242399 243026 244375 246053 247855 249935 252464
64494 252464 255521 259320 264162 270023 276459 282959 289161 294728 299320 302771 305131 306552 307274 307652 308043
64479 308043 308721 310029 312359 315776 319858 324175 328725 333589 338331 342081 344120 344168 342285 338829 334377
64464 334377 329494 324702 320742 318395 317698 317825 318255 319646 322946 327996 333646 339042 344052 348559 352025
64449 352025 353803 353441 350870 346894 343277 341520 341549 342198 342877 344014 345993 348627 351838 355945 361009
64434 361009 366719 373286 381608 392062 403865 416271 429828 445787 464741 486598 511574 540418
64422 540418 573712 611756 655314 705933 765065 833090 909561 994420 1088522 1192496 1304939
64411 1304939 1421936 1538537 1650629 1755580 1851870 1938787 2016151 2083349 2138226 2177231
64401 2177231 2196964 2195703 2173935 2134111 2079808 2014270 1939097 1854251 1759303 1654677 1542188
64390 1542188 1425118 1307798 1194471 1088174 990633 902772 824667 755320 693415 638498
64380 638498 590793 549897 514551 483890 458007 436948 419936 406101 395196 387020 380745 375478
64368 375478 370978 367219 363705 359897 355878 351903 347532 341912 334753 326443 317428 308122 299220 291386
64354 291386 284560 278161 272039 266655 262242 258395 254781 251790 250021 249349 248934 248190 247500 247804 249631
64339 249631 252703 256439 260434 264203 266891 267879 267629 267239 266948 265688 262547 258106 253835 250528 247992
64324 247992 246030 244961 245081 246227 248070 250443 253061 255231 256258 256161 255831 256413 258527 262030 266343
64309 266343 270921 275416 279636 283523 287011 289705 290840 289893 287140 283261 278414 272246 264895 257450
64295 257450 251010 245626 240584 235443 230436 225999 222314 219268 216519 213664 210595 207757 205849 205239
64281 205239 205766 207016 208619 210343 212070 213737 215280 216735 218434 220936 224553 228980 233466 237419
64267 237419 240865 244381 248560 253434 258453 263075 267186 270751 273288 274185 273553 272334 271423 270986 270748
64252 270748 270601 270766 271592 273281 275516 277272 277371 275478 272308 268729 264905 260487 255347 249903 244908
64237 244908 240999 238299 236416 235037 234420 234900 236073 237125 238060 239883 243277 247741 252413 257135 262240
64222 262240 267878 274198 281698 290675 300519 310219 319423 328491 337727 347203 357215 368125 379581
64209 379581 390380 399309 405938 410560 413706 415708 416386 415043 411039 404527 396505 388045 379528 370592
64195 370592 360737 349950 338677 327237 315566 303877 293222 284716 278230 272661 267696 264433 263774
64182 263774 265029 266911 269246 272805 277825 283734 290134 297069 304173 310361 314495 315857 313996 308940
64168 308940 301686 293789 286130 278586 271017 263935 257835 252460 247170 241665 236023 230404 225101 220565
64154 220565 216965 213955 211252 209280 208765 209756 211410 212850 213914 214915 215935 216724 217270 218134 219988
64139 219988 222963 226698 230915 235601 240608 245423 249442 252232 253453 252963 251191 249012 246939 244729
64125 244729 242016 238970 235978 233114 230393 228228 227085 226872 227173 227860 228933 230034 230874 232036 234554
64110 234554 238547 242956 246923 250793 255407 260920 266807 272723 278777 284947 290579 294691 296810 297471
64096 297471 297780 298473 299548 300852 302691 305524 309320 313637 318224 323111 328141 332789 336455 338664 339087
64081 339087 337684 334719 330310 324172 316267 307512 299197 291708 284443 277030 269979 263956 259086 255239
64067 255239 252426 250472 248780 246943 245387 244968 246016 248029 250176 251871 252987 253743 254422 255127 255811
64052 255811 256421 256843 256891 256635 256649 257528 259123 260645 261557 261995 262296 262547 262738 262940 263176 263472 264113 265446
64034 265446 267293 269033 270465 272096 274346 276909 279222 281125 282612 283357 283006 281810 280562 279938 280128
64019 280128 280996 282413 284536 287801 292338 297372 301635 304682 307299 310237 312994 314380 313992 312490 310546
64004 310546 308169 305148 301687 298407 295984 294754 294444 294261 293540 292279 290939 289847 289059 288587 288324 287918
63988 287918 287188 286664 287189 288871 290959 292888 294953 297675 300999 304552 308359 312734 317643 322745 328033
63973 328033 333853 340196 346481 352364 358389 365448 373794 382930 392280 401544 410462 418701 426219 433491
63959 433491 441242 450015 459961 470796 482083 493895 507161 522863 540769 559622 578928 600040
63947 600040 624941 654401 688079 726133 769847 820621 879184 946178 1022923 1111086 1211864
63936 1211864 1325812 1453235 1594262 1748456 1914471 2090110 2272896 2460843 2652619
63927 2652619 2846487 3038819 3223909 3395491 3548381 3678825 3784022 3862001 3911801 3933116
63917 3933116 3925518 3888245 3820898 3724203 3600169 3451929 3283800 3101237 2910079 2715248
63907 2715248 2520070 2326914 2138335 1957348 1786641 1627923 1482126 1349876 1231501
63898 1231501 1126886 1035697 957550 891550 835838 788126 746790 711146 680701 654577 631789
63887 631789 611716 593981 578044 563157 548744 534747 521584 509714 499246 490019 481961 475072
63875 475072 469011 463222 457778 453622 451489 450978 451246 452314 454875 459014 464038 469721 476899 486531 498812
63860 498812 513508 530504 549656 570687 593686 619236 647528 677746 708826 740602 773719
63849 773719 808579 844798 881543 918039 953768 988397 1021449 1051961 1078671 1100717 1117950
63838 1117950 1130461 1138131 1140843 1138711 1131783 1119783 1102502 1080266 1053735 1023540 990403 955336
63826 955336 919265 882560 845236 807468 769670 732269 695755 660756 627724 596678 567593
63815 567593 540855 516880 495418 475775 457793 442107 429196 418538 409023 400044 391877 384942
63803 384942 378986 373139 366735 359835 352892 346057 339003 331388 323293 315276 308190 302821 299387 297248
63789 297248 295284 292602 288832 283997 278499 273128 268588 264883 261493 258164 255177 252857 251260 250355
63775 250355 249993 249609 248539 246811 245088 243676 242260 240854 240182 240561 241144 241011 240490 240560 241294 241731 241190
63758 241190 239966 238734 237889 237506 237362 236994 236173 235316 234996 235109 235042 234624 234334 234512 234926 235287 235704 236389
63740 236389 237261 238071 238693 239166 239708 240756 242686 245376 248305 251168 254097 257115 259776 261674 263203
63725 263203 265384 268879 273307 277706 281572 285309 289680 295077 301465 308796 316997 325537 333420 339875
63711 339875 344864 348773 351843 353987 354848 353873 350699 345731 340067 334624 329620 325056 321213 318218 315531
63696 315531 312454 308978 305659 302851 300584 299040 298541 299043 300180 301848 304309 307591 311182 314466 317223
63681 317223 319621 321962 324509 327325 330223 332888 335018 336341 336791 336821 337171 338059 339028 339931 341553 344643
63665 344643 348743 352795 356613 360822 365446 369619 372891 375792 378651 380704 381007 379627 377271 374206
63651 374206 370230 365378 359938 353930 347240 340268 333873 328559 324163 320430 317516 315724 315107 315532 316907
63636 316907 319133 322016 325502 329858 335261 341239 346837 351490 355513 359576 363922 368327 372666 377192
63622 377192 382279 388127 394691 401664 408606 415409 422612 430851 440088 449863 460352 472537 487068
63609 487068 503558 521426 540947 562924 587651 614773 643943 675001 707654 741522 776481
63598 776481 812396 848331 882292 911786 934581 949253 955613 954770 948607 939120 928069 916713
63586 916713 905361 893476 880613 866974 852599 836463 817183 794625 770147 745245 720557
63575 720557 696226 672620 650451 630551 613694 600254 589956 582219 576696 573230 571440 570884 571572
63562 571572 573833 577770 583273 590403 599046 608297 616973 624832 632557 640430 647944 655051 662905 672749
63548 672749 684661 698062 713028 730448 751210 775812 804609 837920 875983 919178 967971
63537 967971 1021819 1077720 1130035 1172161 1199033 1209008 1204182 1189050 1168427 1146045 1124398 1105100
63525 1105100 1088932 1075639 1064011 1052329 1038931 1022611 1002679 978661 950239 917760 882657
63514 882657 846835 811515 777039 743783 712716 684785 660155 638330 618832 601512 586421
63503 586421 573579 562684 553015 543883 535291 527768 521441 515657 509725 503629 497708 491999 486371 481105
63489 481105 476845 473866 471596 469013 465517 461452 457763 455033 452955 450881 448767 447233 446815 447538 449267
63474 449267 452032 455904 460875 466897 473680 480463 486393 491203 495053 497768 498853 498363 496967 494820
63460 494820 491114 485320 478305 471604 465978 461252 457170 453685 450617 447714 445007 442636 440470 438413
63446 438413 436953 436798 437909 439426 440661 441767 443348 445836 449433 454331 460679 468428 477368 487333
63432 487333 498487 511617 528142 549569 576768 609774 648121 690852 735792 778947 815289
63421 815289 840927 855016 859703 858412 854344 850291 848884 852172 861119 876037 897353 925340 959165
63408 959165 996908 1036570 1076398 1114177 1147123 1172983 1190662 1199535 1199088 1190074 1175357 1158465
63396 1158465 1141310 1123885 1105828 1087298 1068240 1047703 1024416 997700 967678 934974 900521
63385 900521 865423 830741 797386 766145 737596 712024 689561 670333 654257 640905 629954
63374 629954 621677 616501 614013 612947 612421 612775 614866 618857 624204 630683 638818 649080 661104 674119
63360 674119 687985 703392 721026 740910 762669 786118 811374 838686 868408 900962 936525
63349 936525 974840 1015460 1057886 1101029 1142736 1180296 1211401 1234460 1248416 1253052 1249541 1240049
63337 1240049 1226508 1210113 1191949 1173377 1155355 1137691 1119255 1098703 1074967 1047556 1016728
63326 1016728 983268 947988 911673 875480 840834 808715 779379 752962 729977 711051 696579
63315 696579 686848 682190 682715 687843 695820 703291 705734 699477 683918 661577 635987 609971 585542
63302 585542 564057 545714 529634 515113 502361 491644 482383 473668 465115 456674 448148 439490 431120
63289 431120 423381 416062 408930 402227 396201 390734 385883 382069 379061 375569 370776 365697 362012 360000
63275 360000 358638 357324 356363 355844 355183 353920 352138 350051 347903 346257 345628 345717 345636 344907 343630 341818
63259 341818 339355 336647 334583 333626 333453 333500 333370 332782 331739 330767 330472 330879 331594 332410 333205 333581 333316 332918
63241 332918 332951 333044 332489 331623 331547 332420 333165 333066 332651 332548 332397 331469 329758 327952 326709 326237 326196 325886 324964
63222 324964 324009 323854 324431 324992 325403 326337 328028 329715 330663 330954 330974 330875 330835 331095 331481 331640 332041 333804 337108
63203 337108 340700 343536 346010 348858 351728 353835 355444 357676 361068 365167 369340 373371 377400 381898
63189 381898 387567 394752 403037 411691 420318 428821 437262 446142 456331 468130 480812 493591 506567
63176 506567 520086 533686 546544 558716 571008 583663 595974 607248 617458 626772 635087 642235
63164 642235 648160 652683 655509 656640 656413 654973 651997 647091 640135 631111 619896 606513 591453 575529
63150 575529 559392 543282 527224 511382 496165 481926 468696 456387 445240 435819 428459 422922
63138 422922 418696 415393 412748 410489 408441 406621 405117 404028 403584 404044 405382 407307 409681 412605 415990
63123 415990 419483 423072 427265 432348 437819 443070 448290 454137 460658 467074 472671 477521 482321 487802
63109 487802 494282 501461 508616 515225 521408 527614 534042 540603 547261 554043 560759 567057 572890 578678
63095 578678 584942 591912 599552 607787 616705 626581 637679 649916 662738 675391 687265 697956 707102
63082 707102 714244 718811 720231 718233 713048 705186 695068 683147 670267 657432 645022 632669 620079
63069 620079 607577 595602 584166 573222 563159 554422 546882 540101 533994 528713 524036 519516 515251
63056 515251 511945 510040 509167 508638 508190 508126 508931 510935 514127 518199 522799 527747 532988 538482 544340 550878
63040 550878 558275 566241 574292 582221 589986 597272 603681 609381 615103 621276 627553 633441 639037 644700
63026 644700 650187 654595 657259 658380 658653 658541 658119 657362 656202 654327 651364 647488 643582 640533 638501
63011 638501 637096 636056 635393 635009 634731 634886 636487 640596 647679 657629 670110 684673 700768 717946
62997 717946 736040 755010 774673 794614 814279 833163 851044 868043 884334 899876 914531
62986 914531 928271 941050 952742 963674 974892 987207 999907 1011075 1019228 1024057 1025582 1023538
62974 1023538 1017902 1009050 996813 980221 959034 934844 909786 884574 858749 832409 806537 781744
62962 781744 757854 734974 713985 695576 679545 665435 653226 642823 633410 623962 614250 604858
62950 604858 596200 587870 579027 569259 558965 548910 539412 530018 520024 509245 498141 487348 477223
62937 477223 467716 458498 449312 440462 432790 426885 422409 418508 414779 411451 408666 406054 403180 400099
62923 400099 397273 395093 393576 392396 391216 390122 389633 390015 390673 390580 389426 388045 387617 388641 390763 393316
62907 393316 395858 398248 400441 402298 403747 405132 407030 409475 411577 412398 412132 412014 413026 415157 418033
62892 418033 421742 426706 433084 440687 449361 459061 469531 480066 489656 497377 502817 506225 508215 509279
62878 509279 509619 509315 508293 506074 501980 495977 489162 483001 477996 473325 467842 461181 453779 446094 438178
62863 438178 429999 421868 414319 407674 401933 397066 393156 390155 387630 384940 381731 378232 375040 372625
62849 372625 371008 369915 369163 368782 368725 368690 368405 367974 367689 367533 367152 366349 365398 364782 364777 365294 365975 366428 366571
62830 366571 366703 367057 367398 367387 367278 367782 369127 370709 371875 372684 373673 375155 377009 378845 380153 380528 380047
62813 380047 379208 378342 377316 375948 374362 372709 370956 369234 368041 367703 367902 368073 367968 367481 366324 364420
62797 364420 362398 361084 360507 359893 358656 357019 355632 354898 354694 354500 353813 352598 351269 350084 348825 347303
62781 347303 345903 345292 345757 347146 349218 351712 354336 357097 360432 364524 368713 372120 374753 377377 380366
62766 380366 383287 385714 387870 390193 392618 394524 395191 394303 392268 390141 388908 388754 389137 389534 389853 390183
62750 390183 390472 390481 389882 388371 385861 382496 378341 373274 367484 361850 357385 354312 351946 349472 346619
62735 346619 343687 341147 339216 337659 336185 335062 334956 335938 337202 338123 339096 340728 342692 344131 344882
62720 344882 345538 346497 347785 349629 352366 355772 359267 362829 366940 371646 376477 381382 386893 393164 399700
62705 399700 406385 413931 422898 432998 443878 456001 470169 486607 504996 525094 546917 570569
62693 570569 596228 623993 653502 683955 714761 745864 777350 809145 841209 873450 905079
62682 905079 934440 959848 980324 995412 1004673 1007626 1003813 992855 974951 951506 924610 895499
62670 895499 864049 830065 794372 758154 721952 686140 651862 620514 592369 566581 542620
62659 542620 521018 502463 486767 473064 460735 449735 440064 431254 422590 413852 405588 398474 392533
62646 392533 387260 382340 377823 373610 369357 364960 360660 356560 352581 349109 346976 346367 346292 345712 344770
62631 344770 344301 344555 345084 345709 346767 348306 349640 349985 349139 347322 344715 341464 338052 335361 334108 334133
62615 334133 334352 333635 331794 329554 327652 326325 325703 326126 327663 329579 330767 330697 329731 328572 327714 327394
62599 327394 327779 328939 330610 332105 332680 332150 331036 329975 329150 328499 328181 328403 328962 329549 330379 331889 333716
62582 333716 334745 334461 333717 333765 334977 336761 338310 339022 338622 337338 335789 334421 333230 332158 331372 330940
62566 330940 330652 330387 330260 330196 329791 328909 327945 327172 326347 325345 324619 324509 324529 323971 322966 322375 322803 324216
62548 324216 326263 328479 330308 331424 331975 332218 332085 331492 330809 330639 331234 332454 334133 336169 338440 340856
62532 340856 343328 345524 347005 347810 348411 348901 348838 348281 348311 349868 352726 356266 360657 366390 373132 380091
62516 380091 387214 395014 403369 411650 420057 429783 441588 455150 470102 486817 505668 526197 547550
62503 547550 569265 591210 613071 634343 654602 673545 690867 706096 718353 726468 729846 729249
62491 729249 726191 721513 715106 707084 698529 690719 684262 679414 676843 677484 681751 689287 699426 711785
62477 711785 726507 744132 765006 788650 813776 838899 862674 883634 900155 911130 916624 917579
62465 917579 914798 908190 896784 879397 855517 825868 792219 756649 720791 685537 651210 618041
62453 618041 586577 557523 531157 507162 485253 465671 448778 434438 422220 411979 403750 397293
62441 397293 392304 388996 387742 388087 388779 389057 389368 390554 392780 395562 398375 400845 402718 404076 405347
62426 405347 406666 407411 406790 404823 402366 400164 398185 395967 393291 390306 387131 383666 379937 376439 373837
62411 373837 372300 371405 370837 370869 371853 373499 375068 376182 376955 377365 377056 375976 374818 374454 375091 376211 377184
62394 377184 377796 378287 379171 381024 384231 388769 394138 399575 404477 408776 412837 416923 420913 424670 428534
62379 428534 433156 438912 445746 453569 462457 472325 482640 492793 502759 513233 524969 537966 551472
62366 551472 564890 578532 593233 609330 626433 644274 663396 684802 709271 737186 768712
62355 768712 803931 843147 887252 937275 993239 1053903 1117938 1184677 1253010 1320102 1382215
62344 1382215 1436669 1482224 1517796 1542003 1554291 1555677 1547924 1532484 1510389 1482423 1448861 1409451
62332 1409451 1364268 1314532 1262438 1210368 1160236 1113090 1069055 1027879 989736 955172 924212
62321 924212 896024 869767 845407 823282 803079 783637 763738 742889 721415 700018 679245
62310 679245 659232 639879 621207 603491 587131 572461 559569 548125 537536 527505 518358 510626
62298 510626 504459 499658 496085 493652 492056 490944 490265 490062 490070 489996 490154 491276 493622 496730 500074 503506
62282 503506 506998 510486 514146 518359 523199 528258 533092 537511 541401 544757 548016 551899 556723 562187
62268 562187 567964 574104 580729 587790 595406 604166 614921 628491 645511 666156 689943 716307 745526
62255 745526 778679 816639 859625 907830 961762 1021552 1086399 1155045 1226220 1298064 1367466
62244 1367466 1430623 1484306 1526452 1555935 1572402 1576322 1568858 1551410 1525167 1490850 1448851 1399765
62232 1399765 1344857 1285849 1224390 1161969 1100145 1040307 983236 929416 879713 835007 795094
62221 795094 758779 725510 696229 672112 652956 637275 623512 610706 598472 586989 576727
62210 576727 567648 558912 549845 540962 533478 527961 523891 520401 516988 513604 510488 507999 506351 505503
62196 505503 505388 506078 507569 509633 512107 515136 518946 523634 529321 536175 544119 552840 562351 573131
62182 573131 585456 598950 613087 627681 642581 657362 671781 686078 700239 713273 723880
62171 723880 731642 737134 741185 744737 749257 756476 767514 782656 802043 826162 855610 890710 931392
62158 931392 977022 1026240 1077168 1127797 1175990 1219278 1255098 1281493 1297658 1304050 1302115 1293565
62146 1293565 1279456 1259820 1234277 1202810 1165935 1124573 1080179 1034669 989747 946357 905040
62135 905040 866490 831366 799866 772009 748130 728495 712525 699036 687289 677292 669023 661928
62123 661928 655437 649552 644635 640865 638099 636055 634497 633353 632872 633620 636242 641241 648895 659351
62109 659351 672880 689989 711035 735636 762732 791263 820322 848333 872639 890700 901831
62098 901831 907507 910159 912032 914838 919428 925174 929878 930752 925755 914356 897570 877561 857001
62085 857001 838299 822949 811294 802917 797487 795341 797125 802980 812391 824859 840288 858575 879327
62072 879327 902278 927541 955036 983994 1013498 1043251 1073389 1103763 1133815 1163025 1191215
62061 1191215 1218680 1246386 1275636 1307008 1339795 1372872 1405702 1437853 1467845 1493319 1512378
62050 1512378 1524228 1528640 1525574 1515481 1499351 1478148 1452503 1422846 1389317 1351551 1309193 1262831
62038 1262831 1214023 1164296 1114642 1066018 1019686 976659 937152 900798 867160 836011 807553
62027 807553 782526 761656 744741 730642 718327 707523 698210 689990 682294 674852 667606 660487 653578
62014 653578 647208 641459 635793 629455 622176 614209 605999 598170 591623 587066 584300 582297 580217 578234
62000 578234 577369 578637 582408 588321 595607 603530 611681 619922 627997 635259 640919 644591 646506 647120 646688
61985 646688 645240 642671 638597 632433 624094 614476 604680 594736 583748 571456 558952 547480 537145
61972 537145 527373 518114 509830 502589 495977 489918 484924 481382 479041 477277 475556 473631 471624 469896
61958 469896 468536 467099 465248 463529 462976 463943 465775 467678 469474 471469 473977 477168 481017 485292 489864
61943 489864 495118 501757 510145 520076 531216 543480 557078 572505 590484 611441 634940 659907
61931 659907 685477 711363 737453 763491 789220 814345 838188 859817 878853 895847 911470
61920 911470 925383 936209 942739 945014 944039 940402 933522 922650 908591 893816 880679 870035 861900
61907 861900 856797 855740 859294 867426 880038 896802 916452 937068 957218 976312 993794 1008634
61895 1008634 1019729 1026292 1027778 1024015 1015576 1003494 988444 970619 950399 928550 905622 881762
61883 881762 857358 833262 810153 788117 767079 747195 728576 711132 694872 679847 665557
61872 665557 650976 635530 619697 604390 590236 577677 567247 559269 553536 549611 547209 546201
61860 546201 546621 548838 553221 559452 566676 574616 584051 595955 610676 628273 648982 672846 699399
61847 699399 728331 760064 795135 833293 873729 915920 959660 1004399 1048977 1091858 1131244
61836 1131244 1165242 1192384 1211940 1223605 1227295 1223618 1214071 1200246 1183237 1164335 1145799 1130020
61824 1130020 1118099 1110098 1106555 1108733 1117109 1130524 1147362 1166936 1189050 1212498 1234596 1252154
61812 1252154 1262601 1264325 1256566 1239334 1213347 1179836 1140281 1096320 1049773 1002528 956209 911849
61800 911849 869956 830858 794952 762654 734238 709661 688416 669651 652749 637821 625347
61789 625347 615267 606754 599001 591926 585894 581077 577355 574551 572342 570117 567317 563925 560367 557036
61775 557036 554176 552119 551120 550840 550327 548799 546322 543539 540869 538194 535231 531972 528684 525688 523305
61760 523305 521836 521293 521181 520860 520252 519963 520569 522019 523936 526188 528841 531723 534407 536612 538331 539673
61744 539673 540766 541773 542724 543434 543760 543810 543620 542911 541503 539750 538168 536825 535575 534633 534392 534852 535810
61727 535810 537406 539750 542146 543597 544195 545136 547161 549776 552312 554861 557677 560438 562830 565347 568786
61712 568786 573223 578049 582752 587135 590958 593851 595533 595833 594701 592433 589681 586967 584350 581700
61698 581700 579001 576289 573700 571782 571331 572577 574870 577408 579944 582504 584844 586513 587219 586950 586086
61683 586086 585494 585946 587168 587930 587364 585725 583700 581655 579880 578757 578055 576699 573951 570333 566766
61668 566766 563339 559619 555686 552025 548732 545613 542764 540340 538058 535756 534148 534086 535148 535838 535225
61653 535225 533741 532398 531887 532376 533451 534211 534167 534090 535305 538115 541595 544959 548374 552269 556654 561394
61637 561394 566478 571585 575971 579244 581825 584237 586202 586834 585502 582238 577477 571751 565575 559444
61623 559444 553830 549048 545012 541256 537475 533946 531164 529106 527234 525224 523396 522355 522413 523324 524358
61608 524358 524694 523934 522234 519793 516435 511928 506433 500246 493348 485710 477906 470852 464891 459558 454299
61593 454299 449059 444198 440197 437445 435905 434950 433861 432498 431208 430179 429235 428148 426750 424849 422498
61578 422498 420276 418747 417664 416186 413891 411102 408220 405285 402241 399107 395798 392298 389076 386761
61564 386761 385244 383686 381632 379570 378068 376886 375337 373150 370592 368063 365932 364513 363764 363149 362125
61549 362125 360716 359431 358712 358643 359073 359781 360594 361450 362355 363256 364033 364617 365020 365287 365578 366182 367188 368195
61531 368195 368704 368891 369710 371987 375524 379147 381560 382204 381489 380218 378749 376784 374024 370777 367668
61516 367668 364934 362339 359650 356849 353957 351012 348203 345752 343735 342265 341671 342127 343274 344563 345819
61501 345819 347019 347792 347727 347057 346358 345633 344383 342619 341100 340369 340175 340074 339976 339861 339527 338957 338441 338115
61483 338115 337860 337851 338535 339773 340645 340608 340255 340416 341021 341455 341575 341647 341645 341414 341360 342144 343688 345159 346108 346967
61463 346967 348195 349444 349942 349382 348145 346796 345717 345098 345041 345527 346335 347053 347254 346807 346041 345529 345638
61446 345638 346291 347096 347680 347969 348260 348999 350350 351944 353166 353803 354354 355553 357599 359991 362164 364123
61430 364123 366327 369082 372328 375933 379821 383693 386973 389259 390625 391327 391448 391111 390773 390886 391391 391946
61414 391946 392666 394267 397319 401566 406086 409989 412936 415096 416635 417313 416691 414734 412011 409124 406217
61399 406217 403220 400314 397749 395356 392625 389323 385782 382533 379825 377561 375635 374319 374153 375239
61385 375239 376715 377383 376966 376259 375903 375645 375140 374815 375298 376441 377645 378811 380224 381751 382933 383760
61369 383760 384625 385567 386306 386989 388169 389947 391751 393058 393781 393901 393408 392802 393020 394626 397411 400855
61353 400855 404499 407872 410647 413083 415880 419523 424178 430132 437722 446750 456573 466898 477941 489747
61339 489747 501975 514392 526855 538653 548645 556418 562711 568397 573626 578224 582197 585380 587129
61326 587129 586918 584970 581946 578269 573954 568759 562412 555138 548033 542337 538175 534665 531438 529290
61312 529290 528930 529840 530945 531824 532675 533577 534450 535426 536747 538526 541010 544778 550267 557363 565718 575120
61296 575120 585243 595500 605542 615471 625164 633712 639911 642931 642295 637852 630366 621543 612750 603955
61282 603955 594517 584668 575569 568133 562427 558043 554437 551092 548033 546211 546774 549784 554028 558121
61268 558121 561564 564863 569049 574999 582797 591654 600649 609469 618236 626862 634977 642414 649366 656152
61254 656152 663186 671127 680694 692235 705629 720565 736621 753094 768958 783031 794164 801473
61242 801473 804761 804722 802471 798729 793435 786101 776482 765013 752693 740540 729180 718940 710143
61229 710143 703093 697873 694420 692631 692058 691648 690360 688187 686236 685738 687257 690714 695579 701001 706327
61214 706327 711686 717590 723867 729528 733849 736987 739314 740824 741577 742158 743154 744526 745840 746795 747219
61199 747219 746916 745894 744456 742862 741211 739853 739513 740801 743953 749177 756744 766563 778251 791923
61185 791923 808325 827844 849849 873220 896877 919484 939444 955839 968985 979663 988348 995583
61173 995583 1002353 1009333 1016223 1022458 1028151 1033622 1038413 1041553 1042611 1041761 1038926 1033513 1025159 1014339
61159 1014339 1002142 989532 976726 963240 948756 933788 919020 904079 887799 869980 852080
61148 852080 835825 821850 810091 800642 793510 788217 784417 782398 782382 783898 786484 790297 795155 799438
61134 799438 800923 798514 792614 784224 774442 764487 755267 746998 739777 734244 731083 730159 730861 733046 737045
61119 737045 743002 750883 760926 773437 788255 804904 823149 843004 864440 887450 912139 938423
61107 938423 965979 994688 1024554 1054878 1084325 1112348 1139814 1167571 1195095 1221220 1245468
61096 1245468 1267849 1288064 1305854 1321528 1335058 1345083 1349784 1348477 1341638 1329876 1313839 1294606
61084 1294606 1273080 1249231 1222882 1195019 1167382 1140983 1115792 1091596 1068293 1045611 1023421
61073 1023421 1002206 982512 964188 946756 930248 915036 901239 888870 878115 868916 860937 854510
61061 854510 850754 850003 850970 852354 854429 858119 863528 870450 879203 889582 900032 909508 919380 931821
61047 931821 946958 963214 979690 996456 1013197 1029632 1046923 1066719 1088983 1112617 1137892
61036 1137892 1166204 1197493 1229981 1262731 1296625 1332552 1370282 1409470 1450265 1492636 1536372
61025 1536372 1581848 1629590 1679333 1730766 1784789 1842495 1903504 1967020 2033914 2105699 2181910
61014 2181910 2260578 2340805 2422667 2505367 2588413 2674468 2768415 2873795 2992721 3128471 3284422
61003 3284422 3460302 3653103 3862193 4090750 4343328 4627181 4956603 5351269 5829873
60994 5829873 6410765 7118985 7985539 9039563 10312970 11859277 13757797 16089323 18911842
60985 18911842 22254322 26085834 30220239 34228222 37506092 39540209 40191156 39762189
60977 39762189 38809736 37883072 37381756 37523238 38295726 39379325 40174543 40033650 38575778
60968 38575778 35850746 32248005 28266676 24329351 20713151 17556832 14891611 12680996
60960 12680996 10862559 9374064 8158766 7165100 6350818 5684487 5139579 4689865 4312216
60951 4312216 3989953 3710791 3464215 3242925 3043893 2865247 2703641 2556210 2422823
60942 2422823 2304342 2200111 2108596 2028572 1957769 1891688 1825570 1756903 1685202 1610841 1535388
60931 1535388 1461700 1392108 1327089 1266435 1210550 1159658 1112932 1069545 1029640 993344 959856
60920 959856 928453 899466 873297 849427 827270 807147 789486 773860 759609 746621 734761
60909 734761 723449 712582 703007 695312 688990 683485 679110 676143 674001 672205 671205 671326 671760 671644
60895 671644 671346 671570 671913 671400 669954 668239 666444 664153 661115 657394 653155 648983 645848 643941 642065
60880 642065 639013 635028 631009 626818 621483 614815 607709 600892 594271 587510 580458 572938 564797 556324
60866 556324 548132 540571 533622 527270 521509 516100 510804 505859 501831 498967 497002 495572 494582 494220 494749
60851 494749 496243 498474 501208 504565 508723 513306 517532 521053 524129 526926 529319 531667 535035 540085
60837 540085 546214 552181 557088 560365 561489 560434 558109 555724 553873 552521 551442 550272 548579 546471
60823 546471 544817 544332 544717 545189 545495 545922 546592 547354 548096 548630 548420 546993 544500 541374 537580 532705 526796
60806 526796 520622 515013 510120 505283 499515 492351 484467 477195 471195 465926 460681 455696 451741 448967
60792 448967 446735 444405 441758 438747 435397 431979 428885 426277 424133 422515 421459 420702 419928 419222 418935
60777 418935 419137 419572 420142 421072 422525 424324 426166 427969 429990 432702 436464 441088 445805 449934 453611
60762 453611 457745 463188 470007 477494 484814 491695 498543 505842 513488 520875 527516 533280 538057 541614
60748 541614 543999 545679 547055 548127 548927 549955 551787 554377 557027 558947 559626 558872 556765 553503 549094
60733 549094 543262 535859 527289 518363 509860 502263 495613 489385 482763 475486 468352 462560 458494 455340
60719 455340 451931 447817 443507 439797 437009 434869 433062 431694 431090 431320 432185 433626 435720 438252 440624
60704 440624 442439 443946 445814 448595 452478 457271 462563 468119 474202 481247 489120 497004 504169 510580
60690 510580 516653 522697 528736 534483 539246 542205 543210 543173 543302 544005 544782 545136 545271 545825 547163 549176
60674 549176 551834 555656 561329 568842 577368 586234 595652 606109 617395 628829 640339 652668 666455
60661 666455 681650 697933 715174 733172 751323 768891 785520 801443 817343 833773 850369
60650 850369 865783 878850 889589 898519 905222 908557 908250 905195 899936 891897 880643 866951 851867
60637 851867 835406 817048 797076 776615 756658 737676 719905 703317 687557 672592 659230
60626 659230 648409 640130 633697 628833 625758 624178 622986 621314 619412 618143 617852 617980 617601 616099 613427
60611 613427 609953 606195 602608 599321 595850 591274 585133 578156 571773 566814 562950 559322 555215 550190
60597 550190 544259 538189 533013 528862 524835 520310 515778 511887 508304 504284 499985 496407 494220 493279
60583 493279 493187 493637 494183 494281 493761 493000 492578 492959 494338 496473 498768 500891 503292 506899 512368 519795 528950
60566 528950 539515 551309 564663 580401 599151 620792 644836 671159 699985 731201 763832
60555 763832 795976 825019 848229 863673 870623 869119 859521 842804 821057 797252 774478 755209
60543 755209 740699 730696 724185 720837 721461 726858 736871 751112 770075 794774 825491 861426
60531 861426 901176 942800 983627 1020759 1051746 1074437 1086750 1087647 1078364 1061901 1041274 1018837
60519 1018837 996864 977495 961688 949026 938841 930822 924341 918140 911387 904521 898543 893959 890866
60506 890866 889617 890693 894085 899327 906094 914448 924620 936887 951672 969643 991790 1019610 1054992
60493 1054992 1099646 1154606 1220313 1297017 1384872 1483615 1592101 1707897 1827141 1944888
60483 1944888 2055817 2154817 2237233 2299007 2336861 2348378 2332100 2287995 2218017 2126022 2016853
60472 2016853 1895504 1767028 1636742 1509882 1390694 1281785 1184220 1098105 1023093 958460
60462 958460 902944 854770 812171 774070 740314 711075 685972 663821 643390 624392 607550
60451 607550 593555 582064 571851 561876 552077 543206 536026 530584 526064 521461 516549 512041 508592
60438 508592 505966 503550 501370 499889 498944 497762 496270 495547 496441 498285 499565 499450 498062 495620 492095
60423 492095 487742 483284 479274 475528 471466 466986 462839 459973 458450 457271 455581 453752 452773 452752 452770
60408 452770 452271 451739 451742 452154 452735 453687 455030 456150 456662 457107 458047 459071 459545 459798 460517 461356 461324 460465 460038
60389 460038 460879 462532 464208 465768 467361 468873 470167 471419 472867 474558 476532 478888 481498 484020
60375 484020 486360 488741 491202 493387 494953 495935 496630 497431 498782 500967 503921 507515 512026 517862 524799
60360 524799 531844 537974 542759 546317 549015 551271 553238 554617 554999 554418 553255 551619 549152 545543 541006
60345 541006 536281 532374 530069 529347 529371 529448 529925 531727 535149 539561 544198 548739 553076 557050 560558 563533
60329 563533 565770 567072 567605 567804 568022 568618 570138 572799 575832 577994 578873 579117 579252 578886 577432 575104
60313 575104 572776 571085 570084 569742 570529 573357 578860 586741 596094 606571 618995 634582 653823 676517
60299 676517 702753 733483 770082 813207 861347 910043 953238 986307 1007656 1016989 1012902 993533
60287 993533 959480 914843 865252 815728 770238 731493 700159 674938 654220 637343 624033
60276 624033 613484 604678 597175 590986 585944 581578 577370 572849 567770 562404 557314 552737 548586 545040
60262 545040 542481 540731 539105 537522 536820 537528 538984 540170 540782 540981 540735 540142 539808 540089 540226 539021
60246 539021 536251 532798 529519 526592 523918 521510 519361 517351 515490 514021 513195 513091 513605 514495 515530
60231 515530 516683 518042 519472 520618 521424 522428 524347 527492 531685 536467 541255 545583 549461 553267
60217 553267 557165 560825 563786 565785 566672 566460 565748 565618 566647 568249 569369 569736 570158 571696 574709 578597
60201 578597 582350 585451 588257 591263 594157 596144 597227 598462 600572 602963 604642 605625 606697 608034
60187 608034 608803 608163 606165 603523 600909 598625 596741 595293 594295 593521 592399 590426 587772 585198 583247
60172 583247 581730 580180 578534 577168 576497 576707 577678 578971 580117 581079 582265 583909 585716 587238 588366
60157 588366 589305 590400 592173 595164 599321 603765 607467 610034 611648 612495 612617 612135 611285 610195 608878
60142 608878 607422 606059 605066 604737 605426 607617 611878 618561 627237 636636 645620 654247 663438 673466 683247
60127 683247 691328 697164 701095 703417 703876 701967 697505 691022 683700 676746 670760 665784 661904 659379
60113 659379 658189 657916 658232 659110 660524 662350 664710 667890 671717 675471 678738 681928 685679 690102 694824
60098 694824 699356 703182 705928 707657 708621 708483 706420 702309 697249 692439 688072 683894 680333 678317 678221
60083 678221 679651 682141 685436 689197 692999 696735 700584 704519 708144 711065 713133 714233 713983 711741
60069 711741 707039 700209 692545 685448 679218 672970 665937 658493 651637 645790 640506 635195 629778 624617
60055 624617 620025 615893 611795 607467 603021 598539 593744 588523 583493 579424 576228 573195 570187 567765
60041 567765 566037 564340 562465 561362 562082 564590 568082 571860 575511 578893 582457 586971 592424 597789
60027 597789 602294 606211 609836 612506 613446 612862 611376 608950 605347 601132 597105 592993 587729 580988 573630
60012 573630 566704 560736 555895 552052 548633 545023 541125 537179 533365 530113 528307 528259 528728 527948 525639
59997 525639 523213 521972 521914 522377 522991 523687 524319 524630 524329 523240 521693 520674 521082 522918 525598 528844
59981 528844 532727 537072 541526 546147 551228 556475 560977 564113 566044 567282 568273 569328 570382 570792 569839
59966 569839 567556 564701 562013 559890 558581 558150 558296 558683 559301 560068 560395 559866 559153 559402 560733 562049
59950 562049 562375 561660 560225 558260 556038 553925 551886 549496 546662 543900 541707 540133 539060 538418 537984
59935 537984 537470 536921 536613 536442 535860 534496 532477 530142 527875 526202 525532 525735 526411 527596 529674 532619
59919 532619 535840 538852 541585 544025 546116 548113 550489 553318 556143 558493 560169 561074 561301 561291 561384 561257
59903 561257 560444 559290 558651 558595 558203 556855 555036 553645 553127 553491 554513 555659 556383 556780 557523 559021 561213
59886 561213 564260 568692 574571 581158 587795 594586 601892 609656 617553 625303 632590 639157 645292 651698
59872 651698 658553 665196 671005 675990 680129 682748 683140 681411 678151 673565 667487 660067 651961 643842
59858 643842 636104 628976 622635 617056 611899 606638 601031 595585 591348 588911 587768 587011 586441 586526 587498
59843 587498 589168 591588 595159 600020 606046 613588 623520 636323 651641 668768 686727 703637 716998
59830 716998 725343 729165 729934 728973 727828 728860 734119 743349 753507 760254 760003 751312 735238 714519
59816 714519 691994 669544 648239 628799 611521 596164 582466 570652 561099 553663 547670 542510
59804 542510 538002 534235 531243 528836 526754 524993 523799 523081 522076 520021 517052 513902 510855 507613
59790 507613 504156 500944 498125 495310 492452 490209 489080 488744 488659 488694 488747 488318 487059 485331 483711 482233
59774 482233 480534 478450 476086 473593 471222 469302 467882 466730 465840 465550 465915 466446 466738 466905 467149 467511
59758 467511 468314 470115 472711 474833 475506 475235 475253 476084 477540 479649 482717 486635 490890 495199 499597 504001
59742 504001 508174 511999 515321 517711 518843 518936 518436 517578 516709 516617 517724 519160 519486 518425 517201 516989
59726 516989 517629 518059 517601 516496 515427 514724 513951 512297 509531 506520 504545 504103 504552 504843 504392 503350
59710 503350 502349 502002 502514 503729 505509 507919 510919 514168 517263 519982 522172 523734 524961 526548 528934
59695 528934 531788 534454 536680 538691 540822 543434 546920 551323 555991 559954 562661 564145 564608 564232 563356
59680 563356 562523 562147 562201 562278 562004 561472 561172 561369 561682 561574 561055 560419 559413 557343 554141 550624 547417 544304
59662 544304 541051 538172 536213 534775 533013 530892 529238 528623 528796 529271 529935 530950 532426 534370 536849
59647 536849 540077 544338 549637 555364 560482 564165 566149 566511 565419 563117 559825 555547 550370 544974
59633 544974 540378 537049 534695 532980 531812 530888 529754 528686 528687 530075 531784 532645 532776 533008 533566 534134
59617 534134 534801 536009 537748 539518 540923 541629 541026 538712 535265 531816 528919 526488 524720 524262 525314
59602 525314 527243 529309 531304 533286 535119 536532 537352 537548 537245 536722 536198 535624 534832 533825 532709 531511
59586 531511 530354 529605 529547 529939 530189 529881 528966 527625 526185 524972 523936 522521 520167 516858 513077 509442
59570 509442 506478 504373 502693 500672 498047 495324 493056 491272 489864 488987 488684 488597 488580 489117 490599 492556
59554 492556 494202 495396 496465 497368 497737 497573 497321 497367 497953 499411 501902 505079 508465 511999 515769 519466
59538 519466 522737 526024 530525 537325 546889 559230 574217 591831 612222 634809 656769 673139
59526 673139 679727 676264 666328 654408 643457 634768 628879 626106 626678 630621 637298 645218 652801 659361
59512 659361 665021 669888 673764 676466 677795 677260 674325 668989 661762 653204 643835 634238 624720 615056
59498 615056 605037 595095 585904 577641 570135 563458 557751 552716 547968 543703 540367 537852 535682 533821
59484 533821 532580 531908 531514 531618 532756 534878 537322 539728 542272 545060 548021 551467 555974 561573 567650
59469 567650 573695 579524 584699 588473 590509 591093 590545 589003 586930 585177 584318 584336 585135 586915 589899 594077
59453 594077 599332 605580 612814 621261 631325 643054 655971 669907 685596 703771 723904 744465
59441 744465 764074 781599 795471 804043 806709 803797 795438 781623 763568 743960 725315 708628
59429 708628 693764 680357 667962 656071 644596 634039 625027 618002 613386 611488 612103 614664 618910
59416 618910 625097 633614 644858 659291 677028 697439 719689 743495 768977 796225 825569 857196
59404 857196 888867 914381 926412 921858 903851 878693 851995 827560 807745 793588 785395 783779
59392 783779 788927 797934 804090 800377 783896 756804 723955 690332 659639 633643 612357 595064
59380 595064 581045 569410 559120 549793 541982 536200 532149 529252 527270 525921 524681 523588 523574 525292
59366 525292 528130 531008 533626 536225 538668 540552 541881 542862 543302 542986 542443 542706 544398 547603 552399
59351 552399 558834 566421 574302 582078 590133 599120 609427 621210 634696 650308 668428 688929 710943
59338 710943 733292 755153 776192 796282 815540 834422 853064 870451 884799 894901 900634 902271
59326 902271 900054 894567 886644 876579 864108 849494 833904 818380 803161 788350 774409 761483
59314 761483 749029 736794 725510 715982 708040 701100 695166 690525 686925 683858 681357 679738 678765 677794
59300 677794 676664 675856 675758 676248 676924 677413 677562 677740 678844 681753 686876 694363 704470 717453 733421
59285 733421 752606 775546 802697 833753 866981 898558 922733 933994 930233 913979 890472 864775
59273 864775 840443 819578 803107 791239 784225 782447 785559 792185 801032 811903 825080 840174
59261 840174 856099 871769 886179 898120 906488 910870 911444 908485 902241 893013 880977 866197 849167
59248 849167 831097 813321 796543 780796 765843 751469 737811 725552 715381 707136 700022 693805
59236 693805 689148 686498 685401 685217 685834 687251 689185 691673 695397 700748 707052 713213 718597 722826 725406
59221 725406 726187 725635 723924 720299 714046 705616 695984 685373 673459 660647 648277 637487 628413
59208 628413 620455 612931 605536 598488 592205 586756 581936 577849 574874 572876 571108 569147 567336 566082
59194 566082 565391 565346 566190 567636 568973 570237 572307 575362 578357 580683 583196 586765 590924 595060 599834
59179 599834 606066 613063 619488 625294 631390 637824 643747 648920 653969 659243 664599 670186 676386 683112
59165 683112 690193 698189 707691 718047 728046 737818 748768 761507 774943 787676 799276 809898
59153 809898 819525 827916 834699 839305 841289 840665 837485 831428 822548 812130 801817 792009 781940 771194
59139 771194 760178 749199 738157 727324 717563 709565 703436 698940 695510 692297 689107 687047 687198
59126 687198 688823 690103 690615 691814 694863 699269 704174 709871 717377 727260 739450 753577 768989 785017
59112 785017 801608 819210 837730 856195 873702 890130 905550 919496 931254 940578 947887 954064
59100 954064 960115 966577 973015 978402 982009 983647 983219 980664 976332 970886 964743 958008 950902 943745
59086 943745 936658 929832 923911 919333 915327 910284 903223 894219 883471 870814 856394 841049 825651
59073 825651 810488 795431 780217 764586 748745 733798 721036 710656 701680 693249 685380 678367
59061 678367 672130 666400 661061 656086 651621 648206 646338 645638 644961 643579 641842 640485 639633 638669 636819
59046 636819 633811 630159 626703 623744 620907 618130 616218 615851 616545 617397 618495 620604 623697 626810 629361
59031 629361 631724 634465 637899 642403 648226 654808 661152 667068 673350 680629 688860 698035 708508 720357
59017 720357 733228 747092 762337 778725 794878 809150 820558 828772 833879 836413 837050 836083 833662
59004 833662 830456 827391 824737 822275 820447 820407 822709 826779 831992 838437 846238 854880 863660 872154 879903
58989 879903 886297 891219 895199 898457 900300 899911 897268 892823 886595 878110 867141 854271 840780 827930
58975 827930 816218 805373 795277 786548 779925 775502 773159 773292 776278 781480 787741 794777 803268 813654
58961 813654 825738 839354 854356 869865 884565 897914 910159 921060 929584 935022 937406 936504
58949 936504 931476 921957 908673 892663 874684 855652 836732 818569 801120 784558 769557 756470
58937 756470 745130 735702 728830 724526 721831 719946 718757 717859 716108 712781 708368 703646 698781 693956
58923 693956 689978 687392 685571 683467 680849 678191 675764 673471 671308 669479 668256 667937 668701 670379 672703
58908 672703 675718 679443 683277 686604 689982 694833 701731 709950 718871 728887 740565 753905 768859
58895 768859 785640 803959 822771 841241 859205 876369 892077 906530 921361 938280 957808
58884 957808 979829 1004520 1031985 1061588 1092304 1123188 1152971 1179884 1202487 1220199 1232637
58873 1232637 1239177 1239722 1235138 1226272 1213091 1195351 1173523 1148530 1121202 1092609 1064319 1037734
58861 1037734 1013547 992145 973764 957781 942649 927283 911917 897039 882127 866197 849012
58850 849012 831061 812772 794485 776786 760242 745006 731114 718832 708365 699618 692551 687255
58838 687255 683289 679469 674813 669371 663866 658923 654837 651575 648717 645769 642608 639199 635081 629932
58824 629932 624600 620595 618394 617123 615942 614735 613458 612044 611246 612207 614787 617487 619551 621920 625558
58809 625558 630080 634658 639123 643461 647360 650973 655020 659453 663180 665765 668089 670526 671852 671029
58795 671029 668850 666645 664481 661807 658848 656027 652971 649386 646220 644717 644934 646176 648166 650772
58781 650772 653488 656428 661052 668618 678484 689018 699507 710010 720035 728678 735630 740832 743566
58768 743566 742955 739029 732444 723733 713794 704360 696764 690661 684952 679476 674776 670805 667085 663745
58754 663745 661357 660057 659675 660282 661788 663609 665566 668424 672641 677388 681868 686746 693021 700279 707423
58739 707423 714596 722926 732741 743337 754247 765496 776856 787930 798746 809375 819328 828241
58727 828241 836670 845252 853647 861300 868614 876247 883881 890895 897665 904891 912152 918484 924097 930255
58713 930255 937731 946470 956369 967206 978160 988531 998605 1008724 1017971 1024891 1028986 1030295 1028133
58700 1028133 1021667 1011397 998583 983437 965171 943638 919638 893806 866509 838839 812495
58689 812495 788583 767304 748594 732253 717768 704910 694083 685338 677673 670301 663838 659069
58677 659069 655208 650652 644835 638174 630944 623587 617447 613706 612101 611990 613940 618770 625829 633978
58663 633978 643580 655640 669475 683223 696307 709371 721936 732126 738802 742180 742343 739001 732926
58650 732926 725947 719261 713171 708439 706121 705826 705704 704488 702286 699386 695782 691991 688730 685636 681722
58635 681722 677265 673722 671590 669882 668059 667053 667962 670884 675305 680485 685240 688426 689904 690230 689603
58620 689603 688096 686491 685564 684856 683599 682575 683548 687062 692351 699264 708598 720501 734063 748468
58606 748468 763084 776507 787132 794700 799905 802646 802309 799566 796101 792509 788141 782989 777922 772999
58592 772999 767383 761179 755652 751392 747892 745152 744095 745181 748078 752808 759679 768094 777025 786652
58578 786652 797938 810706 823833 837077 850720 863597 873640 880539 885772 890001 892730 894695
58566 894695 898157 904281 912456 922693 936360 953799 973413 993980 1015888 1039257 1062863 1085805
58554 1085805 1108355 1130191 1149515 1164813 1175879 1182460 1183702 1179802 1172476 1162943 1151003 1136802
58542 1136802 1121855 1107463 1093611 1080060 1066943 1053704 1039139 1023213 1007310 992138 976911
58531 976911 961094 945269 929866 914817 900902 889621 881221 874631 869597 866838 865742 864349 862315
58518 862315 861622 863445 866449 869121 871670 874651 877677 880469 883292 885599 886281 885960 886873 889685 892707
58503 892707 895100 898279 902979 907483 910282 912222 914453 916335 916982 916906 916608 915359 912800 909999 907582
58488 907582 904667 900898 897642 895879 894858 894056 894390 896179 898127 899869 903289 909617 917312 924656 932427
58473 932427 942100 953183 964315 975338 986325 995991 1002899 1007003 1008563 1007045 1002504 996519 990354
58460 990354 983765 976868 971328 968157 966163 964089 962529 962301 962840 963861 966703 972266 979369 986770 995009
58445 995009 1004489 1013527 1020082 1023927 1025589 1024894 1022086 1018658 1015524 1012095 1008466 1006482 1007208 1009515 1012596
58430 1012596 1017458 1024235 1030656 1035258 1039751 1046048 1053338 1060356 1068140 1077972 1088753 1099036 1109739
58417 1109739 1122239 1135561 1147905 1159241 1170023 1179176 1185719 1190654 1195025 1198006 1199056 1199752 1200976
58404 1200976 1200476 1195963 1188676 1181270 1174254 1167240 1161558 1158527 1156958 1155419 1155242 1158246 1163237 1167850
58390 1167850 1172229 1177828 1184089 1189458 1194214 1199284 1203645 1205942 1207249 1209342 1211674 1213016 1214504 1217935
58376 1217935 1222524 1226489 1230410 1235894 1242298 1248057 1253947 1261784 1271042 1279927 1288715 1298956 1310439
58363 1310439 1321878 1333504 1346224 1359462 1372600 1387053 1404085 1422147 1439268 1456356 1475051
58352 1475051 1494129 1511289 1526763 1541828 1555486 1566121 1574783 1583332 1591023 1596528 1601662 1609384
58340 1609384 1619650 1630833 1643503 1659002 1676040 1692692 1710159 1730536 1752460 1773118 1793024
58329 1793024 1814544 1837149 1858430 1878482 1899037 1919573 1938585 1957377 1978203 1999898 2019611
58318 2019611 2037575 2055867 2073929 2089884 2104907 2121693 2139841 2157272 2174766 2194350 2214681
58307 2214681 2232944 2250115 2269439 2291055 2313022 2336201 2362907 2391982 2420445 2448795 2479519
58296 2479519 2511807 2543104 2574414 2608328 2643201 2675196 2704915 2736080 2768917 2800966 2833232
58285 2833232 2869090 2908024 2946828 2986080 3028946 3074528 3119205 3163895 3213069 3267042 3322095
58274 3322095 3377745 3436948 3499393 3561641 3623780 3689102 3757480 3825959 3895414 3969482 4047445
58263 4047445 4125541 4204715 4289410 4379225 4469816 4561584 4659125 4762315 4866478 4971333 5081094
58252 5081094 5195693 5310872 5427094 5549174 5676762 5804714 5933468 6069468 6214491
58243 6214491 6364315 6518788 6683204 6858587 7040675 7229759 7431451 7646661 7871157
58234 7871157 8106082 8358087 8628006 8910532 9206227 9522214 9859865 10213985 10585512
58225 10585512 10982420 11406703 11853825 12326594 12835646 13384443 13968480 14591405 15266592
58216 15266592 16000642 16791756 17647105 18584437 19613469 20734084 21956730 23305456 24797115
58207 24797115 26438863 28251711 30275428 32545949 35093048 37968115 41250696 45023541
58199 45023541 49373172 54427846 60369118 67402306 75755408 85720674 97658609 111953382
58191 111953382 129021481 149377808 173592739 202070134 234810412 271239894 309889022
58184 309889022 347844615 380542174 402665964 410068349 401521885 379090393 347020134
58177 347020134 310088396 272375749 236761475 204921097 177553262 154704740 136107976
58170 136107976 121416410 110276325 102315240 97167182 94495227 93841195 94323325 94542852
58162 94542852 93011076 88865771 82254247 74069134 65362033 56944497 49311756 42695882
58154 42695882 37117353 32464302 28596041 25390900 22729457 20491048 18584967 16957980
58146 16957980 15564635 14355669 13298699 12381735 11587119 10882958 10245538 9668876 9145757
58137 9145757 8658572 8195262 7757000 7344194 6950743 6577039 6233063 5922957 5639953
58128 5639953 5380444 5149159 4946350 4763546 4596265 4447638 4314816 4184542 4047534
58119 4047534 3906356 3765207 3623357 3482854 3351181 3230951 3116637 3005600 2902614
58110 2902614 2809634 2721135 2634017 2552675 2479844 2411366 2344438 2282422 2227122 2174443 2121933
58099 2121933 2072788 2028388 1984581 1939343 1896611 1858598 1821676 1783780 1748597 1718361 1689476
58088 1689476 1659394 1631148 1606988 1583853 1559163 1535065 1513104 1490608 1466111 1442668 1422245
58077 1422245 1402357 1381512 1362181 1345103 1326506 1304563 1282840 1263793 1244557 1222992 1202213
58066 1202213 1185003 1168967 1151525 1134803 1121319 1109327 1096638 1084899 1075968 1067885 1058256 1048046
58054 1048046 1038599 1028523 1016852 1005698 996476 987079 975877 964965 956351 948510 939792 931720 925829
58041 925829 920600 914538 909029 905266 901555 896476 891520 887947 884271 879396 874870 871391 866497 858417
58027 858417 848934 839795 829765 817977 806774 798273 791272 784305 778518 774668 770590 764660 758784
58014 758784 754974 751943 747951 744066 741626 739336 735886 732739 731467 730934 729861 729435 730640 731788 731542
57999 731542 731639 733770 736494 738154 740100 743965 748333 751242 753561 756938 760818 764482 769567 777358 785755
57984 785755 792007 796367 800230 802917 803450 803342 804460 805908 805970 805304 805349 805416 804205 802390 801026 799265
57968 799265 796334 793690 792455 790816 786885 782123 778919 776804 774171 771718 770839 770380 768385 765573 763749
57953 763749 762220 759085 754843 751458 749006 746434 744493 744652 745995 746342 745737 745899 747050 748198 749828
57938 749828 753373 758524 763732 768962 775440 783244 791431 799951 809203 818420 826662 834576 843154 851705
57924 851705 859149 866073 873318 879850 884377 887770 891412 894497 895526 895044 894086 891384 885242 876974 869188
57909 869188 861610 852010 840485 829391 819432 809317 799074 790319 783065 775505 767272 759994 754217
57896 754217 748638 742890 738423 735910 734166 732332 731037 730730 730803 730913 731474 732480 733445 734782 737665 742339
57880 742339 748018 754362 761553 769070 776038 782622 789518 796323 802088 807117 812445 817804 821891 824383
57866 824383 825961 826709 826356 825764 826182 827257 827714 827765 828871 831284 833857 836232 839225 842974 846663 850253
57850 850253 854742 860567 867286 874794 883264 892033 900171 907996 916393 924934 932343 938499 944195 949299
57836 949299 953143 956358 960178 964088 966285 966456 965950 965186 963093 959350 955086 951033 946940 943158 940882
57821 940882 940387 940700 941342 942684 944455 945793 947128 950168 955529 962034 968695 975685 983014 990051 996869
57806 996869 1004377 1012489 1019685 1024990 1029015 1032485 1035060 1036079 1035319 1032603 1027815 1021605 1015114 1008928
57792 1008928 1003220 998559 995279 992414 988871 985338 983326 982603 981577 980128 979876 981409 983415 985040
57778 985040 987125 990474 994684 999357 1004796 1010872 1016803 1022672 1029615 1037901 1046363 1054323 1062557 1071734
57764 1071734 1081407 1091157 1101260 1111501 1120741 1128387 1135022 1140911 1145159 1147025 1146995 1145938 1144234 1142143
57750 1142143 1139923 1137273 1133835 1130494 1128928 1129584 1131441 1133929 1137498 1141982 1146125 1149402 1152811 1157182
57736 1157182 1162045 1166748 1171345 1175704 1179079 1181238 1182886 1184510 1186079 1188203 1192103 1197853 1204131 1210251
57722 1210251 1216971 1224696 1232501 1239806 1247482 1256319 1265667 1274543 1282897 1290879 1298034 1304105 1309639 1314994
57708 1314994 1319782 1323986 1328487 1333756 1339120 1344044 1349057 1354731 1360886 1367483 1375150 1384035 1393250 1402164
57694 1402164 1411204 1420779 1430721 1441432 1454080 1468582 1482642 1493934 1502237 1508509 1513032 1515683 1517070
57681 1517070 1518140 1519313 1521051 1524595 1531126 1540715 1552937 1567958 1586344 1608454 1634816 1666608
57669 1666608 1705195 1751687 1807287 1873379 1950907 2040180 2140675 2248733 2354254 2441309 2494282
57658 2494282 2504650 2473310 2408824 2324250 2233205 2145835 2067353 1999890 1944519 1901106 1867912
57647 1867912 1842827 1824497 1811710 1802841 1796833 1793767 1793591 1795242 1797815 1801487 1806368 1811576 1816486
57634 1816486 1821860 1828542 1835994 1843284 1850642 1858791 1867537 1876268 1885166 1894654 1904188 1912767 1920255 1927197
57620 1927197 1933847 1940355 1947384 1955501 1964339 1973180 1981932 1990804 1999601 2008197 2017095 2026644 2036323 2045613
57606 2045613 2054958 2064957 2075259 2085224 2095091 2105488 2116285 2126840 2136965 2146795 2156217 2165271 2174657
57593 2174657 2184952 2195735 2206220 2216290 2226210 2235869 2245127 2254413 2264218 2274434 2284847 2295725
57581 2295725 2307203 2318667 2329521 2340053 2350929 2362344 2374232 2386636 2399263 2411354 2422617
57570 2422617 2433582 2444597 2455406 2466252 2478235 2491742 2505623 2518816 2531642 2544582 2557006
57559 2557006 2568418 2579803 2592318 2605526 2618402 2631245 2645167 2660367 2676329 2693006 2710324
57548 2710324 2727240 2742870 2758052 2774104 2790495 2805458 2818647 2831511 2845067 2858885 2872413
57537 2872413 2885912 2899788 2914117 2928991 2944496 2960367 2976440 2993205 3010987 3028963 3046037
57526 3046037 3062397 3079159 3096761 3114836 3133283 3152237 3171206 3189518 3207506 3226148 3245652
57515 3245652 3265431 3285201 3304975 3324298 3342838 3361527 3381777 3403570 3425612 3447263 3468991
57504 3468991 3490897 3512243 3532748 3553164 3574230 3595987 3618255 3640823 3663076 3684443 3705314
57493 3705314 3726571 3748244 3769625 3790666 3812104 3834115 3856029 3877603 3899422 3921745 3943956
57482 3943956 3965484 3986429 4007012 4027273 4047516 4068203 4089249 4110186 4131197 4153094 4176141
57471 4176141 4199646 4222855 4245462 4267201 4287859 4307892 4328222 4349278 4370930 4393296 4416703
57460 4416703 4440854 4464946 4488766 4512787 4537183 4561699 4586530 4612299 4638933 4665582 4691932
57449 4691932 4718681 4746369 4774596 4802789 4830997 4859529 4888419 4917450 4946254 4974353 5001712
57438 5001712 5029145 5057401 5085985 5113876 5141321 5169735 5199603 5229687 5258788 5287270 5316232
57427 5316232 5345991 5376077 5406162 5436347 5466862 5497848 5529218 5560558 5591522 5622383 5653805
57416 5653805 5686045 5718783 5751656 5784455 5816967 5849179 5881494 5914199 5946905 5979157 6011380
57405 6011380 6044440 6078517 6113155 6148167 6183573 6218907 6253575 6287764 6321984 6355881 6388626
57394 6388626 6420437 6452606 6485998 6520571 6556314 6593380 6631137 6668333 6704546 6740478 6776629
57383 6776629 6812740 6848761 6885255 6922532 6960277 6998217 7036153 7073303 7108794 7142962 7176937
57372 7176937 7210823 7243653 7275384 7307376 7340385 7373522 7405941 7438142 7470765 7503405 7535646
57361 7535646 7568226 7602088 7637099 7672588 7708384 7744439 7780270 7815666 7851269 7887629 7924373
57350 7924373 7961081 7998207 8036199 8074400 8111866 8148804 8186204 8224377 8262750 8300893 8338846
57339 8338846 8376585 8413847 8450510 8486616 8522070 8556732 8590799 8624836 8659455 8694920 8730852
57328 8730852 8766409 8801207 8835880 8871140 8906472 8940635 8973477 9006180 9039547 9073067 9106101
57317 9106101 9138864 9171615 9203782 9234664 9264362 9293410 9322083 9350628 9379565 9409160 9439052
57306 9439052 9468805 9498324 9527465 9555924 9583826 9611733 9639698 9667063 9693550 9719757 9746119
57295 9746119 9772208 9797532 9822310 9846947 9871510 9896161 9921263 9946550 9970986 9993990 10016055
57284 10016055 10037753 10059037 10079978 10101172 10122760 10144049 10164764 10185680 10207242 10228603 10248862
57273 10248862 10268272 10287266 10305259 10321499 10336287 10350239 10363129 10374528 10384872 10394790 10404033
57262 10404033 10412215 10419889 10427642 10434701 10439800 10443082 10445908 10449098 10452538 10456206 10460358 10464827 10469331 10474401
57248 10474401 10480906 10488637 10496287 10502849 10508277 10512941 10517303 10521977 10527189 10532251 10536338 10539640 10542889 10545961
57234 10545961 10547949 10548539 10548280 10547394 10545226 10541157 10535338 10528254 10520087 10510651 10499586 10486577 10471761 10455816
57220 10455816 10439305 10422114 10403846 10384484 10364215 10343050 10321142 10299070 10277180 10255012 10231955
57209 10231955 10207987 10183041 10156186 10126442 10094223 10061018 10027758 9994265 9960184 9925622 9890837
57198 9890837 9856077 9821771 9788329 9755732 9723786 9692612 9662438 9633119 9604400 9576332 9548925
57187 9548925 9521706 9494248 9466774 9439620 9412551 9385295 9358288 9332069 9306363 9280656 9255252
57176 9255252 9230747 9206776 9182373 9157468 9132919 9109075 9085262 9060734 9035164 9008126 8979012
57165 8979012 8947665 8914278 8878505 8839398 8796436 8749945 8700257 8646972 8589212 8526296 8458260
57154 8458260 8386143 8311607 8235798 8158757 8080388 8001639 7924145 7849067 7777002 7708619 7644542
57143 7644542 7584830 7529364 7478510 7432519 7390575 7351360 7314340 7279475 7245787 7211350 7174709
57132 7174709 7135358 7092794 7046231 6995591 6941948 6886663 6830739 6775282 6722049 6673136 6630252
57121 6630252 6594023 6563640 6537533 6514865 6495949 6480671 6467283 6453894 6440887 6431009 6427593 6433685
57109 6433685 6452244 6485503 6534056 6597821 6678068 6777661 6899876 7048713 7230619 7454558
57099 7454558 7730148 8066890 8475542 8969241 9563207 10274330 11120704 12119521 13283863
57090 13283863 14620768 16130542 17805405 19628096 21572594 23605571 25685733 27762999
57082 27762999 29781113 31680318 33393860 34843312 35946848 36642080 36903911 36739285
57074 36739285 36166074 35199743 33858833 32178443 30216384 28048485 25758635 23428812
57066 23428812 21131285 18924035 16849386 14934589 13193450 11629036 10236986 9008225
57058 9008225 7930588 6989940 6171278 5459699 4841233 4303470 3835648 3428239 3072743
57049 3072743 2761918 2489731 2250796 2040157 1853751 1688589 1542203 1412268 1296875
57040 1296875 1194500 1103337 1021221 946636 879297 819239 765812 717994 675203 637160 603249
57029 603249 572625 544821 519833 497814 479093 464303 454054 448533 447734 452107 462774 481187
57017 481187 508744 546979 598360 666824 756925 871941 1012686 1176764 1355528 1528995
57007 1528995 1665749 1733846 1717069 1622742 1474991 1301485 1124703 959782 814868 692153
56997 692153 590396 507509 441053 387680 344066 308521 280700 259808 244186 232661 225179
56986 225179 221799 221779 223981 227613 232220 237119 241009 242099 238876 230950 219013 203975 186586 167985
56972 167985 149895 133752 120009 108568 99270 91666 85105 79729 76778 77251 80786 86513 94374
56959 94374 104800 117654 132437 149047 167212 185243 200269 209844 212785 208815 198370 182949
56947 182949 164982 146979 130830 117485 106743 97647 89743 83918 81506 82773 86841 92924 101022
56934 101022 111569 125019 141826 162280 186144 212413 239008 262403 278258 283417 277522 262556
56922 262556 241232 216159 189868 164514 141366 121023 103927 90211 79279 70182 62345 55566
56910 55566 49639 44546 40709 38391 37006 35585 33739 31680 29650 28001 27497 28689 31133 33935 36882
56895 36882 40295 44027 47644 51640 57471 66040 76894 89221 102976 118574 135987 154531 173112
56882 173112 190205 203831 212101 214034 209938 201157 189528 176939 165133 155527 148786 144623 142397
56869 142397 142076 144319 149657 158237 170551 187686 210335 238037 269926 305755 345547 388375
56857 388375 431734 471687 503339 522012 525103 513142 489128 457267 422366 389084 360468 337259
56845 337259 319102 306062 298538 296558 300138 309894 326463 349765 379680 417015 462818 517070
56833 517070 578811 646765 718107 786446 842297 876484 883434 862527 818052 757977 691153 624421
56821 624421 561902 506164 458830 420184 389471 366051 349778 340430 337768 342193 354457 374663
56809 374663 402345 437484 480240 529283 580991 630302 671462 698196 704973 689542 654272 604842
56797 604842 547971 489902 435440 387175 345670 310633 281725 258541 240677 228108 220942 218818
56785 218818 221198 228241 240506 257722 278724 302665 329038 355951 379261 394223 397735 389009
56773 389009 369206 341159 308644 274856 241530 209699 180679 155690 134858 117178 101478
56762 101478 87281 75008 65520 59176 55161 52001 48779 45482 42246 38814 34970 30996 27447 24731
56748 24731 22981 22033 21462 20984 20706 20685 20455 19544 18263 17326 16789 16067 14991 14114 13896 14225 14798 15368
56730 15368 15617 15389 15003 14762 14343 13375 12370 12188 12779 13466 14272 15795 17768 19057 19315 19468 20230 21307
56712 21307 22358 23569 24823 25508 25733 26598 28528 30337 30726 29888 28935 28518 28694 29374 30077 29893 28414
56695 28414 26292 24391 22920 21765 21005 20650 20516 20688 21376 22032 21523 19642 17515 15995 14670 13082
56679 13082 11833 11641 12163 12659 13067 13662 14437 15584 17767 21053 24368 26853 28915 31077 32760 33358
56663 33358 33637 34742 36426 37598 38117 38734 39585 40093 40185 40376 40687 40619 40209 40166 40908 42299 44245 46653
56645 46653 48866 50017 50030 49617 49338 49305 49685 50722 52314 54166 56259 58615 60916 63034 65621 69326
56629 69326 73643 77391 80189 82665 85294 87917 90384 92885 95566 98392 101349 104249 106528 107895
56615 107895 108972 110528 112237 113014 112491 111342 110222 109230 108450 108191 108468 108886 109156 109270 109246 109290 110005 111682
56597 111682 113448 113919 112736 110768 108884 107350 106399 106358 106916 107144 106634 105980 105814 106011 106145 106072 105666 104599
56579 104599 102903 101313 100572 100713 101394 102575 104387 106528 108299 109279 109745 110394 111780 113954 116559 119235
56563 119235 121945 124962 128675 133519 139860 147732 156796 166729 177531 189227 201306 212632 221814
56550 221814 227682 229766 228684 225922 222943 220454 218516 217064 216079 215462 214976 214257 212897 210743 208125
56535 208125 205490 202790 199685 196234 192785 189155 184705 179481 174491 170424 166894 163409 160325 158176
56521 158176 156738 155523 154625 154292 154105 153342 151821 149765 147256 144509 142192 140741 139769 138779 137953 137466
56505 137466 136647 134921 133134 132705 133577 134168 133446 132091 131340 131541 132159 132592 132626 132341 131819 130918 129482 127901
56487 127901 126997 127097 127655 128104 128457 128656 128184 127064 126493 127464 129290 130489 130722 130854 131490 132524 133906
56470 133906 135698 137486 138726 139640 140871 142345 143441 144194 145391 147380 149629 151506 152755 153219 152875
56455 152875 152178 151762 151835 152399 153764 156097 158735 160739 161986 163067 164376 165977 167962 170147 171802
56440 171802 172486 172686 172829 172379 170954 169621 169636 170423 170361 169286 168545 168675 168702 167864 166540 165201 163844 162763
56422 162763 162532 162855 162643 161502 160054 158631 156909 155060 153953 153858 154174 154729 156066 158113 159906 161132
56406 161132 162669 165061 167688 169965 172192 174544 176368 177183 177435 177612 177542 177177 177146 177852 178861 179751 180766
56389 180766 182090 183284 184063 184886 186197 187733 188989 189740 189767 188892 187679 187339 188475 190519 192688 194778
56373 194778 196848 198948 201417 204632 208216 211322 213824 216338 218905 220699 221284 221178 220938 220698 220765 221575
56357 221575 222856 223878 224668 225773 226760 226434 224842 223527 223349 223551 223499 223698 224393 224773 224551 224887 226672
56340 226672 229156 231296 233236 235430 237509 239216 241362 244591 248096 250827 253238 256616 261204 266032
56326 266032 270116 273025 274845 276394 278951 283007 287697 291884 295180 297595 299170 300414 302122 304181
56312 304181 305562 305933 306119 306445 305997 304374 302783 302392 302733 302821 302696 302759 302678 302217 302257 303785 306589 309923
56294 309923 313614 317523 320883 323239 325254 327537 329578 330879 332219 334687 338213 342074 345992 349739
56280 349739 352617 354526 356642 359887 363489 366224 368267 370716 374147 378698 384628 391533 397904 402801
56266 402801 407294 413057 420364 428639 438015 448792 460111 470728 480716 491147 502557 514916 528534
56253 528534 543787 560452 578417 598510 621600 647479 675688 706740 741493 780003 822024
56242 822024 867777 917200 969369 1023739 1080858 1140568 1200622 1258559 1313893 1366852 1415979
56231 1415979 1458786 1494017 1521448 1540120 1548601 1546653 1535038 1514165 1484524 1447927 1406646 1361665
56219 1361665 1313208 1262543 1211673 1161619 1112496 1064947 1020019 977991 938642 902288 869295
56208 869295 839137 811252 786117 764109 744069 724663 706488 691122 678662 667830 658001 649454
56196 649454 642127 635683 630303 625934 621474 616314 611793 609315 607881 605572 602726 601368 602036 603395
56182 603395 604722 606512 608733 610621 612219 614272 616738 619193 622292 626865 631886 635521 637988 641203
56168 641203 645805 650735 655643 661340 667671 673252 677719 682245 687521 693088 698860 705446 712794 720366
56154 720366 728745 739126 751115 763017 774458 786740 800400 814479 828505 843201 858812 874679
56142 874679 890957 909010 929692 952901 979106 1009542 1044441 1082748 1124036 1169413 1220547
56131 1220547 1279402 1348909 1432062 1529890 1641388 1764892 1897496 2033219 2163879 2282386
56121 2282386 2384321 2467428 2532291 2583611 2628318 2671246 2713223 2752417 2785393 2807422 2814770
56110 2814770 2807742 2790396 2767479 2742768 2718712 2694390 2663780 2618790 2554736 2471756 2372336
56099 2372336 2260578 2143360 2028534 1921031 1822739 1735732 1662698 1604128 1558027 1522723
56089 1522723 1497338 1479640 1466528 1457044 1452161 1451450 1452858 1455834 1461539 1469672 1478256 1486927 1497271
56076 1497271 1509497 1521973 1534527 1548925 1565471 1582328 1598788 1616044 1634143 1651499 1668098
56065 1668098 1685860 1705103 1723993 1742259 1762101 1784640 1808794 1834392 1862881 1894088 1925756
56054 1925756 1957127 1989526 2022755 2054606 2084788 2115484 2147125 2177519 2206126 2235157 2265386
56043 2265386 2295020 2323932 2354824 2388770 2423754 2459026 2496780 2538076 2581335 2626310 2675182
56032 2675182 2728146 2782354 2836842 2894114 2955174 3017628 3080452 3145943 3215035 3285392 3356073
56021 3356073 3429245 3505378 3581754 3657863 3737188 3821485 3908472 3997418 4091484 4192112 4296605
56010 4296605 4403895 4517166 4638121 4764351 4895005 5033068 5179271 5329956 5483987
56001 5483987 5645360 5815901 5992214 6173310 6364239 6568259 6782430 7004961 7239719
55992 7239719 7489193 7750453 8022727 8311618 8621169 8949311 9295691 9665807 10062528
55983 10062528 10482187 10924458 11397288 11906695 12451332 13033062 13662656 14348488 15090268
55974 15090268 15891154 16764968 17723985 18771602 19915509 21175699 22570885 24111087
55966 24111087 25814037 27715204 29852050 32255561 34970677 38069770 41635815 45755297
55958 45755297 50546678 56179065 62851810 70785773 80256619 91608796 105219430 121494717
55950 121494717 140931028 164101254 191464516 223127422 258667879 296833078 334973114
55943 334973114 368705123 392650772 402324431 396027248 375404520 344445097 307852387
55936 307852387 269781149 233247410 200036081 170903942 145928473 124830256 107163645
55929 107163645 92418270 80103585 69802728 61166980 53892804 47727595 42479534
55922 42479534 37997556 34147520 30817085 27926119 25412801 23216277 21283108 19578208
55914 19578208 18074878 16741564 15548733 14479366 13521160 12655948 11866699 11147092 10493998
55905 10493998 9897194 9345607 8836790 8370960 7941637 7540844 7167761 6823731 6503932
55896 6503932 6202116 5918737 5656595 5412844 5182660 4966703 4767828 4584278 4412802
55887 4412802 4254853 4113206 3985792 3868984 3763905 3673812 3598390 3536132 3489299 3461265
55877 3461265 3451755 3459495 3486370 3533751 3597160 3668603 3740860 3805177 3848737 3860283 3836358 3778138
55865 3778138 3685413 3558437 3402771 3227347 3039969 2848710 2664286 2495461 2343738 2206796
55855 2206796 2084895 1979634 1889054 1809060 1738167 1676542 1622038 1571466 1524333 1481335 1440753
55844 1440753 1400221 1360502 1323648 1288954 1254506 1221161 1191080 1163738 1137123 1111539 1088488
55833 1088488 1067124 1045596 1024764 1006832 991267 975739 960170 946269 933780 920722 906763
55822 906763 893096 879469 864452 848202 832169 816568 800812 785717 772530 760524 748313
55811 748313 736802 728088 722006 716435 710503 704991 700186 695850 692806 692158 693401 695323 698003 701889
55797 701889 705929 708900 711573 715229 719081 721595 723340 725998 729493 732668 735795 739670 742915 743027
55783 743027 739726 734862 729532 723708 718014 713138 707623 698595 684562 665793 642796 616685 590382
55770 590382 566896 546691 528649 512897 500479 491156 484088 479958 479700 481558 482209 480715 478869
55757 478869 477754 476508 474455 471948 468780 464014 457764 451223 444690 437290 428746 419782 410764 401549
55743 401549 392470 383931 375335 366085 357198 350181 344764 339537 334348 330174 327133 324578 322733 322164
55729 322164 322013 320784 318523 316259 313772 310056 305563 301672 298215 293829 288497 283442 278693 273261
55715 273261 267695 263892 262091 260469 258162 256388 256039 256242 256070 255864 256343 257932 261169 265978 270368
55700 270368 271691 269572 265895 261832 256825 250731 244794 239795 235085 230164 225653 222079 219090 216405
55686 216405 214259 212614 211206 210438 210818 211516 211066 209537 208367 208091 208029 208200 209433 211229 211534 209229
55670 209229 205157 200365 195139 190169 186668 184661 182843 180704 179104 178267 177157 175565 174949 176211 178290
55655 178290 179905 181266 183114 185429 187957 190835 193974 196958 200047 203976 208375 211903 214519 217928
55641 217928 223018 228380 232195 234097 234347 232777 229645 226186 223115 219610 214705 208684 202283 195684
55627 195684 189159 183586 179379 175877 172604 170130 168937 168481 168172 168224 168780 169225 169223 169368 169945 170073 168948
55610 168948 166984 164849 162357 159229 156046 153439 151078 148339 145320 142476 139973 138047 137210 137336 137416
55595 137416 136922 136619 137295 138516 139398 139782 139844 139409 138587 138355 139509 141478 143007 143610 143735 143985 144780 146315
55577 146315 148307 150209 152048 154478 157714 161206 164797 169370 175797 184026 193672 204645 216599 228537
55563 228537 239606 249510 257590 262398 263078 260543 256480 251557 245227 236812 226250 214167 201671
55550 201671 189730 178572 168099 158798 151385 145614 140501 135927 132838 131522 130915 130031 128845 127264
55536 127264 124627 121008 117788 115995 115149 114534 114447 115169 115826 115432 114253 113103 112073 110969 110133 109774
55520 109774 109259 108059 106708 105849 105086 103848 102598 102025 101791 101203 100492 100173 99781 98574 97072 96557 97309
55503 97309 98446 99267 99613 99212 97865 96223 95283 95104 94873 94200 93492 93150 93219 93682 94391 94847 94834 95024 96150
55484 96150 97826 99027 99523 99947 100596 101169 101684 102657 104189 105656 106542 106933 107010 106679 105959 105269 105020 105151
55466 105151 105172 104600 103428 102304 102017 102612 103264 103193 102390 101219 99810 98238 96920 96326 96497 97146 97964
55449 97964 98600 98688 98219 97511 96697 95701 94890 95030 96258 97737 98700 99163 99262 98732 97638 96851 97030 97685 97874
55430 97874 97300 96152 94555 92890 91986 92199 92822 93114 93313 93877 94416 94301 93801 93643 93909 94318 95167 96949
55412 96949 99314 101321 102557 103224 103483 103529 103935 105013 106073 106195 105442 104438 103080 100771 97824 95584
55396 95584 95018 95918 97469 98894 99598 99399 98688 97828 96592 94734 92831 91792 91755 92133 92464 92500 91825 90304
55378 90304 88744 88121 88253 88109 87407 86941 87297 88181 89174 90363 91869 93364 94331 94496 93891 92871 92027
55361 92027 91726 91802 91902 91906 91661 90818 89398 88134 87664 87816 88214 89019 90302 91318 91372 90996 91230 92075 92727
55342 92727 93044 93608 94406 94640 93926 92718 91449 90207 89353 89440 90316 91149 91488 91552 91427 90913 90299 90350 91147
55323 91147 91693 91093 89602 88284 88087 89295 91349 93098 93699 93277 92452 91575 90991 91433 93157 95052 95722
55306 95722 95266 94837 94668 93965 92787 92462 93661 95377 96457 96911 97055 96468 94791 92749 91502 91421 92141
55289 92141 93234 94199 94373 93534 92228 91008 89834 88678 88140 88751 90119 91360 92075 92329 92085 91402 90950
55272 90950 91569 93238 95019 96161 96839 97653 98696 99399 99299 98743 98651 99542 101012 102299 103070 103437 103499 103317
55254 103317 103113 103024 102762 102004 100996 100272 99906 99558 99166 98961 98883 98567 97960 97314 96611 95605 94491 93796
55236 93796 93543 93192 92587 92286 92714 93605 94534 95437 96328 97026 97473 97857 98156 97926 96800 94929 92887 91416
55218 91416 91186 92260 93809 94867 95385 95991 96820 97319 97249 97065 97088 97044 96699 96322 96222 96385 96823 97716 98979
55199 98979 100176 101048 101646 101900 101656 101216 101099 101228 101095 100852 101276 102442 103361 103372 102960 102746 102598 102344 102468
55180 102468 103298 104187 104272 103528 102365 100776 98686 96689 95615 95677 96643 98462 100936 103166 104191 104109 103863
55163 103863 103998 104287 104481 104742 105243 105850 106385 106829 107161 107318 107386 107692 108591 110171 112049 113500 114025 113855
55145 113855 113607 113402 112760 111492 110255 109869 110394 111161 111411 110704 109077 107066 105351 104157 103281 102747 102913
55128 102913 103684 104226 103931 103182 102648 102256 101483 100493 100305 101659 104079 106192 106935 106400 105547 105103 104941 104697
55110 104697 104587 105050 105814 106123 105884 105765 105954 105785 104994 104419 104776 105490 105606 105318 105616 106723 107828 108362
55092 108362 108711 109528 110920 112548 114094 115356 116138 116269 115743 114786 113806 113176 113017 113244 113747 114358 114801
55075 114801 115004 115326 116084 116926 117215 116962 116749 116628 115915 114356 112747 111844 111215 109785 107231 104386 102467
55058 102467 102242 103670 105991 108296 110191 111731 112790 112981 112293 111298 110585 110460 111212 112928 114888 115925
55042 115925 115742 115150 114714 114036 112822 111716 111337 111303 111055 110997 111842 113286 114266 114278 113662 112814 111930 111358 111446
55023 111446 112047 112658 113001 113074 112902 112667 112805 113507 114337 114766 114802 114737 114675 114684 114989 115529 115745 115271 114435 113731 113298
55002 113298 113296 114039 115184 115596 114801 113888 114121 115269 116218 116531 116370 115543 113956 112640 112936 114742 116734
54985 116734 118183 119437 120697 121588 122094 122750 123688 124471 124985 125484 125644 124697 122842 121417 121261 121825 122361
54968 122361 123000 124046 125030 125259 124821 124418 124503 125037 125795 126525 127033 127348 127579 127528 126803 125451 124068 123186
54950 123186 122915 123214 124021 125052 125913 126536 127098 127526 127644 127754 128375 129256 129383 128292 126796 126057 126366 127166
54932 127166 127843 128202 128484 129192 130633 132461 133939 134800 135563 136947 139192 141978 144731 147130 149660 153440
54916 153440 159041 165731 172497 179544 187860 197398 206769 214976 222398 229540 235619 239064 238899 235153
54902 235153 228472 219946 210944 202436 194513 186826 179299 172199 165770 160064 154993 150461 146626 143930
54888 143930 142485 141540 140158 138472 137633 138343 140048 141754 142991 143767 144286 145135 147118 150426 154422 158630
54872 158630 163411 169291 176151 183544 191373 199775 208656 217677 226241 233176 236991 237014 233926 228759 221864
54857 221864 213317 203775 194232 185267 177141 170307 165116 161195 157726 154249 150744 147182 143556 140144
54843 140144 137184 134442 131670 129288 127970 127626 127395 126701 125732 124856 124112 123379 122549 121388 119741 118083
54827 118083 117407 118201 119805 121053 121395 121170 120935 120890 120970 121204 121693 122209 122148 121154 119677 118585 118226 118275 118537
54808 118537 119318 120741 122176 122912 123127 123633 124782 126160 127340 128374 129406 130204 130385 129919 129226 128887
54792 128887 129246 130135 130925 131076 130730 130568 131010 131698 131951 131583 131057 130837 130819 130533 129794 128923 128346 128218 128576
54773 128576 129594 131348 133431 135220 136640 138319 140846 144144 147822 151865 156685 162548 169304 176727
54759 176727 184877 193966 203934 214341 224678 234591 243571 250544 254216 254068 250739 245144 237503 227759
54745 227759 216684 205885 196559 188783 182196 176763 172525 169054 165727 162355 159207 156568 154592 153396
54731 153396 152884 152579 151993 151210 150811 151188 152112 153043 153679 154202 155196 157353 161105 166346 172515 178987 185460
54714 185460 192019 198904 206192 213647 220760 226836 231105 232872 231719 227576 220714 211814 201996 192432
54700 192432 183742 175919 168867 162743 157660 153470 150099 147733 146333 145351 144360 143578 143223 142741 141411
54685 141411 139511 138080 137602 137709 138073 138651 138959 138153 136306 134792 134794 135964 137066 137423 137210 136828 136607
54668 136607 136841 137513 138097 138024 137262 136202 135247 134718 134801 135199 135136 134072 132320 130678 129671 129304 129276 129164
54650 129164 128704 128148 128066 128627 129362 129831 130038 130004 129488 128577 128014 128351 129138 129533 129416 129339 129564 129790 129744 129496
54630 129496 129180 128850 128697 129044 130041 131450 132762 133447 133311 132676 131972 131124 129751 128081 127056 127185 127895
54613 127895 128475 129052 129944 130546 129858 127986 126300 125922 126707 127805 128723 129562 130552 131578 132164 131994 131537
54596 131537 131822 133268 135067 136079 136102 135857 136037 136868 138296 139964 141125 141236 140623 140064 139854 139790 139897
54579 139897 140402 141061 141238 140790 140210 139758 139156 138387 138074 138660 139687 140351 140385 140038 139496 138762 137906 137084 136408
54560 136408 136029 136196 136970 138000 138814 139307 139697 140084 140287 140213 140182 140655 141601 142364 142325 141567 140698 140167 140119 140790
54540 140790 142420 144600 146323 147028 147172 147381 147600 147605 147869 149155 151463 154094 156587 158883 160722 161759
54524 161759 162351 163432 165308 167189 168190 168273 167943 167515 167039 166533 166006 165477 165162 165279 165562 165330 164274
54507 164274 162858 161730 161101 160854 160830 160741 160143 158876 157325 155980 154981 154282 153929 153842 153584 152807 151791 151143
54489 151143 151007 150932 150525 149955 149683 149903 150398 150859 151248 151853 152967 154492 155918 156783 157182 157739 159025 161021
54471 161021 163204 165102 166640 167974 169164 170187 171096 171970 172806 173667 174811 176347 177832 178636 178703 178585
54455 178585 178721 179145 179915 181204 182804 184119 184891 185334 185325 184259 182205 180410 179873 180077 179955 179520 179450 179496
54437 179496 178603 176633 174766 173930 173762 173500 173084 172914 173084 173275 173106 172412 171495 171123 171820 173155 174227
54420 174227 174751 175114 175452 175481 175295 175444 175988 176234 175791 175209 175151 175522 175766 175492 174466 172556 170100 167882
54402 167882 166386 165467 164943 164964 165521 166234 167034 168443 170722 173302 175527 177419 179156 180429 181038 181718
54386 181718 183501 186360 189161 190910 191542 191522 191226 190785 190136 189102 187611 185859 184170 182769 181737 180943
54370 180943 180024 178760 177550 177112 177608 178568 179764 181437 183326 184289 183590 182030 180984 180740 180556 180057
54354 180057 179653 179620 179636 179436 179283 179485 179896 180139 179999 179389 178183 176300 173827 171027 168279 165959 164256
54337 164256 163116 162429 162135 162066 161899 161440 160751 159913 158947 158116 157940 158549 159306 159396 158642 157497 156447 155683
54319 155683 155087 154278 152959 151498 150796 151261 152278 153143 154097 155839 158268 160397 161510 161841 162086 162665
54303 162665 163509 164203 164321 163885 163437 163490 164080 165018 166277 167794 169285 170734 172657 175331 178064 179916
54287 179916 180871 181556 181982 181443 179674 177323 175094 173093 171202 169423 167627 165626 163767 162899 163349 164361
54271 164361 164886 164545 163578 162289 160902 159631 158522 157449 156495 156145 156804 158281 159881 160875 160886 160123 159328
54254 159328 159122 159276 158958 157863 156711 156363 156800 157248 157103 156431 155767 155693 156414 157568 158508 158883 158799 158422
54236 158422 157772 157018 156564 156578 156758 156860 157093 157638 158033 157561 156210 154815 154168 154280 154554 154434 153765 152740
54218 152740 151726 151111 151211 152104 153473 154645 155028 154582 153770 153000 152283 151461 150526 149537 148472 147351 146373
54201 146373 145720 145338 145137 145335 146281 147938 149809 151457 152844 153948 154331 153532 151937 150782 150963 152032
54185 152032 152797 152781 152623 152989 153679 154088 154066 153840 153441 152739 151867 151146 150698 150547 150934 151892 152673 152344 151060
54166 151060 150064 150192 150976 151494 151450 151017 150269 149351 148741 148678 148619 147978 147197 147383 148889 150888 152391 153160 153462
54147 153462 153495 153327 153025 152556 151844 151118 150928 151473 152198 152411 152236 152556 153944 155869 157168 157220 156508 156014
54129 156014 156158 156473 156287 155484 154445 153397 152239 151063 150488 151107 152716 154390 155332 155396 154814 153805 152705
54112 152705 152179 152825 154563 156698 158583 159946 160567 160146 158783 157229 156227 155728 155166 154377 153725 153316
54096 153316 152674 151517 150423 150287 151246 152516 153248 153276 153035 153037 153478 154175 154779 155102 155295 155632 156204 156877 157475
54077 157475 157873 158015 158089 158636 160192 162685 165362 167454 168737 169357 169383 168858 168140 167803 168066 168559 168749 168434
54059 168434 167716 166727 165616 164710 164449 165058 166329 167671 168389 168131 167248 166668 167160 168702 170636 172384 173814
54042 173814 174958 175718 176024 176140 176627 177989 180377 183539 187008 190363 193404 196117 198640 201346 204821
54027 204821 209452 215045 220947 226558 231541 235710 238986 241525 243639 245567 247492 249692 252279 254844
54013 254844 256806 258156 259417 260731 261500 261210 260092 258604 256696 254071 250839 247422 243986 240383 236477
53998 236477 232210 227651 223405 220552 219552 219400 218566 216719 214869 213821 213191 212101 210231 207924 205731
53983 205731 204089 203038 202054 200521 198544 196916 196127 195879 195775 195959 196657 197485 197686 196925 195508 194015
53967 194015 192982 192670 192814 192777 192303 191981 192590 194113 195788 197129 198446 200224 202341 204176 205405 206401
53951 206401 207789 209708 211752 213654 215793 218748 222430 226005 228838 231230 234080 238040 243247 249648
53937 249648 257219 265878 275498 286152 298204 312049 327847 345417 364124 382560 398401 408944
53925 408944 412213 407837 397093 382275 365991 350508 337151 326102 317043 310063 305647 303716 303214
53912 303214 303079 303323 304700 307521 311221 315056 318734 322372 326193 330340 334692 338863 342568 345833 348547
53897 348547 350099 350007 348744 347236 345568 342963 339290 335812 333907 333478 333167 331808 329194 325659 321456
53882 321456 316573 310875 304357 297361 290468 284137 278576 273946 270330 267411 264516 261245 257828 254736
53868 254736 252175 250123 248555 247424 246596 245962 245399 244609 243333 241758 240259 238639 236244 233071 230205
53853 230205 228644 228191 228013 227871 228106 228699 229055 228734 227857 226756 225653 224743 224205 224042 224045 223934 223444 222541
53835 222541 221729 221776 222814 223949 224182 223432 222289 221023 219403 217251 214661 211771 208855 206500 205131
53820 205131 204388 203528 202403 201471 200879 200254 199519 199245 199852 200996 202058 202853 203486 203905 204058 204304 205259 207144
53802 207144 209474 211462 212781 214011 216205 219842 224321 228694 232721 236811 241083 245069 248477 251684
53788 251684 255178 258874 262231 264822 266610 267936 269479 271913 275293 278888 281863 284035 285796 287446
53774 287446 288801 289411 289024 287788 286027 283800 280897 277378 273896 271122 268978 266839 264461 262185 260257
53759 260257 258512 257013 256425 257355 259725 263210 267935 274253 282092 291067 301071 312025 322843 331096
53745 331096 334152 330790 321838 309452 295856 282502 270151 259444 251048 245124 240905 237162 233156
53732 233156 229039 225413 222726 221108 220520 220866 221924 223246 224262 224648 224613 224595 224598 224033 222430 220140 218074
53715 218074 216834 216355 216315 216530 216900 217327 217900 218917 220503 222353 224047 225519 226989 228561 230212 232092
53699 232092 234472 237260 239968 242374 244918 248072 251529 254480 256624 258425 260322 262211 263920 265692
53685 265692 267719 269469 269999 268957 266975 265049 263776 263112 262597 261766 260581 259532 259199 259672 260464 260883
53669 260883 260366 258661 256055 253451 251926 251946 253038 254270 255066 255578 256294 257263 257913 257950 258221 260078 263663
53652 263663 267488 270144 271821 273555 275528 277032 277729 277863 277224 275017 271150 266818 263332 260949 259252
53637 259252 258032 257313 256996 256989 257362 258033 258612 258825 258709 258149 256848 255122 254114 254603 256064 257533 258901
53620 258901 260702 262987 265278 267481 269966 272752 275367 277656 280121 283241 286913 290686 294098 296741
53606 296741 298475 299749 301301 303390 305672 307875 310173 312736 315318 317539 319268 320550 321424 321970 322317
53591 322317 322461 322255 321749 321302 321205 321273 320889 319382 316538 313002 310069 308654 308374 307977 306728 304998 303461
53574 303461 302224 301047 299982 299367 299297 299423 299262 298575 297522 296540 295920 295499 294929 294231 293752 293550 293305 293046
53556 293046 293488 295182 297611 299645 300833 301811 303453 305954 308830 311464 313552 315265 317185 319949 323762
53541 323762 328199 332542 336295 339449 342320 345233 348413 352160 356973 363278 370985 379493 388191 396909
53527 396909 405852 415272 425295 435911 447022 458538 470491 482926 495665 508404 521161 534435
53515 534435 548788 564347 580911 598402 617123 637587 660108 684362 709308 733796 757430
53504 757430 780627 803724 826368 848088 869144 890344 912092 934102 956042 978037 1000351
53493 1000351 1022919 1045422 1067681 1089756 1111668 1133161 1153753 1173072 1191063 1207773 1223011
53482 1223011 1236509 1248544 1260024 1271595 1282914 1293202 1302345 1310882 1318934 1325655 1329961 1331417
53470 1331417 1330348 1327500 1323752 1319654 1314831 1308073 1298352 1285618 1270442 1253262 1234346 1214269 1193874
53457 1193874 1173688 1153642 1133359 1112495 1090829 1068310 1045110 1021581 998145 975275 953395
53446 953395 932646 912873 893988 876179 859562 843894 828965 815071 802639 791513 781168
53435 781168 771719 764172 759401 757234 756795 757427 758952 761419 765101 770636 778660 789156 801429 814826
53421 814826 829191 844557 860745 877564 895264 914402 935197 957260 980132 1003899 1029042
53410 1029042 1055810 1084061 1113808 1145573 1179866 1216498 1254780 1294387 1335716 1379260 1424913
53399 1424913 1472130 1520583 1570432 1621945 1675009 1729021 1783238 1837268 1891294 1945756 2000723
53388 2000723 2055613 2109508 2161680 2211842 2260076 2306626 2351544 2394323 2433916 2469327 2500230
53377 2500230 2526968 2550020 2569576 2585522 2597581 2605400 2608657 2607230 2601218 2590721 2575560 2555260
53365 2555260 2529330 2497545 2459933 2416562 2367546 2313453 2255585 2195540 2134350 2072254 2009370
53354 2009370 1946274 1883711 1822012 1761225 1701697 1644099 1588805 1535624 1484246 1434596 1386545
53343 1386545 1339587 1293150 1247216 1202435 1159628 1119230 1081043 1044414 1008902 974972 943866
53332 943866 916455 892289 870099 849181 829922 812967 798394 785941 775559 767247 760562 754902
53320 754902 750257 747161 745798 745653 746360 748397 752410 758060 764133 769919 776020 783580 793009 803800
53306 803800 815431 828091 842376 858528 876197 894940 914746 935897 958456 982169 1006889
53295 1006889 1032789 1059943 1087975 1116447 1145435 1175357 1206277 1237646 1268648 1298468 1326327
53284 1326327 1351751 1374913 1396257 1415664 1432407 1446025 1456762 1464855 1469957 1471723 1470563 1467220
53272 1467220 1461860 1454106 1443837 1431395 1417092 1401025 1383367 1364309 1343653 1320944 1296079 1269438
53260 1269438 1241369 1212037 1181813 1151261 1120443 1088701 1055475 1021096 986538 952650 919850
53249 919850 888287 857959 828800 800845 774134 748337 722743 696840 670709 644678 618899
53238 618899 593581 569294 546574 525307 504909 485123 466305 448924 433127 418916 406451
53227 406451 395868 386838 378481 369986 361378 353557 347290 342232 337233 331677 326064 321121 316801 312563
53213 312563 308245 304110 300177 296137 291954 288028 284648 281705 279060 276813 275007 273423 271868 270369
53199 270369 268840 266868 264164 261092 258402 256510 255230 254177 253188 252344 251797 251618 251675 251610 251066 250003
53183 250003 248774 247810 247223 246719 245934 244824 243694 242829 242178 241467 240523 239366 238111 236964 236269 236310 236980
53166 236980 237779 238246 238308 238220 238309 238761 239479 240146 240610 241188 242306 243812 244971 245264 244896 244370 243911 243560 243439
53147 243439 243516 243393 242790 242074 241787 241811 241522 240690 239622 238451 237024 235660 235188 235698 235952 234783 232776
53130 232776 231761 232717 234792 236450 236952 236575 235887 235239 234723 234290 233873 233485 233195 233061 233114 233232 232973 231830
53112 231830 229973 228442 228130 228759 229311 229347 229225 229110 228559 227335 225866 224497 222917 220838 218708 217150
53096 217150 216121 215266 214702 214730 214979 214628 213442 211912 210394 208787 207123 205741 204678 203560 202421 202029
53080 202029 202953 204676 206110 206700 206634 206187 205356 204107 202660 201428 200776 200750 200962 200922 200583 200346 200368 200146
53062 200146 199103 197458 196213 196195 197252 198391 198690 198188 197975 199230 201989 204965 206741 207042 206748 206856
53046 206856 207738 209229 210917 212174 212315 211159 209396 208032 207376 206776 205552 203887 202520 201746 201207 200685
53030 200685 200522 200943 201407 201137 200036 198659 197469 196631 196354 196798 197640 198297 198716 199384 200404 201087 200782
53013 200782 199714 198711 198424 199051 200472 202292 203967 205170 205927 206274 206032 205059 203413 201236 198800 196778
52997 196778 195915 196104 196244 195421 193832 192238 190961 189983 189599 190189 191444 192405 192409 191644 190753 190260 190356 190965
52979 190965 191920 193153 194601 195904 196541 196491 196356 196539 196709 196489 196176 196240 196483 196386 196039 196031 196622 197718 199496
52960 199496 202196 205253 207456 208203 207888 206983 205460 203473 201863 201389 201822 202253 202150 201784 201774 202313 202733
52943 202733 201932 199529 196487 194115 192566 190949 188867 187018 186055 185722 185571 185731 186330 186703 185998 184253
52927 184253 182248 180505 179063 178008 177587 177804 178355 178932 179212 178744 177435 176066 175756 176797 178465 179987
52911 179987 181178 181995 182103 181367 180386 179996 180273 180463 180013 179311 179160 179742 180461 180821 181024 181481 182072 182361
52893 182361 182410 182833 183910 185087 185607 185358 184857 184705 185267 186585 188179 189151 188868 187561 186007 184730 183738
52876 183738 182894 182173 181570 181018 180500 180088 179884 180036 180730 181943 183303 184375 185070 185608 186207 187041 188354
52859 188354 190213 192156 193491 194103 194607 195539 196690 197568 198268 199458 201520 204074 206434 208137 208812 207993
52843 207993 205601 202539 200209 199200 198755 197735 195793 193363 190898 188610 186768 185633 185064 184592 184004
52828 184004 183572 183653 184332 185434 186592 187346 187566 187788 188795 190839 193603 196747 199889 202141 202478 200936
52812 200936 198764 197047 195760 194485 193343 192663 192375 192446 193364 195434 198036 200448 203045 206684 211016
52797 211016 214422 215739 215124 213132 209897 205652 201207 197274 193780 190349 187064 184333 182296 180859
52783 180859 180027 179729 179481 178665 177145 175413 174133 173737 174249 175283 176253 176818 177070 177298 177704 178437 179574
52766 179574 180904 181953 182464 182662 182817 182764 182156 181041 179838 178822 177940 177100 176392 176040 176327 177488 179382
52749 179382 181329 182632 183276 183783 184329 184475 183999 183552 183952 185061 185947 186199 186485 187493 188821 189462 189206
52732 189206 188980 189644 190909 191701 191370 190282 189377 189418 190563 192377 194136 195277 195689 195706 195856 196504 197502
52715 197502 198158 197807 196496 194890 193407 191790 189742 187581 185824 184399 182822 181076 179752 179236 179236 179297
52699 179297 179329 179369 179200 178557 177545 176552 175859 175512 175427 175442 175406 175393 175695 176414 177221 177693 177753 177639 177605 177874 178640
52678 178640 179817 180910 181462 181575 181749 182327 183392 185001 187013 188747 189404 189030 188526 188475 188398 187611 186399
52661 186399 185829 186555 188279 190257 191907 193015 193832 194951 196621 198165 198587 197830 196934 196821 197516 198814
52645 198814 201022 204481 208821 213257 217274 220398 221642 220087 216072 211120 206530 202593 199234 196712
52631 196712 195307 194802 194744 194980 195649 196820 198391 200145 201813 203328 205014 207196 209523 211116 211538 211152
52615 211152 210364 209057 207123 204996 203136 201392 199462 197691 196801 196967 197681 198371 198637 198060 196415 194151
52599 194151 192120 190752 189860 189250 189013 189141 189364 189573 190006 190811 191735 192488 193159 194060 195308 196722 198020
52582 198020 199004 199662 200141 200568 200884 200958 200818 200693 200874 201634 203092 204928 206413 207042 207131 207526 208725 210463
52564 210463 212057 212923 212871 212222 211590 211279 210939 210004 208390 206452 204506 202768 201632 201456 201984 202378 201943
52547 201943 200644 198989 197708 197372 197924 198590 198671 198367 198460 199316 200664 202165 203600 204549 204630 204109 203650 203321
52529 203321 202538 201156 199879 199289 199165 199148 199428 200314 201631 203042 204526 206072 207317 207980 208283 208576 208908
52512 208908 209353 210306 211944 213873 215802 218174 221511 225453 229059 231823 233812 235142 235957 236690 237609
52497 237609 238203 237638 235788 233240 230439 227470 224596 222220 220250 218262 216418 215496 215715 216227 216186 215789
52481 215789 215732 216074 216235 215933 215594 215794 216658 217899 219276 220862 222884 225315 227700 229522 230696 231558
52465 231558 232454 233506 234772 236294 237909 239267 240185 240875 241717 242890 244238 245344 245667 244834 242947 240540
52449 240540 238171 236097 234270 232532 230747 228925 227256 225923 224836 223653 222148 220544 219373 218995
52435 218995 219218 219388 218907 217664 216017 214506 213663 213863 214945 215981 215893 214563 213046 212419 212700 213113 213088
52418 213088 212572 211639 210372 209141 208546 208896 209971 211306 212570 213753 215207 217416 220439 223666 226394
52403 226394 228565 230680 233129 236011 239561 244271 250466 257980 266295 274677 282123 287504 289963 289161
52389 289161 285339 279436 273007 267413 262934 258978 255213 252107 250276 249736 250060 250888 251982 253021 253704
52374 253704 253971 253907 253571 253080 252737 252880 253593 254710 256109 257915 260389 263554 266878 269470 270717 270688 269781
52357 269781 268174 265898 263330 261154 259743 258842 257977 256918 255754 254727 254087 253873 253807 253632 253525 253893
52341 253893 254746 255610 256130 256431 256782 257230 257743 258434 259479 260951 262834 265020 267318 269668 272341 275605
52325 275605 279320 283256 287764 293505 300438 307737 314924 322376 330318 337974 344414 349813 355048 360233
52311 360233 364414 366829 367887 368634 369665 370854 371896 372823 373903 375234 376650 378127 380028 382609 385403
52296 385403 387616 389237 391232 394376 398311 402057 404984 406897 407657 407369 406679 406265 406089 405612 404563 403071
52280 403071 401277 399460 398392 398778 400262 401663 402388 403009 404221 405888 407506 409093 411109 413794 417038
52265 417038 420665 424414 427815 430547 432899 435483 438522 441774 445215 449382 454753 460916 466640 470834
52251 470834 473381 475084 476929 479490 482890 487058 491834 496888 501702 505734 508653 510519 511767 512947
52237 512947 514334 515853 517386 518964 520534 521790 522609 523572 525600 528902 532658 535988 538996 542436 546509
52222 546509 550490 553751 556790 560798 566242 572303 577853 582676 587389 592333 597093 601233 605081 609355
52208 609355 614197 618968 623060 626648 630518 635271 640766 646264 651122 655429 659968 665430 671677 677776
52194 677776 682762 686339 688961 691379 694065 696957 699736 702370 705285 708887 713014 717019 720327 722814
52180 722814 724716 726364 727941 729264 729817 729186 727417 724788 721342 716958 711903 706849 702131 697321 691903
52165 691903 686202 681227 677580 674856 672276 669664 667567 666607 667012 668812 672046 676518 681487 685929 689188
52150 689188 691220 692267 692541 692263 691714 691145 690753 690865 691850 693691 695840 697721 699256 700749 702388 704077
52134 704077 705549 706408 706169 704566 701800 698314 694458 690622 687535 685996 686240 687877 690543 694386 699876
52119 699876 707295 716497 727008 738305 750122 762389 774779 786552 797052 806224 814238 820795
52107 820795 825224 827243 827087 824908 820658 814759 808338 802375 796953 791689 786643 782418 779647 778743 779989
52092 779989 783379 788380 794137 800053 806088 812548 819657 827112 833911 838737 840730 839759 835969 829500
52078 829500 821076 812476 805769 801957 800652 801026 802584 804981 807641 809916 811446 812156 812114 811610 811149 811106
52062 811106 811388 811626 811624 811441 811138 810652 809963 809236 808650 808070 806913 804456 800475 795687 791370 788328 786229
52045 786229 784170 781798 779531 777633 775554 772591 768946 765526 762654 759571 755472 750574 745804 741759
52031 741759 738539 736409 735997 737654 741019 745365 750122 755037 760168 765820 772152 778763 785021 790915
52017 790915 797148 804166 811507 818399 824610 830323 835582 840449 845467 851301 857882 864407 870208 875161
52003 875161 879129 881490 881484 878719 873177 865009 854598 842555 829317 814782 798574 780626 761364
51990 761364 741312 720698 699574 678397 658398 641112 627271 616190 606453 597156 588342 580354
51978 580354 573220 566805 561153 556339 552125 548041 543688 538736 532731 525260 516460 507155 498296 490308
51964 490308 483154 477059 472953 471905 474126 478807 485071 492817 502337 513356 524916 536246 547256
51951 547256 558080 568489 577939 585771 591078 592769 590332 584525 576955 569055 561709 555678 551824 550672
51937 550672 552107 555772 561661 570151 581512 595453 611051 627001 642063 655480 667082 677006
51925 677006 685223 691153 693663 691637 684756 673720 659495 642422 622344 599664 575941 553169
51913 553169 532579 514306 498048 483715 471422 461149 452642 445606 439844 435180 431341 428033 425199
51900 425199 423193 422645 424141 428051 434543 443571 454718 467162 480013 492701 504903 515986 524621
51887 524621 529120 528312 522148 511606 498169 483510 469413 457467 448435 441996 437408 434472 433609
51874 433609 435009 438134 442390 448046 456069 467067 480687 495984 511973 527705 542229 554813
51862 554813 565024 572354 576060 575688 571597 564512 554689 542045 527238 512032 498232 486590 477082
51849 477082 469898 465566 464179 465145 467868 472237 478203 485280 492836 500702 509108 518109 527390 536567
51835 536567 545229 552466 556691 556282 550512 539905 525879 510170 494441 480094 468227 459616 454516
51822 454516 452330 451602 450723 448867 446181 443050 439423 435077 430339 426078 422840 420389 418356 417090 417485
51807 417485 420020 424396 430042 436533 443380 449936 455860 461282 465990 468753 468155 464182 458382 452268
51793 452268 446065 439331 432274 425859 420816 417122 414451 412605 411329 410077 408295 405822 402950 400176
51779 400176 397997 396725 396361 396668 397391 398264 398825 398431 396661 393643 389963 386414 383830 382884 383753 386069
51763 386069 389389 393619 398900 405316 413042 422583 434348 447852 461619 474027 484028 491056 494695
51750 494695 494794 491707 486064 478366 469089 459052 449307 440541 432807 425867 419627 414206 409882 407081
51736 407081 406155 406990 409079 412252 417175 424770 435193 447711 461629 476899 493453 510125 524597
51723 524597 534677 539640 540534 539537 539068 541098 546451 554205 561724 565764 564138 556775 545499 532938
51709 532938 521434 512439 506367 502739 500466 498141 494354 488212 479857 470498 461691 454626 450089 448734
51695 448734 450766 455210 459905 462659 462488 459873 456133 452706 450654 450458 452210 455987 461706 468430 474207
51680 474207 477051 476087 471601 464384 455517 446486 438708 432792 428684 426610 427250 430818 436627 443940 452785
51665 452785 463452 475537 488023 500188 512100 524412 538002 553477 570417 587042 600910
51654 600910 609913 612493 607497 594784 576102 554681 533549 514460 498336 486001 477986 474068
51642 474068 473542 475775 480028 484789 487781 487006 481819 472986 461793 449134 435451 421394 408136
51629 408136 396711 387206 378990 371715 365619 360778 356651 352706 349117 346379 344498 343009 341668 340676
51615 340676 340198 340066 340017 339887 339510 338697 337470 336141 335111 334716 335205 336567 338295 339588 339966 339572 338802
51598 338802 337815 336562 335132 333882 333246 333547 334927 337353 340743 345189 351007 358418 367216 376894 387183
51583 387183 398190 409681 420246 427648 430485 429559 427298 425773 425497 426136 427843 431494 437962 447721
51569 447721 461107 478347 499078 522176 546381 571024 596211 622578 650961 681793 714385
51558 714385 747009 778228 808342 839403 873818 913080 957631 1007311 1061450 1118430 1175248
51547 1175248 1227527 1270138 1298411 1309549 1303361 1281703 1247105 1201852 1148137 1088560 1025918
51536 1025918 962453 899613 838670 781218 728752 682018 641204 606619 578617 556724 539371
51525 539371 524905 512608 502445 494177 487183 481031 475648 470870 466221 461300 456054 450525 444658
51512 444658 438593 432854 427938 423897 420546 417904 416082 414838 413616 412051 410141 407888 405039 401326
51498 401326 396757 391586 386224 381232 377122 373930 371175 368433 365835 363810 362510 361700 361138 360783 360755
51483 360755 361317 362837 365409 368490 371160 372847 373539 373307 372008 369652 366783 364112 361866 359783 357719
51468 357719 356025 355186 355173 355310 354876 353785 352492 351166 349233 346072 342060 338439 336094 334875 334270 334280
51452 334280 335259 337247 339881 342808 345833 348812 351767 354993 358754 362997 367666 373125 379849 387806
51438 387806 396632 406327 417355 430115 444682 460823 477452 492055 501666 505169 504376 502497 501885
51425 501885 503375 506830 511212 514299 513461 507359 496771 483762 470338 457849 447070 438275 431202
51412 431202 425211 419770 414949 411445 409924 410215 411321 412376 413461 415318 418386 422343 426518 430463
51398 430463 434099 437453 440442 442976 445296 448071 451844 456438 461297 466482 472840 480834 489699 498283
51384 498283 506474 515211 525269 536668 549404 564235 582592 605962 635449 671578 714421 764066
51372 764066 820768 884298 953277 1025633 1099501 1172865 1242186 1302301 1348427 1378089 1390948
51361 1390948 1387348 1367666 1332797 1284548 1225433 1158311 1086126 1011624 937212 865125 797495
51350 797495 735992 681523 634440 594838 562355 535931 514226 496333 481780 469854 459273
51339 459273 448722 437635 426367 415668 405918 396835 387910 379107 370958 363969 358150 353242 349078
51326 349078 345546 342447 339712 337537 336017 334804 333471 332163 331520 331951 333256 334918 336521 337865 338896
51311 338896 339588 339834 339555 339069 339121 340312 342555 345243 347750 349602 350523 350762 351174 352421 354254 356063
51295 356063 357988 360725 364150 366868 367544 366284 364371 362917 361988 360776 358395 354756 350799 347608 345200
51280 345200 342581 339146 335575 333141 332481 333294 334762 335961 336351 336346 337073 339029 341267 342441 342385 342081 342233
51263 342233 342648 343081 343992 346131 349719 354264 358943 363004 366130 368570 370802 373019 375191 377529 380393
51248 380393 383534 385836 386172 384337 380924 376539 371509 366151 360876 355892 351124 346593 342723 340013
51234 340013 338362 336905 334671 331476 328073 325413 323832 323093 323001 323670 325090 326731 327832 328057 327739 327503
51218 327503 327793 328757 330334 332275 334126 335516 336618 338170 340760 344152 347529 350413 353008 355562 357821
51203 357821 359417 360513 361651 363087 364715 366618 369221 372770 376936 381094 384776 387819 390420 393174
51189 393174 396692 400844 404572 406754 407174 406488 405384 404122 402861 401938 401546 401271 400335 398403 395963 393732
51173 393732 391842 389874 387637 385527 383918 382546 380800 378375 375300 371584 367393 363547 361134 360401
51159 360401 360466 360431 360393 361096 362966 365837 369281 372718 375478 377244 378348 379220 379699 379341 378287 377185 376191
51142 376191 374681 372174 369046 365969 363040 359935 356595 353283 350100 346932 343865 341289 339515 338594
51128 338594 338487 339062 339820 340075 339728 339605 340667 342982 345747 348226 350400 352764 355888 360227 365851 372064
51112 372064 377535 381303 383661 385788 388495 391524 394054 395619 396445 397111 398001 399017 399752 400050 400408 401687
51096 401687 404394 408371 413165 418364 423464 427753 430618 431889 431644 429848 426453 421781 416502 411179
51082 411179 406037 401203 396940 393553 391164 389628 388590 387735 387114 387152 388078 389452 390542 391185 391880 392954
51066 392954 394061 394815 395599 397285 400291 404312 408938 414072 419689 425631 431946 439169 447877 457971
51052 457971 468551 478352 486159 491021 492610 491629 489718 488746 490083 494278 501032 509279 517671 525405
51038 525405 532706 540322 548572 557033 565143 572891 580834 589563 599183 609119 618174 624772 627370 624984
51024 624984 617571 606030 591748 576015 559781 543822 528902 515625 504237 494743 487195 481684
51012 481684 478145 476314 475958 477029 479539 483305 487775 492120 495764 499017 502953 508341 514808 521350
50998 521350 527480 533395 539098 544028 547789 550703 553265 555445 556870 557375 556932 555385 552804 550014 548244
50983 548244 548219 549879 552929 557321 563189 570723 580180 591726 605158 619944 635590 651770 668016
50970 668016 683355 696267 705101 708889 708031 703982 698033 690561 681626 671741 661452 650531 638450
50957 638450 625676 613721 603714 595603 588985 584010 581015 579871 580305 582629 587521 595208 605189 616747
50943 616747 629550 643913 660624 680335 703008 728279 756483 788817 826078 867426 910471
50932 910471 951976 988221 1015679 1032682 1040518 1042237 1040258 1035560 1028730 1020676 1011985 1002425 991590
50919 991590 979482 966003 950427 932046 911191 889059 866561 843761 820528 797410 775668
50908 775668 756482 740184 726181 713646 702226 692053 683088 674763 666360 657633 648894 640567 632784
50895 632784 625408 618373 611970 606749 602992 600350 598101 595844 593790 592318 591354 590235 588204 585109
50881 585109 581663 578900 577175 575837 574082 571974 570264 569298 568653 567921 567331 567242 567462 567471 567060 566359 565413
50864 565413 564211 563080 562679 563467 565389 568080 571204 574627 578412 582676 587299 591882 596152 600317 604767
50849 604767 609544 614416 619421 624994 631398 638291 645041 651407 657852 665345 674786 686363 699313 712507
50835 712507 725500 738989 754104 771236 789677 808466 827587 848133 871143 896443 923038
50824 923038 950770 981045 1015448 1053987 1095330 1138689 1184692 1234207 1287004 1341966 1398058
50813 1398058 1454426 1509708 1561800 1608283 1646859 1675740 1694311 1703508 1704964 1699473 1686509 1665393
50801 1665393 1636602 1601813 1562972 1521701 1479461 1437832 1398395 1362359 1330342 1302410 1278295
50790 1278295 1257665 1240443 1227009 1218033 1213834 1213837 1216857 1222082 1229619 1239891 1252655 1266784 1280851
50777 1280851 1293598 1303973 1311269 1315533 1317575 1318304 1317980 1316122 1311968 1305006 1295279 1283252 1269216
50764 1269216 1252776 1233165 1210187 1184622 1157522 1129318 1099847 1069073 1037514 1006048 975586
50753 975586 946914 920660 897255 876880 859312 843860 829765 816902 805835 796972 789966 784289
50741 784289 780123 778141 778503 780716 784502 790185 797951 807304 817765 829716 843915 860250 877483
50728 877483 894289 910230 925600 940638 955106 968488 980428 990942 1000294 1008743 1016538 1024116
50716 1024116 1032065 1040663 1049628 1058501 1067176 1075780 1084163 1091853 1098559 1104447 1109942 1115653 1122616 1132169
50702 1132169 1145178 1161531 1180637 1202246 1226447 1253091 1281616 1311463 1342255 1373428 1403991
50691 1403991 1432786 1458775 1481038 1498885 1512219 1521657 1528096 1532318 1535162 1537755 1541277 1546531 1553865
50678 1553865 1563163 1573601 1583743 1592483 1599904 1606876 1614075 1622084 1632390 1647319 1668442 1695577
50666 1695577 1727740 1764452 1805482 1849748 1895283 1940129 1982711 2021588 2055791 2085635 2112593
50655 2112593 2138060 2162524 2185928 2208271 2229606 2249919 2269201 2287301 2303597 2317352 2328633
50644 2328633 2338489 2348012 2357737 2368255 2380894 2397240 2418301 2444476 2475897 2512293 2552801 2596415
50632 2596415 2642278 2689030 2734312 2775751 2812312 2844047 2870720 2891659 2907007 2918192 2926804
50621 2926804 2933690 2939249 2943363 2943828 2935274 2911042 2867299 2806026 2734602 2662587 2597967 2545112
50609 2545112 2505259 2478268 2463525 2459405 2462847 2470129 2477940 2483382 2483454 2475312 2457138 2428452 2389613
50596 2389613 2341339 2284559 2220308 2149806 2074911 1998301 1922603 1849295 1778763 1711328 1647642
50585 1647642 1588129 1532785 1481867 1436234 1396536 1362409 1332880 1307384 1286077 1269376 1257602
50574 1257602 1250848 1248768 1250532 1255416 1263519 1275634 1292362 1313500 1338178 1365169 1392893 1419536
50562 1419536 1443574 1464286 1481638 1495781 1506853 1515351 1522490 1529943 1539072 1550527 1564725 1582605
50550 1582605 1605653 1635075 1671120 1713248 1760646 1812368 1867252 1924053 1981613 2038684 2093789
50539 2093789 2145750 2194429 2240707 2285824 2331181 2378795 2431239 2490521 2557054 2629952 2708197
50528 2708197 2791415 2879924 2974469 3075885 3184675 3300851 3424245 3554688 3691547 3833265
50518 3833265 3977740 4123045 4267327 4407999 4541496 4663889 4771299 4859684 4924976 4964072
50508 4964072 4975542 4959111 4914810 4843115 4745855 4626578 4490088 4341865 4187730 4033515
50498 4033515 3884813 3747078 3625602 3524797 3447249 3393685 3363804 3356784 3370956 3403334 3449493
50487 3449493 3503538 3558179 3605557 3638595 3651707 3640526 3601935 3535165 3442649 3329347 3201209
50476 3201209 3064281 2924271 2785602 2650515 2519724 2394135 2275437 2164925 2062550
50467 2062550 1967644 1880085 1800146 1727506 1661100 1599932 1543594 1491957 1444772 1401661 1362193
50456 1362193 1325952 1292794 1263115 1237529 1216129 1198238 1182999 1170021 1159326 1150889 1144388 1139329
50444 1139329 1135313 1132265 1130411 1129911 1130545 1131966 1134301 1138196 1144102 1151794 1160754 1170742 1181684 1193224
50430 1193224 1204928 1216978 1230293 1245761 1263510 1283050 1303932 1326175 1350169 1376329 1404733
50419 1404733 1434968 1466445 1498990 1533202 1570140 1610608 1654790 1702643 1754570 1811515 1874154
50408 1874154 1942063 2013977 2088981 2167125 2248603 2332580 2417228 2500841 2582391 2660921 2734956
50397 2734956 2802917 2863869 2917381 2962559 2997362 3018857 3024155 3011375 2980167 2931629 2867886
50386 2867886 2791807 2706893 2616959 2525573 2435773 2350233 2271298 2200645 2139240 2088010 2048338
50375 2048338 2021392 2006941 2003183 2007730 2018307 2032315 2046111 2055333 2056244 2046810 2026576 1995585
50363 1995585 1953715 1901283 1840168 1773760 1705345 1636709 1568524 1501675 1437531 1376996 1320071
50352 1320071 1266595 1216915 1171513 1130373 1093051 1059062 1027926 999172 972678 948772 927707
50341 927707 909222 892892 878619 866437 856118 847384 840287 834891 830778 827434 824963 823711 823156
50328 823156 821866 818867 814512 809709 804812 799684 794435 789541 785367 781973 779386 777746 777265 778167 780502
50313 780502 783800 787152 790035 792939 796825 801992 807898 814065 820706 828253 836667 845568 854847 864757
50299 864757 875319 885920 895649 903962 910926 916900 922250 927440 933178 940048 947909 955855 962857 968269
50285 968269 971689 972781 971661 969300 967165 966489 968139 973053 982422 997495 1019472 1049136 1085275
50272 1085275 1122695 1152499 1165925 1159274 1135890 1103837 1071524 1044477 1024694 1011892 1005008 1002779
50260 1002779 1003386 1004210 1002431 996129 985011 970382 954520 939737 927437 917766 910059 903548 897661
50247 897661 891994 886361 880844 875573 870521 865715 861569 858700 857396 857460 858506 860128 861900 863598 865492
50232 865492 867954 870663 872561 872928 872142 871061 869882 868012 864978 860969 856406 851353 845591 839049 831889
50217 831889 824177 815764 806709 797695 789694 783067 777148 770970 764327 757899 752441 748144 744721 741669
50203 741669 738356 734358 730082 726723 725138 724869 724673 723990 723521 724295 726465 729230 731837 734480 738114
50188 738114 743466 750404 758469 767797 779097 792730 808418 826120 846596 870587 897781 927210
50176 927210 958396 991256 1024820 1056839 1085130 1109077 1129640 1148213 1165710 1182489 1198839
50165 1198839 1215354 1232523 1249715 1264873 1275752 1281343 1281546 1275688 1262439 1241478 1214443 1183696
50153 1183696 1150863 1117178 1084510 1054988 1029801 1009118 992992 981511 974094 969526 966998 966534
50141 966534 968067 970450 971575 969167 961460 947708 928512 905527 880684 855791 832624 812744
50129 812744 796868 784759 775971 770390 767771 767180 767338 767428 767255 766815 766068 765098 764157 763450 762925 762207 760720
50112 760720 758115 754754 751595 749379 748070 747329 747223 748141 750140 752860 755985 759375 762741 765685 768307
50097 768307 771401 775758 781434 787842 794309 800270 805130 808388 810094 811057 812458 815116 819000 823467
50083 823467 828055 833104 839533 847997 858343 869779 881366 892439 902934 913486 924875 937184
50071 937184 949805 962599 976738 993935 1014922 1039229 1066477 1097365 1133195 1174771 1221969
50060 1221969 1273956 1329326 1386145 1442215 1495469 1544189 1587362 1625321 1659933 1693600 1727763
50049 1727763 1762459 1797108 1831161 1863683 1892696 1915410 1929149 1931941 1922514 1900326 1866001 1821574
50037 1821574 1769993 1714122 1656058 1597123 1538290 1480580 1425189 1373393 1326310 1284602 1248298
50026 1248298 1216964 1190114 1167540 1149282 1135329 1125278 1118161 1112547 1106996 1100599 1093097 1084480
50014 1084480 1074655 1063608 1051672 1039361 1027007 1014787 1002901 991234 978854 964425 947513
50003 947513 929115 910569 892179 873310 853588 833537 814172 796557 781805 770907 764197 761275
49991 761275 761800 766045 774290 785790 798751 811367 822678 832386 840190 845613 848478 849351 849331 849268 849086
49976 849086 847870 844555 838539 829722 818262 804524 789269 773677 759005 746153 735525 727249
49964 727249 721420 717986 716448 715933 715846 716394 718226 721536 725787 730392 735408 741393 748843 758067 769431
49949 769431 783426 800468 820867 844939 872999 905332 942291 984235 1030997 1081479 1133991
49938 1133991 1186815 1238129 1285630 1327064 1361401 1389032 1410648 1426514 1437163 1444084 1448893 1451963
49926 1451963 1452386 1449095 1441400 1428521 1409365 1383051 1349264 1308036 1259802 1206014 1149327 1092761
49914 1092761 1038727 988880 944413 905977 873391 845711 821716 800359 781112 764120 749924
49903 749924 738892 730998 726129 724200 724796 727056 730320 734704 740789 749001 759702 773495 790680
49890 790680 810203 829681 846771 860311 870105 876130 878377 877327 874029 869466 863830 856430 846259
49877 846259 832671 815678 795890 774347 752279 730624 709626 689090 669207 650855 634873
49866 634873 621289 609650 599871 592329 587146 583842 581785 580625 580219 580503 581602 583724 586859 590851
49852 590851 595887 602541 611164 621562 633538 647325 663098 680329 698169 716395 735401 754994
49840 754994 773536 788629 798773 804343 807047 808516 809248 808612 805531 799130 789109 775935 760753
49827 760753 744846 729002 713453 698455 684707 673117 664222 657892 653499 650369 648204 647149 647487
49814 647487 649384 653077 659098 667908 679269 692319 706331 721182 737013 753635 770305 785815
49802 785815 798865 808761 815863 821050 824792 827142 828501 829468 829570 826965 820151 809568 796866 783011
49788 783011 767865 751309 733855 716102 698375 681181 665383 651639 640039 630461 622904 617286
49776 617286 613280 610570 608904 607723 606151 603743 601100 599402 599371 600827 603255 606602 611477 618498 627513
49761 627513 637741 648763 661020 674912 689636 703502 715422 725566 734528 742512 749657 756426
49749 756426 762929 768004 769633 766436 758552 747104 733207 717621 701050 684387 668561 654277
49737 654277 641959 631871 624071 618201 613551 609608 606465 604483 603621 603439 603782 605107 607938 612201
49723 612201 617254 622345 626850 630303 632550 633996 635578 638394 643319 650829 661067 674023 689620
49710 689620 707645 727629 748763 769674 788201 801826 808988 810151 807296 802310 796092 789046 781682
49697 781682 774341 766748 758423 749454 740573 732525 725541 719163 712334 703904 693620 682629 672662 664595
49683 664595 658113 652736 648725 646759 647123 649593 653932 660006 667419 675516 684052 693696 705550 720188
49669 720188 737309 756214 776131 795802 813029 825271 831155 831547 829097 826617 825655 826333 828215
49656 828215 831130 835282 840970 848423 857426 866358 871646 869088 856548 835344 808906 780524 752546
49643 752546 726786 704444 685580 669533 656079 645594 638026 632465 627994 624358 621489 619047 616894
49630 616894 615484 615129 615230 614798 613503 611729 609754 607484 604841 601894 598555 594619 590215 585852 581875
49615 581875 578165 574476 570843 567550 564866 562930 561750 561158 560833 560467 560012 559831 560556 562690 566236 570764
49599 570764 575733 580634 584939 588251 590586 592215 593190 593333 592793 592198 592011 592112 592264 592597 593258 593995 594551
49582 594551 595124 595882 596323 595870 594988 594922 596166 597923 599358 600773 603082 606609 610940 615661 620724 626200
49566 626200 632246 639313 647911 658021 669090 680736 693090 706160 719155 730894 740734 748625
49554 748625 754171 756272 754157 748516 741072 733092 724733 715898 707241 700046 695309 693141 692865 693554 694574
49539 694574 695752 697029 698137 698910 699705 700950 702162 702030 699864 696569 693835 692717 693406 695917 700315
49524 700315 706381 713697 722186 732168 743812 756821 770647 784695 798296 810821 821983 831850
49512 831850 840568 848178 854676 860151 864944 869785 875494 882402 890333 899416 910347 923227 936333
49499 936333 946752 952248 952034 945975 934040 916915 896517 875219 854674 835609 818390 803406
49487 803406 790925 780904 773037 766994 762638 759890 758299 756975 755316 753628 752607 752285 751974 751200
49473 751200 750138 749016 747754 746468 745730 745864 746339 746384 745993 745855 746459 747694 749304 751301 753874 757142
49457 757142 761084 765555 770298 774994 779383 783284 786527 788846 789805 788899 785878 781006 774904 768193 761377
49442 761377 754899 749036 743754 738913 734524 730568 726697 722583 718604 715776 714826 715608 717467 719832 722425
49427 722425 725298 728852 733520 739394 746526 755521 767292 782280 800662 823335 851712 886327 926864
49414 926864 974002 1029116 1089637 1145073 1180442 1185696 1162144 1120105 1071554 1024994 984875 953039
49402 953039 929880 915099 908131 907972 912876 920796 930358 941161 953130 965841 978513 990384 1001015
49389 1001015 1010416 1018941 1026817 1033655 1038580 1040905 1040532 1037584 1031913 1023259 1011791 998252 983587
49376 983587 968678 954437 941789 931367 923342 917664 914280 912970 913223 914641 917447 922271 929364
49363 929364 938124 947387 956003 963171 968559 972227 974320 974704 973050 969268 963756 957247 950587 944601
49349 944601 939810 936178 933397 931596 931456 933396 936800 940314 942866 944281 945009 945409 945317 944283 942300
49334 942300 940059 938124 935894 931980 925841 918597 911848 906107 900823 895514 890184 884820 879298 873920
49320 873920 869399 866034 863408 861174 859709 859564 860549 861856 862966 864035 865349 866769 867928 868751 869513
49305 869513 870368 871086 871437 871735 872704 874680 877162 879339 880895 882074 883150 884213 885450 887213 889632
49290 889632 892458 895520 899094 903647 909298 915759 922614 929441 935734 941019 945143 948365 951153 953922
49276 953922 956835 959695 962061 963674 964803 966015 967654 969700 972130 975084 978525 981990 984979 987508
49262 987508 990076 993116 996701 1000717 1005039 1009448 1013631 1017468 1021315 1025949 1032293 1041134 1052974 1068237
49248 1068237 1087774 1112933 1144460 1181130 1219953 1258092 1294076 1326644 1353016 1369492 1374011
49237 1374011 1367467 1352353 1330806 1304272 1274229 1242379 1210292 1179365 1150981 1126285 1105978
49226 1105978 1090723 1081380 1078218 1080044 1084901 1091715 1100499 1110588 1119390 1123624 1121664 1114286 1103339
49213 1103339 1090251 1075781 1060583 1045540 1031690 1019966 1010979 1004858 1001362 1000124 1000776 1002926 1006300
49200 1006300 1010994 1017450 1026100 1037109 1050394 1065439 1080884 1094671 1105150 1112057 1116114 1117885
49188 1117885 1117542 1115686 1113544 1111849 1110006 1106896 1102287 1097024 1092050 1087861 1084880 1083781 1085169 1089208
49174 1089208 1095686 1104251 1114570 1126458 1139890 1154768 1170916 1188812 1210319 1238099 1273832 1316853
49162 1316853 1364023 1410121 1448308 1471593 1475656 1461192 1433566 1399969 1366397 1336380 1311387
49151 1311387 1291766 1277298 1267263 1260443 1255476 1251289 1247121 1242263 1236130 1228767 1220963 1213500 1206348
49138 1206348 1198855 1190703 1182406 1174790 1168194 1162387 1157240 1153216 1150926 1150330 1150732 1151698 1153669 1157436 1163256
49123 1163256 1170737 1179307 1188421 1197553 1206521 1215797 1226060 1237436 1249619 1262590 1276693 1292049
49111 1292049 1308572 1326651 1347133 1370393 1396077 1424135 1455656 1492453 1536452 1589805 1654781
49100 1654781 1732453 1821020 1915261 2007741 2091841 2165944 2235340 2307673 2383449 2450522 2489911
49089 2489911 2489093 2450756 2389695 2321814 2254867 2186988 2112117 2027027 1934652 1842087 1756184 1680903
49077 1680903 1617533 1565910 1525100 1493737 1470384 1453519 1441303 1431886 1424060 1417322 1411286 1405520
49065 1405520 1399882 1394435 1388949 1383053 1377080 1372068 1368675 1366700 1366097 1367747 1372464 1379579 1387349 1394730
49051 1394730 1402113 1410243 1419148 1428500 1438512 1449862 1462761 1476555 1490372 1503874 1517189 1530373
49039 1530373 1543248 1555713 1567925 1580176 1592820 1606308 1620953 1636560 1652616 1669031 1686469
49028 1686469 1705764 1727300 1751079 1776954 1804302 1831705 1857362 1879757 1897738 1910335 1917154
49017 1917154 1918970 1917524 1914654 1911784 1909988 1909972 1911941 1915844 1921805 1929944 1939833 1950604 1961789 1973744
49003 1973744 1987084 2001917 2017743 2033900 2050029 2066189 2082442 2098251 2112448 2123989 2132583
48992 2132583 2138351 2141284 2141594 2140355 2139074 2138430 2137875 2136539 2134108 2130799 2127068 2123566 2120883 2119011 2117348
48977 2117348 2115500 2113827 2113015 2113356 2114688 2116819 2119740 2123464 2127769 2132119 2135876 2138707 2140762 2142303
48963 2142303 2143267 2143360 2142389 2140293 2137057 2133109 2129653 2128067 2128823 2131382 2135210 2140521 2147847 2157302 2168544
48948 2168544 2181329 2195960 2213179 2233502 2256481 2280796 2305346 2330119 2355737 2382427 2409921
48937 2409921 2438237 2467973 2499692 2533380 2568443 2604014 2639441 2674969 2711754 2750684 2791364
48926 2791364 2832765 2874537 2916916 2959578 3001746 3043541 3086180 3130445 3175815 3221579 3268059
48915 3268059 3316266 3366937 3420265 3475738 3531610 3585146 3634139 3678088 3717673 3753642 3786585
48904 3786585 3817162 3845896 3873005 3898786 3923677 3947592 3969788 3989869 4008412 4026081 4042742
48893 4042742 4058020 4072039 4084780 4095267 4102398 4106282 4107749 4106748 4102283 4093930 4082383 4068248
48881 4068248 4051257 4031149 4008629 3984785 3959882 3933244 3904205 3872832 3839738 3805426 3769802
48870 3769802 3732183 3691755 3648109 3601415 3552163 3500713 3447043 3391063 3333406 3275728 3219843
48859 3219843 3166536 3115593 3066972 3021267 2978855 2939300 2902176 2867984 2837574 2810976 2787433
48848 2787433 2766414 2747909 2731808 2717667 2705303 2695102 2687505 2682482 2679670 2678822 2679968 2683346 2689328
48835 2689328 2698282 2710279 2724823 2740916 2757600 2774639 2792600 2812086 2833015 2854912 2877708
48824 2877708 2901714 2926849 2952460 2978101 3003954 3030311 3057162 3084522 3112603 3141312 3170090
48813 3170090 3198653 3227394 3256621 3285899 3314623 3342812 3370801 3398621 3426311 3454425 3483445
$$ [...]
##END NTUPLES=NMR SPECTRUM
##END=
